##TITLE=1H_LR-661-CK1
 CDCl3, 8 sc, 
 14.3.2019
##JCAMPDX= 6.0         $$ Bruker NMR JCAMP-DX V2.0
##DATA TYPE= NMR FID
##DATA CLASS= NTUPLES
##ORIGIN= UXNMR, Bruker Analytische Messtechnik GmbH
##OWNER= root
$$ XWIN-NMR		Version 3.5
$$ Thu Mar 14 14:08:11 2019 Russian Standard Time (UT+4h)  she@DPX200
##.OBSERVE FREQUENCY= 200.1315
##.OBSERVE NUCLEUS= ^1H
##.DELAY= (6, 6)
##.ACQUISITION MODE= SIMULTANEOUS
##.ACQUISITION SCHEME= undefined
##.AVERAGES= 8
##.DIGITISER RES= 18
##SPECTROMETER/DATA SYSTEM= spect
##.PULSE SEQUENCE= zg30
##.SOLVENT NAME= CDCl3
##.SHIFT REFERENCE= (INTERNAL, CDCl3, 0, 15.7039)
##AUDIT TRAIL= $$ (NUMBER, WHEN, WHO, WHERE, WHAT)
$$ ##TITLE= Audit trail, XWIN-NMR		Version 3.5
$$ ##JCAMPDX= 5.01
$$ ##ORIGIN= Bruker BioSpin GmbH
$$ ##OWNER= she
$$ F:/spectra/data/she/nmr/H-F/1/audita.txt
$$ ##AUDIT TRAIL=  $$ (NUMBER, WHEN, WHO, WHERE, WHAT)
(   1,<2019-03-14 14:06:53.98 +0400>,<she>,<DPX200>,
      <created by zg, POWCHK disabled, PULCHK disabled
       configuration hash MD5:
       00 E9 B6 7A A2 85 ED C7 34 08 36 98 17 FE 4E 26
       data hash MD5: 16K
       2A 49 72 39 07 F1 29 84 67 50 B6 79 0C 24 18 BF>)
$$ ##END=
$$ 
$$ hash MD5
$$ 95 21 BE 39 6B A4 D9 85 92 BC 85 D7 75 7F 6C D8
##$RELAX= 
##$RELAX= 
##$RELAX= 
##$RELAX= 
##$RELAX= 
##$RELAX= 
$$ Bruker specific parameters
$$ --------------------------
##$DU= <F:/spectra>
##$EXPNO= 1
##$NAME= <H-F>
##$PROCNO= 1
##$TYPE= <nmr>
##$USER= <she>
##$AMP= (0..31)
100 100 100 100 100 100 100 100 100 100 100 100 100 100 100 100 100 100 
100 100 100 100 100 100 100 100 100 100 100 100 100 100 
##$AQSEQ= 0
##$AQ_mod= 1
##$AUNM= <au_zg>
##$AUTOPOS= <>
##$BF1= 200.13
##$BF2= 200.13
##$BF3= 200.13
##$BF4= 200.13
##$BF5= 200.13
##$BF6= 200.13
##$BF7= 200.13
##$BF8= 200.13
##$BYTORDA= 1
##$CFDGTYP= 0
##$CFRGTYP= 5
##$CHEMSTR= <none>
##$CNST= (0..31)
1 1 145 1 1 1 1 1 1 1 1 1 1 1 1 1 1 1 1 1 1 1 1 1 1 1 1 1 1 1 1 1 
##$CPDPRG= <>
##$CPDPRG1= <>
##$CPDPRG2= <>
##$CPDPRG3= <>
##$CPDPRG4= <mlev>
##$CPDPRG5= <mlev>
##$CPDPRG6= <mlev>
##$CPDPRG7= <mlev>
##$CPDPRG8= <mlev>
##$CPDPRGB= <>
##$CPDPRGT= <>
##$D= (0..31)
0 1.2 0 0 0 0 0 0 0 0 0 0.03 0 0 0 0 0 0 0 0 0 0 0 0 0 0 0 0 0 0 0 0 
##$DATE= 1552558013
##$DBL= (0..7)
120 120 120 120 120 120 120 120 
##$DBP= (0..7)
150 150 150 150 150 150 150 150 
##$DBP07= 0
##$DBPNAM0= <>
##$DBPNAM1= <>
##$DBPNAM2= <>
##$DBPNAM3= <>
##$DBPNAM4= <>
##$DBPNAM5= <>
##$DBPNAM6= <>
##$DBPNAM7= <>
##$DBPOAL= (0..7)
0.5 0.5 0.5 0.5 0.5 0.5 0.5 0.5 
##$DBPOFFS= (0..7)
0 0 0 0 0 0 0 0 
##$DE= 6
##$DECBNUC= <off>
##$DECIM= 24
##$DECNUC= <off>
##$DECSTAT= 4
##$DIGMOD= 1
##$DIGTYP= 9
##$DL= (0..7)
0 120 120 120 120 120 120 120 
##$DP= (0..7)
150 150 150 150 150 150 150 150 
##$DP07= 0
##$DPNAME0= <>
##$DPNAME1= <>
##$DPNAME2= <>
##$DPNAME3= <>
##$DPNAME4= <>
##$DPNAME5= <>
##$DPNAME6= <>
##$DPNAME7= <>
##$DPOAL= (0..7)
0.5 0.5 0.5 0.5 0.5 0.5 0.5 0.5 
##$DPOFFS= (0..7)
0 0 0 0 0 0 0 0 
##$DQDMODE= 0
##$DR= 18
##$DS= 0
##$DSLIST= <SSSSSSSSSSSSSSS>
##$DSPFIRM= 0
$$ [...]
##$SUBNAM2= <"">
##$SUBNAM3= <"">
##$SUBNAM4= <"">
##$SUBNAM5= <"">
##$SUBNAM6= <"">
##$SUBNAM7= <"">
##$SUBNAM8= <"">
##$SUBNAM9= <"">
##$SW= 24.9337058887773
##$SWIBOX= (0..15)
0 0 2 0 0 0 0 0 0 0 0 0 0 0 0 0 
##$SW_h= 4990.01996007984
##$TD= 16384
##$TD0= 1
##$TE= 0
##$TE2= 300
##$TE3= 300
##$TEG= 300
##$TL= (0..7)
0 120 120 120 120 120 120 120 
##$TP= (0..7)
150 150 150 150 150 150 150 150 
##$TP07= 0
##$TPNAME0= <>
##$TPNAME1= <>
##$TPNAME2= <>
##$TPNAME3= <>
##$TPNAME4= <>
##$TPNAME5= <>
##$TPNAME6= <>
##$TPNAME7= <>
##$TPOAL= (0..7)
0.5 0.5 0.5 0.5 0.5 0.5 0.5 0.5 
##$TPOFFS= (0..7)
0 0 0 0 0 0 0 0 
##$TUNHIN= 0
##$TUNHOUT= 0
##$TUNXOUT= 0
##$USERA1= <user>
##$USERA2= <user>
##$USERA3= <user>
##$USERA4= <user>
##$USERA5= <user>
##$V9= 5
##$VALIST= <valist>
##$VCLIST= <CCCCCCCCCCCCCCC>
##$VD= 0
##$VDLIST= <DDDDDDDDDDDDDDD>
##$VPLIST= <PPPPPPPPPPPPPPP>
##$VTLIST= <TTTTTTTTTTTTTTT>
##$WBST= 1024
##$WBSW= 4
##$XGAIN= (0..3)
0 0 0 0 
##$XL= 0
##$YL= 0
##$YMAX_a= 225722
##$YMIN_a= -337937
##$ZGOPTNS= <>
##$ZL1= 120
##$ZL2= 120
##$ZL3= 120
##$ZL4= 120
##$ABSF1= 10
##$ABSF2= 0
##$ABSG= 5
##$ABSL= 3
##$ALPHA= 0
##$AQORDER= 0
##$ASSFAC= 0
##$ASSFACI= 0
##$ASSFACX= 0
##$ASSWID= 0
##$AUNMP= <proc_1d>
##$AZFE= 0.1
##$AZFW= 0.1
##$BCFW= 1
##$BC_mod= 2
##$BYTORDP= 1
##$COROFFS= 0
##$CY= 11.3945322036743
##$DATMOD= 1
##$DC= 2
##$DFILT= <>
##$DTYPP= 0
##$F1P= 18.9103706918063
##$F2P= -1.10871071338519
##$FCOR= 0.5
##$FTSIZE= 0
##$FT_mod= 4
##$GAMMA= 1
##$GB= 0.15
##$INTBC= 1
##$INTSCL= 1
##$ISEN= 128
##$LB= 0.24
##$LEV0= 0
##$LPBIN= 0
##$MAXI= 10000
##$MC2= 0
##$MEAN= 0
##$ME_mod= 0
##$MI= 1.114404
##$NCOEF= 0
##$NC_proc= 0
##$NLEV= 6
##$NOISF1= 3.799351
##$NOISF2= 2.8
##$NSP= 1
##$NTH_PI= 0
##$NZP= 0
##$OFFSET= 15.70392
##$PC= 1
##$PHC0= -9226.656
##$PHC1= 23.60026
##$PH_mod= 1
##$PKNL= yes
##$PPARMOD= 0
##$PSCAL= 0
##$PSIGN= 0
##$REVERSE= no
##$SF= 200.130013532006
##$SI= 16384
##$SIGF1= 3
##$SIGF2= 2
##$SINO= 400
##$SIOLD= 16384
##$SREGLST= <1H.CDCl3>
##$SSB= 0
##$STSI= 0
##$STSR= 0
##$SW_p= 3612.71676300578
##$SYMM= 0
##$S_DEV= 0
##$TDeff= 0
##$TDoff= 0
##$TI= <>
##$TILT= no
##$TM1= 0
##$TM2= 0
##$TOPLEV= 0
##$USERP1= <user>
##$USERP2= <user>
##$USERP3= <user>
##$USERP4= <user>
##$USERP5= <user>
##$WDW= 1
##$XDIM= 8192
##$YMAX_p= 0
##$YMIN_p= 0
$$ End of Bruker specific parameters
$$ ---------------------------------
##NTUPLES= NMR FID
##VAR_NAME=  TIME,          FID/REAL,        FID/IMAG
##SYMBOL=    X,             R,               I
##VAR_TYPE=  INDEPENDENT,   DEPENDENT,       DEPENDENT
##VAR_FORM=  AFFN,          ASDF,            ASDF
##VAR_DIM=   8192,          8192,            8192
##UNITS=     SECONDS,       ARBITRARY UNITS, ARBITRARY UNITS
##FACTOR=    0.0002004,     1,               1
##FIRST=     0,             0,               0
##LAST=      1.6414764,     0,               0
##MIN=       0,             -337937,         0
##MAX=       1.6414764,     225722,          0
$$ Real data points
##PAGE= N=1
##DATA TABLE= (X++(R..R)), XYDATA
0@%%%%Oj4RrJ6k4L2l3M1n6P2q8J04j20J42j68J98k34K70l12L61m13M71n38O13
29C26o93P81q78R85j103J233j376J531j701J890k098K325k575K850l155L494l873
46b037M301m785N335n970O711p591Q659r980J1670j3919J7075k1869L0110m8079
60c0369J54791j42898k80130L04533J86398j95698j87039K26264J65324j94547
70F629k05973J67111J84913j14183j67870J15495J49456j00465j65324P8189J55997
81A03975m2957j43924L3435J36345j7400j54707k6785J38205P5652q9674p0657
92e8492N9977M5830q4575n7312J08804J11706r1026j53356L6809J49804l787j22953
104e8571P783J25222m019j37976k3538J22961L8892r8195l2431Q7332K8003q3471
$$ plain form
0 0 0 0 0 0 6 -8 1 -8 8 -16 16 -17 24 -32 40 -48 56 -64 78 -90 108 -126 144 -168 193 -220 251 -287 326
29 326 -367 414 -464 521 -582 651 -725 806 -895 995 -1103 1222 -1353 1497 -1658 1836 -2037
46 -2037 2264 -2521 2814 -3156 3555 -4036 4623 -5357 6313 -7606 9469 -12400 17710 -30369
60 -30369 124422 -18476 -298606 5927 192325 -3373 -190412 35852 201176 6629
70 6629 -199344 -32233 152680 38497 -129373 -13878 135578 35113 -130211 -52022 103975
81 103975 61018 -82906 -49471 86874 69474 -85233 -112018 26187 101839 12165 -58492
92 -58492 1485 47315 -37260 -94572 14232 125938 34912 -118444 -81635 68169 64382 -58571
104 -58571 -50788 74434 70415 -67561 -91099 31862 70754 -27441 -59872 27460 55463 -28008
116b8008l3248O4816K4133n0511m47O6489J782q3621l2430O6520N3475k4974l5023
129a1047N423J883k5832n533M2186L7587k1695n1784p681M2532J9858l3454k0472
142b8029L9498K8025m7222m5371M6152N9722m2437p0018L9768Q5330k6338r1481
154e2401P904Q1021k808o5314J9876P0742l4124r7727K0340J10565P309r7742
166c2359j4971Q2109O123q5395k070J00239J8493j03783m0600R3246N2797p9282
178e453n8713P0377O4259o3198o8553N6786P4862n4648q9803M3578J06393j9923
190E5964j10114n719R6825J6108q4670r350Q9780J2386j01521l1078J00988M9897
202G9496q6627n8287P0436N2179o8440n0255P0439N6241p0204o4788O3716P4198
$$ plain form
116 -28008 -61256 3560 27693 -22818 -23265 43224 45006 -38615 -71045 -4525 48950 23976 -11047
129 -11047 -5624 -3741 -29573 -35106 7080 44667 22972 -28812 -36493 6039 25897 -7557 -28029
142 -28029 11469 39494 -7728 -53099 -6947 52775 10338 -59680 -19912 65418 39080 -52401
154 -52401 -44497 36524 33716 -31598 -11722 59020 24896 -72831 -52491 58074 65383 -32359
166 -32359 -47330 34779 40902 -44493 -46563 53676 72169 -31614 -72214 21032 73829 -5453
178 -5453 -64166 6211 70470 7272 -61281 -4495 70367 15719 -74084 -30506 75887 55964
190 55964 -54150 -59869 36956 53064 -31606 -40956 48824 61210 -40311 -71389 29599 79496
202 79496 -7131 -65418 5018 57197 -11243 -61498 8941 65182 -5022 -69810 -6094 68104
214F8104m9633p7155L5139P2163k4647o4480K1447O0703k1922o7785J1552P2958
226C6444P043o5805k3311M9713K6046l8682k1757L8353K3673m1812l5071L8274
238f892M6564k5994n0942J4931M8597p296m4335P168M2130r656m7646P299N3608
251B7536o8n6646j0445N0636J5447m2136r851M2616Q151m7970j2648N2472K4722
264D1816m6699l3946L4658L2627k6623l0580K5129L0102k4268l5420K1705M3109
276C1610j1386m6361j31M5067J0108l8927j4193L5876J3842l8524j6571M3822
288A4232K6998m4438l7288L7889M3236l1339m2061K9722M1277l3503m7657L5074
300g858N6352k9043o2472K1104O3901j1982o1010R785N7920p782n9207M738O0738
$$ plain form
214 68104 18471 -58684 -23545 48618 23971 -40509 -19062 41641 19719 -48066 -36514 36444
226 36444 43487 -22318 -45629 4084 30130 -8552 -30309 8044 31717 -10095 -45166 -6892
238 -6892 39672 13678 -37264 -22333 26264 18968 -25367 -18199 23931 14275 -33371 -26072 27536
251 27536 27468 -29178 -39623 11013 26460 -15676 -25527 17089 25240 -22730 -35378 17094 41816
264 41816 -4883 -38829 -4171 28456 1833 -28747 -3618 26484 2216 -33204 -11499 31610
276 31610 20224 -26137 -26268 18799 28907 -10020 -24213 11663 25505 -13019 -29590 14232
288 14232 41230 -3208 -40496 -2607 40629 9290 -32771 -3049 38228 4725 -42932 -7858
300 -7858 48494 19451 -43021 -21917 41984 30002 -31008 -21223 36697 28915 -30292 -25554 35184
313C5184J085o2622j0969N7586J8381m9085k1222M2186K1193l9760k2344M0002
325I615K8930l5652l5982K6735L7928j8561l5983J3407L3748j3567l5350J2161
337a2571L9701q083m4362N94M4596N092m2372r731M0563J0708m0132j2531M3560
350A5032J7229m3280k4235M0035K9218l3997l1232K8051K8163k7374k9174K6904
362d660L1673k4441l4654J8582L6900j2211l3461R054L1048p280l0845N792L1960
375A7457k740l4041m055L3132R156k9622j2903K6552J4908k4483j6454K5080K0539
388B2526k4357k6320K1395L0906j5631l2654J0655L3083p338l2715N606L5568
400B0724k357l7394l629L7217R084l4703j3227L1018J4657k8230j5218K8360J7310
$$ plain form
313 35184 36269 -26353 -37322 20264 38645 -10440 -31662 10524 31717 -8043 -30387 9615
325 9615 38545 2893 -33089 -6354 31574 13013 -22970 -9563 24185 10618 -24732 -12571
337 -12571 27130 19047 -25315 -24721 19875 24967 -17405 -27136 13427 24135 -15997 -28528 15032
350 15032 32261 -11019 -35254 4781 33999 2 -31230 -3179 24984 -2390 -31564 -4660
362 -4660 27013 2572 -32082 -13500 23400 11189 -22272 -13218 17830 10550 -20295 -14503 17457
375 17457 14717 -19324 -23379 9753 18909 -10713 -23616 2936 17844 -6639 -23093 1987 22526
388 22526 -1831 -28151 -6756 24150 8519 -24135 -13480 19603 12265 -20450 -14844 20724
400 20724 18367 -19027 -22656 14561 23645 -11058 -24285 6733 21390 -6840 -22058 6302 23612
413B3612k6195k0647K6061K3990k2184k6185J8368K6771j6945k7132J5389K9148
425B4051j4520l2201J0949L5877n554l5764J823L4664J791l4262m337L4420O805
438B3742l5208j1246L4188J5992l1445j8959K8026K1422k5356k2177K3624K3357
450B5960k2273k6158J9511K8021j7353k9819J3356L0376j0850l0582R460L2158
462B1807o980l4639L886L6891K59l7652n874L6611R403l6527j3079L5855J6706
475B6667l5969k1400L4499K6556l1413l0746K6781L2680k1813l4324J8207L5513
487B5238j4900l6000J0464L6258n765l6174J210L4621J844l3346n361L1646Q199
500A7934l1445j1560L0383J6995k8112k1168K4819K5798j9924k8258J6418L0569
$$ plain form
413 23612 -2583 -23230 2831 26821 4637 -21548 -3180 23591 6646 -20486 -5097 24051
425 24051 9531 -22670 -11721 24156 18602 -17162 -15339 19325 21116 -13146 -17483 16937 23742
438 23742 -11466 -22712 11476 27468 -3977 -22936 5090 26512 1156 -21021 2603 25960
450 25960 3687 -22471 -2960 25061 7708 -22111 -8755 21621 10771 -19811 -10351 21807
462 21807 14827 -19812 -15926 20965 21224 -16428 -22302 14309 23712 -12815 -25894 9961 26667
475 26667 -9302 -30702 3797 30353 -1060 -31806 -5025 27655 5842 -28482 -10275 25238
487 25238 10338 -25662 -15198 21060 15295 -20879 -19669 14952 16796 -16550 -21911 9735 17934
500 17934 -13511 -25071 5312 22307 -5805 -26973 -2154 23644 3720 -24538 -8120 22449
512B2449j3533l3686Q832L5785m115l7201j704L6950P112l5633j0718L5008J5000
525B4546l2760j7875L0895K1213k7833k3613K4107K5154j9393k6082J5830K4848
537A9037j2067k4541J0387K4674p622k4000K999K2964M59k0405l185J9496N604
550A3800j8485o991J7566J1421j6107j4606J4000J7138j1895k0737R133K2676
562A6913o615k4526L982K6113j909k6659o8K7895L378k6655n213K4986O178k5259
576g459o032K4959O260k5508r137K4177J0294k1958r961K0552R822j9293j0605
589a3889J8365J1460j7504j1966J5814J2842j5147j4518J2258J6272q985j8199
601a3197O866J8869l772k1233j628K2683O708k1380j1497J9653J2412j9256j4371
$$ plain form
512 22449 8916 -24770 -15938 19847 15732 -21469 -23173 13777 20889 -14744 -25462 9546 24546
525 24546 -8214 -26089 4806 26019 -1814 -25427 -1320 23834 4441 -21641 -5811 19037
537 19037 6970 -17571 -7184 17490 9868 -14132 -11133 11831 12290 -8115 -11300 8196 13800
550 13800 -4685 -11676 5890 17311 1204 -13402 598 17736 5841 -14896 -5763 16913
562 16913 10298 -14228 -10246 15867 13958 -12701 -12769 15126 18504 -8151 -13364 11622 17800 -7459
576 -7459 -13491 11468 17728 -7780 -16917 7260 17554 -4404 -14365 6187 16009 -3284 -13889
589 -13889 4476 15936 -1568 -13534 2280 15122 -25 -14543 -2285 13987 5002 -13197
601 -13197 -6331 12538 8766 -12467 -14095 8588 15296 -6084 -17581 2072 14484 -4772 -19143
614a9143K0422J7983j9513k1889J7941K3409j6064k5093J5137K6517j3927k8322
626b2542J1078K7944r849k6579R524K7452q881k8227P213K7216n288k5873M932
639a1880K7093l773k8540j774K7424P975k2215j0193J7411J0388j4519j1992J2688
652a907J3967p645j5343L691J4405k236j4602J239J7037K307j7380n179J6257
665D611O089j5259n848J7294P866j8074j0277J5265R127j3388n497J6809N061
678A3779k0717q811K1173J1829j8135j1503J7022J1595j7504j3275J4718J5002
690A5173r636j2254O921Q943o922q488N163Q450j724o064M23K572k001l972J829
705a587O964L344n999o973J910O677j404n256N255P410p692j3719N532J5822m001
$$ plain form
614 -19143 1279 19262 -251 -22140 -4199 19210 3146 -21947 -6810 19707 5780 -22542
626 -22542 -11464 16480 6631 -19948 -10424 17028 8147 -20080 -12867 14349 9061 -16812 -11880
639 -11880 15213 11440 -17100 -18874 8550 16525 -5690 -15883 1528 11916 -2603 -14595 -1907
652 -1907 12060 4415 -10928 -7237 7168 4932 -9670 -8431 8606 10913 -6467 -11646 4611
665 4611 10700 -4559 -10407 6887 14753 -3321 -13598 1667 10794 -2594 -8091 8718 13779
678 13779 -6938 -15749 5424 17253 -882 -12385 4637 16232 -1272 -14547 171 15173
690 15173 5537 -6717 204 9147 2225 -6263 -1100 7350 5626 -438 -15 2557 556 -3416 -1587
705 -1587 5377 8721 2722 -4251 -2341 4336 2932 -2324 2931 10341 2649 -11070 -5538 10284 6283
720F283j5917M928J8383n462k2720J911K4395J903k2406k141K1337J524k2839
733a0821m866K1225P313j5862o121J2990K304j5392k487J6843O205j3064p913
746i646Q207M702p807l299R128P025q029r778M095R038k226q389K738J1062p93
761F028j4336m227J4130O329j3228o054J5537P836j7320j2654J5841J5155j1461
774A576j2136J1468R124j5562j0365J7083J3317j5041j1821J3379R004j6196q711
787a4881J8974J1290j7224j2182J5859J0540j6052j0682J6236J3772j3328j3759
799a1437R638J1708r340j0882R748J3786o191j4537L62J1135K174p589r32Q351
813E994J666j0970n679J0227R863o890j0590O626J0388p857j2877Q015J5741o724
$$ plain form
720 6283 -9634 -4706 13677 8215 -14505 -12594 11801 13704 -8702 -10843 10494 12018 -10821
733 -10821 -15687 5538 12851 -3011 -9132 3858 6162 -9230 -11717 5126 11331 -1733 -9646
746 -9646 -1439 3263 -4544 -7843 1285 8310 281 -9497 -5402 3636 1410 -6979 -4241 6821 6028
761 6028 -8308 -12535 1595 7924 -5304 -11358 4179 12015 -5305 -17959 -2118 13037 1576
774 1576 -10560 908 10032 -5530 -15895 1188 14505 -536 -12357 1022 10026 -6170 -14881
787 -14881 4093 15383 -1841 -14023 1836 12376 -3676 -14358 1878 15650 2322 -11437
799 -11437 -1799 9909 569 -10313 -565 13221 7030 -7507 -7145 3990 6164 -1425 -2357 5994
813 5994 7660 -3310 -8989 1238 11101 4211 -6379 247 10635 2778 -10099 -2084 13657 6933
827F933j6400N515J7356p284j9812O667K1959l272k1133J338J9694k685j9937
840a1061K246K1985J295k1282n197J6137N689j2596m133J1780L961j0896o089
853h161P777O724m079o606J965O129l08p310k438O770N283n662o439N762P458
868F865p531j0100O926J3437n313j4288L591J3451m705j4264N628J7399m481j9209
882a2594J764J8129P33j7472n82J6785J706j6983l383J5525N213j4001o467J2504
896H77Q579j0168j0362P248J0675m525j0583L407J1368j590j3737j089J4910N167
910A0177j3833p752J3227Q431j3432r707J5086J1915j6052j4184J6158J6615j5165
923A484j9027J4470K0890j2843k1393J1818K2182j0591k3468Q869K4867n602k4635
$$ plain form
827 6933 -9467 -3952 13404 6120 -13692 -7025 14934 11662 -9471 -8133 11561 8876 -11061
840 -11061 -8815 13170 14465 -6817 -12014 4123 9812 -2784 -6917 4863 8824 -2072 -8161
853 -8161 -384 6340 2261 -4345 -2380 3749 3441 -3869 -6307 463 5746 84 -6355 -593 6865
868 6865 -666 -10766 -3840 9597 4284 -10004 -6413 7038 2333 -11931 -6303 11096 6615 -12594
882 -12594 -10830 7299 8032 -9440 -10022 6763 8469 -8514 -11897 3628 8841 -5160 -11627 877
896 877 9456 -712 -11074 -3826 6849 2324 -8259 -4852 6516 4926 -8811 -9900 5010 10177
910 10177 -3656 -11408 1819 10250 -3182 -12889 2197 14112 -1940 -16124 34 16649 1484
923 1484 -17543 -3073 17817 4974 -16419 -4601 17581 6990 -16478 -7609 17258 11656 -12979
936a2979K020K3205n37k1002m41K0483K595k0395n350J8934Q140j6171j0018J3602
950B086J1695j1587j2770R286J3719p038j5050O217J5804l561j8138J071J8551
963A0285J090j8319k334J8541L114j9901m939K0867P913k0310j0643J8212J1500
976A5076j6843j1482J5648J2233j4712j3562J2985J3657j1111j3751Q920J3371
988A0429p175j2489N586J0880l859j0741L351J0347j868j0921m60R870K414q630
1002c266l496Q172L713q425n659R041P842q131j0384O601J1513n296j2118M219
1016e674J3412m153j3645K876J4738k082j5252J195J5405M15j5391j102J4560
1029E302J569j4085j958J4266K783j3719m867J3168N822j0957n822J0022N877
$$ plain form
936 -12979 -10959 12246 11709 -9293 -9734 10749 13344 -7051 -12401 6533 14673 -1498 -11516 2086
950 2086 13781 2194 -10576 -1290 12429 5391 -9659 -3442 12362 8801 -9337 -8266 10285
963 10285 11375 -6944 -9278 9263 12377 -7524 -12463 8404 16317 -3993 -14636 3576 15076
976 15076 -1767 -13249 2399 14632 -80 -13642 -657 13000 1889 -11862 -2942 10429
988 10429 3254 -9235 -3649 7231 3372 -7369 -4018 6329 4461 -6460 -6920 2950 5364 -3266
1002 -3266 -6762 1410 5123 -3302 -8961 80 7922 -209 -10593 -3992 7521 2225 -9893 -5674
1016 -5674 7738 3585 -10060 -7184 7554 5472 -9780 -8585 6820 7235 -8156 -9258 5302
1029 5302 6871 -7214 -9172 5094 7877 -5842 -10709 2459 8281 -2676 -8498 1524 7401
1042G401r693o964R265Q819p703j0214O001J1230l850j1699J737J2704M3j2858
1056e781k518J3586M645j3247o774J2581R344j1292j1052J0236J1522q733j2013
1069i496Q518J3101p680j4504O678J4486m730j4487L517J4392k570j4166J473
1082e468J4557k92j4168j764J4002K686j2699m323J1798N173j0513o360R369P594
1096I592r026q459O955J0574n516j1447L420J1091j305j1043m4J1030J087j1304
1110d395k515J0844L748j0056m704Q868M710q317m800P959N027q168n712P586
1124G5O499p098o919O456P182o379p078N658P519n384q023M219Q570l067q847
1139f617J631Q629l44q091q95P808J828p677k708P294L360n889m243M792M692
$$ plain form
1042 7401 -2292 -9256 9 8828 1125 -9089 -3088 8142 4292 -7407 -5670 7034 7077 -5781
1056 -5781 -8299 5287 9932 -3315 -10089 2492 11836 544 -10508 -272 11250 2517 -9496
1069 -9496 -978 12123 4443 -10061 -3383 11103 6373 -8114 -4597 9795 7225 -6941 -5468
1082 -5468 9089 8797 -5371 -7135 6867 9553 -3146 -7469 4329 9502 -1011 -7371 1998 9592
1096 9592 566 -7893 -938 9636 4120 -7327 -3907 7184 5879 -5164 -5208 5822 6909 -4395
1110 -4395 -6910 3934 7682 -2374 -7078 1790 6500 -1817 -6617 1342 6369 -1799 -7511 75
1124 75 6574 -524 -7443 -987 6195 -184 -7262 -1604 5915 531 -7492 -3273 5297 2230 -6617
1139 -6617 -4986 3643 3299 -4792 -5687 2121 3949 -3728 -6436 858 4218 -1671 -5914 -1122 3570
1154C570m207m636L963M944l820n395L730N351k481o116K143O502j806o181O10
1169c829P208l07p088m70P178J778p578k537P247L691o589m278O082N490n773
1184B25o177N118P379l739q052K829P862j092p771J09P446R79p633l25O501J253
1200D912o427j488O239J797o349j653O181K242o446k365O543L085o538l672N220
1215A281M646m604m851M327M482l343n390K921N554k058n952J437N835j043n751
1230b509M39N646P4n525n26N146P30n578r53N279J688n802j737N907J088n912
1246b545j812P232J729p276l194P380L433p240l777P031M349o736n442O175N762
1261E069n262n761M361O138m428o257L280O014j990n755J347N342l28n541l93
$$ plain form
1154 3570 -637 -5273 -1310 3634 -186 -5581 -1851 3500 1019 -5097 -2954 3548 1742 -4439 -3829
1169 -3829 3379 3072 -4016 -4486 2692 4470 -3108 -5645 1602 5293 -1296 -5574 508 5998 225
1184 225 -5952 -834 6545 2806 -5246 -2417 5445 4353 -3418 -3309 4137 5116 -2517 -2842 3659 4912
1200 4912 -1515 -3003 3236 5033 -1316 -2969 3212 5454 -992 -3357 3186 6271 -267 -3939 1281
1215 1281 5927 1323 -3528 799 5281 1938 -3452 -531 5023 2965 -2987 -1550 4285 3242 -2509
1230 -2509 -2070 3576 3650 -1875 -2401 2745 3475 -2103 -3056 2223 3911 -1891 -3628 2279 3367 -2545
1246 -2545 -4357 2875 4604 -2672 -5866 1514 4947 -2293 -6070 961 5310 -1426 -6868 -693 5069
1261 5069 -193 -5954 -1593 4545 117 -6140 -2860 3154 1164 -4591 -3244 2098 1770 -3771 -4164
1276d164N049J412m552k149L840K642l359l045L478M185l268n094K241N874j427
1291A663o655J434P507l30q565p79Q837K127q522k273P812L539p844m547P645
1306A049N518o894n622N738O348n679o531M547P980k970q061Q59P874N79p636
1321b901j172P621K664o933m334O437M973o205n154O856O607p355q169O233J0047
1336I215n788j0819N756J2143n403j3960L960J4698k336j4085J548J4025j559
1349G395j4929P23J5219J134j4960j335J3452J762j3795k572J3759L863j2093
1362b377n246J0476M813r997m956R585O053q695p245P197P093o432p618O400R180
1377H231n635j0331K756J0708j307j0528Q74J0429J62j1454j927J1639K954j0477
$$ plain form
1276 -4164 885 2297 -2255 -4404 -564 2078 -1281 -4326 -848 3337 69 -5025 -2784 3090 1663
1291 1663 -4992 -3558 3949 3619 -4946 -5725 3112 5239 -3283 -5556 2256 5795 -2049 -6596 1049
1306 1049 6567 -327 -5949 -211 6137 458 -6073 -1526 6454 3484 -4577 -3718 4156 4735 -2901
1321 -2901 -4073 3548 6212 -721 -5055 1382 6355 150 -5004 1852 8459 1104 -7065 -832 9215
1336 9215 3427 -7392 -1636 10507 5104 -8856 -4896 9802 7466 -6619 -5071 8954 7395
1349 7395 -7534 -6811 8408 9542 -5418 -6753 6699 8461 -5334 -7906 5853 9716 -2377
1362 -2377 -7623 2853 7666 -2331 -7287 2298 8351 -344 -7589 -392 6701 269 -7349 -949 8231
1377 8231 2596 -7735 -4979 5729 4422 -6106 -5232 5197 5359 -6095 -8022 3617 6571 -3906
1391c906l541J0930K783j0885m816J1638N313r857n868Q789N148r058m667Q497
1405E00N707p846m693O408L399o625k982P342L669o701l908M944L105m185j957
1420c823L938K941l408k241O54J628Q1L51M71r85r4L64j124p79J947J976j404
1437D93j719J246J350k612j282L886K440l323k755K188J922k177j277L322J870
1452C572k815k235J777J295k131N0K888P16l161j344K076J034o35q44N12J493
1468B248j03k177j454J499L290m06l346J10L535j232m776J117O415J72o631j136
1484b875O046K03o412O44P511K43q373j317P775M28p183M07P680j90q318l41P507
1501C435m20o705O95P252l15p959j100O923J210n050o10M945K82m843j974L844
$$ plain form
1391 -3906 -7447 3483 6266 -4619 -9435 2203 7516 -2341 -8209 580 5728 -3330 -7997 500
1405 500 6207 -1639 -6332 76 3475 -3150 -6132 1210 4879 -1822 -5730 -786 2319 -1866 -3823
1420 -3823 115 3056 -352 -2593 -1939 -311 -230 121 592 -393 -487 -123 -1247 -2026 -79 1897 493
1437 493 -1226 20 1370 -1242 -2524 1362 3802 479 -2276 -88 1834 -343 -1620 1702 3572
1452 3572 757 -1478 299 1594 -537 -487 2401 3117 -44 -1388 688 1722 1087 243 755 2248
1468 2248 2145 -32 -1486 13 3303 2897 -449 -339 3196 1964 -2812 -1695 4720 4892 -1739 -2875
1484 -2875 3171 3374 -3038 -2394 5117 5360 -3013 -4330 3445 3873 -3310 -2903 4777 4587 -3731 -4072 3435
1501 3435 3015 -3690 -2995 4257 3942 -4017 -5117 1806 3016 -2034 -2644 2301 2583 -2260 -4234 -390
1517c90K203j527j264L15l0p21k71L95R99J050n59k291N6J642k84j656R67K641
1535A275q17k903l1J657J3p80J504J404k282j919J575J938k213l59L158Q62m232
1552b150j780L494J915k241k45K182q86k774R82K790p60k061J961K430k928k930
1568c001K479K998k450j859L058K116l686k436K681K497j953r71K661j26l462
1583a454J56L020lj614P52J508k416k117L185K687l484k324L869K208m098k870
1599b995M165K877l305k474L257K250m087k059L252K445k210j771J446J213k209
1614b05j375K365K061j082k671k17K111J51j569o08K318P76k437k304L024L402
1630C740l591m375L390N516l749o346L316O430k783o466K493P674l189p887J721
$$ plain form
1517 -390 1813 286 -978 -663 -693 -1414 -1685 -1290 -291 759 200 -2091 -2035 -393 -677 -2333 -1366 1275
1535 1275 458 -2445 -2476 -819 -806 -1586 -82 1322 -960 -2879 -1304 634 -1579 -1938 1220 2082 -2150
1552 -2150 -3930 -436 1479 -762 -1007 1175 289 -2485 -1503 1287 527 -1534 427 2857 -71 -3001
1568 -3001 -522 2476 26 -1833 1225 3341 -345 -2781 -100 2397 444 -527 2134 2008 -1454
1583 -1454 -1298 1722 1719 105 857 2365 -51 -2168 1017 3704 220 -2104 1765 3973 -125 -2995
1599 -2995 1170 4047 742 -1732 1525 3775 -312 -2371 881 3326 1116 -655 791 2004 -205
1614 -205 -1580 785 2846 1764 -907 -1124 987 1138 -431 -1039 1279 2055 -382 -2686 338 3740
1630 3740 149 -4226 -836 4680 931 -5415 -2099 4331 1548 -4918 -2425 5249 2060 -5827 -4106
1645d106Q261j721p335J951P101k908o998K752P135k137p463K065O862k038o092
1660d671J607O133j860n549J614N518j680n571Q90N374J64m519m78L790P94l896
1676b340r72L604K305k924k961J627L526p07l743J010L723j351l534O77M403k10
1692B133m904lN210N82n533p60O175M05o550j33P161J164p701k279P625L365p359
1709a402k742O560L122o562l503O240L998m865m656L692M747k913m291J978M172
1724C575j129m457N51M374R01m627j778M383K582l548m003L488L971k864m540
1739c121K970N409l027o980L054P371j909p813J027P986j051q241L21Q918K83
1754E197r251j518Q831K895q464l162P054L928o461m242N509M335m409n377L874
$$ plain form
1645 -4106 4155 2434 -4901 -2950 4151 1243 -5755 -3003 4132 1995 -5468 -3403 3459 1421 -4671
1660 -4671 -3064 3069 1209 -4340 -2726 2792 1112 -4459 -3569 1805 1969 -2550 -3028 762 1556 -2340
1676 -2340 -3312 292 2597 -327 -3288 -1661 1865 1158 -2585 -1575 2148 797 -2737 -2060 2343 2133
1692 2133 -2771 -2774 2436 3018 -2515 -3275 2900 3305 -3245 -3378 3783 4947 -2754 -5033 2592 5957 -1402
1709 -1402 -4144 2416 5538 -1024 -4527 1713 5711 846 -3810 -118 4629 1716 -2575 -597 3575
1724 3575 2446 -2011 -1460 2914 3815 -812 -2590 1793 4375 827 -3176 312 4283 1419 -3121
1739 -3121 -151 5258 2231 -4749 -1695 5676 3767 -4046 -3019 4967 3916 -4325 -4004 4914 5197
1754 5197 -4054 -5572 3259 6154 -2310 -5472 1582 5510 -951 -5193 316 4651 242 -5135 -1261
1769a261N319l093n186J745M938r72m779R36M752m61n723n47O077J615n679k584
1785d903N364L209m966l830N053M317n434m763M541N803m093o113L127O737k964
1800A085o360K606O566j999o720J060O938n68o237k31N780Q48m942r62M505R23
1816B292m437j367M865K150m286k701L203L206l137k999L010L723k928m067K231
1831a242N361j298o171P91O191k22o064j67O009J171n964k314O398K785n628l792
1847d156N329M082m276m621L966M640m068m495L586N451l334n517K346N636j831
1862B738n449J425N536j333n617K84O098L96n786j503N451K705n781l259N416
1877A321L792n091m216M208N421m267n534K523O480j756o699J350N470K07o065
$$ plain form
1769 -1261 4058 965 -4221 -2476 2462 1490 -3289 -2353 2399 1938 -3785 -4332 1745 3360 -2319 -4903
1785 -4903 461 3670 -1296 -5126 -73 4244 -1190 -5953 -1412 4391 298 -5815 -2688 4049 1085
1800 1085 -5275 -2669 3897 1898 -4822 -3762 3176 2608 -3629 -3860 1920 2768 -2174 -3136 1369 2292
1816 2292 -2145 -3512 1353 3503 -783 -3484 -281 2925 -212 -3211 -201 3522 594 -3473 -1242
1831 -1242 4119 2821 -3350 -2559 3632 3410 -2654 -2821 3188 4359 -1605 -3919 2479 5264 -364 -4156
1847 -4156 1173 5255 979 -3642 324 4964 896 -3599 -13 5438 2104 -3413 -1067 4569 2738
1862 2738 -2711 -1286 4250 2917 -2700 -2416 3682 4078 -1708 -3211 2240 4945 -836 -4095 1321
1877 1321 5113 22 -4194 14 5435 1168 -4366 -1843 4637 2881 -3818 -2468 3002 3209 -2856
1892b856o43O220P42n898k070N483K556m681l040M489K874m580l191M383L572
1907C360l787m284L431M852k868n590K265N726j284o643J520O322j56o827p94
1922d757O469J938o091k661N322K869m839l020N087L597m665m028L936M644l408
1937C93m672K758M804k414m740K016M383p17n335J416M812n32n260L62N146M05
1953B825n236l99N624P78n769k258O117L504n466l942M750M122m537m214M594
1968D93M307l641n122L484M943k897n107K764N326j903n535J956N346j970n306
1983b862K027N060j170n008k9M970K13n162K82M945J90n168j443N218K058l610
1999E11l385L494L193k966l689K147M243j762m356J373M060j162m556Q14M889
$$ plain form
1892 -2856 -3499 2721 3463 -2435 -4505 978 3534 -1147 -4187 302 3176 -1404 -4595 -212 3360
1907 3360 -427 -4711 -1280 3572 704 -4886 -2621 3105 1821 -4822 -3302 3020 2864 -3963 -4757
1922 -4757 1712 3650 -2441 -5102 220 3089 -1750 -4770 317 3914 -751 -4779 -843 3801 393
1937 393 -4279 -1521 3283 869 -3871 -1855 2528 1811 -3524 -2108 2704 2172 -3088 -2726 2420 2825
1953 2825 -2411 -2810 2814 3592 -2177 -4435 1682 5186 -280 -4222 528 4650 113 -4101 493
1968 493 4800 1159 -3963 -479 4464 1567 -3540 -776 4550 2647 -2888 -932 4414 2444 -2862
1983 -2862 -835 4225 3055 -1953 -1982 2988 3201 -1961 -1679 3266 3456 -1712 -3155 2063 4121 511
1999 511 -2874 620 3813 847 -2842 -695 3548 1786 -2570 -1197 2863 1701 -2855 -2041 2848
2014B848k46m993J58M340M40n192o00N167J707n164k494M740J923m239j894M535
2030A036K227m673l203M301L636l514l680K626M198k304m181R27M273J69m055
2045b217o39L578J140l619k162L475L125l098l388K655L871k791m730L065N361
2060C626k211o007J543O481j526o601J836O813j258p311R72P022k62p190m73Q734
2076D188J9q048j113P677J665o816k185P107K774p113l208O026M106n204l829
2091c954M896M092m660m786L740N783k596n876J704N431p39o402Q58O656Q4o375
2107b144r91O490J117o838j431P446J929o794l357O480L571o775l528P372M447
2122F994o949n407N968N147n306n064N340N484n569n343L727O214l524n183K588
$$ plain form
2014 2848 2602 -2391 -2233 2107 2547 -2645 -3245 1922 3629 -1535 -4029 711 2634 -1605 -3499 1036
2030 1036 3263 -1410 -4613 -312 3324 -190 -3870 -1244 2954 650 -3531 -2604 1669 1838 -2217
2045 -2217 -2856 722 1862 -1757 -3919 -444 2681 -417 -3805 -1150 2721 -70 -4800 -1735 3626
2060 3626 1415 -4592 -3049 3432 1906 -4695 -2859 3954 2696 -4615 -3643 3379 3117 -4073 -4546 4188
2076 4188 4207 -3841 -4954 2723 4388 -2428 -4613 2494 5268 -1845 -5053 973 5079 -125 -3954
2091 -3954 942 5034 374 -4412 -672 5111 2515 -3361 -1657 3774 3035 -3367 -2509 4147 4231 -2144
2107 -2144 -3135 3355 4472 -2366 -3797 3649 5578 -1216 -4573 1907 5478 -1297 -4825 2547 6994
2122 6994 45 -5362 606 5753 447 -4617 723 6207 638 -4705 -978 5236 1712 -3471 -883
2137h83M873k320m723J562M286j041l036K03K626o24k703P8K328J171j826j388
2153a417N32J890q81j890R47K770m29l649q53L126J203k777j331L578J608m160
2169a733k280L912K685l174k954L080L161k928m256K514M299j049l470k01L340
2184I46l61k721n05L044J575k313k267J425K345j471k320J716L551j459m828P70
2200b873N430m70m945J12O175m8o799r93P308J678p436j956Q155K145q563l226
2216f306Q581M132p668m337P346M517p378m747O269O000n271n672M447N262m232
2231I43m903L791N585l258n880K459N216j024n646O35O003K07n980j439N443K322
2247D474n410k377N715L335o241m626N589N528m937n802M198O308m112p434M034
$$ plain form
2137 -883 3990 1670 -3053 -1491 2795 1754 -1282 -1079 1547 923 -1780 -1702 626 1797 -29 -1417
2153 -1417 -885 1005 124 -1766 -819 1951 1522 -2127 -2980 146 1349 -1428 -2759 819 2427 -1733
2169 -1733 -4013 -101 2584 -590 -3544 -464 2697 -231 -4487 -1973 2326 1277 -2193 -2394 946
2184 946 585 -2136 -2641 403 1978 -335 -2602 -1177 1168 -303 -2623 -907 2644 1185 -3643 -2873
2200 -2873 2557 2087 -2858 -2746 3429 3381 -3418 -4411 2897 4575 -2861 -4817 3338 5483 -3080 -6306
2216 -6306 2275 6407 -1261 -5598 1748 6265 -1113 -5860 409 6409 1138 -4534 -87 5175 943
2231 943 -3960 -169 5416 2158 -3722 -1263 3953 2929 -2717 -2082 3921 4128 -1852 -3291 2152 4474
2247 4474 -936 -3313 2402 5737 -504 -5130 459 5987 1050 -4752 -554 5754 1642 -5792 -1758
2262a758P623k776p582K039O940j462p637J848P259j458o744Q16O499j084o445
2277c922P98O065M33n815q63N204L78m721p47M205K007l992k835K889L113j886
2293C11l157J468L657j405m213K02N052P12m982j469M848J897n047k422M338L883
2309C673m602l451M507L610m489m477M027N049l551m792L243M336k859m387L263
2324i00M550l178m599K165M670j324m743J300M690q63m054m78M465J089m006j936
2340c152L956K332k823l476K500L978j979m160J432M706r48n469M98N845R2n346
2356b014p26N728L07n266p37N771J142n484k232O425J730o030j866N710J835n257
2372i64k691N729K376m872k832M612L303m186l520L277L297k578k965J674L244
$$ plain form
2262 -1758 5865 3089 -4493 -2454 4486 3024 -4613 -2765 4494 3036 -3708 -2892 3607 2523 -3922
2277 -3922 -3124 2941 3374 -2441 -3304 1900 2278 -2443 -3190 1015 3022 -970 -3805 -916 2197 311
2293 311 -2846 -1378 2279 874 -3339 -3137 1915 2627 -2355 -3824 1024 2921 -2126 -4548 -210 3673
2309 3673 -929 -4380 127 3737 -752 -5229 -1202 3847 296 -4496 -1253 3083 224 -4163 -900
2324 -900 3650 472 -4127 -1962 2708 1384 -3359 -2059 2631 1768 -2286 -2764 1701 2790 -1216 -3152
2340 -3152 804 3136 313 -3163 -663 3315 1336 -2824 -1392 3314 2366 -3103 -2605 3240 3332 -2014
2356 -2014 -2740 2988 3295 -1971 -2708 3063 4205 -1279 -3511 2914 4644 -1386 -3252 2458 4293 -964
2372 -964 -3655 2074 4450 -422 -3254 1358 4661 475 -3045 232 3529 951 -2014 -340 2904
2387B904j251l409L52L749J22l281q27K718J086k515j740K803J539k640j794K369
2403A85K835k794k902K549K742k408l144K079L683k455m199K370M479j638n090
2418c708J604M801j083m707R60M594j108m087l21M236P41l840o70L191N13k643
2434a527p40K632J029k295j564K001J770j608k392J629K301o39k446L58K284K75
2450A068l132l2L366P02l498j519L422K217l831j798L710K331l865k861L699L831
2466C810l545l781K720M396k630l853K041L541j584l780J770L188n10l135N7L200
2482A905J83k867k89K531O13k628j058K694J858k413k439K208K385j591k603J352
2498a59K743j017l363M13M236k46m395k79M390P95m580l71L758J165l505j636
$$ plain form
2387 2904 1653 -1756 -1404 2345 2467 -814 -1641 1077 2163 -352 -2092 711 2250 -390 -2184 185
2403 185 3020 226 -2676 -127 2615 207 -2937 -858 2825 370 -3829 -1459 3020 1382 -3708
2418 -3708 -2104 2697 1614 -3093 -2133 2461 1353 -2734 -3055 1181 1922 -1918 -2588 603 1116 -1527
2434 -1527 -2267 365 1394 -901 -2465 -464 1306 -302 -2694 -1065 1236 597 -1849 -1491 793 1068
2450 1068 -2064 -2096 1270 1972 -1526 -3045 377 2594 -1237 -3035 675 3006 -859 -3720 -21 3810
2466 3810 265 -3516 -796 3600 970 -2883 -842 2699 1115 -2665 -895 2293 1783 -1352 -1295 1905
2482 1905 2088 -779 -1068 1463 2076 -552 -1610 1084 2942 529 -1910 298 2683 1092 -1511 -159
2498 -159 2584 1567 -1796 -1383 2853 2607 -1788 -2067 2323 3118 -1462 -1833 1925 3090 -415 -2051
2514b051L641J837l783k197L467K281l043k622K924J863k186k036K282K303k495
2529A85k550K125K446j616k697J426K703j174l086Q47L360k69l731m24L464J021
2545B030l170j812L195K145k748k657K712L062k696l300K122L275j648l570J469
2560a591L433j127l352J179L501j120l473O37L453l52l739M73L286j73l393l69
2576b727M136N65m101q74L468J488k704k082K572K265j956k569J947K865j637
2591F56l372J242L501o48l386r6L443P79l390r31L382J162l050j077K375J834
2607B424k264j983K166K235k561j911K280K547k205k934K069L238j749l400J167
2622h81L758l81m122l57M230N13l840j187M130J400l499k470L640K601l073k957
$$ plain form
2514 -2051 1590 3427 -356 -2553 914 3195 152 -2470 454 2317 131 -1905 377 2680 185
2529 185 -2365 -240 2206 590 -2107 -681 2022 848 -2238 -1391 1969 1700 -2031 -2455 1009 2030
2545 2030 -1140 -2952 243 2388 -360 -3017 -305 2757 61 -3239 -1117 2158 510 -3060 -1591
2560 -1591 1842 715 -2637 -1458 2043 923 -2550 -1913 1540 1188 -2551 -2078 1208 1035 -2358 -2727
2576 -2727 1409 1974 -2127 -3001 467 1955 -749 -2831 -259 2006 50 -2519 -572 2293 656
2591 656 -2716 -1474 2027 1379 -2007 -2103 1340 2119 -1271 -2202 1180 2342 -708 -1785 590 2424
2607 2424 160 -1823 343 2578 17 -1894 386 2933 728 -2206 -137 3101 1352 -2048 -881
2622 -881 2877 2496 -1626 -1983 2247 2760 -1080 -2267 1863 3263 -236 -2706 934 3535 462 -2495
2638b495L139K822k668l324J696L958j484l585R72L461p07l902J025L699n96l712
2654a701k0M404J69n166p49M979J327m458k226M829J994m084l012M163L047l447
2670D9l721K939L824k635m140K666M224k262m557J229M846r00m604L09M677M8
2686A992m635l41M043P53m185m03M220N28m082j223M309J636l768j912L477K173
2702B582l730k563L505K766k233l385K038K868j475k909J351K875o22k833M19
2717a346K653n27k113l56K509N92k174j138K055J082j531j088J882R95j445j450
2733a400J016J711m77j357N58J532j272j406M07K265k22j656j77J648n8j270l35
2750d93J292J013j268q10J48J045k76j204P49J612O5k122p89J542J140r99j598
$$ plain form
2638 -2495 644 3466 798 -2526 -830 3128 1644 -1941 -969 2492 1785 -2117 -1092 2607 2011 -1701
2654 -1701 -1721 2683 2852 -2314 -3063 1916 3243 -1215 -3441 1388 3382 -702 -3714 449 3496 49
2670 49 -3672 -733 3091 456 -3684 -1018 3206 944 -3613 -2384 2462 1562 -3042 -2733 1944 1992
2686 1992 -2643 -2984 1059 1812 -2373 -2776 1444 1972 -2110 -3333 976 2612 -1156 -3068 409 2582
2702 2582 -1148 -3711 -206 2560 327 -3058 -1020 1848 373 -2536 -1185 1690 1068 -1765 -1346
2717 -1346 1307 780 -1333 -1689 820 1412 -762 -1900 155 1237 -294 -1382 500 1495 50 -1400
2733 -1400 -384 1327 850 -507 51 1583 311 -1095 -688 1577 1355 -301 -478 1170 1112 -158 -493
2750 -493 799 1812 544 -266 -118 927 651 -553 196 1808 1873 -249 -1038 504 1644 645 -953
2767i53J889J088j522k340J342K410o92k539J174J950j189k322J036K715p82k854
2783a589R06K765j180l176R82L667n24l211K2K741k54k992j30L714L23l103r91
2800b030K455J192k627j160K729J728k498k151J555J788n93j974R39J867q64k536
2816b180N41K332n3k309M55K310m14l059j92L655L95k538o30K675J45l600j5L538
2834A056R69k739j624K643N68k824l16L036J253k898j095J513J232j455p43J764
2850C40J157j367j164O99K34j61J24O34Q26j154q97J74M11N99o9K3P5L52r47p85
2870h96N73J784n75j069Q9J077o46j583Q82K147K50k468l80J875J46k207M94K246
2888A739O07k156j601J832J081j348m96J384J017j684j487Q43J381k14p05K46
$$ plain form
2767 -953 936 2024 502 -1838 -496 1914 1222 -1317 -143 1807 618 -1704 -668 2047 1265 -1589
2783 -1589 -683 2082 902 -2274 -1292 2375 1851 -1360 -1338 1403 1149 -1843 -1973 1741 2064 -1039 -2030
2800 -2030 425 1617 -1010 -2170 559 2287 -211 -2362 -807 981 388 -1586 -647 1220 356 -2180
2816 -2180 -1639 693 640 -1669 -1214 1096 682 -2377 -2569 1086 1481 -1057 -1687 988 1133 -2467 -2482 1056
2834 1056 2025 -714 -2338 305 873 -1951 -2267 769 2022 -876 -1971 -458 774 -681 -1424 340
2850 340 1497 130 -1034 -335 -101 -262 -138 496 1322 168 -729 -555 -144 455 386 409 484 836 -111 -896
2870 -896 -323 1461 886 -183 -94 983 337 -1246 -364 1783 2033 -435 -815 1060 1206 -1001 -507 1739
2888 1739 2346 190 -1411 421 1502 154 -342 1042 2059 375 -1112 -269 1112 898 193 439
2904D39R07p64j793J42K499O45k263r05K001Q49k889r48K491K467k576k710K255
2921a53K460k369l045L282L170k677l991K028L518j964l596K237M370k237m528
2936c495J309M358j025l630J073L703j099m546J253L814l28l485M22L426k88l967
2952b505k13L893P46l076j015K834P43l052j359K882K587k418k522J673K595j746
2968D7k553J589L518j750l566Q40L648o80l468Q77L870p59m092M27L735J4l564
2985a867J28L956k16l975l81M106Q27m075k83L716N40l612j111L665J150k833
3001b65j276K588J184k389j389K262J094j287j528J326J105o69j579R37J119K0
3017A253j145p16J387M26j308o57J258J111r98j541J158J288j056j431J337J487
$$ plain form
2904 439 1346 582 -1211 -1069 1430 2075 -188 -1093 908 1757 -1132 -2080 411 2878 302 -2408 -153
2921 -153 2307 -62 -3107 175 3345 668 -3323 -1295 2223 259 -3337 -1100 3270 1033 -3495
2936 -3495 -2186 2172 1147 -2483 -1410 2293 1194 -3352 -2099 1715 1387 -2098 -1676 1750 1462 -2505
2952 -2505 -2718 1175 1921 -1155 -2170 664 1407 -1645 -3004 -122 2465 47 -2475 -802 1793 47
2968 47 -2506 -917 2601 851 -2715 -1875 1773 1093 -2375 -1498 2372 1613 -2479 -2052 1683 1697 -1867
2985 -1867 -1739 2217 2001 -1974 -2355 1751 2578 -1497 -1780 1936 2476 -1136 -2247 1418 2568 -265
3001 -265 -1541 1047 2231 -158 -1547 715 1809 522 -1006 320 1425 756 -823 114 1233 1253
3017 1253 108 -608 779 1205 -103 -760 498 1609 611 -930 228 1516 460 -971 366 1853
3033A853r44k364J194J970o06j832M8K069n28j864PJ968J76j462p40J647L70j493
3051e31m59R15Q57o38r64J61R61J4j291N8J181O89j460j212J618J131j323j586
3069a879J573J314j295j772J581J935j787j801J646J929j538j951J381K488j593
3084B31k482J258K911j499k377M59K767m68k464M70J988j62k033qJ468Q74j841
3101i08m40J476O39j082p44R84P54n49j410O29J368k18j315L1J458K12j887m04
3119a406K120L89j522o19K188O35k079j448K562J522k407j446K114J304j635j763
3135a491J644J759j259j782R24J895o22k027Q43J633n02j514J53J430j79r79m38
3152e12J434L20j414l94Q51J209j336o80Q93Q65p70j416J013J434o75j637J69
$$ plain form
3033 1853 909 -1455 -261 1709 1103 -729 -681 1388 860 -1004 -997 971 1147 -315 -1055 592 962 -531
3051 -531 -990 -75 782 144 -820 -659 302 316 -975 -917 264 953 -507 -1719 -101 1030 -293 -1879
3069 -1879 -306 1008 -287 -2059 -478 1457 -330 -2131 -485 1444 -94 -2045 -664 1824 231
3084 231 -2251 -993 1918 419 -1958 -1499 1268 800 -1664 -1194 794 632 -1401 -1409 59 933 -908
3101 -908 -1348 128 767 -315 -1059 -75 679 130 -1280 -651 717 499 -816 -785 673 885 -1002 -1406
3119 -1406 714 1103 -419 -1038 1150 1785 -294 -1742 820 2342 -65 -1511 603 1907 272 -1491
3135 -1491 153 1912 653 -1129 -205 1690 1068 -959 -116 1517 1015 -499 -346 1084 905 -74 -512
3152 -512 922 1242 -172 -566 285 1494 158 -522 371 1236 466 -950 63 1497 822 -815 -646
3169f46K043m23k023q7K412J44k378o58K027R76k288m69J801R99j819j144J517
3186a6J320j696r31J034J228j223j062Q88P18m07j030P99R15m63j483Q09P09K11
3204C20j336pJ008N39j222k78R69M89r60j010P19J521r20j386R72J169l81j598
3222a392M26J679l14j758K68J880j32j350l66J692K5j614PJ334M3j202K04J202
3240F32k32q92j07Q02K71o64m90O29Q98r02n83P18Q04j91j219J36J564n35q97
3259b58kR77N67j167o25P05R23q02q21J006O71o91p35N65P13q08k03O67O86q06
3279E62j001P04Q67o75q53O59J102r02j001N42O78k9j098N03P14o3j081M70N82
3298F80j84p67q2O30K21l89l69J70P39j67o78oR4k27K23RK98l8l13m66N02K23
$$ plain form
3169 -646 1397 974 -1049 -1136 1276 1420 -958 -1616 411 1387 -901 -1370 431 1430 -389 -1533 -16
3186 -16 1304 -392 -1323 -289 939 -284 -1346 -458 260 -147 -1177 -378 537 74 -1409 -600 109 320
3204 320 -1016 -1023 -15 524 -698 -976 -7 482 -478 -1488 -769 752 -168 -1554 -582 587 206 -1392
3222 -1392 -966 713 399 -1359 -1091 789 657 -693 -1059 633 658 -956 -949 385 428 -774 -570 632
3240 632 400 -492 -599 203 474 -190 -680 -51 847 -55 -638 80 884 693 -526 -390 1174 639 -258
3259 -258 -260 717 1284 117 -508 197 1120 318 -503 503 1174 483 -252 313 1026 218 15 682 1368 562
3279 562 -439 265 1132 457 -396 263 1365 463 -538 4 682 653 -445 58 772 709 -372 98 680
3298 680 496 -271 -353 277 498 109 -260 -90 649 482 -196 -202 -108 -335 -112 -103 195 157 -156 -622 -120 103
3320A03m25j17O89M8p22P2L00L98o85l42N68M84j162k75R12M72p21l68M86L27
3340D2l51q24O51N69J39o35j17j02M55m79n8P51J39p69j31M81L67o90nO63Mj77
3362g7p20N06L52j86p64R93P43q58j049P67R93n45p45K96J189p62j029O70R11
3381F85r2r09M1J040j39j058K09J065L0j131L50K27J87m17j66O37K58n81k15P43
3401G64k90n12J17O75L95j305J4M24L71o23q5R96L4p16o47N84N52p10j77Q02L2
3422F95p60k43N55J17j23J4J86K3l92m84N35L03k24j39J86N7r76k59O75O57n31
3443a28k97N44j8l95k77J88P50j88k62k69j06P0p7Q9N15j45l09kR0n54O2Q46j36
3466il65j84K70J18r44K69J178J81j194m88O38K67m53j12J108L51j161p52P28
$$ plain form
3320 103 -322 -439 250 298 -424 -352 -52 346 -339 -681 -113 371 -791 -1066 -154 318 -403 -771 -285 42
3340 42 -309 -1133 -482 87 226 -409 -526 -628 -173 -652 -710 41 180 -589 -720 -239 128 -562 -567 96 100 -77
3362 -77 -797 -291 61 -125 -889 104 847 -11 -1060 -293 700 155 -590 -294 895 133 -896 -226 685
3381 685 593 -316 -275 765 626 -432 -223 842 872 -259 91 318 505 88 -78 559 817 236 21 764
3401 764 474 -38 79 754 1149 -156 -142 282 653 30 -55 941 975 259 -388 196 748 38 -139 663 695
3422 695 -65 -308 247 364 241 255 441 464 72 -412 123 426 202 63 249 306 -670 -929 -254 403 -128
3443 -128 -425 119 101 -294 -571 -383 367 179 -83 -352 -458 -388 -465 -376 139 -6 -315 -317 -227 -781 -719 127 -9
3466 -9 -374 -558 -288 -170 -1114 -845 333 514 -680 -1168 -530 -263 -716 -828 280 631 -530 -1282 -554
3485e54Q75o81m99J372M32j422j157J573J030j379n34J491Q69j836j215J481J341
3502A187j063j119J694J173k335j300J357K069j003j314N52J402j046j558Q90
3517d14K022j19j972j13J669n62j483P33J618J07j448q15J469n1j090J75J732
3534A458L43k280o63J396R24j015q72K124P62k157j815J614J629r24r45R56J076
3551A611j499j773J406J470n20j292Q03J064j234j333R35J391n41p91K82P80r71
3568b12j216J412J110l86j164j68N86k05m89K13J133l58k54p45N16K43k98M4N60
3587C22k21k82n79K50J37O63k60m76j51M28n47n3O26J75O3l24Q5m06l04K73P67
3608A86j46m4j25k46l46k10O20M34L11n86J32k26k69K88N20k65o6j6K62l05n02
$$ plain form
3485 -554 321 -360 -859 513 945 -477 -1634 -61 969 -410 -944 547 1416 -420 -1635 -154 1187
3502 1187 124 -995 699 1872 -463 -1763 -406 1663 660 -654 -102 1300 254 -1304 -414
3517 -414 1608 1489 -483 -596 1073 511 -972 -239 1379 1486 38 -777 692 641 -449 -274 1458
3534 1458 1801 -479 -1142 254 1178 163 -709 1415 2177 20 -1795 -181 1448 524 -421 535 1611
3551 1611 112 -1661 -255 1215 695 -597 206 1270 36 -1297 -362 1029 488 -303 -21 759 -212
3568 -212 -1428 -16 1094 708 -456 -624 -38 -243 -732 -519 614 256 2 -743 -227 16 -282 -238 322
3587 322 101 -181 -760 -510 -373 290 30 -446 -597 -169 -716 -769 -143 32 95 -229 -144 -550 -854 -581 186
3608 186 40 -4 -129 -375 -721 -931 -311 123 434 -152 -20 -246 -515 -227 293 28 -38 -54 208 -97 -599
3629e99M64O99n17p3L69jp10k10O88P09l92q34R81j95p03J76O01M41n31m15L85
3650C33j88n98M71Q13k83n86pN56k58n37N38Q44l35j056K8J048k21r01N45N14
3670G20q2l19n70M31K71n06O4R31m59o38K22M5m1P8K50K49n27j8l7L81j63k85
3692cq7L29K06k64j137P52R91n65q47K32J042o88j193Q61J419r15q09J54R67n88
3712a43p57L40J164j82j361L61Q34l05r75N02J112p14j413J270P73n52j183N24
3730g05J310l84j370M27J045o15p31J61J078J1q88k05O67N23o19j48K29L69k61
3749a06n23O9P39n2m54j84Q65j64p64L5R13J08p99J52R85j24r06o8P65L57j306
3770d62M9R77K7q09j79Q93O06r79m87Q39J84o41m8N34O9n46J4L71l27o5J70K35
$$ plain form
3629 -599 -135 564 47 -26 343 342 -368 -578 110 819 427 -407 574 379 -324 -148 453 894 363 -52 333
3650 333 145 -453 18 831 548 -38 -45 511 253 -284 254 1098 763 -293 -265 783 562 -339 206 720
3670 720 638 319 -251 180 451 -55 9 940 481 -157 65 110 69 147 397 646 119 101 64 445 282 -3
3692 -3 -90 239 445 181 -956 -204 787 222 -625 -393 649 -39 -1232 -371 1048 133 -676 -522 445 -143
3712 -143 -900 -560 604 422 -939 -578 256 -49 -1024 -522 590 -124 -1537 -267 506 -46 -1229 -705
3730 -705 605 221 -1149 -722 323 -292 -1023 -862 216 227 -661 -866 -199 324 -295 -443 -214 155 -106
3749 -106 -629 -560 179 127 -327 -511 354 190 -574 -539 374 482 -317 -165 820 696 -210 -278 487 844 -462
3770 -462 -413 564 591 -218 -397 496 1102 123 -364 475 659 18 -30 504 573 27 41 412 85 20 190 425
3792D25j58j68K88l05k1J47N32k53k34KK81k21m76N53J21m39n50M51L66k14q1
3813D6K23L63o87m67O55M95p37j60K29N96r27j04N15M08l67m33J34M19j76l06
3833b81K0K46Q1k51j6J87N2l04m1J41n1K13k20j83K95R8n02o7N99K05q58J25R24
3856D12k93p36l67J483j58j566L96J102K16j482O4J309q2j020n5R58K39p73m71
3875h24J088m5o2r14Q33L73l60p83K75O69k94m21K58K24L57p48J12N07J14l01
3895E8m93K41O59q0r81R30O20o62q62L42J181m78j541R43J192l78j439N13J169
3914I34r9j432J11J199L8q79j54J051o5n91j78N15ll81k62O39K04l51n37M65J47
3935C71O7n53J74M61j61l80n0K25J79n11k93P89K97o00n91P65O87q10j110J121
$$ plain form
3792 425 267 99 387 82 61 208 740 487 253 255 536 315 -161 392 513 74 -476 -25 341 127 46
3813 46 269 632 -55 -522 133 628 -109 -269 -40 556 -371 -475 40 448 81 -352 -218 201 25 -281
3833 -281 -261 -15 66 -185 -201 -14 38 -266 -307 -166 -217 -4 -224 -407 -112 -14 -516 -583 16 221 -637 -512 412
3856 412 119 -617 -984 499 341 -1225 -829 273 489 -993 -929 380 298 -722 -777 181 420 -353 -824
3875 -824 264 219 157 -757 76 449 89 -694 -419 250 -44 -465 -207 17 374 -374 -262 245 359 58
3895 58 -435 -194 465 385 -596 334 954 292 -570 -228 953 475 -1066 -123 1069 691 -748 -235 934
3914 934 835 -597 -486 713 751 -128 -282 769 704 113 -65 450 447 66 -196 443 647 296 -241 224 371
3935 371 438 -115 59 520 359 -21 -71 154 333 -178 -471 318 615 15 -576 189 876 66 -1044 77
3955G7N86n37p78L64J285j010r73N94Q19k89m80jN54k60n94N62M34m57o52K74
3975d82M87j03o12J15Q22q6n74k69N53L05m21l52PJ134o73l67Q2Q83m10r47L10
3996e98P67k04n85k79J363j83q34j65J007K04p76k36P97J99q76j74P90N19j035
4015b99l88M89Q08r66k83R98L62q07o95O91N93k41m94J66Q24k96p30P0J015k23
4035E94q06K33J55M04m42j03J6N29l62n60O98J38l18k38L37M79m70j39J34L05
4055E84k89m54O94M0k77m23Q9M51n5k69j53N54n50nJ50J49J46m97K42L90k75j67
4077G5k92L54K21l68r2K19P8K67p37J8J80J58R9q32N50J31l42J11o6M1K23m32
4099d36M6N47n70l1M15K9J3m88K0M20n66L3N29K80n0p87P8L18K69n56k59J045
$$ plain form
3955 77 663 126 -652 -288 997 -13 -986 -392 427 138 -342 -343 211 -49 -643 -81 353 -104 -756 -482
3975 -482 5 -98 -710 -595 227 141 -433 -702 -149 156 -265 -617 -610 524 -149 -516 -434 449 39 -908 -598
3996 -598 169 -35 -620 -899 464 281 -553 -718 289 493 -283 -519 278 477 -399 -573 217 736 -299
4015 -299 -687 -198 610 -356 -639 359 721 -86 -781 -90 503 262 -232 -66 758 462 -268 -198 817 594
4035 594 -212 21 176 580 138 35 51 580 218 -342 356 494 176 -62 275 754 284 145 279 584
4055 584 295 -159 535 575 298 -125 -36 415 360 91 -62 492 -58 -63 87 236 382 -115 127 517 242 75
4077 75 -217 137 358 -10 -102 117 195 462 -275 -257 -77 81 180 -652 -102 29 -313 -202 -268 -227 -4 -436
4099 -436 -390 157 -413 -444 -29 0 13 -475 -455 -35 -601 -568 -39 241 191 -596 -518 -200 69 -487 -746 299
4121B99l31o48QN52P07r23m90O91J00k92n45O01O62o86j13K73L82l93o17Q13M98
4142E48l64r51N95N41m29p13P26R44m52q87R8O64P5q41M88L30M50j027k14R39
4162E20J15m91m94P99O5n01l70O98J26l20l22M58O04o59n60K45J149k25r83J54
4182HN41j15o70M73N21l6p58l21P82l4k76j76Q63k95l21m29N38J10n3n89N57J81
4204E01k83n94J22N78k05m9l07N41O1n07o22M40Q20k20o29j63O36k39l80L65M65
4225C31j71l54l27O90r9n21k52J133j7r29m06Q40N60q37k78M59J126j256q13P54
4245c67J000q92o70N47J225r99q54L50J127M8j463K69J022r0j064j17J524j4j205
4264f23l53J623J12j264n67J824M47j765n51J393J054k016o36J889J091j751j463
$$ plain form
4121 299 -32 -680 -672 -120 587 -336 -826 -135 -35 -327 -872 -271 391 -295 -408 -135 247 -146 -763 50 548
4142 548 184 -767 -172 369 -60 -773 -47 897 445 -442 -344 320 395 -446 42 372 822 -205 -419 520
4162 520 635 144 -350 449 514 13 -357 341 467 147 -175 283 887 228 -332 -87 1062 837 -146 8
4182 8 549 434 -236 237 758 722 -36 -357 425 391 115 -61 802 507 186 -243 295 405 352 -237 320 501
4204 501 218 -376 -254 324 119 70 -237 304 365 -142 -764 -324 496 276 -353 -516 120 -119 -499 -134 331
4225 331 160 -194 -521 169 70 -451 -703 430 413 -516 -922 -82 478 -359 -637 -178 948 -308 -1121 -367
4245 -367 633 -259 -929 -382 843 -156 -1010 -660 467 515 -948 -679 343 253 -811 -928 596 582 -623
4264 -623 -976 647 759 -505 -1072 752 1199 -566 -1117 276 1330 -686 -1322 567 1658 -93 -1556
4281a556J608J381j583j343J476J473j171j633R06J876p21j660O12J662m13j792
4297h78K82J996p36r74j4J406k92j196j59J464L5r87m20J259L98j500m87J250
4315D47J099j518o44P55J038r53r88Q37J108o71j592O87J462k31j724N93J343
4332A048o07p10k74J097L8q23k17J020Q3j080m43J034L93j373N07O19l37k25m79
4351g29O38P1j03k62P8O84m79m80K34N26m8m50k76K46J40J20p43R50L02m65q73
4372i19N23Q54m67q39M95O55n7o21l68Q40K35r36M27L74j87n93n5P81K13o37k04
4393d86N19M41q49j92O07L20o68p6J49Q10n92n92M18P96l64n05j18O51J81p03
4413b53l73J404J11q97k97J14R89l19r42O68M79m97p11M94J107p38o99O88N07
$$ plain form
4281 -1556 52 1433 -150 -1493 -17 1456 285 -1348 -442 1434 713 -947 -335 1327 914 -878
4297 -878 -596 1400 664 -310 -324 1082 790 -406 -565 899 934 -53 -473 786 1184 -316 -803 447
4315 447 1546 28 -616 139 1177 224 -764 73 1181 510 -1082 -395 1067 836 -888 -295 1048
4332 1048 441 -269 -543 554 592 -231 -448 572 655 -425 -868 166 559 -814 -307 312 -25 -250 -729
4351 -729 -91 -20 -123 -385 -307 377 -102 -582 -348 178 130 -320 -596 -350 -210 -90 -833 117 419 -46 -919
4372 -919 -396 458 -9 -848 -353 302 245 -376 -744 96 331 -605 -178 196 9 -584 -639 142 355 -282 -486
4393 -486 33 474 -375 -567 40 360 -308 -384 -235 575 -17 -609 -191 605 241 -264 -382 269 450 -253
4413 -253 -626 778 889 -8 -305 -191 798 479 -463 205 684 187 -524 -30 1077 339 -360 328 835
4432H35m97r32Q07M79k04o37L95J86r5o20M12M62j29n57l05R43o9n34q6P11n3
4453E12k96o96O32L88r3n92K09O08k63n10n17Q85J47o78J39K22J87n62j01O80
4473C01K93q54k21Q18J02p56l32N20N77p13o5L26P65j182m25O39L58l56n41N32
4493b14N03j89q70L48O49J44p41l07O63L46m62m93Q8J044o41l12j5O16j9p94M53
4514b03O12m11o36K05N18K16q17k0R18Q6r09n7O68M21j152l50J513Q1j290j6N82
4535d1N67q15l50N87Q07o27p81P66N65l86p92L90P50l22m34k2N16M2q28K00O52
4556D44M51j096J71K91M97n72p39P15Q58r52l92M89M74m34o56M45J018r71n33
4575d92Q59N07o21p35J91J045k23j229M06J200m50p85j29Q54m5n07k25N94K10
$$ plain form
4432 835 338 -594 213 692 488 -149 246 432 337 -283 129 591 462 -95 -400 543 474 -60 -146 565 512
4453 512 216 -480 152 540 447 -145 64 672 409 -101 -618 267 414 -264 -125 97 284 -278 -379 301
4473 301 594 -260 -481 337 439 -317 -649 -129 448 -265 -330 -4 761 -421 -846 -207 151 -205 -746 -214
4493 -214 289 100 -770 -422 227 371 -370 -677 -14 332 -130 -623 -535 509 -132 -444 -459 157 138 -656 -203
4514 -203 409 -2 -638 -433 85 301 -516 -536 382 468 -441 -498 170 591 -561 -911 602 683 -607 -623 -41
4535 -41 526 -289 -639 -52 755 128 -653 113 678 292 -500 -110 640 318 -116 -138 378 420 -408 -208 444
4556 444 895 -201 -30 261 758 186 -553 162 1020 68 -324 165 639 205 -451 -6 1012 41 -492
4575 -492 367 874 253 -482 -291 754 531 -698 -292 908 458 -327 -456 398 353 -154 -379 215 425
4594D25o78R3L78J24n89R1J77L97n02m87O16J63j75n52J75O43j35r83K73R65M7
4615D66j177k3J187J19j159pR63L07j277j83O44K11l07l63L91O50p25m60O47L24
4635B28l56n88J94N43j26n12L77P67l57n40o2N09R8q58o9N47j0j18J3O13J33p33
4657c07R5K76L22j96q79M20N85J83q54L0N70K37j089J79Q69J03m02n20Q87J12
4677F21q25m6Q69m0o89p7N07L64q23J22M22M35n55p67M16Q33m07q62N63M79k65
4698B75o82N70N39o4n93o0O36N8j025n3O75N58j030m05P82O91r32j25M2Q82o27
4719A12p74L18R95m02p64K67P34o63l31L01Q84m29p23K71N72J23q57m01Q76N16
4739F25j082K17M03M25q71k77M26N91o69k44K54M51k31r48N23O69m53m22M24L49
$$ plain form
4594 425 -253 -160 218 342 -247 -156 21 418 -84 -571 45 208 33 -519 -344 299 164 -819 -546 419 466
4615 466 -711 -734 453 572 -587 -594 369 676 -601 -784 -140 71 -236 -599 -208 442 -283 -743 -96 228
4635 228 -128 -716 -522 21 -105 -617 -240 527 170 -370 -432 77 175 -683 -752 -205 -215 -333 -320 293 426 -307
4657 -307 -212 64 386 190 -689 -269 316 499 -355 -325 245 482 -607 -428 441 544 142 -378 509 621
4677 621 -204 -250 619 579 -110 -187 320 684 -139 -17 405 840 285 -482 -66 767 360 -502 61 540 275
4698 275 -407 163 702 638 45 -15 621 679 -346 -399 276 834 -196 -601 181 872 -60 -185 -143 739 112
4719 112 -662 -344 651 249 -515 -248 486 -177 -508 -207 677 248 -475 -204 368 491 -366 -767 109 625
4739 625 -457 -240 163 588 -283 -560 -134 457 -212 -456 -202 249 18 -930 -407 262 -191 -613 -189 160
4759A60P4l73l55L15K50n98P1Q62m79m55k00Q49L04p63k65N22J98k42o88P62M74
4780D23n72o32M71L85K1n76J61M96N6k33m81N75K82n89l09N13M47k82n79K88M31
4801B96q8o74M01N21J23n97l93R79J6m34m46R82J71j119M1P02K88o91o49J151
4821E80J75l74j139R17R64n64r71O24R07p81j094Q62R22j73j398K41Q87o1j051
4840e27j53J553N8j221j62P84L46j045k62J043L78j152K17O19j9p43n14J055N53
4859H08q44j136J077N62n00q63P04J131r54q93M81J066m38r52L41Q15l16j017
4877i28r8J735k39q64j98Q06M4j014J35R13j64p63j55O43L78o84k46Q44N59p75
4897g1n02M28O57o26o47L31R35o14p89O49P55m39m72l5Q27K92q13k00N40K08r8
$$ plain form
4759 160 234 -139 -494 -179 71 -527 -456 406 -73 -528 -728 121 425 -338 -603 -81 117 -125 -813 -51 423
4780 423 -149 -781 -310 75 96 -480 -319 177 233 0 -481 94 376 -213 -522 -9 438 156 -423 -135 296
4801 296 208 -466 -65 456 579 -18 -411 568 584 150 -296 686 857 -262 -221 481 769 78 -571 580
4821 580 755 381 -758 159 1123 559 -412 212 1119 338 -756 106 1028 855 -543 -302 585 524 -527
4840 -527 -680 873 931 -290 -452 332 678 -367 -629 414 792 -360 -143 476 457 -286 -800 255 808
4859 808 -36 -1172 -95 467 -33 -896 -192 939 -15 -908 -427 639 201 -751 -410 405 89 -928
4877 -928 -1026 709 470 -394 -592 214 258 -756 -621 292 128 -635 -790 -147 231 -453 -699 145 704 -71
4897 -71 -573 -145 512 -114 -761 -430 505 -109 -898 -249 506 67 -405 -440 387 679 -134 -334 206 414 316
4918C16r09M82Q87n41m79K67N10k53m20j53N53K12o19K84L08k7j68o75J035k48
4938C62k14J15k3K02o84l4M14L00j90k86k0O33j68p26K94P43l98m69K31L28k00
4959B10n02J77N61L11j038n9N30l3l32P3K90M95n83o96N78L85k66n32M77M57j3
4980D90p43J61M69l62o03L49O77m68m56O5O00j61p07M16P86k68j062J51P89L05
5000D28q48k29P98J77q73M4P10M24q86l9J65J22l74P9L35J10m70k51O04j19j44
5021b37pJ88O8k6n67L05J04J06o26L44O21J33r45k0L21M73l15l9K23q3j5j50J36
5044hM12m08J62j97K88j74O6r6L24k64q7K79j32m46N00l35K43K16k75j41m0j3
5066a26L07Mm56M89j86O9k72N46p6%k01O8K46n01k7J5O60l30n39L79K58P3l07
$$ plain form
4918 316 -593 -111 776 235 -244 23 533 280 -140 -293 260 472 -147 137 445 418 250 -425 610 362
4938 362 148 263 240 442 -242 -276 138 438 248 -38 -58 575 407 -319 -25 718 320 -149 82 410 210
4959 210 -292 -115 446 757 -281 -340 190 157 -175 -102 188 683 100 -596 -18 367 101 -431 46 503 490
4980 490 -253 -92 377 15 -588 -239 438 -30 -486 -421 179 18 -689 -273 513 245 -817 -666 123 428
5000 428 -420 -649 149 326 -547 -503 207 631 -255 -294 -129 -7 -381 -302 33 143 -327 -578 26 -93 -237
5021 -237 -244 -56 12 -14 -581 -276 -172 -66 -692 -348 273 406 -539 -559 -238 235 -80 -119 104 21 6 -144 -8
5044 -8 404 -4 158 -39 249 75 141 45 369 105 18 297 165 -281 219 -116 127 343 68 -73 -113 -126
5066 -126 181 185 -271 218 32 101 -171 375 299 299 98 166 412 -89 -116 -101 559 229 -310 69 327 400 93
5089I3k34Q74k12q59j07Q84k0n69RM80J33m68m68O95K24q04j72P85Q6l14n89N61
5111HL12k98m03M2R96m31p91M18N17l32n74K29Q36j17o50L1K92M13q13r9M90M04
5133D80r66k21R80M8l13p28P07L79o00o02Q04K92p17j26N99N57j217m3P35J57
5153B05n13m57N22Q59q96m91L11N41K93r98L7N38J40o44J60M37j8k18j70K85M11
5174C34l94m63N93M86l78o08L48L82p4p48n0P42K62p04K53P20n37l57PQ65n1r34
5196c06J56P00k49o73J70Q00r7n05m11P62J88m60m05N09M85l40l23K35j15O4l64
5217a79P9J53J96j74j56M53L5m99P3K70K60n92L6K81K01n77k85O22J34j66o20
5238d55Q43L3n22l29L04M31j75l10p1N52j08n57j09O67P4o86K7L07J06j05k59
$$ plain form
5089 93 -141 733 521 -338 -445 439 419 -150 -141 339 472 4 -464 231 455 -349 -521 264 350 36 -553 8
5111 8 320 22 -381 -339 657 226 -565 -147 370 38 -536 -307 529 412 -238 -207 85 498 -315 -414 76 480
5133 480 -486 -707 273 321 8 -720 -13 366 -234 -836 -32 260 -457 -583 16 573 -644 -687 48 205
5153 205 -308 -765 -243 616 -280 -771 -460 81 374 -624 -587 -49 91 -553 -393 44 26 -192 -362 -77 334
5174 334 -60 -523 70 556 178 -430 -82 300 226 -522 -572 170 432 -272 -19 701 164 -193 -186 679 628 -306
5196 -306 -150 550 301 -372 -202 598 501 -4 -415 347 535 75 -330 179 664 324 1 236 121 185 -179
5217 -179 -100 53 249 75 -81 372 407 -92 -19 251 511 -81 -45 236 437 -140 -425 197 331 165 -455
5238 -455 388 421 -101 -430 -126 305 130 -180 -251 301 193 -364 -473 194 268 -418 -391 -84 22 -83 -342
5259c42N48m7n4k39o5K85k31k61P1L94k75j25k8M22k19l39n3O53j63k05j48O37
5281B16%m67k28K06L34l30l37Q40o8m65k74J99M49m29j28K53O74j03n89K76l0
5302aR5j97j69N44k90j28J17L19l82J5J4L3lJ40k50K81l0l09q2M8O65k81j85J49
5326A13J89j26n24N24K45l0m11o6N42k44l05J76L00J1l47JK83J96m00l20M08K8
5348B43l40J76j46M50n02j4L00J44l67l2K06M24n82N3K72j6k10k29r9L21J44Q9
5370B85n13L5O75m10k10J06N56o17k04J48r4K99m07L1M20k60l02K48N19k71m89
5391d55j84R12n42k10L43K07P0l57l06N79ok29k62N96j42n1k10j27K92pm28L13
5413b04K80P7m47R3M54j96p2n08O01K8j60k87M94J6k66m15M52K07l51j21K62M50
$$ plain form
5259 -342 206 159 105 -134 -199 86 -145 -406 -335 59 -216 -341 -369 53 -166 -505 -558 95 -68 -273 -421 216
5281 216 216 -251 -479 -273 61 -269 -606 234 166 -299 -573 -374 75 -354 -482 -229 445 342 -247 29 -1
5302 -1 94 -103 -272 272 -18 -146 -29 290 -92 -77 -63 -30 -33 107 -143 138 108 -201 -283 -235 430 149 -36 113
5326 113 302 176 -348 176 421 391 -20 -86 456 212 -93 83 383 394 47 48 331 527 127 -193 215 243
5348 243 -97 79 -67 383 -119 -133 167 311 -56 -88 118 542 -40 13 285 269 59 -170 -269 52 196 285
5370 285 -228 -193 482 72 -138 -32 524 -93 -297 -149 -243 56 -351 -320 100 -160 -462 -214 305 34 -455
5391 -455 -639 273 -269 -479 -136 71 141 -216 -522 57 51 -178 -440 156 14 -37 -247 -374 -82 -89 -517 -204
5413 -204 76 153 -294 -201 253 57 -15 -523 78 106 -54 -341 153 169 -97 -512 -60 147 -204 -325 -63 387
5435C87l03n58N22N98p18j27K52M32o45R2r0P86n09k47J04N95l53n81%Q21k25
5456B33k82k82M08N87m52n8k93K85J64m13K06N85m12k15j80L55j19k98J35M23
5476C77J09n63K83P4j03o21O73J23j37n24n0N81J15k06n80Q45l4n76M5J53K82
5497B66j97l65K36K42j75k97M51K0J50o81mN62j18l93R0K27L14j84n66L22K50
5518A50L3m48J33N83o81k9R8K7R2n23K64M87k87o96M13M63o6l87J91K72J36n00
5540b75l28L33L59n43k25M98N30l63n73L66M80o3q90N61J51k52j20L75K53m56
5560a82j68K37M27m58o7J62P94p71k64L83J89k48k57K07Q6O37o13l77Q08j87n03
5581a65J96K45J08m80j10L95K33l86l72N29L14m33k28N49j61J95k40nj76J70j86
$$ plain form
5435 387 84 -474 48 646 -72 -199 53 485 -160 -68 -158 628 119 -128 -24 571 218 -363 -363 458 233
5456 233 -49 -331 77 664 212 154 -139 146 310 -103 103 688 276 61 -119 236 117 -181 -46 377
5476 377 486 -77 206 280 177 -444 229 352 215 -309 -359 222 337 131 -449 396 362 -214 -169 -16 266
5497 266 69 -296 -60 182 7 -290 161 181 331 -350 -354 208 90 -303 -213 14 328 144 -422 -100 150
5518 150 183 -265 -132 451 -230 -259 -161 -134 -42 -565 -301 186 -101 -797 -384 79 13 -374 -183 89 225 -275
5540 -275 -603 -270 89 -454 -679 -181 349 -14 -587 -221 259 196 -694 -133 18 -234 -354 21 274 -182
5560 -182 -350 -113 314 -144 -211 -49 745 -26 -290 93 282 34 -223 -16 70 707 94 -283 525 338 -165
5581 -165 31 276 384 -96 -206 189 422 36 -336 193 507 74 -154 395 234 429 189 184 8 178 -8
5602hK85M3k95J09m3o1J04k90K93L23m69J33N0K9k18k1J72J6l52K79K3J23j73
5625E2P8N5j53l62K65K31r6j14k6L43j65k50l32M82p5r5o6N94l89r5j58K43J17
5648H4j62l36K89J96l32l6L85p4J19l33K9K2k06J96J80K53m83q6M73K28p19j30
5670d43L1L70l32J1K26L69N6o76R9M12l6l12Q5L88j86n04J08N62k66j3j12K43
5692H0q3J09j75K71K4m95l9O95j50j09k95mM60n38L17R8J54l18j61p3O06m13o8
5715a07K56J53k92n60M38O6J61q8J27J6L12o68M88j09m5j2j95j24K17J90k66K52
5737B10kj41K00j57K57m04r1L91r0j69l02K00J87l33K97m6j57L52k53m23M31N4
5759A1pk15j7K23l00J36K8K48j15l1j60J24k63q6L29K58j83k48K96p6j39ql8K59
$$ plain form
5602 -8 277 320 25 134 91 30 134 -156 137 460 -9 124 174 203 -15 -36 136 152 -200 79 102 225 52
5625 52 130 185 32 -330 -65 166 70 -44 -70 273 108 -142 -474 8 -67 -162 -228 366 -23 -118 -276 -33 84
5648 84 -78 -414 -125 71 -261 -297 88 14 133 -200 -171 -149 -355 -159 21 274 -209 -295 178 406 -313 -443
5670 -443 -412 -42 -374 -363 -137 232 288 -388 -289 123 87 -225 -140 248 62 -442 -334 228 -38 -51 -163 80
5692 80 -3 106 -69 202 226 -269 -308 387 237 128 -167 -171 289 -249 68 166 320 2 -159 -232 374 -39 -107
5715 -107 149 302 10 -550 -112 -46 115 27 154 170 482 -186 302 193 148 136 -59 -183 34 224 -42 210
5737 210 208 67 267 110 367 -37 -128 263 173 4 -298 -98 89 -244 53 7 -150 202 -51 -474 -43 11
5759 11 4 -211 -228 -5 -305 -169 -141 107 -8 -39 -199 -75 -338 -424 -95 163 -20 -268 28 -48 -187 -195 -233 26
5783B6k28J28M5j7K21m64%M12l00Q1k17K59Rk20J88M8K56l32l84L74R1j49o6M86
5807B47k02l41J13L75m15K22o1n2P2Q3r4J68M35n90j76L22l7L8j86J6J21k9J15
5830A44l25M34l6m64J96k78K75M9J19m35L15R7m0K41k14J32l56J06K49J43k33
5851A19l5K10j76j00m8L30j39l25J48r9J80K21l68O16j61k77r9L79k51j08k3P
5873Aj68%M04l11J95P7k92N46m41o9K47l00J60O6n0m8J19m73M39r7J11k83J3L57
5897B03j02m4j78J39J64K3k07o6J50j85j36M29k42J35o3m02N07j97q6K11k55K61
5919E9q3k20k4K16j5r5J36Mj40K27j59j15K60R8p3q2j30k6j49J66J21j26J65q
5943Gn50L90N7k24L8J30j36M46j83K89j15j66J63j81J42j47m0M7K51l19o9M40
$$ plain form
5783 26 -202 -74 -29 -46 175 -289 -289 123 -177 -96 -313 -54 -45 -265 -77 -29 227 -105 -489 -115 -24 -173 -239 247
5807 247 45 -296 -183 192 -223 -1 -62 -114 -42 41 -53 115 550 -40 -216 106 69 107 -79 -63 58 29 144
5830 144 -181 253 217 -247 -51 -329 -54 -5 114 -321 -6 91 51 292 78 210 -146 -40 209 352 119
5851 119 84 294 118 18 -30 300 161 -164 -16 -115 65 286 -82 534 373 96 -3 376 125 17 -6 1
5873 1 -167 -167 237 -74 121 198 -94 452 11 -58 189 -111 49 115 65 17 136 -337 102 5 116 -167 -154 203
5897 203 101 57 -121 18 182 205 -2 -68 82 -103 -239 190 -52 83 20 -382 125 -72 -158 53 -202 59
5919 59 -24 -244 -268 -52 -67 -162 -26 -22 -162 65 -94 -209 51 149 76 -6 -136 -162 -311 -145 -24 -150 15 7
5943 7 -543 -153 -96 -320 -282 -152 -288 158 -25 264 149 -17 146 -35 107 -40 -80 -33 218 -101 -170 270
5965B70j65l9j59p4M43j14l04J06P1j5N1J37R6K6k36j47M11j15l02n7J36J88j78
5988C0q1J80j13J10l99L72Mm4j74J63J51n7j41k53M52o4J92l84K63j45O2k43r5
6011b14L8K19l26K30J19L22k59m38N22Q0j78r0J54k94J18N5k4l1q8j37Q0o0m1
6034b43j04K48r7M34l41j86L38m27K20N9N2j6q1L18j46J92l24j6J13l14J50K81
6056A10k91L51j07k00j47l7J78J62K2M8Q0k98o6L56k54j1R3n2O2j11K10j73K04
6079A29j36j84J80M7m9oK21j05l80K53J52j28L0J0J60j6k23j46J7L10k65K31J0
6102A12L30l63J6J3O4J45n58K20L72j20j90k52L00JN3o6K81k82r2l00J87N03k48
6125A26m88J28N32j22l49M0J16J45l62L08K29n01L71k60J94Q0k29o8L6L08l11
$$ plain form
5965 270 105 66 -93 -167 276 162 -142 -36 35 20 71 208 304 330 94 -53 358 243 -59 -116 20 208 30
5988 30 -51 129 16 126 -273 99 103 59 -115 48 199 142 1 -252 200 136 328 -56 207 62 124 -119 -214
6011 -214 -176 43 -283 -53 66 388 129 -309 213 293 115 25 179 -115 3 58 34 3 -85 -222 -142 -202 -243
6034 -243 -347 -99 -196 238 -103 -289 49 -378 -158 -99 -47 -63 -144 174 28 220 -104 -120 -7 -321 -171 110
6056 110 -181 170 63 -137 -284 -321 -143 19 41 89 169 -129 -195 161 -93 -104 -11 -63 -1 -112 98 -75 129
6079 129 -7 -191 -11 36 -13 -19 202 97 -283 -30 122 -6 24 34 194 178 -45 -191 -174 136 -129 102 112
6102 112 442 79 95 108 172 317 -241 -21 351 231 41 -211 89 90 143 77 358 76 -16 -316 -129 374 126
6125 126 -362 -234 298 176 -173 -133 -17 128 -234 74 303 -198 173 -87 107 187 -42 -110 -74 234 -77
6146g7R2K54O0m20J88j60l94L34n7J17O7j19K17k28q7j13K68P6j54J54m7l8M3
6169b4N4k71nj80N23m38N1p1M78m7l66K08M08l30J16m43J09J53q8n6L3K74l71
6192b83R7J47K16l6j60K0l9J27j98j94L92p5k88J10K4p9L43l36L04R7n21N04l10
6215a38N22n39P1K20N0j11m24N67K17l61j99L77P8l53j86L17J96j63j56j8J73
6236A40N1l47j67O41l58q4K98J18r5j58j32N8J58r9J75l02L45k66l7M53l42J1
6258F1O1k27K35j05k2j05K22K04o57J82K87k36q8K77j50L71l40J29r3J18L7l80
6280b19J98j15K29l16J46P6J36j26K13k06q5k16J1J81j10L9K7J09R6k17n7J87
6302a9M84o14k65K81J90J62k21J20l2k14l09Q8M02r6k63J74K42j75j75q4K7L76
$$ plain form
6146 -77 15 269 329 -91 97 -63 -457 -123 -180 -63 4 -115 102 -126 -213 -326 -58 18 -136 18 -29 -67 -24
6169 -24 30 -241 -246 -426 97 -341 -290 -361 117 70 -296 -88 320 -10 106 -337 -228 -75 -163 -219 -186 88 -283
6192 -283 -186 -39 177 141 -19 1 -38 89 -109 -303 89 14 -274 -164 -140 -219 124 -212 92 189 -332 172 -138
6215 -138 384 -155 -84 136 186 75 -349 218 435 74 -125 252 330 -23 -209 108 304 141 -15 -33 140
6236 140 191 -156 -323 318 -40 -124 174 292 197 39 -93 -35 123 24 199 -103 242 -24 -61 392 50 61
6258 61 122 -105 130 25 3 -102 120 324 -333 -151 136 -100 -188 89 -61 310 -30 99 6 124 161 -219
6280 -219 -21 -136 93 -223 -77 -1 135 9 222 16 -69 -285 -274 -93 -203 -164 -137 -28 68 -149 -206 -19
6302 -19 465 -149 -414 -133 57 219 -2 118 86 -128 -437 -349 53 -43 -306 -132 110 -65 -240 -324 -297 79
6324G9k50r9j2J94j58K52L26r3j37j0L2L2j69k67L68J9l28J4J78K43l68O7K93
6347B06J30k50n61J02M63K68l62%L03j74j79J67M5n5qK13j23L1k36J32M5M3j26
6370G4J05O9k06R2j08J26J26j20j43m6J71j44j83M32o4q0o8l6Q6j32J00P9o5l37
6394b72K53L62m96J54k22L21L0o7J2p2%k68N31k79j8k3j15P9Q1J2j03J77n2p5
6418e0o77O99L35l14r6k80J84J6J79j67J51j62k72O07J46l70K13k1k01j33K1K40
6440D8l37j49J47L97M4j60k22L32j46J16l66K62K25o03L62NK47j52p8j04N57n50
6462a25k41L12J12N5n33M20L08l38k79M94j82j70L82l49K83j06j27N6N1k84j4
6483b75K14K32L43q14L77K47k77L1j91K22L18k87j00L88m3m50J6J71K6n7j46K03
$$ plain form
6324 79 -171 -270 -282 -88 -246 6 332 239 102 92 124 156 -13 -280 88 107 -221 -207 -29 214 -154 -87 206
6347 206 336 86 -475 -373 90 358 -4 -4 299 125 -54 113 158 103 95 308 185 216 -20 112 157 200 74
6370 74 179 248 42 134 26 152 278 158 15 -31 140 -4 -187 245 181 101 33 -3 83 -49 51 130 65 -272
6394 -272 -19 343 -153 1 -221 100 130 63 75 3 3 -265 266 -13 -31 -54 -169 -90 -9 3 -100 77 25 -50
6418 -50 -727 -28 307 -7 -103 -383 -199 -183 -4 -171 -20 -182 -454 153 299 -71 142 121 -80 -213 -192 48
6440 48 -289 -438 -291 106 150 -10 -232 100 -46 70 -296 -34 191 -412 -50 -45 202 50 -28 -132 425 -125
6462 -125 -366 -54 58 113 -420 0 308 -30 -309 185 3 -167 215 -134 149 43 -84 -28 23 -261 -275
6483 -275 -61 171 514 -300 77 324 47 78 -113 109 427 140 40 428 385 -65 -49 122 148 91 -55 148
6505A48j34l32n1L41K63k86J3m7M5L9k25J74Q1R1R2k42N4J55l39K76r0l0o5j60
6529b29L95nj22oj7K60n03M9l4L97k86K91k61nJ29l30L65K05k03o9L7Kj96q8K13
6554a1J07j86j16N4N28m74J6J02j91K38J16m84O38m33k5j62K01K53l23K1q3J00
6576a14j94K11j89K55k2j69j47M40k90P5j31K00K12m24n3K34k1J79j08K00j51
6597gq1k94M08K44l83j80k7M14j12N7J46R5j05J68k71K6J06k56nJ3M41k88K56
6620C65M6m92p0K17J29o8o3r4L24l27O4m74L41J82N6l80R9O50l6p11M36J37K2
6643C53n42J52M25l25k15j01N99l11m13K82K86J90m24N9j82M27k81p1N6O9K28
6664B61l77J78l6J19m19J16K63N9l85K03K28k92O0k39o3L60R0l77K82M5l67n8
$$ plain form
6505 148 14 -318 -369 -28 235 -51 -38 -85 -40 -1 -226 -52 29 120 212 -30 24 179 -160 116 26 -4 -69 -229
6529 -229 166 161 39 33 16 276 -227 -178 -212 185 -101 190 -71 -76 53 -277 88 293 90 21 58 60 -136 -224 -11
6554 -11 96 -90 -206 -152 376 -98 -82 20 -171 67 183 -301 337 -96 -121 -283 -82 171 -152 -131 -214 -114
6576 -114 -308 -97 -286 -31 -53 -222 -369 71 -219 -144 -275 -75 137 -287 -340 -106 -127 52 -56 144 -7
6597 -7 -88 -382 26 270 -113 -293 -320 94 -18 39 185 280 175 343 72 98 204 -52 -57 -44 397 109 365
6620 365 411 -81 -151 66 195 127 64 -30 294 -33 31 -443 -102 80 136 -244 -145 505 469 -242 194 331 353
6643 353 -189 -37 388 63 -152 -253 346 35 -378 -96 190 380 -44 15 -167 260 -21 -92 -36 33 261
6664 261 -116 62 26 145 -274 -158 105 164 -221 -18 210 -82 -22 -261 -324 36 126 -251 31 76 -291 -349
6686c49L10J08n9L7l49K78J03j58k86L19q7R6n1K64j81j5j27J02J39j68K07j18
6708A5K0m19J33N00n28L88k88L99j23J16j15n51M43J8l13K58R3J72%k83O6K78
6730B79k80J70k58M31k43j84J55K31m28k79K70J41J36q3J01L1j84l21L64R8j18
6751B9J47l82M97N5k83M5p6K49j71m35N31J04k93J6p7M11k44NQ3j64Q6k16L37
6774B54j89P8k63J81L29m88k26J66J63K02k11k90M55j56j38K64K2k18n4j04O8
6795a55L53n36J16L08J6j34k19Q8J01J41L7j65K70j85k40L41J5J68n28j71J75
6816b04L95l24k52L27R6l5J87l22R7r8K37P1l12K84m66k0M06Qk06L14j07J57m61
6839b28l5L32K07l56K9K40j2l05M0L56j12k75J28J34N5J6j47l14L41O4j16j02
$$ plain form
6686 -349 -39 69 10 47 -302 -24 79 -79 -365 -46 -133 -37 -88 176 -5 -20 -147 -45 94 -74 133 15
6708 15 35 -384 -251 249 -279 109 -179 220 97 213 98 -453 -10 8 -305 -47 46 218 218 -65 1 279
6730 279 -1 169 -89 342 99 -85 70 301 -127 -406 -136 5 141 58 159 190 6 -315 49 147 29
6751 29 176 -206 291 346 63 108 32 281 110 -325 206 310 17 33 -44 367 123 128 211 47 133 -83 254
6774 254 65 143 -120 61 390 -98 -324 -158 5 207 -4 -294 161 5 -133 131 153 -65 -119 -223 -155
6795 -155 198 -338 -222 86 102 -32 -251 -163 -62 79 116 -49 221 36 -204 137 152 320 -208 -379 -204
6816 -204 191 -133 -385 -58 38 3 190 -132 -35 -133 104 175 -137 147 -319 -339 67 75 -131 183 76 233 -228
6839 -228 -263 69 276 -80 -51 189 177 -128 -88 268 156 -119 9 143 198 214 67 -247 94 158 42 -60
6861f0L62j40k77k31L12p5M0N5j67M00j81J06K8M0j43m57K59K58j80k0J44k17
6883a44L83k19J90L8l59k23M69n2K70m15J16J24m1J49m44L31J36o68L33J20J70
6904B64n4l30J40J91j73l21K10R6P8k44O6K94J42m22K65q3j38M7q1J36k8j55J80
6927H0K0l28O16m44k28L38j37qNJ92j43Q4J1K52m47J21M2k73l3j70M60l35L94
6950F9J6j9J11l26K04j16K54l69o7M60j45k27K15j38n6R2q6p8J51j40J81m7k17
6973b78L66K3p7R5m9l38J44M46l59O7j46r5L68l6m6j06PJ5m2J57K5l23J30k3K04
6998A29m43M80Q2J04m47J57L9j55J93M1p4j40K58j23m1k5k12M75k09j60J43K08
7020B80k32k15L5M74j45k43M0j1q2L12J25k62K95n98J75q2L09m76K91J97k15j14
$$ plain form
6861 -60 302 162 -115 -346 -34 -109 -69 -14 -181 219 38 144 172 212 69 -388 -129 129 -51 -71 73 -144
6883 -144 239 20 210 248 -111 -334 135 83 353 -62 54 178 137 286 -158 173 309 -359 -26 94 264
6904 264 210 -120 20 211 38 -283 -73 23 101 -143 -77 217 359 -63 202 119 -19 28 -53 83 55 -100 80
6927 80 100 -228 388 -56 -284 54 -83 -91 -86 106 -37 47 58 310 -137 -16 26 -247 -280 -450 10 -325 69
6950 69 85 66 177 -149 55 -61 193 -176 -243 217 72 -155 60 -78 -134 -42 -128 -206 -55 -195 -14 -61 -278
6973 -278 88 111 34 129 80 -258 -114 332 -27 40 -106 -201 167 131 85 -21 -14 1 -41 116 141 -182 -52 -75 129
6998 129 -314 166 248 352 -95 62 101 -54 139 180 106 -34 224 101 60 35 -177 298 89 -71 72 280
7020 280 48 -167 -132 342 197 -46 -6 -17 -99 213 338 76 371 -227 -52 -134 175 -301 -10 187 -28 -142
7042a42J63J19O1l11P5P2p3k9J99j75L99l29k34K71K76k29m56J98J64J08k92J08
7064e7o9o5q1K96k00K04k18k9K7K07j81Q3J9K04l57r8L24K47j95k89K36M5P6j24
7088Ek90L36O7j86K3LO5j26O4L26j91l01PR6J3J0j09J76n7J2j46J89K85j27k54
7113a10J76J8k52J54R4k01J01JK56l33J07r9l33L35J08qj06J2J33m3p8K87n6k24
7137f1j13j8N29m34K6n1K26J04k05j58K14mR5k69K12J03J93o16N39j2n1m74L15
7160I0P2r9m90M98J28k94N8P4m8K2j49J24M10k78J05k8o4K7p3j55K5J87k67K01
7184G6J15k3k62k1N02m59k04k9L23R6j43O3J25p7k10n8J31ql80R5L07j82L55p95
7208f63Q31k19J29l00j51L63m1j92N9L52n2k01p9L11l31J89J9j70L64l39R2K37
$$ plain form
7042 -142 21 140 201 -110 -35 37 -36 -65 134 -41 358 29 -205 66 342 113 -343 -145 19 127 -165 -57
7064 -57 -126 -191 -272 24 -176 28 -190 -219 -192 15 -166 -83 -64 140 -217 -315 9 256 61 -228 8 53 129 5
7088 5 -285 51 118 -68 -45 -42 23 -103 -39 287 96 -205 -198 -102 -89 -79 -188 -12 -69 -57 -203 -14 271 144 -110
7113 -110 66 84 -168 -14 80 -121 -20 -19 237 -96 11 -88 -421 -86 22 14 -92 -80 53 10 -68 219 163 -61
7137 -61 -174 -192 337 -97 -71 -122 104 208 3 -155 59 55 150 -119 93 196 389 -227 312 300 249 -225 90
7160 90 162 63 -427 71 199 -95 -37 37 -11 11 -138 -14 396 118 223 195 131 158 85 -70 -45 142 -125 76
7184 76 191 168 -94 -115 387 -72 -276 -305 18 114 -29 34 159 82 -128 -186 -55 -63 -443 -348 -41 -223 132 -663
7208 -663 168 -51 78 -222 -373 -10 -51 -243 -184 168 116 -85 -164 147 -184 5 24 -146 218 -121 -29 208
7230B08p6m6j97j76P02m40j77M24m04j6j40L79M8j87K83l00L32k20j7n2M6M3j05
7253h8M2l8o4K81J13l22L55m05J12K0J32j69K25p2l9lj07k14K22K84l04r6K67
7276A32N3l58J60j80M42j28k4n5J05p0k83p9J88P5N0j0P3l5l31M55L7Rm01K07
7300C2k6N7N4k47O6K21k40QK44q9j73j58M47j98j07r0L34k4N8j4k45J23K28j75
7324H6l71J97o5K70j24j67L42l28J81m6N6j63J35k75K25j9k89K19M15j27l64O5
7346a47l8J29j9k31O68k99j81M0J53k77J30j67k6N08j43L6o5J90k92K88l2j32
7368I3J77m48n0K69k61J91J2m6K63L4l76J56J1q7N1o7l1J49j97L42n24J37K17
7391A5j53L45k04j48N0L79M2m04l0K43J6k05K21j35O3j12O4j15K08N9k26j07L33
$$ plain form
7230 208 132 86 -111 -287 415 -25 -202 222 -182 -198 -338 41 89 -98 185 -115 217 -3 -20 -72 -26 17 -88
7253 -88 -46 -84 -148 133 246 -76 279 -126 -14 6 138 -31 194 122 83 80 -27 -241 -19 265 -39 -135 132
7276 132 185 -173 -13 -193 249 121 97 42 147 77 -206 -285 -97 -22 28 18 91 56 -275 180 217 226 -175 32
7300 32 6 63 117 -130 -64 157 -83 -75 169 80 -93 -251 196 -2 -109 -199 135 111 169 155 -90 33 261 86
7324 86 -285 -88 -153 117 -7 -174 168 -160 21 -25 31 -132 3 -272 -47 -66 -355 -136 279 152 -212 -147
7346 -147 -185 -56 -75 -306 362 63 -118 -78 75 -202 -72 -239 -265 243 100 136 71 261 -31 257 225 93
7368 93 270 -178 -228 41 -220 -29 -17 -63 200 234 -142 14 25 -62 -11 -78 -109 40 -157 185 -339 -202 15
7391 15 -138 207 3 -145 -95 284 326 -78 -108 135 151 -54 167 32 95 -17 47 -68 140 199 -27 -134 199
7414A99l5k62J91k0j07k59J69K06j11pq4K12j34r4J4L14P7m75M66l39J11j23K80
7437A89j75L5j84L5k2J95R9l09o6N0J50k4o1j0j01QM33k29k08o0R0L73k79l3Q3
7462b1J74J2l29J56K5p5k36K24j9J41k68L01L0j07j30m27K62J29P8j28K22Olm73
7486d56O52j66K81m31r5M11k57j11lK91j62O3o8R1j74j8K84j78K8j88J61K19k6
7509A48j11k93L91j95k87K55q0K64J52k65l6r8L30k71J97k3Pj83j46K22k4J49
7531A03K5J75j15n30M36nn5r8j2J15l25N34n03J61K67j58Q3J23m3q5r3J11n9j88
7555a36j4J03o7N8J68j41J80j38j74L76k17L4J68k92k4J20j90J34M6k42K00J10
7577F2m68O20q6l46L58J39j65k53jJ51j8L2j47O7J85m06K04J39n7Q0Ol83L47q2
$$ plain form
7414 199 164 -98 93 73 -34 -293 -124 82 -29 -36 -120 92 -42 -136 -122 192 269 -206 260 -79 32 -91 189
7437 189 14 49 -135 -100 -122 73 172 -137 -203 -153 -3 -27 -88 -98 -199 -191 242 13 -195 -255 -165 208 -71 -104 -21
7462 -21 153 165 -164 -8 17 -58 -294 -70 -89 52 -216 85 115 8 -122 -549 -287 -158 -80 -208 14 20 17 -456
7486 -456 196 30 311 -120 -215 196 -61 -172 -175 116 -46 17 -51 40 -134 -152 132 -46 -18 -206 -45 174 148
7509 148 37 -256 135 -60 -347 -92 -172 92 244 -21 -57 -155 175 -96 101 78 85 -98 -244 -22 -46 103
7531 103 128 303 188 -342 94 89 34 -64 -76 39 -286 248 -255 -94 173 15 98 221 178 93 0 111 52 -136
7555 -136 -150 -47 -114 -56 112 -29 151 13 -161 215 -2 32 200 -92 -116 4 -186 -52 -6 -248 -48 62
7577 62 -406 214 128 -218 140 279 114 -139 -140 11 -7 25 -122 -55 130 -276 -72 67 10 90 96 -287 60 -22
7601b2o7K31J37k32l34K7L89j67m04K34LK08r6L4P3j6q1J82J94K5k59nm1J98p1
7626A40k92J87j45J98l64K12K71m41J75N10k93m6m11K68J72m4J04j78j9M2J0k85
7648b29J62L98q8k16K94j24J15l15K81j96J25k01L07j20q5m22L03J25J17k94K30
7669A67o3Q7k02k2K34r2j4k32L08J57q3m74L93j02J50l02Q2K49j83N0k44K62j10
7692A6p8K92k28j68K15K06n44K01K87j49M1k96L54j63No2j09L61j67q5j2J7j43
7715b09J90q0k8N5L82l90Q0K33o2l53L90k41P5J23l09KN18j11n68L32Q1n7j90
7738a37J5j2J19j01J1J82J27j85n7k8J96J7k49J54k6K01j70j43M05l85M0q5K14
7761A03j74J87O3l1L77o08j11N87j74k49J8J25J20m63K10L32K78p59K23J27J28
$$ plain form
7601 -22 -89 142 279 47 -287 -260 129 -38 -442 -208 -205 3 -93 -59 14 -2 -83 99 293 318 59 54 13 211 140
7626 140 -152 35 -110 88 -276 -64 207 -234 -59 451 158 112 -299 -31 141 97 201 23 4 46 56 -229
7648 -229 -67 331 243 27 321 197 312 -3 278 82 207 6 313 193 108 -314 -11 114 231 -63 167
7669 167 104 191 -11 -33 201 109 95 -137 171 328 245 -229 164 62 212 -90 -8 241 58 108 -136 126 16
7692 16 -62 230 2 -166 49 255 -289 -88 199 50 91 -205 149 -14 -9 -71 -180 181 14 -71 -83 -66 -209
7715 -209 -19 -99 -127 -72 310 -80 0 233 171 -182 208 -33 42 165 -144 -142 376 265 -303 29 110 53 -137
7738 -137 -122 -134 -15 -116 -105 77 204 19 -38 -66 130 147 -102 52 26 227 57 -86 319 -66 -26 -111 103
7761 103 -71 116 179 148 525 -83 -194 393 219 -30 -12 113 233 -230 -20 312 590 -169 54 181 309
7782C09k41J2j0n7J11k18M10P5l75m4p9J25k2r0J6L38m00J62j17k38N10J04k80
7805AQ2n0k3L12j63j19k3O6j45K22j37j01K11j29J00r0k15K6M24P8l80J59l15
7828b09L32J04Lk48K81k84J13l14M55j79j10j84M12k12L8K40j87N1O1p2l98Q6
7850b21L63jk58j48J13K52k98L38l15K01m1l55K06J46q6J33J7j60J02p2L6l3J08
7873B7r8l4L56l97O6jK59M7k65J71k77K29J14o1j48K0L52n85L31k93Q1K26J94
7896C14m29N7o6L03j72O5k91N30l34j95L94K0j61o4K25k26N0r0k7L83l56N3k16
7919b33M96m33J33M3m2n7n7J82n7J35J85m67L27r7j74J0k2q7J64J4J23j75K90
7942B01k17J2pn9J1J01P0qk56K26J79m31M6M00l05M2N3k84J55K71l86J60K49j26
$$ plain form
7782 309 68 80 70 13 124 -94 316 391 16 -28 -107 18 -4 -94 -78 260 -140 22 -95 -333 177 281 1
7805 1 83 33 10 322 159 40 17 83 -62 160 23 -78 133 4 104 14 -201 -175 249 327 -53 106 -209
7828 -209 123 227 230 -18 263 -21 92 -222 233 54 -56 -240 172 -40 -2 238 51 102 163 91 -307 -221
7850 -221 142 141 -117 -265 -152 100 -198 140 -175 26 -15 -370 -164 -18 -104 29 46 -114 -12 -84 -48 -81 27
7873 27 -71 -105 251 -146 -80 -81 178 225 -40 131 -146 83 197 136 -12 8 360 -225 106 -187 -106 120 314
7896 314 -115 -58 -124 179 7 72 -219 311 -23 -218 176 196 35 -29 196 -30 20 -70 -97 286 -70 -17 -233
7919 -233 263 -170 -37 6 -36 -93 -150 32 -25 110 295 -172 155 58 -116 -106 -128 -215 -51 -37 86 -89 201
7942 201 -16 -4 -11 -70 -59 42 112 104 -152 74 253 -178 -132 268 -37 5 58 -226 -71 200 -186 -26 223 97
7966I7J4l41K1n5O3J56P0j26o4J69j19J33j52j43R4N7j36L75k27m4j12J79R8j77
7990a70L72j38k69J41q0J45m7J12k10L8J31j79J54l12m4K18O4n1o6K86p4j01j5
8013i5J96q0K33n78N17o15J56j3J39P7O9J19O2q7l6j82j6M26n42K08R7l1J52l53
8037a77J89j5L48Rm23K98k47J75n55L63L03j63l31J75K70l52K91j78J89l2l96
8058b59L26L0k03j09m0M25R7l27l6J4J27J40j42k4L40l06J00j83k4J25q8q7K19
8081A15j03K5J30l16J94j85J67q8P7j91O0j34M74k18J59k06K42j93R4r9J84n21
8103c33J60K22j07k83K92M2K58l67j62K61j49P7K85M3k63J63j97q0K88J5k64O6
8125c3K61k38r7m6M37k31J40m77J00k6J57J3J75l56K95j88j46Q4O8O1j16K22k3
$$ plain form
7966 97 111 -230 -209 -264 -201 -45 25 -101 -165 4 -115 18 -134 -277 -183 -126 -262 113 -114 -158 -270 -91 7 -170
7990 -170 202 64 -205 -64 -144 1 -46 66 -144 -106 25 -154 0 -312 -356 -138 -74 -125 -191 95 21 -80 -95
8013 -95 101 21 254 -324 193 -422 -266 -279 -140 -63 6 125 187 100 64 -118 -134 292 -250 -42 55 24 176 -177
8037 -177 12 -3 345 354 -69 229 -18 157 -398 -35 268 105 -226 -51 219 -133 158 -20 169 137 -259
8058 -259 67 97 -106 -215 -255 170 267 -60 -96 -82 45 185 43 19 359 53 153 -30 -54 71 -17 -104 115
8081 115 12 37 167 -149 45 -140 27 -61 16 -175 -115 -249 225 7 166 -40 202 9 103 4 188 -333
8103 -333 -173 49 -58 -341 -49 -7 251 -116 -278 -17 -166 -89 196 239 -24 139 -58 -138 150 165 -99 -33
8125 -33 228 -10 -107 -153 284 53 193 -284 -184 -210 -53 -40 135 -221 74 -114 -260 -176 -108 -47 -163 59 36
8148C6j23K03n2Rj20j56K66k5L4l28M89j13R2m59K81l5L30k20l39K68j35K20l14
8171a91M16j98j25K69j40j01J83j0j10K69m02J18J91o0J77m56K37K1J9l58
$$ plain form
8148 36 -87 116 64 73 -47 -203 63 38 72 -256 233 120 212 -247 34 -1 329 109 -230 38 -97 123 -191
8171 -191 225 27 -98 171 31 -70 113 103 -7 262 -140 -22 169 109 286 -170 67 88 107 -251
8191b51
$$ Imaginary data points
##PAGE= N=2
##DATA TABLE= (X++(I..I)), XYDATA
0@%%%%%%%Qj6J6j6K4l2L2m0M8n6O4p2Q8j04J20j41J65j89K15k45K80l15L55m03
31b14M52n04N63o29P02p81Q66r60J064j178J305j445J598j770J967k186K434k720
49a436L054l451L928m516N260o234P574r541J2711j8646L3414j35442k24612L45978
63H041K17681k21615j93591K17768J64584k09031j91990J87193J95887j34567
73D0360j80312J13437J51402j08835j59440R2410J61601n7263j50714L7787J36621
84G7054k6651j45617J278J53095N5787j15795p8935O7329N6477o8743m5132R8896
96B9043Q1389j06805j37105O4533J57685j4825j34223L453J20901q544j33063
107g7561p978J34912L4877j09193l6595R0496K7999q6337l0934P5087L1704n5188
$$ plain form
0 0 0 0 0 0 0 0 0 8 -8 8 -8 16 -16 16 -24 24 -32 32 -40 48 -56 64 -77 88 -101 114 -131 149 -166 189 -214
31 -214 238 -266 297 -332 370 -411 455 -505 559 -619 686 -759 839 -931 1036 -1150 1284 -1436
49 -1436 1618 -1833 2095 -2421 2839 -3395 4179 -5362 7349 -11297 22117 -113325 -337937 8041
63 8041 225722 4107 -189484 28284 192868 -16163 -208153 -20960 174927 40360
73 40360 -139952 -26515 124887 16052 -143388 -50978 110623 53360 -97354 -59567 77054
84 77054 50403 -95214 -93936 59159 114946 -849 -79784 -12455 44022 -24721 -69853 29043
96 29043 110432 3627 -133478 -68945 88740 73915 -60308 -56855 64046 55502 -77561
107 -77561 -85539 49373 84250 -24943 -61538 28958 56957 -29380 -60314 14773 46477 -8711
119h711j2420N5617m449p8036j5401Q0561M7242m5614m7884J0207J7355j1607
131a3140K731L8685K1387l5987m8518N556M8061J5902l7274k0935L4961K2672
143C4101m5131l6159M8040N3600m3566o3735M2027P7975l3797r0262J7113Q8488
155D8694k049p2576Q867O4208k9995q3947K9793J07960o365j06681j4622Q7843
167C1130J1322q0977j897R2406Q743j04180l0181J00371M8573q5871n6184P4581
179G836O0652o6869o7014N9027P0472n6476q1753N0733R8757l3503j11062O279
191f2921J05240J3275q8473j3067Q5150Q891r6053k0859J03441M1621r5159n6612
203g5526P7504N5964o8414m9872O9703N1417p0935o0181O7055P0034n7295p6855
$$ plain form
119 -8711 -21131 34486 30037 -47999 -63400 17161 64403 18789 -29095 -18888 -1533 -13140
131 -13140 -10409 28276 49663 13676 -34842 -29286 18775 34677 -2597 -23532 11429 34101
143 34101 -11030 -47189 851 54451 10885 -52850 -10823 67152 33355 -56907 -39794 48694
155 48694 46645 -25931 -17064 47144 17149 -66798 -37005 70955 64590 -42091 -56713 31130
167 31130 42452 -38525 -40422 51984 60727 -43453 -73634 26737 75310 -10561 -66745 7836
179 7836 68488 1619 -65395 -6368 64104 7628 -74125 -23392 75365 41862 -69200 -62921
191 -62921 42319 55594 -32879 -45946 39204 48095 -47958 -68817 34624 76245 -18914 -75526
203 -75526 1978 57942 -10472 -60344 9359 60776 -10159 -70340 -3285 66749 9454 -67401
215f7401M1977P5348k8353o8150K2219O1678k1129o3416J8707P1888k276p1579
227c0487j6547N7706K5854m2793k4413L7098K0853m0381k8532M1174M1963l2017
239I478m9559K0681N1017r746m6377O963M2766q248m4835R397N1004m668n6381
252b8508n512N4541J4059m5792j3506M1160Q531m5189q507N0809J8800n0654l0056
265c9824M1398L4870k9868l1301K5867K9929k4948l2366K3226L8804j7379m5806
277b7398M724M6235N162m2550j2483L7152J4400l5773j3904M1554K2108m4989
289e762l2514M1475M0898l3885m3813K8775M0686l2109m3876L4708N1743l2976
301A3350n9929K4505O4488j6191o2027J0611N8895q024n8689O547N9906k275o2228
$$ plain form
215 -67401 -25424 49924 21571 -46579 -24360 37318 16189 -47227 -28520 43368 41092 -30487
227 -30487 -47034 10672 36526 -6267 -30680 6418 27271 -13110 -41642 -468 41495 9478
239 9478 -40081 -19400 31617 21871 -24506 -17543 25223 16975 -27860 -18463 32541 27873 -28508
252 -28508 -34020 20521 34580 -11212 -24718 16442 24973 -20216 -28723 22086 40886 -9768 -39824
265 -39824 1574 36444 6576 -24725 1142 31071 6123 -26243 -3017 35787 18408 -27398
277 -27398 -22674 23561 28723 -13827 -26310 10842 25242 -10531 -24435 17119 39227 -5762
289 -5762 -38276 3199 44097 10212 -33601 -4826 35860 3751 -40125 -5417 46326 13350
301 13350 -46579 -22074 42414 26223 -35804 -25193 33702 25678 -33011 -26464 33442 31167 -31061
314c1061n958O0181J4991n3299k0861M4730K0656m0531k1543L9716K4916l8426
326f489l2346L1381L7735k1846l6572J5526L4653j3196l3968J2888L7460j1125
338A4101m2694M339M4134K834m4247q000M1321J0404m0132j0653M2181J4361m3444
351a5495k0385M2578K7623l7607l0803L0918K9828k7429k8373K7125L0848k6336
363B492l3637K2141L6278j5491l4967R794L1913p839l0414O747L1461m248l2659
376a8429j3L3786P230l1000j1433K7833J4164k5331j6137K4586J8465k5138k3733
389b5150K3146K9332j8581l1933J3060L3213q223l2637O981L3801m277l6292n64
402a8124L7642O034l5938j1842L2914J4320k9082j5276K7918J6332k7722j9332
$$ plain form
314 -31061 -37019 23162 38153 -15146 -36007 8723 29379 -11152 -32695 7021 31937 -6489
326 -6489 -38835 -7454 30281 8435 -28137 -12611 22042 8846 -25122 -12234 25226 14101
338 14101 -28593 -24254 19880 22714 -21533 -29533 11788 22192 -17940 -28593 13588 27949 -15495
351 -15495 -35880 6698 34321 -3286 -34089 -3171 26657 -772 -29145 -2020 28828 2492
363 2492 -31145 -9004 27274 11783 -23184 -13390 18523 10684 -19730 -12983 18478 14230 -18429
376 -18429 -18442 15344 22574 -8426 -19859 7974 22138 -3193 -19330 5256 23721 -1417 -25150
389 -25150 -2004 27328 8747 -23186 -10126 23087 14864 -17773 -10792 23009 18732 -17560 -18124
402 -18124 19518 25552 -10386 -22228 10686 25006 -4076 -19352 8566 24898 -2824 -22156
414b2156K6655K1882k4027k5624K0199K6643j7762k6263J6351K8128j5247l0376
426b1597J3091L4058q968l5704K868L4809k65l4532l465L4256M578l4545q789
439b4205L4924J4066l2737j7446K9622K0838k6807k1682K3923K2213k3038k4838
451b5167K1020K6554j8551k9405J5109L0339j2170l0634J0065L1551q269l3364
463b2922N806L5764j521l7734k741L7309P694l6769j1169L6220J4792l6300j9234
476c0805L5306K4086l3208k9101K8875L2246k4254l3342K0585L4687j5811l5625
488b6361J3101L6483p969l6595L519L5332L45l3800l815L2244O556l1476r821
501b2257L1050J4562k9297j9078K6860K4227k2689k6908J8437K9499j4991l1969
$$ plain form
414 -22156 4499 26381 2354 -23270 -3071 23572 5810 -20453 -4102 24026 8779 -21597
426 -21597 -8506 25552 16584 -19120 -16252 18557 18292 -16240 -19705 14551 19129 -15416 -24205
439 -24205 10719 24785 -7952 -25398 4224 25062 -1745 -23427 496 22709 -329 -25167
451 -25167 -4147 22407 3856 -25549 -10440 19899 7729 -22905 -12840 18711 10442 -22922
463 -22922 -17116 18648 17127 -20607 -23348 13961 21655 -15114 -26283 9937 24729 -11571 -30805
476 -30805 4501 28587 -4621 -33722 -4847 27399 3145 -30197 -9612 25075 9264 -26361
488 -26361 -13260 23223 15254 -21341 -17822 17510 17855 -15945 -19760 12484 19040 -12436 -22257
501 -22257 8793 23355 -5942 -25020 1840 26067 3378 -23530 -5093 24406 9415 -22554
513b2554J1664L4495o459l6880J308L7388M721l6540r068L5425J2933l4412j6340
526b4319L2335J9113k8713k3066K6314K5261k1845k5693J8093K5558j3834k5012
538a5808J1200K4391r515k4442N023K3135j194k1730k070J9972M236j8606o178
551a1586J8314R385j7437j3065J5302J5925j3438j9309J0701K1589q032k3682
563a5333N735K4869k928k6462O99K7101J517k7486m475K5639N736k5000n996K5324
577H940N998k5563p482K5387R751k3299j0366K1188R529k0152j0813J8996J1086
590A3200j8282j1472J6248J2133j5243j3601J3960J6023j0564j7288Q215J8214
602A1543n474k0118J088K2366M030k2413r276K0298J1724j8368j3187J9442J6266
$$ plain form
513 -22554 -10890 23605 17146 -19734 -18426 18962 23683 -12857 -21925 13500 26433 -7979 -24319
526 -24319 8016 27129 -1584 -24650 1664 26925 5080 -20613 -2520 23038 9204 -15808
538 -15808 -4608 19783 10268 -14174 -9151 13984 12790 -8940 -11010 8962 13198 -5408 -11586
551 -11586 6728 16113 -1324 -14389 913 16838 3400 -15909 -5208 16381 8349 -15333
563 -15333 -9598 15271 12343 -14119 -13420 13681 15198 -12288 -16763 8876 14612 -10388 -16384 8940
577 8940 14938 -10625 -18107 7280 17031 -6268 -16634 4554 14083 -6069 -16882 2114 13200
590 13200 -5082 -16554 -306 11827 -3416 -17017 -3057 12966 2402 -14886 -6671 11543
602 11543 6069 -14049 -12961 9405 13435 -8978 -18254 2044 13768 -4600 -17787 1655 17921
615A7921k0031j9903J8460K3369j6900k4038J5533K6015j4129k7657J2171K8313
627A9124j0039k6737R387K6994r668k8062Q038K8059n859k6411M924K5927m457
640A1220k7174R96K9388M955k5207q873J9206J0762j6109j1096J4310J3294j1237
653D435j4848N488J4468k425j3930J847J5967J41j7285l934J6753O271j5640n697
667h389J6124O617j8094r389J6973J0409j4057p522J4996M029j9207o971K1915
680G434J0600k0051j1738J7080J1211j7521j2290J6887J4669j2189j4222P655
692b475J0763p203q576O181Q354l358p600N52L689j261k987K815N347L96p106
707b469n654M238P154j109n631L063N383o913j0450O857J5131m583j5819M046
$$ plain form
615 17921 -2110 -22013 -3553 19816 2916 -21122 -5589 20426 6297 -21360 -9189 19124
627 19124 9085 -17652 -8265 18729 9061 -19001 -10963 17096 11237 -15174 -10250 15677 11220
640 11220 -15954 -14958 14430 19385 -5822 -14695 4511 15273 -836 -11932 2378 15672 4435
653 4435 -10413 -4925 9543 7118 -6812 -4965 11002 11143 -6142 -10076 6677 12948 -2692 -8389
667 -8389 7735 14352 -3742 -13131 3842 14251 194 -7328 7668 11697 -7510 -14481 7434
680 7434 18034 -2017 -13755 3325 14536 -2985 -15275 1612 16281 4092 -10130 -2475
692 -2475 8288 1085 -7491 -1310 7044 3686 -3914 -3362 327 -934 -3921 -1106 4241 4637 -2469
707 -2469 -8123 -3885 3269 2160 -3471 -408 4975 -1938 -12388 -5531 9600 5017 -10802 -6756
721f756J6654n393k0775M291K4017j14k3665k424K1511J950k2221k757K2976O317
735A3611j8710p203J4712L335j3563j453J6321L974j5466q025J0482O738p068
748b315l852Q971M629r149q187O187R794k691q100K135R993k499j3121j605J4982
763E172N769j3797o116J3924O766j6513j0341J7294J4679j3349j3980J0377J0104
776I989j2944q895J6805J1978j5937j2888J3791J0327j4849q138J8125J0098j8802
789a340j2317J6304J1272j5765j0045J6187J2217j5060j3890J1556J2807r682
801B244r907R457J1847q527j4681K856J3341J633r431j967P465Q43j0003l416
815h246J1314Q378r059j0546O393J0216o910j1939Q210J4395p112j6577N931J6764
$$ plain form
721 -6756 9898 4505 -16270 -11979 12038 11924 -11741 -14165 7346 9296 -12925 -15682 7294 13611
735 13611 -5099 -12302 2410 5745 -7818 -9271 7050 11024 -4442 -12467 -1985 4753 -2315
748 -2315 -6167 2804 7433 -1716 -9903 -3716 6078 3387 -4713 -2578 7415 4916 -8205 -9810 5172
763 5172 10941 -2856 -8972 4952 11718 -4795 -15136 2158 16837 3488 -10492 -115 9989
776 9989 -2955 -11850 4955 16933 996 -11892 1899 12226 -2623 -10761 7364 17462 -1340
789 -1340 -13657 2647 13919 -1846 -11891 4296 16513 1453 -12437 -881 11926 2244
801 2244 -7663 1794 13641 5114 -9567 -6711 6630 8263 -1168 -3135 4330 5173 -4830 -8246
815 -8246 3068 11446 2387 -8159 -1766 8450 1540 -10399 -2189 12206 5094 -11483 -5552 11212
829A1212p161j7996P557K0255m539k2232J452K0527k020j9228K472K1427q46k2076
843a1196l578J8859N701j3690n061J1702L513j1380n088R331P208o094o571K828
857c516N928j200o472n95O907L899o145n873N731O399o627q540P854J2070o525
872C295j4234M232J4077l922j3397N004J5866n636j7831L081J8819l70j7665q33
886i514J7685R51j6732k524J6364M035j4272o024J3710P577j1783r115Q706J0453
900I517n487j0639L466J1208k547j2581L25J4906L078j4081p168J3948Q193j3213
914a075r450J4727J0652j5714j2867J5803J5640j5611j7840J4912J9804j3543
926E438k1143J1537K2378j1340k2976R995K4231p228k5185M139K3587j173k1852
$$ plain form
829 11212 4051 -13945 -6388 13867 9328 -12904 -11452 9075 7055 -12173 -9701 11726 10880 -11196
843 -11196 -14774 4085 9786 -3904 -8965 2737 6250 -5130 -10218 -887 6321 227 -6344 -3516
857 -3516 2412 1212 -5260 -5855 1052 4951 -1194 -7067 -1336 5063 -1564 -10104 -2250 9820 3295
872 3295 -10939 -6707 7370 3448 -9949 -4945 10921 5285 -12546 -9465 9354 8984 -8681 -9514
886 -9514 8171 9122 -7610 -10134 6230 10265 -4007 -10031 3679 11256 -527 -9642 -936 9517
900 9517 4030 -6609 -3143 8065 5518 -7063 -6738 8168 11246 -2835 -10003 3945 12138 -1075
914 -1075 -10525 4202 14854 -860 -13727 2076 17716 2105 -15735 -823 18981 5438
926 5438 -15705 -4168 18210 6870 -16106 -6111 18120 10892 -14293 -10154 13433 12260 -9592
939i592j5K1003Q96k0932l574J9403O945j7621r288J4613J0973j2742j2030J0174
953a787J3332q197j4279O499J5508n130j7387K848J8191Rj8837j895J8331K696
967I902j9261m054K0568O627k1058r316J9231J1143j7724j1400J6520J1547j5099
980b374j2850J3989J3490j2251j3602J0278J3158p926j3145O273J1808m430j0753
993h335L735J0346k775j0700Q90J0368J815r334k778Q006L604q042m259Q743O747
1008H031q406r349P364J0792n701j1937M975J3036m454j3292L581J4121k153j5008
1022h400J569J5508q4j5517p57J4439K309j4240k373J4060K651j3690m014J3361
1036D822N450j1939n887J0244O171r732o082R286P582q420q986O348J0987m848
$$ plain form
939 -9592 -9607 11396 12292 -8640 -12214 7189 14134 -3487 -12775 1838 12811 69 -11961 -1787
953 -1787 11545 3348 -10931 -4432 11076 5946 -11441 -8593 9598 9607 -9230 -11125 7206 9902
967 9902 -9359 -13413 7155 13782 -7276 -16592 2639 13782 -3942 -15342 1178 12725 -2374
980 -2374 -15224 -1235 12255 4 -13598 -3320 9838 1912 -11233 -4960 6848 2418 -8335
993 -8335 -4600 5746 2971 -7729 -6839 3529 5344 -3990 -6768 1238 4842 -3200 -7459 1284 8031
1008 8031 -375 -9724 -2360 8432 2731 -9206 -4231 8805 4351 -8941 -5360 8761 6608 -8400
1022 -8400 -6831 8677 8593 -6924 -7681 6758 9067 -5173 -7546 6514 9165 -4525 -8539 4822
1036 4822 10272 -1667 -7554 2690 8861 -871 -6953 2333 9915 1495 -7491 -1143 9844 4996
1050D996j1708L182J1640n90j2780j047J3020L238j3123o347J3417Q430j2266
1063F2j0589J0558J1724r821j1244Q342J2198p925j3747O999J4513n235j5060
1076i225M047J4283l156j4078K456J3816j118j4582k53J3629K238j3168l879J2430
1090C440M627j1086n981J0161O833r419q321Q297R868p027j0762M159J1539k509
1104C819j1397J013J1012L21j0929j790J1139L063j0171m686R496N058q705m934
1118g691Q201M860q159n133Q042N809p791o340P053P012o585o662N694P538n725
1133A23p500M884Q419l657q762K515Q701o93q796J17Q081J337p917k044P276L291
1149E375o430l990N526M553m405m746M198M530l597m945L698N514l284n634K392
$$ plain form
1050 4996 -6712 -3530 8110 7520 -5260 -6307 6713 9951 -3172 -9519 3898 12328 62
1063 62 -10527 31 11755 1934 -9310 -968 11230 3305 -10442 -3443 11070 5835 -9225
1076 -9225 -5178 9105 5949 -8129 -5673 8143 7025 -7557 -7810 5819 8057 -5111 -8990 3440
1090 3440 8067 -3019 -9000 1161 7994 -1425 -9746 -1449 8419 1392 -9370 -5211 6328 3819
1104 3819 -7578 -6565 4447 4768 -6161 -7951 3188 6251 -3920 -8606 890 5948 -2757 -7691
1118 -7691 510 5370 -2789 -7922 120 5929 -1862 -8202 -1149 5863 -722 -7384 -1690 5848 123
1133 123 -7377 -2493 5926 2269 -6493 -3978 4723 4030 -4766 -4649 3432 4769 -3148 -5192 2084 5375
1149 5375 -1055 -5045 481 5034 629 -4117 81 4611 1014 -3931 -233 5281 1997 -3637 -1245
1164a245O309j676o641J094O831k92p000j59P343R58p768j655P397L244p026m027
1180d313O497M859n849o405N442O938m279p906L270Q064j917p729K42P960l35
1195D539p162p27P185J023p017j069O359J376o423j722O272J660o043k099N687
1210A839K796o330l467O089L832n228m839M326N286l953n279L117N502k542o011
1225d862K358N610j295o175P57N608J09n859j26N528L11n412p81N276J344n687
1241c296j558N601J526n646j572O695J568p029k361P448L168p109m103O975M348
1256D655o980m732O848N485o041n531N267N566m250n914L780O373k711o001J752
1271b434N411j036n395O57N175J168n079j770M010K148k743k949L340L957l706
$$ plain form
1164 -1245 5064 3388 -3253 -2159 4672 4380 -2620 -2779 4564 5522 -2246 -3901 3496 6740 -286 -4313
1180 -4313 2184 7043 1194 -5211 231 7169 2890 -5016 -1746 6318 4401 -3328 -3086 4874 4539
1195 4539 -2623 -3350 3835 4858 -2159 -3228 3131 4507 -1916 -3638 2634 4294 -1749 -3848 1839
1210 1839 4635 -1695 -5162 927 4759 -469 -5308 -982 4304 351 -4928 -1811 3691 1149 -4862
1225 -4862 -2504 3106 1811 -4364 -3607 2001 2110 -3749 -3875 1653 1964 -3448 -4229 1047 2391 -3296
1241 -3296 -4854 747 2273 -3373 -4945 1750 3318 -3711 -6072 1376 4544 -2565 -6668 307 4655
1256 4655 -2325 -7057 -209 5276 -765 -6296 -1029 4537 287 -5627 -1847 4526 1815 -4186 -2434
1271 -2434 2977 1941 -3454 -2797 2378 3546 -1533 -3303 707 2855 112 -2837 503 4460 754
1286G54m888L333N760k290o390J753P268q46q110m42Q762J719q367k442P786L205
1302F565q074l897Q356M621o937n443N641N958n569o282N119P188l158q219J297
1317b834P631m9p270q03P192J870p309l428O218M651n663n166O122N887o901p389
1333g241O510R080o016j0240N514J1464n698j2978M611J4087l005j4067J397J4059
1347G477j788j4625J607J5066J69j5436j366J4148J692j3545k213J3553L524j2881
1361d618n126J1454N190r998n015R852N189r193o848Q079P074o656p434O644Q254
1376F848o244r935M433J0675j804j0263N81J0440l99j1015o15J1692K509j1110
1390d207l548J0589L435j0904l648J1437N201j0713n923R640N378r028m733R177
$$ plain form
1286 754 -4134 -801 4959 2669 -3721 -1968 5300 4454 -3656 -4098 4664 6383 -1984 -4426 3360 6565
1302 6565 -1509 -5406 2950 7571 634 -4809 832 6790 1221 -5061 58 7246 4088 -4131 -2834
1317 -2834 4797 4748 -2522 -3325 3867 5737 -1572 -5000 1218 5869 206 -4960 1162 7049 148 -7241
1333 -7241 -731 8349 2333 -7907 -2393 9071 3373 -9605 -4994 9093 6088 -7979 -6582 7477
1347 7477 5689 -8936 -7329 7737 7906 -7530 -8896 5252 6944 -6601 -8814 4739 8263 -4618
1361 -4618 -9744 1710 6900 -3098 -8113 1739 6928 -2265 -9113 -1034 6040 -616 -8050 -1406 6848
1376 6848 604 -9331 -4898 5777 3973 -6290 -5709 4731 4332 -6683 -7298 4394 6903 -4207
1390 -4207 -7755 2834 6269 -4635 -8283 3154 8355 -2358 -8281 1359 6737 -2291 -7024 2153
1404B153N305q464n068P021L792o433k839P679L008p322m337O075L997m503k640
1419b576M546K359l923l086K522K070k78l19q6m49n67M40J3n63J690J141j728
1436A206k098J068J850j823j105L020K463l751k790J891K835k119j456K857J308
1451C356l447j937K182K259k024l52K138j24k973r98K290J628j402j123J089N03
1467A065n80j734m29J700K787j415l226m17L440n97l582Q81N625k54o743r39N900
1484A482R16o148N50O672k62q107p39P818J081p314l63P737m68q116o5P703J67
1501B544o529M29P126r77q264P4P423J648n867j110M955K43m665j225M610K113
1517B528k315j983Q48K56n80L01O22Q60K76j064j659P48J569M16j581O03J862
$$ plain form
1404 2153 7458 -1006 -6074 947 4739 -1694 -4533 3146 6154 -1168 -5505 570 4567 64 -2576
1419 -2576 1970 4329 406 -2680 -158 1912 1634 1315 1229 780 213 653 666 103 1793 2934 1206
1436 1206 -892 176 2026 203 -902 2118 4581 830 -1960 -69 2766 647 -809 2048 3356
1451 3356 -91 -2028 154 2413 389 37 2175 2051 -922 -1920 370 1998 596 -527 562 1065
1467 1065 485 -1249 -1678 22 2809 1394 -1832 -2249 1191 594 -2988 -2107 3518 3264 -3479 -4418 1482
1484 1482 2398 -3750 -3200 3472 3210 -4897 -5636 2182 3263 -4051 -4414 3323 2855 -5261 -5326 2377 2544
1501 2544 -3985 -3556 3570 2593 -5671 -5597 1826 3474 -2393 -3503 1452 1695 -2970 -4195 415 2528
1517 2528 213 -1770 -922 -666 -1246 -945 -323 537 813 -251 -1910 -1162 407 823 -758 -155 1707
1534A707r47k817O37K184L15j222J079J018k066k171K427K113j781j245K666O92
1550B589l833j163L737K052k677r10J848j08k846J204K768r97k578K016J862k443
1566E21k616K602L112k290k308K513J612l592j888L402K324k155j574J953K75
1581A891l363K16L090O39k351J58R72j817j189K858J964l006k341K804K355l666
1597g86k978M257K980l729k867L357K183l643k064L333K723k795k328J451J795
1612H89j964j423K526J669j773k257JK535N4j739k23J508J041k485j877K999K914
1629B395l373l743L528M612l130o295L486O538k754o716K999O707k786p867K702
1644c697Q181j775p368J143P373k222o678K348P486k627p161K293O484j504o847
$$ plain form
1534 1707 760 -2057 -1420 764 1079 -143 936 1954 -112 -2283 144 2257 476 -769 1897 2589
1550 2589 -1244 -2407 1330 3382 705 -205 1643 1535 -1311 -107 2661 1664 -914 1102 2964 521
1566 521 -2095 507 3619 1329 -979 1534 3146 -446 -2334 1068 3392 1237 -337 1616 1891
1581 1891 -1472 -1256 1834 2473 122 280 1252 -565 -1754 1104 3068 62 -2279 525 2880 -786
1597 -786 -3764 493 3473 -256 -3123 234 2417 -1226 -3290 43 2766 -29 -2357 -906 889
1612 889 -1075 -2498 28 1697 -76 -2333 -2332 203 257 -1482 -1705 -197 844 -1641 -3518 -519 2395
1629 2395 -978 -4721 -1193 3419 289 -6006 -2520 4018 1264 -5452 -2453 4254 1468 -6399 -3697
1644 -3697 4484 2709 -4659 -3516 3857 1635 -5043 -2695 4791 2164 -4997 -2704 3780 2276 -4571
1659d571K394O097k138n621J868N612j548n258R79N797o44m699n74M287K28l065
1675h56j121L677J803l203k656K204L319j252l250Q74L206m49l971M37M490o07
1691B645m307m8N295p2n368k38N822K51o496Q1O735N53p711j645P988K482p558
1708a591k477O571K673o481l018O321L527n415m644M511M496l077m801K263M772
1723C630j833m568N88M521R9m398r96M173K385m055l657L556L997l247m450K980
1739a275N354l568o020L213O938k087p877J118Q281j059q182L39R020n33r048
1754e386n29Q874K081q745l165Q140L711p035l949O037M371n137m886M464M731
1769C577k964n535K371N356j845m192N00M949m87m755k63N495R75n501k380N374
$$ plain form
1659 -4571 -2177 3920 1782 -3839 -1971 3641 2093 -3165 -2186 3611 2967 -1732 -2306 1981 2209 -856
1675 -856 -1977 1700 3503 300 -2356 -152 3167 1915 -1335 -461 2745 2296 -1675 -1238 3252 2645
1691 2645 -1662 -1710 3585 3513 -1855 -2093 3729 3980 -2516 -2435 4300 4853 -2858 -4503 3485 5967 -1591
1708 -1591 -4068 2503 5176 -1305 -4323 1998 5525 110 -4534 -23 4473 1396 -3405 -1142 3630
1723 3630 1797 -2771 -2183 2338 2437 -1961 -2957 1216 3601 -454 -4111 -555 3442 195 -4255 -1275
1739 -1275 4079 511 -5509 -2296 4642 2555 -5322 -4204 4077 3018 -5164 -4825 4195 3662 -5386
1754 -5386 -5915 2959 5040 -3705 -6870 1270 4981 -2054 -6003 34 4405 -732 -5618 -1154 3577
1769 3577 613 -4922 -2551 2805 960 -3232 -2732 2217 1730 -3025 -3288 2207 3182 -2319 -4699 675
1785F75L243m670l522M950L798n178m461N142N505m379o445L960O201k915o179
$$ plain form
1785 675 3918 -752 -4274 676 4474 -704 -5165 -23 5482 1103 -5342 -1382 4819 1904 -4275
$$ [...]
8191a25
##END NTUPLES=NMR FID
##END=
