##TITLE=1H_LR-661-B1
 D2O, 8 sc, 
 15.3.2019
##JCAMPDX= 6.0         $$ Bruker NMR JCAMP-DX V2.0
##DATA TYPE= NMR FID
##DATA CLASS= NTUPLES
##ORIGIN= UXNMR, Bruker Analytische Messtechnik GmbH
##OWNER= root
$$ XWIN-NMR		Version 3.5
$$ Fri Mar 15 16:04:35 2019 Russian Standard Time (UT+4h)  she@DPX200
##.OBSERVE FREQUENCY= 200.131
##.OBSERVE NUCLEUS= ^1H
##.DELAY= (6, 6)
##.ACQUISITION MODE= SIMULTANEOUS
##.ACQUISITION SCHEME= undefined
##.AVERAGES= 8
##.DIGITISER RES= 18
##SPECTROMETER/DATA SYSTEM= spect
##.PULSE SEQUENCE= zg30
##.SOLVENT NAME= CDCl3
##.SHIFT REFERENCE= (INTERNAL, CDCl3, 0, 15.7039)
##AUDIT TRAIL= $$ (NUMBER, WHEN, WHO, WHERE, WHAT)
$$ ##TITLE= Audit trail, XWIN-NMR		Version 3.5
$$ ##JCAMPDX= 5.01
$$ ##ORIGIN= Bruker BioSpin GmbH
$$ ##OWNER= she
$$ F:/spectra/data/she/nmr/H-F/1/audita.txt
$$ ##AUDIT TRAIL=  $$ (NUMBER, WHEN, WHO, WHERE, WHAT)
(   1,<2019-03-15 16:03:40.29 +0400>,<she>,<DPX200>,
      <created by zg, POWCHK disabled, PULCHK disabled
       configuration hash MD5:
       00 E9 B6 7A A2 85 ED C7 34 08 36 98 17 FE 4E 26
       data hash MD5: 16K
       3D 95 06 26 96 3A C1 F8 40 53 52 19 F4 68 DD 79>)
$$ ##END=
$$ 
$$ hash MD5
$$ 78 4B 9A 17 30 58 5F 03 8F 7A 73 32 96 DD 39 7F
##$RELAX= 
##$RELAX= 
##$RELAX= 
##$RELAX= 
##$RELAX= 
##$RELAX= 
$$ Bruker specific parameters
$$ --------------------------
##$DU= <F:/spectra>
##$EXPNO= 1
##$NAME= <H-F>
##$PROCNO= 1
##$TYPE= <nmr>
##$USER= <she>
##$AMP= (0..31)
100 100 100 100 100 100 100 100 100 100 100 100 100 100 100 100 100 100 
100 100 100 100 100 100 100 100 100 100 100 100 100 100 
##$AQSEQ= 0
##$AQ_mod= 1
##$AUNM= <au_zg>
##$AUTOPOS= <>
##$BF1= 200.13
##$BF2= 200.13
##$BF3= 200.13
##$BF4= 200.13
##$BF5= 200.13
##$BF6= 200.13
##$BF7= 200.13
##$BF8= 200.13
##$BYTORDA= 1
##$CFDGTYP= 0
##$CFRGTYP= 5
##$CHEMSTR= <none>
##$CNST= (0..31)
1 1 145 1 1 1 1 1 1 1 1 1 1 1 1 1 1 1 1 1 1 1 1 1 1 1 1 1 1 1 1 1 
##$CPDPRG= <>
##$CPDPRG1= <>
##$CPDPRG2= <>
##$CPDPRG3= <>
##$CPDPRG4= <mlev>
##$CPDPRG5= <mlev>
##$CPDPRG6= <mlev>
##$CPDPRG7= <mlev>
##$CPDPRG8= <mlev>
##$CPDPRGB= <>
##$CPDPRGT= <>
##$D= (0..31)
0 1.2 0 0 0 0 0 0 0 0 0 0.03 0 0 0 0 0 0 0 0 0 0 0 0 0 0 0 0 0 0 0 0 
##$DATE= 1552651419
##$DBL= (0..7)
120 120 120 120 120 120 120 120 
##$DBP= (0..7)
150 150 150 150 150 150 150 150 
##$DBP07= 0
##$DBPNAM0= <>
##$DBPNAM1= <>
##$DBPNAM2= <>
##$DBPNAM3= <>
##$DBPNAM4= <>
##$DBPNAM5= <>
##$DBPNAM6= <>
##$DBPNAM7= <>
##$DBPOAL= (0..7)
0.5 0.5 0.5 0.5 0.5 0.5 0.5 0.5 
##$DBPOFFS= (0..7)
0 0 0 0 0 0 0 0 
##$DE= 6
##$DECBNUC= <off>
##$DECIM= 24
##$DECNUC= <off>
##$DECSTAT= 4
##$DIGMOD= 1
##$DIGTYP= 9
##$DL= (0..7)
0 120 120 120 120 120 120 120 
##$DP= (0..7)
150 150 150 150 150 150 150 150 
##$DP07= 0
##$DPNAME0= <>
##$DPNAME1= <>
##$DPNAME2= <>
##$DPNAME3= <>
##$DPNAME4= <>
##$DPNAME5= <>
##$DPNAME6= <>
##$DPNAME7= <>
##$DPOAL= (0..7)
0.5 0.5 0.5 0.5 0.5 0.5 0.5 0.5 
##$DPOFFS= (0..7)
0 0 0 0 0 0 0 0 
##$DQDMODE= 0
##$DR= 18
##$DS= 0
##$DSLIST= <SSSSSSSSSSSSSSS>
##$DSPFIRM= 0
$$ [...]
##$SUBNAM2= <"">
##$SUBNAM3= <"">
##$SUBNAM4= <"">
##$SUBNAM5= <"">
##$SUBNAM6= <"">
##$SUBNAM7= <"">
##$SUBNAM8= <"">
##$SUBNAM9= <"">
##$SW= 24.9337681822398
##$SWIBOX= (0..15)
0 0 2 0 0 0 0 0 0 0 0 0 0 0 0 0 
##$SW_h= 4990.01996007984
##$TD= 16384
##$TD0= 1
##$TE= 0
##$TE2= 300
##$TE3= 300
##$TEG= 300
##$TL= (0..7)
0 120 120 120 120 120 120 120 
##$TP= (0..7)
150 150 150 150 150 150 150 150 
##$TP07= 0
##$TPNAME0= <>
##$TPNAME1= <>
##$TPNAME2= <>
##$TPNAME3= <>
##$TPNAME4= <>
##$TPNAME5= <>
##$TPNAME6= <>
##$TPNAME7= <>
##$TPOAL= (0..7)
0.5 0.5 0.5 0.5 0.5 0.5 0.5 0.5 
##$TPOFFS= (0..7)
0 0 0 0 0 0 0 0 
##$TUNHIN= 0
##$TUNHOUT= 0
##$TUNXOUT= 0
##$USERA1= <user>
##$USERA2= <user>
##$USERA3= <user>
##$USERA4= <user>
##$USERA5= <user>
##$V9= 5
##$VALIST= <valist>
##$VCLIST= <CCCCCCCCCCCCCCC>
##$VD= 0
##$VDLIST= <DDDDDDDDDDDDDDD>
##$VPLIST= <PPPPPPPPPPPPPPP>
##$VTLIST= <TTTTTTTTTTTTTTT>
##$WBST= 1024
##$WBSW= 4
##$XGAIN= (0..3)
0 0 0 0 
##$XL= 0
##$YL= 0
##$YMAX_a= 605631
##$YMIN_a= -1137138
##$ZGOPTNS= <>
##$ZL1= 120
##$ZL2= 120
##$ZL3= 120
##$ZL4= 120
##$ABSF1= 10
##$ABSF2= 0
##$ABSG= 5
##$ABSL= 3
##$ALPHA= 0
##$AQORDER= 0
##$ASSFAC= 0
##$ASSFACI= 0
##$ASSFACX= 0
##$ASSWID= 0
##$AUNMP= <proc_1d>
##$AZFE= 0.1
##$AZFW= 0.1
##$BCFW= 1
##$BC_mod= 2
##$BYTORDP= 1
##$COROFFS= 0
##$CY= 11.3945322036743
##$DATMOD= 1
##$DC= 2
##$DFILT= <>
##$DTYPP= 0
##$F1P= 18.9103706918063
##$F2P= -1.10871071338519
##$FCOR= 0.5
##$FTSIZE= 0
##$FT_mod= 4
##$GAMMA= 1
##$GB= 0.15
##$INTBC= 1
##$INTSCL= 1
##$ISEN= 128
##$LB= 0.24
##$LEV0= 0
##$LPBIN= 0
##$MAXI= 10000
##$MC2= 0
##$MEAN= 0
##$ME_mod= 0
##$MI= 1.114404
##$NCOEF= 0
##$NC_proc= 0
##$NLEV= 6
##$NOISF1= 3.799351
##$NOISF2= 2.8
##$NSP= 1
##$NTH_PI= 0
##$NZP= 0
##$OFFSET= 15.70392
##$PC= 1
##$PHC0= -9225.149
##$PHC1= 13.80026
##$PH_mod= 1
##$PKNL= yes
##$PPARMOD= 0
##$PSCAL= 0
##$PSIGN= 0
##$REVERSE= no
##$SF= 200.130013532006
##$SI= 16384
##$SIGF1= 3
##$SIGF2= 2
##$SINO= 400
##$SIOLD= 16384
##$SREGLST= <1H.CDCl3>
##$SSB= 0
##$STSI= 0
##$STSR= 0
##$SW_p= 3612.71676300578
##$SYMM= 0
##$S_DEV= 0
##$TDeff= 0
##$TDoff= 0
##$TI= <>
##$TILT= no
##$TM1= 0
##$TM2= 0
##$TOPLEV= 0
##$USERP1= <user>
##$USERP2= <user>
##$USERP3= <user>
##$USERP4= <user>
##$USERP5= <user>
##$WDW= 1
##$XDIM= 8192
##$YMAX_p= 0
##$YMIN_p= 0
$$ End of Bruker specific parameters
$$ ---------------------------------
##NTUPLES= NMR FID
##VAR_NAME=  TIME,          FID/REAL,        FID/IMAG
##SYMBOL=    X,             R,               I
##VAR_TYPE=  INDEPENDENT,   DEPENDENT,       DEPENDENT
##VAR_FORM=  AFFN,          ASDF,            ASDF
##VAR_DIM=   8192,          8192,            8192
##UNITS=     SECONDS,       ARBITRARY UNITS, ARBITRARY UNITS
##FACTOR=    0.0002004,     1,               1
##FIRST=     0,             0,               0
##LAST=      1.6414764,     0,               0
##MIN=       0,             -1137138,        0
##MAX=       1.6414764,     605631,          0
$$ Real data points
##PAGE= N=1
##DATA TABLE= (X++(R..R)), XYDATA
$$ plain form
0 0 0 0 0 -8 8 -8 16 -24 24 -35 48 -56 72 -88 110 -131 160 -187 224 -264 307 -360 419 -480 555 -636
26 -636 723 -826 935 -1055 1191 -1337 1497 -1679 1873 -2084 2321 -2579 2859 -3172 3511 -3889
42 -3889 4304 -4767 5281 -5860 6508 -7251 8100 -9087 10249 -11647 13355 -15511 18322
55 18322 -22162 27761 -36722 53446 -95568 425595 605631 -243271 -401520 -196957 330837
66 330837 528059 385492 -34416 -247557 -175749 120623 242345 87381 -270717 -457884
76 -457884 -328003 55999 333663 298243 -39222 -357198 -410254 -152753 156782 260900
86 260900 65615 -234435 -396091 -297483 -74971 50371 -55865 -303502 -492913 -477175
96 -477175 -301985 -132624 -115700 -238058 -368334 -374892 -254091 -115717 -78528 -156134 -252760
$$ packed form
0@%%%qJ6j6K4m0M8n9Q3j04J28j60J98k41K91l47M11m88N71o67P79q99J035j191
26f36J359j549J761j990K246k528K834l176L552l957M405m900N438o031O683p400
42c889Q193r071J0048j1141J2368j3759J5351j7187J9336k1896K5002k8866L3833
55A8322m0484M9923o4483R0168j49014N21163J80036q48902j58249K04563N27794
66C30837J97222j42567m19908k13141P1808K96372J21722j54964l58098j87167
76d57884J29881L84002K77664l5420l37465l17976n3056K57501L09535J04118
86B60900j95285l00050j61656R8608K22512J25342j06236k47637j89411J5738
96d77175J75190J69361J6924j22358j30276o558J20801J38374L7189p7606r6626
$$ plain form
107 -252760 -251845 -127837 36514 122807 79939 -36888 -124380 -117950 -41880 26002 28754 -22772
119 -22772 -71432 -71485 -29208 8612 2979 -40094 -77000 -69634 -17805 43144 76821 76608 64603
132 64603 68282 93016 122609 139520 142320 145643 160190 179788 186716 168711 133862 103753 91684
145 91684 94031 92544 77259 55442 44268 50530 61391 55973 27824 -3678 -10368 19941 66434
158 66434 92795 79220 40286 15359 28466 68629 95831 79468 28474 -15359 -16039 22048
170 22048 55943 41085 -22718 -90544 -110931 -71304 -14991 858 -45812 -117846 -151124 -114489
182 -114489 -36830 13913 -5970 -76166 -129383 -110693 -29661 47611 56151 -9987 -90270 -113207
194 -113207 -58777 22767 56395 9714 -77001 -127883 -98298 -17110 42127 24326 -55928 -126533
$$ packed form
107b52760R15J24008J64351Q6293m2868j16827q7492O430P6070O7882K752n1526
119b2772m8660n3M2277L7820n633m3073l6906P366N1829O0949L3677k13j2005
132F4603L679K4734K9593J6911K800L323J4547J9598O928j8005l4849l0109j2069
145I1684K347j487j5285k1817j1174O262J0861n418k8149l1502o690L0309M6493
158F6434K6361j3575l8934k4927J3107M0163K7202j6363n0994m3833o80L8087
170B2048L3895j4858o3803o7826k0387L9627N6313J5849m6670p2034l3278L6635
182a14489P7659N0743j9883p0196n3217J8690Q1032P7272Q540o6138q0283k2937
194a13207N4430Q1544L3628m6681q6715n0882K9585Q1188N9237j7801q0254p0605
$$ plain form
206 -126533 -123697 -47753 38503 63065 10859 -65096 -91789 -41735 44465 95645 72557 2282
218 2282 -48439 -32525 36225 96182 94398 34042 -31561 -46658 -873 61390 84520 47888
230 47888 -15312 -48928 -25911 30979 71127 60725 12208 -28912 -24989 20406 67579 77442
242 77442 44573 432 -15181 9153 49157 67544 47717 7429 -19013 -11376 19001 42075
254 42075 34294 1312 -28502 -32659 -10515 15714 21050 1160 -25037 -34612 -19328 6122 19198
267 19198 9927 -12338 -26449 -20809 -1461 13501 10202 -7605 -24345 -26201 -12990 1471 3190
280 3190 -8862 -25148 -31710 -23562 -9271 -2342 -7686 -20089 -27882 -24290 -11922 -621 1040 -5992
294 -5992 -14719 -16538 -9348 1089 7193 5125 -2430 -8902 -8808 -2930 4055 7275 4109 -2504 -7275
$$ packed form
206a26533K836P5944Q6256K4562n2206p5955k6693N0054Q6200N1180k3088p0275
218B282n0721J5914O8750N9957j784o0356o5603j5097M5785O2263K3130l6632
230D7888o3200l3616K3017N6890M0148j0402m8517m1120L923M5395M7173R863
242G7442l2869m4141j5613K4334M0004J8387j9827m0288k6442P637L0377K3074
254D2075p781l2982k9814m157K2144K6229N336j9890k6197r575J5284K5450J3076
267A9198r271k2265j4111N640J9348J4962l299j7807j6740j856J3211J4461J719
280C190j2052j6286o562Q148J4291O929n344j2403p793L592J2368J1301J661p032
294e992q727j819P190J0437O104k068p555o472R4N878O985L220l166o613m771
$$ plain form
309 -7275 -6411 -318 6143 8259 4205 -2284 -5631 -2061 5895 13256 13416 7098 -637 -2992 2937 12928
325 12928 19293 16119 6260 -2455 -2264 5936 15972 18102 10083 -1859 -7973 -3179 8270 16325
339 16325 13992 2604 -7667 -8854 142 11342 14417 7129 -4630 -10182 -5127 6343 13810 11086
353 11086 -29 -10455 -11448 -2708 7579 10755 3687 -7761 -14040 -10172 -120 7518 5941 -3189
367 -3189 -12171 -13386 -6446 2728 6313 1576 -7115 -12023 -9381 -1569 4600 4473 -2595 -9071 -9923 -4674
383 -4674 2005 4768 1013 -5146 -8733 -6747 -511 3994 3493 -1043 -5714 -6238 -2481 2323 4104 1772
399 1772 -1881 -3790 -2328 992 3815 3237 914 -1204 -1033 1211 2943 2991 1717 -98 -82 1363 2710
416 2710 2519 1748 204 -26 1459 3039 3193 1761 508 258 849 2434 2743 1888 254 -627 760
$$ packed form
309g275Q64O093O461K116m054o489l347L570P956P361J60o318p735k355N929R991
325A2928O365l174r859q715J91Q200J0036K130q019j1942o114M794J1449Q055
339A6325k333j1388j0271j187Q996J1200L075p288j1759n552N055J1470P467k724
353A1086j1115j0426r93Q740J0287L176p068j1448o279L868J0052P638j577r130
367c189q982j215O940R174L585m737q691m908K642P812O169j27p068o476q52N249
383d674O679K763l755o159l587J986O236M505n01m536m671n24L757M804J781k332
399A772l653j909J462L320K823n78k323k118J71K244J732M8j274j815J6J445J347
416B710j91p71j544k30J485J580J54j432j253k50N91J585L09q55j634q81J387
$$ plain form
433 760 2291 3152 2105 343 -1092 -647 1009 2453 2256 127 -1882 -2534 -583 1841 2457 1237 -1319
450 -1319 -2773 -2599 -266 1864 1771 -12 -2526 -3017 -1826 724 1774 680 -1186 -3281 -3149 -1128
466 -1128 732 1171 -60 -2135 -2892 -1963 -138 1692 1094 -684 -2458 -3152 -1495 815 1589 647 -1055
483 -1055 -2280 -2246 -647 1330 1802 500 -1157 -2147 -1310 302 1576 1629 455 -1058 -1231 -493 869
500 869 1931 1551 -70 -1131 -982 51 1307 1803 1102 -330 -687 -554 702 1555 1395 404 -394 -824
518 -824 -99 818 1486 1071 492 -634 -540 143 1104 1407 928 -174 -602 -379 505 922 1216 421 -658 -708
538 -708 -573 204 494 503 -108 -755 -632 -268 143 210 137 -294 -200 -485 -110 115 87 56 177 -309 -328 -281 -134
561 -134 -277 -212 -428 -323 -460 -265 -251 -247 -116 -246 -440 -580 -205 -251 -42 218 41 -7 -396 -395 -9 320 327 543
$$ packed form
433G60J531Q61j047j762j435M45J656J444j97k129k009o52J951K424O16j220k556
450a319j454J74K333K130r3j783k514m91J191K550J050j094j866k095J32K021
466a128J860M39j231k075p57R29J825J830n98j778j774o94J657K310P74r42j702
483a055j225L4J599J977M72j302j657r90Q37J612J274N3j174j513j73P38J362
500H69J062l80j621j061J49J033J256M96p01j432l57J33J256Q53j60r91p98m30
518h24P25R17O68m15n79j126R4O83R61L03m79j102m28K23Q84M17K94p95j079n0
538g08J35P77K90Ro11o47J23L64M11O7p3m31R4k85L75K25k8l1J21m86j9M7J47
561a34j43O5k16J05j37J95J4MJ31j30j94j40L75m6K09K60j77m8l89JL86L29PK16
$$ plain form
585 543 -103 -401 -404 -179 317 734 237 -117 -725 -710 -423 579 889 535 -352 -991 -782 -289 1109 1157 534
606 534 -782 -1360 -624 792 1798 1484 152 -1276 -1103 158 1653 1675 562 -1379 -2082 -1222 767
623 767 2052 1222 -526 -2192 -2163 -76 1909 2281 687 -1327 -2247 -1302 883 2527 1977 -99 -2068
640 -2068 -2192 -146 2018 2120 439 -1552 -2435 -1534 712 2169 1440 -605 -2574 -2162 -347 1449 2167
657 2167 825 -1257 -2319 -1049 882 2474 1712 -258 -1737 -1815 -137 1587 2213 975 -1319 -1844
673 -1844 -935 402 1790 1137 -592 -1872 -1684 -192 1140 1580 429 -1413 -1473 -361 1066 1534 923
690 923 -706 -1457 -601 283 1475 1261 115 -703 -1150 -116 978 985 -59 -810 -1009 -662 560 972 357
709 357 -486 -1106 -323 530 962 563 -499 -634 -575 107 795 738 361 -447 -622 -386 503 487 -78 -486 -803
$$ packed form
585E43o46k98lK25M96M17m97l54o08J5K87J002L10l54q87o39K09M93J398M8o23
606E34j316n78P36J416J006l14j332j428J73J261J495K2j113j941p03Q60J989
623G67J285q30j748j666K9K087J985L72j594k014r20R45K185J644n50k076j969
640b068j24K046K164J02j681j991q83R01K246J457p29k045j969M12J815J796P18
657B167j342k082j062J270J931J592p62j970j479p8J678J724O26j238k294n25
673a844R09J337J388o53j729j280J88J492J332M40j151j842o0J112J427M68o11
690I23j629p51Q56Q84J192k14j146q18m47J034J094Pj044p51j99L47J222M12o15
709C57q43o20P83Q53M32l99j062j35N9O82O88n7l77q08j75K36Q89j6n65m08l17
$$ plain form
730 -803 -231 38 395 650 -112 -883 -509 -140 217 564 30 -361 -223 -302 540 708 604 -185 -739 -629 -286
751 -286 651 592 -81 -391 -375 -590 313 211 377 -34 -770 -328 -360 303 785 366 -202 -877 -482 117 889
772 889 353 -6 -686 -584 128 479 608 295 -383 -650 -362 -40 91 492 32 -678 -612 -412 174 725 414
793 414 -192 -367 -396 187 406 609 360 -253 -243 -168 239 678 595 159 -387 -453 -412 136 435 277 -244 -892
815 -892 -482 -67 564 472 49 -624 -634 -224 582 611 608 -290 -647 -318 361 886 771 -243 -993 -706 404
836 404 705 705 189 -912 -1045 -508 308 537 -4 -463 -655 -385 3 779 696 30 -503 -656 -73 470 1094
857 1094 329 -295 -910 -536 15 499 551 320 -915 -946 -389 525 370 215 -260 -696 -454 266 730 601
877 601 -67 -330 -604 -106 508 741 399 -289 -700 -606 143 731 746 0 -657 -854 -460 636 823 273 -460
$$ packed form
730h03N72K69L57K55p62p71L74L69L57L47n34l91J38p9Q42J68j04p89n54J10L43
751b86R37n9o73l10J6k15R03j02J66m11p36M42l2O63M82m19n68o75L95N99P72
772H89n36l59o80J02P12L51J29l13o78k67K88L22J31M01m60p10O6K00N86N51l11
793D14o06j75k9N83K19K03k49o13J0P5M07M39q3m36n46o6M1N48K99j58n21o48
815h92M10M15O31r2m23o73j0M10Q06K9lq98l57L29O79N25j15j014p50K87J110
836D04L01%n16j101j33N37Q16K29n41m59j92K70L88P76q3o66n33j53N83N43O24
857A094p65o24o15L74N51M84N2k31j235l1N57R14j55j55m75m36K42P20M64j29
877F01o68k63k74M98O14K33l42o88m11R4P49N88J5p46o57j97L94J096J87n50p33
$$ plain form
898 -460 -810 -779 99 718 552 90 -543 -511 -188 624 1030 653 3 -798 -448 246 806 321 -18 -396 -580
919 -580 -304 305 639 36 -218 -613 -631 -125 686 701 343 -288 -453 -295 396 794 497 110 -819 -511 -269
940 -269 397 486 301 -220 -648 -361 240 109 180 35 -350 -597 -45 198 714 274 -165 -392 -415 89 613
961 613 739 251 -292 -351 2 453 689 233 -192 -673 -340 -49 789 311 -109 -458 -255 -127 420 547 65
982 65 -86 -663 -207 254 422 61 -200 -233 -9 136 185 419 176 28 -233 -299 124 285 134 -209 -78 -189
1004 -189 124 60 134 -184 -169 72 154 457 410 96 52 -37 212 211 71 -297 -155 70 30 117 116 156 -311 -357 -167
1029 -167 155 179 -16 -190 -119 -147 -226 160 129 61 -172 -166 -285 447 308 -160 -235 151 -393 326 61 327 76
1052 76 -374 -703 135 386 279 380 -288 -346 -237 31 232 254 87 -6 -426 -8 132 70 -86 -55 -316 212
$$ packed form
898d60l50L1Q78O19j66m62o33L2L23Q12M06l77o50q01L50O94N60m85l39l78j84
919e80K76O09L34o03k54l95j8N06Q11J5l58o31j65J58O91L98k97l87r29L08K42
940b69O66Q9j85n21m28K87O01j31P1j45l85k47N52K43N16m40m39k27k3N04N24
961F13J26m88n43n9L53M51K36m56m25m81L33K91Q38m78m20l49K03J28N47J27m82
982F5j51n77M56M61J68l61k61l3K24J45M9K34k43j48k61o6M23J61j51l43J31j11
1004a89L13o4P4l18J5K41Q2L03m7l14m4q9K49jj40l68J42K25m0Q7jM0m67m6J90
1029a67L22K4j95j74P1k8p9L86l1o8k33Oj19P32j39m68p5L86n44P19k65K66k51
1052G6m50l29Q38K51j07J01o68n8J09K68K01K2j67r3m20M18J40o2j56L1k61N28
$$ plain form
1074 212 112 391 111 -141 81 -355 -115 168 -50 42 -100 -388 -64 224 299 224 100 -200 157 -108 222
1095 222 -25 13 395 -231 -79 233 112 -65 184 14 99 11 -27 80 -2 132 -121 -304 -251 -101 112 287
1117 287 299 -161 -307 122 -130 -151 -40 -71 -80 -210 -166 144 -5 -8 -154 83 -196 -8 343 91 -33 -222 181
1140 181 109 195 320 -184 -433 352 43 233 402 -174 -87 -22 -70 -32 0 267 -260 54 -350 512 280 63
1162 63 -70 -79 135 -37 126 -76 79 87 75 -64 83 236 58 240 -76 148 -37 119 283 259 61 -102
1184 -102 28 286 107 -63 -123 -196 -202 -182 6 131 188 57 -178 -102 -123 276 238 -149 6 182 261 263 323 23
1208 23 -15 -275 -12 36 -3 233 312 -85 -104 186 199 167 231 -139 -200 -56 -5 105 25 -313 -11 -83 -73 164 219
1233 219 95 -151 -137 -253 -76 277 99 95 -111 -374 65 -96 -164 289 -213 -277 107 -50 51 52 400 -105
$$ packed form
1074B12j00K79k80k52K22m36K40K83k18R2j42k88L24K88P5p5j24l00L57k65L30
1095B22k47L8L82o26J52L12j21j77K49j70Q5q8l8J07q2J34k53j83N3J50K13J75
1117B87J2m60j46M29k52k1J11l1rj30M4L10j49lj46K37k79J88L51k52j24j89M03
1140A81p2Q6J25n04k49P85l09J90J69n76Q7O5m8L8L2K67n27L14m04Q62k32k17
1162F3j33rK14j72J63k02J55Qj2j39J47J53j78J82l16K24j85J56J64k4j98j63
1184a02J30K58j79j70o0p3oK0J88J25N7j31k35P6k1L99l8l87J55J76P9KO0l00
1208B3l8k60K63M8l9K36P9l97j9K90J3l2O4l70o1J44N1J10q0l38L02p2J0K37N5
1233B19j24k46J4j16J77L53j78mk06k63M39j61o8M53n02o4L84j57J01JL48n05
$$ plain form
1255 -105 -249 -71 49 100 113 149 196 -134 -129 47 73 101 -205 207 -105 48 141 -96 -28 -39 122 -127 198 280
1279 280 -5 57 -68 -172 36 -124 -136 -174 -1 -143 -190 -251 50 57 169 -4 13 102 287 -349 -226 46 -89
1302 -89 100 6 209 127 -91 -13 -334 102 -172 57 260 196 -126 54 -200 178 -107 -109 -27 -220 30 -6 -79
1325 -79 101 32 -112 95 142 272 -111 -49 63 122 -66 89 -187 -43 -192 79 222 -2 83 -60 130 -154
1347 -154 25 321 423 -54 144 131 228 118 146 114 29 20 -46 197 210 -208 -121 -20 235 225 29 96 -22 -148
1371 -148 -379 58 -204 155 -332 -26 -250 -107 -104 -142 75 -38 59 45 259 -174 -121 0 -55 -358 -3 -1 -16
1394 -16 -182 -111 -175 -44 97 52 204 -182 6 -291 -146 53 94 291 -157 32 -55 -145 11 147 -66 12 -132
1417 -132 57 80 -147 -80 32 100 -120 -173 170 29 101 -184 -283 108 27 -291 104 -215 61 -89 -217 61
$$ packed form
1255a05j44J78J20N1J3L6M7l30NJ76K6K8l06M12l12J53R3k37O8j1J61k49L25Q2
1279B80k85O2j25j04K08j60j2l8J73j42m7o1L01PJ12j73J7Q9J85o36J23K72j35
1302h9J89r4K03q2k18P8l21M36k74K29K03o4l22J80k54L78k85kQ2j93K50l6p3
1325g9J80o9j44K07M7J30l83O2J12N9j88J55k76J44j49K71J43k24Q5j43J90k84
1347a54J79K96J02m77J98j3R7j10K8l2q5ro6K43J3m18Q7J01K55j0j96O7j18j26
1371a48k31M37k62L59m87L06k24J43Ll8K17j13R7j4K14m33N3J21n5l03L55Kj5
1394a6j66P1o4J31J41m5J52l86J88k97J45J99M1J97m48J89q7r0J56J36k13P8j44
1417a32J89K3k27O7J12O8k20n3L43j41P2k85r9L91q1l18L95l19K76j50j28K78
$$ plain form
1439 61 -122 181 -187 -144 -170 154 -84 220 26 76 -11 -21 178 -1 13 -110 118 -366 331 247 42 68 -132
1462 -132 -15 -105 39 419 16 -144 2 -91 -143 -154 -78 90 92 321 -150 25 -104 8 164 -54 185 415
1484 415 -96 -57 -213 -27 -79 197 347 -81 -65 122 -83 56 39 93 -46 133 -5 -66 28 -30 -294 10 -31
1507 -31 -35 164 -144 13 63 270 165 -265 -152 -263 118 145 105 -63 93 -73 209 -112 96 49 171 164 -38
1530 -38 -168 -83 -152 -187 149 198 61 10 130 42 -102 -226 189 110 156 -175 120 145 6 -125 26 216 83
1553 83 -24 -173 -11 189 -174 -3 -273 -164 44 192 231 -22 -136 83 -83 24 175 -140 -1 46 -43
1574 -43 129 204 -20 -167 -261 438 6 -10 -46 -65 -164 -254 -115 7 -71 -189 -112 172 -31 7 46 -267 132 77
1598 77 76 134 -111 216 -41 235 -149 39 139 -87 85 -15 -143 -54 7 -262 194 -77 -67 -49 -126 -34 79
$$ packed form
1439F1j83L03l68M3k6L24k38L04j94N0q7j0J99j79J4j23K28m84O97q4k05K6k00
1462a32J17r0J44L80m03j60J46r3n2j1P6J68KK29m71J75j29J12J56k18K39K30
1484D15n11L9j56J86n2K76J50m28J6J87k05J39j7N4j39J79j38o1R4n8k64L04m1
1507c1mJ99l08J57N0K07j05m30J13j11L81K7m0j68J56j66K82l21K08m7J22pk02
1530c8j30Q5o9l5L36M9j37n1J20q8j44j24M15p9M6l31K95K5j39j31J51J90j33
1553H3j07j49J62K00l63J71k70J09K08J48L9k53j14K19j66J07J51l15J39M7q9
1574d3J72P5k24j47r4O99m32j6l6j9r9r0J39J22p8j18P7K84k03L8L9l13L99n5
1598G7jN8k45L27k57K76l84J88J00k26J72j00j28Q9O1k69M56k71J0J8p7R2J13
$$ plain form
1621 79 126 91 -45 162 -16 120 -114 135 -120 -165 -74 -173 -14 148 -320 175 62 359 53 -163 -191 -404
1643 -404 -270 -78 -78 394 53 124 267 -163 254 174 132 -39 -52 -92 183 -113 94 126 -19 -27 99 197 150 -102
1667 -102 -107 -194 -322 183 -70 -47 -29 97 -95 -103 121 167 -206 -20 100 -13 5 -349 -31 -10 0 32 -181 46
1691 46 -121 40 2 -65 266 35 294 136 -148 13 -230 73 357 92 -212 63 198 195 -77 -231 -75 13
1713 13 209 -263 -327 -278 -7 -76 324 41 -60 -132 -188 24 184 169 -213 -160 -165 27 79 -110 -70 -44 -141 -35 -173
1738 -173 41 -26 117 31 -36 -131 131 317 -8 -47 -125 -21 0 -317 48 106 -159 -327 -202 -112 -161 72 -94
1761 -94 61 2 -23 151 138 -259 212 72 357 128 37 304 -230 -418 182 -26 194 -57 174 -113 -199 -17
1783 -17 -197 179 220 171 -74 83 -169 -100 144 10 93 33 83 -108 7 -1 75 176 -159 0 183 52 -151
$$ packed form
1621G9M7l5j36K07j78J36k34K49k55m5R1r9J59J62m68M95j13K97l06k16k8k13
1643d04J34J92%M72l41P1J43m30M17q0m2j71j3m0K75k96K07L2j45qJ26R8m7k52
1667a02nq7j28N05k53K3J8J26j92qK24M6l73J86J20j13J8l54L18K1J0L2k13K27
1691D6j67J61l8o7L31k31K59j58k84J61k43L03K84k65l04K75J35lk72j54J56Q8
1713A3J96m72o4M9K71o9M00k83j01p2n6K12J60j5l82N3nJ92N2j89M0K6r7J06j38
1738a73K14o7J43q6o7r5K62J86l25l9p8J04K1l17L65N8k65j68J25R0m9K33j66
1761i4J55n9k5J74j3l97M71j40K85k29r1K67n34j88O00k08K20k51K31k87q6J82
1783a7j80L76M1m9k45J57k52O9K44j34Q3o0N0j91J15qP6J01l35J59J83j31k03
$$ plain form
1806 -151 -208 78 -32 -291 -88 -32 -152 81 100 190 -108 104 -59 -37 38 -81 110 -86 211 -27 72 59 35
1829 35 -77 149 -203 -103 -74 259 81 -44 93 -31 -211 -116 128 383 -263 -179 -102 -38 -231 232 21 -101
1851 -101 -184 -21 -43 -120 -223 -128 -29 309 224 -107 45 -157 -100 -62 -35 -123 -144 -51 248 75 -53 -167 87 74
1875 74 -228 -79 69 -91 -2 -85 -171 11 45 -272 -296 50 -69 166 -37 -21 -90 345 9 -170 157 53 246
1898 246 -294 -161 -306 45 -52 -74 227 36 71 94 192 477 108 87 74 -138 -161 189 -195 -308 131 -211 -83
1921 -83 72 -185 -126 -178 1 -117 -16 -298 181 -254 4 -86 -57 115 87 -119 153 -170 73 -93 -168 -110 -50
1944 -50 -46 16 -48 22 344 -160 28 -120 -297 40 -110 283 7 -376 347 -185 145 43 211 122 -116 -152 147
1967 147 -66 -8 -123 9 -232 -130 198 85 -96 58 274 -165 108 -9 450 301 262 -56 0 -224 -78
$$ packed form
1806a51n7K86j10k59K03N6j20K33J9R0k98K12j63K2P5j19J91j96K97k38R9j3k4
1829C5j12K26l52J00K9L33j78j25J37j24j80R5K44K55o46Q4P7O4j93M63k11j22
1851a01q3J63k2p7j03R5R9L38q5l31J52k02N7L8K7q8k1R3K99j73j28j14K54j3
1875G4l02J49J48j60Q9q3q6J82L4l17k4L46j19K35k03J6o9M35l36j79L27j04J93
1898B46n40J33j45L51r7k2L01j91L5K3R8K85l69k1j3k12k3L50l84j13M39l42J28
1921h3J55k57N9n2J79j18J01k82M79m35K58r0K9J72k8k06K72l23K43j66p5N8O0
1944e0MO2o4P0L22n04J88j48j77L37j50L93k76l83P23n32L30j02J68q9k38l6K99
1967A47k13N8j15J32k41J02L28j13j81J54K16m39K73j17M59j49l9l18N6k24J46
$$ plain form
1988 -78 -161 52 -131 -2 7 -11 14 -108 -157 204 -374 206 -4 168 -17 170 27 219 74 -125 -211 176 -146
2011 -146 7 45 -23 34 -193 -88 165 -31 40 123 -73 -15 -53 180 162 -51 -52 -139 24 -153 176 206 165 -210
2035 -210 193 -199 -137 -122 183 29 -7 -116 -225 -138 110 42 252 -29 -93 -107 -117 -14 -26 55 -117 -10 -29 185
2059 185 -124 -77 -129 96 6 47 -85 -64 -73 -179 56 37 -233 -91 -83 -26 -208 27 532 205 -314 24 277 -18
2083 -18 -44 31 -241 136 -116 189 188 247 31 -101 -90 98 -92 -143 -93 88 -250 86 222 102 -54 10 -243
2106 -243 -150 -291 7 216 -26 -156 158 54 -103 -186 -169 62 -230 305 181 -39 -37 -228 374 -49 -84 -339
2128 -339 147 -125 -142 68 -40 53 -18 -76 286 79 44 -50 182 -123 -189 17 -196 24 68 76 -15 39 -143 290
2152 290 324 303 -296 64 -70 -5 -68 100 -52 -49 -43 80 -2 -40 1 161 -130 90 -2 -5 77 -197 56 -114 48
$$ packed form
1988g8q3K13j83J29Rj8K5j22m9L61n78N80k10J72j85J87j43J92j45j99q6L87l22
2011a46J53L8o8N7k27J05K53j96P1Q3j96N8l8K33j8k13jq7J63j77L29L0m1l75
2035b10M03l92O2J5L05j54l6j09j09Q7K48o8K10k81o4j4j0J03j2Q1j72J07j9K14
2059A85l09M7n2K25r0M1j32K1rj06K35j9k70J42QN7j82K35N05l27n19L38K53k95
2083a8k6P5k72L77k52L05jN9k16j32J1J88j90n1N0J81l38L36J36j20j56O4k53
2106b43R3j41K98K09k42j30L14j04j57q3J7K31k92N35j24k20Kj91O02m23l5k55
2128c39M86k72j7K10j08R3p1n8L62k07l5r4K32l05o6K06k13K20M4Qr1N4j82M33
2152B90L4k1n99L60j34O5o3J68j52LOJ23q2l8M1J60k91K20r2lQ2k74K53j70J62
$$ plain form
2177 48 289 134 -43 124 -92 56 0 -78 -159 -67 -198 68 18 -82 162 -52 195 156 33 287 94 169 183
2200 183 -236 -321 29 176 171 386 -206 -12 -119 -52 197 -42 250 -174 -213 123 -170 -206 51 11 -259 -126
2222 -126 75 42 -55 -134 154 -78 108 -398 -101 178 -4 275 -306 147 -223 -173 29 104 -101 117 107 -113
2244 -113 1 -91 38 -182 -56 -328 238 -84 -228 116 -149 -2 26 -330 121 -129 129 106 -105 -268 106
2265 106 112 5 125 -224 326 145 -80 -155 118 -181 -217 -67 191 -67 125 -135 -66 -237 60 -33 -24 -45 57
2288 57 -62 -203 134 -76 120 270 147 62 -43 -270 -160 317 82 -21 -118 277 -4 -26 -85 64 -22 -197
2310 -197 178 -211 -278 168 -122 -107 53 120 316 99 14 -97 109 -106 291 162 223 237 -1 -144 -102 9
2332 9 65 32 -217 -47 -52 -93 -32 124 126 -66 -207 -100 34 115 184 -92 -34 101 -328 206 47 -177 -275 -98 155
$$ packed form
2177D8K41j55j77J67k16J48n6p8q1R2j31K66n0j00K44k14K47l9j23K54j93P5J4
2200A83m19q5L50J47nK15n92J94j07O7K49k39K92m24l9L36k93l6K57m0k70J33
2222a26K01l3r7p9K88k32J86n06K97K79j82K79n81M53l70N0K02P5k05K18j0k20
2244a13J14r2J29k20J26k72N66l22j44L44k65J47K8l56M51k50K58k3k11j63L74
2265A06Oj07J20l49N50j81k25p5K73k99l6J50K58k58J92k60O9j71K97r3Rk1J02
2288E7j19j41L37k10J96J50j23q5j05k27J10M77k35j03r7L95k81k2n9J49q6j75
2310a97L75l89o7M46k90J5J60O7J96k17q5j11K06k15L97j29O1J4k38j43M2J11
2332IN6l3k49J70nm1O1J56Kj92j41J07J34Q1O9k76N8J35m29N34j59k24r8J77K53
$$ plain form
2357 155 94 -279 75 68 139 56 130 60 -340 6 -127 178 -54 -196 -152 -42 -3 -124 -109 4 16 42 -5 -5 155
2382 155 -114 -131 198 237 51 148 60 -118 108 181 86 -116 12 309 -112 -105 194 -130 -59 -167 96 78 6 88
2406 88 -36 33 43 102 -287 -153 -24 -192 173 -81 -43 -230 95 -15 90 173 180 387 308 90 110 -123 -80 -248
2430 -248 -161 -64 12 8 3 155 -145 157 165 159 -141 -199 -9 154 -23 57 -248 -210 35 -62 23 -15 -145 -201 -256 118
2456 118 25 -37 57 18 -310 -130 -75 104 -11 103 79 -22 -173 -271 166 -11 -246 207 -77 54 -30 210 225
2479 225 -404 163 58 34 23 -112 25 0 12 43 276 -92 102 108 213 93 -215 -105 -24 139 45 0 -190
2502 -190 -52 199 -109 -170 -102 77 34 177 84 -152 165 -278 -61 -7 15 -266 -62 49 -178 -23 83 -120
2524 -120 150 -65 64 -71 -146 -70 -99 33 -39 4 306 173 -17 199 278 -412 -29 80 168 135 -25 -4 59
$$ packed form
2357A55o1l73L54pP1q3P4p0m00L46j33L05k32j42M4J10L9j21J5J13J2K6m7%J60
2382A55k69j7L29L9j86R7q8j78K26P3r5k02J28K97m21PK99l24P1j08K63j8p2Q2
2406H8j24O9J0N9l89J34J29j68L65k54L8j87L25j10J05Q3PK07p9k18K0k33M3j68
2430b48Q7R7P6mnJ52l00L02Qol00n8J90J63j77Q0l05L8K45r7Q5l8j30n6n5L74
2456A18r3o2R4l9l28J80N5J79j15J14k4j01j51r8M37j77k35M53k84J31q4K40J5
2479B25o29N67j05k4j1j35J37k5J2L1K33l68J94OJ05j20l08J10Q1J63r4m5j90
2502a90J38K51l08o1O8J79m3J43r3k36L17m43K17N4K2k81K04J11k27J55J06k03
2524a20K70k15J29j35p5P6k9J32p2M3L02j33j90K16P9o90L83J09Q8l3j60K1O3
$$ plain form
2547 59 -40 120 185 84 29 -59 -250 -90 -58 55 -137 26 45 -7 -141 -57 -55 171 -29 59 430 -91 151 269
2571 269 284 -111 109 -14 -89 22 -157 1 23 112 120 -29 -260 -38 122 -80 -97 25 71 75 -136 101 185 -71
2595 -71 34 -72 -91 -87 -108 33 249 -113 295 -1 128 -55 -108 -157 83 231 -1 210 -62 -59 315 169 82
2618 82 25 -60 -180 73 31 304 -33 -72 -24 -59 -68 -15 47 94 -286 1 173 163 56 -15 22 21 -86 -259 -58 160
2644 160 -59 -246 53 -113 99 -121 -36 79 171 204 -16 47 14 77 187 -66 -16 -194 -121 112 22 201 -94
2667 -94 320 38 79 111 -40 44 -33 -125 -130 59 215 57 -322 -30 -305 176 24 -57 -192 250 254 -86 -21 -29 69
2692 69 -269 -71 -95 -143 -139 141 -155 -158 125 -70 -233 -213 63 -43 127 -6 -211 7 -149 71 454 74 -241
2715 -241 290 211 -188 -130 -120 139 3 -241 143 -183 76 56 -48 50 -241 39 150 -247 74 29 -70 -355
$$ packed form
2547E9r9J60O5j01n5q8j91J60L2J13j92J63J9n2j34Q4KK26k00Q8L71n21K42J18
2571B69J5l95K20j23p5J11j79J58K2Q9Qj49k31K22J60k02j7J22M6Mk11K37Q4k56
2595g1J05j06j9Mk1J41K16l62M08k96J29j83n3m9K40J48k32K11k72LL74j46q7
2618H2n7q5j20K53m2K73l37l9M8l5rN3O2M7l80K87J72j0j07p1L7jj07j73K01K18
2644A60k19j87K99j66K12k20Q5J15R2L3k20O3l3O3J10k53N0j78P3K33r0J79k95
2667i4M14k82M1L2j51Q4p7r2nJ89J56j58l79K92k75M81j52q1j35M42Ml40O5qR8
2692F9l38J98k4m8MK80k96lK83j95j63K0K76j06J70j33k05K18j56K20L83l80l15
2715b41N31p9l99N8J0K59j36k44L84l26K59k0j04R8k91K80J11l97L21m5r9k85
$$ plain form
2737 -355 149 -181 13 37 -79 102 157 -103 -69 -71 15 127 -299 6 -197 96 -77 76 67 -48 49 -115 28
2760 28 213 -331 18 -1 -102 -189 -74 115 -70 48 203 245 -62 150 71 -60 -52 -196 -62 63 -113 -11
2782 -11 -96 -116 -293 158 115 72 170 118 -182 11 -148 220 -199 378 -41 8 41 -199 197 -14 27 -151 -126 324
2806 324 92 54 39 -99 33 -29 152 -203 -62 3 -151 -35 385 102 -50 109 -39 -260 106 -190 -61
2827 -61 -103 -25 -109 -91 149 -108 230 -144 137 -216 -94 156 86 -91 49 214 76 75 -107 61 -372 -173 -18
2850 -18 429 63 90 51 32 198 -126 69 162 172 272 94 22 43 56 -118 -47 -11 -89 158 196 -104 -218 228
2874 228 357 102 56 -206 -81 -148 -2 -14 -43 -197 -37 -174 32 154 44 116 -201 -144 64 18 -232 142
2896 142 -199 30 143 32 104 162 -73 449 24 -60 32 -81 -158 -196 168 -99 -62 303 -128 -92 226 -74 -77
$$ packed form
2737c55N04l30J94K4j16J81N5k60L4kQ6J12m26L05k03K93j73J53rj15R7j64J43
2760B8J85n44L49j9j01q7J15J89j85J18J55M2l07K12p9j31Qj44J34J25j76J02
2782a1q5k0j77M51m3m3R8n2l00J93j59L68m19N77m19M9L3k40L96k11M1j78K5M50
2806C24k32l8j5j38J32o2J81l55J41O5j54J16M20k83j52J59j48k21L66k96J29
2827f1m2P8q4J8K40k57L38l74K81l53J22K50p0j77J40J65j38jj82J68m33J99J55
2850a8M47l66K7l9j9J66l24J95R3J0J00j78p2K1J3j74P1L6p8K47L8l00j14M46
2874B28J29k55m6k62J25o7J46j2k9j54J60j37K06J22j10P2l17N7K08m6k50L74
2896A42l41K29J13j11P2N8k35N22m25q4R2j13p7l8L64k67L7L65m31L6L18l00l
$$ plain form
2919 -77 -182 112 -136 91 -78 -25 128 -56 25 198 -185 -78 45 21 87 -28 41 43 -116 4 9 -124 16
2942 16 86 -49 89 -333 -388 -1 -175 269 -410 54 65 -89 -8 -62 52 113 -20 130 102 278 261 22 -124
2965 -124 159 149 49 213 -398 -116 155 148 -110 -218 -54 -38 -69 232 105 -132 -127 -172 -22 33 212 -93 392
2988 392 -250 89 119 -174 -175 -258 34 11 28 83 120 61 225 160 167 -101 212 -221 31 88 189 29 -124 -110 127
3013 127 -179 -140 182 185 193 -67 -87 56 87 -118 -61 12 123 -172 184 39 -91 59 304 -79 -133 14 74 -188
3037 -188 153 -194 137 13 -121 287 16 -12 -267 130 -145 85 318 -120 50 409 7 -170 -179 -195 184
3058 184 70 -103 -30 138 26 -227 361 -109 -222 281 -53 -56 -130 -93 49 -19 -284 -162 -230 -10 121 300
3080 300 92 -109 -195 3 209 9 17 225 -9 210 283 6 -98 -210 181 142 140 81 -11 -3 -40 -44 473 207 91
$$ packed form
2919g7j05K94k48K27j69N3J53j84Q1J73l83J07J23k4O6j15O9Kj59J20Nj33J40
2942A6P0j35J38m22n5L87j74M44o79M64J1j54Q1n4J14O1j33J50k8J76j7k39j46
2965a24K83j0j00J64o11K82K71pk58j08J64J6l1L01j27k37Nm5J50N5J79l05M85
2988C92o42L39L0k93jq3K92k3J7N5L7n9J64o5Pk68L13m33K52N7J01j60j53J4K37
3013A27l06L9L22LQk60k0J43L1k05N7P3J11k95L56j45j30J50K45l83n4J47O0k62
3037a88L41l47L31j24j34M08k71k8k55L97k75K30K33m38J70L59m02j77rj6L79
3058A84j14j73P3J68j12k53N88m70j13N03l34lp4L7J42o8k65J22o8K20J31J79
3080C00k08k01q6J98K06k00QK08k34K19P3k77j04j12L91l9kn9r2Ql7mN17k66j16
$$ plain form
3105 91 -168 155 -296 -156 -134 5 177 -290 -254 -129 343 82 31 -265 -121 126 150 160 243 -26 -237 138
3127 138 158 -114 -190 -152 290 137 52 -122 231 -163 48 124 -107 -94 -66 -241 -8 142 -24 -54 173 -7 42
3150 42 223 356 -67 260 334 -123 201 5 -109 205 113 113 -338 289 35 51 202 -323 63 194 -8 -95
3172 -95 -194 -87 -22 -321 45 149 368 -34 -158 -142 -17 -22 52 -27 129 331 -94 -13 -107 187 49 -105 -225
3195 -225 -7 -122 -57 39 383 -165 123 -12 175 150 -16 48 -280 46 -514 -86 -4 150 -101 -80 -161 108
3217 108 100 38 -356 -62 -35 -44 250 -139 -68 -137 90 293 -81 156 59 -154 -190 -176 26 112 21 87 -158 -100 -25
3242 -25 54 -207 -9 61 45 46 -18 -18 -30 -145 16 241 -317 25 150 97 82 -72 30 9 -178 -23 5 167 161
3267 161 -11 -121 -267 -130 30 290 183 -148 13 70 66 9 338 14 -267 26 -21 117 36 217 79 69
$$ packed form
3105I1k59L23m51J40K2J39J72m67L6J25M72k61n1k96J44K47K4J0Q3k69k11L75
3127A38K0k72p6L8M42j53q5j74L53l94K11P6k31J3K8j75K33J50j66l0K27j80M9
3150D2J81J33m23L27P4m57L24j96j14L14r2%m51O27k54J6J51n25L86J31k02q7
3172i5r9J07O5k99L66J04K19m02j24J6J25nP4p9J56K02m25Q1r4K94j38j54j20
3195b25K18j15O5R6L44n48K88j35J87k5j66O4l28L26n60M28Q2J54k51K1q1K69
3217A08qo2l94K94K7rK94l89P1o9K27K03l74K37r7k13l6J4K02Q6r1O6k45N8P5
3242b5P9k61J98P0j6Jo4%j2j15J61K25n58L42J25n3j5j54J02k1j87J55K8J62o
3267A61j72j10j46J37J60K60j07l31J61N7mn7L29l24k81K93m7J38q1J81j38j0
$$ plain form
3289 69 342 296 211 175 -106 -92 -178 -51 -89 90 198 -47 113 -28 152 -350 201 -171 84 -490 -81 -15 -151
3312 -151 -4 -12 -228 111 80 98 -127 -276 225 99 60 -224 -237 39 150 6 -68 -32 -105 36 160 -94 49
3335 49 -90 -193 33 -79 -239 -154 -295 -134 191 -11 -158 -31 -20 -321 14 56 237 23 -49 -185 79 -21
3357 -21 109 150 -242 135 190 56 -100 -161 410 -207 50 -110 125 60 456 267 -136 6 -49 162 3 152
3379 152 164 3 125 126 -222 64 229 20 26 264 -171 93 6 226 -102 39 72 151 -197 -428 244 -52 -9
3402 -9 72 -21 -86 -85 -204 -479 43 99 335 -58 -116 -26 -359 99 -88 54 8 230 45 33 -167 -22 -107 262
3426 262 15 -313 98 -147 -124 -66 69 -84 -70 169 154 -51 -86 -32 117 -117 239 -69 -28 -187 -52 -98 57
3449 57 -108 -25 -37 240 41 209 -122 237 27 143 292 168 -13 -175 40 79 281 -14 139 -175 31
$$ packed form
3289F9K73m6q5l6k81J4q6J27l8J79J08k45J60j41J80n02N51l72K55n74M09O6j36
3312a51J47qk16L39l1J8k25j49N01j26l9k84j3K76J11j44p4L6p3J41J24k54J43
3335D9j39j03K26j12j60Q5j41J61L25k02j47J27J1l01L35M2J81k14p2j36K64j00
3357b1J30M1l92L77N5j34j56o1N71o17K57j60K35o5L96j89m03J42n5K11j59J49
3379A52J2j61J22Jl48K86J65k09OK38m35K64q7K20l28J41L3P9l48k31O72k96M3
3402iQ1r3o5Jj19k75N22N6K36l93n8R0l33M58j87J42m6K22j85j2k00J45q5L69
3426B62k47l28M11k45K3N8J35j53J4K39j5k05l5N4J49k34L56l08M1j59J35m6J55
3449E7j65Q3j2K77j99J68l31L59k10J16J49j24j81j62K15L9K02k95J53l14K06
$$ plain form
3470 31 -36 139 79 106 -76 -282 113 43 -181 -1 172 140 -389 73 83 -88 38 -31 140 18 43 -53 -193
3493 -193 80 -185 144 266 102 -78 -34 150 58 111 -177 36 10 -130 38 -130 -207 -74 67 -43 46 -44
3515 -44 30 -161 -315 -70 -114 134 -70 56 139 -144 320 209 34 279 -205 5 77 -89 44 144 96 53
3537 53 48 -104 -4 185 -56 -254 160 68 -10 67 -163 -229 -130 -170 -327 -29 279 46 -26 4 -29 -145 201 -16
3561 -16 -36 -176 -12 -185 -123 24 125 3 141 77 -56 -182 -45 8 -219 175 43 -51 -120 32 -196 -73
3583 -73 -100 -45 236 22 158 42 -25 23 207 103 97 21 130 -237 -177 -148 296 -91 190 -13 344 314 -42 -178
3607 -178 37 50 114 8 143 -20 -10 70 -146 184 79 -55 -148 -7 53 16 -153 -15 0 248 -43 -45 16 -86
3631 -86 -209 87 18 -20 143 -116 164 40 74 148 -129 -152 233 -271 -129 -19 149 129 137 -1 -93 -346 52
$$ packed form
3470C1o7J75o0K7j82k06L95p0k24J80J73l2n29M62J0j71J26o9J71j22K5r6j40
3493a93K73k65L29J22j64j80M4J84r2N3k88K13k6j40J68j68p7J33J41j10Q9r0
3515d4P4j91j54K45m4K48k04J26Q3k83M64j11j75K45m84K10P2j66J33J00m8m3
3537E3nj52J00J89k41j98M14r2p8P7k30o6R9m0j57K98L08k33p2L0l3j16L46k17
3561a6k0j40J64j73O2J47J01j22J38o4j33j26J37N3k27L94j32r4o9J52k28J23
3583g3k7N5K81k14J36j16o7M8J84j04op6J09l67O0K9M44l87K81k03L57l0l56j36
3607a78K15J3O4j06J35j63J0Q0k16L30j05j34r3J41O0l7j69J38J5K48k91kO1j02
3631h6j23K96o9l8J63k59K80j24L4P4k77k3L85n04J42J10J68k0Qj38r2k53L98
$$ plain form
3654 52 246 -78 -127 233 -255 -38 109 136 -142 -60 -177 -88 119 -34 -262 -12 117 279 135 -85 -45 -52 -46
3677 -46 78 29 147 -30 5 -343 48 -49 133 -162 -15 -67 -27 62 -128 -152 -93 -149 -90 -159 -433 62 355 33
3701 33 105 122 76 189 -170 -100 292 -101 162 5 131 261 1 -274 83 49 -36 29 -334 -92 104 23 330
3724 330 -6 -231 95 -107 -114 -88 -164 71 77 46 113 -7 157 133 141 -17 -69 130 -99 -324 112 81 206 -55
3748 -55 -203 -137 317 99 167 -114 -200 21 -148 104 -244 -58 -139 126 151 -117 77 -159 52 -17 208 -145
3770 -145 134 143 -347 132 108 276 -45 -262 -91 -171 211 -317 233 204 -208 105 148 357 183 -63 -94 52
3792 52 131 -166 116 -62 93 -369 -54 52 -108 -8 132 147 24 -46 -90 59 -331 -144 -24 -7 119 -40
3814 -40 -134 -169 -265 276 9 250 206 -177 304 -41 119 -142 45 -138 24 79 123 48 -115 369 138 -79 226
$$ packed form
3654E2J94l24m9L60m88K17J47K7k78Q2j17Q9K07j53k28K50J29J62j44k20M0pO
3677d6J24m9J18j77L5l48L91r7J82k95J47n2M0Q9j90k4N9n6N9o9k74M95K93l22
3701C3P2J7m6J13l59P0L92l93K63j57J26J30k60k75L57l4q5O5l63K42J96q1L07
3724C30l36k25L26k02pK6p6K35Ol1O7j20J64k4Qj58n2J99k29k25M36l1J25k61
3748e5j48O6M54k18O8k81q6K21j69K52l48J86q1K65K5k68J94k36K11o9K25l53
3770a45K79Rm90M79k4J68l21k17J71q0L82n28N50k9m12L13M3K09j74k46l1J46
3792E2P9k97K82j78J55m62L15J06j60J00J40J5j23p0m4J49l90J87J20J7J26j59
3814d0r4l5r6N41k67K41m4l83M81l45J60k61J87j83J62N5M4p5j63M84k31k17L05
$$ plain form
3837 226 -122 197 -91 167 140 -172 -76 197 -79 -325 -34 -24 207 -41 19 184 220 -188 -12 -279 105 -33
3859 -33 79 -247 152 43 -285 77 -11 64 -234 -3 -54 146 123 205 -308 -90 -206 -158 -99 28 -146 -176 43
3882 43 -22 -132 -49 79 14 26 -227 -78 282 -102 -84 133 37 -119 76 86 136 80 -104 161 246 40 -196 -50
3906 -50 -185 90 195 -215 95 187 104 -133 -24 59 79 -123 26 -27 85 -14 16 -34 -153 -37 -232 -234 -268 -234
3930 -234 134 -172 -173 74 -202 66 -14 -87 -95 238 -65 208 -121 -320 283 -81 90 55 482 -123 2 117
3952 117 222 -162 29 118 252 -140 60 -58 12 445 -85 344 -67 204 -23 61 66 65 116 160 109 63 130 -167
3976 -167 129 -371 125 152 23 260 40 165 -224 34 150 -78 -166 136 -134 291 354 -191 -1 180 -5
3997 -5 29 217 31 116 -107 166 -294 46 -71 -127 -174 109 199 34 125 -88 -250 -91 -202 224 228 -38 -1 8
$$ packed form
3837B26l48L19k88K58k7l12R6K73k76k46K91J0K31k48O0J65L6m08J76k67L84j38
3859c3J12l26L99j09l28L62q8P5k98K31n1K00k3Q2n13K18j16M8N9J27j74l0K19
3882D3o5j10Q3J28o5J2k53J49L60l84J8K17r6j56J95J0N0n6j84K65Q5k06k36J46
3906e0j35K75J05m10L10R2q3k37J09Q3K0k02J49n3J12r9L0n0j19J16j95kl4L4
3930b34L68l06jK47k76K68q0p3qL33l03K73l29j99O03l64J71l5M27o05J25J15
3952A17J05l84J91Q9J34l92K00j18P0M33n30M29m11K71k27Q4NjN1M4n1m6O7k97
3976a67K96n00M96K7j29K37k20J25l89K58J16k28q8L02k70M25O3n45J90J81j85
3997eL4J88j86Q5k23K73m60L40j17n6m7K83R0j65R1k13j62J59j11M26Mk66L7R
$$ plain form
4021 8 2 -114 74 -174 57 -31 159 159 30 -114 -173 -393 127 -506 111 63 -228 -374 -11 -148 131 -353 -213
4044 -213 46 125 26 -159 212 -225 140 127 -34 105 147 112 34 -192 -54 -150 190 -161 244 151 89 164 185 -27
4068 -27 109 -14 -172 67 -164 90 -38 -37 145 -26 -195 -176 -223 -88 137 -56 -64 9 228 65 -76 27 79
4091 79 111 61 -167 126 144 304 -11 -7 -358 -239 135 354 -128 -234 -30 136 -9 51 -60 45 -271 39
4113 39 104 44 0 -463 -139 -29 -295 -127 142 85 -220 -27 -163 10 -100 -29 -11 -12 -292 -68 49 -153 50
4136 50 157 -1 -9 -54 -101 -80 -91 357 -32 -61 -104 -25 -129 -173 146 118 -87 -169 66 285 307 -49 152 115 99
4161 99 -352 162 61 98 7 -60 -101 79 140 -78 -84 -14 44 82 -83 -257 19 45 -233 13 -356 399 306 -198
4185 -198 126 -10 35 25 -85 -132 -29 -168 241 65 12 -49 -115 -256 -36 -195 159 -100 -56 277 -73 -82 -197
$$ packed form
4021Hoj16J88k48K31q8J90%j29j44n9k20N20o33O17m8k91j46L63j37K79m84J40
4044b13K59P9r9j85L71m37L65j3j61J39M2l5p8k26J38r6L40l51M05r3o2P5K1k12
4068b7J36j23j58K39k31K54j28JJ82j71j69J9m7J35K25j93qP3K19j63j41J03N2
4091G9L2n0k28K93J8J60l15Ml51J19L74K19m82j06K04J66j45O0j11J05l16L10
4113C9O5o0m4m63L24J10k66J68K69n7l05J93j36J73j10P1J8jk80K24J17k02K03
4136E0J07j58qm5m7K1j1M48l89k9m3P9j04m4L19k8k05q2K35K19K2l56K01l7j6
4161I9m51N14j01L7r1o7m1J80O1k18oP0N8L8j65j74K76K6k78K46l69P55r3n04
4185a98L24j36M5j0j10m7J03j39M09j76n3o1o6j41K20j59L54k59M4L33l50rj15
$$ plain form
4208 -197 -101 31 -50 -28 -122 -98 40 27 94 -127 75 36 88 -127 -19 -251 50 130 189 49 -36 -19 105 -65
4232 -65 146 112 106 50 98 -93 -140 -70 -325 -53 1 -141 -68 -248 17 -74 322 -188 120 -162 -77 47 -18 -216
4256 -216 193 45 -271 30 -188 -118 370 -113 119 -8 98 -36 171 248 -275 66 -45 -53 193 360 97
4277 97 -102 -83 -23 -229 -305 -160 67 -9 -86 148 -16 -296 -9 11 -65 -34 -40 101 111 -56 -102 75 -405 310
4301 310 -46 -86 -217 93 -227 -10 -321 121 -72 -131 295 204 32 -221 0 323 84 161 -92 7 136 -361
4323 -361 135 -71 -197 -181 -95 -141 -302 -211 -232 -56 -45 44 32 53 -129 202 96 34 95 114 -125 -32 -31 -57 166
4348 166 -201 -136 -194 39 70 77 -133 -29 53 98 60 -49 269 -108 234 21 129 -207 -178 -17 -74 -32 25 220
4372 220 -96 246 99 -201 -84 -40 -123 291 -161 -101 220 -61 139 -27 -33 -113 -68 182 263 316 195 93 265
$$ packed form
4208a97R6J32q1K2r4K4J38j3O7k21K02l9N2k15J08k32L01Q0N9j40q5J7J24j70
4232f5K11l4on6M8j91m7P0k55K72N4j42P3j80K65r1L96n10L08k82Q5J24o5j98
4256b16M09j48l16L01k18P0M88m83K32j27J06j34K07P7n23L41j11qK46J67k63
4277I7j99J9O0k06p6J45K27p6p7K34j64k80K87K0p6L1oJ41J0j67m6J77m80P15
4301C10l56m0j31L10l20K17l11M42j93n9M26r1j72k53K21L23k39P7k53R9J29m97
4323c61M96k06j26J6Q6m6j61R1k1J76J1Q9j2K1j82L31j06o2O1J9k39R3Jk6K23
4348A66l67O5n8K33L1Pk10J04Q2M5l8j09L18l77L42k13J08l36K9J61n7M2N7J95
4372B20l16L42j47l00J17M4q3M14m52O0L21k81K00j66oq0M5K50Q1N3j21j02J72
$$ plain form
4395 265 178 121 -61 -9 35 -57 -13 106 151 -137 -157 -119 44 -37 -38 -119 6 77 188 107 -6 104 170 -43 75
4420 75 133 -259 -132 -258 47 30 190 69 256 247 186 -50 -230 131 -110 38 -95 287 303 56 433 -224
4442 -224 220 -12 -216 -53 -115 135 83 -98 160 91 91 -60 -91 3 353 293 124 -106 65 -53 -431 -329 195
4465 195 120 -140 -54 127 -162 -50 74 -248 -110 -67 -4 -25 -248 -5 -136 -2 189 89 -11 -171 64 -265
4487 -265 247 32 49 209 -163 100 12 353 111 154 135 20 -30 -24 76 -208 123 25 -132 25 16 -177 -101 -47
4511 -47 153 215 178 -103 -215 180 -374 -126 -198 -34 149 -30 196 46 121 238 26 -96 -357 224 33 -53
4533 -53 -99 63 -86 -37 30 -84 -49 95 233 299 24 -110 -263 58 -37 -426 -81 -295 -93 -73 34 -40 97
4556 97 53 -167 -8 -108 119 22 -87 45 -66 0 51 -68 -117 -242 -172 -67 97 15 178 10 43 8 -35 212
$$ packed form
4395B65q7n7j82N2M4r2M4J19M5k88k0L8J63q1jq1J25P1J11q1j13J10O6k13J18
4420G5N8l92J27j26L05j7J60j21J87ro1k36j80L61k41J48j33L82J6k47L77o57
4442b24M44k32k04J63o2K50n2j81K58o9%j51l1R4L50o0j69k30J71j18l78J02N24
4465A95p5k60Q6J81k89J12J24l22J38M3O3k1k23K43j31J34J91j00j00j60K35l29
4487b65N12k15J7J60l72K63q8L41k42M3j9j15n0OJ00k84L31r8j57J57rj93P6N4
4511d7K00O2l7k81j12L95n54K48p2J64J83j79K26j50P5J17k12j22k61N81j91q6
4533e3m6J62j49M9O7j14L5J44J38O6k75j34j53L21r5l89L45k14K02K0J07p4J37
4556I7m4k20J59j00K27r7j09J32j11O6N1j19m9j25P0J05J64q2J63j68L3l5m3K47
$$ plain form
4580 212 -102 181 -82 -146 -162 -216 -68 -147 -540 36 185 -205 -157 -269 4 -149 -69 233 164 -36 -140 48
4602 48 10 -4 165 54 -121 -74 13 -166 36 40 235 382 78 -33 -145 341 193 39 155 -42 -137 -122 -236
4625 -236 4 -225 296 -24 -148 -122 68 -113 105 118 -72 -191 145 83 -63 -49 369 -70 157 -64 -76 264
4647 264 12 -212 -19 -194 -16 46 60 -198 135 88 58 -78 16 -65 39 170 -431 83 244 187 -99 63
4669 63 79 -243 -177 77 37 -48 -102 -166 -187 84 25 -17 74 272 -4 -117 178 75 4 165 -50 106 -150 -81
4693 -81 156 26 -15 -165 -193 234 22 191 -55 -83 -189 -73 25 116 -40 -171 75 -29 171 138 56 103 251
4716 251 128 -115 70 -22 49 -212 392 90 202 332 46 233 -92 20 53 -137 -99 209 -166 -80 -148 -342
4738 -342 22 -344 247 185 -222 82 164 314 95 152 -71 13 139 18 345 -324 156 35 229 -266 -137
$$ packed form
4580B12l14K83k63o4j6n4J48p9l93N76J49l90M8j12K73j53Q0L02o9k00j04J88
4602D8l8j4J69j11j75M7Q7j79K02MJ95J47l04j11j12M86j48j54J16j97r5J5j14
4625b36K40k29N21l20j24K6J90j81K18J3j90j19L36o2j46J4M18m39K27k21j2L40
4647B64k52k24J93j75J78O2J4k58L33m7l0j36R4q1J04J31o01N14J61n7k86J62
4669F3J6l22O6K54m0q5n4o4k1K71n9m2R1J98k76j13K95j03p1J61k15J56k56O9
4693h1K37j30m1j50k8M27k12J69k46k8j06J16R8R1j56j31K46j04K00l3q2M7J48
4716B51j23k43J85r2P1k61O04l02J12J30k86J87l25J12L3j90L8L08l75Q6o8j94
4738c42L64l66N91o2m07L04Q2J50k19N7k23Q4J26j21L27o69M80j21J94m95J29
$$ plain form
4759 -137 -184 -185 65 -156 96 -5 73 -401 45 4 7 -72 -184 112 113 -11 240 124 -119 36 151 128 -274 -4
4783 -4 73 56 195 -130 -131 -8 -261 154 109 126 68 326 -27 -101 -175 -197 -39 -71 -92 113 -184 -69 -112 -20 123
4808 123 207 -68 -99 100 -2 177 -407 -105 -7 -36 148 41 -80 28 91 9 -192 -108 -127 140 118 -47 42
4831 42 179 7 -217 289 27 -5 -78 -99 -24 -127 -31 22 -108 -83 14 29 -75 -138 -93 21 40 -17 17 -262 23
4856 23 -174 -204 71 -3 -209 147 156 -59 -46 -195 89 -117 224 13 -212 21 -167 230 -8 245 -129 -67
4878 -67 28 76 87 -303 81 35 124 -203 50 -115 34 -1 90 108 -61 -111 -20 148 -123 15 -75 -89 -324 -127
4902 -127 36 -33 -82 -124 47 382 64 196 -32 166 11 278 -74 32 367 -83 313 56 -30 55 88 -90
4924 -90 -54 121 -275 -63 216 -55 133 93 170 -37 6 -19 -66 323 57 -56 265 -34 -39 -222 13 174 114
$$ packed form
4759a37m7jK50k21K52j01P8m74M46m1Lp9j12K96Jj24K51j16k43J55J15k3m02K70
4783dP7j7J39l25jJ23k53M15m5J7n8K58l53p4p4k2J58l2k1K05k97J15m3R2J43
4808A23Q4k75l1J99j02J79n84L02R8k9J84j07j21J08O3q2k01Q4j9K67k2j65Q9
4831D2J37j72k24N06k62l2p3k1P5j03R6N3j30K5R7J5j04o3M5J14J9n7L4k79K85
4856B3j97l0K75p4k06L56Rk15J3j49K84k06L41k11k25K33j88L97k38K53l74O2
4878f7R5M8J1l90L84m6Q9l27K53j65J49l5R1J8j69n0R1J68k71J38r0j4k35J97
4902a27J63o9m9m2J71L35l18J32k28J98j55K67l52J06L35m50L96k57q6Q5L3j78
4924i0L6J75l96K12K79k71J88m0P7k07M3k5m7L89k66j13L21k99nj83K35J61o0
$$ plain form
4947 114 -41 -128 11 -56 -13 -80 138 -96 -252 -8 220 216 -74 -117 141 34 -21 -148 -255 131 59 -15 68 -109
4971 -109 -172 -144 52 74 -33 -78 -40 -5 -36 107 -17 -273 197 92 128 -92 83 48 158 11 -34 -33 116 46
4995 46 -69 -172 1 18 -201 -20 136 -149 -242 56 70 144 -59 8 243 -236 2 225 -151 55 -15 125
5017 125 34 334 53 -3 -155 -15 177 250 -3 -107 41 382 -133 -105 -30 207 111 125 234 -9 307 -273
5039 -273 -165 52 302 -117 102 3 161 38 222 90 -149 143 -312 74 -55 -258 41 39 -280 -33 22
5060 22 213 -64 107 -170 -216 -95 11 6 264 -111 54 217 -83 -193 -78 22 56 -102 -80 -522 -55 228
5082 228 -141 -56 -113 -291 205 46 -55 300 115 -128 55 -106 123 33 -198 -37 189 83 -248 -38 151
5103 151 -158 -330 -51 166 -170 -16 19 -102 251 187 105 -46 -98 18 193 129 280 -56 -66 20 -154 54
$$ packed form
4947A14j55q7J39o7M3o7K18k34j56K44K28mk90m3K58j07n5j27j07L86p2p4Q3j77
4971a09o3K8J96K2j07m5L8L5l1J43j24k56M70j05L6k20J75l5J10j47m5JJ49p0
4995D6j15j03J73J7k19J81J56k85r3K98J4P4k03O7K35m79K38K23l76K06p0J40
5017A25r1L00k81n6j52J40J92P3k53j04J48L41n15K8P5K37r6J4J09k43L16n80
5039b73J08K17K50m19K19r9J58j23J84j32k39K92m55L86j29k03K99kl19K47N5
5060B2J91k77J71k77m6J21J06nK58l75J65J63l00j10J15J00L4j58K2m42M67K83
5082B28l69Q5n7j78M96j59j01L55j85k43J83j61K29r0k31J61K26j06l31K10J89
5103A51l09j72K79K17l36J54L5j21L53o4q2j51n2J16J75o4J51l36j0Q6j74K08
$$ plain form
5125 54 -68 256 79 -286 181 -26 -46 51 32 -143 -1 -29 -165 -27 -232 83 -313 57 77 13 112 -505 5
5148 5 46 244 236 203 -68 18 82 -389 -43 -125 -18 -151 -184 172 -104 240 368 -134 147 90 -93 -121 -235 34
5172 34 204 9 -69 -51 109 -10 38 219 263 172 86 -269 -300 81 141 -259 -37 149 73 -159 106 174 115 -163
5196 -163 1 214 -109 103 264 63 86 -197 339 51 59 131 228 -73 172 68 -69 184 -176 -194 118 12
5218 12 -82 39 -22 51 176 67 281 103 -26 -78 87 -2 37 -40 -88 18 -221 38 29 -74 198 -48 136 203
5242 203 114 268 -108 41 -52 80 290 -108 288 43 -139 -32 1 135 323 43 161 44 -61 -84 -7 220
5264 220 146 -160 -95 452 120 60 112 -90 -118 66 -174 -55 -106 27 354 -101 55 23 -68 215 -173 -252 -140
5287 -140 4 19 323 43 -60 -57 78 205 -54 -42 -72 -190 271 -25 -25 300 119 50 83 -17 -97 -372 -10
$$ packed form
5125E4j22L24j77l65M67k07k0R7j9j75J42k8j36J38k05L15l96L70K0o4R9o17N10
5148EM1J98ql3k71Q6O4m71L46q2J07j33l3L56k76L44J28n02K81n7j83k8j14K69
5172C4J70j95p8J8J60j19M8J81M4r1q6l55l1L81O0m00K22J86p6k32K65O8n9k78
5196a63J64K13l23K12J61k01K3k83N36k88QP2R7l01K45j04j37K53l60j8L12j06
5218A2r4J21o1P3J25j09K14j78j29n2J65q9L9p7m8J06k39K59rj03K72k46J84O7
5242B03q9J54l76J49r3J32K10l98L96k45j82J07L3J34J88k80J18j17j05k3P7K27
5264B20p4l06O5N47l32o0N2k02k8J84k40J19n1J33L27m55J56l2r1K83l88p9J12
5287a40J44J5L04k80j03LJ35J27k59J2l0j18M61k96%L25j81o9L3j00q0k75L62
$$ plain form
5310 -10 -39 -132 -87 14 -37 177 -119 -43 242 11 -134 -212 -118 164 -187 -228 -271 61 -112 27 133 39 81 112
5334 112 -75 -216 -90 30 88 -71 15 -7 108 139 83 1 40 10 -251 95 -57 -94 65 65 -49 31 83 2 28
5359 28 -81 -13 14 90 96 259 298 9 76 136 -135 151 -26 215 205 -281 127 155 327 141 91 -15 93 -28
5383 -28 -231 -98 -50 55 43 252 79 80 71 -94 -123 55 130 121 130 -282 -84 5 28 -129 59 -132 247 143 -70
5408 -70 97 -9 205 -319 -124 161 18 175 -101 -17 127 52 23 -255 -18 150 -7 -272 62 -15 -226 17
5430 17 117 -39 10 77 -25 73 -94 -37 -38 -34 303 211 199 33 -137 204 -70 377 279 -201 -4 -302 152 -111
5454 -111 33 -155 -227 195 -113 -24 -31 -67 -29 96 -73 -114 68 160 85 59 -287 -149 162 -192 191 -59 87
5477 87 -9 -54 -124 45 -133 206 181 -78 -196 -351 104 -91 -110 -39 68 -109 -49 236 -33 75 214 -77 -13
$$ packed form
5310a0k9r3M5J01n1K14k96P6K85k31j45p8R4K82l51m1m3L32j73J39J06r4M2L1
5334A12j87j41J26J20N8j59Q6k2J15L1n6q2L9l0k61L46j52l7J59%j14Q0N2q1K6
5359B8j09O8K7P6OJ63L9k89O7O0k71K86j77K41j0m86M08K8J72j86n0j06J08j21
5383b8k03J33M8J05j2K09j73Jrj65k9J78P5rRm12J98Q9K3j57J88j91L79j04k13
5408g0J67j06K14n24J95K85j43J57k76Q4J44p5k9k78K37J68j57k65L34p7k11K43
5430A7J00j56M9O7j02R8j67N7jML37r2j2j66j70L41k74M47r8m80J97k98M54k63
5454a11J44j88p2M22l08Q9pl6L8J25j69m1J82R2p5k6l46J38L11l54L83k50J46
5477H7r6m5p0J69j78L39k5k59j18j55M55j95j9P1J07j77O0K85k69J08J39k91O4
$$ plain form
5500 -13 19 285 -198 -173 161 -52 -185 236 -335 44 -187 83 -123 -53 43 -11 -54 150 -410 -150 -11 -146
5522 -146 239 44 152 -9 -78 -6 93 225 220 -99 158 -48 142 -62 28 -89 -190 -90 210 237 -46 -17 -131
5545 -131 -140 122 -12 219 -33 194 135 176 139 274 -37 11 108 322 49 228 137 65 16 29 -6 3 -253 105 -14
5570 -14 20 101 -69 230 290 156 -62 -107 4 257 -331 206 157 88 295 31 -84 -23 44 50 -197 56 -111 331
5594 331 181 -294 -35 222 -89 -1 88 263 -112 -369 103 -170 154 237 95 -85 104 86 -92 -144 65 -144
5616 -144 -318 77 21 -41 -82 -158 180 241 -134 264 111 189 -83 20 -64 28 135 83 -49 119 -99 192 107
5639 107 -56 -24 146 81 -54 225 58 198 82 -139 -26 -231 -41 -100 278 178 -205 13 241 25 189
5660 189 -11 -182 -98 -155 -253 52 141 -8 99 100 -96 -165 23 -24 165 182 -32 -417 116 45 -163 2 423
$$ packed form
5500a3L2K66m83K5L34k13j33M21n71L79k31K70k06P0R6n4m3K04n60K60J39j35
5522a46L85j95J08j61o9P2R9J32nl19K57k06J90k04R0j17j01J00L00K7k83K9j14
5545a31rK62j34K31k52K27n9M1l7J35l11M8R7K14k73J79r1p2m9J3l5Rk56L58j19
5570a4L4Q1j70K99O0j34k18m5J11K53n88N37m9o9K07k64j15O1O7Ok47K53j67M42
5594C31j50m75K59K57l11Q8Q9J75l75k57M72k73L24Q3j42j80J89j8j78n2K09k09
5616a44j74L95n6o2m1p6L38O1l75L98j53P8k72J03q4R2J07n2j32J68k18K91q5
5639A07j63L2J70o5j35K79j67J40j16k21J13k05J90n9L78j00l83K18K28k16J64
5660A89k00j71Q4n7r8L05Q9j49J07Jj96o9J88m7J89J7k14l85N33p1k08J65M21
$$ plain form
5683 423 4 -206 -227 -44 48 -259 22 142 152 -44 239 1 -37 -140 -67 -80 157 -10 -143 155 76 89 -78
5706 -78 -159 -44 123 -89 -189 56 -254 -22 -147 -323 -19 -291 87 -133 325 -147 -209 211 -87 -289 72
5727 72 61 -75 120 210 77 -98 100 -178 -207 -29 112 -146 72 -54 -42 151 -77 -118 -84 181 294 -395
5749 -395 13 111 175 -77 -280 -66 -195 -12 49 -264 227 215 -146 -101 -56 52 -93 301 132 -78 119 -225
5771 -225 244 -191 -64 -82 46 62 204 61 -110 -4 -174 331 92 294 291 105 5 254 -131 -83 -33 45
5793 45 -146 256 -106 107 12 -68 153 -13 168 -59 29 -202 26 -66 -237 117 -97 -71 57 -21 -78 59 -142
5816 -142 -49 -22 20 31 179 128 97 -124 87 78 -38 -281 -171 156 141 -67 -6 185 -301 112 -104 169 -85
5839 -85 73 -44 -133 7 252 -19 -54 204 -28 -113 -21 35 -16 -86 -18 154 -65 -169 -127 -124 -150 238 -99 225
$$ packed form
5683D23m19k10k1J83R2l07K81J20J0j96K83k38l8j03P3j3K37j67j33K98p9J3j67
5706g8q1J15J67k12j00K45l10K32j25j76L04k72L78k20M58m72o2M20k98k02L61
5727G2j1j36J95R0j33j75J98k78k9J78J41k58K18j26J2J93k28m1L4K65J13o89
5749c95M08R8O4k52k03K14j29J83O1l13M91j2l61M5M5J08j45L94j69k10J97l44
5771b25M69m35J27j8J28J6J42j43j71J06j70N05k39K02lj86j00K49l85M8N0P8
5793D5j91M02l62K13r5q0K21j66J81k27Q8k31K28r2j71L54k14K6J28p8n7J37k01
5816a42R3K7M2J1J48n1l1k21K11rj16k43J10L27j5k08O1J91m86M13k16K73k54
5839h5J58j17q9J40K45k71l5K58k32q5R2N6n1p0O8J72k19j04M2Lk6L88l37L24
$$ plain form
5863 225 113 157 -35 -104 -12 -57 39 -45 -77 -31 27 143 -131 182 14 56 121 -347 97 582 83 -26 -139 -137
5887 -137 -195 -32 117 25 -41 46 39 -91 -5 101 237 -137 -47 -10 245 160 -168 -312 -143 -60 -12 97 -50 42
5911 42 64 246 38 42 54 318 11 97 182 -42 -1 185 -100 -73 97 -37 -248 -125 -238 -287 -204 37 -274 50
5935 50 -138 -82 143 148 -39 -152 79 -9 23 -88 -260 -114 40 -61 -130 162 179 53 197 1 -5 170 162 137
5959 137 -295 -116 -164 111 -67 -169 16 142 -313 -107 135 11 -248 -11 230 176 136 44 -124 62 147 54
5981 54 222 68 -271 17 -297 -3 -115 -275 -124 188 97 15 -106 39 -105 -209 99 140 142 81 32 80 123
6004 123 -65 0 -196 -147 -32 -74 -112 131 118 175 -127 43 324 110 403 132 326 129 -40 -68 79 122 -169
6027 -169 211 -129 54 -179 54 -235 141 -322 -128 256 250 -115 139 -64 -310 123 -103 -57 48 78 -64
$$ packed form
5863B25j12M4j92o9R2m5R6q4l2M6N8J16k74L13j68M2O5m68M44M85m99j09j13K
5887a37n8J63J49r2o6Q7pj30Q6J06J36l74R0L7K55q5l28j44J69Q3M8J09j47R2
5911D2K2J82k08MJ2K64l07Q6Q5k24M1J86k85K7J70j34k11J23j13m9Q3K41l11L24
5935E0j88N6K25Nj87j13K31q8L2j11j72J46J54j01o9K92J7j26J44j96oJ75qk5
5959A37m32J79m8K75j78j02J85J26m55K06K42j24k59K37K41n4m0r2j68J86Q5r3
5981E4J68j54l39K88l14K94j12j60J51L12r1q2j21J45j44j04L08M1Ko1m9M8M3
6004A23j88O5j96M9J15m2l8K43j3N7l02J70K81k14K93k71J94j97j69k8J47M3k91
6027a69L80l40J83k33K33k89L76m63J94L84ol65K54k03k46M33k26M6J05L0j42
$$ plain form
6048 -64 -62 17 -96 -258 -87 198 -289 34 257 -163 -216 58 70 90 -141 249 -16 24 48 -157 -335 -40 -17
6071 -17 -42 -15 -29 14 -164 202 64 -137 -256 203 248 -339 74 -30 -92 139 41 126 -48 110 6 -108 -79
6094 -79 250 17 36 -186 -26 123 -63 220 168 -6 -107 -196 -209 -232 -3 -48 114 28 115 110 -168 52 -14 -26
6118 -26 -22 -167 -84 -34 112 -53 25 101 -14 124 321 -239 -73 -73 -41 -278 183 392 78 -117 -154 -13 -8 -61 -118
6143 -118 132 7 126 -16 -51 70 96 -333 -45 218 287 202 -46 18 -195 298 116 182 24 130 78 76 -10
6166 -10 -5 -124 103 -103 255 326 201 7 157 165 116 -320 275 82 -52 -29 -186 -29 -77 68 -62 -1 94 -105
6190 -105 259 107 -296 -30 111 266 280 28 -127 -55 -239 -317 -1 -65 -236 -51 -43 46 -199 66 101 103 139 3
6214 3 225 229 -81 34 -30 -107 111 -176 251 64 33 195 20 -108 -159 209 222 168 -96 -69 -59 329 296 274 -320
$$ packed form
6048f4KP9j13j62J71K85m87L23K23m20n3K74J2K0k31L90k65M0K4k05j78K95K3
6071a7k5K7j4M3j78L66j38k01j19M59M5n87M13j04o2K31r8Q5j74J58j04j14K9
6094g9L29k33J9k22J60J49j86K83n2j74j01q9j3k3K29m5J62q6Q7nk78K20o6j2
6118b6Mj45Q3N0J46j65P8P6j15J38J97n60J66%L2k37M61K09l14j95l7J41Nn3n7
6143a18K50j25J19j42l5J21K6m29K88K63O9q5k48O4k13M93j82O6j58J06n2kq6
6166a0Nj19K27k06L58P1j25j94J50Qm9m36N95j93j34K3j57J57m8J45j30O1R5j99
6190a05L64j52m03K66J41J55J4k52j55P2j84p8L16o4j71J85QQ9k45K65L5KL6j36
6214CK22Ml10J15o4p7K18k87M27j87l1J62j75j28n1L68J3n4k64K7J0L88l3k2n94
$$ plain form
6239 -320 -122 -142 21 -73 -42 -140 -110 107 -54 240 -267 313 53 -137 91 51 -45 74 15 -88 -52 139 13
6262 13 134 -152 62 179 245 266 12 21 265 102 102 11 169 -180 23 199 130 -24 -109 -64 -363 -254 -150 -110
6286 -110 411 -56 -172 145 -22 -44 2 -112 -18 -197 206 83 -103 163 -79 -2 -105 100 337 28 156
6307 156 -145 -97 148 322 130 46 -110 18 228 197 -93 145 -131 5 72 40 14 98 41 118 137 175 70 150
6331 150 152 -224 371 9 28 16 -398 -12 -96 161 91 242 -202 88 240 58 236 -64 57 -251 132 -102
6353 -102 5 -45 262 -16 31 -84 -146 99 93 272 -7 -169 -54 58 -94 158 163 -9 -171 265 -49 -207
6375 -207 164 137 -181 9 -175 -75 107 157 -117 325 -99 13 170 2 -82 14 -45 -159 -49 -185 204 -309
6397 -309 38 -93 -184 -7 179 128 18 -26 7 100 113 -340 31 175 -89 -88 28 277 100 -9 -211 187 -47
$$ packed form
6239c20J98k0J63r4L1r8L0K17j61K94n07N80k60j90K28m0r6J19n9j03L6J91j26
6262A3J21k86K14J17O6K1k54RK44j63%r1J58l49K03J76o9j54q5M5k99J09J04M0
6286a10N21m67j16L17j67k2M6j14R4j79M03j23j86K66k42P7j03K05K37l09J28
6307A56l01M8K45J74j92q4j56J28K10l1k90K38k76J36O7l2k6Q4n7P7J9L8j05Q0
6331A50Kl76N95l62J9j2m14L86q4K57p0J51m44K90J52j82J78l00J21l08L83k34
6353a02J07n0L07k78M7j15o2K45oJ79k79j62J15J12j52K52Nj72j62M36l14j58
6375b07L71k7l18J90j84J00J82N0k74M42m24J12J57j68q4R6n9j14J10j36L89n13
6397c09L47j31r1J77J86n1j10m4L3R3J3m53L71J44k64JJ16K49j77j09k02L98k34
$$ plain form
6420 -47 -60 108 -287 3 -86 -312 -80 -60 152 28 -194 90 -26 -166 -157 281 -184 -201 -270 -8 272 234 120
6443 120 -38 -77 -9 116 219 -53 224 284 259 -73 -143 219 -254 -228 -20 -35 142 166 -104 -109 69 -72 74
6466 74 100 56 108 175 -12 150 -262 -187 39 -96 -290 -189 -134 -304 146 -87 -158 195 134 130 -26 -157 233 -126
6490 -126 -64 2 -294 -128 51 67 22 108 13 -2 86 68 -14 112 225 44 -74 17 -63 -46 -145 318 10 -75 -109
6515 -109 -51 77 45 78 56 -183 166 -221 91 -115 -116 40 -117 -21 12 171 -180 -27 -69 -5 13 -205 -170 185
6539 185 251 351 -322 -160 135 -191 217 -103 -60 -108 -54 -122 -444 -184 65 80 -243 125 43 -131 342 86
6561 86 11 -88 64 38 -63 -114 36 -154 18 72 -142 -138 -210 -23 8 -144 76 200 195 -6 174 254 62 225
6585 225 -44 -159 -130 107 -266 249 165 -21 90 -259 122 260 -210 -117 98 -56 -1 120 -26 110 169 -201
$$ packed form
6420d7j3J68l95K90q9k26K32K0K12j24k22K84j16j40RM38m65j7o9K62K80l8j14
6443A20j58l9O8J25J03k72K77O0k5l32p0L62m73K6K08j5J77K4k70nJ78j41J46
6466G4K6m4N2O7j87J62m12P5K26j35j94J01N5j70M50k33p1L53o1mj56j31L90l59
6490a26O2O6k96J66J79J6m5Q6r5j5Q8j8q2J26J13j81j18R1q0J7r9M63l08q5l4
6515a09N8J28l2L3k2k39L49l87L12k06jJ56j57R6L3J59l51J53m2O4J8k18L5L55
6539A85O6J00o73J62K95l26M08l20M3m8N4o8l22K60K49J5l23L68q2j74M73k56
6561H6p5r9J52k6j01n1J50j90J72N4k14Mp2J87L1j52K20J24nk01J80Q0j92J63
6585B25k69j15K9K37l73N15q4j86J11l49L81J38m70R3K15j54N5J21j46J36N9l70
$$ plain form
6607 -201 93 260 -412 64 52 -55 54 162 -143 -58 143 -88 -245 -92 120 -363 -77 188 -19 1 76
6628 76 72 56 114 -45 22 -178 286 264 68 55 -241 43 82 -239 305 -133 185 -36 -187 -86 -293 129 -45
6651 -45 97 -250 45 -199 97 83 233 20 -131 76 230 89 -42 41 -63 34 27 74 110 328 262 95 116
6674 116 -87 160 -218 4 142 50 -284 -19 45 -371 49 234 184 -32 191 14 65 56 -31 -208 -5 -86 -139
6697 -139 37 48 -106 -209 172 274 -2 31 334 9 43 197 200 -241 -8 131 123 -16 -207 236 -141 108
6719 108 73 -225 -119 141 90 -174 -89 -1 109 -158 16 354 238 235 72 26 47 -134 -217 -109 -163 -182 329 -241
6743 -241 274 169 14 73 -90 -203 238 6 290 -14 -38 -189 -42 -209 222 -110 -202 -94 254 202 167 20
6765 20 109 -3 155 234 1 56 303 378 62 31 27 -241 -150 166 164 -15 -139 -34 -162 -64 -144 -119 -49 -42 -72 248
$$ packed form
6607b01K94J67o72M76j2j07J09J08l05Q5K01k31j57J53K12m83K86K65k07K0P5
6628G6mj6N8j59O7k00M64k2j96j3k96K84L9l21N44m38L18k21j51J01k07M22j74
6651d5J42l47K95k44K96j4J50k13j51K07J54j41j31Q3j04R7pM7L6K18o6j67K1
6674A16k03K47l78K22J38r2l34K65O4m16M20J85n0k16K23j77N1rq7j77K03q1n3
6697a39J76J1j54j03L81J02k76L3L03l25L4J54Lm41K33J39qj39j91M43l77K49
6719A08l5k98J06K60n1k64Q5Q8J10k67J74L38j16lj63m6K1j81q3J08n4j9N11n70
6743b41N15j05j55N9j63j13M41k32K84l04k4j51J47j67M31l32r2J08L48n2l5j47
6765B0Q9j12J58P9k33N5K47P5l16l1mk68R1L16kj79j24J05j28R8q0K5P0Pl0L20
$$ plain form
6791 248 262 -122 -137 149 185 -186 34 -90 112 3 21 -111 -290 -47 -160 122 101 -171 43 131 -72 23
6813 23 219 -37 263 -354 29 64 16 -97 155 174 -143 -13 -103 180 -153 -205 -17 -214 29 202 -195 -3
6835 -3 -7 235 396 -94 -294 145 197 198 -211 214 137 -206 -155 -163 -64 -161 -43 -41 16 -88 9 197 -24 327 -96 -155
6861 -155 89 117 -239 -182 37 -276 -97 -94 58 -265 243 13 -46 94 55 -78 123 -125 -190 -160 -274 -81 -111
6884 -111 53 87 -48 192 213 -98 -39 173 142 46 68 361 6 -149 155 103 -105 -208 14 153 -298 -267 -158
6907 -158 193 -39 -75 59 285 -247 -6 63 -147 114 79 -171 169 -96 -208 -107 -94 131 0 250 -100
6928 -100 -72 -92 248 71 9 194 -127 220 -91 71 168 223 39 -77 302 66 -104 -74 -115 -350 -98 -122 -65
6951 -65 32 -216 -160 -161 197 247 27 -89 -167 -161 -183 102 -11 96 -267 83 105 -157 431 214 38 -19 -3 -46 -177
$$ packed form
6791B48J4l84j5K86L6l71K20j24K02j09J8j32j79K43j13K82k1k72K14Q8k03R5
6813B3J96k56L00o17L83L5m8j13K52J9l17J30r0K83l33n2J88j97K43J73l97J92
6835cmK42J61m90k00M39N2Jm09M25p7l43N1qR9r7J18KN7j04R7J88k21L51m23n9
6861a55K44K8l56N7K19l13J79LJ52l23N08k30n9J40l9j33K01k48o5L0j14J93l0
6884a11J64L4j35K40K1l11N9K12l1r6K2K93l55j55L04n2k08j03K22J39m51L1J09
6907a58L51k32l6J34K26n32K41O9k10K61l5k50L40k65j12J01J3K25j31K50l50
6928a00K8k0L40j77o2J85l21L47l11J62R7N5j84j16L79k36j70L0m1k35K52k4N7
6951f5R7k48N6jL58N0k20j16p8Ok2K85j13J07l63L50K2k62N88k17j76n7J6m3j31
$$ plain form
6976 -177 177 -81 -366 60 -153 -199 -211 48 -59 -46 -101 243 189 112 -44 -28 -202 -166 347 194 72 -6 -79
6999 -79 -62 176 16 -170 -220 -94 29 224 4 7 -189 -102 -49 31 -59 143 -165 -291 -28 -181 -47 -164 277
7022 277 217 130 44 -44 -278 -67 -303 -62 100 -122 -59 33 34 150 -196 56 96 135 147 180 154 -82 -144 -230 -142
7047 -142 266 18 -161 -121 191 99 -275 -211 177 -290 -1 125 281 17 252 219 -60 -19 -32 -266 122 62
7069 62 16 30 92 -297 414 -179 116 134 -166 64 52 174 -331 -134 233 4 -198 -88 36 -141 148 136
7091 136 -115 -56 -158 241 78 219 27 144 -135 237 14 132 -33 -111 -106 107 -171 156 95 -240 8 -47
7113 -47 120 255 95 4 -274 -81 -95 29 -67 -49 99 185 96 65 -148 6 177 -52 237 -225 -20 84 73
7136 73 154 368 -205 -50 55 147 -136 -362 -135 -62 20 -57 -12 -72 41 -193 -89 196 -43 123 -47 50 -37
$$ packed form
6976a77L54k58k85M26k13m6j2K59j07J3n5L44n4p7j56J6j74L6N13j53j22p8p3
6999g9J7K38j60j86n0J26J23J95k20Lj96Q7N3Q0r0K02l08j26K63j53J34j17M41
7022B77o0q7q6q8k34K11k36K41J62k22O3R2JJ16l46K52M0L9J2L3k6k36o2q6Q8
7047a42M08k48j79M0L12r2l74O4L88m67K89J26J56k64K35l3k79M1j3k34L88o0
7069F2m6J4O2l89P11n93K95J8l00K30j2J22n05J97L67k29k02J10J24j77K89j2
7091A36k51N9j02L99j63J41j92J17k79L72k23J18j65p8NK13k78L27o1l35K48n5
7113d7J67J35j60r1k78J93j4J24r6J8J48Q6q9l1k13J54J71k29K89m62K05J04j1
7136G3Q1K14n73J55J05R2k83k26K27P3Q2p7M5o0J13k34J04K85k39J66j70R7q7
$$ plain form
7159 -37 117 -42 57 53 -47 -195 136 95 -121 -81 17 -1 197 16 24 120 -244 -25 -241 -78 22 -21 -199 74
7183 74 -6 -58 80 76 63 -31 118 38 65 -49 -61 140 58 47 242 54 -257 -147 -53 -40 -179 14 -107 254 118
7208 118 -8 -20 45 96 -211 -195 190 -186 90 -57 85 121 51 27 221 -111 129 139 35 42 -287 -296 -178 -195
7232 -195 156 258 44 113 -55 101 140 -105 -11 -54 199 122 -76 71 263 -6 -262 -138 -169 117 9 -92
7254 -92 -215 -92 251 -39 -42 68 -96 -31 145 136 -84 55 -81 -92 -395 -127 43 -84 -215 91 -311 -275 45
7277 45 98 -224 9 -87 -79 -25 23 114 29 348 47 186 83 -150 -59 -196 -56 235 70 -314 -128 103 3
7300 3 45 12 -91 -23 -200 -222 139 -128 38 -120 157 -225 -152 -50 -83 -151 194 -110 98 198 194 -45 -68 -348
7324 -348 -18 -80 11 52 51 -7 -357 101 10 100 -121 54 119 65 64 -81 183 157 -203 148 -189 -65 28 23 -136
$$ packed form
7159c7J54j59R9mj00j48L31m1k16M0R8j8J98j81QR6l64K19k16J63J00m3j78K73
7183G4q0n2J38mj3r4J49q0K7j14j2K01q2j1J95j88l11J10R4J3j39J93j21L61j36
7208A18j26j2O5N1l07J6L85l76K76j47J42L6p0k4J94l32K40J0j04Pl29rJ18j7
7232a95L51J02k14O9j68J56L9k45R4m3K53p7j98J47J92k69k56J24l1K86j08j01
7254i2j23J23L43k90lJ10j64O5J76rk20J39j36j1l03K68J70j27j31L06m02L6L20
7277D5N3l22K33r6QN4M8R1q5L19l01J39j03k33R1j37J40K91j65l84J86K31j00
7300CM2l3j03O8j77k2L61k67J66j58K77l82P3J02l3o8L45l04K08J00mk39k3k80
7324c48L30o2R1M1jn8l50M58r1R0k21J75O5n4jj45K64k6l60L51l37J24R3nj59
$$ plain form
7349 -136 178 -77 -221 157 -6 -40 -268 8 255 0 70 -38 99 275 -11 -35 -48 -60 -57 59 116 -17 45
7372 45 -108 346 69 157 43 -48 161 163 -96 -72 -176 -170 -83 105 129 53 -362 -86 -103 209 -281 -77 239 -108
7396 -108 19 196 173 201 -189 48 -59 -116 1 15 -23 -149 -295 -33 -12 66 -84 106 -175 14 62 -214 128
7419 128 -21 16 -73 -153 -205 -13 82 33 76 -286 71 -101 -112 -202 -162 -240 -171 -41 -20 15 140 109 30 7 -23 117
7445 117 -165 103 123 276 -84 -54 40 54 -20 -221 211 139 123 33 -37 -60 73 -40 -312 206 61 -146 226
7468 226 141 210 73 -14 -88 -6 63 -106 -30 -134 -110 213 122 75 -318 265 -109 11 -158 -27 257 -306 -76
7491 -76 96 113 233 20 4 211 -115 241 -33 -193 58 230 6 -117 152 -23 281 -191 -143 246 -270
7512 -270 256 -48 -209 -59 182 -126 -221 -63 -147 27 -334 33 70 -291 74 -61 335 6 -50 19 -16 -29
$$ packed form
7349a36L14k55j44L78j63l4k28K76K47k55P0j08J37J76k86k4j3j2LJ16N7j33O2
7372D5j53M54k77Q8j14r1K09Kk59K4j04OQ7J88K4p6m15K76j7L12m90K04L16l47
7396a08J27J77k3K8l90K37j07n7J17J4l8j26j46K62K1P8j50J90k81J89M8k76L42
7419A28j49L7q9q0n2J92R5m9M3l62L57j72j1r0M0p8O9J30K1L5J25l1p9k3l0J40
7445A17k82K68K0J53l60L0R4J4p4k01M32p2j6r0p0k3J33j13k72N18j45k07L72
7468B26q5O9j37q7p4Q2O9j69P6j04K4L23r1m7l93N83l74J20j69J31K84n63K30
7491g6J72J7J20k13j6K07l26L56k74j60K51J72k24j23K69j75L04m72M8L89n16
7512b70N26l04j61J50K41l08r5J58q4J74l61L67L7l61L65j35L96l29n6O9l5j3
$$ plain form
7534 -29 -52 -93 156 -38 2 188 -102 64 163 104 -192 94 292 -194 46 -139 -91 176 26 87 -100 208 -310
7557 -310 -129 131 31 -43 239 -1 -348 55 11 180 -139 198 192 113 -185 -4 -85 41 -118 -46 -145 159 258
7580 258 -90 -3 -310 -85 194 -106 -185 25 242 74 104 200 -71 50 -17 -38 -116 148 116 -105 -175 79 -127
7603 -127 248 -27 179 -260 287 225 -306 -211 161 -95 93 -95 -119 25 50 155 -79 315 212 57 -55
7624 -55 201 -137 -13 65 -3 -99 -222 46 -144 -343 61 -253 29 -104 -96 95 -220 -14 -19 -65 -16 115 76 132
7648 132 -123 230 -19 125 -196 -291 -183 58 46 217 -260 -99 129 48 -45 -158 353 303 191 129 -37 95
7670 95 -103 -135 -126 -37 -16 139 -267 -43 8 -128 227 17 6 -103 209 61 101 -42 -100 76 218 -116 43
7693 43 371 77 118 -64 3 -140 -160 140 -30 -31 -260 190 25 -63 32 -258 -68 56 -92 -89 -244 -227 -215 -126
$$ packed form
7534b9k3m1K49j94M0J86k90J66R9n9k96K86J98m86K40j85M8K67j50O1j87L08n18
7557c10J81K60j00p4K82k40l47M03m4J69l19L37op9k98J81q1J26j59P2r9L04R9
7580B58l48Q7l07K25K79l00p9K10K17j68L0R6k71J21o7k1p8K64l2k21p0K54k06
7603a27L75k75K06m39N47o2n31R5L72k56J88j88k4J44K5J05k34L94j03j55j12
7624e5K56l38J24P8o8r6j23K68j90j99M04l14K82j33QJ91l15K06nm6M9J31l9N6
7648A32k55L53k49J44l21r5J08K41j2J71m77J61K28q1r3j13N11n0j12o2j66J32
7670I5j98l2RQ9K1J55m06K24N1j36L55k10j1j09L12j48M0j43n8J76J42l34J59
7693D3L28k94M1j82O7j43k0L00j70jk29M50j65q8R5k90J90J24j48Lj55J7J2Q9
$$ plain form
7717 -126 309 -304 -28 158 -83 39 -65 -60 -90 219 142 -144 42 -57 18 -51 -134 206 -137 -210 80 -193 -183
7740 -183 -216 14 130 -89 2 79 27 -68 89 -24 -103 210 -240 -11 84 193 -50 -244 152 -55 -9 -8 225
7763 225 201 -91 161 -97 223 -178 172 -163 124 18 -136 22 4 3 -26 -106 -172 -41 -5 269 126 -144 -80
7786 -80 -33 -63 4 375 236 79 -4 43 59 -26 -123 -45 132 -98 -166 230 -86 77 390 -153 70 -130 -67 -105
7810 -105 -169 46 -63 104 -109 -273 241 230 -263 127 -142 414 -96 -144 -208 -47 115 -152 40 14 95 82
7832 82 -90 -251 -63 -220 -37 -120 -140 -154 -179 78 -360 -72 -163 -9 20 -12 30 14 15 -50 -160 263 11 -233
7856 -233 110 440 -191 -83 -18 150 -3 -87 -59 -160 156 -120 -289 -235 98 375 -158 -43 -284 -66 -19 -88
7878 -88 -15 -84 145 253 19 -69 88 182 -2 30 173 -174 -128 -74 20 126 176 -14 114 -173 -129 -28 -104 -366
$$ packed form
7717a26M35o13K76J86k41J22j04Nl0L09p7k86J86r9P5o9q3L40l43p3K90k73J0
7740a83l3K30J16k19R1P7n2r5J57j13p9L13m50K29R5J09k43j94L96k07M6JK33
7763B25k4k92K52k58L20m01L50l35K87j06j54J58j8jk9q0o6J31L6K74j43k70O4
7786h0M7l0O7L71j39j57q3M7J6q5r7P8J77k30o8L96l16J63L13n43K23k00O3l8
7810a05o4K15j09J67k13j64N14j1m93L90k69N56n10m8o4J61J62k67J92k6Q1j3
7832H2j72j61J88j57J83q3k0j4k5K57m38K88r1J54K9l2M2j6Jo5j10M23k52k44
7856b33L43L30o31J08O5J68j53q4K8j01L16k76j69N4L33K77n33J15k41K18M7o9
7878h8P3o9K29J08k34q8J57R4j84L2J43l47M6N4R4J06N0j90J28k87M4J01p6k62
$$ plain form
7902 -366 -192 177 47 -53 -33 139 105 -54 -25 204 -163 86 57 -178 105 -100 246 123 107 -11 36 -303
7924 -303 -249 66 209 -47 234 39 -4 -61 -211 -29 113 145 -57 -132 -263 138 -95 215 58 105 -122 75
7946 75 -85 52 173 -181 148 -135 -135 363 -217 -235 -30 -60 211 139 10 -103 -8 -93 -60 206 202 103 -211 6
7970 6 -143 -51 199 -310 -99 -165 106 -154 21 84 54 244 -98 -13 -102 127 -26 170 -35 -164 -224 126 41
7993 41 -177 -116 -271 -98 76 158 189 -10 -130 74 174 58 -192 40 -94 -361 63 -52 301 -193 -221 74
8015 74 -365 154 233 159 45 -258 -128 5 -30 -179 7 109 -274 38 79 -16 128 -218 100 -190 13 26
8037 26 247 15 160 70 -46 11 1 230 -127 35 -127 -144 12 197 -226 -46 225 -29 57 -150 29 196
8059 196 -61 226 -209 -12 -175 45 220 49 -47 -6 -262 67 -268 52 -120 -127 57 85 63 -147 115 87
$$ packed form
7902c66J74L69j30j00K0J72l4j59K9K29l67K49k9k35K83k05L46j23j6j18M7l39
7924c03N4L15J43k56K81j95m3n7j50J82J42L2k02p5j31M01k33L10j57M7k27J97
7946G5j60J37J21l54L29k83%M98n80j8K05l0K71p2j29j13R5q5L3K66mr9l14K17
7970Fj49R2K50n09K11o6K71k60J75O3l0J90l42Q5q9K29j53J96k05j29o0L50q5
7993D1k18O1j55J73J74Q2L1j99j20K04J00j16k50K32j34k67M24j15L53m94k8K95
8015G4m39N19P9p4j14l03J30J33l5j49J86J02l83L12M1r5J44l46L18k90K03J3
8037B6K21k32J45r0j16N7j0K29l57J62j62j7J56J85m23J80K71k54Q6k07J79J67
8059A96k57K87m35J97j63K20J75j71r6M1k56L29l35L20j72pJ84K8k2k10K62k8
$$ plain form
8081 87 23 103 395 142 -119 -161 146 -40 216 -117 -133 73 114 93 -82 247 193 215 215 83 108 204 150 13 71
8106 71 87 237 105 200 198 -284 486 405 311 -11 -59 207 66 -54 8 -5 -60 31 82 -74 -42 -48 -103 9 228 -53
8132 -53 -79 -10 -50 68 -17 -126 140 -273 -81 -51 62 59 -42 -45 -175 -177 -256 49 149 176 204 -61 102 -42 -176
8157 -176 140 -43 209 11 210 -104 -83 -1 97 39 81 3 -251 165 182 -203 -218 62 232 108 -165 17 88
8180 88 187 136 -111 24 -146 351 51 -103 184 -8 -170
$$ packed form
8081H7o4Q0K92k53k61m2L07j86K56l33j6K06M1k1j75L29n4K2%j32K5R6n4j37N8
8106G1J6J50j32R5km82P70q1r4l22m8K66j41j20O2j3n5R1N1j56L2on5J12K19k81
8132e3k6O9m0J18q5j09K66m13J92L0J13lj01lj30kp9L05J00K7K8k65J63j44j34
8157a76L16j83K52j98J99l14K1Q2R8n8M2p8k54M16J7l85j5K80J70j24k73J82P1
8180H8R9n1k47J35j70M97l00j54K87j92j62
8191a70
$$ Imaginary data points
##PAGE= N=2
##DATA TABLE= (X++(I..I)), XYDATA
$$ plain form
0 0 0 0 0 8 -8 8 -16 16 -24 32 -34 40 -56 64 -83 103 -120 143 -174 200 -235 275 -317 366 -423 480 -551
27 -551 625 -705 798 -902 1008 -1134 1268 -1414 1576 -1753 1944 -2160 2393 -2650 2936 -3249
43 -3249 3597 -3988 4423 -4917 5478 -6123 6876 -7765 8833 -10148 11817 -14004 17024
56 17024 -21480 28754 -42746 79854 -391256 -1137138 -885788 -386721 136453 119391 -216637
67 -216637 -621402 -657934 -409404 -92353 -66351 -291178 -555290 -529162 -224327 141164 226720
78 226720 -18110 -399856 -569739 -409363 -56248 163675 82084 -225152 -472866 -467375 -231885
89 -231885 -361 30326 -153609 -360259 -396071 -215818 30711 158258 97092 -48580 -118754
100 -118754 -35196 128441 234368 205406 97780 34270 92523 229719 328026 298884 162581
$$ packed form
0@%%%Qj6J6k4L2m0N6o6P4r6J20j47J86k23K63l17L74m35N10n92O83p89R03j031
27e51J176j330J503j700J910k142K402k682K990l329L697m104M553n043N586o185
43c249O846p585Q411r340J0395j1601J2999j4641J6598j8981K1965k5821L1028
56A7024l8504N0234p1500J22600m71110p45882K51350M99067N23174j7062l36028
67b16637m04765l6532K48530L17051K6002k24827k64112K6128L04835L65491Q5556
78B26720k44830l81746j69883J60376L53115K19923q1591l07236k47714N491K35490
89b31885K31524L0687j83935k06650l5812J80253K46529J27547o1166j45672p0174
100a18754Q3558J63637J05927k8962j07626o3510N8253J37196R8307k9142j36303
$$ plain form
111 162581 23558 -20592 41548 135869 176451 138608 69688 36669 63563 115964 139915 116618
123 116618 75891 65015 103464 164838 204642 199010 162787 130950 125111 137997 145850 134061
135 134061 110226 89706 80616 71128 46130 4111 -37708 -59906 -57594 -45395 -42535 -53593 -64092
148 -64092 -62016 -47167 -36084 -43975 -65102 -76047 -57907 -17017 17022 15288 -22232 -63523 -74094
161 -74094 -48439 -16489 -16348 -57069 -109836 -130719 -105141 -60529 -43867 -77354 -134233 -163129
173 -163129 -132297 -63041 -12092 -20028 -74545 -118337 -100971 -26894 47547 62437 10192 -56813
185 -56813 -71315 -14527 67599 103264 58599 -28817 -83509 -59254 20763 82790 70112 -6299
197 -6299 -77686 -78670 -6769 75246 96636 40411 -38579 -65635 -10967 82011 135984 108501 28345
$$ packed form
111A62581j39023m4150O2140R4321M0582l7843o8920l3019K6894N2401K3951k3297
123A16618m0727j0876L8449O1374L9804n632l6223l1837n839J2886P853j1789
135A34061k3835k0520r090r488k4998m2019m1819k2198K312J2199K860j1058j0499
148f4092K076J4849J1083p891k1127j0945J8140M0890L4039j734l7520m1291j0571
161g4094K5655L1950J41m0721n2767k0883K5578M4612J6662l3487n6879k8896
173a63129L0832O9256N0949p936n4517m3792J7366P4077P4441J4890n2245o7005
185e6813j4502N6788Q2126L5665m4665q7416n4692K4255Q0017O2027j2678p6411
197f299p1387r84P1901Q2015K1390n6225p8990k7056N4668R2978N3973k7483q0156
$$ plain form
210 28345 -30998 -15504 60201 128218 128561 61074 -14944 -35459 11909 79204 102483 57185
222 57185 -18291 -60926 -36933 28018 73505 59842 148 -51927 -51132 435 56266 67739
234 67739 28067 -25380 -44782 -15586 35221 60187 37756 -12102 -46762 -39674 -1587 30023
246 30023 24503 -13669 -52020 -59254 -33159 -326 8711 -14041 -46605 -59498 -41510 -8370 11367
259 11367 2579 -23556 -41587 -35213 -9799 12238 12837 -6939 -27399 -30129 -14216 5765 11673
272 11673 -2122 -21835 -30716 -21275 -3200 7131 1990 -13266 -23283 -18656 -2976 10400 11515
285 11515 1814 -8538 -9092 2029 15557 21322 15793 5157 -1254 2387 11939 19579 19189 11452
299 11452 2504 -754 3320 10851 15218 12983 6497 444 -444 4493 11055 14680 12283 5835 799
$$ packed form
210B8345n9343J5494P5705O8017L43o7487p6018k0515M7368O7295K3279m5298
222E7185p5476m2635K3993O4951M5487j3663n9694n2075P95N1567N5831J1473
234F7739l9672n3447j9402K9196N0807K4966k2431m9858l4660P088L8087L1610
246C0023n520l8172l8351p234K6095L2833R037k2752l2564j2893J7988L3140J9737
259A1367q788k6135j8031O374K5414K2037N99j9776k0460k730J5913J9981N908
272A1673j3795j9713q881R441J8075J0331n141j5256j0017M627J5680J3376J115
285A1515r701j0352n54J1121J3528N765n529j0636o411L641R552P640l90p737
299A1452q948l258M074P531M367k235o486o053q88M937O562L625k397o448n036
$$ plain form
314 799 1002 6884 14503 16236 11214 2353 -3257 -1117 6807 13686 12867 3959 -6641 -10428 -4392 5661
330 5661 11100 6629 -5335 -14784 -13791 -3778 6709 8851 347 -11300 -15811 -9701 2093 9240
344 9240 5689 -6177 -15353 -14618 -4724 6104 7687 -970 -12252 -16972 -10841 928 7850 3994
358 3994 -6744 -15703 -15305 -5567 5171 7782 803 -8849 -13071 -7960 1937 8542 6464 -1732 -8668
373 -8668 -8863 -2014 6219 8924 3717 -3868 -7418 -4197 3109 8210 6458 696 -4890 -4549 703 6185
389 6185 7939 4427 -1148 -3714 -1207 3688 7408 6369 2478 -1256 -1334 1500 5008 5760 3333 369
405 369 -430 513 3145 4123 2615 630 -601 -36 1726 2508 1781 208 -1078 -309 1049 2005 1310 -664
423 -664 -1601 -922 445 1142 1337 -639 -2251 -2027 -691 695 634 -925 -2391 -2896 -1342 606 1151 -536
$$ packed form
314G99K03N882P619J733n022q861n610K140P924O879q19q908j0600l787O036J0053
330E661N439m471j1964r449R93J0013J0487K142q504j1647m511O110J1794P147
344I240l551j1866r176P35R894J0828J583q657j1282m720O131J1769O922l856
358C994j0738q959L98R738J0738K611o979r652m222N111R897O605k078q196o936
373h668j95O849Q233K705n207p585l550L221P306N101j752n762n586L41N252N482
389F185J754l512n575k566K507M895L720j039l891l734p8K834L508P52k427k964
405C69p99R43K632R78j508j985j231N65J762P82p27j573j286P69J358R56o95j974
423f64r37O79J367O97J95j976j612K24J336J386o1j559j466n05J554J948N45j687
$$ plain form
441 -536 -2431 -3808 -2609 -662 895 811 -1585 -2990 -3158 -1519 910 1834 339 -2073 -3656 -2936 -620
458 -620 1512 1344 -380 -2314 -2904 -1496 828 2069 923 -857 -2038 -2038 -237 1779 2100 967 -1151
475 -1151 -1819 -758 1100 2601 2383 343 -1122 -1482 10 1588 2322 1901 209 -1223 -1241 250 1938
492 1938 2368 1323 -558 -1164 -592 940 1901 1889 828 -764 -1299 -173 768 2081 1318 70 -992
509 -992 -1088 2 1073 1557 566 -326 -1146 -928 36 765 722 50 -894 -1067 -337 396 987 461 -593 -1222
529 -1222 -1235 -423 352 556 52 -525 -953 -1132 -227 323 187 -53 -656 -1067 -459 -254 -8 313 -301 -375 -583
550 -583 -111 -157 109 -63 160 -20 -120 -365 -56 -105 -371 -150 62 -116 -500 -144 116 109 322 177 49 -245
572 -245 -285 364 594 611 478 -4 -41 2 230 824 631 344 -7 -437 -274 229 651 557 89 -431 -811 -300
$$ packed form
441e36j895j377J199J947J557q4k396j405j68J639K429R24j495k412j583P20K316
458f20K132j68j724j934n90J408K324J241j146j780j181%J801K016L21j133k118
475a151o68J061J858J501k18k040j465l60J492J578P34m21j692j432j8J491J688
492A938M30j045j881o06N72J532R61j2j061j592n35J126R41J313p63j248j062
509i92r6J090J071M84r91q92q20K18R64P29m3o72r44j73P30P33N91n26j054o29
529a222j3Q12P75K04n04n77m28j79R05N50j36k40o03m11O08K05K46L21o14p4k08
550e83M72m6K66j72K23j80j00k45L09m9k66K21K12j78l84L56K60pK13j45j28k94
572b45m0O49K30J7j33m82l7M3K28N94j93k87l51m30J63N03M22r4m68n20l80N11
$$ plain form
594 -300 480 1018 885 212 -605 -1093 -221 808 1136 1091 -247 -1093 -780 191 1434 1469 127 -893 -1401
613 -1401 -911 823 1667 919 -819 -1989 -1704 74 1440 1709 217 -1978 -2177 -901 1298 2422 1806
630 1806 -556 -2339 -1870 278 1697 2107 464 -1640 -2578 -1279 1227 2040 1486 -600 -2414 -1931 -160
647 -160 1936 1903 269 -1476 -2326 -1089 1487 2394 1956 -342 -1841 -1816 -4 2234 2428 768 -1336
664 -1336 -1988 -981 973 1963 1405 -531 -2121 -1752 -554 1603 1582 142 -967 -1553 -563 988 1925
681 1925 1091 -543 -1422 -951 434 1611 1495 44 -1165 -1704 -158 1030 1249 709 -845 -1639 -822
698 -822 601 1086 876 -552 -1186 -1099 354 784 886 -103 -634 -578 335 920 994 382 -557 -668 -271 420
718 420 799 362 -472 -844 -540 34 502 518 -221 -795 -935 -344 597 511 -20 -227 -538 -137 503 514 266
$$ packed form
594c00P80N38j33o73q17m88Q72J029L28m5j338q46L13R71J243L5j342j020n08
613a401M90J734Q44p48j738j170K85J778J366K69j492k195j99J276K199J124o16
630A806k362j783M69K148J419M10j643k104r38J299K506Q13n54k086j814M83J771
647a60K096l3j634j745q50J237K576R07m38k298j499K5J812K238J94j660k104
664a336o52J007J954R90n58j936j590L69J198K157k1j440j109n86R90J551R37
681A925q34j634q79M71J385J177j16j451j209n39J546J188K19n40j554p94Q17
698h22J423M85k10j428o34Q7J453M30J02r89n31N6R13N85P4o12r39j11L97O91
718D20L79m37q34l72L04N74M68J6p39n74j40N91R41q6n31k07l11M01O40J1k48
$$ plain form
739 266 245 -437 -417 161 440 618 125 -562 -613 -472 225 773 334 -224 -780 -932 -270 460 571 249 -549
760 -549 -696 -96 464 550 701 190 -391 -661 71 608 745 264 -122 -545 -458 104 435 251 27 -692 -177
781 -177 -82 471 725 99 -124 -550 -598 38 631 596 407 -548 -639 -593 327 481 206 -69 -683 -457 -195 203
803 203 375 -203 -290 -793 -468 212 261 464 -153 -659 -400 162 712 826 87 -303 -568 -669 452 930 348
824 348 -163 -659 -501 -7 529 601 -84 -661 -866 -260 336 666 157 -307 -1098 -477 237 732 322 259 -500
845 -500 -667 -31 470 689 420 -568 -703 -222 514 680 749 -320 -881 -509 -25 635 955 109 -584 -702
865 -702 -231 284 749 547 -8 -711 -548 143 587 852 328 -302 -1005 -501 199 735 512 28 -895 -603
885 -603 -397 558 581 466 -454 -929 -143 287 628 418 226 -670 -789 -307 456 864 685 -162 -848 -384 28
$$ packed form
739B66k1o82K0N78K79J78m93o87n1J41O97N48m39n58n56j52O62P30J11l22p98
760e49j47O00N60Q6J51n11n81k70P32N37J37m81l86m23Q7N62L31j84k24p19N15
781a77R5N53K54o26k23m26m8O36N93l5j89r55r1M6R20J54k75k75o14K26K62L98
803B03J72n78q7n03L25O80M9K03o17n06K59N62N50J14p39l90k65j01J121M78n82
824C48n11m96J58M94N36P2o85n77k05O06N96L30n09m64p91O21P14M95m10o3p59
845e00j67O36N01K19k69r88j35M81P36J66O9j069n61L72M84O60L20q46o93j18
865g02M71N15M65k02n55p03J63O91M44K65n24o30p03N04P00N36k23m84r23K92
885f03K06R55K3j15r20m75P86M30L41k10j92q96j19M82P63M08j79q47o86M64M12
$$ plain form
906 28 621 732 24 -803 -903 -96 475 689 429 -147 -647 -419 123 370 622 329 -506 -514 33 423 755
927 755 595 101 -528 -439 27 668 661 69 -372 -344 -276 77 287 612 50 -478 -584 -21 129 475 -147 -466
949 -466 -657 -254 278 733 551 -53 -436 -487 200 676 395 312 -516 -669 -203 141 452 198 -57 -638 -550
970 -550 -299 148 350 -80 -332 -282 -374 16 351 297 -231 -620 -197 -2 367 113 154 -644 -270 -398 493 210
992 210 90 -338 -270 -144 -281 324 46 -126 -262 -218 -170 21 152 256 104 -138 -67 312 -53 101 -179 -204
1014 -204 -14 71 429 37 -304 -84 -50 39 296 440 86 -162 -75 -142 103 28 -58 -119 44 54 203 -131 160
1037 160 -314 -294 -146 122 85 275 -80 -195 -187 -158 288 165 51 -162 -320 -245 257 248 206 2 -122 -627 192
1060 192 22 95 446 -141 -370 -31 150 140 -197 -240 -203 82 -13 423 -38 203 -249 -298 -67 52 225 21
$$ packed form
906B8N93J11p08q27j00Q07N71K14k60n76n00K28N42K47K52k93q35qN47L90L32
927G55j60m94o29Q9M66O41pn92m41K8O8L53K10L25n62n28j06N63J50L46o22l19
949d66j91M03N32M55j82o04l83n1O87M76k81q3q28j53M66L44L11k54k55n81Q8
970e50K51M47K02m30k52N0r2L90L35n4n28l89M23J95L69k54M1p98L74j28Q91k83
992B10j20m28O8J26j37O05k78j72j36M4M8J91J31J04j52k42P1L79l65J54k80k5
1014b04J90Q5L58l92l41K20L4Q9K57J44l54k48Q7o7K45p5q6o1J63J0J49l34K91
1037A60m74K0J48K68l7J90l55j15QK9M46j23j14k13j58P5N02rm2k04j24n05Q19
1060A92j70P3L51n87k29L39J81j0l37m3L7K85r5M36m61K41m52m9K31J19J73k04
$$ plain form
1082 21 150 71 -165 35 129 86 78 68 -314 6 -11 -223 -96 113 134 -171 -373 -62 -61 -27 -18 -250 -44 -49 249
1107 249 -15 -180 17 -70 6 -10 -114 170 -125 110 -113 226 -29 194 205 271 -74 -276 -70 29 -241 52
1129 52 -68 -150 16 -83 131 110 124 108 -147 -139 -2 175 -195 -290 -467 -132 182 -34 206 -42 -112 -92 -11 -32
1153 -32 209 -84 111 -254 179 -78 71 73 -203 -116 284 116 98 33 304 -107 -143 -53 -78 457 356 -320 -72
1176 -72 86 33 178 -107 235 -249 -202 -139 439 427 120 -104 -88 -18 404 -99 436 -134 -42 -393 -174 167 55
1199 55 -161 -63 94 -13 -70 144 21 63 -66 -199 62 0 464 101 -177 -248 -124 42 -99 -81 8 136 -314
1222 -314 -58 81 -18 117 -32 -15 219 -140 160 289 -24 -15 -58 -281 -44 -81 -46 -113 104 -185 -27 171 -169
1245 -169 -475 229 -20 238 66 -1 -189 -19 -31 -78 35 -63 154 -142 25 153 -116 -147 29 112 -90 86
$$ packed form
1082B1J29p9k36K00R4m3qj0l82L20j7k12J27K09K1l05k02L11JL4Rk32K06nK98
1107B49k64j65J97q7P6j6j04K84k95K35k23L39k55K23J1O6l45k02K06R9k70K93
1129E2j20q2J66r9K14k1J4j6k55QJ37J77l70r5j77L35L14k16K40k48p0K0Q1k1
1153c2K41k93J95l65M33k57J49Kk76Q7M00j68j8o5K71m11l6R0k5N35j01o76K48
1176g2J58n3J45k85L42m84M7O3N78j2l07k24J6P0M22n03N35n70R2l51K19L41j12
1199E5k16R8J57j07n7K14j23M2j29j33K61o2M64l63k78p1J24J66j41J8Q9J28m50
1222c14K56J39r9J35j49J7K34l59L00J29l13Rm3k23K37l7L5o7K17k89J58J98l40
1245a69l06P04k49K58j72o7j88J70j2m7J13r8K17k96J67J28k69l1J76Q3k02J76
$$ plain form
1267 86 110 -48 58 23 -10 -245 -283 80 -164 -102 160 141 443 261 -24 -8 -108 -41 -283 -60 -51 -277 -200 -34
1291 -34 -13 247 -223 -85 151 83 71 -43 -74 284 -172 269 83 -128 137 -147 93 -154 -305 -329 -15 192
1313 192 17 -112 -186 -41 95 -207 25 204 114 -3 -129 52 214 -67 263 16 10 -64 -38 144 36 52
1335 52 -250 -20 196 -252 73 230 -281 56 27 -87 203 164 -29 123 41 -85 -109 255 345 -149 -170 -280
1357 -280 190 365 157 220 -170 -66 -23 153 39 267 246 22 20 -24 108 88 -76 -189 -244 23 130 80 42
1380 42 -66 -198 44 241 -4 93 149 -2 -139 10 -193 93 3 -45 -266 55 15 -105 40 292 48 -359
1402 -359 -9 -88 192 130 -90 123 -404 -2 251 -343 -99 36 52 17 -105 206 161 61 308 -9 -9 -293
1424 -293 237 94 -23 -326 -197 99 -154 168 -152 336 -63 -234 81 44 -367 70 -55 25 10 -248 423
$$ packed form
1267H6K4j58J06l5l3k35l8L63k44O2K62j9L02j82k85J6j00O7k42K23Rk26P7J66
1291c4K1K60m70J38K36o8j2j14l1L58m56M41j86k11K65k84K40k47j51k4L14K07
1313A92j75j29p4J45J36l02K32J79r0j17j26J81J62k81L30k47op4K6J82j08J6
1335E2l02K30K16m48L25J57n11L37k9j14K90l9j93J52q2j26k4L64R0m94k1j10
1357b80M70J75k08O3l90J04M3J76j14K28k1k24km4J32k0j64j13n5K67J07n0l8
1380D2j08j32K42J97k45R7N6j51j37J49k03K86r0m8k21L21m0j20J45K52k44m07
1402c59L50p9K80o2k20K13n27M02K53n94K44J35J6l5j22L11m5j00K47l17%k84
1424b93N30j43j17l03J29K96k53L22l20M88l99j71L15l7m11M37j25Q0j5k58O71
$$ plain form
1445 423 121 101 -193 154 226 137 -18 -6 187 44 23 -103 201 50 301 -135 -320 -180 177 259 214 -285
1467 -285 -250 -115 221 6 139 -42 154 71 59 27 136 14 -18 -37 57 -230 311 -124 -113 -138 -121 -80 -33 83
1491 83 68 -19 14 -260 -195 479 180 -120 19 413 4 -161 -55 -129 142 -18 -202 -279 166 135 -112 -92 -253
1514 -253 -276 306 -228 -286 -120 -23 130 -388 93 457 -80 61 73 -433 -76 116 -98 -66 104 -140 -116 -119 -225
1537 -225 36 -145 -154 48 65 12 217 -374 452 113 79 -139 4 183 -140 11 -93 -61 114 214 -206 43
1559 43 202 -47 46 53 -18 294 220 131 88 -30 -21 180 -287 -77 37 37 -167 54 82 -175 -27 96 295 57
1583 57 -263 -146 -13 -134 62 0 140 -238 -121 177 -75 -196 -59 -65 47 -204 -15 121 -288 -294 -52 19
1605 19 334 352 164 12 -111 142 120 150 -57 141 121 60 329 201 71 -3 5 286 -124 114 -343 -94 -136
$$ packed form
1445D23l02k0k94L47P2q9j55J2J93j43k1j26L04j51K51m36j85J40L57Q2m5m99
1467b85L5J35L36k15J33j81J96q3j2l2J09j22l2j9R4k87N41m35J1k5J7M1M7J16
1491H3j5q7L3k74O5O74k99l00J39L94m09j65J06p4K71j60j84p7M45l1k47K0j61
1514b53k3N82n34n8J66R7J53n18M81L64n37J41J2n06L57J92k14L2J70k44K4lj06
1537b25K61j81rK02J7n3K05n91Q26l39l4k18J43J79l23J51j04L2J75J00m20K49
1559D3J59k49R3Pp1L12p4q9m3j18RK01m67K10J14%k04K21K8k57J48J23J99k38
1583E7l20J17J33j21J96o2J40l78J17K98k52j21J37oJ12k51J89J36m09oK42P1
1605A9L15J8j88j52j23K53k2L0k07J98k0o1K69j28j30p4QK81m10K38m57K49m2
$$ plain form
1628 -136 -103 -184 36 84 -38 -130 -204 297 -66 72 334 -178 -246 147 -179 115 141 247 -104 45 72 -59 -124
1651 -124 258 -52 -220 31 124 69 -11 -182 -76 112 -13 241 -38 203 91 1 67 110 261 206 -79 14 -170
1674 -170 44 -3 160 0 -61 -202 -221 320 133 91 -28 -8 -21 56 9 96 -6 31 -77 -176 -177 -68 24 9 304
1699 304 -265 -55 -76 20 -70 -58 219 71 160 166 -51 -18 -9 5 -282 75 33 9 4 -84 -60 -242 -127 45 198 -67
1725 -67 -124 149 -46 63 273 -74 36 -28 306 -107 135 -76 77 73 -30 20 94 -1 -92 224 -199 127 87
1748 87 349 203 73 -86 173 39 -285 -118 -233 -126 68 -99 -30 -72 6 -331 96 89 14 73 -131 74 123
1771 123 108 -114 14 154 68 154 -68 186 78 208 -24 134 -251 -94 -39 -123 325 148 -115 272 167 -107
1793 -107 221 -108 -2 -57 133 -38 -50 34 -96 -20 -35 -287 -147 -226 118 -21 157 -121 31 95 -313 81
$$ packed form
1628a36L3q1K20M8j22r2p4N01l63J38K62n12o8L93l26K94K6J06l51J49K7j31o5
1651a24L82l10j68K51R3n5q0j71J06J88j25K54k79K41j12r0O6M3J51n5k85R3j84
1674a70K14m7J63j60o1j41j9N41j87m2j19K0j3P7m7Q7j02L7j08r9jJ09R2j5K95
1699C04n69K10k1R6r0J2K77j48Q9Ok17L3RJ4k87L57m2k4nq8K4j82J15J72J53k65
1725f7n7K73j95J09K10l47J10o4L34m13K42k11J53mj03N0P4r5r1L16m23L26m0
1748H7K62j46j30j59K59j34l24J67j15J07J94j67O9m2P8l37M27pp5N9k04K05M9
1771A23j5k22J28J40q6Q6k22K54j08J30k32J58l85J57N5q4M48j77k63L87j05k74
1793a07L28l29J06n5J90j71j2Q4j30P6j5k52J40p9L44j39J78k78J52O4m08L94
$$ plain form
1815 81 134 -405 14 -162 158 -58 61 165 137 167 -217 -76 112 -71 -85 180 -146 -259 229 80 124 -210
1837 -210 57 121 -68 12 78 -6 207 -125 162 117 -54 -77 126 -189 292 87 29 -27 -369 -148 -155 -147 -383 -165
1861 -165 44 -177 184 -264 160 52 129 183 -226 347 94 -4 192 -4 -80 -26 -7 -71 93 88 13 -108 -23 253
1885 253 154 -65 44 -77 67 -145 17 -107 28 -183 131 273 37 -101 -13 246 102 -210 77 145 -275
1906 -275 144 -79 20 65 -11 246 59 9 -129 5 154 90 -35 -155 -270 150 -135 -250 -255 242 -284 283
1928 283 95 288 276 -40 -420 43 -37 185 164 -140 272 -188 -18 167 -238 -1 67 74 -45 -55 19 229 93
1951 93 30 -301 -113 45 228 -308 60 271 155 179 251 58 -124 16 195 -20 -24 -95 153 256 115 -58
1973 -58 -297 -218 -322 -30 57 -68 157 28 173 -46 122 43 10 -223 155 -33 162 24 50 -425 -174 298
$$ packed form
1815H1N3n39M19j76L20k16J19J04k8L0l84J41J88j83j4K65l26j13M88j49M4l34
1837b10K67O4j89Q0O6q4K13l32K87m5j71k3K03l15M81k05n8n6l42K21pQk36K18
1861a65K09k21L61m48M24j08P7N4m09N73k53r8J96j96p6N4J9o4J64np5j21Q5K76
1885B53r9k19J09j21J44k12J62j24J35k11L14J42k36j38Q8K59j44l12K87O8m20
1906b75M19k23R9M5p6K57j87n0j38J34J49o4j25j20j15M20k85j15nM97n26N67
1928B83j88J93j2l16l80M63q0K22k1l04M12m60J70J85m05K37O8Pj19j0P4K10j36
1951I3o3l31J88J58J83n36L68K11j16K4P2j93j82J40J79k15mp1K48J03j41j73
1973e8k39P9j04K92Q7j25K25j29J45k19J68p9l3k33L78j88J95j38K6m75K51M72
$$ plain form
1995 298 40 -161 -253 68 52 54 11 16 328 -60 196 88 17 -71 238 10 224 35 -344 59 45 -33 234 38
2019 38 164 -19 163 -210 -131 45 364 163 -116 247 86 22 -572 120 174 -39 -247 -185 -127 -158 29 -141
2041 -141 -94 12 166 255 -67 243 50 -88 -33 332 80 23 -182 -118 3 225 -299 -46 12 34 -39 19 -72
2064 -72 -178 -188 239 6 -45 380 82 -301 202 115 -13 -283 -330 52 -269 -237 -114 74 45 -204 -141 -133 33
2087 33 -33 192 -152 212 -45 -187 14 -113 54 -58 6 22 150 -71 -114 -208 -165 -16 85 -76 225 -220
2109 -220 -8 -136 444 17 -127 84 -45 -54 -72 103 -157 60 -182 13 -113 -333 -55 277 136 -188 -48
2130 -48 114 -8 -110 65 -155 -98 144 356 241 -213 201 55 -3 90 48 162 333 -213 -143 71 121 -11
2152 -11 -60 -42 255 182 276 -139 -107 70 -107 -76 -158 186 -75 84 -35 -152 -44 -66 26 129 117 157 -59 -96
$$ packed form
1995B98k58k01r2L21j6Km3NL12l88K56j08p1q8L09k28K14j89l79M03j4p8K67j96
2019C8J26j83J82l73P9J76L19k01k79L63j61o4n94O92N4k13k08O2N8l1J87j70
2041a41M7J06J54Q9l22L10j93j38N5L65k52n7k05O4J21K22n24K53N8K2p3N8r1
2064g2j06j0M27k33n1M25k98l83N03q7j28k70m7L82l21L2J23J88k9k49O3QJ66
2087C3o6K25l44L64k57j42K01j27J67j12O4J6J28k21m3r4M3J49J01j61L01m45
2109b20K12j28N80m27j44K11j29rj8J75k60K17k42J95j26k20K78L32j41l24J40
2130d8J62j22j02J75k20N7K42K12j15m54M14j46n8R3m2J14J71n46P0K14N0j32
2152a1m9J8K97p3R4m15L2J77j77L1q2L44k61J59j19j17J08k2R2J03j2M0k16l7
$$ plain form
2176 -96 234 217 -410 -223 49 107 182 -88 -88 -255 47 251 155 -193 -354 -284 -242 67 -72 229 95 51 -58
2199 -58 -335 161 28 0 -193 -299 225 94 -170 -296 -189 -61 28 -113 -301 -220 127 101 -230 -99 26 -34
2221 -34 -41 36 64 59 -86 -187 42 -159 -48 18 76 -7 84 -160 -4 -165 -164 -70 86 220 136 -28 29 -251 -92
2246 -92 56 13 227 -81 161 254 -51 -98 11 -26 -55 123 100 162 -87 71 -54 163 -114 158 -242 71 -36
2269 -36 -180 -56 -22 -71 140 -127 126 45 -123 -142 -203 245 -38 -157 -221 -175 251 2 224 -390 72 55 -90
2292 -90 99 -264 26 -89 28 -223 89 -1 17 -22 -164 -15 10 -244 -90 111 79 204 140 257 -65 -182
2314 -182 432 173 41 -132 -53 127 67 -33 -208 -75 -99 -128 -287 338 -335 67 -243 31 143 166 -214 -35
2336 -35 119 371 218 -76 -180 -119 -42 -122 150 134 -17 -37 348 -97 130 -195 6 140 -26 -129 18 47
$$ packed form
2176i6L30j7o27J87K72N8P5k70%j67L02K04r6l48j61P0M2L09j39L01j34m4j09
2199e8k77M96j33k8j93j06N24j31k64j26J07J28Q9j41j88Q1L47k6l31J31J25o0
2221c4pP7K8nj45j01K29k01J11O6N8q3R1k44J56j61JR4J56J34q4j64N7k80J59
2246i2J48m3K14l08K42R3l05m7J09l7k9J78k3O2k49J58j25K17k77K72m00L13j07
2269c6j44J24L4m9K11k67K53q1j68j9o1M48k83j19o4M6M26k49K22o14M62j7j45
2292i0J89l63K90j15J17k51L12r0J8l9j42J49K5k54J54K01l2J25o4J17l22j17
2314a82O14k59j32j73P9J80o0j00j75J33k4k9j59O25o73M02l10K74J12K3l80J79
2336c5J54K52j53k94j04O1P7q0K72j6j51k0L85m45K27l25K01J34j66j03J47K9
$$ plain form
2358 47 -144 60 -54 -134 -62 16 128 10 230 -225 179 222 40 -79 -241 66 -170 407 19 51 169 -246
2380 -246 41 106 20 185 -76 -139 65 265 -143 -38 -386 60 39 -74 -3 -80 109 127 -222 -82 2 -85 1
2403 1 112 0 242 84 -66 -57 108 -102 -104 257 68 -143 -281 171 76 12 218 -107 -65 -240 94 -63 -21
2426 -21 180 22 258 -198 72 101 74 7 49 81 -16 -77 82 -53 20 338 32 82 215 -40 181 -1 -212
2449 -212 10 -201 -38 -105 -48 173 102 -194 28 160 -136 28 -36 3 84 8 84 -51 143 27 34 -192 127
2472 127 38 21 -52 49 -152 -133 234 -34 -196 -248 33 22 48 291 -91 27 -123 -255 290 185 -102 -204
2494 -204 209 -336 -26 -30 -38 -14 -226 133 -279 129 34 -71 48 -64 112 193 97 150 125 -27 152 -15 -30 -193
2518 -193 -67 -17 195 -19 -70 50 -388 7 -52 106 -25 8 83 165 1 -54 -149 -15 61 -95 -107 185 165 147
$$ packed form
2358D7j91K04j14q0P2P8J12j18K20m55M04M3j82j19j62L07k36N77l88L2J18m15
2380b46K87O5q6J65k61o3K04K00m08J05l48M46k1j13P1p7J89J8l49J40Q4q7Q6
2403AJ11j12K42j58j50RJ65k10kL61j89k11j38M52r5o4K06l25M2j75L34j57M2
2426b1K01j58K36m56K70K9k7o7M2L2r7o1J59j35P3L18l06N0J33k55K21j82k11
2449b12K22k11J63o7N7K21p1k96K22J32k96J64o4L9Q1p6P6j35J94j16Pk26L19
2472A27q9j7p3J01k01J9L67k68j62n2K81j1K6K43l82J18j50j32N45j05k87j02
2494b04M13n45L10mqK4k12L59m12M08r5j05J19j12J76Q1r6N3k5j52J79j67j5j63
2518a93J26N0K12k14n1J20m38L95n9J58j31L3P5Q2j64n5r5J34P6j56j2K92k0j8
$$ plain form
2542 147 151 188 -50 -28 -555 -289 -5 -102 161 212 -300 68 -324 191 244 -64 245 -215 46 183 62 -169
2564 -169 117 47 -71 219 28 -188 -72 27 17 101 15 -37 15 -109 73 162 156 -7 125 -226 102 -292 143
2587 143 -56 31 -81 -144 -117 116 -159 -30 -173 -293 -9 112 388 -104 60 -85 51 167 -82 451 -258
2608 -258 -269 -36 -180 -130 -56 -15 -122 -58 -67 -58 143 -191 -4 34 -239 -6 -340 175 -135 146 -89 9 111 -10
2632 -10 108 278 34 234 -109 90 -246 -231 102 153 -149 -172 34 134 -35 196 33 90 1 -183 62 -156
2654 -156 -18 45 66 50 -11 -40 334 -92 -24 33 -53 271 35 228 -5 -59 -77 -43 -39 -87 -99 67 -92 -124 -234
2679 -234 -4 -159 160 201 168 -223 -148 216 253 -162 132 69 67 452 -122 370 109 180 190 -67 -133 56 -244
2702 -244 -50 -213 28 131 111 -85 30 194 14 268 56 77 -62 166 112 -209 86 127 -48 114 168 -160
$$ packed form
2542A47ML7k38K2n27K66K84r7K63N1n12L68l92N15N3l08L09m60K61J37j21k31
2564a69K86p0j18K90j91k16J16R9j0Q4q6n2N2j24J82Q9oj63J32l51L28l94M35
2587A43j99Q7j12o3K7K33k75J29j43j20K84J21K76m92J64j45J36J16k49N33p09
2608b58j1K33j44N0P4M1j07O4rRK01l34J87L8k73K33l34N15l10K81k35R8J02j21
2632a0J18J70k44K00l43J99l36J5L33N1l02k3K06J00j69K31j63N7q9j84K45k18
2654a56J38O3K1j6o1k9L74m26O8N7q6L24k36J93k33n4j8L4Mm8j2J66j59l2j10
2679b34K30j55L19M1l3l91P5L64L7m15K94o3kL85n74M92k61P1J0k57o6J89l00
2702b44J94j63K41J03k0j96J15J64j80K54k12K1j39K28n4l21K95M1j75J62N4l28
$$ plain form
2724 -160 0 62 -20 106 85 96 132 120 124 170 33 133 -3 339 164 116 -66 109 41 72 287 -136 -247 -122
2748 -122 26 -99 87 36 -112 389 31 -27 -63 -87 -158 -91 89 -95 359 56 141 167 -190 261 -70 -52 -189
2771 -189 -51 17 -103 246 45 42 116 -114 -17 -230 -296 15 -30 31 105 323 21 -100 -304 208 163 106 -22 -12
2795 -12 -11 -68 -97 174 65 -210 -144 376 -258 -17 -378 -491 -102 -21 258 122 133 2 267 -90 27 13 -123
2818 -123 -229 -102 405 86 328 131 55 150 -112 -101 241 -383 8 -231 -25 403 -145 164 -135 231 104
2839 104 103 18 32 -134 13 -90 -23 149 -204 -55 -132 416 -257 137 191 -84 -98 -19 261 11 -310 75 169
2862 169 201 -25 -92 127 4 28 -53 159 -38 -102 5 165 -231 111 13 -315 -152 35 -178 148 43 162
2884 162 -129 162 -85 51 169 -120 -175 -121 -268 47 80 -20 -119 177 112 -14 59 245 -182 -16 381 257
$$ packed form
2724a60J60O2q2J26k1J1L6j2MM6j37J00j36L42j75m8j82J75o8L1K15m23j11J25
2748a22J48j25J86n1j48N01l58n8l6k4p1O7J80j84M54l03Q5K6l57M51l31J8j37
2771a89J38O8j20L49k01lP4k30R7k13o6L11m5O1P4K18l02j21k04N12m5n7j28J0
2795a2Jn7k9K71j09k75O6N20o34K41l61j13L89Q1K79j36J1j31K65l57J17j4j36
2818a23j06J27N07l19K42j97p6R5k62J1L42o24L91k39K06M28n48L09k99L66j27
2839A04jq5J4j66J47j03O7J72l53J49p7N48o73L94N4k75j4P9K80k50l21L85R4
2862A69L2k26o7K19j23K4q1K12j97o4J07J60l96L42r8l28J63J87k13L26j05J19
2884A62k91K91k47J36J18k89n5N4j47L15L3j00r9K96o5j26P3J86m27J66L97j24
$$ plain form
2906 257 0 65 267 -216 -182 -4 -212 -110 -371 -164 197 65 92 -174 159 123 14 -323 -357 -66 97 130
2928 130 157 -399 17 279 46 127 -66 207 -151 117 147 111 -85 -61 -206 136 246 168 -90 -38 -214 431
2950 431 -74 -89 55 98 88 -131 -24 169 26 236 12 -101 -95 -128 95 -80 104 -215 63 207 172 12
2972 12 -79 -76 70 30 -16 63 -144 -42 101 148 45 12 -31 153 156 94 -129 -123 -117 -51 79 42 116 144 239 40 -157
2999 -157 -149 -305 31 -44 -27 75 180 -21 131 152 259 -143 37 -103 54 -136 -127 -20 165 -48 -76 -83 -131 6
3023 6 248 179 144 117 27 -155 -98 90 -470 -167 -253 -128 -204 276 -265 28 -29 173 167 -21 69 -23 -428 -304 -209
3048 -209 138 -99 71 -102 44 155 -191 7 -33 13 -194 40 -15 -15 -123 -323 205 43 70 6 51 -45 -199
3071 -199 -47 -96 -44 -83 -94 -314 -357 -55 -166 -156 -127 213 -66 -93 -182 -191 237 -115 68 87 -69 12 -14 114 -216
$$ packed form
2906B57k57O5K02m83L4J78k08J02k61K07L61j32K7k66L33l6j09l37l4K91J63L3
2928A30K7n56M16K62k33Q1j93K73l58K68L0l6j96K4j45L42J10p8k58N2j76O45
2950D31n05j5J44M3j0k19J07J93j43K10k24j13Ol3K23j75J84l19K78J44l5j60
2972A2r1LJ46m0m6P9k07J02J43M7j03l3m3J84Lo2k23OOO6J30l7P4K8R5j99j97
2999a57Qj56L36p5J7J02J05k01J52K1J07m02J80j40J57j90RJ07J85k13k8pm8J37
3023FK42o9l5k7r0j82N7J88n60L03q6J25p6M80n41K93n7K02oj88R0r2m05J24R5
3048b09L47k37J70j73J46J11l46J98m0M6k07K34n5%j08k00N28j62K7o4M5r6j54
3071a99J52m9N2l9j1k20m3L02j11J0K9L40k79k7q9rM28l52J83J9j56Q1k6J28l30
$$ plain form
3096 -216 78 232 -213 -37 96 55 50 71 140 309 -34 246 200 -120 248 -80 105 -235 -126 -59 -64 -255 -23
3119 -23 -288 -182 141 -126 288 -46 241 146 240 -137 -48 44 79 259 -174 9 30 -203 -84 45 -428 137
3141 137 -162 -30 -32 -72 135 129 -17 289 -102 -96 -5 124 158 42 -6 8 40 -192 -73 27 -172 210 129 107 -21
3166 -21 -7 -266 -37 204 -153 89 178 183 190 -173 -26 145 -46 -37 3 73 -4 -140 -162 196 60 -88 -192 108
3190 108 200 -109 130 22 16 -51 110 245 -21 84 36 54 47 92 117 59 95 131 -43 -193 127 200 41 16 -204
3215 -204 287 84 -66 190 -163 -101 42 -188 -28 165 -225 46 -176 142 1 43 331 8 42 -23 6 -133
3237 -133 31 151 -123 -142 -33 -223 18 77 61 -362 -179 180 -23 44 -4 -24 -90 211 -104 -5 201 193 128 -283
3261 -283 -36 156 321 -95 323 39 96 29 -27 -234 -271 67 97 -216 -348 42 -243 83 -25 198 76 -98
$$ packed form
3096b16K94J54m45J76J33m1nK1O9J69l43K80m6l20L68l28J85l40J09O7nj91K32
3119b3k65J06L23k67M14l34K87r5R4l77Q9R2L5J80m33J83K1k33J19J29m73N65
3141A37k99J32km0K07oj46L06l91OR1J29L4j16m8J4L2k32J19J00j99L82q1k2j28
3166b1J4k59K29K41l57K42Q9NPl63J47J71j91RM0P0p7j36k2L58j36j48j04L00
3190A08R2l09K39j08oo7J61J35k66J05m8J8pM5K5n8L6L6j74j50L20P3j59k5k20
3215b04M91k03j50K56l53O2J43k30J60J93l90K71k22L18j41M2K88l23L4o5K9j39
3237a33J64J20k74j9J09j90K41N9j6m23J83L59k03O7m8k0o6L01l15R9K06qo5m11
3261b83K47J92J65m16M18k84N7o7n6k07l7L38L0l13j32L90k85L26j08K23j22j74
$$ plain form
3283 -98 21 120 -23 62 69 -5 -213 -89 10 -92 48 -204 90 44 -12 66 -1 28 128 108 -127 -195 -51 -74 -284
3308 -284 -26 -3 67 149 128 -222 336 17 21 -37 -90 173 -65 -40 32 10 244 9 -1 11 78 43 -250 98 -7
3333 -7 -92 -60 -104 67 54 36 -220 187 -85 2 -94 -19 13 -131 77 -156 -301 -182 -192 174 -16 -263 -21 -131
3357 -131 213 -156 169 59 -100 371 -114 -127 -97 220 -5 68 198 153 181 -165 -57 53 -78 -98 241 -157
3379 -157 106 182 -12 293 -166 -84 -206 68 -145 239 68 11 -199 -65 94 15 233 166 288 -29 101 -297
3401 -297 -124 -156 -169 -129 -185 -85 -18 -2 180 71 108 -155 -144 62 -137 228 -161 60 317 68 17 -492 -95
3424 -95 25 102 -128 -180 211 -100 -193 216 83 71 101 -29 -152 -54 230 44 -90 157 64 -22 -174 -45 39
3447 39 147 -77 -43 184 50 -330 4 -3 4 -201 1 206 3 209 123 9 65 193 -260 -191 -150 199 -8
$$ packed form
3283i8J19R9j43Q5Pp4k08J24R9j02J40k52K94m6n6P8o7K9J00k0k35o8J44k3k10
3308b84K58K3P0Q2k1l50N58l19Mn8n3K63k38K5P2k2K34k35j0J2O7l5k93L48j05
3333gq5L2m4J71j3j8k56M07k72Q7r6P5L2j44K08k33j45J19j0L66j90k47K42j10
3357a31L44l69L25j10j59M71m85j3L0L17k25P3J30m5K8l46J08J10j31k0L39l98
3379a57K63P6j94L05m59Q2j22K74k13L84j71n7k10J34J59p9K18o7J22l17J30l98
3401b97J73l2j3M0n6J00O7J6J82j09L7k63J1K06j99L65l89K21K57k49n1n09L97
3424i5J20P7k30n2L91l11r3M09j33j2L0j30j23R8K84j86j34K47r3q6j52J29Q4
3447C9J08k24L4K27j34l80L34pPk05K02K05k03K06q6j14N6J28m53O9M1L49k07
$$ plain form
3470 -8 175 -115 -63 198 -153 182 4 -35 86 166 -120 -78 54 -60 -372 -87 89 -38 -3 -243 -272 -41 -72
3493 -72 171 198 -123 15 -233 -229 -89 98 174 -102 226 -200 -204 -168 -13 23 -288 125 145 -155 50 -254 -66
3516 -66 28 -128 189 -135 26 183 -47 -245 4 142 -236 54 -267 -228 -62 118 75 143 50 -82 -37 -99 -71
3539 -71 -84 325 8 -279 -14 -69 -168 -30 -205 108 -183 -165 70 142 -73 0 -53 -92 258 -140 145 -37 -265
3562 -265 -302 5 -145 133 246 164 209 -90 -154 -91 63 -264 -202 -122 134 -2 179 -125 -42 -146 320 25 -277
3585 -277 358 237 230 -129 -14 237 -216 6 -186 30 226 -12 -302 -152 220 -171 119 -374 184 -15 -76
3606 -76 20 103 -248 79 -144 18 -5 -50 137 -39 -195 -134 102 -39 -180 144 -101 -1 -73 31 40 -12 -101 -30
3630 -30 168 -16 94 -114 53 -14 189 101 -69 -115 72 -234 -129 -110 22 81 -23 -93 -91 -126 -204 183 -27 -75
$$ packed form
3470hJ83k90N2K61l51L35j78l9J21Q0k86M2J32j14l12K85J76j27L5k40k9K31l1
3493g2K43K7l21J38k48MJ40J87P6k76L28m26mL6J55L6l11M13K0l00K05l04J88
3516f6R4j56L17l24J61J57k30j98K49J38l78K90l21L9J66J80m3O8r3j32M5o2K8
3539g1j3M09l17k87K65n5r9J38j75L13k91J8K35P2k15P3n3l9L50l98K85j82k28
3562b65l7L07j50K78J13q2M5k99o4O3J54l27O2Q0K56j36J81l04Q3j04M66k95l02
3585b77O35j21pl59J15K51m53K22j92K16J96k38k90J50L72l91K90m93N58j99o1
3606g6R6Q3l51L27k23J62k3m5J87j76j56O1K36j41j41L24k45J00p2J04Rn2q9P1
3630c0J98j84J10k08J67o7K03q8j70m6J87l06J05J9J32N9j04p0Kl5p8L87k10m8
$$ plain form
3654 -75 6 -292 -56 232 -398 -26 145 186 22 55 -29 242 -182 74 -5 -134 -6 -122 -125 41 15 8 92 -39
3678 -39 -95 66 0 -273 250 -45 51 135 -100 37 39 -11 -152 -93 114 -408 161 -50 -194 -232 41 32 69 54 -25
3703 -25 148 -347 122 -112 108 433 -64 -54 101 72 -121 -300 -275 147 243 -60 -376 123 123 225 -64 -102 39
3726 39 -9 -39 235 47 -34 134 -208 -25 -14 190 210 -302 34 -155 -178 -281 197 -230 13 3 127 129 -47
3749 -47 23 133 460 78 -104 62 25 -98 -114 -73 124 409 159 -168 181 82 77 -206 -30 -65 -92 -63 4 121
3773 121 17 -114 110 -223 93 -389 -23 -7 -199 70 117 -169 194 -103 -42 40 -232 -50 -74 -145 183 -150
3795 -150 -195 -206 297 346 -63 19 161 -31 170 64 -192 -129 112 156 -54 267 89 135 57 -9 -168 264 -120
3818 -120 -196 -145 -161 87 14 137 -105 48 193 35 206 105 -2 113 -240 62 -42 6 24 35 204 287 -146
$$ packed form
3654g5Q1k98K36K88o30L72J71M1j64L3q4K71m24K56p9j29J28j16lJ66k6pQ4j31
3678c9n6J61o6k73N23k95R6Q4k35J37Kn0j41N9K07n22N69k11j44l8K73rL7j5p9
3703b5J73m95M69k34K20L25m97J0J55k9j93j79K5M22R6l03l16M99%J02k89l8J41
3726C9m8l0K74j88q1J68l42J83J1K04K0n12L36j89k3j03M78m27K43j0J24Kj76
3749d7P0J10L27l82j82J66l7j23j6M1J97K85k50l27L49r9nk83J76l5k7K9O7J17
3773A21j04j31K24l33L16m82L66J6j92K69M7k86L63k97O1Q2k72J82k4p1L28l33
3795a50m5j1N03M9m09Q2J42j92K01j06k56O3K41M4k10L21j78M6p8o6j59M32l84
3818a20p6N1j6K48p3J23k42J53J45j58J71j01j07J15l53L02j04M8J8J1J69Q3m33
$$ plain form
3841 -146 35 109 -138 45 127 -15 134 17 -159 15 234 49 -286 -181 -29 -122 69 71 151 92 128 -140 -5
3864 -5 -30 -15 191 -241 -61 -51 27 79 -276 208 -193 334 39 -223 -169 192 114 72 -28 -144 -146 -4 246 146
3888 146 10 -215 192 -28 -29 -178 83 -5 205 103 -8 172 3 -147 366 235 -214 49 96 -65 -74 -271
3910 -271 -30 -225 14 167 -37 -17 -84 223 -174 -1 -132 155 -99 35 28 -100 426 -17 368 -244 -406
$$ packed form
3841a46J81P4k47J83Q2j42J49j17j76J74K19j85l35J05J52r3J91KQ0n9L6k68J35
3864ek5J5K06m32J80J0P8N2l55M84m01N27k95k62N4L61p8m2j00j16kJ42K50j00
3888A46j36k25M07k20jj49K61q8K10j02j11J80j69j50N13j31m49K63M7j61rj97
3910b71K41j95K39J53k04K0o7L07l97J73j31K87k54J34pj28N26m43L85o12j62
$$ [...]
8191b5
##END NTUPLES=NMR FID
##END=
