##TITLE=1H_LR-659-C1-B
 D2O, 8 sc, 
 12.3.2019
##JCAMPDX= 6.0         $$ Bruker NMR JCAMP-DX V2.0
##DATA TYPE= NMR FID
##DATA CLASS= NTUPLES
##ORIGIN= UXNMR, Bruker Analytische Messtechnik GmbH
##OWNER= root
$$ XWIN-NMR		Version 3.5
$$ Tue Mar 12 16:38:36 2019 Russian Standard Time (UT+4h)  she@DPX200
##.OBSERVE FREQUENCY= 200.1316
##.OBSERVE NUCLEUS= ^1H
##.DELAY= (6, 6)
##.ACQUISITION MODE= SIMULTANEOUS
##.ACQUISITION SCHEME= undefined
##.AVERAGES= 8
##.DIGITISER RES= 18
##SPECTROMETER/DATA SYSTEM= spect
##.PULSE SEQUENCE= zg30
##.SOLVENT NAME= CDCl3
##.SHIFT REFERENCE= (INTERNAL, CDCl3, 0, 15.7039)
##AUDIT TRAIL= $$ (NUMBER, WHEN, WHO, WHERE, WHAT)
$$ ##TITLE= Audit trail, XWIN-NMR		Version 3.5
$$ ##JCAMPDX= 5.01
$$ ##ORIGIN= Bruker BioSpin GmbH
$$ ##OWNER= she
$$ F:/spectra/data/she/nmr/H-F/1/audita.txt
$$ ##AUDIT TRAIL=  $$ (NUMBER, WHEN, WHO, WHERE, WHAT)
(   1,<2019-03-12 16:36:57.82 +0400>,<she>,<DPX200>,
      <created by zg, POWCHK disabled, PULCHK disabled
       configuration hash MD5:
       00 E9 B6 7A A2 85 ED C7 34 08 36 98 17 FE 4E 26
       data hash MD5: 16K
       FC DA 25 AB 02 AF 5E CF 1C F0 12 F2 8B 50 4A 91>)
$$ ##END=
$$ 
$$ hash MD5
$$ 76 C7 00 B3 FA EE 20 3F 70 83 E4 3C 53 F9 89 E1
##$RELAX= 
##$RELAX= 
##$RELAX= 
##$RELAX= 
##$RELAX= 
##$RELAX= 
$$ Bruker specific parameters
$$ --------------------------
##$DU= <F:/spectra>
##$EXPNO= 1
##$NAME= <H-F>
##$PROCNO= 1
##$TYPE= <nmr>
##$USER= <she>
##$AMP= (0..31)
100 100 100 100 100 100 100 100 100 100 100 100 100 100 100 100 100 100 
100 100 100 100 100 100 100 100 100 100 100 100 100 100 
##$AQSEQ= 0
##$AQ_mod= 1
##$AUNM= <au_zg>
##$AUTOPOS= <>
##$BF1= 200.13
##$BF2= 200.13
##$BF3= 200.13
##$BF4= 200.13
##$BF5= 200.13
##$BF6= 200.13
##$BF7= 200.13
##$BF8= 200.13
##$BYTORDA= 1
##$CFDGTYP= 0
##$CFRGTYP= 5
##$CHEMSTR= <none>
##$CNST= (0..31)
1 1 145 1 1 1 1 1 1 1 1 1 1 1 1 1 1 1 1 1 1 1 1 1 1 1 1 1 1 1 1 1 
##$CPDPRG= <>
##$CPDPRG1= <>
##$CPDPRG2= <>
##$CPDPRG3= <>
##$CPDPRG4= <mlev>
##$CPDPRG5= <mlev>
##$CPDPRG6= <mlev>
##$CPDPRG7= <mlev>
##$CPDPRG8= <mlev>
##$CPDPRGB= <>
##$CPDPRGT= <>
##$D= (0..31)
0 1.2 0 0 0 0 0 0 0 0 0 0.03 0 0 0 0 0 0 0 0 0 0 0 0 0 0 0 0 0 0 0 0 
##$DATE= 1552394217
##$DBL= (0..7)
120 120 120 120 120 120 120 120 
##$DBP= (0..7)
150 150 150 150 150 150 150 150 
##$DBP07= 0
##$DBPNAM0= <>
##$DBPNAM1= <>
##$DBPNAM2= <>
##$DBPNAM3= <>
##$DBPNAM4= <>
##$DBPNAM5= <>
##$DBPNAM6= <>
##$DBPNAM7= <>
##$DBPOAL= (0..7)
0.5 0.5 0.5 0.5 0.5 0.5 0.5 0.5 
##$DBPOFFS= (0..7)
0 0 0 0 0 0 0 0 
##$DE= 6
##$DECBNUC= <off>
##$DECIM= 24
##$DECNUC= <off>
##$DECSTAT= 4
##$DIGMOD= 1
##$DIGTYP= 9
##$DL= (0..7)
0 120 120 120 120 120 120 120 
##$DP= (0..7)
150 150 150 150 150 150 150 150 
##$DP07= 0
##$DPNAME0= <>
##$DPNAME1= <>
##$DPNAME2= <>
##$DPNAME3= <>
##$DPNAME4= <>
##$DPNAME5= <>
##$DPNAME6= <>
##$DPNAME7= <>
##$DPOAL= (0..7)
0.5 0.5 0.5 0.5 0.5 0.5 0.5 0.5 
##$DPOFFS= (0..7)
0 0 0 0 0 0 0 0 
##$DQDMODE= 0
##$DR= 18
##$DS= 0
##$DSLIST= <SSSSSSSSSSSSSSS>
##$DSPFIRM= 0
$$ [...]
##$SUBNAM2= <"">
##$SUBNAM3= <"">
##$SUBNAM4= <"">
##$SUBNAM5= <"">
##$SUBNAM6= <"">
##$SUBNAM7= <"">
##$SUBNAM8= <"">
##$SUBNAM9= <"">
##$SW= 24.9336934301222
##$SWIBOX= (0..15)
0 0 2 0 0 0 0 0 0 0 0 0 0 0 0 0 
##$SW_h= 4990.01996007984
##$TD= 16384
##$TD0= 1
##$TE= 0
##$TE2= 300
##$TE3= 300
##$TEG= 300
##$TL= (0..7)
0 120 120 120 120 120 120 120 
##$TP= (0..7)
150 150 150 150 150 150 150 150 
##$TP07= 0
##$TPNAME0= <>
##$TPNAME1= <>
##$TPNAME2= <>
##$TPNAME3= <>
##$TPNAME4= <>
##$TPNAME5= <>
##$TPNAME6= <>
##$TPNAME7= <>
##$TPOAL= (0..7)
0.5 0.5 0.5 0.5 0.5 0.5 0.5 0.5 
##$TPOFFS= (0..7)
0 0 0 0 0 0 0 0 
##$TUNHIN= 0
##$TUNHOUT= 0
##$TUNXOUT= 0
##$USERA1= <user>
##$USERA2= <user>
##$USERA3= <user>
##$USERA4= <user>
##$USERA5= <user>
##$V9= 5
##$VALIST= <valist>
##$VCLIST= <CCCCCCCCCCCCCCC>
##$VD= 0
##$VDLIST= <DDDDDDDDDDDDDDD>
##$VPLIST= <PPPPPPPPPPPPPPP>
##$VTLIST= <TTTTTTTTTTTTTTT>
##$WBST= 1024
##$WBSW= 4
##$XGAIN= (0..3)
0 0 0 0 
##$XL= 0
##$YL= 0
##$YMAX_a= 312145
##$YMIN_a= -485895
##$ZGOPTNS= <>
##$ZL1= 120
##$ZL2= 120
##$ZL3= 120
##$ZL4= 120
##$ABSF1= 10
##$ABSF2= 0
##$ABSG= 5
##$ABSL= 3
##$ALPHA= 0
##$AQORDER= 0
##$ASSFAC= 0
##$ASSFACI= 0
##$ASSFACX= 0
##$ASSWID= 0
##$AUNMP= <proc_1d>
##$AZFE= 0.1
##$AZFW= 0.1
##$BCFW= 1
##$BC_mod= 2
##$BYTORDP= 1
##$COROFFS= 0
##$CY= 11.3945322036743
##$DATMOD= 1
##$DC= 2
##$DFILT= <>
##$DTYPP= 0
##$F1P= 18.9103706918063
##$F2P= -1.10871071338519
##$FCOR= 0.5
##$FTSIZE= 0
##$FT_mod= 4
##$GAMMA= 1
##$GB= 0.15
##$INTBC= 1
##$INTSCL= 1
##$ISEN= 128
##$LB= 0.24
##$LEV0= 0
##$LPBIN= 0
##$MAXI= 10000
##$MC2= 0
##$MEAN= 0
##$ME_mod= 0
##$MI= 1.114404
##$NCOEF= 0
##$NC_proc= 0
##$NLEV= 6
##$NOISF1= 3.799351
##$NOISF2= 2.8
##$NSP= 1
##$NTH_PI= 0
##$NZP= 0
##$OFFSET= 15.70392
##$PC= 1
##$PHC0= -8865.55
##$PHC1= 18.20025
##$PH_mod= 1
##$PKNL= yes
##$PPARMOD= 0
##$PSCAL= 0
##$PSIGN= 0
##$REVERSE= no
##$SF= 200.130013532006
##$SI= 16384
##$SIGF1= 3
##$SIGF2= 2
##$SINO= 400
##$SIOLD= 16384
##$SREGLST= <1H.CDCl3>
##$SSB= 0
##$STSI= 0
##$STSR= 0
##$SW_p= 3612.71676300578
##$SYMM= 0
##$S_DEV= 0
##$TDeff= 0
##$TDoff= 0
##$TI= <>
##$TILT= no
##$TM1= 0
##$TM2= 0
##$TOPLEV= 0
##$USERP1= <user>
##$USERP2= <user>
##$USERP3= <user>
##$USERP4= <user>
##$USERP5= <user>
##$WDW= 1
##$XDIM= 8192
##$YMAX_p= 0
##$YMIN_p= 0
$$ End of Bruker specific parameters
$$ ---------------------------------
##NTUPLES= NMR FID
##VAR_NAME=  TIME,          FID/REAL,        FID/IMAG
##SYMBOL=    X,             R,               I
##VAR_TYPE=  INDEPENDENT,   DEPENDENT,       DEPENDENT
##VAR_FORM=  AFFN,          ASDF,            ASDF
##VAR_DIM=   8192,          8192,            8192
##UNITS=     SECONDS,       ARBITRARY UNITS, ARBITRARY UNITS
##FACTOR=    0.0002004,     1,               1
##FIRST=     0,             0,               0
##LAST=      1.6414764,     0,               0
##MIN=       0,             -485895,         0
##MAX=       1.6414764,     312145,          0
$$ Real data points
##PAGE= N=1
##DATA TABLE= (X++(R..R)), XYDATA
$$ plain form
0 0 0 0 0 0 8 -8 8 -8 16 -16 24 -24 33 -41 50 -64 73 -89 106 -126 147 -171 198 -231 263 -302 345 -393
28 -393 446 -503 566 -639 716 -799 894 -994 1108 -1231 1365 -1515 1676 -1856 2055 -2274
44 -2274 2521 -2796 3104 -3457 3860 -4323 4874 -5530 6331 -7335 8638 -10400 12932 -16900
58 -16900 24060 -41012 164148 -33389 -388568 -64568 3408 -107549 44841 312145 137634
69 137634 -114422 -145681 -121716 -118619 69483 180416 73381 24235 72653 -109943 -277449
80 -277449 -67843 186197 107290 42518 134588 11067 -266304 -206413 62471 120582 84645
91 84645 160499 99149 -159806 -267108 -115117 67723 181201 194537 51311 -111828 -132294
102 -132294 -115911 -105136 59106 255834 162035 -91611 -138565 -49171 -69098 -82040 63126
$$ packed form
0@%%%%Qj6J6j6K4l2M0m8N7p4R1j14J37j62J95k32K73l18L69m29M94n65O47p38
28c93Q39r49J069j205J355j515J693j888K102k339K596k880L191l532L911m329
44b274M795n317N900o561P317q183R197j0404J1861j3666J5973j9038K3332k9832
58a6900M0960o5072K05160j97537l55179L24000O7976j10957J52390K67304j74511
69A37634k52056l1259K3965L097J88102J10933j07035m9146M8418j82596j67506
80b77449K09606K54040p8907o4772R2070j23521k77371N9891K68884N8111l5937
91H4645P5854o1350k58955j07302J51991J82840J13478J3336j43226j63139k0466
102a32294J6383J0775J64242J96728r3799k53646m6954Q9394j9927j2942J45166
$$ plain form
113 63126 188556 133441 -14131 -128833 -152279 -77082 18944 85805 157014 151626 -33834
124 -33834 -214108 -161004 -12321 50494 125138 201314 69410 -167770 -194369 -64107 1784
135 1784 72016 187260 142756 -59905 -162401 -128034 -69701 44511 163469 116369 -5865
146 -5865 -21215 -55973 -176826 -118184 128109 190775 45013 73 9880 -127013 -202943 -24863
158 -24863 157712 151366 88114 10359 -132236 -185423 -63063 57476 104766 154900 106171
169 106171 -97020 -201569 -88595 12387 34376 122763 168440 6848 -154072 -115926 -40941
180 -40941 -27487 59750 169437 107381 -47754 -112268 -110867 -83233 24267 133778 123303
191 123303 50706 -21028 -127666 -175066 -41198 125599 135896 74693 34622 -62539 -172646
$$ packed form
113F3126J25430n5115j47572j14702k3446P5197R6026O6861P1209n388j85460
124c3834j80274N3104J48683O2815P4644P6176j31904k37180k6599J30262O5891
135A784P0232J15244m4504k02661j02496L4367N8333J14212J18958m7100j22234
146e865j5350l4758j20853N8642K46293O2666j45762m4940R807j36893p5930J78080
158b4863J82575o346o3252p7755j42595n3187J22360J20539M7290N0134m8729
169A06171k03191j04549J12974J00982K1989Q8387M5677j61592j60920L8146P4985
180d0941J3454Q7237J09687o2056j55135o4514J401K7634J07500J09511j0475
191A23303p2597p1734j06638m7400J33868J66797J0297o1203m0071r7161j10107
$$ plain form
202 -172646 -124523 35561 125685 124984 76631 -31795 -129075 -116306 -45028 22931 112773 151784
214 151784 38747 -98734 -107677 -71305 -54462 39373 159435 120708 -22228 -88604 -99525
225 -99525 -105275 -18061 122538 142446 54879 -19595 -94985 -152577 -70114 83501 120414 78689
237 78689 59370 -24542 -161119 -140901 24499 100230 80289 88616 43677 -102916 -159345 -55756
249 -55756 38343 72996 113918 87729 -42698 -119854 -86753 -49092 7471 125620 150975 12798
261 12798 -94094 -83982 -80489 -63862 68100 170667 87271 -44293 -78651 -88296 -92314 -1197
273 -1197 117285 122637 45632 -29385 -101102 -124577 -39410 67133 96926 87670 52190 -56284
285 -56284 -147498 -93846 23655 71319 82266 90366 22198 -98770 -132416 -57779 31132 88609
$$ packed form
202a72646M8123J60084R0124p01m8353j08426r7280J2769P1278O7959Q9842L9011
214A51784j13037j37481q943L6372J6843R3835J20062l8727j42936o6376j0921
225i9525n750Q7214J40599J9908q7567p4474p5390n7592Q2463J53615L6913m1725
237G8689j9319q3912j36577K0218J65400P5731j9941Q327m4939j46593n6429J03589
249e5756R4099L4653M0922k6189j30427p7156L3101L7661N6563J18149K5355j38177
261A2798j06892J0112L493J6627J31962J02567q3396j31564l4358r645m018R1117
273a197J18482N352p7005p5017p1717k3475Q5167J06543K9793r256l5480j08474
285e6284r1214N3652J17501M7664J0947Q100o8168j20968l3646P4637Q8911N7477
$$ plain form
297 88609 105439 56602 -32180 -97409 -110698 -54437 60461 131112 84797 -1660 -48781 -87920
309 -87920 -107097 -25935 101365 126269 51436 -18621 -67219 -104366 -75682 21858 101950 109376
321 109376 50112 -47200 -111431 -86020 -17925 34746 88796 114064 33233 -93678 -117684 -48330
333 -48330 3223 44019 105109 99145 -13444 -110542 -103153 -39999 26421 84848 98159 45352
345 45352 -35631 -98785 -106601 -31461 74177 105506 60286 12125 -38015 -105501 -104656 6280
357 6280 105569 96173 37580 -8668 -62547 -105410 -68353 32968 104939 94934 26163 -47195
369 -47195 -84620 -78720 -36679 41010 113266 98009 -4111 -85071 -85331 -52360 -11695 60115
381 60115 115326 73604 -34064 -97154 -82655 -33516 23957 76936 93886 46110 -44789 -108105
$$ packed form
297H8609J6830m8837q8782o5229j3289N6261J14898P0651m6315q6457m7121l9139
309h7920j9177Q1162J27300K4904p4833p0057m8598l7147K8684R7540Q0092P426
321A09376n9264r7312o4231K5411O8095N2671N4050K5268q0831j26911k4006O9354
333d8330N1553M0796O1090n964j12589r7098P389O3154O6420N8427J3311n2807
345D5352q0983o3154p816P5140J05638L1329m5220m8161n0140o7486Q45J10936
357F280R9289r396n8593m6248n3879m2863L7057J01321P1971j0005o8771p3358
369d7195l7425N900M2041P7689P2256j5257j02120q0960k60L2971M0665P1810
381F0115N5211m1722j07668o3090J4499M9139N7473N2979J6950m7776r0899o3316
$$ plain form
393 -108105 -86247 -4163 61590 78522 67080 24415 -58402 -115197 -72827 25973 81719 76367
405 76367 47311 -3498 -75485 -107063 -50897 46099 97549 76681 19385 -39231 -81466 -84719
417 -84719 -26981 62066 105860 65544 -12210 -63743 -77423 -60108 -4014 74003 105285 49911
429 49911 -37788 -82072 -72023 -34672 21333 82850 96027 29553 -60204 -93868 -62287 -7460
441 -7460 46703 85375 75413 4837 -74734 -96665 -49546 22114 70078 77677 46905 -16159 -81708
454 -81708 -94122 -30831 50228 82444 63733 21621 -35581 -86317 -80788 -9343 66661 88657
466 88657 53986 -6108 -59639 -82134 -57477 8444 78136 92858 35578 -37733 -72620 -68685
478 -68685 -36958 29160 90212 80716 8462 -54171 -75063 -62789 -13041 56809 88659 56091
$$ packed form
393a08105K1858Q2084O5753J6932j1442m2665q2817n6795M2370R8800N5746n352
405G6367k9056n0809p1987l1578N6166R6996N1450k0868n7296n8616m2235l253
417h4719N7738Q9047M3794m0316p7754n1533j3680J7315N6094P8017L1282n5374
429D9911q7699m4284J0049L7351N6005O1517J3177o6474q9757l3664L1581N4827
441g460N4163L8672r962p0576p9571k1931M7119P1660M7964P599l0772o3064o5549
454h1708j2414O3291Q1059L2216j8711m2112n7202n0736N529P1445P6004K1996
466H8657l4671o0094n3531k2495K4657O5921O9692J4722n7280p3311l4887L935
478f8685L1727O6118O1052r496p2254o2633k0892J2274M9748O9850L1850l2568
$$ plain form
490 56091 -6743 -62449 -85181 -49439 22403 69829 71733 43370 -16659 -84583 -87102 -16262
502 -16262 48123 66000 63357 30703 -44572 -96387 -63522 8050 55387 74163 57410 -5700
514 -5700 -67524 -77066 -42134 11651 69976 85964 30726 -39641 -66598 -62017 -34351 30022 87482
527 87482 71161 3765 -47772 -69733 -62627 -9812 59506 82674 48486 -7967 -62098 -81250
539 -81250 -41596 24037 65969 71581 38349 -31581 -82644 -65438 -8628 34654 63601 68656
551 68656 18319 -54830 -79551 -48349 334 50966 77172 46846 -13190 -54052 -69455 -51719
563 -51719 17438 83040 70155 11632 -24172 -53207 -77270 -35533 53977 85438 46207 3773
575 3773 -36070 -78376 -63654 12287 63392 61825 42638 -3013 -68683 -78451 -19741 27144 46280
$$ packed form
490E6091o2834n5706k2732L5742P1842M7426J904k8363o0029o7924k519P0840
502a6262O4385J7877k643l2654p5275n1815L2865P1572M7337J8776j6753o3110
514e700o1824r542L4932N3785N8325J5988n5238p0367k6957M581K7666O4373N7460
527H7482j6321o7396n1537k1961P106N2815O9318K3168l4188n6453n4131j9152
539h1250L9654O5633M1932N612l3232o9930n1063J7206N6810M3282K8947N055
551F8656n0337p3149k4721L1202M8683N0632K6206l0326o0036m0862j5403J7736
563e1719O9157O5602j2885n8523l5804k9035k4063M1737Q9510L1461l9231m2434
575C773l9843m2306J4722P5941N1105j567j9187m5651o5670r768N8710M6885J9136
$$ plain form
588 46280 66955 43965 -39660 -84367 -44389 -3671 15676 60678 82025 11598 -70015 -69656
600 -69656 -32084 -4044 42566 80958 48184 -22444 -60204 -64374 -40790 24742 78125 59265
612 59265 8984 -22142 -55420 -76054 -22390 62745 76436 31268 -1911 -30321 -66829 -57556
624 -57556 9002 62115 60684 30512 -10353 -51509 -63452 -34251 16430 62567 70474 23170
636 23170 -39754 -64765 -50027 -18132 32025 75086 60741 -3429 -57157 -65584 -37335 8622
648 8622 49051 62158 40819 -11172 -67442 -70737 -13103 37009 44142 45868 36501 -24334 -82541
661 -82541 -55891 11623 37916 42523 51042 16948 -49620 -69246 -36083 3062 44097 72431
673 72431 38943 -26954 -51580 -48413 -43342 10730 87487 72292 -13755 -44686 -32374 -50135
$$ packed form
588D6280K0675k2990q3625m4707L9978M0718J9347M5002K1347p0427q1613L59
600f9656L7572K8040M6610L8392l2774p0628l7760m170K3584O5532N3383j8860
612E9265n0281l1126l3278k0634N3664Q5135J3691m5168l3179k8410l6508R273
624e7556O6558N3113j431l0172m0865m1156j1943K9201N0681M6137P907m7304
636B3170o2924k5011J4738L1895N0157M3061j4345o4170n3728q427K8249M5957
648H622M0429J3107k1339n1991n6270l295N7634N0112P133J726r367o0835n8207
661h2541K6650O7514K6293M607Q519l4094o6568j9626L3163L9145M1035K8334
673G2431l3488o5897k4626L167N071N4072P6757j5195q6047l0931J2312j7761
$$ plain form
685 -50135 -36008 51599 90186 26389 -25524 -27118 -45674 -54751 5865 64566 52830 21087
697 21087 -4991 -52679 -70299 -13751 37104 36569 43105 43525 -26220 -89404 -47327 21417 28022
710 28022 34540 62238 22341 -66139 -79238 -20100 20160 39356 59152 37461 -26070 -61109
722 -61109 -49503 -19672 26464 65815 47881 -5067 -31753 -38682 -46203 -18948 43112 66724
734 66724 30344 -10007 -31380 -48941 -43649 1656 52493 63626 28708 -24396 -56018 -47425
746 -47425 -17556 17421 55061 62898 11866 -48850 -56871 -31666 -6210 31740 66322 43007
758 43007 -17018 -48684 -47206 -31175 11801 56320 48567 9697 -12848 -35962 -59280 -25555
770 -25555 41172 53119 23799 15083 -6198 -62259 -65274 7611 52550 40223 32606 14477 -46930
$$ packed form
685e0135J4127Q7607L8587o3797n1913j594j8556r077O0616N8701j1736l1743
697B1087k6078m7688j7620N6548N0855n35O536M20o9745o3184M2077O8744O605
710B8022O518K7698l9897q8480j3099N9138M0260J9196J9796k1691o3531l5039
722f1109J1606K9831M6136L9351j7934n2948k6686o929p521K7255O2060K3612
734F6724l6380m0351k1373j7561N292M5305N0837J1133l4918n3104l1622Q593
746d7425K9869L4977L7640P837n1032o0716q021K5205K5456L7950L4582k3315
758D3007o0025l1666J478J6031M2976M4519p753l8870k2545k3114k3318L3725
770b5555O6727J1947k9320q716k1281n6061l015P2885M4939j2327p617j8129o1407
$$ plain form
783 -46930 -75057 -23684 28169 38772 47306 36425 -26282 -68125 -37209 970 13635 43510
795 43510 60811 6951 -52420 -44984 -19531 -11827 24156 66567 39206 -24131 -41286 -32711 -32023
808 -32023 -1383 51533 56658 13933 -19099 -38544 -52478 -25413 33565 57829 36659 8090
820 8090 -26102 -59997 -46996 10566 48649 43889 24550 -4164 -41622 -52005 -21488 18320
832 18320 42310 43950 18498 -21807 -43671 -39492 -16880 21625 53450 42985 1042 -32013
844 -32013 -43437 -38374 -4818 39845 52675 27547 -7053 -38507 -52997 -26619 20930 44460
856 44460 40484 23467 -16876 -58220 -47851 2718 31927 35446 37511 13952 -37651 -56365 -23020
869 -23020 9954 26418 42532 35449 -8694 -43002 -40093 -23102 4967 46067 54281 10441 -28300
$$ packed form
783d6930k8127N1373N1853J0603Q534j0881o2707m1843L0916L8179J2665K9875
795D3510J7301n3860n9371P436K5453P704L5983M2411k7361o3337j7155Q575O88
808c2023L0640N2916N125m2725l3032j9445j3934K7065N8978K4264k1170k8569
820H090l4192l3895J3001N7562L8083m760j9339k8714l7458j0383L0517L9808
832A8320K3990J640k5452m0305k1864M179K2612L8505L1825j0465m1943l3055
844c2013j1424N063L3556M4663J2830k5128l4600l1454j4490K6378M7549K3530
856D4460l976j7017m0343m1344J0369N0569K9209L519K065k3559n1603j8714L3345
869b3020L2974J6464J6114p083m4143l4308K909J6991K8069M1100Q214m3840l8741
$$ plain form
882 -28300 -35153 -37628 -23988 27643 62586 33460 -11016 -26319 -36833 -40363 -2726 46497 48713
895 48713 17966 -9061 -34754 -48215 -21948 21325 39467 36292 20474 -18188 -52558 -38683
907 -38683 1526 23274 33778 40615 12996 -37862 -52265 -23560 7079 28297 44129 32049
919 32049 -9928 -43104 -43463 -19046 16973 44542 39123 9342 -19961 -39400 -41622 -10462 33107
932 33107 45424 25118 819 -23223 -44008 -35268 5442 38857 41563 21861 -9369 -37781
944 -37781 -40773 -17999 12672 39759 45385 13066 -30411 -41319 -26189 -9566 17119 48075
956 48075 40126 -6886 -37837 -34518 -23328 -2201 33283 47380 20833 -14541 -34228 -39279 -20099
969 -20099 19346 41386 31177 11833 -12972 -44100 -43972 -244 35256 33542 23911 10483 -26395
$$ packed form
882b8300o853k475J3640N1631L4943k9126m4476j5303j0514l530L7637M9223K216
895D8713l0747k7027k5693j3461K6267M3273J8142l175j5818l8662l4370J3875
907c8683M0209K1748J0504O837k7619n0858j4403K8705L0639K1218J5832j2080
919C2049m1977l3176l59K4417L6019K7569n419k9781k9303j9439k222L1160M3569
932C3107J2317k0306k4299k4042k0785Q740M0710L3415K706j9702l1230k8412
944c7781k992K2774L0671K7087N626l2319m3477j0908J5130J6623K6685L0956
956D8075p949m7012l0951L319J1190K1127L5484J4097k6547l5374j9687n051J9180
969b0099L9445K2040j0209j9344k4805l1128J28M3728L5500j714r631j3428l6878
$$ plain form
982 -26395 -53922 -28219 17654 34677 31469 22084 -6254 -39898 -41235 -12284 16932 36870 37646
995 37646 8948 -25255 -35246 -27479 -11331 20849 48023 32834 -8869 -31330 -31360 -25705 -2951
1008 -2951 35154 46834 18681 -16878 -34636 -35287 -16143 16505 38079 34765 10723 -22761 -42512
1021 -42512 -30878 1198 24832 33429 29050 3530 -32270 -42785 -19785 10091 28297 34774
1033 34774 21927 -9538 -36021 -37045 -14866 16606 38579 33819 7100 -19416 -35179 -34340 -7524
1046 -7524 30211 42852 22006 -5776 -25104 -36192 -26870 7296 37017 35764 14240 -11376
1058 -11376 -33138 -35176 -12277 17976 33889 31532 10070 -21681 -39095 -27107 -1129 21036
1070 21036 34942 29873 -341 -32182 -37538 -18738 6477 29450 37927 18927 -14005 -35289
$$ packed form
982b6395k7527K5703M5873J7023l208r385k8338l3644j337K8951K9216J9938P76
995C7646k8698l4203r991P767J6148L2180K7174j5189m1703k2461l0N655K2754
1008b951L8105J1680k8153l5559j7758o51J9144L2648K1574l314k4042l3484j9751
1021d2512J1634L2076K3634Q597m379k5520l5800j0515K3000K9876J8206O477
1033C4774j2847l1465k6483j024K2179L1472K1973m760k6719k6516j5763Q39K6816
1046g524L7735J2641k0846k7782j9328j1088R322L4166K9721j253k1524k5616
1058a1376k1762k038K2899L0253J5913k357k1462l1751j7414J1988K5978K2165
1070B1036J3906n069l0214l1841n356J8800K5215K2973Q477j9000l2932k1284
$$ plain form
1082 -35289 -33217 -12088 17354 37164 30672 5056 -20881 -34695 -29217 -2409 27224 36168 21661
1095 21661 -3072 -25692 -35181 -21522 7733 30754 33757 16647 -11525 -33782 -33116 -10605 15869
1108 15869 33076 32040 8455 -22827 -37192 -25749 -732 23289 35453 25259 -3573 -29719
1120 -29719 -34704 -18421 8894 30305 32290 14160 -11780 -30964 -32087 -11740 17925 34345
1132 34345 26990 5173 -18306 -33039 -28711 -2935 26150 35586 21250 -3963 -25611 -32979 -20909
1145 -20909 6802 31580 34825 13947 -14224 -31256 -29332 -10432 15635 33685 29568 4862
1157 4862 -21985 -33057 -23144 -739 21805 32657 23373 -3041 -28054 -33794 -16348 8771 27078
1170 27078 30629 16064 -10757 -32894 -31498 -8143 17887 30241 26138 7347 -18645 -34835
$$ packed form
1082c5289K072K1129K9442J9810o492k5616k5937j3814N478K6808K9633Q944j4507
1095B1661k4733k2620r489J3659K9255K3021L003j7110k8172k2257O66K2511K6474
1108A5869J7207j036k3585l1282j4365J1443K5017K4021J2164j0194k8832k6146
1120b9719m985J6283K7315K1411J985j8130k5940j9184j123K0347K9665J6420
1132C4345p355k1817k3479j4733M328K5776K9085R436j4336k5213k1648p368J2070
1145b0909K7711K4778L245k0878k8171j7032J924J8900K6067J8050m117k4706
1157D862k6847j1072R913K2405K2544J0852r284k6414k5013n740J7446K5119J8307
1170B7078L551j4565k6821k2137J396K3355K6030J2354m103j8791k5992j6190
$$ plain form
1182 -34835 -26647 1507 26010 31179 18848 -2600 -23939 -33400 -19049 9856 30243 29290 11592
1195 11592 -11604 -29013 -28620 -9741 16133 32180 26999 3712 -21602 -30347 -21162 -2178 20419
1208 20419 34293 23145 -6775 -28702 -27782 -14964 4229 27609 33974 12626 -16869 -28714
1220 -28714 -24502 -9387 14122 32336 26929 2450 -20416 -30208 -23064 600 24430 29400 17672
1233 17672 -1932 -23856 -34163 -16832 13693 28154 23108 11838 -6925 -29745 -31874 -6072
1245 -6072 20373 27666 21810 5959 -17769 -32309 -22654 1421 22539 30004 19210 -5274 -26285
1258 -26285 -28499 -14966 7706 28289 30384 9407 -15228 -26453 -24098 -9051 14511 31917
1270 31917 25235 351 -21431 -27337 -18804 -312 19866 30205 20226 -5831 -28138 -27696 -10516
$$ packed form
1182c4835Q188K8154K4503N169j2331k1448k1339r461J4351K8905K0387r53j7698
1195A1592k3196j7409L93J8879K5874J6047n181k3287k5314q745R185J8984K2597
1208B0419J3874j1148k9920k1927R20J2818J9193K3380O365k1348k9495j1845
1220b8714M212J5115K3509J8214n407k4479k2866r792P144K3664K3830M970j1728
1233A7672j9604k1924j0307J7331L0525J4461n046j1270j8763k2820k129K5802
1245f072K6445P293n856j5851k3728j4540R655K4075K1118P465j0794k4484k1011
1258b6285k214J3533K2672K0583K095k0977k4635j1225K355J5047K3562J7406
1270C1917o682k4884k1782n906Q533J8492K0178J0339r979k6057k2307M42J7180
$$ plain form
1283 -10516 8710 22530 27792 14627 -13447 -30686 -24513 -5253 14241 28274 25173 2748
1295 2748 -20766 -28657 -21095 182 24458 30525 13926 -6917 -21269 -28026 -17357 11093 30515
1308 30515 22279 5632 -7606 -23329 -30202 -8378 21910 28286 16762 3804 -14499 -30676
1320 -30676 -22225 3853 22308 26126 18612 -3504 -28258 -27411 -8476 7432 20857 29796 14976
1333 14976 -18080 -32013 -19423 -3206 12000 27904 26311 -1266 -23968 -24580 -15278 -526 20657
1346 20657 29801 14250 -8679 -21076 -24138 -15242 7995 27666 24750 7435 -10118 -25269 -27419
1359 -27419 -6440 20001 28033 17947 2115 -16567 -29041 -20589 3907 23725 26156 13914
1371 13914 -6385 -23144 -26401 -12371 10891 26182 23902 7058 -12999 -26158 -23250 -3765
$$ packed form
1283a0516J9226J3820N262j3165k8074j7239O173J9260J9494J4033l101k2425
1295B748k3514p891P562K1277K4276O067j6599k0843j4352o757J0669K8450J9422
1308C0515q236j6647j3238j5723o873K1824L0288O376j1524j2958j8303j6177
1320c0676Q451K6078J8455L818p514k2116k4754Q47J8935J5908J3425Q939j4820
1333A4976l3056j3933J2590J6217J5206J5904j593k7577k2702o12R302J4752K1183
1346B0657R144j5551k2929j2397l062Q896K3237J9671k916j7315j7553j5151k150
1359b7419K0979K6441Q032j0086j5832j8682j2474Q452K4496J9818K431j2242
1371A3914k0299j6759l257J4030K3262J5291k280j6844k0057j3159K908J9485
$$ plain form
1383 -3765 18085 25256 17130 2398 -15686 -28255 -19804 4526 21183 23525 16126 -2331 -25414
1396 -25414 -29320 -9384 11303 22791 25320 11530 -16956 -30199 -17583 -865 11681 26129
1408 26129 24882 -1910 -25065 -21609 -11842 -2838 17863 32629 14976 -14011 -21398 -18247 -14369
1421 -14369 4994 29876 25776 1662 -12441 -20039 -23954 -7769 20183 27378 14349 2571 -12740
1434 -12740 -31132 -22942 9531 26313 19543 11655 -621 -24915 -31177 -6950 17386 20561 17947
1447 17947 9029 -11795 -27489 -19811 -1264 13811 24315 21034 -106 -20584 -22834 -14989 -936
1460 -936 20846 30153 12870 -11951 -21281 -20140 -12086 7925 26740 24405 4823 -14786 -24665
1473 -24665 -20598 -2684 16785 24913 19418 1079 -22257 -28609 -11207 8171 16958 22172 15962
$$ packed form
1383c765K1850P171q126j4732j8084j2569Q451K4330J6657K342p399j8457k3083
1396b5414l906J9936K0687J1488K529j3790k8486j3243J2616J6718J2546J4448
1408B6129j247k6792k3155L456R767R004K0701J4766j7653k8987p387L151L878
1421a4369J9363K4882m100k4114j4103p598l915J6185K7952P195j3029j1778j5311
1434a2740j8392Q190L2473J6782o770p888j2276k4294o262K4227K4336L175k614
1447A7947q918k0824j5694P678J8547J5075J0504l281k1140k0478k250P845J4053
1460i36K1782R307j7283k4821r330J141Q054K0011J8815k335j9582j9609r879
1473b4665M067J7914J9469Q128n495j8339k3336o352J7402J9378Q787N214o210
$$ plain form
1486 15962 -7411 -26239 -21841 -5392 8209 19963 23579 7888 -14814 -23535 -20090 -6269 16710
1499 16710 29607 16874 -4882 -15969 -22212 -20461 2649 28264 24960 4052 -7181 -15861 -25514
1512 -25514 -14077 15118 27840 16522 2913 -9829 -24449 -22662 -156 18480 22107 16408
1524 16408 957 -20509 -25981 -10374 5515 14843 23610 17620 -8309 -27164 -20323 -5406 6904
1537 6904 20992 26024 7358 -18588 -25986 -16683 -687 16234 25506 16356 -3186 -18883 -23285
1550 -23285 -14156 5870 21442 21080 9450 -5867 -21202 -23983 -8429 13170 23033 18482 4421
1563 4421 -12876 -23688 -18965 -2409 16600 25372 16075 -3606 -18102 -21572 -15208 2191 22965
1576 22965 26696 8437 -11456 -19621 -20987 -10382 12939 27158 18300 625 -12776 -21847 -19358
$$ packed form
1486A5962k3373j8828M398J6449J3601J1754L616j5691k2702q721L445J3821K2979
1499A6710J2897j2733k1756j1087o243J751K3110K5615l304k0908j1233q680r653
1512b5514J1437K9195J2722j1318j3609j2742j4620J787K2506J8636L627n699
1524A6408j5451k1466n472J5607J5889R328Q767n990k5929j8855O841J4917J2310
1537F904J4088N032j8666k5946p398R303J5996J6921R272r150j9542j5697m402
1550b3285R129K0026J5572l62j1630j5317j5335k781J5554K1599R863m551j4061
1563D421j7297j0812M723J6556J9009Q772r297j9681j4496l470O364J7399K0774
1576B2965L731j8259j9893q165j366J0605K3321J4219q858j7675j3401r071K489
$$ plain form
1589 -19358 391 18845 20517 12589 972 -17230 -26528 -12455 8867 17986 19515 14349 -6927
1602 -6927 -26804 -22071 -1845 10770 18377 22680 7195 -18945 -25687 -12874 71 13126 25195
1615 25195 17866 -5789 -20547 -19534 -12590 3095 23187 24497 5244 -10912 -17193 -20379 -10746
1628 -10746 13496 26066 15454 202 -10106 -21202 -21383 -123 20109 21508 12580 -194 -17815
1641 -17815 -26315 -12192 9154 19964 20029 10599 -8849 -24182 -19866 -3481 11104 20755 20200 3438
1655 3438 -16717 -22320 -14721 -261 15610 23535 14341 -4420 -18689 -21293 -11877 6206 21275
1668 21275 20474 8043 -8117 -20999 -21325 -5648 13358 21789 17830 3522 -15053 -24292 -15266
1681 -15266 1965 15335 21808 15601 -3954 -21550 -20932 -8148 5742 18073 22125 8949 -11472
$$ packed form
1589a9358J9749J8454J672p928j1617j8202r298J4073K1322R119J529n166k1276
1602f927j9877M733K0226J2615P607M303j5485k6140o742J2813J2945J3055J2069
1615B5195p329k3655j4758J013O944J5685K0092J310j9253j6156o281l186R633
1628a0746K4242J2570j0612j5252j0308j1096j81K1260K0232J399q928j2774j7621
1641a7815q500J4123K1346J0810O5r430j9448j5333M316J6385J4585R651n55j6762
1655C438k0155n603P599J4460J5871P925r194j8761j4269k604R416J8083J5069
1668B1275q01j2431j6160j2882l26J5677J9006Q431l959j4308j8575r239R026
1681a5266J7231J3370O473o207j9555j7596O18J2784J3890J2331M052j3176k0421
$$ plain form
1694 -11472 -20953 -17518 -6129 11687 23714 17062 -150 -13268 -20369 -17769 -1032 19809 23156
1707 23156 9801 -4209 -15361 -22637 -13374 9214 22172 17799 6493 -7236 -21287 -21308 -4018
1720 -4018 14274 21034 16639 2356 -15717 -22394 -12938 1338 14553 22632 14993 -6371 -21204
1733 -21204 -18410 -7762 4103 18334 23105 8109 -12808 -22099 -16673 -3390 11889 20788 16370
1746 16370 2129 -14286 -22946 -15622 4082 18771 18604 10339 -2185 -18076 -23737 -9625 11111
1759 11111 19778 16388 7143 -8101 -21512 -19424 -3246 13707 21216 15440 265 -14929 -20274
1772 -20274 -13769 421 17579 23713 10660 -8134 -17322 -16874 -10534 4856 21412 21604 4060
1785 4060 -13400 -19161 -15454 -4152 11611 21461 17183 523 -16344 -21698 -12315 3960 15782
$$ packed form
1694a1472r481L435J1389J7816J2027o652j7212j3118p101K600J6737K0841L347
1707B3156j3355j4010j1152p276R263K2588J2958m373j1306j3729j4051k1J7290
1720d018J8292O760m395j4283j8073o677R456J4276J3215Q079p639k1364j4833
1733b1204K794J0648J1865J4231M771j4996k0917r291N426J3283J5279Q899m418
1746A6370j4241j6415q660P324J9704J4689j67q265j2524j5891n661J4112K0736
1759A1111Q667l390r245j5244j3411K088J6178J6953P509n776j5175j5194n345
1772b0274O505J4190J7158O134j3053j8794r188M48O340J5390J6556J92j7544
1785D060j7460n761L707J1302J5763R850m278j6660j6867n354R383J6275J1822
$$ plain form
1798 15782 18770 12709 -3837 -20632 -21396 -6248 9842 17773 17411 7458 -10012 -22097 -17727 -1434
1812 -1434 13981 19846 14176 329 -14216 -21253 -14431 3703 18568 19444 8511 -5515 -16484
1825 -16484 -19748 -10353 9012 22200 17503 3184 -10546 -18387 -17062 -4000 13604 21825 14362
1838 14362 -1159 -16050 -19555 -11817 2329 16012 20474 11320 -7170 -19769 -18292 -5857 7812
1851 7812 17758 18724 6031 -12245 -20622 -15184 -873 12731 19644 14923 -427 -16364 -20987 -11454
1865 -11454 4549 16805 19001 9972 -5736 -19425 -19399 -6190 10114 19021 16214 4459 -10958
1878 -10958 -19883 -16194 -1180 14354 20150 12654 -1456 -14598 -19194 -12513 3434 18051 19773
1891 19773 8222 -7586 -17528 -17501 -7118 8971 20057 17394 2556 -11907 -18772 -14852 -1940
$$ packed form
1798A5782K988o061j6546j6795p64J5148J6090P931l62r953j7470j2085M370J6293
1812a434J5415N865n670j3847j4545p037O822J8134J4865Q76j0933j4026j0969
1825a6484l264R395J9365J3188m697j4319j3730p841J325J3062J7604Q221p463
1838A4362j5521j4891l505P738J4146J3683M462r154j8490j2599J477J2435J3669
1851G812R946R66j2693j8276q377N438J4311J3604O913m721j5350j5937m623R533
1865a1454J6003J2256K196r029j5708j3689K6J3209J6304Q907k807j1755j5417
1878a0958q925L689J5014J5534N796p496j4110j3142m596O681J5947J4617J722
1891A9773j1551j5808r942K7J0383J6089J1086k663j4838j4463o865L920J2912
$$ plain form
1904 -1940 14047 21265 13164 -3233 -15640 -18400 -10893 3725 17382 19345 7854 -7756 -17867
1917 -17867 -17569 -6114 9351 18485 16252 3951 -11517 -20569 -15101 1291 14133 17793 12902
1930 12902 -56 -16108 -21858 -10099 7300 16306 16805 9443 -6299 -20249 -18169 -3603 10377
1943 10377 17452 15935 3880 -12873 -19708 -13134 -10 12808 20172 12782 -4198 -16258 -17102
1956 -17102 -10267 3174 18401 19964 5374 -8948 -15263 -16017 -7706 9432 21403 15599 100
1969 100 -11609 -17127 -14874 -1040 15395 19761 10848 -2497 -15313 -19562 -9471 6990 16678
1982 16678 16754 7567 -7205 -19236 -16986 -2675 10656 16389 15270 3766 -13013 -20451 -12581 1889
1996 1889 13210 17610 12521 -2809 -17107 -18572 -7812 6407 15841 16658 7359 -7889 -18211
$$ packed form
1904a940J5987P218q101j6397j2407k760P507J4618J3657J963j1491j5610j0111
1917a7867K98J1455J5465R134k233j2301j5468r052N468J6392J2842L660m891
1930A2902j2958j6052n750J1759J7399R006M99p362j5742j3950K080J4566J3980
1943A0377P075j517j2055j6753o835O574J3124J2818P364p390j6980j2060q44
1956a7102O835J3441J5227J563j4590j4322o315p54Q311J7138J1971n804j5499
1969A00j1709n518K253J3834J6435M366q913j3345j2816m249J0091J6461R688
1982A6678P6r187j4772j2031K250J4311J3331N733j119j1504j6779p438P870J4470
1996A889J1321M400n089j5330j4298j465J0760J4219R434Q17r299j5248j0322
$$ plain form
2009 -18211 -17013 -4415 10747 18555 14723 2130 -12260 -19771 -13648 1542 15438 18907 9968
2022 9968 -4587 -15907 -16725 -8760 5279 17681 17830 4688 -9204 -15909 -14690 -6192 9876 20812
2036 20812 14251 -1112 -12032 -16381 -13500 -366 15498 19183 9228 -4098 -14981 -18228 -8831
2049 -8831 7069 16782 16350 7490 -8288 -20835 -16469 -185 11598 15393 14235 2922 -14966
2062 -14966 -20758 -8639 4751 12049 15433 11349 -3026 -16562 -16919 -6520 5663 15929 16940
2075 16940 5439 -8723 -16577 -16303 -4917 12143 20617 12011 -1417 -11068 -16946 -14010 1148
2088 1148 17264 18767 7595 -5266 -14652 -16903 -8056 7297 18103 16416 3995 -11026 -17643
2101 -17643 -11804 -1411 8714 16850 14682 -650 -14468 -15692 -8996 -173 11682 19013 11230
$$ packed form
2009a8211J198J2598J5162P808l832j2593j4390p511O123J5190J3896L469q939
2022I968j4555j1320q18P965J4039J2402J49j3142j3892o705J219Q498J6068J0936
2036B0812o561j5363j0920m349K881J3134J5864L685r955j3326j0883l247R397
2049h831J5900R713m32q860j5778j2547M366J6284J1783L795j158j1313j7888
2062a4966n792J2119J3390P298L384m084j4375j3536l57J0399J2183J0266J011
2075A6940j1501j4162p854K74J1386J7060Q474q606j3428r651n878K936J5158
2088A148J6116J503j1172j2861r386k251Q847J5353J0806j687j2421j5021o617
2101a7643N839J0393J0125Q136k168j5332j3818j224O696Q823J1855P331p783
$$ plain form
2114 11230 -5379 -16409 -16699 -8066 7320 18427 15809 3474 -9037 -17895 -16611 -609 15319
2127 15319 16191 8566 1118 -10826 -20027 -11990 6780 16011 12915 7753 -1924 -16503 -18150 -4304
2141 -4304 9181 14028 13806 6011 -9457 -17183 -12087 -1977 8161 17815 15696 -1293 -15473 -16024
2155 -16024 -9704 -132 14956 21211 8215 -10282 -16130 -13043 -6412 7058 18901 14984 238
2168 238 -11003 -14061 -11576 -2224 10846 17003 11053 -837 -12037 -16925 -10136 3677 14415 15409
2182 15409 8118 -4151 -15845 -16676 -5792 8367 16501 14451 3763 -9105 -17814 -14608 -792
2195 -792 13936 17402 9942 -1873 -12833 -18341 -9887 7377 16072 12345 4975 -3962 -14438 -16196
2209 -16196 -3702 9660 13533 11828 5086 -8318 -18084 -12805 -55 10124 17002 14022 -2262
$$ packed form
2114A1230j6609j1030k90Q633J5386J1107k618j2335j2511q858J284J6002J5928
2127A5319Q72p625p448j1944r201Q037J8770R231l096n162r677j4579j647J3846
2141d304J3485M847k22p795j5468p726N096J0110J0138R654k119j6989j4180n51
2155a6024O320R572J5088O255j2996j8497n848L087O631J3470J1843l917j4746
2168B38j1241l058K485R352J3070O157n950j1890j1200m888O789J3813J0738R94
2182A5409p291j2269j1694q31J0884J4159Q134k050j0688j2868q709L206J3816
2195g92J4728L466p460j1815j0960n508Q454J7264Q695l727p370q937j0476j758
2209a6196J2494J3362L873j705o742j3404r766N279J2750J0179O878k980j6284
$$ plain form
2222 -2262 -16670 -15643 -6287 2160 13027 19171 8072 -10710 -16308 -10935 -5269 5621 18434
2235 18434 15718 -1164 -12823 -13175 -10969 -2218 12937 18040 7801 -4174 -10755 -14886 -9864 5459
2249 5459 15104 12159 5969 -2403 -15160 -18409 -4144 11747 14486 11238 5106 -8969 -20284 -13139
2263 -13139 3839 13429 14250 9777 -1858 -14828 -15853 -5882 5358 13409 15351 5640 -8039 -14861
2277 -14861 -11930 -4398 7641 16838 13289 -84 -10861 -13769 -10990 -812 12042 16947 9113
2290 9113 -3860 -12599 -14685 -8033 3761 14517 16189 5677 -8162 -16673 -12951 -2256 9030
2303 9030 15762 12646 282 -12540 -15399 -9209 1210 11736 15386 8554 -3434 -12523 -14806 -7762
2317 -7762 5533 14674 13452 4409 -5827 -14562 -14847 -2679 11085 14777 9636 2133 -9112 -17342
$$ packed form
2222b262j4408J027R356Q447J0867O144j1099j8782n598N373N666J0890J2813
2235A8434k716j6882j1659l52K206Q751J5155N103j0239j1975o581m131N022J5323
2249E459R645k945o190q372j2757l249J4265J5891K739l248o132j4075j1315P145
2263a3139J6978R590Q21m473j1635j2970j025R971J1240Q051J942r711j3679o822
2277a4861K931P532J2039R197l549j3373j0777k908K779J0178J2854M905p834
2290I113j2973q739k086O652J1794J0756J672j0512j3839q511L722J0695J1286
2303I030O732l116j2364j2822k859O190J0419J0526L650o832j1988r089k283P044
2317g762J3295R141j222r043j0236q735k85J2168J3764L692n141p503j1245q230
$$ plain form
2331 -17342 -11461 3755 13411 13223 8185 -2072 -14167 -15789 -5373 6666 13730 14011 4568 -9058
2345 -9058 -14844 -10945 -2233 7661 15313 12636 -1371 -11601 -12846 -9095 -615 11929 17042 7863
2359 7863 -6165 -12611 -13042 -7085 5313 15287 13584 3043 -8307 -14684 -12551 -1479 10197 14064
2373 14064 10829 1309 -11324 -16380 -8481 3862 11154 13101 8606 -3557 -14943 -14819 -4129 7137
2387 7137 12999 12625 4021 -8038 -14392 -12148 -1836 10168 15093 9588 -1052 -9845 -14255 -10632
2401 -10632 2436 14544 14423 4763 -4787 -11527 -14119 -6128 7318 14818 11511 2672 -7616 -14442
2415 -14442 -11274 -507 9715 14088 10898 -365 -12745 -14384 -6685 2578 10672 14607 7884 -6041
2429 -6041 -14623 -11908 -3697 5214 13341 13492 2856 -9683 -14383 -10068 -512 9504 14523 9585
$$ packed form
2331a7342N881J5216R656j88n038j0257j2095j622J0416J2039P064K81r443j3626
2345i058n786L899Q712R894P652k677j4007j0230j245L751Q480J2544N113r179
2359G863j4028o446m31N957J2398R974j703j0541j1350o377K133J1072J1676L867
2373A4064l235r520j2633n056P899J2343P292J947m495j2163j1386J24J0690J1266
2387G137N862l74q604j2059o354K244J0312J2004M925n505j0640q793m410L623
2401a0632J3068J2108j21r660r550o740k592P991J3446P500l307q839j0288o826
2415a4442L168J0767J0222M373l190j1263j2380j639P699R263Q094L935o723j3925
2429f041q582K715Q211Q911Q127J51j0636j2539m700M315R556J0016N019m938
$$ plain form
2443 9585 -1257 -10788 -14514 -8592 4275 13109 12207 5370 -4079 -12868 -13949 -4658 8025 13617
2457 13617 10842 2360 -7735 -14572 -11633 -348 10485 14356 9094 -1858 -11298 -13400 -7532 3178
2471 3178 12450 13804 5532 -5998 -12564 -11763 -5032 6547 14823 11673 996 -8963 -12736 -10365
2485 -10365 -671 9954 14386 8960 -2410 -11644 -13492 -6623 3691 11849 13196 6214 -5545 -14216
2499 -14216 -11925 -2097 7493 12598 11247 2640 -9082 -14609 -9247 1364 9545 13246 8545 -1696
2513 -1696 -11893 -13601 -6106 4644 12018 11924 4799 -4703 -13165 -13073 -3742 8607 13878 9604 894
2528 894 -7613 -13090 -10753 212 11267 13951 6838 -3601 -10825 -12208 -6540 3799 12640 13491
2542 13491 4345 -7293 -12811 -10061 -3116 5932 13298 11355 545 -10399 -12726 -7583 553 9121
$$ packed form
2443I585j0842r531l726N922J2867Q834r02o837r449q789j081R291J2683N592
2457A3617k775q482j0095o837K939J1285J0833L871n262j0952r440k102N868J0710
2471C178R272J354q272j1530o566Q01O731J1579Q276l150j0677r959l773K371
2485a0365R694J0625M432n426j1370r234j848O869J0314Q158J347o982j1759q671
2499a4216K291R828R590N105j351q607j1722n527N362J0611Q181L701m701j0241
2513a696j0197j708P495J0750P374r4p125r502q462R2R331J2349N271m274q710
2528H94q507n477K337J0965J1055K684p113j0439p224j383N668J0339Q841Q51
2542A3491r146j1638n518K750O945R048P366j943j0810j0944k327N143Q136Q568
$$ plain form
2556 9121 13724 8916 -3450 -12651 -12378 -4693 4335 11504 12233 5159 -6193 -13964 -11376 -955 8376
2571 8376 12140 9223 1630 -8418 -14095 -9504 2487 11360 11530 5888 -2209 -9825 -13170 -6483 5604
2586 5604 13406 10912 2602 -6087 -11818 -11200 -3258 8399 13906 9174 -596 -8861 -12150 -8480 1178
2601 1178 11083 13270 6786 -4392 -11975 -11402 -4536 4462 11357 12055 4020 -7574 -13131 -9157 -556
2616 -556 7128 11719 10247 511 -10472 -13539 -6603 2243 9599 11860 7225 -3173 -11957 -12406 -4547
2631 -4547 5763 12053 10860 2885 -6611 -12407 -10272 -1168 9192 12881 7861 -1142 -9106 -11736
2645 -11736 -7822 1795 11078 12228 4988 -4201 -10164 -11151 -5340 5446 12344 10611 2468 -6272 -11591
2660 -11591 -9970 -1580 8517 12590 8625 -915 -9388 -12800 -7563 2851 10581 11848 5816 -4326
$$ packed form
2556I121M603m808j2366r201K73P685R028P169P29p074j1352p771K588J0421R331
2571H376L764k917p593j0048n677M591J1991Q873J70n642q097p616l345O687J2087
2586E604P802k494q310q689n731O18P942J1657N507m732r770q265l289L670R658
2601A178R905K187o484j1178p583N73O866Q998O895O98q035j1594n557L974Q601
2616e56P684M591j472r736j0983l067O936Q846P356K261m635j0398q784m49P859
2631d547J0310O290j193p975r496n796K135R104J0360L689n020r003p964k630
2645a1736L914R617R283J150p240r189n963r87N811J0786O898j733q143q740n319
2660a1591J621Q390J0097M073l965r540q473l412N237J0414P730J267o032j0142
$$ plain form
2674 -4326 -12561 -11196 -2961 6438 11072 10159 2456 -7909 -12509 -8362 393 7886 11199 8373 -734
2689 -734 -9525 -11575 -6443 2024 10164 12250 5678 -4271 -11258 -10830 -3708 5932 12175 10400 1972
2704 1972 -7292 -12504 -9381 122 9274 12057 7142 -1317 -9751 -12151 -6371 3562 11030 10457 4030
2719 4030 -4560 -10843 -10040 -2924 5499 11118 9016 1799 -6421 -10896 -8871 -1142 8249 12068 7890
2734 7890 -1993 -9161 -11706 -6865 2848 11692 11494 3493 -5745 -11334 -10038 -2300 6644 11118 8806
2749 8806 1258 -7647 -11829 -7523 992 7774 10566 7371 -1439 -10617 -10944 -4056 3175 8324 10810
2764 10810 5433 -4804 -11578 -9440 -2418 5434 10866 10137 1713 -8176 -12163 -8660 575 10102 12006
2779 12006 5862 -2889 -9172 -11023 -5365 4889 11666 9049 1440 -4421 -8630 -9955 -3496 7124
$$ packed form
2674d326q235J365Q235R399M634r13p703j0365m600M147Q755P493L313k826r107
2689g34q791k050N132Q467Q140K086o572r949o987M28P122R640O243j775q428
2704A972r264n212L123R503R152K783m915q459q434k400N780R933P468n73o427
2719D030q590o283Q03P116Q423N619k102p217q220m475K025P729R391L819m178
2734G890r883p168k545M841R713Q844j98q001r238n589J296P738Q944M474k312
2749H806p548q905m182M306Q515O782K792l195q810r178l27O888P231N149K486
2764A0810n377j0237o774K138P022P852N432p29q424r889l987L503R235R527J904
2779A2006o144q751o283j851N658J0254O777k617p609n861m209j325O459J0620
$$ plain form
2793 7124 11408 7650 34 -6232 -10173 -8149 -150 8676 11511 6590 -2605 -9444 -10309 -5302 3201
2808 3201 9838 11391 4277 -6366 -11823 -9100 -753 6490 10953 9078 745 -9783 -12042 -4775
2822 -4775 3342 7481 8531 6341 -1297 -10181 -10807 -2804 4293 7880 9010 5116 -4104 -11717 -9553
2837 -9553 -1536 6834 11222 8212 34 -8100 -10441 -7464 484 9919 12557 3736 -4983 -7958 -8588
2852 -8588 -6782 3373 13593 10255 -809 -6937 -7747 -8177 -3001 7390 11905 5794 -2005 -6463
2866 -6463 -8974 -6828 1072 8017 9475 6540 -1106 -10542 -11599 -2789 5428 8220 9199 5696 -5969
2881 -5969 -14080 -8258 2637 7348 7885 7934 965 -9462 -11653 -4606 3511 7889 8778 4913 -3486
2896 -3486 -9414 -8933 -3699 4383 10704 8584 372 -5484 -7903 -8230 -3018 7268 12069 6406 -1681
$$ packed form
2793G124M284l758p616o266l941K024P999Q826K835m921r195o839q65N007Q503
2808C201O637J553p114j0643n457K723Q347P243M463j875q333j0528k259P267
2822d775Q117M139J050k190p638q884o26Q003P097L587J130l894r220p613K164
2837i553Q017Q370M388l010q178q134k341K977P948R435K638q821q719k975o30
2852h588J806J0155J0220l338j1064o128q10m30N176J0391M515o111p799m458
2866f463k511K146P900O945J458k935p646r436j057Q810Q217K792R79l503j1665
2881e969q111N822J0895M711N37M9o969j0427k191P047Q117M378Q89l865q399
2896c486n928M81N234Q082O321k120q212n856k419l27N212J0286M801n663q087
$$ plain form
2911 -1681 -6679 -9034 -7265 466 10110 12259 3867 -5268 -9867 -8823 -2950 4795 10342 8601 1060
2926 1060 -7438 -9957 -6344 238 6150 8809 6699 174 -7890 -10555 -4960 3097 8090 8535 5196
2941 5196 -2381 -9930 -10370 -2453 5953 8916 7590 2657 -5574 -11013 -8119 679 7858 10070 6721
2956 6721 -1255 -8778 -9911 -4358 2876 8857 9519 3081 -5397 -8767 -6958 -2955 3669 10017 8612
2971 8612 259 -6405 -8387 -6593 -1378 7026 10806 6345 -2012 -7869 -9563 -5529 3389 9355 8376
2986 8376 3074 -3144 -9426 -9505 -1877 6699 9239 6440 1337 -5849 -10201 -7008 1457 7383 8693
3001 8693 5854 -1635 -8261 -9154 -3877 2863 7679 8683 3887 -4294 -8719 -7777 -2340 4601 9962
3016 9962 8048 606 -6830 -9206 -6256 381 7402 9653 5395 -2779 -8599 -8805 -3561 3639 8011
$$ packed form
2911a681m998k355J769P731R644K149q392r135m599J044N873P745N547j741p541
2926A060q498k519L613O582N912K659k110o525q064k665N595Q057M993M45l339
2941E196p577p549m40P917Q406K963j326m933q231n439K894Q798P179K212l349
2956F721p976p523j133N553P234N981O62o438q478l370J809M003O624O348j405
2971H612q353o664j982J794N215Q404L780m461q357n857j694M034Q918N966r79
2986H376n302o218o282p9P628Q576K540k799n103p186m352L193Q465N926J310
3001H693k839p489o626q93N277O740M816J004m796q181m425R42N437O941N361
3016I962j914p442p436k376K950O637P021K251m258q174n820k06N244P200M372
$$ plain form
3031 8011 7842 3592 -4129 -9553 -7841 -973 5844 8489 6498 757 -6128 -9383 -6348 1140 7765
3046 7765 8935 4620 -2369 -7450 -8618 -4885 2910 9634 8206 1687 -4413 -7930 -7676 -2158 6150
3061 6150 10072 6398 -820 -6540 -8547 -5952 939 7276 8902 4796 -2650 -8228 -8139 -2711 3039
3076 3039 7346 8432 3431 -5223 -10272 -6820 -440 4846 7911 7155 911 -7148 -9646 -5167 2145
3091 2145 6956 7810 4484 -1691 -8137 -8969 -3538 4887 8732 6464 1570 -3794 -8050 -8219 -1090 7197
3107 7197 8893 5132 -648 -5441 -8105 -6161 1100 7960 8991 3498 -3631 -7435 -7273 -3316 2520
3122 2520 8541 8819 1195 -6676 -8142 -4952 -939 4345 9297 7356 -986 -8112 -7690 -3502 1590
3137 1590 6242 8341 4610 -2913 -8683 -8153 -1842 4607 7224 6212 2683 -4028 -9353 -7696 881
$$ packed form
3031H011j69m250p721n424J712O868O817K645j991n741o885l255L035P488O625
3046G765J170m315o989n081j168L733P795O724j428o519o100l517K54N518Q308
3061F150L922l674p218n720k007K595O891O337J626m106p446n578Q9N428N750
3076C039M307J086n001q654n049L452O380N286L065p56o244q059k498M479P312
3091B145M811Q54l326o175o446q32N431Q425L845k268m894n364m256j69P129Q287
3107G197J696l761n780m793k664J944P261O860J031n493p129l804J62L957N836
3122B520O021K78p624p871j466L190M013N284M952j941q342p126M22M188N092
3137A590M652K099l731p523n770N30O311O449K617j012l529o711n325J657Q577
$$ plain form
3152 881 7060 7023 4223 395 -5688 -9523 -5236 3114 8261 6752 2522 -2406 -6599 -7965 -3443 4355
3168 4355 9147 6707 2 -4931 -6795 -5645 -1810 5608 9574 5441 -2671 -7092 -6306 -3815 993
3183 993 6822 8708 3791 -4337 -8246 -6207 -1389 3510 6960 7338 1796 -5871 -9150 -5117 1298
3198 1298 5480 6527 5724 17 -7366 -9114 -3396 3327 6621 6150 3358 -2292 -7709 -8372 -1676 5302
3214 5302 7952 5704 786 -4263 -7249 -6262 -352 6836 8504 3869 -2153 -5829 -6557 -4627 2028
3229 2028 7772 7773 2252 -4426 -7323 -5977 -1863 3586 7813 6876 200 -6175 -7393 -4585 77 5149
3245 5149 8042 5460 -1620 -7317 -7198 -3011 2897 6568 6928 2803 -3063 -7925 -6832 -916 5211
3260 5211 7110 4910 898 -4679 -7975 -5644 932 6566 7155 3243 -1283 -5963 -7561 -3783 2747
$$ packed form
3152H81O179l7k800l828o083l835M287Q350N147j509m230m928m193j366M522P798
3168D355M792k440o705m933j864J150L835P418L966m133q112m421P86K491M808
3183I93N829J886m917q128l909K039M818M899L450L78n542p667l279M033O415
3198A298M182J047q03n707p383j748N718O723L294m71k792n650n417o63O696O978
3214E302K650k248m918n049k986R87N910P188J668m635o022l676p28J930O655
3229B028N744Jn521o678k897J346M114N449M227r37o676o375j218K808M662N072
3245E149K893k582p080n697J19M187N908L671L60m125n866m862J093N916O127
3260E211J899k200m012n577l296K331O576N634N89l912m526m680j598L778O530
$$ plain form
3275 2747 7328 6584 1947 -3863 -7037 -5976 -1549 4320 7219 6048 3 -5538 -7298 -4311 705
3290 705 5403 7906 4549 -2138 -7005 -6753 -2413 2466 6447 6953 2073 -3733 -7222 -5880 -751 4551
3306 4551 7152 5284 120 -5143 -7268 -4490 990 6128 7101 2930 -2082 -5838 -6836 -3286 3058
3321 3058 7396 6109 1213 -4010 -6284 -5640 -1032 4441 7537 5350 -659 -5485 -6832 -3804 1232
3336 1232 5910 6867 3593 -2445 -6705 -6462 -1847 3258 5919 5776 2030 -3885 -7527 -5720 -68 4869
3352 4869 6417 4967 310 -5315 -7706 -3928 2086 6153 6311 2786 -1790 -5890 -6824 -2677 3908
3367 3908 7138 5372 825 -4066 -6072 -5668 -976 5102 7417 4128 -1240 -5068 -5741 -3402 755
3382 755 5661 7078 3050 -2973 -6379 -5237 -2066 2323 6500 6692 1349 -4911 -7379 -4037 400
$$ packed form
3275B747M581p44m637n810l174J061M427N869K899j171o045n541j760K987N016
3290G05M698K503l357o687m867K52M340M879L981N06m880n806l489J342N129N302
3306D551K601j868n164n263k125K778N480N138R73m171n012l756r98L550O344
3321C058M338j287m896n223k274O44M608N473L096k187o009m826j347L028N036
3336A232M678R57l274o038m260K43M615N105K661j43l746n915l642J807N652M937
3352D869J548j450m657n625k391L778O014M067J58l525m576m100r34M147O585
3367C908L230j766m547m891k006M04M692O078K315l289n368l828o73K339M157
3382G55M906J417m028o023l406J142L171M389M177J92n343o260k468L342M437
$$ plain form
3397 400 4320 6548 4805 -668 -6019 -6847 -2666 2684 4953 5093 2883 -1272 -6500 -6698 -1626 4514
3413 4514 6055 4231 1403 -2818 -6803 -5830 133 5429 6339 3110 -811 -4213 -6288 -4133 1566
3428 1566 6721 6301 1462 -3128 -5381 -5168 -2107 3061 7332 5814 -439 -5267 -5655 -3300 -474 3596
3444 3596 6976 4951 -1718 -6039 -5240 -2148 1249 4477 6253 3410 -3037 -6939 -5294 -508 3544
3459 3544 5390 5401 945 -4210 -7189 -4477 1125 5406 5381 2687 -417 -4472 -7120 -3916 3538 6750
3475 6750 4406 649 -1893 -4956 -6240 -1864 4944 6773 3325 -488 -2704 -5401 -5012 -281 4652
3490 4652 6438 3607 -1608 -5564 -5531 -2643 1410 5179 6806 2629 -4900 -6773 -3274 -29 2112
3505 2112 5658 6161 427 -5778 -6222 -2396 339 3315 5557 4158 -1727 -5677 -5479 -2244 2436 5456
$$ packed form
3397D00L920K228j743n473n351q28M181N350K269J40k210m155n228j98N072O140
3413D514J541j824k828m221l985R73N963N296R10l229l921l402k075K155N699
3428A566N155m20m839m590k253K13L061N168M271j518o253m828l88K355K826M070
3444C596L380k025o669m321P99L092L397L228J776k843o447l902J645M786M052
3459C544J846J1m456n155k979K712N602M281k5k694l104m055k648L204P454L212
3475F750k344l757k542l063j284M376O808J829l448l813k216k697L89M731M933
3490D652J786k831n215l956L3K888M053L769J627m177p529j873L499L245K141
3505B112L546N03n734o205m44L826K735K976K242j399n885l950J98L235M680L020
$$ plain form
3521 5456 4974 1507 -2206 -5449 -5477 -1446 4552 6020 3257 -205 -2598 -6100 -5962 1180 6647 6063
3537 6063 1421 -1760 -4113 -5597 -2841 2837 6103 4422 805 -2952 -4875 -4033 -776 3147 5481
3552 5481 4815 324 -4708 -5656 -2883 815 3719 5761 3943 -1727 -6101 -4893 -927 2301 4284
3567 4284 5081 2306 -3511 -6515 -4338 -236 3423 5503 4450 -400 -4622 -5446 -3153 1341 4990
3582 4990 5377 1613 -2455 -4034 -4313 -2806 2266 5785 4626 223 -2565 -4266 -5033 -1471 4024 6350
3598 6350 3346 -644 -3735 -5352 -3380 1721 5264 4579 2428 -1368 -5230 -5605 -1291 2960 4435
3613 4435 4219 2075 -3200 -6350 -3678 919 3700 4515 3754 -56 -4422 -5137 -2501 923 3753 5345
3629 5345 2444 -2097 -4686 -4589 -2180 1985 6044 5236 274 -3701 -4573 -3887 -795 3734 5970 3281
$$ packed form
3521E456m82l467l713l243k8M031N998J468k763l462k393l502J38P142N467n84
3537F063m642l181k353j484K756N678L266j681l617l757j923Q42L257L923K334
3552E481o66m491n032r48K773L698K904K042j818n670m374J208L966L228J983
3567D284P97k775n817l004K177M102L659K080j053m850m222q24K293M494L649
3582D990L87l764m068j579k79J507N072L519j159m403k788j701p67L562N495K326
3598F350l004l990l091j617J972N101L543o85k151l796l862l75M314M251J475
3613D435k16k144n275l150K672M597K781Q15p61l810m366p15K636L424K830J592
3629E345k901m541k589R7K409M165M059q08m962l975q72O86L092M529K236k689
$$ plain form
3645 3281 -1493 -4233 -4247 -2806 881 4644 4879 2230 -1963 -4602 -4803 -1183 2566 4582 4171 1370
3661 1370 -3210 -5451 -3849 842 3804 4063 3446 176 -4169 -5584 -2581 1645 4621 4421 2111 -1741
3677 -1741 -4787 -5415 -1263 3679 5455 3311 -291 -3021 -4850 -3631 49 3967 4845 2864 -1257
3692 -1257 -3732 -4254 -2601 714 4600 5631 2087 -3036 -4853 -3546 -1439 1879 5143 4881 47
3707 47 -4098 -4720 -2690 123 2908 4791 3818 -653 -4828 -4968 -1702 1754 4273 4151 2108 -1797
3723 -1797 -4982 -4608 -410 3325 4053 2872 1044 -2097 -5345 -4052 245 4326 4352 2045 -450 -3493
3739 -3493 -5106 -3063 1746 5053 4330 747 -2386 -3694 -3958 -1654 2717 5236 3290 -537 -3135
3754 -3135 -3855 -2989 -335 3614 5317 2649 -1548 -4206 -4006 -1555 1446 3646 4352 2505 -2455 -5443
$$ packed form
3645C281m774k740j4J441L687L763K35k649m193k639k01L620L749K016m11k801
3661A370m580k241J602M691K962K59o17l270m345j415L003M226K976k00k310l852
3677a741l046o28M152M942J776k144l602k730j829J219L680L918Q78j981m121
3692a257k475n22J653L315L886J031l544n123j817J307K107L318L264k62m834
3707D7m145o22K030K813K785J883r73m471m175j40L266L456K519j22k043l905
3723a797l185L74M198L735P28j181j828l141l248J293M297M081K6k307k495l043
3739c493j613K043M809L307p23l583l133j308k64K304M371K519j946l827k598
3754c135p20Q66K654L949J703k668m197k658K00K451L001K200P06j847m960k988
$$ plain form
3770 -5443 -3716 102 2537 3359 3998 1086 -3667 -5361 -2535 1468 3267 3914 2777 -577 -4013 -4667
3786 -4667 -1983 2088 4405 3843 904 -1825 -3773 -4078 -1421 3569 5224 2811 -560 -2583 -3543 -3753
3802 -3753 142 4789 5180 1531 -1551 -3238 -3927 -2032 1315 4445 4310 1077 -2911 -4539 -2976 -524
3818 -524 2027 4370 4066 182 -3925 -4626 -1929 877 3105 4081 2612 -1199 -4560 -4161 -1061 2223
3834 2223 3665 3167 1605 -2104 -4644 -3892 -205 3544 4229 2729 293 -2596 -4345 -3094 1472 4141
3850 4141 4002 1714 -1282 -3429 -4079 -1945 1724 4501 3789 569 -2555 -3648 -3212 -683 2492 4789
3866 4789 3018 -457 -3464 -3974 -2334 526 3705 4268 2128 -1618 -4102 -3538 -1238 1630 3682 3576
3882 3576 954 -2464 -4514 -3334 13 2837 3682 2839 110 -3161 -4641 -2372 1204 3337 3573 2065
$$ packed form
3770e443J727L818K435Q22O39k912m753j694K826M003J799O47j137l354l436o54
3786d667K684M071K317n62k939k729j948l05K657M990J655k413l371k023r60k10
3802c753L895M647L91l649l082j687o89J895L347L130j35l233l988j628J563K452
3818e24K551K343l04l884m107p01K697K806K228R76j469l811l361L99L100L284
3834B223J442m98j562l709k540P52L687L749O85j500k436k889j749J251M566K669
3850D141j39k288k996k147o50K134L669K777p12l220l124j093M36K529L175K297
3866D789j771l475l007n10J640K860L179N63k140l746k484N64K300K868K052j06
3882C576k622l418k050J180L347K824Q45q43k729l271j480K269L576K133K36j508
$$ plain form
3898 2065 -1323 -3664 -3862 -1418 1918 4364 3637 494 -2489 -3803 -3291 -397 2684 4300 2949 -862
3914 -862 -3513 -3851 -2270 725 3561 4160 1914 -1451 -3780 -3401 -1152 1805 3387 3273 709 -2292
3930 -2292 -4195 -3255 133 3030 3703 2643 -128 -2730 -3994 -2157 1088 3568 3664 1544 -1817 -3428
3946 -3428 -3672 -1056 1893 4033 3197 732 -2237 -3772 -3062 -152 2873 3942 2334 -597 -3322 -3613
3962 -3613 -1976 668 3107 4056 1663 -2083 -4157 -2942 -826 1550 3638 3654 792 -2734 -4000 -2531
3978 -2531 372 2659 3916 2345 -548 -3034 -3968 -1989 1479 3577 3412 1070 -1299 -3337 -3770 -1467
3994 -1467 2296 4059 2444 137 -2057 -3299 -3372 -227 3345 3869 1639 -718 -2624 -2995 -2199 761
4010 761 3876 3746 1008 -2029 -3186 -3035 -1299 1993 4076 2936 358 -2976 -3557 -1986 327 2006
$$ packed form
3898B065l388k341j98K444L336K446p27l143k983j314N12K894L081J616j351l811
3914h62k651l38J581K995K836N99k246l365k329L79K249K957J582j14k564l001
3930b292j903R40L388K897O73j060k771k602j264J837L245K480R6k120l361j611
3946c428k44K616K949K140q36k465k969j535P10K910L025J069j608k931k725k91
3962c613J637K644K439R49k393l746k074J215K116K376K088J6k862l526j266J469
3978b531K903K287J257j571k893k486r34J979L468K098j65k342k369k038m33K303
3994a467L763J763j615k307k194j242p3L145L572N24k230k357j906l71P96K960
4010G61L115j30k738l037j157J51J736L292K083j140k578l334n81J571K313J679
$$ plain form
4026 2006 3609 2526 -431 -3540 -3661 -1137 1209 2961 3158 1753 -1011 -4042 -3381 -174 2416 3377
4042 3377 3019 774 -2610 -4123 -3046 427 3213 3259 1632 -257 -2961 -3716 -2140 1306 3797 3513
4058 3513 345 -1769 -2766 -2900 -1134 2049 4128 2405 -319 -2251 -2763 -2430 -524 2714 4263 2198
4074 2198 -1667 -3206 -2735 -1509 940 3024 3599 1220 -1897 -3833 -2816 -180 2113 2820 2233 376
4090 376 -2411 -4076 -2227 1120 2423 2635 2029 -454 -2984 -3756 -1121 1875 3065 2634 1135 -1374
4106 -1374 -3334 -3415 -810 2273 3554 2462 27 -2676 -3200 -2270 226 3147 3897 1877 -1725 -2759
4122 -2759 -2702 -1785 903 3210 3497 437 -2266 -2793 -2132 -1123 1562 4064 2606 -387 -2804 -3234 -2264
4139 -2264 148 2934 3354 1573 -813 -3200 -3576 -1130 1886 2971 2495 1245 -1197 -3632 -3369 167
$$ packed form
4026B006J603j083k957l109j21K524K346J752J97j405k764l031O61L207K590R61
4042C377l58k245l384j513J077L473K786M6j627j889k704p55J576L446K491k84
4058C513l168k114r97j34J766L183K079j723k724j932n12L33J906L238J549k065
4074B198l865j539M71J226K449K084N75k379l117j936J017K636K293P07n87j857
4090C76k787j665J849L347J303K12o06k483k530p72K635K996J190m31j499k509
4106a374j960q1K605L083J281j092k435k703n24R30K496K921P50k020l602j034
4122b759N7R17K688K307K87l060k703n27O61J009K685K502j458k993k417m30R70
4139b264K412K786M20j781k386k387l76K446L016J085m76j250k442k435K63L536
$$ plain form
4155 167 2742 2892 2123 387 -2492 -3743 -1641 1018 2254 2085 1637 -584 -3161 -3370 -1339 1496
4171 1496 2893 3241 1407 -2252 -3218 -2469 -440 2027 3558 2958 -527 -2908 -2760 -1742 -13 2387
4187 2387 3658 1877 -1573 -2955 -2344 -1508 1262 3737 2863 421 -1981 -2401 -2491 -508 2536 3342 1699
4204 1699 -357 -1595 -3126 -2350 461 3112 2946 1313 -619 -2902 -3569 -1360 2084 3397 2393 919
4220 919 -1631 -3560 -2600 208 2241 2696 1801 435 -3004 -3319 -990 1112 1989 2746 2213 -1439 -3401
4237 -3401 -2557 -405 1158 2480 2924 799 -2216 -3095 -1887 -329 1675 3242 2314 -586 -2366 -2581
4253 -2581 -2202 515 3313 3467 609 -1595 -2315 -2543 -1377 2003 3763 2161 -166 -1473 -2282 -2576
4269 -2576 -348 2118 3265 1958 -405 -2217 -3265 -1936 823 2604 2875 1311 -1248 -3443 -2352
$$ packed form
4155A67K575J50p69j736k879j251K102K659J236j69m48k221k577k09K031K835
4171A496J397L48j834l659r66P49K029K467J531o00l485k381J48J018J729K400
4187B387J271j781l450j382O11Q36K770K475q74k442k402m20r0J983L044Q06j643
4204A699k056j238j531P76K811K651j66j633j932k283o67K209L444J313j004j474
4220I19k550j929R60K808K033M55q95j366l439l15K329K102Q77P57n33l652j962
4237c401Q44K152J563J322M44k125l015q79J208J558K004J567r28k900j780k15
4253b581L79K717K798J54k858k204p20k28J166L380J760j602k327j307q09k94
4269b576K228K466J147j307k363j812j048J329K759J781K71j564k559k195J091
$$ plain form
4284 -2352 -184 1077 2464 2606 854 -1902 -3524 -2287 175 2014 2803 2161 -82 -2855 -3333 -1361
4300 -1361 1222 2470 2486 1250 -860 -2788 -2956 -848 1715 2681 2241 346 -1762 -2791 -2579 -253
4316 -253 2285 3482 1783 -963 -2502 -2387 -2079 251 3284 3143 746 -1462 -2488 -2274 -1124 1314
4332 1314 3417 2710 -95 -1996 -2704 -1941 -104 2225 2859 1783 -612 -2540 -2799 -1007 818 1815
4348 1815 2452 1597 -569 -2981 -3071 -390 1797 2566 2178 454 -1773 -3652 -2362 813 2607 2724 1364
4365 1364 -211 -2106 -2972 -1662 1187 2860 2269 599 -1034 -2539 -2605 -981 1787 2846 2127 135
4381 135 -2068 -2425 -1576 -88 1980 2943 1606 -797 -2447 -2402 -1011 229 2372 3219 1421 -1909 -2787
4398 -2787 -1904 -311 1570 2920 2629 -218 -2124 -2608 -1501 170 2099 2755 1269 -163 -1974 -2995
$$ packed form
4284b352K168J261J387J42j752k756j622J237K462J839P89o42k243k773m78J972
4300a361K583J248J6j236k110j928j68K108K563R66m40j895k108j029K12K326
4316b53K538J197j699k746j539J15L08K330L033j41k397k208j026K14J150K438
4332A314K103p07k805j901p08P63J837K329O34j076k395j928k59J792J825R97
4348A815O37q55k166k412r0K681K187P69l88j724k227j879J290L175J794J17j360
4365A364j575j895q66J310K849J673n91j670j633j505o6J624K768J059p19j992
4381A35k203l57Q49J488K068R63j337k403j650M5J391J240K143Q47j798l330q78
4398b787Q83J593J881J350k91k847j906m84J107J671J929O56j486j432j811j021
$$ plain form
4414 -2995 -1552 1002 2751 2277 743 -946 -2897 -2865 -354 2170 2500 1671 130 -1401 -2903 -2366
4430 -2366 280 2267 2605 1608 -752 -2568 -2633 -1140 966 2435 2179 675 -1498 -2491 -1995 -404 1172
4447 1172 2845 2096 -200 -2095 -2690 -1515 -113 2228 2842 1715 -890 -2610 -2260 -775 1069 2637
4463 2637 2601 703 -1420 -2681 -2096 -462 1909 2775 2147 -158 -1788 -2470 -1938 724 2215 2247 1465
4480 1465 -654 -2431 -2970 -1417 1150 2770 2070 836 -994 -2137 -2336 -332 1752 2551 1636 -198
4496 -198 -1717 -2750 -1722 762 2338 2303 1438 -552 -2603 -2850 -920 1469 2836 1862 761 -1514
4512 -1514 -2517 -2333 -83 1438 2481 1873 -251 -2073 -2691 -1692 154 2223 2616 820 -1060 -2249
4528 -2249 -2006 -1131 1207 3087 2712 511 -1374 -2467 -2291 -14 1532 2804 1909 -66 -1997 -2422
$$ packed form
4414b995J443K554J749m74j534j689j951L2K511K524L30q29j541j531j502N37
4430b366K646J987L38r97k360j816o5J493K106J469k56j504k173r93M96J591J576
4447A172J673p49k296j895n95J175J402K341O14j127k605j720L50J485J844J568
4463B637l6j898k123j261N85J634K371Q66o28k305j630o82N32K662J491L2p82
4480A465k119j777n39J553K567J620p00j234j830j143j99K004K084P99r15j834
4496a98j519j033J028K484J576l5q65j990k051k47J930K389J367r74j101k275
4512a514j003J84K250J521J043o08k124j822o18R99J846K069L93j796j880j189
4528b249K43Q75K338J880l75k201j885j093J76K277J546J272q95j975j931m25
$$ plain form
4544 -2422 -1189 580 1778 2083 1516 -715 -2846 -2601 -823 1324 2279 1707 686 -1324 -2917 -2299
4560 -2299 -259 1986 2536 1621 -100 -1832 -2525 -1556 593 2425 2281 540 -1037 -2010 -2266 -808 1405
4577 1405 3078 2107 480 -1472 -2352 -1709 -503 1738 2678 2084 -901 -2334 -2084 -1682 124 2226 2836
4594 2836 1144 -1111 -2466 -1739 -587 1425 1997 2095 701 -1632 -2728 -1554 214 1735 2460 1936
4610 1936 -13 -2067 -2827 -1517 965 2138 1787 974 -727 -2160 -2715 -679 2114 2595 1641 256
4626 256 -1154 -2569 -1881 -141 2172 2086 1440 -332 -1906 -2439 -1506 473 2287 2276 776 -1265 -2052
4643 -2052 -1864 -875 710 2653 2270 29 -1954 -2169 -1548 -272 1430 2573 1843 -547 -2349 -2437 -767
4660 -767 652 2201 2270 1079 -745 -2524 -2378 -405 1315 2387 1631 307 -1877 -2742 -1826 275 2084
$$ packed form
4544b422J233J769J198L05n67k231k131K45J778K147R55n72j021k010j593O18
4560b299K040K245N50r15j721j732o93R69K149J832j44j741j577r73k56J458K213
4577A405J673r71j627j952q80O43J206K241R40n94k985j433K50M02J806K102O10
4594B836j692k255j355P27J152K012N72R8j394k333j096J174J768J521P25n24
4610A936j949k054p60J310K482J173l51q13j701j433n55K036K793M81r54j385
4626B56j410j415O88J740K313q6o46j772j574n33R33J979J814j1j500k041p87
4643b052J88R89J585J943l83k241j983k15O21J276J702J143p30k390j802q8J670
4660g67J419J549O9j191j824j779J46J973J720J072p56j324k184q65R16K101J809
$$ plain form
4677 2084 2041 1140 -327 -1597 -2413 -1354 1374 2416 2253 861 -856 -2162 -2466 -819 1575 2510 1644
4694 1644 141 -1363 -2366 -2082 240 1980 2583 1227 -518 -1842 -2274 -1087 1104 2041 2366 992
4710 992 -1153 -2436 -1828 -409 1081 2411 2006 286 -1757 -2565 -1402 219 1697 2307 1511 -632
4726 -632 -2247 -2368 -910 863 2269 2097 696 -810 -2314 -1856 -242 1599 2446 1698 -149 -1482
4742 -1482 -2315 -1763 52 2041 2268 1152 -579 -1761 -2556 -1160 1087 2413 2130 423 -1192 -1826
4758 -1826 -1802 -236 1443 2244 1671 -108 -1508 -2380 -1764 599 1952 2077 1390 -461 -2396 -2348 -801
4775 -801 1057 1951 2086 772 -1490 -2514 -1577 -210 1153 2315 1755 -53 -2177 -1993 -1273 206 1668
4792 1668 2485 1171 -895 -2105 -2326 -1002 767 2041 2185 236 -1201 -1985 -1198 -479 1576 2774
$$ packed form
4677B084m3r01j467j270q16J059K728J042j63j392j717j306l04J647K394R35q66
4694A644j503j504j003K84K322J740O03j356j745j324m32J187K191R37L25j374
4710I92k145j283O08J419J490J330m05j720k043q08J163J621J478O10p96k143
4726f32j615j21J458J773J406j72j401j506j504M58J614J841Q47p48j847j333
4742a482q33N52J815J989K27j116j731j182p95J396K247J326k83j707j615o34
4758a826K4J566J679Q01n73j779j400q72O16K363J353J25o87j851j935M8J547
4775h01J858Q94J35j314k262j024R37J367J363J162n60j808k124J84P20J479J462
4792A668Q17j314k066j210k21J324J769J274J44j949j437p84P87P19K055J198
$$ plain form
4808 2774 1572 -137 -1296 -2293 -1629 328 2069 2257 461 -445 -1658 -2220 -964 1377 2153 1267 940
4825 940 -791 -2331 -2291 112 2072 2138 1160 215 -1403 -2802 -1312 709 1901 2046 924 -763 -2164
4842 -2164 -1460 -368 719 1950 2049 625 -1780 -2031 -884 113 944 2223 1853 -401 -2210 -1930 -1103
4859 -1103 181 1614 2377 1372 -909 -1964 -1613 -562 811 2240 1729 261 -900 -1666 -2060 -34
4875 -34 2084 2586 750 -156 -1561 -2202 -1381 1143 2155 1503 464 -190 -1373 -2356 -983 1744 2115
4892 2115 1336 261 -1268 -2138 -1924 -230 1715 2341 1270 -114 -1883 -1632 -985 415 1319 2069 1383
4909 1383 -938 -2563 -1614 -296 803 1882 2203 704 -2104 -2067 -775 186 1277 1780 1423 -167 -1942
4926 -1942 -1920 -928 562 1618 1693 926 -799 -1944 -2048 -694 1703 2294 1441 -66 -1020 -1704 -1950 -58
$$ packed form
4808B774j202j709j159r97O64J957J741J88j796r06j213n62J256K341P76q86l27
4825I40j731j540M0K403J960O6r78r45j618j399J490K021J192J45j122j687j401
4842b164P04J092J087J231R9j424k405k51J147R97Q31J279l70k254j809K80Q27
4859a103J284J433P63j005k281j055L51J051J373J429n11j468j161p66l94K026
4875c4K118N02j836r06j405o41Q21K524J012o52j039o54j183r83J373K727L71
4892B115p79j075j529q70K14J694J945O26j071j384j769K51O47J400R04P50o86
4909A383k321j625R49J318J099J079L21j499k808L7J292R61J091N03l57j590j775
4926a942K2R92J490J056P5p67j725j145j04J354K397N91q53j507r54o84k46J892
$$ plain form
4944 -58 2189 2220 699 -507 -1264 -1721 -1821 681 2305 1737 341 -897 -1589 -1882 -410 1203 2104 1554
4962 1554 -112 -1601 -1629 -1022 279 1605 1804 1415 -456 -1933 -1821 -551 917 1412 2062 1151 -1368
4979 -1368 -2616 -1739 262 1087 1440 1384 347 -1367 -2109 -1550 140 1544 1872 1037 -265 -1623 -1961
4996 -1961 -919 895 1779 1780 336 -971 -1724 -1595 -672 1165 2208 1565 -261 -1550 -1945 -1356 -67
5013 -67 1793 2385 943 -916 -1945 -1611 -729 1016 1943 1849 171 -1338 -1723 -1529 -129 1078 1905 1070
5031 1070 157 -1317 -2066 -1264 663 1518 1447 1142 -463 -1953 -2036 -484 1303 1743 1752 1081 -878 -2284
5049 -2284 -1376 108 1271 1921 1631 229 -1701 -2004 -652 172 1441 1733 1117 -961 -1955 -1490 -434
5066 -434 699 1719 1763 12 -1008 -1674 -1318 -519 1204 2203 1399 -405 -1153 -1932 -1625 -101 2204 1869
$$ packed form
4944e8K247L1j521j206p57m57j00K502J624n68j396j238o92k93J472J613R01n50
4962A554j666j489k8O07J301J326J99l89j871j477J12J270J468M95O50r11k519
4979a368j248Q77K001Q25L53n6j037j714p42N59J690J404L28q35j302j358l38
4996a961J042J814Q84Jj444j307p53J29R23J837J043o43j826j289l95N89J289
5013f7J860N92j442j859j029L34Q82J745R27r4j678j509l85J94J400J207Q27q35
5031A070r13j474p49Q02J927Q55p1l05j605j490q3J552J787M40Ro71j959j406
5049b284R08J484J163O50k90j402j930l03J352Q24J269K92o16k078r94M65J056
5066d34J133J020M4j751j020o66L56P99J723R99q04j804p48p79L07J524K305l35
$$ plain form
5084 1869 611 -610 -1492 -1672 -558 947 1824 1410 -15 -1017 -1893 -1598 -56 1724 2007 1233 -79
5101 -79 -1287 -1801 -868 710 1295 1663 717 -573 -1655 -1776 -336 1060 1784 1780 449 -1541 -2216 -1134
5119 -1134 39 1233 1590 1360 -237 -1544 -1626 -583 500 1229 1577 828 -865 -1760 -1386 -479 722
5136 722 1769 1692 433 -1242 -1374 -1039 -411 1324 2068 656 -625 -1090 -1446 -1394 251 1908 1514 227
5154 227 -835 -1459 -1812 -605 1086 1871 1335 -256 -1038 -1579 -1286 293 1325 1836 974 -450 -1628
5171 -1628 -2031 -627 691 1363 1436 876 -907 -2082 -1412 25 874 1273 1453 255 -1429 -2089 -1122 360
5189 360 1255 1497 813 -166 -1497 -1940 -938 827 2002 1483 413 -579 -1339 -1901 -424 1221 1952 802
5207 802 -94 -1186 -1769 -1053 -440 1426 2101 950 -470 -1298 -1322 -935 311 1574 1768 220 -944 -1574
$$ packed form
5084A869j258j221q82j80J114J505Q77m14j425j002q76K95J542J780K83p74j312
5101g9j208n14R33J578N85L68r46j290j082j21J440J396P24mj331j990o75J082
5119a134J173J194L57k30j597j307q2J043J083P29L48p49j693q95L74R07J201
5136G22J047p7j259j675j32L35O28J735P44j412j281m65l56N2J645J657l94j287
5154B27j062o24l53J207J691P85n36j591p82n41K93J579J032N11q62j424j178
5171a628m03J404J318O72P3n60j783j175O70J437Q49L99J80j198j684o60R67J482
5189C60Q95K42o84r79j331m43J002J765J175n19j070r92p60n62J477J645P31j150
5207H02q96j092n83P16O13J866O75j151j420q28k4L87J246J263J94j548j164o30
$$ plain form
5225 -1574 -1018 -234 796 1547 1688 35 -1646 -1864 -756 527 1071 1634 965 -440 -1518 -1880 -455
5242 -455 925 1569 1407 527 -695 -1932 -1420 18 1390 1691 1189 230 -1076 -1862 -1163 291 1503
5259 1503 1584 490 -428 -1183 -1629 -775 427 1602 1516 325 -853 -1584 -1271 71 933 1857 1197 -323
5277 -323 -1188 -1167 -1032 286 1306 1502 792 -591 -1662 -1656 -540 576 1485 1582 633 -1012 -1616 -1288 -40
5296 -40 1216 1285 1112 125 -1141 -1817 -989 280 1534 1542 777 -317 -1785 -1495 -331 1062 1555 1560 278
5315 278 -545 -1750 -1398 -30 1509 1309 961 -135 -1188 -1754 -890 249 1449 1646 571 -509 -1560
5332 -1560 -1112 -432 451 1268 1158 428 -1235 -1354 -1198 52 1130 1638 996 -247 -940 -1489 -564 221
5350 221 1258 1535 565 -605 -1523 -1459 -487 784 1531 1175 354 -989 -1694 -1400 17 1149 1412 776
$$ packed form
5225a574N56P84J030P51J41j653j681k18J108J283N44N63o69j405j078l62J425
5242d55J380O44j62q80j222j237N12J438J372L01n02r59j306p86O99J454J212
5259A503Q1j094r18p55m46Q54J202J175q6j191j178p31L13J342Q62R24o60j520
5277c23q65K1J35J318J020J96p10j383j071OJ116J116R09R7r49j645o04L28J248
5296d0J256O9j73r87j266o76Q28J269J254Qp65j094j468K90J164J393M93Nj282
5315B78q23j205L52J368J539k00l48j096j053n66Q64J139J200J97j075j080j051
5332a560M48O80Q83Q17j10p30j663j19J56J250J078N08o42j243o93n49R25P85
5350B21J037K77r70j170r18O4R72J271P47l56q21j343p05K94J417J132K63o36
$$ plain form
5368 776 -269 -1297 -1636 -830 484 1156 1217 448 -414 -1501 -1168 -698 922 1492 1445 89 -1278 -1653
5386 -1653 -1351 297 1012 1320 1036 -132 -1590 -1228 -782 470 990 1107 368 -641 -1347 -1211 -573 621
5404 621 1460 950 167 -1242 -1357 -852 -119 1042 1562 864 -451 -1014 -1063 -696 345 1188 1326 441 -624
5423 -624 -1533 -1032 -487 804 1318 1125 250 -1166 -1332 -1154 -30 1073 1364 678 -177 -1442 -1346 -309
5441 -309 577 1291 971 386 -416 -1577 -1113 121 1019 1476 991 94 -1403 -1692 -1184 301 910 1517 832
5460 832 -476 -1233 -1214 -773 588 1117 1354 247 -1118 -1085 -942 -401 786 1853 1087 -185 -1114 -936
5478 -936 -630 4 1191 1540 426 -658 -1084 -1068 -766 240 1495 898 497 -503 -1374 -1141 68 888
5496 888 1122 685 269 -1096 -1394 -872 508 1211 696 718 -334 -1127 -1414 -264 686 1193 1062 373 -384
$$ packed form
5368G76j045j028l39Q06J314O72O1p69q62j087L33M70J620N70m7j356j367l75
5386a653L02J648P15L08k84j168j458L62M46J252N20J17p39j009p06J36O38J194
5404F21Q39n10p83j409j15N05P33J161N20o98j315n63m9L67J041Q43J38q85j065
5423f24r09N01N45J291N14j93q75j416j66J78J124J103K91o86q55j265R6J037
5441c09Q86P14l20n85q02j161M64J234Q98M57m85q97j497k89N08J485O09O07o85
5460H32j308p57J9M41J361N29K37j107j365L3J43N41J187J067p66j272r29J78
5478i36L06O34J187L49j114j084m26J6L02J006J255n97m01j000q71K33J209Q20
5496H88K34m37m16j365k98N22J380P03n15K2j052p93k87J150R50N07j31o89p57
$$ plain form
5515 -384 -1429 -1384 32 1007 1136 924 -140 -885 -1307 -1002 81 1084 1436 626 -1048 -996 -968 -282 303
5534 303 1469 1390 26 -876 -916 -818 -68 630 1396 827 -237 -1046 -1048 -674 46 970 1179 519 -748 -797 -1223
5555 -1223 -342 911 1268 1076 147 -794 -1451 -1200 -56 967 1274 877 54 -954 -1289 -826 441 1097
5573 1097 843 453 -336 -807 -1295 -529 922 1294 702 63 -706 -1143 -863 -47 816 1156 845 -349 -1228
5592 -1228 -1231 -542 561 1074 1438 558 -845 -1301 -869 -397 81 764 887 154 -786 -1159 -794 -103 468 1347
5612 1347 979 -197 -1128 -1053 -564 391 1038 1033 298 -413 -983 -1093 -219 570 1249 632 269 -685 -1027 -1108 215
5633 215 950 1172 474 -419 -1054 -1250 -677 797 1073 734 507 -347 -1052 -913 -426 911 974 928 103 -925
5653 -925 -1235 -1007 181 978 1012 757 -185 -1082 -1112 -104 282 1065 915 465 -574 -1329 -859 -118 457 1424
$$ packed form
5515c84j045M5J416R75J29k12j064p45m22L05J083J003L52q10j674N2K8O86N85
5534C03J166p9j364r02m0R8P50O98P66n69j064q09kL74P20R24K09o60j267m9m26
5555a223Q81J253L57j92r29r41o57K51J144J023L07l97q23j008l35M63J267O56
5573A097k54l90p89m71m88P66J451L72n92o39p69m37K80Q16Q63L40l11j194q79
5592a228lO89J103N13L64q80j403m56M32M72M78O83J23p33r40l73L65O91N71Q79
5612A347l68j176r31P5M89R55O47np35p11n70j10Q74P89O79o17l63r54l42q1J323
5633B15P35K22o98q93o35j96N73J474K76l39k27q54p05J39M87J337O3m6q25j028
5653i25l10K28J188P97L4k55r42q97l0J008L86P83j50m50j039p55M70P41N75R67
$$ plain form
5673 1424 1157 59 -1096 -1255 -503 -10 647 989 415 -569 -916 -832 -492 -17 982 1134 412 -527 -1011
5692 -1011 -1006 -326 870 1471 700 -112 -670 -1001 -722 83 1372 932 171 165 -632 -1163 -634 464 940 681
5712 681 349 -421 -1494 -1246 19 1086 927 690 39 -645 -1309 -687 179 658 943 978 -168 -1130 -767
5731 -767 -170 732 839 1378 677 -919 -1258 -605 -81 367 842 757 -15 -1190 -892 -409 4 756 1171 512
5751 512 -591 -730 -737 -98 497 1201 609 186 -139 -846 -865 -183 1106 994 323 -339 -343 -1154 -946 258 957
5772 957 649 500 -136 -1169 -1304 -172 892 1223 615 48 -236 -1174 -851 126 676 979 935 -32 -991
5791 -991 -1045 -370 130 903 1151 629 -613 -1112 -443 -246 134 1133 830 30 -728 -1020 -570 -267 548 972
5811 972 764 -57 -821 -1140 -45 58 885 872 415 -301 -1031 -785 -231 568 925 763 274 -500 -1240 -818
$$ packed form
5673A424k67j098j155j59P52M93O57L42n74r84l47Q4L40M75R99J52p22r39m84
5692a011NO80J196O01p71q12n58l31K79Q05J289m40p61op97n31N29J098M76k59
5712F81l32p70j073K48J265J067j59k37o51o84o64O22Q66M79K85L5j146r62L63
5731g67N97R02J07N39p01j596l39O53N24M48M75q5p72j175K98M83M13P52M15o59
5751E12j103j39pO39N95P04n92m23l25p07j9O82J289j12o71o62mq11K08J204O99
5772I57l08j49o36j033j35J132J064L31o08n67k84r38L23R77N50L03m4r67r59
5791i91n4O75N00P73K48n22j242m99O69J97L80R99l03q00p58k92M50L03Q15M24
5811I72k08q21p64l19J095J03Q27j3m57p16p30K46N54P99L57j62m89p74p40M22
$$ plain form
5831 -818 89 825 1139 521 -348 -703 -705 -851 539 1046 584 266 -353 -895 -1008 -143 878 678 1019 12
5851 12 -575 -744 -638 141 640 866 828 -424 -1149 -792 -108 442 503 745 125 -299 -1119 -950 196 314
5871 314 903 864 18 -726 -787 -687 -303 521 993 567 -342 -804 -922 -382 477 806 704 319 -93 -731 -1055
5892 -1055 -365 525 1099 746 183 -352 -1023 -535 92 480 811 338 -186 -707 -910 -697 259 1178 1088 163
5912 163 -481 -789 -604 59 249 867 641 -250 -622 -747 -517 -388 533 1071 445 -163 -693 -714 -207 619
5932 619 787 952 227 -546 -973 -752 6 325 612 694 20 -683 -1003 -165 468 680 853 358 -185 -905
5952 -905 -973 -529 617 921 335 288 -561 -885 -615 90 844 740 451 -81 -564 -885 -843 177 839 817 411
5973 411 -679 -502 -556 -432 423 1060 624 102 -517 -974 -344 -22 453 655 678 98 -519 -794 -591 174
$$ packed form
5831h18R07P36L14o18q69l55kj46J390N07m62l18o19n42j13Q65J021k00L41j007
5851A2n87j69J06P79M99K26l8j252p25L57O84N50O1K42o20m24q20J69J146J18
5871C14N89l9q46p44o1J00L84Q24M72m26r09m62j18N40Q59L29j02l85m12o38l24
5892a055O90Q90N74l53n63n35o71M88O27L88L31m73n24n21k03K13R56R19r0r25
5912A63o44l08J85O63J90O18k26q91l72j25K30J29R21N38o26o08n30k1N07Q26
5932F19J68J65p25p73m27K21P58L19K87Q2o74p03l20Q38O33K12J73m95n43p20
5952i05o8M44J146L04n86m7q49l24K70P05P54j04k89n32m83l21M2J020O62k2m06
5973D11j090J77n4J24Q55O37m36n22o19m57O30L22M75K02K3n80o17k75K03P65
$$ plain form
5993 174 614 821 577 -339 -731 -860 -119 84 647 774 319 -508 -1041 -568 46 932 720 466 54 -526
6013 -526 -1124 -301 356 1104 762 713 -458 -883 -669 -180 403 917 824 113 -187 -757 -336 44 675 679 301
6034 301 -93 -678 -817 -240 242 717 704 299 -435 -560 -870 -421 353 785 372 54 -491 -558 -536 166 796
6055 796 712 937 152 -659 -954 -229 322 653 506 376 -289 -1091 -645 -77 536 634 719 16 -493 -1012 -539
6076 -539 166 559 885 545 4 -618 -924 -142 353 985 421 132 -397 -466 -477 196 82 594 196 -168 -325
6097 -325 -383 -668 44 509 707 178 -85 -296 -511 -414 34 886 442 342 -332 -883 -529 -22 201 916 379
6118 379 30 -650 -553 -532 -50 597 675 556 -155 -565 -637 -57 295 791 552 427 -167 -725 -512 209 462
6139 462 818 432 121 -221 -689 -447 114 517 831 244 -264 -444 -679 -453 35 708 627 -72 -482 -417 -510
$$ packed form
5993A74M40K07k44r16l92j29P41K03N63J27m55q27n33M73O14Q86k12k54m12n80
6013e26n98Q23O57P48l42m9j171m25K14M89N83N14r3p11l00n70M21L80O31Ml78
6034C01l94n85j39N77M82M75j3m05p34j25l10M49P74M32m13l18n45o7K2P02O30
6055G96q4K25p85q11k95P25N51L31j47j30o65q02M46N68O13R8Q5p03n09n19M73
6076e39P05L93L26l40n41o22l06P82M95O32n64k89n29o9j1O73j14N12l98l64j57
6097c25n8k85P12M65J98n29k63k11k15R7M48Q52m44j00o74n51L54N07K23P15n37
6118C79l49o80R7K1M82O47P8j19p11m10p2N80L52M96k39j25n94n58K13P21K53
6139D62L56l86l11l42m68K42N61M03L14n87n08j80k35K26M88O73q1o99m10O5r3
$$ plain form
6160 -510 -455 268 717 264 95 -495 -591 -390 -113 788 422 178 -237 -318 -553 -443 -79 616 756 131 -613
6181 -613 -459 -509 247 430 447 516 105 -380 -842 -249 194 295 337 591 -88 -314 -586 -366 220 655 706 495
6203 495 -465 -793 -584 33 649 525 461 30 -536 -798 -274 136 416 781 176 -273 -462 -567 -258 18
6223 18 889 300 -274 -420 -651 -556 -316 647 660 391 -311 -371 -466 -644 312 538 718 568 -590 -571 -477 -658
6245 -658 76 542 343 130 -385 -819 -607 94 311 580 423 -32 -351 -504 -216 142 439 237 268 -253
6265 -253 -866 -516 -151 371 480 385 132 -317 -546 -318 298 389 479 350 227 -298 -550 -66 276 422 466
6286 466 175 -228 -512 -492 -309 144 345 199 -155 -378 -89 -301 -346 219 929 312 -33 -811 -502 -227 237
6307 237 649 585 357 -160 -533 -560 -236 530 542 327 -87 -537 -420 -597 237 463 309 272 78 -102 -587
$$ packed form
6160e10N5P23M49m53j69n90r6K01K77R01l66k44m15q1k35J10L64O95J40o25p44
6181f13J54n0P56J83J7O9m11m85m62N93M43J01M2K54o79k26k72K20N86M35N1k11
6203D95r60l28K09O17O16j24o4m31n66k62N24M10K80L65o05m49j89j05L09K76
6223A8Q71n89n74j46k31R5K40R63J3k69p02o0r5j78R56K26J80j50j158J9R4j81
6245f58P34M66j99k13n15m34K12P01K17K69j57m55l19j53K88L58K97k02L1n21
6265b53o13L50L65N22J09r5k53m49k29K28O16R1R0j29j23n25k52M84L42J46M4
6286D66k91m03k84K0J83M53K01j46l54k23K89k12m5N65P10o17l45p78L09K75M64
6307B37M12o4k28n17l73k7L24P66J2k15m14m50J17j77Q34K26j54l7j94j80m85
$$ plain form
6328 -587 -634 578 355 348 343 -39 -673 -458 -4 183 559 202 297 -339 -164 -173 -179 384 346 123 -107 -395 -646
6351 -646 -406 69 377 262 262 -488 -592 -290 -471 284 336 320 -95 -277 -516 -280 -20 276 637 146 -394
6372 -394 -54 -404 -533 261 389 611 -22 -114 -9 -442 320 153 472 143 310 -244 -513 -414 -22 629 258
6393 258 329 -3 -454 -587 -14 371 90 228 264 -579 -694 -525 -29 235 531 292 -140 -56 -323 -161 -219
6414 -219 532 758 306 -239 -413 -340 -22 -47 189 595 109 -25 -272 -7 -401 209 448 647 378 -260 -544
6435 -544 -278 141 230 441 71 -152 -499 -477 -204 311 523 205 -190 -288 -181 -313 -80 216 219 190 93 -319
6457 -319 -580 -312 351 299 389 286 26 -287 -457 110 140 368 287 76 -53 -476 -303 -219 62 421 280 -39
6479 -39 -350 -372 -342 7 291 437 65 -317 -49 -536 -54 74 231 279 306 -128 -298 -391 -428 691 771 378
$$ packed form
6328e87m7J212k23pnl82o34K15M54J87L76l57R5o36J75roN63l8k23k30k88k51
6351f46K40M75L08j15%p50j04L02j81P55N2j6m15j82k39K36K60K96L61m91n40
6372c94L40l50j29P94J28K22o33r2J05m33P62j67L19l29J67n54k69R9L92O51l71
6393B58P1l32m51j33N73L85k81J38L6q43j15J69M96K64K96k39m32Q4k67J62n8
6414b19P51K26m52n45j74P3L18k5K36M06m86j34k47K65l94O10K39J99k69o38k84
6435e44K66M19Q9K11l70k23l47K2K73N15K12l18l95r8J07j32K33K96Lk9r7m12
6457c19k61K68O63n2R0j03k60l13j70N67L0K28q1k11j29m23J73Q4K81L59j41l19
6479c9l11k2L0L49K84J46l72l82K68m87M82J28J57M8K7m34j70r3l7J119Q0l93
$$ plain form
6501 378 -170 -154 -283 -26 246 325 489 142 -90 -389 -161 -219 168 287 259 258 -113 -311 -329 83 116 120 327
6524 327 182 -421 -655 -198 396 482 138 -69 -344 -140 -243 29 -158 531 291 -154 -270 -295 -533 -196 232
6545 232 779 185 -74 -69 -796 -620 -253 156 432 328 -251 -171 -144 -313 127 420 217 324 -364 -431 29 194
6567 194 175 290 303 -181 -436 -320 -78 265 349 288 18 -173 -451 -494 -328 196 301 270 9 -94 -403 -352
6589 -352 -39 -84 505 167 167 -21 -300 -348 328 332 332 55 -138 -188 -384 -337 159 -1 255 125 -192 -608 -23
6612 -23 -60 188 412 89 -383 -111 -314 -69 -56 366 147 75 -169 -252 -259 -183 266 152 350 19 -115 -506 -263
6635 -263 53 145 162 224 -201 -313 -262 -31 475 206 364 93 10 -320 -301 -187 189 421 460 239 3 -481
6657 -481 -243 13 214 207 403 40 -157 -302 -487 -114 248 443 214 -217 -393 -288 -139 462 591 313 262
$$ packed form
6501C78n48J6j29K57K72P9J64l47k32k99K28n8L87J19k8jl71j98j8M12L3MK07
6524C27j45o03k34M57N94Q6l44k07k75K04j03K72j87O89k40m45j16k5k38L37M28
6545B32N47n94k59Np27J76L67M09K76j04n79Q0K7j69M40K93k03J07o88o7M60J65
6567A94j9J15J3m84k55J16K42L43Q4o1k70j91k78m3J66N24J05l1k61j03l09N1
6589c52L13m5N89l38%j88k79m8O76M%k77j93n0j96M7M96j60K56j30l17m16N85
6612b3l7K48K24l23m72K72k03K45J3M22k19p2k44q3pP6M49j14J98l31j34l91K43
6635b63L16R2J7O2m25j12N1K31N06k69J58k71q3l30J9J14L76K32L9k21k36m84
6657d81K38K56K01pJ96l63j97j45j85L73L62J95k29m31j76J05J49O01J29k78n1
$$ plain form
6678 262 -311 -295 -115 -79 355 519 168 -124 -570 -148 146 -122 228 429 -53 -168 -321 -254 171 -106 319
6699 319 110 332 -265 -138 -288 -191 -152 331 166 -1 37 -291 55 86 264 491 -119 183 -649 -201 187
6720 187 73 467 317 -18 290 -162 -292 -211 78 120 305 103 -419 -429 -209 36 185 200 343 119 -384
6741 -384 -267 -232 344 291 238 203 -263 114 -241 214 202 521 72 -12 -265 -208 -437 58 109 406 101 18 -127
6764 -127 -300 -159 -191 193 293 -50 -28 -375 -124 23 58 353 92 209 -133 -149 32 -264 206 239 -107 441
6786 441 -207 -146 -105 383 210 323 153 -137 -132 -92 22 313 440 -106 85 -480 -74 -92 268 371 142 113
6808 113 -10 -243 -326 -308 -10 650 273 115 -73 -484 -176 20 71 354 191 101 -530 -272 -197 -16 36 252
6830 252 359 -471 -202 -228 142 -264 319 336 142 -97 -242 -153 -37 22 -83 -15 61 -131 -424 -275 108 256
$$ packed form
6678B62n73J6J80L6M34J64l51k92m46M22K94k68L50K01m82j15j53O7M25k77M25
6699C19k09K22n97J27j50R7L9M83j65j67L8l28L46L1J78K27o10L02q32M48L88
6720A87j14L94j50l35L08m52j30Q1K89M2J85k02n22j0K20K45J49J5J43k24n03
6741c84J17L5N76n3n3l5m66L77l55M55j2L19m49q4k53N7k29M95N1K97l05q3j45
6764a27j73J41l2L84J00l43K2l47K51J47L5K95k61J17l42j6J81k96M70L3l46N48
6786D41o48O1M1M88j73J13j70k90NM0J14K91J27n46J91n65M06j8L60J03k29k9
6808A13j23k33q3J8K98O60l77j58j88m11L08J96N1K83j63r0o31K58P5J81N2K16
6830B52J07q30K69k6L70m06N83J7j94k39j45Q9J16N9j05O8P6j92k93J49L83J48
$$ plain form
6852 256 321 50 -206 -386 -15 219 244 383 399 108 -68 -151 -54 324 112 208 450 -17 -109 -333 -138 -5
6874 -5 286 549 -24 -198 -163 -181 359 -88 162 440 -101 -51 -85 99 66 37 -55 32 125 105 -197 -117 -9 225
6898 225 187 -23 -4 -230 -308 -161 -41 243 341 326 -302 -108 -232 119 143 169 -57 -199 -79 -10 -236 110 274
6921 274 532 202 -93 -318 -101 -115 -76 278 245 18 -202 -266 -163 -71 -66 508 353 4 -184 -181 -408 352 440
6944 440 567 143 -139 -318 -58 77 91 235 26 -309 -20 -343 41 108 54 73 289 151 -211 -230 176 315
6966 315 222 385 156 -263 -68 -51 -262 84 161 118 201 -158 15 9 -193 299 284 -399 56 68 -86 2 28 203
6990 203 336 -13 11 -257 -108 114 298 285 252 -62 -441 -20 -64 -318 -231 251 61 -52 -204 -10 -3 82 273
7013 273 233 -10 82 -469 156 20 -153 151 420 -48 -427 -194 -70 122 25 161 -10 -43 -283 -396 -202
$$ packed form
6852B56O5k71k56j80L71K34K5J39J6k91j76q3R7L78k12R6K42m67r2k24J95J33
6874eK91K63n73j74L5j8N40m47K50K78n41N0l4J84l3k9r2Q7R3k0l02Q0J08K34
6898B25l8k10J9k26p8J47J20K84R8j5o28J94j24L51K4K6k26j42J20O9k26L46J64
6921B74K58l30k95k25K17j4L9L54l3k27k20o4J03R2NN74j55l49j88Lk27P60Q8
6944D40J27m24k82j79K60J35J4J44k09l35K89l23L84O7n4J9K16j38l62j9M06J39
6966C15r3J63k29m19J95J7k11L46P7m3Q3l59J73ok02M92j5o83M55J2j54Q8K6J75
6990B03J33l49K4k68J49K22J84j3l3l14l79M21m4k54Q7M82j90j13j52J94PQ5J91
7013B73m0k43R2n51O25j36j73L04K69m68l79K33J24J92r7J36j71l3k40j13J94
$$ plain form
7034 -202 131 -55 183 41 -63 -77 -119 -125 175 523 181 98 -121 -255 -197 66 266 366 34 169 -16 -112
7056 -112 -19 287 476 324 -98 -147 123 -305 -211 -207 29 151 323 43 -177 -282 -110 451 155 149 67 -53 -211
7079 -211 80 -72 282 111 -180 98 -48 -239 45 269 -114 341 150 -91 -388 -9 -193 207 377 172
7099 172 -167 -108 -292 -55 36 289 336 -94 -15 -175 -319 -330 214 64 346 -338 -23 -306 -270 39 455 219
7121 219 83 234 -170 -263 -158 82 329 333 -56 -251 -287 69 -185 185 144 446 -110 -108 -238 -410 78 202
7143 202 -116 338 -146 -170 -120 -53 133 132 233 162 -377 -237 -172 -252 47 219 256 206 10 -143 127 -9 184
7166 184 90 251 88 -191 35 -75 223 173 -8 131 -110 -227 -2 67 451 293 -128 71 -238 -76 74
7187 74 405 473 -32 112 -145 -111 -167 -77 271 344 141 98 96 -213 -93 2 63 35 150 394 -5 -341 -167 125
$$ packed form
7034b02L33j86K38j42j04j4m2oL00L48l42q3k19j34N8K63K00J00l32J35j85r6
7056a12R3L06J89j52m22m9K70m28R4MK36J22J72k80k20j05J72N61k96oq2j20j58
7079b11K91j52L54j71k91K78j46j91K84K24l83M55j91k41k97L79j84M00J70k05
7099A72l39N9j84K37R1K53M7m30P9j60j44j1N44j50K82o84L15k83L6L09M16k36
7121B19j36J51m04r3J05K40K47Ml89j95l6L56k54L70m1L02n56Kj30j72M88J24
7143B02l18M54m84k4N0O7J86jJ01p1n39J40O5q0K99J72L7n0j96j53K70j36J93
7166A84r4J61j63k79K26j10K98n0j81J39k41j17K25O9L84j58m21J99l09J62J50
7187G4L31O8n05J44k57L4n6R0L48P3k03m3kl09J20R5O1k8J15K44l99l36J74K92
$$ plain form
7211 125 203 139 69 -394 -119 -310 -103 223 -173 268 305 237 -30 -97 -178 109 179 -56 170 -216 -543 -163 5
7234 5 75 138 78 -27 -336 -3 90 145 153 15 231 -419 -373 -151 -389 22 -16 226 -205 -70 -353 -204 -142 -11
7258 -11 580 114 -214 60 -42 72 179 126 201 127 -205 -350 52 107 30 14 359 -134 108 -442 73 3 219
7281 219 419 125 -26 -285 -80 -224 289 281 3 -108 -103 -410 -239 -3 308 62 202 75 -239 -216 102 -72
7303 -72 159 -116 49 -125 -297 79 72 224 451 84 315 66 -99 -169 -222 193 80 230 144 -129 -319 -243
7325 -243 24 -181 132 -118 19 -374 1 -353 295 14 154 325 -203 -27 -4 303 110 45 137 11 -106
7346 -106 -55 -44 -60 74 -91 226 -122 -268 -330 -327 -54 102 137 24 267 -465 -70 307 -52 363 328 -236 -154
7369 -154 -160 -166 -68 -55 -8 -34 74 6 -114 23 80 115 252 -53 -215 -373 -123 -64 90 358 10 92 -5 -367 -116
$$ packed form
7211A25P8o4p0m63K75j91K07L26l96M41L7o8k67o7q1K87P0k35K26l86l27L80J68
7234EP0O3o0j05l09L33R3N5Qj38K16o50M6K22k38M11l8K42m31J35k83J49O2J31
7258a1N91m66l28K74j02J14J07n3P5p4l32j45M02N5p7j6L45m93K42n50N15p0K16
7281B19K00k94j51k59K05j44N13qk78j11Nl07J71K36L11k46J40j27l14K3L18j74
7303g2K31k75J65j74j72L76pJ52K27l67K31k49j65p0n3M15j13J50q6k73j90P6
7325b43K67k05L13k50J37l93L75l54O48k81J40J71n28J76K3L07j93o5R2j26j17
7346a06N1J1j6J34j65L17l48j46o2LK73J56L5j13K43p32L95L77l59M15l5n64Q2
7369a54ooR8J3M7k6J08o8j20J37N7L5J37l05j62j58K50N9J54K68l48Q2r7l62K51
$$ plain form
7394 -116 -151 175 77 397 -335 -458 -214 -67 -117 155 -170 -70 1 -446 -177 319 45 67 270 -65 -172 -242
7416 -242 46 -223 154 97 362 189 -170 -87 26 -141 131 141 18 52 -175 -352 163 48 40 51 113 -121 -276
7439 -276 -57 -175 232 290 368 -61 -220 -68 -86 119 140 162 41 -125 -116 36 77 383 193 177 -35 -347 -246
7462 -246 -251 40 120 100 203 246 -435 -176 168 147 -511 314 20 -144 -105 -205 -106 118 144 126 292 -89 -157 92
7486 92 42 76 371 273 151 -296 -183 -108 164 321 324 19 87 65 162 -40 168 62 184 -9 -78 -114 -6 85
7510 85 -43 82 -296 65 -78 6 -138 1 271 -107 -49 -69 -430 36 -42 223 45 -197 -99 -204 36 -310
7532 -310 340 87 -168 165 -182 -443 -224 -150 -94 -19 140 75 -121 -177 -41 200 292 158 -54 45 -27 -261 -21
7555 -21 -90 341 20 -69 -102 -200 -474 120 26 48 47 -169 230 -328 -31 291 98 218 -101 115 -12 8 -275
$$ packed form
7394a16l5L26r8L20p32j23K44J47n0K72l25J00P1m47K69M96k74K2K03l35j07p0
7416b42K88k69L77n7K65j73l59Q3J13j67K72J0j23L4k27j77N15j15qJ1O2k34j55
7439b76K19j18M07N8P8m29j59J52j8K05K1K2j21j66RJ52M1L06j90j6k12l12J01
7462b46nK91Q0k0J03M3o81K59L44k1o58Q25k94j64L9j00R9K24K6j8J66l81o8K49
7486I2n0L4K95r8j22m47J13P5K72J57Ll05O8k2R7k02K08j06J22j93o9l6J08R1
7510H5j28J25l78L61j43Q4j44J39K70l78N8k0l61M66p8K65j78k42R8j05K40l46
7532c10O50k53k55L33l47k61K19P4N6P5J59o5j96n6J36K41R2j34k12R9p2k34K40
7555b1o9M31l21q9l3r8k74N94r4K2jk16L99n58K97L22j93J20l19K16j27K0k83
$$ plain form
7578 -275 66 113 346 -3 -66 -112 -114 149 145 -92 190 193 -229 -232 -335 64 92 -244 105 81 -150 -81 43 60 23
7603 23 384 -34 -438 6 -14 127 30 81 209 -129 -293 -279 213 -332 89 372 226 61 -185 -44 -18 -41
7625 -41 214 26 20 -139 -253 -91 -134 179 171 -173 -115 63 -135 -134 18 -48 186 183 -10 -343 27 38 68 177 411
7650 411 312 133 -144 66 -223 -195 215 324 -172 -90 -202 -184 7 136 -30 -102 295 -71 -116 -245 -63 256
7672 256 -25 -192 -131 -143 -97 -353 277 -35 -26 -59 -192 -290 -244 7 166 171 62 42 448 -98 -177 177 201 255 -127
7697 -127 -20 68 332 -22 -180 309 -87 -86 -359 46 -87 201 157 -55 -11 -246 -194 -232 13 62 98 375 -56
7720 -56 4 -167 -342 -113 212 550 57 -175 -168 -61 35 -57 -77 203 -157 -1 -167 -82 -39 40 91 -86 -250 -378
7744 -378 -244 -189 117 269 -90 177 48 -20 62 341 231 427 -9 210 214 4 -185 -334 49 42 119 96 271
$$ packed form
7578b75L41M7K33l49o3m6kK63mk37K82Lm22lj03L99K8l36L49k4k31O9J24J7l7
7603B3L61m18m04M44k0J41r7N1J28l38j64J4M92n45M21K83j46j65k46J41K6k3
7625d1K55j88oj59j14J62m3L13ql44N8J78j98JJ52o6K34lj93l33L70J1L0J09K34
7650D11r9j79k77K10k89K8M10J09m96Q2j12J8J91J29j66p2L97l66m5j29J82L19
7672B56k81j67O1j2M6k56O30l12Rl3j33r8M6K51J59Nj09k0M06n46p9L54K4N4l82
7697a27J07Q8K64l54j58M89l96Jk73M05j33K88m4k12M4k35N2l8K45M9L6K77m31
7720e6O0j71j75K29L25L38m93k32PJ07R6r2k0K80l60J56j66Q5M3P9N1j77j64j28
7744c78J34N5L06J52l59K67j29o8Q2K79j10J96m36K19Mk10j89j49L83pP7k3J75
$$ plain form
7767 271 40 191 165 171 -28 110 89 -144 139 -39 260 192 72 220 44 182 -105 111 -37 131 161 -51
7789 -51 113 -97 -173 8 -139 121 -318 -200 1 -112 -117 -185 166 186 154 -160 -32 87 228 297 177 227 146
7812 146 -55 -222 55 -215 373 35 -230 -229 -336 -81 167 90 284 80 57 67 -297 -53 121 217 268 140
7834 140 68 -48 -378 -163 -82 61 -118 199 28 -54 85 -194 173 -45 -164 -43 7 -79 132 26 -5 166
7856 166 147 -183 -118 348 -59 35 124 -7 93 173 -13 99 -131 6 93 -64 87 -108 -299 -157 142 -43
7878 -43 -76 350 -249 19 -97 -232 146 10 -23 83 -60 -128 12 112 339 275 187 171 -15 287 63 134 14
7901 14 -292 117 -3 -344 257 -153 113 -112 -32 79 -13 -6 -112 186 124 110 -42 48 -11 19 151 -105 506
7924 506 79 95 -58 -469 93 -127 163 166 58 -12 -47 121 -152 -44 164 152 22 -57 92 172 -123 258 12
$$ packed form
7767B71k31J51k6Oj99J38k1k33K83j78K99o8j20J48j76J38k87K16j48J68L0k12
7789e1J64k10p6J81j47K60m39J18K01j13no8L51K0l2l14J28J19J41O9j20N0q1
7812A46k01j67K77k70N88l38k65Jj07K55K48p7J94k04k3J0l64K44J74R6N1j28
7834A40p2j16l30K15Q1J43j79L17j71q2J39k79L67k18j19J21N0q6K11j06l1J71
7856A66j9l30O5M66m07R4Q9j31J00Q0j86J12k30J37Q7j57J51j95j91J42K99j85
7878d3l3M26n99K68j16j35L78j36l3J06j43o8J40J00K27o4q8j6j86L02k24P1j20
7901A4l06M09j20l41O01m10K66k25Q0J11r2Pj06K98o2j4j52R0n9L0J32k56O11
7924E06m27J6j53m11N62k20K90Lj08p0l5J68k73J08K08j2j30p9J49Q0k95L81k46
$$ plain form
7947 12 22 -145 -147 159 -163 127 179 284 83 -19 79 -173 -237 183 -103 -42 350 -288 -266 -6 36 -303 -62
7970 -62 16 -9 -57 28 -77 14 -80 115 -146 4 48 21 -190 -135 200 -150 -123 -26 -294 33 -154 130 162 152 148
7995 148 -21 -29 186 119 -138 4 25 216 -69 -303 -361 -69 -90 -165 251 122 -199 243 426 109 130 39 10
8018 10 49 371 -85 -137 -150 57 267 -466 -59 106 91 14 136 -58 61 20 -3 -183 218 45 428 29 -220
8041 -220 95 190 61 -50 70 51 -79 -27 -217 -86 -11 386 14 -42 40 173 293 -11 83 -50 189 117 -189
8064 -189 -11 -138 -61 200 140 243 11 -8 134 125 61 242 -40 42 7 116 -137 -80 -2 89 108 53 -139 -306
8088 -306 77 -192 121 50 -160 9 -147 -6 34 56 -59 211 -38 94 -49 -402 -186 115 28 -179 55
8109 55 -62 -166 -89 -146 154 169 59 167 53 -412 -143 40 147 106 190 -291 -222 230 -55 1 -42 -37 35 74
$$ packed form
7947A2J0j67kL06l22K90N2J05k01j02R8k52o4M20k86O1L92o38K2K60M2l39K41
7970f2P8k5m8Q5j05R1r4J95k61J50M4k7k11N5L35l50K7R7k68L27j87K84L2j0m
7995A48j69qK15o7k57J42K1J91k85k34n8K92k1p5M16j29l21M42J83l17K1r1k9
8018A0L9L22m56n2j3K07K10p33M07J65j5p7J22j94J19m1k3j80M01j73L83l99k49
8041b20L15R5j29j11J20j9j30N2j90J31P5L97l72n6Q2J33J20l04R4j33K39p2l06
8064a89J78j27P7K61o0J03k32j9J42ro4J81k82Q2l5J09k53N7P8R1J9n5j92j67
8088c06L83k69L13p1k10J69j56J41M0K2j15K70k49J32j43l53K16L01q7k07K34
8109E5j17j04P7n7L00J5j10J08j14m65K69J83J07m1Q4m81O9M52k85N6m3NP2L9
$$ plain form
8133 74 4 209 17 -97 -72 162 -131 70 -215 -35 -110 319 5 -110 -309 26 -472 153 52 220 178 248
8155 248 41 5 -267 -27 339 14 -198 -3 91 -106 112 28 204 -10 297 -44 -148 -69 -142 254 137 80
8177 80 65 -290 -13 68 106 -74 287 106 123 -172 -246 222 160 -91
$$ packed form
8133G4p0K05j92j14K5K34k93K01k85J80p5M29l14j15j99L35m98O25j01J68m2P0
8155B48k07l6k72K40L66l25k12J95R4j97K18q4J76k14L07l41j04P9p3L96j17n7
8177H0j5l55K77Q1L8j80L61j81J7k95p4M68o2k51
8191i1
$$ Imaginary data points
##PAGE= N=2
##DATA TABLE= (X++(I..I)), XYDATA
$$ plain form
0 0 0 0 0 0 -3 0 -8 8 -8 11 -16 16 -24 24 -32 40 -48 56 -65 75 -90 102 -123 139 -156 180 -206 232 -263 294
30 294 -333 375 -418 469 -522 580 -646 714 -796 879 -974 1079 -1194 1322 -1465 1627 -1810
47 -1810 2020 -2259 2545 -2881 3289 -3797 4447 -5311 6524 -8346 11391 -17388 33641 -166650
61 -166650 -485895 -34531 176474 21752 65436 253549 36824 -250159 -191966 -26517
71 -26517 17602 136549 193325 26096 -93076 -34526 -107609 -195482 34053 276082 128839
82 128839 -55532 -4940 -57604 -244242 -120915 191132 211320 49367 27535 -25047 -212948
93 -212948 -219729 28181 208482 197807 90371 -78861 -200081 -137698 -17510 35127 130985
104 130985 219651 59748 -201624 -193301 -10101 30691 8564 106482 165560 36205 -129495
$$ packed form
0@%%%%lLqJ6j6J9k7L2m0M8n6P2q8J04j21J40j65J92k25K62k95L36l86M38m95N57
30B94o27P08p93Q87r91J102j226J360j510J675j853K053k273K516k787L092l437
47a810L830m279M804n426O170p086Q244r758J1835j4870J9737k8779N1029k00291
61a66650l19245M51364K11005j54722M3684J88113k16725k86983N8193J65449
71b6517M4119J18947N6776j67229j19172N8550p3083q7873K29535K42029j47243
82A28839j84371N0592n2664j86638J23327L12047K0188j61953k1832n2582j87901
93b12948o781K47910J80301j0675j07436j69232j21220O2383J20188N2637R5858
104A30985Q8666j59903k61372Q323J83200M0792k2127R7918N9078j29355j65700
$$ plain form
115 -129495 -172106 -99303 27074 119209 125082 94320 25053 -132708 -228027 -85636 117579
126 117579 149143 109847 89172 -51354 -231042 -169178 48516 128538 112586 124271 33159
137 33159 -159535 -196021 -56303 56804 120966 155492 54706 -98867 -104326 -58891 -91658
148 -91658 -16445 189970 190726 -30786 -114681 -54291 -96858 -114278 76786 223035 118410
159 118410 -35012 -100764 -153188 -125939 42257 158251 123438 66912 -13047 -165161 -193213
170 -193213 -7768 128169 99924 87065 73640 -81725 -200277 -89591 56215 69494 87017
181 87017 124075 21127 -138374 -145972 -52890 20359 98372 145588 67856 -53815 -105818 -124061
193 -124061 -90885 60699 189153 122139 -18926 -73512 -106788 -133240 -31405 133252 163873
$$ packed form
115a29495m2611P2803J26377R2135N873l0762o9267j57761r5319J42391K03215
126A17579L1564l9296k0675j40526j79688O1864K17694Q0022j5952J1685r1112
137C3159j92694l6486J39718J13107O4162L4526j00786j53573n459M5435l2767
148i1658P5213K06415P56k21512q3895O0390m2567j7420J91064J46249j04625
159A18410j53422o5752n2424K7249J68196J15994l4813n6526p9959j52114k8052
170a93213J85445J35937k8245j2859j3425j55365j18552J10686J45806J3279J7523
181H7017L7058j02948j59501p598R3082P3249P8013M7216p7732j21671n2003j8243
193a24061L3176J51584J28454o7014j41065n4586l3276k6452J01835J64657L0621
$$ plain form
204 163873 68227 -29358 -108497 -139550 -61041 53224 101696 111964 78824 -50453 -158648
215 -158648 -104151 5080 43703 88463 136410 46729 -112996 -139637 -64482 -9628 65063
226 65063 150340 103382 -39551 -110298 -109519 -85683 21739 150326 128699 9560 -45871 -84497
238 -84497 -141690 -67429 112307 155033 54016 -3217 -40202 -129808 -125970 26114 124805 96257
250 96257 57671 3003 -105818 -135969 -36742 46071 76414 118235 85112 -70571 -154572 -76864
262 -76864 -136 28287 107196 143656 11921 -130500 -115167 -43540 -4937 68659 137561 80382
274 80382 -42993 -102854 -103429 -62238 42118 125684 97125 19244 -37570 -102280 -126454 -24285
286 -24285 105021 113484 51793 10436 -51799 -125900 -98200 23648 105913 102902 53987 -23300
$$ packed form
204A63873r5646r7585p9139l1053P8509J14265M8472J0268l3140j29277j08195
215a58648N4497J09231L8623M4760M7947q9681j59725k6641P5155N4854P4691
226F5063Q5277m6958j42933p0747P79K3836J07422J28587k1627j19139n5431l8626
238h4497n7193P4261J79736M2726j01017n7233l6985q9606L838J52084R8691k8548
250I6257l8586n4668j08821l0151R9227Q2813L0343M1821l3123j55683q4001P7708
262g6864P6728K8423P8909L6460j31735j42421J5333P1627L8603P3596O8902n7179
274H0382j23375n9861n75M1191J04356Q3566k8559p7881n6814o4710k4174J02169
286b4285J29306Q463o1691m1357o2235p4101K7700J21848Q2265l011m8915p7287
$$ plain form
298 -23300 -96438 -106360 -52104 32678 113425 120306 20827 -82552 -96352 -67308 -33268 49914
310 49914 134464 98204 -25274 -94592 -89072 -61344 380 87863 117991 58435 -34056 -104268
322 -104268 -108517 -30153 59678 88701 78014 47141 -42472 -132352 -98351 20388 79542 74353
334 74353 71273 27184 -81272 -133690 -61656 40718 88471 90038 49125 -29393 -93014 -97900
346 -97900 -45112 46450 117512 92841 -1505 -62735 -76651 -80431 -35646 75038 133102 63497
358 63497 -36674 -74172 -77299 -64087 2637 92772 112508 42295 -49191 -95662 -80002 -24491
370 -24491 37349 85968 97251 33259 -74793 -118702 -60768 15912 56117 82819 81060 3736
382 3736 -96392 -111407 -38174 38885 76628 80103 45886 -25435 -93581 -99862 -27846 65229
$$ packed form
298b3300p3138r922N4256Q4782Q0747O881r9479j03379j3800K9044L4040Q3182
310D9914Q4550l6260j23478o9318N520K7728O1724Q7483L0128n9556r2491p0212
322a04268m249P8364Q9831K9023j0687l0873q9613q9880L4001J18739N9154n189
334G4353l080m4089j08456n2418P2034J02374M7753J567m0913p8518o3621m886
346i7900N2788R1562P1062k4671r4346o1230j3916l780M4785J10684N8064o9605
358F3497j00171l7498l127J3212O6724R0135J9736p0213r1486m6471J5660N5511
370b4491O1840M8619J1283o3992j08052m3909N7934P6680M0205K6702j759p7324
382C736j00128j5015P3233P7059L7743L475l4217p1321o8146o281P2016R3075
$$ plain form
394 65229 99383 62593 6320 -43024 -88272 -88493 -7552 89514 103137 41250 -20681 -60660
406 -60660 -86707 -65081 19481 99587 97903 24901 -49655 -82351 -72411 -28844 41191 98026
418 98026 85936 3913 -75728 -89474 -49981 2950 55048 91889 68945 -16648 -92155 -89881
430 -89881 -28958 31181 68974 81300 46011 -37451 -101637 -83304 -6175 56969 78702 65566
442 65566 15953 -56649 -98932 -66916 14556 78212 83781 41522 -16730 -67384 -86827 -49267
454 -49267 34359 94008 78353 13728 -41671 -72341 -73626 -26999 52553 97200 66368 -5180
466 -5180 -63861 -80302 -53168 3422 63753 90379 54589 -26731 -85780 -76299 -24872 26920
478 26920 70207 83700 32131 -52806 -90188 -60241 -7673 45052 82522 67541 -470 -64225
$$ packed form
394F5229L4154l6790n6273m9344m5248k21Q0941R7066J3623o1887o1931l9979
406f0660k6047K1626Q4562Q0106j684p3002p4556l2696R940M3567P0035N6835
418I8026j2090q2023p9641j3746L9493N2931N2098L6841k2944q5593p5507K274
430h9881O0923O0139L7793J2326l5289q3462o4186J8333P7129O3144K1733j3136
442F5566m9613p2602m2283L2016Q1472O3656N569m2259n8252n0654j9443L7560
454d9267Q3626N9649j5655o4625n5399l0670j285M6627P9552M4647l0832p1548
466e180n8681j6441K7134N6590O0331K6626l5790q1320n9049R481N1427N1792
478B6920M3287J3493n1569q4937l7382K9947N2568N2725L7470j4981o8011o3755
$$ plain form
490 -64225 -81746 -53017 9345 72183 81868 36211 -19120 -64059 -85061 -44383 43034 88972
502 88972 60743 13446 -28834 -75742 -81737 -11504 66552 81357 48564 691 -56028 -84377
514 -84377 -48816 16627 62328 77313 48425 -25633 -82057 -68645 -18949 24867 66319 80438
526 80438 25850 -53237 -80420 -53775 -9849 43823 82361 61159 -6404 -61730 -76632 -49173
538 -49173 13710 70513 73652 33174 -20654 -70655 -80098 -24146 46556 69680 53746 21337
550 21337 -34466 -82468 -64804 2411 53393 70140 52589 -2993 -61012 -70410 -39670 5157
562 5157 60615 86930 35513 -42616 -65596 -50796 -33176 18106 85291 77827 -69 -52894
574 -52894 -61071 -56424 -14503 59782 83834 37011 -13020 -47825 -74961 -48457 29538 70136
$$ packed form
490f4225j7521K8729O2362O2838R685m5657n5331m4939k1002M0678Q7417M5938
502H8972k8229m7297m2280m6908n995P0233P8056J4805l2793m7873n6719k8349
514h4377L5561O5443M5701J4985k8888p4058n6424J3412M9696M3816M1452J4119
526H0438n4588p9087k7183K6645M3926N3672L8538k1202o7563n5326j4902K7459
538d9173O2883N6803L139m0478n3828n0001r443N5952P0702K3124j5934l2409
550B1337n5803m8002J7664O7215N0982J6747j7551n5582n8019r398L0740M4827
562E157N5458K6315n1417p8129k2980J4800J7620N1282O7185p464p7896n2825
574e2894q177M647M1921P4285K4052m6823n0031l4805k7136K6504P7995M0598
$$ plain form
586 70136 50780 27816 -7688 -71045 -81874 -8229 49765 48270 47813 36616 -36134 -95766 -55001
599 -55001 18633 46434 56001 55083 716 -67759 -73334 -31262 14748 61922 77829 24608 -42990
612 -42990 -58832 -48841 -32142 26603 87971 64405 -14229 -50885 -48684 -45932 -13270 51879 77749
625 77749 36479 -18005 -50000 -58440 -35700 13723 56129 65529 34776 -26337 -72472 -60475
637 -60475 -10076 33013 59617 61465 16870 -51668 -77412 -43779 10566 50652 60950 37354
649 37354 -7653 -51742 -71162 -37882 32834 69976 44746 9625 -11649 -51590 -74644 -19795
661 -19795 57078 63416 28422 7938 -23524 -67195 -55438 7411 48726 56706 45558 -4886
673 -4886 -64701 -62460 -18607 9738 45348 81552 37181 -59316 -75643 -23496 -5562 8153
$$ packed form
586G0136j9356k2964l5504o3357j0829P3645N7994j495m57j1197p2750n9632M0765
599e5001P3634K7801R567r18n4367o8475n575M2072M6010M7174J5907n3221o7598
612d2990j5842R991J6699N8745O1368k3566p8634l6656K201K752L2662O5149K5870
625G7749m1270n4484l1995q440K2740M9423M2406R400l0753o1113m6135J1997
637f0475N0399M3089K6604J848m4595o8538k5744L3633N4345M0086J0298k3596
649C7354m5007m4089j9420L3280P0716L7142k5230l5121k1274l9941k3054N4849
661a9795P6873O338l4994k0484l1462m3671J1757O2849M1315P980j1148n0444
673d886n9815K241M3853K8345L5610L6204m4371r6497j6327N2147J7934J3715
$$ plain form
685 8153 68076 75973 -12106 -70114 -42596 -20314 -12717 39026 76120 31907 -25516 -42637 -52001
698 -52001 -40112 24969 68667 39491 7912 -3200 -49945 -80724 -13937 65062 54169 18995
710 18995 18122 -17522 -80868 -62000 25108 63037 45430 28094 -5020 -57710 -65071 -17871 27656
723 27656 52967 56899 14707 -44284 -54989 -28926 -9214 18846 59829 54297 -6365 -49072
735 -49072 -45966 -29385 -4975 37415 63472 39300 -15487 -57596 -57841 -18296 25424 47395 50534
748 50534 27219 -29814 -71686 -46988 7284 35280 47374 47683 5136 -53557 -60944 -23499 11664
761 11664 41791 58248 25192 -28367 -43523 -35772 -28637 10915 63821 52561 -5051 -26527
773 -26527 -28373 -50932 -32029 44241 74167 27030 -10377 -23526 -54304 -54543 14305 64892 45206
$$ packed form
685H153N9923P897q8079n8008K7518K2282P597N1743L7094m4213n7423j7121r364
698e2001J1889O5081M3698k9176l1579j1112m6745l0779O6787P8999j0893l5174
710A8995q73l5644o3346J8868Q7108L7929j7607j7336l3114n2690p361M7200M5527
723B7656K5311L932m2192n8991j0705K6063J9712K8060M0983n532o0662m2707
735d9072L106J6581K4410M2390K6057k4172n4787m2109k45L9545M3720K1971L139
748E0534k3315n7033m1872K4698N4272K7996J2094L09m2547n8693p387L7445L5163
761A1664L0127J6457l3056n3559j5156P751P135L9552N2906j1260n7612k1476
773b6527j846k2559J8903P6270K9926m7137l7407j3149l0778k39O8848N0587j9686
$$ plain form
786 45206 16180 -5548 -50358 -66556 -10227 41618 38875 33154 26211 -26315 -70865 -36828 15822
799 15822 25835 35290 49193 7093 -56038 -53530 -11958 6753 26792 55630 35985 -23401
811 -23401 -50422 -38912 -22164 12751 56728 54227 4450 -33363 -45628 -45443 -11512 45817 62037
824 62037 25476 -13661 -34916 -46566 -31524 13505 47375 44258 18232 -16737 -45171 -42871
836 -42871 -12900 19572 42902 45872 13691 -33656 -50771 -32496 -4539 28600 52935 38040
848 38040 -7244 -40328 -46350 -30718 8739 49046 48669 15174 -15934 -40900 -52899 -19651 37533
$$ packed form
786D5206k9026k1728m4810j6198N6329N1845k743n721o943n2526m4550L4037N2650
799A5822J0013R455J3903m2100o3131K508M1572J8711K0039K8838j9645n9386
811b3401k7021J1510J6748L4915M3977k501m9777l7813j2265J85L3931N7329J6220
824F2037l6561l9137k1255j1650J5042M5029L3870l117k6026l4969k8434K300
836d2871K9971L2472K3330K970l2181m7347j7115J8275K7957L3139K4335j4895
848C8040m5284l3084o022J5632L9457M0307l77l3495l1108k4966j1999L3248N7184
$$ [...]
8191A03
##END NTUPLES=NMR FID
##END=
