##TITLE=1H_LR-659-C1-0
 CDCl3, 8 sc, 
 12.3.2019
##JCAMPDX= 6.0         $$ Bruker NMR JCAMP-DX V2.0
##DATA TYPE= NMR FID
##DATA CLASS= NTUPLES
##ORIGIN= UXNMR, Bruker Analytische Messtechnik GmbH
##OWNER= root
$$ XWIN-NMR		Version 3.5
$$ Tue Mar 12 15:50:32 2019 Russian Standard Time (UT+4h)  she@DPX200
##.OBSERVE FREQUENCY= 200.1316
##.OBSERVE NUCLEUS= ^1H
##.DELAY= (6, 6)
##.ACQUISITION MODE= SIMULTANEOUS
##.ACQUISITION SCHEME= undefined
##.AVERAGES= 8
##.DIGITISER RES= 18
##SPECTROMETER/DATA SYSTEM= spect
##.PULSE SEQUENCE= zg30
##.SOLVENT NAME= CDCl3
##.SHIFT REFERENCE= (INTERNAL, CDCl3, 0, 15.7039)
##AUDIT TRAIL= $$ (NUMBER, WHEN, WHO, WHERE, WHAT)
$$ ##TITLE= Audit trail, XWIN-NMR		Version 3.5
$$ ##JCAMPDX= 5.01
$$ ##ORIGIN= Bruker BioSpin GmbH
$$ ##OWNER= she
$$ F:/spectra/data/she/nmr/H-F/1/audita.txt
$$ ##AUDIT TRAIL=  $$ (NUMBER, WHEN, WHO, WHERE, WHAT)
(   1,<2019-03-12 15:47:30.85 +0400>,<she>,<DPX200>,
      <created by zg, POWCHK disabled, PULCHK disabled
       configuration hash MD5:
       00 E9 B6 7A A2 85 ED C7 34 08 36 98 17 FE 4E 26
       data hash MD5: 16K
       1D 7D 0F 4A F7 48 B4 41 CB BB 0D AC 5A F4 07 81>)
$$ ##END=
$$ 
$$ hash MD5
$$ C3 47 53 E3 51 6F CE 24 3D 1A BD 14 F9 B8 99 0E
##$RELAX= 
##$RELAX= 
##$RELAX= 
##$RELAX= 
##$RELAX= 
##$RELAX= 
$$ Bruker specific parameters
$$ --------------------------
##$DU= <F:/spectra>
##$EXPNO= 1
##$NAME= <H-F>
##$PROCNO= 1
##$TYPE= <nmr>
##$USER= <she>
##$AMP= (0..31)
100 100 100 100 100 100 100 100 100 100 100 100 100 100 100 100 100 100 
100 100 100 100 100 100 100 100 100 100 100 100 100 100 
##$AQSEQ= 0
##$AQ_mod= 1
##$AUNM= <au_zg>
##$AUTOPOS= <>
##$BF1= 200.13
##$BF2= 200.13
##$BF3= 200.13
##$BF4= 200.13
##$BF5= 200.13
##$BF6= 200.13
##$BF7= 200.13
##$BF8= 200.13
##$BYTORDA= 1
##$CFDGTYP= 0
##$CFRGTYP= 5
##$CHEMSTR= <none>
##$CNST= (0..31)
1 1 145 1 1 1 1 1 1 1 1 1 1 1 1 1 1 1 1 1 1 1 1 1 1 1 1 1 1 1 1 1 
##$CPDPRG= <>
##$CPDPRG1= <>
##$CPDPRG2= <>
##$CPDPRG3= <>
##$CPDPRG4= <mlev>
##$CPDPRG5= <mlev>
##$CPDPRG6= <mlev>
##$CPDPRG7= <mlev>
##$CPDPRG8= <mlev>
##$CPDPRGB= <>
##$CPDPRGT= <>
##$D= (0..31)
0 1.2 0 0 0 0 0 0 0 0 0 0.03 0 0 0 0 0 0 0 0 0 0 0 0 0 0 0 0 0 0 0 0 
##$DATE= 1552391250
##$DBL= (0..7)
120 120 120 120 120 120 120 120 
##$DBP= (0..7)
150 150 150 150 150 150 150 150 
##$DBP07= 0
##$DBPNAM0= <>
##$DBPNAM1= <>
##$DBPNAM2= <>
##$DBPNAM3= <>
##$DBPNAM4= <>
##$DBPNAM5= <>
##$DBPNAM6= <>
##$DBPNAM7= <>
##$DBPOAL= (0..7)
0.5 0.5 0.5 0.5 0.5 0.5 0.5 0.5 
##$DBPOFFS= (0..7)
0 0 0 0 0 0 0 0 
##$DE= 6
##$DECBNUC= <off>
##$DECIM= 24
##$DECNUC= <off>
##$DECSTAT= 4
##$DIGMOD= 1
##$DIGTYP= 9
##$DL= (0..7)
0 120 120 120 120 120 120 120 
##$DP= (0..7)
150 150 150 150 150 150 150 150 
##$DP07= 0
##$DPNAME0= <>
##$DPNAME1= <>
##$DPNAME2= <>
##$DPNAME3= <>
##$DPNAME4= <>
##$DPNAME5= <>
##$DPNAME6= <>
##$DPNAME7= <>
##$DPOAL= (0..7)
0.5 0.5 0.5 0.5 0.5 0.5 0.5 0.5 
##$DPOFFS= (0..7)
0 0 0 0 0 0 0 0 
##$DQDMODE= 0
##$DR= 18
##$DS= 0
##$DSLIST= <SSSSSSSSSSSSSSS>
##$DSPFIRM= 0
$$ [...]
##$SUBNAM2= <"">
##$SUBNAM3= <"">
##$SUBNAM4= <"">
##$SUBNAM5= <"">
##$SUBNAM6= <"">
##$SUBNAM7= <"">
##$SUBNAM8= <"">
##$SUBNAM9= <"">
##$SW= 24.9336934301222
##$SWIBOX= (0..15)
0 0 2 0 0 0 0 0 0 0 0 0 0 0 0 0 
##$SW_h= 4990.01996007984
##$TD= 16384
##$TD0= 1
##$TE= 0
##$TE2= 300
##$TE3= 300
##$TEG= 300
##$TL= (0..7)
0 120 120 120 120 120 120 120 
##$TP= (0..7)
150 150 150 150 150 150 150 150 
##$TP07= 0
##$TPNAME0= <>
##$TPNAME1= <>
##$TPNAME2= <>
##$TPNAME3= <>
##$TPNAME4= <>
##$TPNAME5= <>
##$TPNAME6= <>
##$TPNAME7= <>
##$TPOAL= (0..7)
0.5 0.5 0.5 0.5 0.5 0.5 0.5 0.5 
##$TPOFFS= (0..7)
0 0 0 0 0 0 0 0 
##$TUNHIN= 0
##$TUNHOUT= 0
##$TUNXOUT= 0
##$USERA1= <user>
##$USERA2= <user>
##$USERA3= <user>
##$USERA4= <user>
##$USERA5= <user>
##$V9= 5
##$VALIST= <valist>
##$VCLIST= <CCCCCCCCCCCCCCC>
##$VD= 0
##$VDLIST= <DDDDDDDDDDDDDDD>
##$VPLIST= <PPPPPPPPPPPPPPP>
##$VTLIST= <TTTTTTTTTTTTTTT>
##$WBST= 1024
##$WBSW= 4
##$XGAIN= (0..3)
0 0 0 0 
##$XL= 0
##$YL= 0
##$YMAX_a= 851432
##$YMIN_a= -1099913
##$ZGOPTNS= <>
##$ZL1= 120
##$ZL2= 120
##$ZL3= 120
##$ZL4= 120
##$ABSF1= 10
##$ABSF2= 0
##$ABSG= 5
##$ABSL= 3
##$ALPHA= 0
##$AQORDER= 0
##$ASSFAC= 0
##$ASSFACI= 0
##$ASSFACX= 0
##$ASSWID= 0
##$AUNMP= <proc_1d>
##$AZFE= 0.1
##$AZFW= 0.1
##$BCFW= 1
##$BC_mod= 2
##$BYTORDP= 1
##$COROFFS= 0
##$CY= 11.3945322036743
##$DATMOD= 1
##$DC= 2
##$DFILT= <>
##$DTYPP= 0
##$F1P= 18.9103706918063
##$F2P= -1.10871071338519
##$FCOR= 0.5
##$FTSIZE= 0
##$FT_mod= 4
##$GAMMA= 1
##$GB= 0.15
##$INTBC= 1
##$INTSCL= 1
##$ISEN= 128
##$LB= 0.24
##$LEV0= 0
##$LPBIN= 0
##$MAXI= 10000
##$MC2= 0
##$MEAN= 0
##$ME_mod= 0
##$MI= 1.114404
##$NCOEF= 0
##$NC_proc= 0
##$NLEV= 6
##$NOISF1= 3.799351
##$NOISF2= 2.8
##$NSP= 1
##$NTH_PI= 0
##$NZP= 0
##$OFFSET= 15.70392
##$PC= 1
##$PHC0= -8856.57
##$PHC1= 14.20025
##$PH_mod= 1
##$PKNL= yes
##$PPARMOD= 0
##$PSCAL= 0
##$PSIGN= 0
##$REVERSE= no
##$SF= 200.130013532006
##$SI= 16384
##$SIGF1= 3
##$SIGF2= 2
##$SINO= 400
##$SIOLD= 16384
##$SREGLST= <1H.CDCl3>
##$SSB= 0
##$STSI= 0
##$STSR= 0
##$SW_p= 3612.71676300578
##$SYMM= 0
##$S_DEV= 0
##$TDeff= 0
##$TDoff= 0
##$TI= <>
##$TILT= no
##$TM1= 0
##$TM2= 0
##$TOPLEV= 0
##$USERP1= <user>
##$USERP2= <user>
##$USERP3= <user>
##$USERP4= <user>
##$USERP5= <user>
##$WDW= 1
##$XDIM= 8192
##$YMAX_p= 0
##$YMIN_p= 0
$$ End of Bruker specific parameters
$$ ---------------------------------
##NTUPLES= NMR FID
##VAR_NAME=  TIME,          FID/REAL,        FID/IMAG
##SYMBOL=    X,             R,               I
##VAR_TYPE=  INDEPENDENT,   DEPENDENT,       DEPENDENT
##VAR_FORM=  AFFN,          ASDF,            ASDF
##VAR_DIM=   8192,          8192,            8192
##UNITS=     SECONDS,       ARBITRARY UNITS, ARBITRARY UNITS
##FACTOR=    0.0002004,     1,               1
##FIRST=     0,             0,               0
##LAST=      1.6414764,     0,               0
##MIN=       0,             -1099913,        0
##MAX=       1.6414764,     851432,          0
$$ Real data points
##PAGE= N=1
##DATA TABLE= (X++(R..R)), XYDATA
$$ [...]
42 -4405 4879 -5395 5978 -6637 7368 -8199 9161 -10273 11578 -13141 15053 -17452 20568
55 20568 -24784 30862 -40429 57735 -98871 391052 -78579 -1090094 -112325 622430 222372
66 222372 -273078 108022 91225 -432775 -273910 619798 507911 -522853 -694030 308810
76 308810 653896 -93112 -512892 -21004 265247 10092 -47019 147212 -97403 -394334
86 -394334 39624 608017 193989 -595028 -439895 344903 472855 -1225 -188475 -121189
96 -121189 -219850 -70818 476059 465972 -390243 -738290 83466 709140 171626 -439795
106 -439795 -179793 160605 -51621 -77786 321023 184535 -492529 -398376 486807 568937
116 568937 -374773 -656015 194325 607451 -36755 -435552 -12651 201974 -113235 -43329
126 -43329 379736 107075 -590709 -355318 584997 622160 -311593 -649531 -7232 406614
136 406614 141853 -48590 13408 -155555 -308499 92610 501084 129840 -468693 -315493
146 -315493 257472 314027 -48152 -166675 -62744 -48919 28613 213791 88263 -296083
156 -296083 -245480 263026 368140 -127717 -374920 -27691 239231 92970 -11430 39426
166 39426 -125631 -291803 69445 512393 178292 -512608 -412802 310454 462639 -65662
176 -65662 -290900 -25120 43272 -98568 84632 310715 -34038 -463195 -141814 449760
186 449760 284590 -329553 -337836 167813 273822 -55061 -148810 17539 5075 -70386 97604
197 97604 198018 -89697 -315055 -26265 336396 193894 -192105 -255895 -23163 152429
207 152429 176884 80298 -141080 -268249 -40017 284622 213571 -143227 -244687 -29058
217 -29058 107440 76751 67864 10568 -177440 -178461 151537 299044 -54842 -340336 -57546
228 -57546 295005 124029 -205349 -123135 115616 58055 -64383 59107 107278 -145249 -219582
239 -219582 147999 352080 -25580 -381051 -128920 282210 212038 -106605 -148174 -12388
249 -12388 -9761 -9867 131472 131003 -136966 -252459 21719 260631 97295 -172617 -155103 36833
261 36833 109640 52905 -19493 -79134 -70756 48124 124606 14176 -120089 -65510 70363
272 70363 82381 16109 -17444 -61851 -90573 36528 198332 80201 -212307 -202296 128791
283 128791 248830 -9429 -188220 -51198 70387 315 -4231 103969 25651 -192721 -127143
294 -127143 187065 212570 -120194 -245590 29555 207427 22459 -140727 -26282 81686
304 81686 -5394 -47435 59564 60354 -96084 -100651 103544 162350 -46976 -180355 -33762
315 -33762 141040 100287 -42805 -93693 -46521 20850 71302 58859 -26384 -88803 -47393 37418
327 37418 68965 36430 -31486 -90756 -55392 75548 122135 -23393 -148234 -38587 129677
338 129677 74344 -90490 -72734 60621 49693 -45838 -6884 72714 -15174 -115052 12892
349 12892 169177 38909 -181376 -101281 147569 141223 -80044 -126505 25634 68650 -26111
360 -26111 -21113 63518 9363 -113907 -53388 118569 100173 -86779 -130249 26318 113503
371 113503 17673 -73766 -34268 32165 25284 -3432 971 3380 -15394 -14498 21302 41862 7398
384 7398 -47451 -43881 33385 83864 15562 -90195 -66284 63030 93056 -22452 -85844 -6379
396 -6379 51425 -6461 -34825 34541 39415 -67813 -79686 65483 114150 -43082 -135662 5016
408 5016 128918 22886 -105564 -31929 83307 28157 -64196 -9138 69149 720 -78685
419 -78685 2570 101420 22746 -103276 -52044 87747 78507 -49905 -79412 13437 55964 567
431 567 -31130 3314 15088 -23791 -30011 23403 46463 -12680 -64907 -20618 58300 46800 -40285
444 -40285 -63654 15340 66700 7219 -56745 -15022 49929 19009 -40598 -8057 50967 7899
456 7899 -62495 -10614 83903 35920 -87107 -62548 74950 82954 -50248 -85553 26083 68868
468 68868 -23172 -58437 27145 52287 -41233 -69029 35852 80292 -25157 -92067 921 86723
480 86723 18035 -73348 -29378 58133 34903 -40287 -28798 34964 27551 -28908 -21271 37157
492 37157 32947 -34797 -45078 28845 62457 -5651 -67066 -20475 56319 36999 -39627 -42398
504 -42398 21972 30940 -24847 -29722 29143 32401 -40545 -53243 33571 67599 -20813 -78446 623
517 623 77425 15948 -69097 -23040 63451 30255 -53927 -27397 55536 31237 -52812 -30092
529 -30092 61286 42697 -60264 -55973 54576 71625 -36109 -77217 12392 66346 -1429 -53671
541 -53671 -3107 39793 -8202 -46725 6311 53655 1160 -63779 -23926 55560 41402 -39299
553 -39299 -49936 21530 49296 -7505 -41129 5280 42020 812 -38595 696 45690 7095
565 7095 -46369 -10536 54482 24295 -55371 -40443 48658 55144 -34609 -64367 13695 54958
577 54958 -6359 -47224 6024 39381 -19771 -54244 17422 69051 -5696 -81528 -20358 74918
589 74918 38995 -56764 -41944 43286 38647 -35539 -29913 41994 36549 -39602 -40582 39036 51340
602 51340 -28301 -53076 21613 58502 -9191 -60422 -7138 54710 21211 -42807 -31661 22237
614 22237 22286 -18382 -16264 21828 13623 -37289 -35016 34041 56616 -15165 -68918 -13677 60291
627 60291 32725 -39358 -29544 30813 22861 -30882 -15629 45237 28108 -46822 -38977 45051 51997
640 51997 -34306 -56868 27103 61556 -18841 -67740 3308 63639 8128 -55659 -16441 39738
652 39738 4649 -43025 1650 54346 608 -73193 -26683 70409 53272 -46776 -61497 18205
664 18205 49175 -2077 -24540 13117 20924 -23546 -28909 27540 48523 -8159 -50172 -9994
676 -9994 43434 24186 -31470 -29090 23590 33587 -17942 -43112 2850 41068 6589 -36649 -11947
689 -11947 24715 -1989 -34391 8079 54460 307 -75335 -31678 71773 61146 -43267 -64461
701 -64461 17395 46979 -9090 -22685 29370 25996 -43963 -43151 45924 68102 -23153 -71533 2556
714 2556 63054 7523 -53608 -11391 47712 13513 -46570 -23060 33736 19777 -28265 -14844
726 -14844 26669 6451 -42937 -20447 48179 45647 -32186 -64155 -2884 56115 33525 -22759
738 -22759 -30806 451 11917 92 8494 28085 4674 -44390 -32318 41067 59938 -16129
750 -16129 -64667 -5378 54160 10597 -48485 -11745 46595 11156 -50853 -20408 42998 17143
762 17143 -41633 -12904 46239 8891 -64080 -26736 69830 55719 -49192 -70695 15368 59314
774 59314 9936 -24417 1507 8812 -25137 -16941 42622 49907 -23792 -65723 -8256 56080 32832
787 32832 -29720 -33798 9540 20494 -9059 -17855 9265 19339 -9185 -26577 -2318 20543
799 20543 787 -22014 1968 31594 248 -50207 -22784 55478 55554 -33089 -67756 3285 55270
812 55270 14220 -24291 5693 17715 -32036 -36059 45352 71739 -23094 -86513 -9130 73211
824 73211 26656 -50272 -23760 34910 8963 -40390 -9148 42565 12046 -43315 -19204 34314
836 34314 14626 -37016 -17447 41197 31334 -35598 -48080 12131 51050 19723 -25235 -26304
848 -26304 -1538 11577 13083 16101 10482 -15377 -35688 -10551 41407 46343 -15511 -59317 -17666
861 -17666 44712 30776 -27176 -26724 18775 13059 -31038 -17937 36788 25037 -38579 -33332 33632
874 33632 31434 -39343 -36271 46701 53543 -40373 -69357 19478 70858 6387 -45619 -6145 25551
887 25551 -12147 -22540 36581 49313 -30581 -71871 2695 71363 26767 -46215 -34549 16499
899 16499 16777 -10775 -3596 16611 75 -27269 -13954 19613 19203 -10755 -20031 3187 17867
912 17867 -1595 -23094 -5946 30314 26615 -21402 -40870 2438 42942 19290 -21634 -14133
924 -14133 10504 -3654 -16764 20656 45680 -10191 -67557 -19044 63405 42526 -42963 -46127
936 -46127 22254 29119 -24894 -21162 34419 23274 -44244 -37852 36480 42588 -29171 -41642 25567
949 25567 41594 -24930 -46850 19202 54252 -12 -44098 -10050 27801 9496 -11127 8811
961 8811 18876 -15144 -35109 3896 44606 21825 -31494 -38477 3970 31182 13174 -15671
973 -15671 -15309 2148 1473 -9857 -821 18455 7168 -25226 -21832 19106 27392 -13440 -28466
986 -28466 13781 34149 -12178 -42223 6478 50877 10828 -42943 -17621 32633 15016 -23780
998 -23780 -281 35182 -1784 -51027 -11815 57228 32668 -46436 -45531 23359 37041 -14320
1010 -14320 -25913 14900 17391 -25815 -26160 24198 33415 -16763 -36293 5679 31333 -980 -26606
1023 -26606 423 28494 7469 -25682 -14765 19923 23704 -4189 -16729 14 10578 -1990
1035 -1990 -7736 11759 20065 -10809 -35031 -4440 38190 21149 -30493 -32178 13986 25577 -10890
1048 -10890 -20626 13627 18544 -22163 -28832 19966 36206 -13513 -39207 7021 38947 -3051
1060 -3051 -37726 2987 42883 6001 -40560 -12355 36803 18819 -24893 -13007 23736 9335
1072 9335 -27290 -10212 32873 20925 -30462 -32941 16123 33327 -3661 -28077 -4871 16366
1084 16366 224 -16355 519 18706 1108 -24000 -10862 20625 17652 -15380 -20460 11616
1096 11616 23169 -7578 -24283 6969 31265 2283 -29792 -7180 28813 12793 -22427 -9773
1108 -9773 24061 8686 -29147 -12965 32780 21898 -31911 -32815 21016 32493 -14852 -31549
1120 -31549 9001 25131 -12638 -28223 11215 29996 -8441 -33574 2174 32667 4028 -28587
1132 -28587 -5767 28621 10518 -24390 -12786 23268 19720 -14399 -18727 10245 18560 -5755
1144 -5755 -16222 6563 18652 -5165 -23879 -1084 25335 8286 -25974 -18433 17787 18708 -15229
1157 -15229 -21266 10822 19608 -12456 -23910 10873 27389 -7658 -30054 4246 32175 1341
1169 1341 -30368 -2413 33127 8673 -30319 -10650 30787 16558 -25021 -16510 23100 17950
1181 17950 -21340 -18487 20847 20707 -20380 -26466 13915 26977 -9589 -28648 1731 23544 -455
1194 -455 -23351 -3190 20361 3684 -20902 -8195 19526 12319 -16273 -14400 14366 19203 -8848
1207 -8848 -19234 7496 23624 -122 -22256 -2667 23453 8242 -20650 -9940 20104 12180
1219 12180 -20677 -15780 19701 18828 -19599 -25224 14013 26122 -12100 -29527 6412 26921 -5819
1232 -5819 -29002 1897 28478 -143 -28622 -3077 29053 7349 -26662 -8694 27171 14052
1244 14052 -22460 -14708 22200 19859 -16093 -18835 13938 20381 -9805 -19572 8103 20654 -5398
1257 -5398 -22435 230 21394 2537 -21933 -8917 17149 10203 -16740 -14444 12154 15105 -11259
1270 -11259 -18130 7695 20105 -4470 -21020 1965 23206 2867 -22497 -4116 24933 10621
1282 10621 -22069 -12376 22928 17406 -19123 -18267 17690 20399 -15744 -21952 13857 23377 -13293
1295 -13293 -27510 7724 26422 -5544 -28496 -319 24905 1017 -25310 -4770 23029 6782
1307 6782 -23028 -9577 21029 13088 -17151 -14005 15736 17140 -10706 -16740 10076 20124 -4225
1320 -4225 -18967 1698 20031 3378 -17483 -5729 16249 7322 -16263 -10955 15017 13568 -15187
1333 -15187 -19406 9191 20139 -7543 -23213 1957 21232 -1257 -22997 -1209 23841 3723
1345 3723 -25591 -7127 26285 12675 -22759 -13326 22965 16972 -19534 -16704 20508 21335 -16053
1358 -16053 -21742 13346 22911 -9634 -21776 7188 20539 -6681 -22877 3166 22397 -559
1370 -559 -23382 -6621 18148 7556 -15700 -9986 11503 8708 -11222 -10785 9983 14326 -6711
1383 -6711 -16299 2535 18380 4119 -15524 -5254 16356 9091 -14837 -10047 16767 15601 -14061
1396 -14061 -18718 11787 20789 -8699 -21596 6770 21645 -8228 -26593 4345 28010 -1681
1408 -1681 -31124 -5760 27294 7178 -25177 -8577 22737 7364 -24477 -8944 25976 14279
1420 14279 -22619 -16529 19418 18664 -13396 -14927 13518 16489 -10802 -16156 9486 18455 -3152
1433 -3152 -16573 -1199 12758 2498 -10907 -3241 9514 3151 -12517 -10617 9092 14260 -4819
1446 -4819 -18221 -3419 15257 5013 -13088 -5262 14166 5610 -17276 -8057 21351 15721 -18478
1459 -18478 -19293 16687 22886 -12021 -20351 13791 23508 -13186 -26369 11533 29703 -6694 -29333
1472 -29333 2140 25212 -3029 -24943 2834 25994 -3734 -30775 -4085 28264 9184 -23728
1484 -23728 -12477 15472 8485 -13267 -5138 15358 6524 -15587 -10052 12991 15419 -3938 -11812
1497 -11812 144 9748 3309 -5824 -2015 8329 6355 -8198 -11713 5210 15911 -151 -16963
1510 -16963 -4289 13228 1256 -16292 -779 20687 1500 -28216 -11258 26651 17312 -22154
1522 -22154 -20033 16487 15922 -16521 -13096 22366 17106 -23554 -22440 21849 28768 -13661 -25667
1535 -25667 11242 23864 -9740 -21873 11306 25463 -7640 -25531 1486 21548 884 -16794
1547 -16794 -404 13042 -3757 -16991 -637 17584 6134 -15061 -14351 3855 12601 3874 -6322
1560 -6322 -5649 1482 2813 -3078 105 10809 6940 -12128 -13989 11138 21505 -2591 -19654 1808
1574 1808 19570 -1895 -21008 2990 25648 596 -28736 -6983 24582 7474 -22441 -5696
1586 -5696 21794 1618 -29600 -6950 31839 14648 -28898 -21757 18866 19579 -12414 -12032 13657
1599 13657 8725 -17504 -10756 20551 19270 -12822 -20033 5708 17815 561 -10234 1243 9194
1612 9194 -435 -9797 -3253 8332 8359 -3710 -10478 -3640 6268 2634 -5658 -1457 8294 -1080 -18279
1627 -18279 -7287 21658 17664 -18007 -24687 8731 23251 -3784 -15631 8945 15294 -14623
1639 -14623 -19425 18329 29712 -11591 -31186 5952 29998 -1960 -25122 3927 25328 -3837
1651 -3837 -27557 -118 25793 2869 -22239 -3857 16499 -1652 -20077 547 22573 3014
1663 3014 -23244 -12855 13913 14760 -3104 -8970 -2368 401 157 3808 6545 2416 -3980 -7716
1677 -7716 -2493 9682 13580 -1845 -16514 -3897 16326 7163 -14860 -6623 16802 7473 -20858
1690 -20858 -12586 19624 14786 -18611 -15681 16463 11245 -22426 -14438 27056 20506 -27367 -29773
1703 -29773 19579 31453 -10382 -24428 8760 17796 -13065 -15824 20585 23482 -17952 -28056
1715 -28056 12551 29227 -3168 -22282 1543 17186 -2905 -15073 3291 14006 -1858 -13187
1727 -13187 -1955 7157 -348 -5713 738 4586 -995 -6802 -5512 1727 9515 7627 -8357 -15935
1741 -15935 1059 18131 7159 -12553 -6038 10088 1606 -10978 4634 21327 -1181 -27287
1753 -27287 -4451 29536 12297 -25420 -13219 22473 12208 -23145 -12634 23610 13513 -24001
1765 -24001 -16731 20091 14067 -21562 -14393 21871 15349 -24250 -21680 19058 25027 -10931 -21786
1778 -21786 4794 15202 -3987 -8015 10345 10442 -11283 -13766 9183 18421 172 -14187 -6061
1791 -6061 7552 7357 -809 -4745 -1397 2735 965 -4731 -3965 5052 5027 -6386 -9167 4662 8466
1806 8466 -7321 -11393 9073 15132 -10420 -22252 5950 26278 1616 -23259 -4394 19119
1818 19119 3824 -15494 2373 20440 -2551 -25647 2 29904 8204 -26065 -12721 20851
1830 20851 12990 -16711 -11020 14978 8718 -16432 -10922 13912 10583 -13473 -12164 10438 10941
1843 10941 -10727 -13547 7033 15008 -2119 -14312 -3582 9760 7308 -2941 -4552 1416 2557
1856 2557 -1928 -1744 7106 8017 -4951 -13103 944 17168 6646 -14979 -11064 11195 11000 -9867
1870 -9867 -11575 8704 10262 -11144 -13486 9879 14424 -10804 -16975 8883 17899 -9048 -21058
1883 -21058 6560 23072 -1359 -21697 -2036 19315 4422 -14045 -1043 15046 246 -16192
1895 -16192 -323 19970 6179 -17976 -10790 13931 13314 -8037 -12019 3967 8675 -4055 -8491
1908 -8491 2859 7995 -2829 -10476 -953 9813 2133 -10790 -5955 9455 8382 -8743 -11656
1921 -11656 5907 14406 -1206 -13649 -1192 12737 2936 -10504 -352 13034 1213 -14951
1933 -14951 -2254 18805 7961 -17481 -12389 13857 14059 -10978 -14184 7939 11967 -8910 -13232
1946 -13232 7746 13105 -7941 -16162 4756 16023 -3507 -17067 127 16796 2631 -15127
1958 -15127 -5232 13568 7546 -9238 -6602 8399 6952 -6561 -5602 8741 9493 -6680 -11911 4433
1972 4433 14121 462 -14138 -4847 10965 5967 -9215 -7166 7773 6147 -9094 -8700 8256
1985 8256 10267 -8330 -13032 6104 13887 -4760 -15896 2252 16637 1221 -15985 -2734 15447
1998 15447 5474 -12777 -4678 12963 5978 -12501 -5944 14451 10056 -12854 -12820 10432 14802 -6724
2012 -6724 -14550 3138 12094 -2687 -12346 846 11209 -1234 -12864 -1714 12104 3132 -12331
2025 -12331 -6611 10632 8127 -9008 -9687 7077 11590 -3481 -11114 1979 11405 684 -9780
2038 -9780 252 11825 1339 -11939 -2670 14034 6530 -13206 -9609 10901 11107 -8761 -12294
2051 -12294 5956 10780 -6811 -12471 4996 12379 -5480 -14771 2153 14510 -497 -15268 -1905
2064 -1905 14507 4274 -13179 -5826 12491 9007 -9420 -8028 9025 9488 -6591 -8459 7290
2077 7290 11110 -5538 -12501 3431 14273 174 -13410 -3745 11467 4807 -10128 -6411 8150
2090 8150 5771 -9617 -8326 7777 8926 -7765 -11960 5287 13000 -3273 -13747 1208 14337
2103 14337 1400 -13513 -2938 13970 5598 -11375 -5279 11807 6878 -10760 -6430 12014 9133
2116 9133 -11030 -11666 8628 13110 -5644 -13925 2200 11368 -1938 -11469 562 10150 -880
2129 -880 -12216 -1926 11386 3457 -11304 -6481 9195 7859 -7381 -8607 6526 10757 -3083
2142 -3083 -10371 1984 11261 805 -9180 -446 10336 2403 -10367 -2891 12425 6649 -11830
2155 -11830 -10400 9342 11964 -6516 -13104 3414 10900 -4195 -12112 2562 12530 -3315 -15267
2168 -15267 708 15199 1769 -15026 -3744 14335 5614 -12851 -6362 12840 8917 -10168
2180 -10168 -8389 9192 9672 -6645 -8169 7460 9368 -6584 -10841 5192 12917 -1672 -13372
2193 -13372 -2844 10365 4362 -8515 -5298 5846 3301 -7223 -5276 7092 6851 -7061 -9991
2206 -9991 4157 11068 -969 -10638 -605 11096 3088 -10420 -3762 11317 6930 -9209 -7746
2219 -7746 8508 8957 -6908 -7979 8366 9921 -8712 -12843 6946 15643 -3708 -16794 -1329
2232 -1329 13175 1928 -11937 -2183 10488 128 -13174 -2095 13629 4963 -13528 -8065 11082
2245 11082 9296 -8097 -8772 7489 10021 -5390 -9666 4367 11348 -698 -9202 353 8733 418
2259 418 -8358 -232 10340 2988 -11081 -7334 9233 10334 -5666 -11544 660 8626 -853 -7814
2273 -7814 1499 7671 -2973 -11526 314 13063 3183 -12924 -5695 11310 8333 -9050 -7612
2286 -7612 9453 9868 -7001 -10169 6529 11620 -3550 -10166 3666 10162 -3671 -11443 3960
2299 3960 13919 -1174 -15579 -4495 12891 6920 -9651 -7751 5390 4581 -6507 -4428 7639
2312 7639 5772 -9014 -9752 6306 11981 -2279 -11574 -815 10513 2918 -8909 -2604 10027
2325 10027 5413 -8328 -5671 7847 7671 -5561 -6548 6347 7374 -7398 -10358 5979 13176 -3335
2339 -3335 -15505 -2441 12563 3623 -9967 -4716 7451 1603 -9916 -1997 11851 4855 -12509
2352 -12509 -8602 10565 11054 -6339 -10393 4641 10250 -2673 -8763 3134 10365 -387 -9343
2365 -9343 -455 9173 1633 -7903 -1737 8857 3059 -10653 -6784 8954 9839 -5929 -12377 443
2379 443 8948 518 -7351 -241 5785 -2414 -9281 1041 11902 2599 -12921 -6521 10957 9716
2393 9716 -7425 -8841 6822 9515 -5649 -9049 6170 11201 -3561 -10903 3008 10456 -2025
2406 -2025 -11268 1697 12302 -336 -14714 -4147 12951 6693 -10208 -9009 5704 5950 -5174
2419 -5174 -4723 6313 4319 -8448 -8323 6895 11433 -2940 -11440 -379 10233 3645 -7080 -2826
2433 -2826 6840 3867 -5924 -4209 6444 6183 -4620 -6621 4333 6979 -4321 -8795 3234 10556
2447 10556 -1675 -13098 -2949 11434 5711 -9925 -6913 6179 4521 -6887 -3950 8809 5059
2460 5059 -10561 -8890 9714 12725 -5336 -12657 2863 12288 -178 -9921 1172 10693 65
2473 65 -10201 -773 10619 2191 -9751 -3229 9492 3788 -10047 -6381 8969 8338 -7253 -10967
2487 -10967 2553 9114 -1026 -7278 -49 5192 -1778 -6879 2248 9081 686 -10250 -4213 10106
2501 10106 8193 -5543 -7983 4157 8214 -2081 -6691 2807 7878 -1709 -8494 1289 9392 230
2515 230 -9955 -1548 9916 2282 -10921 -5490 9584 7084 -8856 -9973 4989 8404 -4046
2528 -4046 -7207 3937 6650 -5472 -8742 5496 11835 -2336 -12989 -775 12122 4365 -8711
2541 -8711 -4191 8210 4695 -6646 -4048 7530 5881 -6623 -6297 5478 7681 -4905 -8528 2834
2555 2834 8854 -2097 -10852 -1250 9176 3057 -8422 -5261 5838 4176 -5425 -3893 6099 4584
2569 4584 -6967 -6870 7007 9935 -3654 -10532 1688 11048 1351 -8592 -1381 8401 1730 -8008
2583 -8008 -1801 8719 3284 -8874 -5004 7657 5601 -7616 -7937 6042 7721 -5236 -10164 2390
2597 2390 8674 -895 -9019 -510 7331 24 -7328 39 8591 1581 -9428 -3693 9598 7156
2611 7156 -6712 -7693 4706 8574 -1867 -6658 2221 7301 -1820 -7411 1485 8367 58 -9245
2625 -9245 -1879 8528 3291 -8710 -5293 7270 5953 -7091 -8075 3964 7579 -3154 -7618 2363
2639 2363 7351 -2593 -7861 2486 9717 -750 -10229 -983 10792 4726 -8266 -4730 7212 5585
2653 5585 -5359 -4447 5842 5125 -5325 -6516 4598 7709 -3616 -8576 1155 8368 -860 -9153
2667 -9153 -1946 7856 2694 -7735 -4245 5857 4436 -5585 -4849 5469 5518 -5004 -6363 5650
2681 5650 8859 -2952 -9001 1459 9985 1350 -8312 -1613 7960 2810 -7080 -2661 7472 3547
2695 3547 -7826 -4751 6804 5896 -6519 -7896 4386 7935 -3758 -9148 1663 8251 -465 -8530
2709 -8530 -529 7376 989 -7033 -1442 7487 2438 -7427 -3391 7860 6102 -5370 -6479 4481
2723 4481 7805 -1697 -6703 1162 6607 -467 -6919 433 7232 817 -7947 -2916 7408 3901 -7347
2738 -7347 -6035 5747 6120 -5370 -7684 3482 7543 -2978 -7699 2362 8080 -1380 -7817 1365
2752 1365 9172 308 -9001 -1247 9667 3961 -7836 -4407 7328 5838 -5294 -5310 4810 5431
2766 5431 -4884 -6113 4125 6916 -3197 -8204 1208 7551 -602 -7816 -1646 6498 1922 -6601
2780 -6601 -3615 5794 3640 -4786 -4321 4174 5041 -3158 -5155 3532 6784 -1599 -7198 314 8266
2795 8266 2302 -6977 -3096 6334 4238 -5483 -4152 5686 4597 -5833 -5673 5196 6764 -5068
2809 -5068 -8371 3106 8253 -2308 -9234 672 8601 160 -8841 -1194 8075 1822 -7361 -2060
2823 -2060 7712 3225 -6948 -3556 7584 5756 -5738 -5913 4862 7462 -2655 -6572 2078 6323
2837 6323 -670 -5708 454 6256 -216 -6967 -1727 6114 2439 -6083 -4211 4577 4389 -4078 -5712
2852 -5712 2742 5838 -1648 -6405 471 6327 449 -5678 -752 6853 1922 -6549 -2445 7537 5346
2867 5346 -5714 -5892 5279 7222 -3628 -6366 3232 6484 -3226 -7306 2311 7545 -1872 -8736
2881 -8736 -44 8015 944 -8547 -2420 7144 2698 -6912 -3940 6162 4675 -4932 -4688 4403 5434
2896 5434 -3593 -5055 3826 6444 -2303 -6577 1509 7728 976 -6376 -1721 5815 2727 -4774 -3009
2911 -3009 4310 3015 -4676 -4222 3887 4940 -3760 -6720 1538 6118 -922 -6883 -603 6460 1292
2926 1292 -6716 -2247 6256 3338 -5412 -3276 5689 4201 -4642 -4236 5549 6468 -4007 -6666 3097
2941 3097 7930 -1353 -6984 387 6194 251 -6144 -422 5862 692 -6937 -2594 5904 3287 -5825
2956 -5825 -5036 4061 4905 -3735 -6013 2430 5770 -1374 -5593 781 6164 644 -5479 -564 5956
2971 5956 1499 -5526 -1550 6528 3820 -5047 -4718 4557 5823 -2739 -5656 1768 5036 -2076 -5554
2986 -5554 1718 5738 -1267 -7109 -467 6725 1600 -7046 -3130 5505 2841 -5334 -3826 4861 4187
3001 4187 -4024 -4533 3799 5272 -2443 -5051 2607 5909 -1126 -5772 617 6936 1427 -6081 -2714
3016 -2714 5116 3429 -3710 -3399 3220 2763 -3744 -4178 3473 4535 -3220 -6831 977 6521 53 -6609
3032 -6609 -1227 5578 1799 -5176 -2138 5548 3126 -4964 -3290 5033 4566 -3632 -4220 4359 5460
3047 5460 -3372 -5846 2739 7086 -936 -6934 -495 5617 888 -5294 -1099 4917 494 -6347 -1634
3062 -1634 5805 2783 -6027 -4692 3861 4624 -3225 -4744 1817 4646 -1692 -4726 1113 4940 317
3077 317 -4427 -207 4866 1669 -4180 -1633 5046 3413 -4000 -4331 3291 5536 -1923 -5142 537
3092 537 4886 -469 -4490 264 4631 -876 -6442 -892 6421 2314 -6563 -4158 4698 4011 -4096
3107 -4096 -4175 3569 4370 -3222 -4684 3508 5640 -1873 -5078 2060 5547 -867 -5652 923 6490 873
3123 873 -5880 -2117 5187 3226 -3553 -3199 2654 2573 -3245 -2696 2867 3084 -3676 -5547 1626 5406
3139 5406 -125 -5525 -1364 4288 1706 -3428 -1566 3762 2219 -3492 -2797 3775 4125 -2758 -3795
3154 -3795 2575 4856 -2072 -4919 1590 6197 5 -6150 -1188 5440 2180 -4515 -2394 3804 1475
3169 1475 -4980 -2278 5170 3318 -5551 -5580 3502 5691 -2139 -5629 1129 4778 -847 -4161 1316
3184 1316 4960 23 -4374 -199 5172 1543 -4125 -1723 4658 2775 -3628 -3432 3446 4490 -2049
3199 -2049 -4394 807 3477 -425 -3688 297 3182 -917 -4751 -462 4800 1372 -5399 -3374 4058
3214 4058 4340 -2506 -3817 1888 3781 -1707 -3394 2174 4661 -1232 -4903 934 5507 427 -4973
3229 -4973 -511 5363 1505 -4862 -2842 4494 3449 -3891 -3901 2065 2890 -2692 -3283 2090 3121 -3095
3245 -3095 -5003 1666 5369 -414 -5502 -1450 4505 2065 -3049 -1400 3121 1749 -3022 -1704 3511
3260 3511 3121 -2658 -3336 2351 4390 -1271 -3976 922 4556 39 -4629 -818 4308 1501 -3804
3275 -3804 -2153 2508 1245 -3782 -2005 3680 2476 -4188 -4229 2513 4896 -1370 -4982 37 4294
3290 4294 256 -3696 295 3779 609 -3770 -483 4778 2015 -3844 -2458 3484 3158 -2560 -3614
3305 -3614 2156 3765 -1717 -4171 815 3513 -360 -3817 -474 3250 135 -4268 -1033 4238 1269
3320 1269 -4536 -3107 3334 3970 -2563 -3864 1666 3386 -1066 -3294 1770 4057 -1249 -4004 720
3335 720 5093 756 -4205 -743 4416 1794 -3920 -2217 3405 2324 -3190 -2983 2331 2978 -2162 -3420
3351 -3420 1761 2826 -2225 -3819 1394 4173 -364 -4734 -783 3854 1748 -2509 -1529 2603 1648
3366 1648 -1959 -1470 2946 2746 -2144 -3529 1796 4081 -434 -3551 25 3661 484 -3618 -1370
3381 -1370 3270 1347 -3696 -2350 2629 1987 -2763 -2342 2408 2767 -3020 -3568 2143 4315 -1189 -4625
3397 -4625 221 4116 384 -3217 256 3587 844 -3329 -574 4147 1907 -3714 -2081 3621 3151
3412 3151 -2439 -3272 1957 2814 -1554 -3223 775 3084 -1047 -3421 27 2873 -462 -2925 -908
3427 -908 3094 1101 -3224 -1865 2745 2757 -1950 -2713 1149 3052 -580 -2492 909 3135 -528 -3215
3443 -3215 247 3769 1005 -3335 -1320 3800 1546 -3022 -2627 2354 2289 -2453 -3007 1588 2954 -1805
3459 -1805 -3310 739 2748 -1360 -3888 417 3739 -69 -3765 -870 3254 1780 -2873 -1675 3097
3474 3097 2517 -1887 -1866 2636 2648 -2067 -2738 1922 3256 -590 -3457 538 3160 26 -3130 -813
3490 -813 2839 537 -3105 -1675 1996 1563 -2462 -2429 1757 2234 -1649 -2602 1235 2945 -540 -3117
3506 -3117 224 3320 899 -2632 -668 3138 1397 -2449 -787 3411 1934 -2667 -1781 3021 2543
3521 2543 -1973 -3131 1409 2846 -1095 -2942 461 2681 -626 -3241 -644 2526 225 -3408 -1198
3536 -1198 2777 1067 -3019 -1659 2587 2159 -2023 -2224 1870 3072 -1211 -1890 1283 2989 -268 -2518
3552 -2518 347 2897 379 -2995 -1022 2975 1079 -2561 -2009 1765 1600 -2050 -2301 1182 2284 -1639
3568 -1639 -2799 603 2670 -300 -2821 -114 2849 328 -2983 -588 2981 974 -2292 -1651 2023
3583 2023 2143 -1588 -1599 1837 1959 -1334 -2496 1434 2768 -715 -2958 102 2780 -29 -2853 -330
3599 -330 2371 770 -2767 -1411 2057 1524 -2426 -1866 1637 1952 -1564 -2020 1413 2659 -782 -2525
3615 -2525 873 2928 371 -2131 -636 2710 1154 -1952 -640 2662 1182 -2415 -1171 1870 2013
3630 2013 -1673 -2423 952 2555 -466 -2559 173 2433 -751 -2450 -749 2345 600 -2470 -1250
3645 -1250 2132 901 -2220 -1291 1926 1789 -1776 -2060 1068 2599 -552 -2082 730 2142 -83 -1840
3661 -1840 75 2705 -76 -2680 -816 2549 1330 -2189 -1477 1372 1616 -2102 -1989 1270 2085 -1166
3677 -1166 -2355 577 2181 -346 -2389 -113 2346 -172 -2792 -292 2883 1133 -2170 -1074 2142
3692 2142 1958 -1202 -1394 1574 1938 -1622 -1916 1385 2314 -1285 -2840 196 2581 -121 -2225 -821
3708 -821 1787 655 -2265 -1153 1661 1146 -1914 -1808 1099 1382 -1123 -1746 990 1843 -465 -2099
3724 -2099 608 2888 553 -2188 -490 2215 1365 -1411 -922 1769 1138 -2297 -1776 1994 1950 -1970
3740 -1970 -2866 890 2270 -592 -2206 372 1917 -457 -2447 -192 2091 175 -2152 -776 2107
3755 2107 542 -2208 -717 2344 1464 -1730 -1673 1506 2063 -471 -1501 379 1660 -238 -1451 372
3771 372 1901 -263 -1988 -466 2025 918 -1905 -1597 916 1377 -1105 -1987 360 1431 -881 -2041
3787 -2041 97 2063 149 -1893 -17 1839 364 -2190 -492 2443 1296 -2342 -1534 1849 1940 -807
3803 -807 -1351 1640 1547 -1025 -1684 1232 2083 -1066 -2585 564 2290 207 -2325 -922 1913 496
3819 496 -2168 -663 1753 623 -1800 -773 1178 997 -910 -1154 1066 1611 -896 -1335 793 2089
3835 2089 316 -1808 -468 1878 732 -851 -361 1096 1015 -1373 -641 1649 1282 -1751 -2245 250
3851 250 2034 -422 -2170 -418 1742 -386 -2259 -288 2201 431 -2236 -1047 1977 938 -1671
3866 -1671 -825 1693 1687 -1822 -1687 1645 2482 -894 -1771 331 1593 153 -1371 563 1569 -365 -2130
3883 -2130 -58 2062 840 -2263 -1253 1276 1129 -1093 -1100 708 1006 -1178 -1435 577 1428 -392 -1599
3900 -1599 138 1679 329 -1747 -260 2218 1040 -1865 -723 1919 1880 -889 -1302 875 828 -891
3916 -891 -1426 1245 1576 -927 -1905 527 2260 -39 -2601 -686 1527 207 -1502 -665 1403 335
3932 335 -1611 -981 1452 1103 -1161 -1307 1064 1611 -570 -1255 1013 1712 -405 -1654 -186 1655 1136
3949 1136 -827 -449 1036 364 -960 -785 1237 766 -1323 -1592 806 1774 -444 -1919 -237 1446
3965 1446 -252 -1672 -106 1514 584 -1984 -575 1728 988 -1534 -899 1596 1375 -1578 -1343 1798
3981 1798 1991 -819 -1736 681 1828 126 -1301 151 1325 -597 -1784 -25 1875 75 -2180
3996 -2180 -986 1312 874 -1230 -1101 538 805 -944 -1398 615 1232 -396 -1193 508 1567 -37
4012 -37 -1159 113 1548 513 -1419 -571 2015 1571 -744 -1242 499 1251 -160 -1210 282 1153 -978
4029 -978 -1860 401 1734 -239 -1952 -862 1784 336 -1943 -935 1415 624 -1656 -600 1180 1335
4045 1335 -1289 -1056 1104 1083 -480 -959 846 1925 -329 -2054 160 2046 637 -1103 -271 861
4061 861 394 -1055 -304 897 263 -1194 -1118 842 1121 -929 -1688 18 1261 -61 -1263 -235 1164
4078 1164 -304 -1156 -190 1424 720 -1326 -153 1301 955 -919 -913 1293 1702 -853 -1611 323 1807
4095 1807 214 -1621 -39 1249 -104 -1366 309 1642 21 -2432 -771 1462 703 -1549 -1327
4110 -1327 562 1087 -791 -1068 1041 894 -392 -834 477 1365 -264 -998 364 1631 266 -1263
4126 -1263 -231 1635 1048 -981 -1066 882 986 -708 -1163 277 885 -578 -1280 312 1385 -562 -2082
4143 -2082 -199 1667 58 -1749 -1052 1165 701 -1354 -546 1581 783 -1170 -868 976 1311 -1004
4159 -1004 -970 1190 1605 -515 -1293 313 1860 313 -1505 -406 1009 496 -858 -341 951 306 -1203
4176 -1203 -429 849 705 -1341 -1371 146 1413 -351 -1410 -24 1097 164 -922 27 923 471 -953
4193 -953 -115 1463 905 -716 -677 1079 1476 -632 -1562 536 1486 -366 -1397 -99 959 -108 -1154
4210 -1154 238 955 -15 -1487 -347 1566 671 -1552 -1273 1210 1258 -870 -1153 473 1248 -444 -956
4227 -956 969 1372 -246 -1214 642 1166 210 -1347 43 1370 604 -1263 -744 1066 722 -708 -760
4244 -760 400 599 -984 -837 708 938 -529 -1320 336 1315 -272 -1342 -470 1383 721 -719 -537
4261 -537 829 738 -878 -839 956 1367 -554 -1096 1002 1508 -395 -1673 177 1765 90 -1324 -278
4278 -278 1113 241 -756 -360 745 216 -1195 -878 1005 1225 -1231 -1809 874 1293 -523 -1377 226
4295 226 1104 -116 -1147 -92 1048 11 -1112 -445 1526 529 -1100 -434 1431 1161 -1119 -857 909
4312 909 1121 -89 -1174 348 538 -182 -1317 -149 937 -358 -1381 -489 1247 351 -1606 -1169 1071
4329 1071 1389 -663 -834 623 1148 -324 -671 389 1322 -249 -1141 229 1663 407 -1316 -297
4345 -297 1341 495 -1183 -643 788 867 -1181 -830 572 755 -588 -1008 601 952 -778 -1110 61
4362 61 1676 207 -1427 -698 1363 650 -917 -466 1117 667 -1090 -301 1309 1228 -591 -982 938
4379 938 1513 -244 -1340 290 1411 104 -1606 -240 1141 266 -1058 -150 1153 224 -1302 -602
4395 -602 1355 670 -1229 -1135 989 1367 -615 -1109 306 816 11 -1249 259 956 50 -793 4 1404
4413 1404 552 -1236 -704 1439 783 -969 -653 691 1077 -711 -940 130 648 -120 -1145 -143 811
4430 811 -204 -1435 -471 1243 384 -1403 -1067 726 1031 -974 -1000 958 1118 -364 -791 1034 1349
4447 1349 -481 -1207 422 1603 301 -1213 -158 1405 474 -1126 -503 1075 701 -1194 -983 727
4463 727 603 -900 -1178 629 609 -606 -1275 208 1396 -143 -1276 -169 791 312 -886 -565 1060
4480 1060 576 -712 -424 1270 918 -607 -848 734 1474 -109 -1173 10 1054 314 -1518 -255
4496 -255 1161 92 -1557 -584 1049 168 -1107 -783 1077 647 -1050 -1401 1069 1155 -524 -1757 -47
4513 -47 1481 -82 -937 173 1502 100 -1077 217 1865 424 -1142 -686 1088 895 -896 -1118
4529 -1118 422 714 -753 -1114 133 881 -384 -1118 147 855 -389 -1410 -56 980 428 -1201
4545 -1201 -709 1049 990 -808 -799 307 1112 -73 -744 834 1107 -428 -1345 406 1708 -16 -1442
4562 -1442 -582 1297 676 -1299 -523 768 692 -903 -1023 796 599 -907 -1227 454 922 -382 -1306
4579 -1306 232 1565 -239 -1549 -73 1762 569 -764 -552 821 712 -817 1 1309 1037 -861
4595 -861 -932 885 1348 -329 -1234 231 1144 -134 -991 -283 846 71 -1558 -493 1147 200 -1041
4612 -1041 -750 1038 922 -698 -845 808 1092 -64 -1279 279 1167 158 -808 -86 1017 35 -954
4629 -954 209 1408 466 -1272 -621 1088 1190 -796 -1291 521 1190 -304 -1042 326 729 -574 -1383
4646 -1383 90 1332 -114 -1206 -248 1342 684 -1556 -597 1042 883 -918 -702 944 908 -302 -669
4663 -669 414 626 -424 -1258 666 1629 -152 -1753 -459 1319 771 -838 -760 510 507 -482 -812 848
4681 848 259 -981 -1108 415 1039 -651 -920 772 1353 18 -1140 -111 1284 782 -748 -364 801
4698 801 383 -496 -172 1076 548 -597 -696 916 1269 -536 -1579 -156 728 332 -946 -404 676 100
4716 100 -911 -118 1006 61 -1201 -730 919 613 -968 -1194 423 815 -239 -1007 218 1348 258
4733 258 -822 263 1006 191 -727 323 1525 111 -1164 -473 1322 1356 -736 -1481 306 884 -447
4750 -447 -908 150 468 -741 -845 59 827 -37 -1556 -483 1254 224 -1048 -617 986 826 -624
4767 -624 -574 480 804 -398 -457 710 711 -315 -1287 399 1195 61 -1358 -527 1141 733 -739 -830 398
4786 398 488 -336 -821 142 757 -917 -1196 568 1283 -378 -1383 -159 971 466 -1114 -217 1242 713
4804 713 -866 -588 1082 475 -572 -406 1040 455 -747 -816 1052 1398 -507 -1010 -50 1054 193 -1218
4822 -1218 -409 587 -196 -1052 22 774 -11 -1307 -608 1065 832 -637 -1126 785 957 -345 -834 281
4840 281 967 -53 -517 151 940 253 -493 172 1483 328 -1098 -437 956 1308 -823 -1455 190 1176
4858 1176 -250 -908 11 269 -771 -1036 201 1370 -304 -1549 -316 1208 823 -1201 -603 910
4874 910 759 -622 -982 657 1177 -285 -652 677 874 -314 -894 560 1360 -357 -1435 -347 1025
4891 1025 554 -882 -802 283 775 -696 -576 452 88 -1034 -909 894 1197 -464 -1180 232 1396
4908 1396 355 -1285 -528 926 440 -769 -195 696 420 -517 -268 855 607 -1111 -867 912 1152
4925 1152 -591 -1076 -52 970 227 -982 -402 526 -143 -867 -31 894 -184 -1113 -500 848 627 -721
4943 -721 -1089 475 964 161 -720 293 934 121 -631 -124 819 323 -1074 -111 1027 332 -1103 -751
4961 -751 1000 651 -698 -1293 485 1054 -436 -962 -38 593 -368 -1212 260 1164 -126 -1470 -261
4978 -261 1573 651 -886 -906 739 757 -301 -704 460 1031 -728 -498 904 812 -275 -1179 362 1254
4996 1254 267 -1151 -157 818 191 -1047 -719 575 278 -643 -541 597 499 -744 -600 538 1115 -132
5014 -132 -1486 -174 1210 603 -1053 -336 1041 574 -522 -120 1100 574 -693 -880 690 943 -746
5031 -746 -997 587 1089 -236 -1266 -10 966 -133 -963 -3 567 -223 -770 -62 763 -44 -1026 -175
5049 -175 1000 749 -689 -787 413 1228 -15 -1171 274 982 31 -600 243 987 111 -765 -30 942
5067 942 388 -719 -492 700 739 -812 -736 492 747 -415 -852 -140 689 -173 -1094 -147 969 -104
5085 -104 -956 -214 1347 783 -686 -618 739 1081 -268 -770 513 561 -402 -720 263 1068 -168 -872 147
5104 147 1013 -237 -1165 -103 1076 395 -815 -725 632 605 -656 -646 501 371 -402 -535 403 764 -503
5123 -503 -921 40 1102 556 -755 -74 824 166 -545 -274 784 657 -575 -462 452 782 -428 -778
5141 -778 236 898 -370 -1064 -108 914 -13 -980 -395 650 251 -1064 -288 771 272 -570 -522 849
5159 849 755 -623 -697 567 1163 -201 -558 75 996 -205 -895 96 728 127 -928 -499 870 73 -995
5178 -995 -567 785 447 -516 -664 266 745 -235 -1044 -226 497 -235 -983 397 842 120 -743 -329 1047
5197 1047 630 -799 -714 552 821 -464 -671 427 751 -159 -639 648 997 -243 -819 245 847 201
5215 201 -1002 -194 1040 324 -707 -637 625 412 -624 -733 601 595 -633 -481 72 831 -317 -1295
5233 -1295 -48 1035 168 -850 -285 784 555 -488 -449 548 519 -691 -599 524 713 -746 -785 235
5251 235 804 -262 -1033 -106 868 158 -877 -144 923 207 -733 -505 525 361 -741 -280 708 791 -823
5270 -823 -872 466 662 229 -628 -17 641 -111 -814 150 980 205 -910 -198 681 204 -702 -345 385 317
5290 317 -315 -627 476 571 -554 -825 247 926 -108 -767 -285 696 270 -477 -209 775 642 -411 -511
5309 -511 497 672 -585 -275 417 690 -241 -1021 -62 912 -163 -982 -1 779 287 -842 -322 848
5327 848 381 -922 -730 489 666 -758 -507 556 630 -255 -513 554 820 -48 -848 346 1002 491
5345 491 -641 -329 311 555 -175 -38 314 491 -325 -622 518 630 -550 -1140 317 652 -61 -520 -84
5364 -84 435 -82 -978 -224 693 242 -785 -520 690 357 -441 -335 673 720 -164 -746 512 899 145
5383 145 -412 143 1057 15 -680 -160 1173 115 -625 -286 771 420 -786 -454 457 399 -325 -769 384
5402 384 673 -372 -879 -96 958 -15 -767 48 800 -78 -610 -395 1030 444 -449 -416 427 910 -65
5421 -65 -444 148 778 -37 -449 352 783 -48 -842 153 666 -2 -974 -509 771 391 -370 -427 706 528
5441 528 -524 -684 656 646 -457 -321 409 575 146 -826 276 934 84 -670 -257 574 336 -302 11
5460 11 489 535 -576 -474 493 425 -513 -848 188 706 -324 -759 -30 213 -276 -405 -307 311 265 -402 -498
5481 -498 555 430 -269 -371 307 945 -178 -745 464 753 94 -783 -30 543 17 -502 120 643 113
5500 113 -927 -205 900 465 -651 -511 359 530 -532 -989 67 718 -463 -455 224 847 -19 -723 -11
5519 -11 687 161 -451 -248 830 312 -455 -182 512 833 -167 -344 202 193 -164 -501 302 461 -237 -757
5539 -757 -114 894 205 -710 -203 299 165 -620 -483 662 534 -378 -858 433 697 -78 -704 146 916
5558 916 80 -678 161 976 -120 -775 216 852 223 -547 -161 417 -88 -655 -330 419 712 -939 -729
5577 -729 220 663 -438 -766 21 456 -10 -625 98 465 234 -534 -208 593 137 -99 -369 632 575 -222
5597 -222 -499 54 812 -62 -730 -170 597 406 -520 -265 827 203 -728 -400 169 425 -446 -451 369 391 -140
5618 -140 -595 117 501 -127 -560 399 709 -282 -523 -251 543 82 -636 -58 367 348 -424 -203 882 633
5638 633 -410 -270 414 768 -288 -368 208 406 -209 -391 205 719 -19 -594 -389 474 250 -435 -442 319
5658 319 68 -805 -338 374 512 -335 -421 300 745 218 -291 23 684 229 -535 -18 529 232 -721 -432
5678 -432 387 501 -653 -357 302 438 -362 -583 320 741 -317 -614 8 347 -208 -570 214 660 64
5697 64 -677 197 622 241 -154 -145 696 446 -111 -327 622 523 -99 -615 192 383 43 -363 -265 206 312 -425
5719 -425 136 295 135 -710 -650 59 403 -126 -325 142 291 -271 -802 127 607 98 -560 218 617 136
5739 136 -265 -84 507 380 -439 -472 341 176 -461 -395 530 533 -193 -417 126 580 -267 -726 -34 684 -21
5760 -21 -816 -244 326 187 -662 -283 391 218 -254 -440 229 277 -303 -687 43 537 61 -646 -115 530 261
5781 261 -323 -21 358 209 -196 -134 499 533 -255 -417 52 354 -33 -591 137 518 -272 -286 -197 232 -59
5802 -59 -629 -339 539 390 -317 175 600 360 -217 -277 536 316 -306 -458 485 374 -228 -462 136 618 82
5823 82 -574 124 298 -48 -338 -358 -9 -17 -433 -691 179 320 -213 -379 1 340 181 -361 -4 415 48
5844 48 -1009 -82 509 152 -200 -86 418 274 -261 11 150 152 -198 -445 364 485 -171 -486 129 579 -411
5865 -411 -643 54 215 -178 -579 -247 258 -25 -462 -252 480 456 -280 -508 28 247 -437 -237 -86 770
5885 770 160 -363 -12 633 272 -486 -191 485 0 -349 -224 393 119 -465 -337 44 181 -268 -315 132
5905 132 155 -139 -382 -183 342 173 -287 -8 458 126 -588 -326 459 690 -464 -413 140 806 -304 -56
5925 -56 462 99 -39 -363 489 464 -202 -312 -132 411 47 -545 -133 32 322 -335 -218 143 -107 -258 -369
5946 -369 -3 316 8 -262 -33 337 28 -385 30 356 187 -289 40 237 374 -142 -187 397 132 -330
5966 -330 -238 576 555 -543 -354 230 256 -117 -267 16 321 -31 -505 1 330 -53 -248 -280 456 526 -225
5987 -225 -221 145 448 -449 -510 150 497 -48 51 38 503 20 -246 29 530 -151 -319 -60 378 124 -236 -393
6009 -393 309 465 -450 -324 -83 558 -459 -365 185 375 83 -377 -261 270 5 -121 -78 532 297 -271
6029 -271 -43 333 461 -47 -142 19 224 -269 -432 210 549 -185 -558 140 317 151 -363 -398 214 82 -290
6050 -290 -446 258 -7 -123 -317 112 508 -151 -249 197 -48 -128 -285 24 556 97 -306 -277 457 175 -192
6071 -192 -96 255 158 -120 -387 390 601 -262 -240 176 230 -37 -310 86 295 3 -806 -80 245 193 -403 -19
6093 -19 398 304 -174 -307 176 468 48 -209 11 438 -136 -594 -75 421 -87 -465 -103 317 13 -355 -190
6114 -190 206 119 -254 -218 478 304 -374 -297 -133 116 24 -274 131 284 104 -334 -150 519 282 -32 -433
6135 -433 262 151 -295 -706 112 536 -337 -261 116 573 193 -299 2 214 -265 -70 -219 350 360 -368 -406
6156 -406 424 230 -434 -235 298 212 -55 -68 452 444 -374 -416 101 654 80 -353 -234 283 30 -44 173 331
6178 331 68 -293 -66 19 137 -219 -76 111 284 -273 -492 -217 321 -142 -124 -206 202 162 -262 -16 366
6199 366 152 -182 -244 -29 417 -145 -503 294 156 -144 -54 240 560 172 -439 43 552 39 -280 -39 308
6220 308 100 -494 -293 194 -154 -177 -176 168 51 -371 -498 219 161 -118 46 85 362 32 -290 -84 389 3
6242 3 -329 -308 251 -59 -452 -153 126 370 68 -207 195 290 -105 -388 -172 411 -172 -276 -30 155 58 -564
6264 -564 -392 326 266 -159 10 -1 167 -16 -32 400 245 -116 -154 32 620 50 -536 152 383 55 -435
6285 -435 208 396 -29 -245 -290 447 160 -235 -348 290 163 -263 -369 -11 375 -334 -4 153 171 -25 -448
6306 -448 1 168 293 -386 -72 465 540 -458 -142 282 626 112 -8 113 224 -247 -226 24 289 -430 -515
6327 -515 37 496 -44 -520 -127 140 59 -374 -386 181 277 -525 -50 377 92 -338 336 230 107 -142 -286
6348 -286 -51 364 212 -236 283 224 121 -221 -255 388 228 -328 250 258 37 -45 -311 352 341 -258 -568 -45
6370 -45 16 -273 -498 35 373 270 -408 2 317 102 -105 -246 463 183 -165 -256 244 419 68 -110 137
6391 137 515 239 -334 -3 508 7 -151 -311 327 103 -328 81 193 -106 -203 -478 9 98 -346 -315 261
6412 261 219 -61 -281 132 306 112 -451 -479 499 -74 -381 -266 456 558 -33 -284 212 286 -337 -35 71
6433 71 417 99 -664 -36 99 219 -250 30 474 -183 -325 -432 -109 134 -216 -351 124 496 -281 -311 -160
6454 -160 153 -27 -54 29 158 -18 -29 95 582 39 -373 -54 269 115 -380 -218 136 205 -309 -325 25 205
6476 205 -338 -408 -168 214 -10 -216 -287 241 -32 -35 -280 226 308 -89 -75 355 429 -62 -34 287 709 -165 -277
6499 -277 273 387 -25 -64 84 514 -31 -384 -279 186 146 -508 -377 336 -46 -311 -242 335 364 -273 -302 74
6521 74 187 76 -389 -5 253 -53 -291 126 468 318 -135 -130 750 407 49 -355 189 32 -197 -215 189
6542 189 201 -324 -379 -108 154 -39 -331 -59 309 60 -188 -378 256 238 -217 -231 -107 80 -264 -117 270
6563 270 409 54 -354 331 488 42 -347 -58 313 103 -273 -257 525 -181 -145 -148 512 -113 -477 -153 271
6584 271 388 -337 -355 88 236 152 -409 -100 252 -147 -322 222 213 95 -93 -351 90 336 15 31 212 366
6606 366 -231 -285 197 228 106 -360 4 409 103 -196 220 93 -137 -541 -94 -18 84 -279 -426 126 62
6627 62 -119 -426 433 -73 36 -192 200 244 -291 -213 -25 618 -359 -379 345 435 96 -412 -359 108 43 -328
6649 -328 -218 -27 125 -20 -279 -49 214 -138 -230 -175 -102 -38 -344 -345 275 139 -653 -432 386 324 -376 -118
6671 -118 184 336 -107 -227 125 580 -75 -411 162 208 121 -207 -231 575 178 -441 53 108 143 -220 -362 63
6693 63 163 -256 -236 -108 868 -211 -515 13 302 -47 -348 78 471 -8 -245 -263 585 138 -355 -219 147
6714 147 375 -189 -387 45 221 113 -589 321 394 23 -203 -159 398 -18 -94 -382 603 -4 -297 -417 227
6735 227 472 -358 -376 465 139 -48 -222 -140 621 30 -205 -150 304 217 -147 -312 414 -219 -136 -230 46 87
6757 87 28 -116 273 157 -140 -41 157 455 -78 -507 302 305 -64 -372 -241 157 303 -438 -48 239 577 -63
6779 -63 -89 115 502 45 -356 -46 53 -329 -486 245 301 -32 -390 -82 305 64 -275 253 61 -104 -412
6800 -412 -597 146 168 -373 -469 -44 296 -134 -144 -48 580 -55 -392 -57 406 -54 -217 -177 388 73 -129 -340
6822 -340 344 136 -341 -244 499 406 -117 -527 18 197 -164 -368 -10 414 -82 -702 -451 220 172 -185 -220
6843 -220 366 171 -56 -352 66 388 9 -623 42 433 28 -141 -46 273 -69 -406 60 532 140 -377
6863 -377 -78 291 58 34 -100 228 355 -396 -87 43 322 -342 -594 -98 340 -113 -496 -229 401 165
6883 165 -134 -214 174 375 119 -202 357 387 -109 -121 453 457 317 -24 174 327 51 -166 -383 252 214 -103
6905 -103 -506 169 186 -325 -164 306 397 -93 -492 340 337 -31 -344 -101 444 203 -471 111 447 9 -176
6926 -176 -356 518 118 -334 -212 448 362 57 -376 195 331 -330 -234 243 209 12 -241 326 94 124 -329
6947 -329 -304 240 412 -161 -38 107 370 220 -470 125 219 -387 -64 263 344 88 -376 -73 295 504 -173
6968 -173 -74 431 221 -471 -234 243 540 -549 -495 180 318 -311 -291 -57 402 -160 -248 -129 413 126 -16
6989 -16 36 447 451 -85 -230 332 405 -343 -184 238 136 -34 177 188 264 119 -350 79 331 109 -420 -330 121
7012 121 222 -400 63 196 99 -170 -456 76 236 -224 -423 -142 474 -34 -152 -90 180 -4 -192 -15 191
7033 191 -8 -287 -127 589 129 -67 15 225 422 -403 -35 78 472 125 -443 -12 158 -50 -421 -51
7053 -51 301 -90 -523 -486 225 358 -688 -113 182 443 -39 -177 187 143 -11 -122 91 424 23 -318 76
7074 76 360 -65 -252 -212 658 -16 -243 -232 382 118 -189 -410 10 28 -108 -503 54 303 -257 -600 165
7095 165 566 112 -345 -306 607 284 -173 45 299 54 -362 -195 344 505 -271 -453 -235 626 -2 -414
7115 -414 -77 400 57 -219 -133 305 -48 -266 -57 32 -211 -248 -224 107 379 -382 -389 168 478 -133 -429 -208
7137 -208 358 155 -110 10 661 106 -134 -342 247 415 -379 -180 108 202 -189 -333 329 66 -50 -250
7157 -250 -63 178 -251 -359 -188 338 357 -211 -292 -226 294 -237 -58 342 533 -250 -76 440 210 160 -60
7178 -60 136 230 75 -28 54 235 -64 -616 -251 323 388 -151 -351 417 228 -193 -158 64 142 -339 -536 -240
7200 -240 350 -46 -309 73 366 173 -495 -43 385 332 71 -167 120 564 -177 -161 -25 175 -103 -441 283
7221 283 398 -14 -367 50 367 331 -147 -12 181 188 -688 -230 268 108 -218 -400 300 275 -163 -403 -47
7242 -47 461 397 -394 -132 183 -116 -238 -243 360 -96 -168 -298 294 195 -298 -516 408 569 -5 -187 41 610
7264 610 150 -225 -325 491 -99 -256 159 175 -92 -680 30 229 242 -248 -370 124 663 -75 -329 -11 337
7285 337 -57 -108 238 668 -58 -236 188 476 -144 -544 -26 419 -50 -334 -86 -68 450 -254 -182 -274 214
7306 214 22 -283 325 267 -278 -319 -256 365 138 -383 -219 194 174 -99 -427 545 106 -41 -234 375 514
7327 514 43 68 98 450 56 -397 -144 321 180 -402 89 354 -287 -396 -497 42 309 19 -304 306 316
7348 316 259 -267 240 690 43 -307 15 198 407 -386 -140 184 252 -107 -27 15 198 -140 -405 -92 618
7369 618 44 -190 335 453 -331 -371 -37 327 -48 -130 -26 25 199 -216 -271 297 417 -285 -238 293 427 -262
7391 -262 -199 214 269 33 -318 258 579 -101 -829 -84 655 -25 -539 -487 264 408 -134 -56 156 348 -435
7412 -435 -124 287 431 -146 -640 -80 456 49 -189 -123 412 395 -333 -16 616 328 -247 -135 207 332 2
7433 2 -252 154 371 -220 -311 180 514 -26 -658 -24 461 301 -315 -370 152 288 -331 -398 152 418 -327 -182
7455 -182 63 181 363 -370 125 412 76 -467 -352 358 -104 -78 -125 305 -95 -122 -213 512 522 -245 -304 51
7477 51 226 -219 -425 96 338 -190 -370 -48 259 55 -426 -224 257 204 -225 -137 148 301 -184 -106 189
7498 189 396 -36 -665 5 336 -259 -427 195 601 286 -276 80 170 10 -302 -156 306 343 -371 -362 45
7519 45 85 -524 -209 62 -37 -50 -358 -164 354 -137 -266 -462 336 37 -330 54 58 32 -307 -293 63 177 -160
7542 -160 -203 374 481 3 -479 -38 327 -116 -457 -44 336 259 -320 -601 366 284 -175 -267 96 298 -180
7563 -180 -197 61 475 -69 -284 170 490 155 -172 -84 222 -50 -347 90 320 515 -399 -297 217 266 -299
7584 -299 -214 173 403 -132 -333 -29 90 166 -441 -19 200 -290 -271 -298 274 82 -545 -427 46 490 -139
7605 -139 -378 -49 383 -52 -354 218 539 139 -81 -99 165 129 -175 14 711 70 -414 -308 244 326 -168
7626 -168 -377 202 621 -60 50 -43 106 -107 -153 66 227 179 -249 -122 253 14 -353 -184 170 51 -9
7647 -9 -113 232 249 -119 -396 258 357 -186 -623 39 236 12 -247 -159 115 26 -362 -307 -72 -34 -224 -435 111
7670 111 228 -204 -251 121 285 15 -443 299 221 133 -343 119 219 146 -177 -274 41 123 -437 -44 89 380
7692 380 74 -472 48 380 -38 -509 194 91 31 -219 -121 265 -48 -220 -175 397 266 -359 -258 367 279
7713 279 -214 -213 122 325 147 -433 -98 18 296 -122 -471 602 82 -145 28 527 265 -388 -233 265
7733 265 598 -257 -327 -29 -17 133 -95 16 282 -71 -191 221 440 155 -551 -223 143 288 -197 -43 207
7754 207 181 -16 10 407 294 -69 -335 231 198 -418 -284 11 130 115 -439 63 253 92 -427 -155 126
7775 126 113 -263 -245 12 347 -380 -699 -36 358 139 -487 -3 360 -59 -377 71 496 163 -315 -232 230
7796 230 30 20 73 238 -10 -431 -575 397 151 8 -275 -191 656 276 -452 -62 98 61 -286 -325 587 307
7818 307 15 -40 184 133 -322 -170 446 237 -78 -32 357 265 142 -380 -123 397 83 -509 -162 94 25 -95
7840 -95 -277 225 97 -208 -227 44 62 55 -526 189 327 -70 -554 -257 106 411 -224 -186 402 299 -177 -156
7862 -156 339 226 44 -268 115 234 -402 -337 45 527 -60 -356 62 232 37 -236 -153 313 133 -308 -389
7883 -389 176 157 -109 -355 69 174 -211 21 156 58 103 -149 -18 434 -55 -88 -130 507 -9 -185 -68 287
7905 287 191 -124 -190 -41 177 -159 -236 96 414 -71 -475 65 384 153 -467 36 272 232 -144 -359 505
7926 505 208 -273 -312 548 222 -84 -149 145 325 238 -423 -21 296 -53 -277 -319 240 219 -616 -194 272 112
7948 112 -99 -24 -232 41 -99 -263 -68 200 -51 -248 176 147 -154 -193 166 490 373 124 -252 99 433
7969 433 69 36 366 384 46 -426 29 462 1 -310 -44 215 74 -536 -103 384 195 -380 -434 220 283
7990 283 -251 -594 51 210 -438 -93 286 -68 -64 -12 32 174 -186 -168 12 185 300 218 44 289 240 -11
8012 -11 -108 132 -97 -91 186 102 237 -42 -715 -340 183 4 -378 17 -23 111 -48 -23 173 359 -293 -12
8034 -12 252 312 -469 -201 196 126 12 6 -227 233 -55 -399 -69 223 -6 -128 -97 -97 119 -435 -334 261 180
8057 180 -40 -259 -3 -101 -63 -91 -95 275 -107 -190 7 -30 60 -241 21 107 235 -119 -135 59 225 107 -79
8080 -79 -22 311 33 -128 94 116 179 -165 25 48 -222 -502 -91 151 70 -4 -250 158 -184 -34 -154 309
8102 309 166 163 -112 -185 301 -207 -177 -97 498 -22 -485 -132 333 307 -192 15 213 96 -45 -83 42 297
8124 297 169 -195 59 225 73 -364 31 372 78 -148 -102 90 215 -156 -360 27 257 -116 -59 144 107
8145 107 -215 -112 104 313 -75 0 -161 -81 23 -225 200 294 195 30 0 87 207 -127 24 322 288 -48
8167 -48 -357 48 210 87 -103 157 381 1 -90 223 440 325 -145 1 97 73 -317 -5 162 211 -109 -66
8189 -66 313 201
8191B01
$$ Imaginary data points
##PAGE= N=2
##DATA TABLE= (X++(I..I)), XYDATA
0 0 0 0 0 8 -8 0 -8 16 -16 16 -24 32 -40 47 -51 70 -82 90 -109 134 -154 173 -203 235 -269 304 -345 391 -446
29 -446 501 -559 631 -710 786 -876 980 -1085 1201 -1336 1475 -1635 1813 -2001 2216 -2464
45 -2464 2734 -3038 3398 -3813 4291 -4869 5575 -6458 7597 -9127 11296 -14616 20260 -31662
59 -31662 63627 -333519 -1099913 -272 851432 228814 -446196 -78675 129119 -277204
69 -277204 -163101 561688 385543 -596376 -627625 425091 692037 -190420 -598530 24372
79 24372 392867 36449 -150420 55140 -42619 -261389 97186 522159 63072 -632291
89 -632291 -329356 497445 495970 -163213 -364224 -99048 -17960 62633 382777 261112 -477420
100 -477420 -636351 245551 760777 64680 -594270 -214032 282824 80679 -92351 190749
110 190749 110371 -426819 -288336 509291 493822 -440427 -624595 290007 651620 -104934
120 -104934 -532465 -3994 322062 -24436 -99730 241325 46930 -502922 -213966 624006
130 624006 504508 -472462 -674362 141212 555128 108220 -226438 -97947 -87750 -161608
140 -161608 152824 427732 9109 -516294 -241721 373365 337911 -144892 -254450 -24070
150 -24070 59711 62100 142392 24108 -265253 -163475 296903 318698 -201910 -386907 48277
161 48277 326650 82516 -125492 -49417 -77098 -158396 125248 419481 39526 -545814 -312162
172 -312162 427553 465867 -181770 -400858 -9719 160780 -16824 40884 201559 -81927
182 -81927 -404679 -48565 475715 223271 -398494 -324197 248865 319489 -100659 -214013
192 -214013 27820 77853 -30221 58448 131230 -107412 -261808 44802 344867 113649
202 113649 -282271 -245284 85111 224978 116917 -44396 -185673 -192278 58428 299046
212 299046 136104 -229675 -253761 48332 189240 71264 -17800 -48595 -137144 -92257 180023
223 180023 249815 -106922 -329176 -1862 328374 100472 -250370 -129622 160583 100243
233 100243 -79668 -6 74957 -108772 -156030 161213 290828 -99171 -384624 -55530
243 -55530 345171 184268 -198006 -199563 30539 70859 16910 80395 61763 -153360 -201741
254 -201741 87693 271895 42707 -226043 -137324 105503 143372 18015 -64845 -72403 -26318
265 -26318 71168 105638 -16290 -127479 -41349 102431 82665 -27003 -59177 -46714 -33641
276 -33641 60121 149827 12936 -221130 -147745 178366 236973 -69689 -232761 -35407 127840
287 127840 36378 -28094 48410 1913 -157022 -71829 202035 175911 -158351 -236425 75020
298 75020 234936 4788 -173007 -27830 111126 16089 -58111 33590 50231 -79772 -76211
309 -76211 106559 132430 -82102 -179051 6410 168025 71651 -97967 -109082 -9240 60564
320 60564 67241 20520 -57753 -84881 -13453 69871 66180 -1134 -58107 -69398 -9113 92393
332 92393 95042 -50835 -139510 -7341 145255 62428 -108795 -75761 75477 65421 -48563
343 -48563 -27654 55576 -6791 -91833 18922 143008 7110 -182655 -72261 168362 125109
354 125109 -117467 -143243 45711 98563 -20653 -43007 40155 7440 -91903 -27429 122579
365 122579 78414 -106546 -118686 58435 128376 875 -93350 -27887 53483 34177 -13206
376 -13206 -11153 2013 -8396 -6573 21636 28708 -10364 -48236 -25435 42996 64673 -13541 -93515
389 -93515 -44258 77848 82115 -44606 -95652 2365 67994 2880 -41092 18585 33167 -53300
401 -53300 -57036 71297 99614 -55405 -126208 26155 136965 12875 -116288 -28010 95907
412 95907 33300 -70865 -18072 65401 4166 -72328 3100 90149 6813 -106259 -38291 97146
424 97146 65545 -72062 -84057 28310 67787 -4780 -44415 -2307 19315 -14790 -20871 25985
436 25985 38588 -20027 -56692 -1931 65346 36068 -48569 -55206 29745 69360 -1451 -60838
448 -60838 -10894 54324 19311 -43317 -13481 44189 6663 -56328 -8022 72674 20049 -89184
460 -89184 -50944 81263 72912 -65436 -88404 35492 77206 -23692 -63825 23106 52847
471 52847 -34584 -58930 41040 75914 -30752 -86514 15225 92857 11207 -78757 -23026 67383
483 67383 34792 -47161 -30790 37702 28827 -30496 -23570 32535 25162 -37594 -39531 32116 53277
496 53277 -20057 -69311 -9765 61797 28558 -50004 -42755 28273 36008 -22470 -29791 26442 29839
509 29839 -35217 -40887 40166 62426 -26761 -72560 12885 80922 9974 -71827 -18614 68004
521 68004 28551 -57500 -28463 54890 29507 -53959 -30965 56321 34574 -63100 -50212 57161
533 57161 62757 -48258 -78131 22660 71831 -6941 -61267 -3354 44710 -3026 -41618 9063
545 9063 50530 -3391 -59053 -10550 62964 35401 -46763 -45265 31893 51859 -11944 -43800
557 -43800 6400 42105 -1326 -39513 376 41789 2317 -46857 -9477 49007 15772 -56954
569 -56954 -33857 51543 46855 -44703 -62921 22494 60103 -9441 -51460 4294 41979 -12428
581 -12428 -44512 21359 62956 -11941 -76005 -5366 81850 32853 -64490 -40901 50090 42233
593 42233 -37027 -32558 39083 32710 -41595 -38476 39560 45322 -34877 -53804 23612 54532 -17365
606 -17365 -61385 96 57069 13321 -50864 -29050 31280 27791 -18829 -18969 18753 13253 -29613
619 -29613 -21294 39444 47805 -25186 -63593 2294 68459 26834 -48506 -32068 34050 26782 -28660
632 -28660 -17574 38130 20350 -47921 -34630 45915 45274 -41297 -56476 28915 57445 -24737
644 -24737 -66768 10413 65918 2131 -61449 -14350 46879 11519 -38713 117 47935 -2109
656 -2109 -64052 -10318 76500 42782 -59075 -59266 33233 59215 -6567 -35463 6653 20707
668 20707 -18631 -23028 27802 38474 -20080 -52469 -2580 46541 16424 -38987 -28552 25387
680 25387 29551 -22771 -40041 10240 42934 1743 -40480 -11360 29553 6751 -26113 7678
692 7678 44185 -5793 -65533 -12721 78792 49886 -58009 -65210 29960 58651 -8705 -32783
704 -32783 17699 21138 -38861 -33645 47074 55889 -37313 -73447 10578 66661 2342 -59213 -11414
717 -11414 48619 10829 -48683 -19442 40397 22817 -29956 -17773 26402 9999 -33580 -9491
729 -9491 49082 33479 -41599 -56014 17070 65402 22397 -39620 -35051 9919 23131 3821
741 3821 677 12531 -6102 -39555 -18501 44856 46907 -31223 -66446 2232 58606 8762 -51840
754 -51840 -12332 46137 10060 -50207 -16053 47646 20308 -40735 -14497 43079 9917 -53823
766 -53823 -14248 71029 42609 -60926 -64822 34033 69589 1688 -41439 -7624 12972 -12683
778 -12683 -9275 36827 32209 -37607 -61936 6950 62972 21912 -44778 -37478 16546 25984 -8368
791 -8368 -18443 8887 17522 -10674 -23591 3561 24986 3522 -19424 1220 26270 -1538
803 -1538 -39846 -7598 57477 40829 -46117 -63891 18504 65445 9713 -39354 -7584 17072
815 17072 -19883 -24070 41522 53619 -38197 -83852 5158 81713 19541 -63033 -28999 39517
827 39517 15163 -37106 -7781 41770 9924 -43466 -16165 38834 17898 -33305 -13571 40408
839 40408 24363 -38971 -39295 26873 54035 5934 -39779 -26448 11204 21850 11253 2978 -4352
852 -4352 -20804 -25007 4153 41348 28300 -32260 -58018 -3826 53345 26341 -35842 -31241 19549
865 19549 18646 -23917 -13817 35313 21459 -37863 -29002 36860 33748 -34175 -31358 44782 44670
878 44670 -44571 -61389 32425 73987 -4541 -59694 -9672 33632 -1161 -20379 25402 32944
890 32944 -38624 -63525 17670 74267 12749 -61687 -35439 28454 26877 -11348 -9726 12179
902 12179 -832 -23294 -6108 25437 18633 -14255 -19360 7249 19456 -1221 -18557 310
914 310 29114 16203 -26781 -34248 13490 45133 10101 -33848 -20087 13313 5644 -10969 13497
927 13497 29354 -20198 -60077 -4371 67832 31673 -55634 -48263 29654 37512 -21174 -23361 29420
940 29420 20619 -40128 -29507 42400 42378 -31921 -41684 27562 41845 -24351 -42216 24201 52480
953 52480 -9459 -50171 -6336 36754 12127 -18052 -1148 12088 -14963 -27716 11250 40823
965 40823 7096 -42143 -33611 16771 36350 5738 -24576 -16784 6489 8070 -3889 595 14639
978 14639 3381 -22291 -14051 23912 26581 -14428 -26797 14037 31709 -12712 -36791 11328
990 11328 48163 2071 -48713 -15407 37718 17424 -26990 -8531 26626 -3996 -44456 -4247
1002 -4247 55335 21337 -54555 -42387 33445 42789 -17952 -31828 12928 20334 -20448 -20168 27105
1015 27105 31070 -20417 -35284 11939 35761 -1336 -27707 1746 28069 3624 -27314 -10432
1027 -10432 23883 20534 -11781 -21756 190 12772 -709 -8266 6617 11602 -14095 -28989 3313
1040 3313 37164 12223 -36496 -29352 21358 29893 -11111 -22531 11776 18664 -17664 -22099 22752
1053 22752 34105 -15934 -37542 11213 40043 -4107 -36912 4041 41086 1733 -41721 -9127
1065 -9127 39258 16404 -31430 -17565 22663 9824 -25556 -9365 29645 13681 -34241 -28735
1077 -28735 23070 33832 -9989 -31857 -1927 21614 3247 -15161 1017 17691 447 -21002
1089 -21002 -4639 24187 15795 -17065 -18391 13941 22412 -8733 -22499 8044 27588 -2597
1101 -2597 -31366 -5089 29113 10093 -26040 -12253 21442 7427 -27374 -11036 30405 16027
1113 16027 -34202 -28499 26336 33038 -17942 -32318 11109 28250 -9853 -25303 12987 29759
1125 29759 -9397 -31310 6277 34407 2535 -29923 -4207 29092 8645 -25854 -11290 24189
1137 24189 16094 -19510 -19931 11602 18230 -8401 -18095 4981 15727 -7604 -21878 1747 24087
1150 24087 3760 -26744 -14286 21735 18958 -16302 -19758 12961 20820 -11158 -20362 12782 26466
1163 26466 -8766 -27824 6776 32275 -376 -30636 -1356 32033 6192 -31952 -9757 30409
1175 30409 13516 -28686 -17708 23116 16377 -23069 -18794 20075 18193 -21671 -24409 16702 26438
1188 26438 -12019 -28532 5412 26446 -737 -22987 -571 22820 4414 -19997 -4733 21758
1200 21758 11152 -17212 -12755 16675 17695 -11121 -18798 8508 21829 -3868 -23114 -2028
1212 -2028 22245 5059 -22701 -10616 19064 10123 -21433 -14543 19449 16431 -20617 -22975 16591
1225 16591 25323 -13238 -27859 9444 28906 -5364 -27403 4652 29604 50 -27915 -577
1237 -577 29815 5980 -26990 -7127 27269 11804 -24517 -14367 22330 17326 -19318 -19616 14249
1250 14249 18949 -12802 -21027 7922 19227 -7426 -22397 2313 21503 530 -22258 -6162
1262 -6162 19756 9787 -16691 -12119 15075 15255 -11015 -15638 10559 20373 -5263 -19772 4159
1275 4159 22955 837 -22370 -2980 23957 7447 -23756 -11709 22267 14633 -21360 -18655
1287 -18655 17243 18277 -17596 -21528 13783 21873 -14200 -25824 9952 26863 -6783 -27687
1299 -27687 2876 26971 916 -24176 -2121 24849 6181 -22283 -6955 22878 12210 -18446
1311 -18446 -13016 16927 16379 -13108 -16467 10524 18133 -7514 -20110 2466 18968 264 -19775
1324 -19775 -5620 16100 5726 -17202 -9839 15053 11330 -15663 -16821 12344 20286 -8062 -21846
1337 -21846 4397 22805 -977 -21137 1072 24561 3481 -24029 -4177 26741 10686 -23801
1349 -23801 -12407 23199 15497 -21156 -16510 20019 18467 -19032 -22210 14441 21604 -12190 -23099
1362 -23099 7108 20345 -7949 -22193 4588 22096 -2697 -23529 -3196 21179 7562 -16618
1374 -16618 -8557 13494 9999 -10665 -8725 12086 13462 -7910 -14677 5390 18374 1427 -16552
1387 -16552 -4515 15634 7026 -15677 -9977 15494 12038 -16396 -18383 12177 19517 -11266 -22245
1400 -22245 6276 20801 -8259 -24041 6519 26875 -3523 -29808 -1607 29944 7462 -25318
1412 -25318 -7530 24490 8633 -22990 -7307 26500 12094 -24064 -15001 21836 18544 -15640
1424 -15640 -17014 12991 15407 -12422 -16395 9422 17166 -7223 -19157 -30 14307 1142 -12613
1437 -12613 -3644 9129 2494 -11481 -6795 11087 12696 -6924 -16372 1298 17575 5814 -13596
1450 -13596 -4583 14248 6015 -14888 -5516 20229 12512 -20066 -17665 18096 21577 -14201 -21831
1463 -21831 12153 21249 -14244 -25493 11945 27347 -10089 -30856 3076 26743 -2750 -25508
1475 -25508 2641 24485 -4176 -28691 253 30195 7730 -26082 -10560 20059 11374 -12769
1487 -12769 -5722 15122 5968 -15147 -7829 15193 13779 -8260 -13942 1584 11165 1863 -7501
1500 -7501 -3172 6194 2883 -9443 -9894 6324 13667 -3646 -17516 -3187 14687 2628 -14503
1513 -14503 -999 18082 413 -24614 -5583 28998 15427 -24205 -18735 19478 18999 -14688
1525 -14688 -12909 19859 14844 -23065 -18952 23679 26310 -17517 -27820 11475 24288 -10388 -22975
1538 -22975 9972 22727 -10515 -26970 3721 23288 -688 -19575 -1454 13547 -2134 -15152
1550 -15152 2230 18205 3281 -16982 -10410 10546 15314 1929 -9157 -5034 3909 5081 -1053
1563 -1053 330 7542 3156 -12146 -10377 12459 18426 -7075 -21509 912 18747 -2309 -20237
1576 -20237 2218 22645 -2540 -28720 -4615 26383 7674 -23686 -7145 21000 3095 -25080
1588 -25080 -3201 31907 11205 -30957 -18584 24941 22356 -13617 -14571 13022 10109 -14930 -8384
1601 -8384 20566 15717 -17160 -20494 8827 19254 -2222 -14291 -617 8952 -1635 -10278 -1708
1614 -1708 9148 5064 -7455 -10805 -532 8345 3611 -5822 -2359 6544 -414 -12692 -1462 21633
1628 21633 12910 -20317 -21598 14253 25642 -4283 -18380 6033 14762 -11253 -16414 17632 24749
1641 24749 -15859 -31434 8145 30266 -4044 -27900 2222 24274 -5195 -27378 1245 26713
1653 26713 1064 -24876 -4237 18817 1068 -17786 1897 21461 724 -23574 -8068 20336
1665 20336 15665 -7950 -12034 -33 4642 2610 3532 4244 -1155 -5964 -5130 1121 9370 8382 -6362
1680 -6362 -16394 -1919 15747 5591 -16047 -7521 14743 5898 -19777 -10463 19997 13493 -19409
1693 -19409 -15969 16830 13309 -18763 -11652 25716 17497 -27792 -24883 24958 31953 -13808 -27827
1706 -27827 9203 21495 -9725 -15370 17565 19448 -20028 -26255 15089 29413 -7918 -26286
1718 -26286 1170 18781 -2413 -16177 2790 13705 -3435 -14575 -786 9961 712 -6389
1730 -6389 452 5032 -1340 -5528 -1243 5518 8530 2539 -9384 -11426 5969 18928 4301 -15396
1744 -15396 -6977 11186 4858 -9812 2501 15283 -4256 -25004 -1780 28671 8220 -27994
1756 -27994 -14009 22983 12247 -23304 -12817 22717 12278 -24736 -15548 21841 15620 -20233
1768 -20233 -13897 21790 15030 -23153 -17989 23137 24981 -14502 -23790 7531 19247 -2890 -10178
1781 -10178 6944 8490 -11015 -12131 11070 16797 -4740 -17555 -4250 10419 6710 -4594 -6972
1794 -6972 -1251 2972 973 -4292 -2705 4632 4168 -6401 -7691 5451 8703 -5340 -8861 8975
1808 8975 13612 -9753 -18308 9353 25519 -1539 -24844 -3317 21686 5372 -16297 -739
1820 -739 17137 -3232 -23068 1608 27772 3768 -29221 -11637 22993 12324 -19134 -12320
1832 -12320 14983 8722 -16257 -9930 15093 10476 -14046 -11334 12151 11813 -10110 -11417 9324
1845 9324 14881 -3894 -14410 -392 13228 6783 -5804 -5670 2122 3481 -1094 -1411 4979 4059
1859 4059 -6912 -11057 3380 15044 2281 -17080 -9949 12264 11010 -10364 -11646 8464 10668
1872 10668 -10179 -12103 10875 13975 -9976 -15714 10340 17941 -8722 -19055 8628 22978 -3300
1885 -3300 -22401 -104 21109 3982 -16302 -2706 14280 498 -14957 242 17561 2776
1897 2776 -20064 -9196 15654 11974 -11265 -13470 4952 9859 -4086 -8970 3318 8135 -3011
1910 -3011 -9583 1355 10292 1660 -9617 -3423 10470 7314 -8371 -9365 7952 13960 -2990 -14067
1924 -14067 66 13813 2604 -11408 -1705 11274 550 -14105 -1978 16885 4756 -19271
1936 -19271 -11454 15467 13353 -12926 -14997 8610 12680 -8842 -12907 8238 13068 -7900 -14601
1949 -14601 6938 16390 -3861 -15896 2548 17353 1307 -15464 -3645 14983 7006 -10933
1961 -10933 -6962 8854 6891 -7370 -6282 7426 7156 -8588 -10979 5371 12870 -2724 -14819
1974 -14819 -3493 11974 5160 -10770 -7236 7923 6061 -8226 -7634 8680 9441 -8480 -11139
1987 -11139 8088 14307 -5269 -14300 4290 17183 204 -16049 -1558 16198 4566 -13652
1999 -13652 -4889 12909 4816 -13064 -6095 13245 7283 -14206 -11878 11567 13324 -9111 -15493
2012 -15493 4193 12784 -2876 -12371 1616 11819 -1044 -12337 -117 12839 2669 -11700
2024 -11700 -4585 11791 8037 -8949 -8461 8340 11242 -4797 -10960 3043 11597 -561 -10649
2037 -10649 -140 10334 176 -11740 -2059 12566 4054 -14595 -8835 11670 10152 -10266 -12348
2050 -12348 6750 11509 -6616 -11944 5871 12003 -5057 -13042 3937 14867 -828 -14010 -35
2063 -35 15514 3521 -13826 -4829 13700 8160 -10654 -8289 9246 8705 -7502 -8842 6807 9202
2077 9202 -7068 -12201 3764 12724 -2229 -14863 -2676 12024 4189 -11197 -6120 8975 5978
2090 5978 -8620 -7035 8975 8722 -7474 -10129 6619 13130 -3601 -12616 3056 14526 352
2103 352 -13633 -1781 14208 4262 -12346 -5284 11204 5793 -11236 -6743 11191 7223 -11924
2116 -11924 -11299 9797 12155 -8227 -14132 3254 12544 -2341 -11405 1004 10453 -699 -10952
2129 -10952 155 12382 3186 -11205 -4684 10988 7762 -7854 -7808 7452 10353 -4687 -10326
2142 -10326 2744 11194 -514 -10313 -1363 9061 1374 -10835 -2787 10731 3871 -12958 -9002
2155 -9002 10638 11119 -8385 -13071 4646 11635 -3586 -11371 3822 12050 -2992 -13335 2250
2168 2250 16126 1145 -14733 -2338 15059 5061 -13238 -5629 13422 7960 -11363 -8627 9476
2181 9476 9382 -8002 -9138 6682 8164 -7523 -10532 5740 11435 -4260 -14273 -916 11498
2194 11498 3487 -9808 -5366 6710 4212 -6271 -3685 7402 5868 -6716 -7757 6214 11206
2207 11206 -2017 -10372 341 11590 1973 -10386 -2844 11043 5626 -10162 -7565 8842 8224
2220 8224 -7751 -8864 7024 8194 -9083 -11780 7467 13730 -5939 -16980 499 15208 1903
2233 1903 -12640 -1934 11288 992 -11698 -528 14320 3760 -13246 -6089 13125 9441
2245 9441 -8901 -8607 7651 9719 -6234 -9582 4903 10688 -2810 -10601 18 8625 -2 -8757
2259 -8757 -590 8541 657 -11319 -5222 10119 8502 -8018 -11578 2996 10077 -637 -8059 1275
2273 1275 8058 -2124 -8990 2341 13125 1796 -12650 -4373 12416 7748 -9436 -7479 9281
2286 9281 8960 -8026 -10042 6970 11107 -5486 -11244 3322 9829 -4307 -11078 3357 11999 -3192
2300 -3192 -15526 -2073 14299 5553 -11368 -7860 7023 6451 -5431 -4097 7133 4739 -8336
2313 -8336 -7248 8675 11779 -3582 -11972 879 11580 2074 -9458 -2311 9104 3915 -9337
2326 -9337 -5586 7769 6351 -7030 -7529 5073 6313 -7397 -9143 6560 11488 -5755 -15016 367
2340 367 14157 3653 -11300 -4725 8518 3066 -8053 -806 11130 3315 -11889 -5942 12088
2353 12088 10669 -7682 -10579 5639 10425 -3464 -9309 2860 9879 -2092 -10327 -690 9014
2366 9014 1110 -8958 -2105 7950 1765 -10043 -4794 9509 7894 -8116 -11580 2819 11007
2379 11007 490 -8219 -472 6729 -679 -7104 2536 11565 932 -12325 -4389 12709 8720 -9056
2393 -9056 -9131 6963 9331 -6036 -9309 5509 9816 -5070 -11447 2724 10585 -2949 -11411 1693
2407 1693 11170 -1961 -14222 -1855 13631 5534 -11831 -8263 7614 7758 -4549 -5074 5581
2420 5581 4872 -7040 -5792 8660 10447 -4606 -11293 1446 11303 2528 -8362 -3165 7037 3298
2434 3298 -6932 -4040 6203 4653 -6170 -7118 3589 6456 -4971 -7953 3804 9060 -3289
2447 -3289 -12159 -634 12321 4499 -10666 -6657 7747 6094 -5729 -3346 8116 4329 -9518
2460 -9518 -6672 11116 11726 -7260 -12748 4479 12689 -939 -10871 715 9884 -860 -10783 -384
2474 -384 10279 1020 -10848 -3362 9499 3239 -10160 -5124 9877 7123 -8463 -9903 4897
2487 4897 10089 -1384 -8291 98 6459 -241 -5179 2521 8216 -439 -9822 -1868 10924 6954
2501 6954 -7978 -8157 4806 7998 -2868 -7512 2250 7011 -2839 -8929 1170 8356 -613 -10018
2515 -10018 -1462 9306 1324 -11050 -4030 10320 6417 -9584 -8675 6884 9383 -3878 -7591
2528 -7591 4205 7156 -4359 -6840 6146 10698 -3824 -12405 823 12506 2974 -10695 -4478
2541 -4478 8208 4120 -6936 -4418 7014 4385 -7728 -6270 5741 6471 -5621 -8542 3475
2554 3475 8719 -2791 -9921 474 10179 2067 -8974 -4405 7500 5517 -5099 -3259 5893 4010
2568 4010 -6459 -4929 7331 8772 -5297 -10223 2905 11286 -58 -9871 -1651 7777 1401 -8035
2582 -8035 -1964 7740 1749 -9074 -4380 8101 4981 -8269 -7056 7094 7761 -5764 -9130 3764
2596 3764 10037 -1410 -8508 425 8211 877 -6396 243 8194 779 -9009 -2374 10054 5855
2610 5855 -7975 -7590 5820 8055 -3658 -7652 2027 6426 -2319 -7674 1230 7570 -1322 -9532
2624 -9532 -1478 8633 2480 -8791 -4551 7983 5708 -7364 -7058 5814 8405 -3249 -7538 2927
2638 2927 7673 -2129 -6969 3029 9154 -1778 -9983 344 10775 3198 -9799 -4885 7540 5188
2652 5188 -6429 -5301 5097 4437 -5951 -6484 4823 6705 -4484 -8517 2263 8278 -1401 -9002
2666 -9002 -542 8587 2088 -7669 -3385 7348 4896 -5350 -4079 5794 5197 -4961 -5411 5626
2680 5626 7543 -3998 -9165 2712 9843 -46 -9530 -2103 8072 1926 -7639 -2863 6901 2486
2694 2486 -7916 -4589 6897 5346 -6916 -7044 5087 7900 -4207 -8554 2929 8857 -598 -7777
2708 -7777 424 8312 1307 -6952 -903 7752 2007 -6906 -2711 7658 4839 -6777 -6466 5017
2722 5017 7369 -3304 -7398 1190 6234 -916 -7075 -7 6523 -485 -8125 -1859 7713 3132 -7506
2737 -7506 -5015 6537 6095 -5571 -6684 4768 7705 -2869 -7304 3003 8420 -1192 -7446 1542
2751 1542 8758 -84 -8846 -631 9533 2533 -9113 -4390 7328 5115 -5992 -6021 5085 4965
2765 4965 -5332 -6151 4201 6124 -3907 -7998 2293 7998 -946 -7819 -301 7781 1977 -6458
2779 -6458 -2426 6315 4200 -4675 -3978 4932 4879 -3445 -4675 3584 6340 -2665 -7210 792 7758 727
2795 727 -7851 -2814 6465 3307 -6276 -4283 5449 4002 -6276 -5452 5170 6106 -5472 -7860 3754
2810 3754 8496 -2749 -8814 1969 8729 -8 -8252 -61 8922 2078 -7219 -1860 7956 2750
2824 2750 -7168 -3167 7360 4928 -6817 -6031 5050 6954 -3548 -7056 1671 5891 -1778 -6298
2838 -6298 530 5555 -667 -6653 -844 5911 2255 -6139 -3430 5208 4302 -4049 -4771 3565 5984
2853 5984 -1985 -5778 1323 6366 818 -5639 -337 6260 1314 -6265 -2542 7004 3840 -7207 -5642
2868 -5642 5569 6215 -4411 -7240 3099 6073 -3347 -7143 2551 7241 -2561 -8570 714 8316
2882 8316 360 -8061 -1427 7999 2718 -6715 -3033 6940 4331 -5247 -4494 5059 5491 -3784 -5020
2897 -5020 3815 5818 -2708 -6546 1971 7228 -605 -7161 -1689 5885 2110 -5440 -3333 4330 2716
2912 2716 -4976 -3944 4245 4530 -3810 -5657 2442 6259 -1288 -6537 563 6783 1132 -5868 -1172
2927 -1172 6867 2904 -5693 -3098 5673 4004 -4591 -4369 5226 4940 -5179 -6522 3443 7105 -2287
2942 -2287 -7722 149 6212 -311 -6346 -898 5686 138 -6567 -1789 6304 2957 -6038 -4314 5036
2957 5036 4963 -3502 -5087 3456 6077 -1868 -5703 1719 6615 72 -5729 -95 5764 1076 -5885
2972 -5885 -1484 6118 2600 -6138 -4340 4869 5062 -3667 -6294 2031 5133 -2228 -5306 1568 5531
2987 5531 -1614 -6307 704 7071 1033 -7065 -2250 6274 3304 -5021 -3192 5064 4312 -3992 -4032 4059
3003 4059 5300 -2510 -4727 2410 5379 -1835 -5824 1315 6652 -288 -6951 -2274 5271 3063 -5029
3018 -5029 -3795 3123 3106 -3621 -3639 3209 4201 -3543 -5596 1992 6745 -46 -6160 -526 6264 2105
3034 2105 -5233 -1431 5835 2915 -5031 -2951 5147 4020 -4132 -4350 4130 4627 -4134 -5910 2904
3049 2904 6405 -2345 -7386 -307 6070 68 -5572 -1363 4686 295 -5449 -927 5969 2414 -6219
3064 -6219 -3510 4972 4827 -3296 -4812 2581 4761 -1493 -3987 1384 4936 43 -4751 -568 4756
3079 4756 1205 -4666 -1723 4410 2241 -4768 -4183 3785 4593 -3040 -5939 423 4902 -449 -4545
3094 -4545 84 4157 -627 -5561 -74 6404 1157 -6463 -3014 6001 4510 -4227 -4013 3909 4702
3109 4702 -3106 -3932 3643 5394 -2645 -5447 2159 5309 -1376 -5700 545 5705 -484 -6665 -1881
3124 -1881 5617 2519 -4776 -3579 2575 2362 -3111 -2685 3339 2584 -3214 -4136 3008 5428 -826 -5528
3140 -5528 -779 5107 2063 -3868 -1339 4197 2199 -3408 -2318 3919 3209 -3142 -4232 2780 4477
3155 4477 -2296 -5358 1481 5161 -963 -6590 -1032 5349 1596 -4913 -2686 4096 1684 -4270 -1997
3170 -1997 4950 2864 -5555 -4228 4823 5847 -2671 -5511 1911 5266 -543 -4044 983 4815 -382
3185 -382 -4821 440 5037 973 -4494 -1837 4189 2136 -4374 -3277 3218 3678 -2981 -4894 945
3200 945 4061 -576 -3845 86 3315 -544 -3548 266 4636 1181 -4777 -2442 4802 4229 -2619
3215 -2619 -3818 2555 4090 -1209 -3527 2180 4333 -1703 -4682 1092 4993 10 -5375 -575 5094
3230 5094 1227 -5002 -2496 4579 2691 -4194 -3767 2863 3471 -2824 -3286 2268 3294 -2615 -3888 2675
3246 2675 5361 -938 -5655 -132 5126 1970 -3647 -1555 3739 2159 -2809 -1712 3615 2632 -3429
3261 -3429 -3589 2421 3715 -2081 -4359 683 4008 -784 -4842 -479 4368 924 -4199 -2323 2926
3276 2926 1815 -2967 -1850 3225 2379 -3713 -3206 3675 4900 -1563 -4684 1243 4921 87 -3535
3291 -3535 -81 3772 -165 -3858 -57 4352 1195 -4591 -2480 3561 2687 -3143 -3413 2043 2963 -2203
3307 -2203 -4093 994 4033 -705 -3943 -43 3390 131 -3496 -196 4086 980 -4290 -2102 4392
3322 4392 3812 -2683 -3557 2088 3854 -1090 -2963 1629 3661 -1430 -3868 1064 4285 -387 -4964
3337 -4964 -1237 4171 1020 -4334 -2267 3521 2103 -3701 -3348 2553 2750 -2183 -3046 1891 2874 -1951
3353 -1951 -3303 2111 4351 -733 -4075 -131 4393 1453 -3185 -1476 2457 1705 -2266 -1174 2438
3368 2438 1722 -2542 -2810 1933 3324 -1166 -4041 -144 3219 -375 -3960 -1130 3422 1070 -3670
3383 -3670 -1876 2806 2191 -2667 -2450 2794 2724 -2528 -2924 2860 4100 -1578 -4337 869 4556 651
3399 651 -3624 -280 3950 482 -3411 -392 3847 912 -4157 -2260 3478 2693 -3425 -3503 2082 2892
3415 2892 -2010 -3287 1410 2987 -1262 -3438 473 2955 46 -3099 -150 3342 1043 -3114 -1293
3430 -1293 3231 2524 -1886 -2494 1658 3019 -891 -2296 838 2704 -589 -3169 117 3786 -45
3445 -45 -3878 -1234 3044 1114 -3613 -2433 2611 2058 -2415 -2867 1943 3011 -1744 -3055 1465 3581
3461 3581 -886 -3239 941 3923 44 -3814 -689 3891 1511 -3173 -1321 3047 1854 -2244 -1905
3476 -1905 2440 1893 -2655 -2777 1836 2897 -1756 -3499 419 2877 -541 -3134 -539 2604 361
3491 361 -2926 -1011 2335 1735 -2319 -1743 2146 2314 -1612 -2135 1740 3030 -818 -3221 415 3774
3507 3774 792 -2896 -453 2789 759 -2978 -876 2922 1481 -3167 -1964 2442 2408 -2599 -3126 1452
3523 1452 2484 -1410 -3188 824 2991 -393 -3142 67 3252 264 -3148 -529 3453 1291 -2553
3538 -2553 -1209 2883 2368 -1940 -2325 1833 2893 -1225 -2527 1167 2661 -630 -2541 383 2532
3553 2532 -96 -3471 -1064 2785 885 -3029 -2055 1893 1556 -2121 -2269 1806 2347 -1466 -2542 1219
3569 1219 2397 -456 -2305 463 3055 380 -2612 -534 3232 1370 -2796 -1236 2461 2012 -1823
3584 -1823 -1912 1538 1837 -1769 -2609 1090 2490 -1038 -3102 300 2876 -44 -2862 -921 2311 459
3600 459 -2565 -1057 2285 1415 -2346 -1556 2280 2267 -1436 -1833 1793 2913 -741 -2228 1088 3005
3616 3005 214 -2470 -378 2693 696 -2063 -1020 2355 850 -2510 -1591 2076 1821 -2314 -2762 1139
3632 1139 2178 -1038 -2772 278 2791 -459 -2511 168 2605 547 -2146 -521 2614 1099 -1783
3647 -1783 -1254 2324 1828 -1742 -1745 1664 2582 -621 -2205 59 2263 -476 -2269 267 1933 -363
3663 -363 -2858 -1099 2247 1050 -2435 -1943 1906 1484 -1770 -1564 1496 1827 -1297 -2270 975 2482
3679 2482 -526 -2083 315 2059 222 -2549 292 2908 1059 -2618 -1094 2514 2039 -1650 -1712 1356
3695 1356 1245 -1453 -1593 1564 1854 -1273 -2576 155 2217 -192 -2688 -525 1906 634 -1912 -994
3711 -994 1761 1226 -1769 -1326 1736 1753 -743 -1538 1535 2330 -493 -2282 601 2819 538 -2359 -971
3728 -971 2060 1235 -1738 -1068 1439 667 -2033 -1620 1711 1426 -2228 -2317 1293 2557 -698 -2724 460
3745 460 1989 -569 -2319 157 2713 383 -2154 -500 2446 756 -1550 -225 2465 1177 -2017
3760 -2017 -1642 1653 2349 -567 -2096 531 1540 -681 -1656 117 1275 -942 -2172 -307 1922 139
3776 139 -1906 -1426 1291 1189 -1059 -1578 571 1244 -793 -1741 604 2273 -168 -1744 255 2092
3792 2092 293 -1442 -190 2560 918 -2172 -1316 2076 1835 -1346 -1748 960 1654 -1353 -1736 1521
3808 1521 1710 -1605 -2738 714 2242 -200 -2434 -110 1911 461 -1512 -281 1843 574 -1591
3823 -1591 -834 1781 1695 -1013 -1228 1074 1341 -935 -1399 1064 1824 -347 -2098 -538 1478 732 -1402
3840 -1402 -776 736 264 -1619 -913 1253 883 -1654 -2290 805 1983 -663 -2058 -116 1689 90
3856 90 -1620 128 2116 504 -1700 -157 2015 1103 -1515 -671 1574 1190 -1729 -1375 1411 1994 -854
3873 -854 -2115 301 1584 -348 -1703 86 1246 -831 -2003 41 1744 -80 -2227 -1325 1821
3888 1821 1487 -1255 -1298 985 1608 -750 -764 1309 1712 -159 -1457 480 2121 87 -1365 -278 1838
3905 1838 556 -2018 -770 2023 1395 -1448 -1660 368 1334 -807 -1572 709 934 -1204 -2300 643
3921 643 2152 -262 -2211 -240 1962 516 -1532 -764 1662 821 -1434 -651 1638 1214 -973 -850
3937 -850 1251 1373 -944 -1076 1005 1916 -529 -1813 -46 1841 411 -1589 -816 885 156 -1223
3953 -1223 -729 1299 621 -1508 -1548 793 1914 -445 -1832 -68 1733 146 -1509 118 1647 465
3969 465 -1553 -704 2091 1182 -1520 -835 1588 1123 -1312 -1021 1527 1419 -1256 -1897 524 1716 -469
3986 -469 -1580 45 1167 -714 -1592 405 1679 -309 -1907 -465 1670 608 -1241 -1195 1102 1102 -803
4003 -803 -641 1025 1328 -630 -980 212 1412 -2 -1084 73 1374 234 -1371 -576 1700 1038
4019 1038 -1150 -1495 733 937 -594 -1206 186 821 -750 -1739 337 1616 -109 -1744 -305 2113
4035 2113 501 -1701 -600 1679 877 -1036 -698 1758 1385 -1068 -1127 1275 1280 -901 -720 980 1406
4052 1406 -574 -1811 418 1644 34 -1857 -690 740 170 -1193 -598 773 -127 -967 -864 1012
4068 1012 976 -1042 -1033 219 1660 -132 -1019 579 1349 271 -846 217 1471 1044 -1298 -626 1091
4085 1091 824 -1313 -874 1101 1077 -1258 -1809 627 1586 -692 -2036 156 845 -379 -1449 91 1519
4102 1519 -241 -1905 -262 1873 684 -1547 -713 1196 1076 -682 -1028 761 1333 -348 -869 601
4118 601 1532 37 -815 127 1507 -29 -1573 -303 1723 777 -1529 -1173 672 852 -1098 -1146 324
4135 324 465 -618 -1145 512 1000 -576 -1768 -22 1829 441 -1533 -253 1367 824 -709 -620 1172
4152 1172 1084 -742 -554 1136 1002 -841 -936 934 1526 -706 -2013 335 1472 -366 -1915 -631 1278
4169 1278 422 -1195 -430 891 290 -1119 -278 1153 737 -893 -1109 881 1613 33 -894 46 1335
4186 1335 340 -1017 94 1339 313 -554 -380 1265 577 -1027 -591 1255 840 -1228 -1437 624 1293
4203 1293 -442 -1743 -439 1122 40 -1082 -175 1195 -1 -1444 -62 1665 463 -1395 -641
4218 -641 1375 1147 -589 -1007 987 1288 -409 -1169 563 938 -143 -1049 321 1565 -450 -1752 -168
4235 -168 1280 301 -1636 -833 798 614 -1444 -907 376 509 -752 -1004 775 709 -948 -1145 727
4252 727 1335 405 -1292 -336 1182 793 -912 -669 1198 822 -433 -728 893 1151 -613 -1081 872
4269 872 1244 -709 -1838 253 1314 -121 -1970 -582 1038 -8 -1227 -749 803 438 -1077 -813
4285 -813 1072 771 -1308 -1112 1009 1672 -492 -1345 452 1163 -127 -1119 326 1153 -94 -1054 -77
4302 -77 1184 317 -1394 -675 1242 875 -1222 -1204 704 984 -620 -1233 335 1148 -319 -1113 -324 1229
4320 1229 -354 -1226 -127 1321 522 -1319 -556 1265 965 -1003 -806 513 1039 -296 -851 781 1321
4337 1321 -797 -1283 543 1489 -280 -1404 -217 1110 51 -1620 -1051 822 680 -915 -1071 594
4353 594 735 -578 -786 759 1260 -947 -1216 366 1663 26 -1305 -134 1422 583 -933 -319 1053
4370 1053 569 -893 -605 1236 824 -853 -1323 729 886 -886 -1682 40 1313 -263 -1794 -339
4386 -339 1384 201 -1279 -579 1004 347 -1372 -526 1432 605 -1049 -731 1240 1333 -519 -1159 401
4403 401 1144 -93 -839 312 1184 90 -1190 -30 1137 331 -1242 -557 905 928 -1096 -919 510
4420 510 884 -575 -1137 336 1177 -438 -1182 231 849 -330 -1087 143 1611 596 -1159 -744 1042
4437 1042 1071 -512 -639 779 1003 -386 -620 667 1100 -625 -1216 374 1373 -493 -1672 -433 1236
4454 1236 -67 -1442 -742 775 572 -1243 -751 1038 443 -718 -621 731 749 -449 -861 827 1411
4471 1411 211 -1228 61 1541 467 -721 -220 893 506 -693 43 978 652 -1006 -836 614
4487 614 953 -570 -1354 104 1207 -726 -1264 -336 1189 183 -1134 -548 1217 939 -1023 -248 1026
4504 1026 909 -1244 -1163 1225 1389 -353 -1465 251 1366 -456 -1111 335 1060 28 -1332 201
4520 201 1391 64 -1548 -801 1167 674 -1151 -989 602 938 -987 -1081 672 934 -572 -1172 118
4537 118 895 -291 -849 301 851 49 -1169 -261 1175 1117 -894 -1093 906 912 -144 -282 427 1008 -317
4556 -317 -1256 453 1403 -147 -1817 -453 990 519 -1180 -977 764 981 -851 -680 941 957 -1035
4573 -1035 -1085 605 766 -592 -882 636 1506 41 -1399 -31 1295 554 -1010 -430 1042 397 -727
4590 -727 -289 1128 323 -786 -841 895 1143 -665 -1697 -47 1085 -144 -1116 -144 1232 185 -950
4607 -950 -281 1179 73 -926 -311 860 999 -881 -737 862 1030 -501 -1179 518 1498 -134 -1070
4624 -1070 184 682 -232 -804 93 1076 158 -1502 -419 1200 576 -912 -1148 396 830 -642 -1042
4641 -1042 584 826 -729 -1116 258 1437 -266 -1334 -101 1501 422 -1197 -167 1461 802 -820
4657 -820 -766 829 1316 -233 -830 561 542 -691 -832 232 1027 -483 -1745 -596 1180 417 -1085
4674 -1085 -1013 1038 593 -719 -892 602 559 -936 -757 1075 1130 -714 -1016 364 1402 -290 -1131 137
4692 137 1588 463 -1007 -380 618 412 -524 -105 664 352 -921 -628 891 819 -1082 -1620 -88 1057
4710 1057 87 -1058 -193 830 55 -875 -28 960 246 -1166 -445 1317 925 -872 -773 1224 1559 -412
4728 -412 -1160 376 1075 83 -1043 49 879 -32 -884 -138 1117 8 -1183 -688 1407 689 -1309
4745 -1309 -1355 837 1240 -496 -467 124 678 -639 -907 800 1226 -325 -1042 -211 1631 130 -968 -378
4763 -378 1088 750 -685 -669 876 1187 -202 -822 367 711 -393 -1075 453 1215 -263 -1690 -287
4780 -287 1034 386 -1305 -1129 421 727 -492 -441 690 606 -778 -753 1099 1074 -637 -1136 363 1335
4798 1335 198 -1105 76 1309 437 -918 -516 948 223 -1065 -386 675 571 -1083 -842 949
4814 949 798 -633 -1582 -18 1136 84 -1094 -102 842 -149 -593 64 908 38 -931 -117 1199 904
4832 904 -736 -926 891 1505 -166 -813 428 1021 123 -960 -214 535 -323 -758 187 962 -55 -1337
4850 -1337 -555 1241 899 -1132 -1182 312 1175 -99 -617 75 798 -487 -798 405 1273 -42 -1447
4867 -1447 105 1664 726 -973 -881 860 879 -577 -448 659 1103 -337 -662 763 547 -694 -1003
4884 -1003 172 1124 -362 -929 -40 1374 672 -1093 -715 736 614 -372 -592 687 157 -941 -448
4901 -448 800 1003 -457 -1145 364 1464 41 -908 -236 1054 183 -773 -247 782 60 -648 -309 940
4919 940 623 -908 -770 854 586 -1024 -1499 304 935 -155 -1080 -303 822 253 -804 119 800 -6
4937 -6 -962 -263 1266 626 -1120 -891 619 852 4 -1024 130 1025 -79 -810 -39 888 -251 -1086
4955 -1086 -29 859 270 -1201 -484 799 609 -700 -1403 460 1401 -245 -1000 164 634 -462 -760
4972 -760 587 949 96 -1424 7 1375 503 -1249 -905 964 486 -809 -602 706 403 -581 -681
4989 -681 377 759 -501 -1058 349 1359 -446 -1395 104 1027 239 -1091 -534 513 633 -709 -538
5006 -538 463 674 -339 -559 660 829 -557 -1019 -141 1216 219 -713 -319 783 447 -838 -217 865
5024 865 535 -723 -604 443 558 -764 -657 718 1146 -369 -1228 41 1085 -223 -1050 -317 688
5041 688 319 -541 -388 877 195 -790 -298 1049 553 -665 -1051 653 988 -324 -904 133 831 -355
5059 -355 -855 31 852 -346 -908 -497 780 183 -1044 -644 882 542 -750 -923 590 936 -329 -980
5077 -980 168 532 -187 -679 290 1235 61 -921 -64 1464 474 -1091 -355 1034 935 -585 -909 580
5095 580 578 -852 -774 473 596 -506 -1028 72 1146 -113 -1157 87 758 333 -1199 -706 709 569
5113 569 -621 -655 616 564 -485 -642 810 949 -275 -881 345 1120 98 -900 -215 882 301 -529
5131 -529 -176 510 356 -884 -515 465 490 -685 -774 356 1126 -206 -1034 -49 1077 -191 -792 -78 853
5150 853 262 -483 3 975 485 -723 -123 1086 758 -991 -626 819 931 -272 -748 124 825 155
5168 155 -954 243 804 -161 -995 -505 625 398 -793 -876 800 348 -892 -794 376 573 -431 -727
5186 -727 250 804 30 -355 127 1070 212 -939 -104 1019 450 -860 -686 506 866 -557 -741 508
5204 508 977 -106 -627 195 952 -151 -1287 -137 628 180 -1155 -186 993 432 -734 -387 716
5221 716 511 -513 -680 48 780 -138 -578 433 1075 -461 -552 326 1150 172 -1017 -71 761 341 -937
5240 -937 -257 782 104 -791 -526 606 509 -688 -817 241 741 -687 -1102 369 878 57 -928 -167
5258 -167 939 297 -641 -90 369 562 -839 -387 915 873 -604 -613 341 837 -291 -969 -31 483 2
5277 2 -852 93 698 -66 -717 -261 367 264 -793 -530 375 616 -497 -580 422 381 -241 -675 270 568
5297 568 204 -728 288 608 145 -790 -22 908 728 -622 -598 844 936 -368 -677 549 740 -213 -706
5316 -706 170 810 -367 -1045 -200 829 -391 -1011 -163 747 446 -740 -154 900 303 -313 -685 555
5334 555 627 -593 -420 528 874 -439 -484 162 906 200 -902 -267 435 356 -699 -562 433 252 -683 -863
5354 -863 113 432 -743 -739 -142 582 -227 -816 -12 673 166 -975 -293 810 225 -788 -255 719 705 -563
5374 -563 -479 373 862 -509 -749 513 903 -438 -707 -579 513 -94 -509 52 705 -11 -612 -443 849
5393 849 394 -1101 -321 709 389 -284 -485 522 768 -402 -641 256 447 255 -574 13 873 -4 -640
5412 -640 -221 658 417 -652 -458 574 943 -21 -622 61 277 -556 -600 45 401 -453 -698 -23 954 284
5432 284 -749 -160 677 339 -749 -784 627 393 -495 -468 475 858 -31 -741 294 803 -207 -713 351
5451 351 706 6 -682 -515 718 424 -698 -280 412 27 -599 -288 521 475 -602 -974 55 740 -155
5470 -155 -506 -85 414 161 -702 -440 489 246 -429 -240 485 466 -165 -255 389 499 -408 -696 375 889
5490 889 -179 -974 -126 674 -234 -768 -205 520 -200 -511 -22 755 255 -1031 -655 608 718 -385 -496
5509 -496 301 620 -193 -582 229 635 -65 -491 312 655 109 -299 -51 849 -52 -673 -279 421 552 -284
5529 -284 -622 300 272 -193 -365 227 458 -154 -937 -200 716 1 -701 -9 671 199 -516 -332 579 471
5549 471 -144 -633 713 742 -152 -995 101 679 174 -718 71 1090 52 -912 47 849 288 -871 -307
5568 -307 510 288 -215 -636 609 360 -379 -725 666 582 -25 -649 -65 596 -40 -172 -16 738 194 -307
5588 -307 148 510 305 -317 -627 671 224 3 -250 237 717 -76 -380 10 162 -213 -574 -32 550 42
5608 42 -562 -411 616 343 -655 -619 543 522 -307 -914 376 832 106 -437 97 958 -135 -620 289 986
5628 986 -62 -644 -185 706 248 -368 -496 368 432 -534 -555 553 293 -344 -480 35 225 -454 -419 41
5648 41 514 230 -740 -261 233 359 -257 -299 457 370 -365 -272 685 531 -139 -304 510 538 -42 -606 -237 248
5670 248 212 -638 -10 305 -50 -408 -353 475 139 -482 -681 347 367 -365 -893 507 491 -61 -876 70 980
5691 980 104 -484 -17 359 338 -447 293 642 372 -336 12 619 186 -258 -325 130 303 -117 -435 10 270
5712 270 -14 -834 -112 144 -356 -216 -13 331 67 -500 -317 535 432 -96 -534 387 562 18 -446 188
5732 188 479 94 -551 27 535 220 -657 -136 550 210 -467 -389 562 576 -706 -686 417 399 -200 -361 170
5753 170 500 -137 -588 -22 362 -41 -406 -131 639 304 -517 -301 290 540 -240 66 483 247 -255 -365
5773 -365 117 459 9 -259 -320 497 -124 -320 54 387 215 -375 -348 203 351 -310 -554 81 308 -214 -483
5794 -483 167 539 -287 -605 8 658 -57 -327 346 793 212 -484 3 447 7 -450 -28 454 431 -327
5814 -327 -510 241 332 -206 -544 114 318 -284 -708 -32 116 -134 -640 -117 345 90 -439 -138 545 682
5834 682 310 -413 494 449 12 -506 135 256 -62 -637 -92 571 -103 -704 -464 258 269 -378 -121 340 -27
5855 -27 -473 -511 418 306 -453 -335 174 536 -243 -295 -32 482 45 -671 11 265 47 -455 -104 325 410
5876 410 -86 -153 427 454 -297 -188 126 369 198 -403 -12 499 -52 -522 -159 469 84 -423 -514 97 122
5897 122 -477 -186 301 463 -126 -623 33 401 -49 -365 307 601 144 -511 68 609 273 -122 -387 592
5917 592 297 -559 -397 171 324 -367 -345 241 485 -220 -521 332 9 -51 -556 -211 199 -19 -449 -3 541
5938 541 237 -499 -318 372 193 -236 -215 145 291 -219 -429 335 679 -164 -293 -106 445 111 -738 -101
5958 -101 142 401 -179 -183 105 186 -432 -89 215 8 -404 -710 -162 325 -112 -276 195 683 -102 -453 13
5979 13 487 328 -526 -8 423 329 -79 -153 609 277 -182 -210 118 466 99 -387 143 17 -92 -332 8
6000 8 -6 300 -325 -325 379 251 -503 -234 102 198 -166 -104 197 316 -173 -216 280 395 -10 -317 -61 487 229
6023 229 -467 -178 503 229 -292 -276 351 -83 -273 -484 236 -9 -346 -236 113 411 -32 -464 -160 24
6043 24 263 -404 3 367 52 -81 49 466 252 -175 -607 615 468 -182 -138 -133 375 -175 -238 110 124 140
6065 140 -596 145 670 104 -468 -228 318 -45 -138 -338 -48 275 -172 -722 91 336 37 -335 -58 547
6085 547 -98 -474 107 639 75 -411 -204 734 250 -353 -75 439 241 -331 -210 174 83 75 -580 171 170 85
6107 85 -537 -34 418 133 -489 -450 226 -122 -188 29 129 354 -220 -110 116 512 -29 -233 137 465 -155
6128 -155 -406 -220 336 175 3 55 461 20 -258 -273 57 449 -114 -359 -85 220 -211 -376 -99 422 -204
6149 -204 -522 -106 229 329 -652 -485 378 104 19 37 339 240 -330 -58 369 619 -322 -313 -47 362 -65 -183
6171 -183 110 390 -137 -484 -118 350 125 -376 -164 43 -212 -64 -41 -10 79 -230 -447 222 435 37 -199
6192 -199 -63 561 -142 13 23 471 58 -611 -104 551 321 -213 -229 465 495 -157 -394 99 280 -171 -516
6213 -516 -30 185 -268 -18 196 226 123 -676 -62 61 80 -432 -293 535 227 -526 -57 268 333 -30 -406
6234 -406 234 318 -566 -197 487 82 -277 -353 -66 519 -21 -262 -103 13 22 -400 -422 95 239 -141 -381 155
6256 155 297 85 6 108 267 433 -245 -265 385 -104 -477 -338 543 -14 -160 -40 302 362 195 -218 -67
6277 -67 452 -254 -243 188 227 -31 -136 -142 288 -165 -166 -342 50 -53 -286 -174 483 -129 -416 -409 322 502 161
6300 161 -368 132 290 207 -116 69 479 -263 -46 -188 388 87 -437 -107 562 302 -229 -335 222 183 -307
6321 -307 -234 159 5 -136 -401 -439 505 -347 -416 103 123 270 -605 -48 316 34 -152 -352 109 165 -376 -128
6343 -128 380 537 -100 -321 173 338 14 -133 -375 258 352 -584 -353 -74 219 -119 -205 97 294 -375 -228
6364 -228 53 529 -135 -471 246 545 -212 -391 292 229 349 -228 210 124 59 -397 -141 475 326 -346 -338 148
6386 148 219 0 -422 -2 166 128 -264 59 167 -397 -559 35 433 4 -418 -163 132 495 -436 -491 358
6407 358 496 -12 -454 57 473 -42 266 162 330 109 -162 155 399 259 -514 -339 291 269 122 -1
6427 -1 139 96 -474 -287 270 195 -17 -425 6 298 -261 -346 -445 -1 206 -360 -119 399 377 -190 -22 197
6449 197 114 14 -129 225 388 -251 -302 400 224 -54 -434 -256 352 -127 -463 -81 329 60 -204 -374 392
6470 392 310 -187 -223 393 296 -50 -222 335 245 -148 -408 254 472 206 -377 21 277 123 -141 -229 409 77
6492 77 -243 -331 236 490 -217 -425 -61 212 71 -303 -135 227 -25 -374 17 296 -118 -87 -121 1 121
6513 121 -244 -408 468 431 -66 -632 179 433 -163 -313 183 411 203 -42 -14 10 348 -330 -153 359 227
6534 227 -428 -126 210 70 -295 -619 649 431 -350 -453 -20 308 -90 -251 98 340 158 -276 -50 269
6554 269 514 -14 -270 132 425 -435 -57 102 328 -182 -535 402 232 -279 -526 -35 -59 289 -435 -209
6574 -209 157 34 -370 -276 230 176 -259 -413 107 -2 -345 -150 195 316 172 -502 49 287 181 -475 238
6595 238 332 478 -170 26 100 188 -434 -71 79 73 -133 -473 157 354 -154 -432 -73 214 -138 -402 -169 199
6617 199 -266 -896 106 453 12 -400 -191 110 439 -291 79 572 249 -236 -248 334 236 82 -128 104
6637 104 144 263 -461 -44 144 -5 16 -357 234 309 -254 -205 481 -130 -137 -368 -43 207 -79 -289 225 82
6659 82 60 -212 93 163 511 -316 -110 276 122 -164 -343 189 223 -226 -196 97 333 -207 -557 188 568 115
6681 115 -301 -534 278 275 -281 -206 -29 31 -354 -88 257 179 36 -391 88 350 -145 -265 -73 372 -322 -41
6703 -41 17 473 233 -92 -196 -67 254 -78 -111 582 366 -158 -327 -149 56 56 -111 -185 468 -172 -60 -32
6725 -32 220 7 -420 -153 745 423 -167 -428 243 186 -233 47 419 572 -163 -150 -29 68 69 -161 227 297
6747 297 -145 -549 -250 538 -7 -367 -270 328 238 -179 -204 -143 108 -116 -221 -64 241 -189 -381 -53 258
6768 258 54 -439 -165 189 528 7 293 379 84 -421 -69 -18 495 -78 -529 275 291 -33 -229 -18 242
6789 242 133 -373 -115 484 -69 -336 -280 337 295 -180 -323 361 359 -173 -198 381 391 12 -432 -34 496 70
6811 70 -407 -26 389 189 -571 -118 308 -454 -487 -128 440 -116 -167 -230 326 206 -182 -108 -122 -103 70 -297
6833 -297 -34 323 55 -145 -57 483 50 -162 -296 212 301 -76 -316 13 184 -249 -349 88 379 -180 -111
6854 -111 -239 806 -104 -309 46 478 234 -423 -199 182 166 -197 -496 353 -28 -287 -283 210 60 -35 -491
6875 -491 233 557 335 -260 -25 609 50 -157 -300 217 198 -436 -40 43 161 92 -252 185 473 -80 -397
6896 -397 -159 278 -76 -282 -110 108 371 -124 -355 248 69 -529 -345 318 351 -228 -477 105 382 -119
6916 -119 -443 381 272 112 -324 140 246 -154 -453 -249 246 172 -248 240 66 400 -308 -491 -61 105
6936 105 -148 -306 54 465 135 -82 56 49 13 -619 115 349 191 25 -512 247 332 -42 -374 197 283 148
6958 148 -263 202 488 154 -219 -88 589 31 -463 -15 549 294 -338 -463 612 325 -454 -333 210 362
6978 362 -75 -480 149 284 -97 -427 351 466 332 -191 -101 491 23 -113 -169 266 301 -283 -232 419 402 118
7000 118 -19 218 353 -204 -468 241 364 -184 -263 40 -74 203 -279 -190 234 32 -255 -288 142 -134 -55
7021 -55 -216 200 291 81 -181 245 256 -83 -426 -241 521 48 -233 69 458 188 -125 -193 234 145 -501 -536
7043 -536 17 329 -335 -761 -313 419 39 -331 19 358 -5 -451 -215 395 302 31 -166 90 408 -183
7063 -183 -295 81 52 -203 40 323 320 134 -204 251 444 -256 -447 -155 383 398 -211 -166 69 167 -305 -718
7085 -718 127 337 176 -297 225 470 154 -137 228 656 188 -437 -516 578 154 -41 -191 -139 373 -44
7105 -44 -149 339 -36 -265 -474 192 204 -248 -539 -90 481 233 -394 11 60 -225 -252 -139 27 132 -325
7126 -325 64 23 243 -229 -85 227 182 93 -390 189 490 479 -246 -278 430 143 -173 17 718 352 -8 -348
7148 -348 -74 334 -454 -193 271 260 -185 -174 84 334 147 -345 29 190 365 -259 -97 392 364 -505 148
7169 148 290 258 -50 -410 521 227 -671 -145 188 335 -254 -640 122 415 -86 -411 -423 303 127 -527 -125
7190 -125 113 133 -76 -68 440 320 -92 -433 141 312 -52 -244 -142 189 211 -160 -37 407 483 -379 -284 351
7212 351 156 -213 -282 -14 322 -144 -127 35 394 -22 -475 245 570 -173 -497 -135 164 218 -296 -311 84
7233 84 269 -227 -356 357 619 132 -357 234 537 -112 -224 -141 303 172 -306 -6 43 110 -308 -255 315 263
7255 263 -612 -389 123 438 -156 -306 -44 215 -131 -444 -239 290 -66 -345 -32 136 221 18 26 304 481
7276 481 -88 -137 631 557 -314 -294 -47 230 -129 -253 116 605 148 -142 -289 229 178 -421 -478 450 426 -487
7298 -487 -618 64 155 -189 -254 150 66 -230 -154 -7 548 -284 -74 28 654 79 -534 -260 283 351 -243 -63
7320 -63 196 290 -465 -709 435 246 51 -431 92 160 -268 -173 112 243 4 -217 -354 301 44 -158 -147
7341 -147 287 -77 -465 -54 240 141 -207 -332 366 147 -150 -245 263 266 -2 -127 -63 174 -113 -320 -193 154
7363 154 54 -309 -330 -36 473 52 -131 -75 330 -35 -206 -38 241 64 -91 198 328 89 -136 -313 289
7384 289 546 -429 -498 352 187 -105 -463 16 217 -81 -437 101 334 -47 -511 51 572 -15 -330 16
7404 16 269 264 -340 -227 164 321 -204 -115 82 421 -120 -423 117 374 -156 -199 32 350 112 -236 -171 329
7426 329 168 -316 -323 150 197 -416 -176 58 385 -157 -223 133 277 51 -302 -269 288 224 -497 -339 208 241
7448 241 -216 -165 369 3 -507 -368 67 515 -365 -427 26 630 144 -101 388 115 47 -348 -92 123 -48
7469 -48 -179 81 55 3 -160 -607 -26 480 -52 -573 128 322 70 -223 -351 -24 249 -244 14 139 359
7490 359 -205 -267 540 529 -406 -262 -135 475 46 -647 250 208 16 -167 -140 314 -206 -632 -399 238 -61
7511 -61 -125 26 420 320 -156 -37 194 339 -297 -240 181 244 188 -197 -79 643 -114 49 -141 307 -114 -172
7533 -172 207 395 395 21 -284 46 492 -337 -176 81 351 -83 -252 -14 124 -59 -360 -289 410 251 -514
7554 -514 -103 55 99 -225 -230 136 156 -176 -131 116 531 -17 -214 -151 196 43 -346 -326 436 363 -212 -253 -73
7577 -73 -256 -55 -422 344 -67 -245 -233 123 480 -338 -428 -17 342 68 -510 -81 279 -36 -102 -355 211
7598 211 108 -459 -82 452 359 -445 -385 217 318 -176 -354 48 339 -50 -207 -228 348 -31 -497 -123 -140
7619 -140 285 -508 -153 304 362 132 -441 265 625 104 -506 -54 508 -194 -523 15 228 -29 -231 -112
7639 -112 391 130 -267 -209 436 556 -208 -354 99 143 -160 -278 295 144 -202 -343 207 402 26 -455 -314
7660 -314 292 119 -553 -223 443 240 -134 -337 609 205 -231 -261 208 475 -179 -582 -218 36 -60 -287 -150
7681 -150 177 -106 -190 -192 521 42 -415 -20 259 -88 -199 -192 -64 64 -81 -248 103 524 131 -6 220 544
7703 544 85 -260 -162 405 292 -19 -137 118 56 -229 -131 -59 -12 28 -398 112 101 -237 -131 -297 296 27
7725 27 -22 -115 345 230 -356 113 542 515 -97 -308 129 198 -54 -477 156 299 -204 -206 469 424 101 -359 196
7748 196 271 -39 -433 -55 221 206 -257 -333 -53 139 -374 -232 61 190 -85 -598 5 425 -195 -297 -266
7769 -266 229 309 -311 -304 287 323 -147 -73 77 -5 -325 -74 266 384 -108 -201 103 562 89 -313 -340 415 165
7792 165 -379 90 257 -49 -387 -110 -4 12 60 99 -24 341 -391 -354 82 339 -217 -64 -137 103 217 -126
7814 -126 -17 237 130 -108 -309 163 157 73 -471 71 311 99 -289 41 504 -1 -6 -53 34 91 -200 -233 194
7837 194 266 -88 -118 69 282 -175 -217 210 195 -13 -130 -48 483 114 -100 -146 288 90 -236 -60 280 27
7859 27 -395 -143 321 172 19 -240 -179 355 30 117 -209 72 -244 -440 59 191 153 -305 -22 141 138 -210
7881 -210 -410 510 210 -62 -84 424 231 90 -60 308 399 177 -398 101 469 115 -130 -401 207 63 -183
7902 -183 -81 13 -189 -9 -317 79 153 -62 -233 86 282 16 -150 -79 378 9 -392 -211 580 72 -65
7923 -65 -198 451 168 10 -316 256 189 -183 -261 116 261 -231 -136 86 145 81 -113 37 466 -28 -265 -35
7945 -35 299 222 -96 -220 90 -81 107 -562 219 455 -129 -212 -71 279 -16 8 -75 381 -194 19 -204 404
7967 404 237 -249 -195 -121 -67 -190 -342 246 282 2 266 -3 490 -33 -647 -306 171 -151 -323 -73 290
7988 290 175 -158 -182 34 250 45 -52 202 249 -373 -234 -21 566 192 -299 -26 206 -63 -87 -86 464 -31
8010 -31 -285 128 2 94 120 -468 155 144 -217 -371 153 512 -119 -216 52 443 -25 -298 270 -4 305 66
8032 66 44 140 -190 -168 -314 111 209 -90 -172 -126 190 133 -516 -183 65 -161 -558 34 287 -20 -61 -179 329
8055 329 169 -202 -236 59 174 -102 -47 4 310 52 -16 118 281 131 61 304 72 -33 -195 -136 480 122
8077 122 -47 -46 129 357 63 -64 153 152 -60 -490 19 428 -19 -236 -278 265 86 -380 -3 287 333 -265
8099 -265 37 224 140 -394 -29 245 431 -109 -151 -12 403 154 -293 181 122 158 -153 -341 121 110 -448 -49
8121 -49 284 158 -250 -219 -17 173 -18 -246 -135 49 191 2 72 4 294 -113 59 28 46 -59 11 117
8143 117 47 95 -52 100 452 -128 20 207 386 -252 -137 -238 186 435 -177 -11 266 22 -148 -193 368
8164 368 371 -387 -95 -141 110 36 -61 118 392 323 49 83 321 -29 154 -111 353 149 -249 -284 371 250 89
8187 89 -191 59 280 -197
8191a97
##END NTUPLES=NMR FID
##END=
