##TITLE=1H_LR-644-K2
 CDCl3, 8 sc, 
 26.2.2020
##JCAMPDX= 6.0         $$ Bruker NMR JCAMP-DX V2.0
##DATA TYPE= NMR FID
##DATA CLASS= NTUPLES
##ORIGIN= UXNMR, Bruker Analytische Messtechnik GmbH
##OWNER= root
$$ XWIN-NMR		Version 3.5
$$ Wed Feb 26 14:38:58 2020 Russian Standard Time (UT+4h)  she@DPX200
##.OBSERVE FREQUENCY= 200.1315
##.OBSERVE NUCLEUS= ^1H
##.DELAY= (6, 6)
##.ACQUISITION MODE= SIMULTANEOUS
##.ACQUISITION SCHEME= undefined
##.AVERAGES= 8
##.DIGITISER RES= 18
##SPECTROMETER/DATA SYSTEM= spect
##.PULSE SEQUENCE= zg30
##.SOLVENT NAME= CDCl3
##.SHIFT REFERENCE= (INTERNAL, CDCl3, 0, 15.7039)
##AUDIT TRAIL= $$ (NUMBER, WHEN, WHO, WHERE, WHAT)
$$ ##TITLE= Audit trail, XWIN-NMR		Version 3.5
$$ ##JCAMPDX= 5.01
$$ ##ORIGIN= Bruker BioSpin GmbH
$$ ##OWNER= she
$$ F:/spectra/data/she/nmr/H-F/1/audita.txt
$$ ##AUDIT TRAIL=  $$ (NUMBER, WHEN, WHO, WHERE, WHAT)
(   1,<2020-02-26 14:37:33.70 +0400>,<she>,<DPX200>,
      <created by zg, POWCHK disabled, PULCHK disabled
       configuration hash MD5:
       00 E9 B6 7A A2 85 ED C7 34 08 36 98 17 FE 4E 26
       data hash MD5: 16K
       F0 1D 73 61 3E 94 39 67 45 5E 6E 1D 54 4C 22 F0>)
$$ ##END=
$$ 
$$ hash MD5
$$ 34 E8 EB 75 9C 51 B1 E1 A2 B8 9C 95 8A 35 76 B5
##$RELAX= 
##$RELAX= 
##$RELAX= 
##$RELAX= 
##$RELAX= 
##$RELAX= 
$$ Bruker specific parameters
$$ --------------------------
##$DU= <F:/spectra>
##$EXPNO= 1
##$NAME= <H-F>
##$PROCNO= 1
##$TYPE= <nmr>
##$USER= <she>
##$AMP= (0..31)
100 100 100 100 100 100 100 100 100 100 100 100 100 100 100 100 100 100 
100 100 100 100 100 100 100 100 100 100 100 100 100 100 
##$AQSEQ= 0
##$AQ_mod= 1
##$AUNM= <au_zg>
##$AUTOPOS= <>
##$BF1= 200.13
##$BF2= 200.13
##$BF3= 200.13
##$BF4= 200.13
##$BF5= 200.13
##$BF6= 200.13
##$BF7= 200.13
##$BF8= 200.13
##$BYTORDA= 1
##$CFDGTYP= 0
##$CFRGTYP= 5
##$CHEMSTR= <none>
##$CNST= (0..31)
1 1 145 1 1 1 1 1 1 1 1 1 1 1 1 1 1 1 1 1 1 1 1 1 1 1 1 1 1 1 1 1 
##$CPDPRG= <>
##$CPDPRG1= <>
##$CPDPRG2= <>
##$CPDPRG3= <>
##$CPDPRG4= <mlev>
##$CPDPRG5= <mlev>
##$CPDPRG6= <mlev>
##$CPDPRG7= <mlev>
##$CPDPRG8= <mlev>
##$CPDPRGB= <>
##$CPDPRGT= <>
##$D= (0..31)
0 1.2 0 0 0 0 0 0 0 0.06 0 0.03 0 0 0 0 0.0002 0 0 0 0 0 0 0 0 0 0 0 0 
0 0 0 
##$DATE= 1582713452
##$DBL= (0..7)
120 120 120 120 120 120 120 120 
##$DBP= (0..7)
150 150 150 150 150 150 150 150 
##$DBP07= 0
##$DBPNAM0= <>
##$DBPNAM1= <>
##$DBPNAM2= <>
##$DBPNAM3= <>
##$DBPNAM4= <>
##$DBPNAM5= <>
##$DBPNAM6= <>
##$DBPNAM7= <>
##$DBPOAL= (0..7)
0.5 0.5 0.5 0.5 0.5 0.5 0.5 0.5 
##$DBPOFFS= (0..7)
0 0 0 0 0 0 0 0 
##$DE= 6
##$DECBNUC= <off>
##$DECIM= 24
##$DECNUC= <off>
##$DECSTAT= 4
##$DIGMOD= 1
##$DIGTYP= 9
##$DL= (0..7)
0 120 120 120 120 120 120 120 
##$DP= (0..7)
150 150 150 150 150 150 150 150 
##$DP07= 0
##$DPNAME0= <>
##$DPNAME1= <>
##$DPNAME2= <>
##$DPNAME3= <>
##$DPNAME4= <>
##$DPNAME5= <>
##$DPNAME6= <>
##$DPNAME7= <>
##$DPOAL= (0..7)
0.5 0.5 0.5 0.5 0.5 0.5 0.5 0.5 
##$DPOFFS= (0..7)
0 0 0 0 0 0 0 0 
##$DQDMODE= 0
##$DR= 18
##$DS= 0
##$DSLIST= <SSSSSSSSSSSSSSS>
$$ [...]
##$SUBNAM2= <"">
##$SUBNAM3= <"">
##$SUBNAM4= <"">
##$SUBNAM5= <"">
##$SUBNAM6= <"">
##$SUBNAM7= <"">
##$SUBNAM8= <"">
##$SUBNAM9= <"">
##$SW= 24.9337058887773
##$SWIBOX= (0..15)
0 0 2 0 0 0 0 0 0 0 0 0 0 0 0 0 
##$SW_h= 4990.01996007984
##$TD= 16384
##$TD0= 1
##$TE= 0
##$TE2= 300
##$TE3= 300
##$TEG= 300
##$TL= (0..7)
0 120 120 120 120 120 120 120 
##$TP= (0..7)
150 150 150 150 150 150 150 150 
##$TP07= 0
##$TPNAME0= <>
##$TPNAME1= <>
##$TPNAME2= <>
##$TPNAME3= <>
##$TPNAME4= <>
##$TPNAME5= <>
##$TPNAME6= <>
##$TPNAME7= <>
##$TPOAL= (0..7)
0.5 0.5 0.5 0.5 0.5 0.5 0.5 0.5 
##$TPOFFS= (0..7)
0 0 0 0 0 0 0 0 
##$TUNHIN= 0
##$TUNHOUT= 0
##$TUNXOUT= 0
##$USERA1= <user>
##$USERA2= <user>
##$USERA3= <user>
##$USERA4= <user>
##$USERA5= <user>
##$V9= 5
##$VALIST= <valist>
##$VCLIST= <CCCCCCCCCCCCCCC>
##$VD= 0
##$VDLIST= <DDDDDDDDDDDDDDD>
##$VPLIST= <PPPPPPPPPPPPPPP>
##$VTLIST= <TTTTTTTTTTTTTTT>
##$WBST= 1024
##$WBSW= 4
##$XGAIN= (0..3)
0 0 0 0 
##$XL= 0
##$YL= 0
##$YMAX_a= 76202
##$YMIN_a= -62280
##$ZGOPTNS= <>
##$ZL1= 120
##$ZL2= 120
##$ZL3= 120
##$ZL4= 120
##$ABSF1= 10
##$ABSF2= 0
##$ABSG= 5
##$ABSL= 3
##$ALPHA= 0
##$AQORDER= 0
##$ASSFAC= 0
##$ASSFACI= 0
##$ASSFACX= 0
##$ASSWID= 0
##$AUNMP= <proc_1d>
##$AZFE= 0.1
##$AZFW= 0.1
##$BCFW= 1
##$BC_mod= 2
##$BYTORDP= 1
##$COROFFS= 0
##$CY= 11.3945322036743
##$DATMOD= 1
##$DC= 2
##$DFILT= <>
##$DTYPP= 0
##$F1P= 16.9975609425685
##$F2P= -3.02152046262296
##$FCOR= 0.5
##$FTSIZE= 0
##$FT_mod= 4
##$GAMMA= 1
##$GB= 0.15
##$INTBC= 1
##$INTSCL= 1
##$ISEN= 128
##$LB= 0.24
##$LEV0= 0
##$LPBIN= 0
##$MAXI= 10000
##$MC2= 0
##$MEAN= 0
##$ME_mod= 0
##$MI= 1.114404
##$NCOEF= 0
##$NC_proc= 0
##$NLEV= 6
##$NOISF1= 3.799351
##$NOISF2= 2.8
##$NSP= 1
##$NTH_PI= 0
##$NZP= 0
##$OFFSET= 15.70392
##$PC= 1
##$PHC0= -9786.566
##$PHC1= 9.800819
##$PH_mod= 1
##$PKNL= yes
##$PPARMOD= 0
##$PSCAL= 0
##$PSIGN= 0
##$REVERSE= no
##$SF= 200.130013532006
##$SI= 16384
##$SIGF1= 3
##$SIGF2= 2
##$SINO= 400
##$SIOLD= 16384
##$SREGLST= <1H.CDCl3>
##$SSB= 0
##$STSI= 0
##$STSR= 0
##$SW_p= 3612.71676300578
##$SYMM= 0
##$S_DEV= 0
##$TDeff= 0
##$TDoff= 0
##$TI= <>
##$TILT= no
##$TM1= 0
##$TM2= 0
##$TOPLEV= 0
##$USERP1= <user>
##$USERP2= <user>
##$USERP3= <user>
##$USERP4= <user>
##$USERP5= <user>
##$WDW= 1
##$XDIM= 8192
##$YMAX_p= 0
##$YMIN_p= 0
$$ End of Bruker specific parameters
$$ ---------------------------------
##NTUPLES= NMR FID
##VAR_NAME=  TIME,          FID/REAL,        FID/IMAG
##SYMBOL=    X,             R,               I
##VAR_TYPE=  INDEPENDENT,   DEPENDENT,       DEPENDENT
##VAR_FORM=  AFFN,          ASDF,            ASDF
##VAR_DIM=   8192,          8192,            8192
##UNITS=     SECONDS,       ARBITRARY UNITS, ARBITRARY UNITS
##FACTOR=    0.0002004,     1,               1
##FIRST=     0,             0,               0
##LAST=      1.6414764,     0,               0
##MIN=       0,             -62280,          0
##MAX=       1.6414764,     76202,           0
$$ Real data points
##PAGE= N=1
##DATA TABLE= (X++(R..R)), XYDATA
$$ [...]
2452B614l858k111K011L401Q46k028k899o45K701K441r20k073j083M57J518O91
2468A063o81l16n74m41J81O95J224K0j373j818j66K337K326q00k833k539J707
2485a988L555K225k927l999q30L170M051J23m185k793P16L985K060j725l063j324
2501b949J588K444P91j610j479n08O63Q24Q74J13l61j562r94J243K577R83k044
2518E93l147o00K863L695j28l968l223O74M652K922j802m854j866K559M666R83
2534D019l318l571k60L289K917m85k868j969M99K523J231k48j232j352m26Q43
2550d08J574J314q06k441j718J010L302J816j731l682j963K499M429J374l848
2565G21m334k4M117L880p66m516l037J665M489J983k479l678j132K296K585R43
$$ plain form
2452 2614 -1244 -3355 -1344 2057 2903 875 -2024 -2669 32 2473 1553 -520 -1603 -1146 372 1063
2468 1063 382 66 -508 -949 -768 -73 1151 1171 -202 -2020 -2186 151 2477 1677 -1156 -3695 -1988
2485 -1988 1567 3792 865 -3134 -3964 -794 3257 3380 -805 -3598 -2882 1103 3163 1438 -1625 -2949
2501 -2949 -1361 1083 1874 264 -1215 -1723 -1060 -236 638 751 390 -1172 -2166 -923 1654 2637 593
2518 593 -2554 -3154 -291 3404 3276 -692 -3915 -3241 1411 4333 2531 -2323 -4189 -1630 3036 4019
2534 4019 701 -2870 -3130 159 3076 2591 -277 -2246 -1747 776 2007 1759 527 -825 -1251 -408
2550 -408 1166 2480 1674 -767 -2485 -1475 1827 3643 1912 -1770 -3733 -1234 3195 4569 721
2565 721 -3613 -3637 480 4360 3594 -922 -3959 -2294 2195 4178 1699 -1979 -3111 -815 1770 2713
2581B713j705k485m49J267J539P61l56j435k048J55J811K196N73k861k992L96
2597b920L297K786m34l951l235J666M629K434k450m786j424L168M122O85l678
2612i1l636R22L186K530r35l017j791P97K449J053l32j246j308j83Q59J422Q09
2629A488o72k207j253J298K933J276j720l571j074K705L682N34l789l531R04L753
2645G56K938j378m190j589K155L242J419k591k868n15K634J810J20j870j350L60
2661i17Q30P40K89q9r45p73m68J607J637K09j984k059J14K464K557r17l102k196
2679c003J529L810J079k644k871q34K968L209o40k936k139J084K857J070j629
2694I10k012l47J121J279Q3n69n79j14r0J38O43L44K4j304q92L64J791J114j055
$$ plain form
2581 2713 1008 -1477 -1926 -659 880 1641 1285 -150 -2198 -2043 -232 1964 2537 -324 -3316 -2920
2597 -2920 377 3163 2729 -1222 -4457 -2791 1838 4272 1822 -2964 -4388 -1220 2902 3587 -91
2612 -91 -3727 -2805 381 2911 1976 -1041 -2832 -2035 414 1467 1135 -111 -1419 -1602 -743 679 1488
2629 1488 816 -1391 -2644 -1346 1587 2863 1143 -2428 -3502 -797 2885 3419 -370 -3901 -2997 756
2645 756 3694 2316 -1874 -3463 -1308 1934 3353 762 -2106 -2621 13 1823 1943 73 -1277 -917
2661 -917 -87 653 942 853 -92 -865 -1333 274 1911 2120 136 -1923 -1809 655 3212 2295 -807 -3003
2679 -3003 -1474 2336 3415 771 -2100 -2934 34 3243 2603 -333 -2472 -1388 1469 2539 910
2694 910 -1102 -1449 -328 951 1034 465 -114 -228 -318 -180 463 807 831 -473 -1365 -1001 790 1904 849
2713H49k212j025K300K074K20k405k455R95K686J573j580k696r56K236K182l67
2729A419j487j763O01K024L07r87q13j52P83N42n05l84K7N48m10p57n6J168Q47
2748I52p28j581r7J175J843n18j970j116J000J973Q29j682k154K22K528J079j150
2765F05j745l81J403J402m99j362r12J284J163j75j327m19R58Q48q2j292m62R08
2783h5P35K91j190j014J079J118M78j592q04N97J179P35j285j187M23J304M76
2800A258q91j467P80J472L5j092r19N65Q98R10j291j197j35J803J228r65j810
2817h18n62J486J636k60j789j015P33K066J76j403j180pJ202R38r72o86K29M92
2835B66K45o05r4J55M41Q3j027j51N07J318l76j776n74P13K363N26k091j829j9
$$ plain form
2713 849 -1363 -2388 -88 1986 2206 -199 -2654 -1659 1027 2600 1020 -1676 -2632 -396 1786 1419
2729 1419 -68 -1831 -1230 794 1101 114 -699 -851 -68 474 -31 -415 -388 160 -250 -1007 -1063 105 952
2748 952 224 -1357 -1454 -279 1564 1046 -924 -2040 -1040 933 1762 80 -2074 -1852 676 1755 605
2765 605 -1140 -1521 -118 1284 785 -577 -1489 -205 958 783 -544 -963 -5 843 761 -531 -993 -85
2783 -85 650 941 -249 -1263 -184 934 1412 -180 -984 -387 792 1527 242 -945 -522 782 1258
2800 1258 367 -1100 -320 1152 1187 95 -824 -259 639 1549 258 -939 -1074 729 1957 992 -818
2817 -818 -1380 106 1742 1482 -307 -1322 -589 1477 1653 250 -930 -937 265 1203 231 -455 -226 266
2835 266 511 -94 -188 -33 408 491 -536 -687 -180 1138 762 -1014 -1588 -875 1488 2014 -77 -1906 -1925
2854a925K622J521r52k854o54J105K530O17k133j788j2K286J217r29j040r61Q31
2871e19P03L03m60k53k94l83K49L17P14L22j115j153j77J864J721m99k657j591
2889b908J691K783R67k148l060J13K452K801o79l128j553Q70K935J115j232k566
2905a547n72J698J497J50j299p47k22P87P79N2J45p42p39l73O44J762N47j556
2923B64j935k63K079K477m79k530k193N51L679J831j984l380r16K208L074L24
2939B807k351k909L02K671J887n68k204j248P05J492Q73l8j022j114J54MJ410
2956H51P91o32j600j044P28K318J226j793k389j430K056L536M82k840l240J88
2972b792L651K206r64l384j955J787L004J121j796k895l20J664K091L43j517j363
$$ plain form
2854 -1925 697 2218 1266 -1588 -2242 -1137 1393 2010 -123 -1911 -1923 363 1580 651 -389 -1350 -519
2871 -519 184 487 27 -226 -520 -903 -654 -337 377 699 -416 -1569 -1746 118 1839 1340 -1317 -2908
2889 -2908 -1217 1566 2533 385 -2675 -2562 -110 2691 2012 -1116 -2669 -1799 1136 2251 1019 -1547
2905 -1547 -2119 -421 1076 1226 -73 -820 -1042 -255 524 576 721 -21 -760 -1133 -489 1273 1820 264
2923 264 -1671 -1934 145 2622 2143 -387 -2580 -2029 1650 3481 1497 -1883 -2799 -591 2483 2807
2939 2807 456 -2453 -2151 520 2407 1839 -365 -1613 -908 584 1457 1419 397 -717 -563 -559 851
2956 851 1642 1010 -590 -1634 -906 1412 2638 845 -1544 -2974 -918 2618 3100 260 -2980 -2792
2972 -2792 859 3065 2101 -1283 -3238 -1451 1553 2674 878 -2017 -2337 -673 1418 1761 244 -1119
2988a119l2M33J279M58l71r59j489L31J554J564k28j825j957M16K474K179j122
3005A586l095j896J713L671J293k567l409n00K913K759o7k813k532P44K603J764
3021B167n83k530j153J039J423R65n06r24j137m6Q40J357K03m80j800p94J255
3038g04K102R08j618k811p45K653K757J82l344k276Q50L222J958j329l332j365
3054b892K079K980J87j858k275J61J353J608N33j732r58R7L06J173M07o76n09
3071a6q52O0J420Q63m9j672j582O40K233J637j265k590j330J899K730N94k160
3088E60k722O3K558K107q39k559j226J091J962R83j454j474n16J120J110M9m66
3105C47m97o06K50K91O84L37k09j333r32Q48J672O48j486j758j84J622J799K21
$$ plain form
2988 -1119 -1151 -718 561 1019 648 -311 -1800 -1469 85 1649 1421 -404 -2361 -1945 529 2708 1586
3005 1586 -1509 -3405 -1692 1979 3272 705 -2704 -3204 -291 2468 2401 -412 -2944 -2200 403 2167
3021 2167 1584 -946 -2099 -1060 363 1328 822 -102 -1239 -1285 -445 912 1115 635 -1165 -1959 -704
3038 -704 1398 2306 688 -2123 -2868 -215 2542 2724 -620 -2896 -2046 1176 3134 1805 -1527 -2892
3054 -2892 -813 2167 2354 496 -1779 -1618 -265 1343 1876 144 -814 -717 -411 762 1169 493 -16
3071 -16 -868 -808 612 1475 1426 -246 -1828 -1188 1045 2682 1417 -1173 -2503 -604 2126 2720 560
3088 560 -2162 -2099 459 2566 1727 -832 -2058 -967 995 1978 524 -950 -1466 -346 764 813 347
3105 347 -150 -756 -506 -215 469 806 597 -736 -1668 -820 852 1500 14 -1744 -1928 -306 1493 1714
3123A714k286j893R23K779Q38j285k676m80K147J562n1j761j210P86J086Q00q35
3140A58o86J09k05P29P1k79O2k67J49o10K92R14J99r21p32L65P90J170o72j570
3160i34p92J153J553N44j566j574M37J624J161q83j557m41J131J264k91q88r23
3177i82N86J069Q6p05m56M24O73k54r79j28J207J9k88p53j21Q26O75q3j226k51
3197f61Q65Q27P1j228p12K75J307L27r19p80K73J075N49r64r69J23J243K55k52
3216G05j566J49J306M49l94j522l11J375Q46l34j094o52Q69R25J04q63p44K10
3234e42J007N22r48q07N04N52K17p37k17L38L94J07o11n72N01R41j4j513l79O74
3254e83J367N01j559j098j11J936J064j072j604o10J213J793j38j255j215K66
$$ plain form
3123 1714 -572 -2465 -1542 1237 2075 790 -1886 -2366 -219 1343 1292 -469 -1679 -893 193 993 158
3140 158 -528 -419 -624 105 176 -103 -41 -308 -159 -769 -477 437 636 -285 -1017 -652 138 1308 636 -934
3160 -934 -1726 -573 980 1524 -42 -1616 -1179 445 1606 723 -834 -1275 -144 1120 829 -59 -982
3177 -982 -396 673 759 54 -402 22 695 441 -538 -666 541 560 272 -481 -602 224 899 816 -410 -661
3197 -661 204 1031 1102 -126 -838 -563 744 1071 152 -628 -355 720 1269 305 -664 -541 702 957 705
3216 705 -861 -712 594 1043 649 -873 -1184 191 1037 703 -391 -1043 -174 751 855 -8 -752 -542
3234 -542 465 987 39 -768 -264 288 505 -232 -449 -111 283 390 -221 -793 -292 649 635 -878 -1257 -583
3254 -583 784 1285 -274 -1372 -1483 453 1517 445 -1159 -1769 -556 1237 1099 -156 -1371 -1105
3270a105J523O91o49j206k03N50N83J62n43o6j7K26n02L26O33J1o55p75n3J532
3290D63J116l84j889q83R36J881L63j466j970R3K142J442l32k243j171R98K045
3307A141M08n43j981l73J509J024j17r94o16K5L39O99j1J53l29o57l16O14J098
3326A073M45j238j479q2J798J611p83j786j522Q27K643R53j544k233o87J853K260
3343B109j71j861j742L12J833J170n56j600p54O23J200N30o63l52o83j66M73P08
3361D10R18r30j160n56O84J716O09j063k422m42J878K123K47k431k180P05K723
3378H29J702j217k509j452J554K166Q10j416j759m63J324J655R7j246j395K70
3394a050L18R45R72o14j011o92J26J220J162j70j503j592O23J865J248r11k263
$$ plain form
3270 -1105 418 1109 460 -746 -949 -399 184 346 -197 -263 -280 -54 -556 -230 403 414 -241 -1016 -1069 463
3290 463 1579 1195 -694 -1577 -641 1240 1603 137 -1833 -1740 402 1844 1512 -731 -1902 -904 1141
3307 1141 1549 1006 -975 -1348 161 1185 1068 74 -542 -517 -178 521 510 663 334 -323 -639 -25 1073
3326 1073 1518 280 -1199 -1281 517 2128 1345 -441 -1963 -1136 1507 2460 916 -1317 -2004 -151 2109
3343 2109 1938 77 -1665 -1353 480 1650 1094 -506 -1260 -637 563 1093 430 78 -605 -771 -298 410
3361 410 1328 398 -762 -1318 -634 1082 1691 628 -1794 -2236 -358 1765 2012 -419 -2599 -1894 829
3378 829 2531 1314 -1195 -2647 -1093 1073 1883 467 -1292 -1755 -431 1224 1321 75 -1320 -1050
3394 -1050 -732 213 1185 571 -440 -1132 -1006 214 1376 1206 -297 -1889 -1266 599 1847 936 -1327
3411a327j235J544K593R92j816l013KK057K245l54k023j680N27K171R05o14j789
3428h15p45J123R58Q04l68j300k27l59Q79Q36M11q70j137n21J049J688K53j189
3446D70j912m04K220J830k88k311j760R31K222J408j238k425r76J750K351L38
3462B206j757j702N5J116J524j23j095j075J73N75P27K45k48j115l41K10J150
3479E25R30l88j626j056P65J641J028r46k012q39J252K283M79j849k207J92K268
3496D40J041k70j788j418J086J618P90j021j325j34N28R97O6m50m10m09K5M80
3514a54L97N52p01o27n25N91J557L8j344j390m2J957J218l93j895r40R43J818
3532A060M63j077j631o40J804J219l12j146j020L94J245O42q50n80k12N09L77
$$ plain form
3411 -1327 -2562 -1018 1575 2567 751 -2262 -2260 -203 2042 1688 -335 -2015 -1488 683 1588 974 -815
3428 -815 -1560 -437 521 1325 957 -343 -570 -929 -50 786 1197 327 -810 -1331 -282 1406 1659 470
3446 470 -1442 -1846 374 2204 1916 -395 -2155 -1224 998 2406 1168 -1257 -2233 -483 1868 2206
3462 2206 449 -1253 -1198 -82 1442 1319 224 -851 -678 -103 624 869 621 -494 -835 -625 525
3479 525 1455 1067 -559 -1615 -850 791 1819 873 -1139 -1978 -726 1557 2036 187 -2020 -1828 440
3496 440 1481 1211 -577 -1995 -909 709 1499 478 -847 -981 -453 544 610 160 -250 -659 -634 -154
3514 -154 243 795 94 -533 -1058 -467 1090 1128 -216 -1606 -1648 309 1527 1134 -761 -1701 -758 1060
3532 1060 1523 446 -1185 -1825 -21 1198 886 -260 -1280 -886 359 1001 151 -429 -641 -132 245
3549B45j64o1K03k91n51M29L30M48Q4p75q83N30J036R16q80j326p93J323J383
3568A203K81j740j204P83J486P50r70j241j4P00J031j79r92l74L03P32l7n74L7
3587a9N4J40j23k78K87L03P3m35p68L43J196J11p52j094M46M57J067l8j417m62
3607i09N22Q44L26p88p15L62N54P47p23j084N64K45P16l30p48j35L22O16j1p53
3627c78m01Q51M05m51o88k43N83O84J21j033p9L76P01l52l71m72M17N97L5o20
3647c18n79N96M19J38l50q36P37P41k63p12m98N15R93J48r32p41K29J145N51p04
3667B79r92k66P41R01l48m85o80J96J265J70n95n97N4M37K24k7l71P4J15m4j80
3688a29KM36O3l13o52o0J111M83k69j305k59O69J457P5j246j386N69J268P03r5
$$ plain form
3549 245 81 20 223 -68 -619 -190 140 588 672 -103 -986 -456 580 1496 616 -710 -1503 -180 1203
3568 1203 1484 -256 -1460 -677 809 1559 589 -652 -666 34 1065 886 -106 -480 -177 555 518 -56 -19
3587 -19 35 175 52 -226 61 364 437 2 -766 -423 773 884 132 -962 -516 -59 1008 970 -447 -909
3607 -909 -387 457 783 -5 -720 -358 196 943 220 -864 -300 -55 661 331 -417 -552 -230 386 375 -378
3627 -378 -779 72 477 26 -662 -905 -322 362 483 -550 -629 -253 448 96 -275 -747 -330 267 302 -318
3647 -318 -897 -301 118 256 -94 -930 -193 548 285 -427 -925 -410 583 731 -201 -942 -713 432 983 279
3667 279 -713 -979 -238 663 315 -170 -850 -654 611 781 186 -411 -357 80 304 277 -94 -20 95 51 -129
3688 -129 -127 309 372 59 -593 -653 458 941 672 -633 -892 -223 1234 1309 63 -1323 -754 514 1217 1122
3708A122j676q01R82J347J19r61p42j35R81R25n53k11o79O4J40J79L44Q0k88m14
3728a77l82M61R20M74j314q36N3R95J083k6j712j315J142J772Q00j741j553j75
3746a531J286J556l9j597j264M90J481O78l05j411j77M68N74M49k11m46n88J09
3764d78Q3R58J3l05r13l03O74J246J3q17j427l31J509J380l62j199j732O69J786
3783D64J237j044j766o82J145J586N72j503j303j40J314Q84L1r87m08l78M99P72
3801B93J06O6p73p71K15J123Q61l23j306p33K71J707J068r45j671q00J277J738
3819A403L62j551j850J66J551J707n72j697j168R86J315N40n28j187n83N73J178
3836F45K76j98r09n72K56P90M13J80o74q61k15R50J185N5j204j390J00J503J468
$$ plain form
3708 1122 -554 -1355 -373 974 1093 132 -610 -745 236 1161 608 397 -282 -218 -78 101 445 525 237 -177
3728 -177 -559 -98 822 1296 -18 -854 -801 194 1277 1251 -461 -1776 -634 1138 1938 197 -1356 -1531
3746 -1531 -245 1311 1272 -325 -1589 -1099 382 1060 755 -656 -833 -365 209 658 447 1 -587 -478
3764 -478 -395 563 576 271 -642 -945 -271 975 988 171 -1256 -1587 -78 1302 940 -259 -1991 -1322 464
3783 464 1701 657 -1109 -1791 -646 940 1512 9 -1294 -1434 -120 764 795 -192 -600 -978 -479 293
3801 293 399 465 -308 -1079 -864 259 1120 797 -509 -1242 -971 736 1804 859 -812 -1612 -335 1403
3819 1403 1765 214 -1636 -1470 81 1788 1216 -481 -1649 -663 652 1192 664 -523 -1106 -533 645
3836 645 921 723 -186 -758 -502 288 701 881 207 -654 -869 81 1266 1321 117 -1273 -1173 330 1798
3855A798n32j791j146J019J750P99j133j685p80J422J575J59j440j022m8J040
3871a5J232j91r04j227N16N34N60K22o96p09r5J87J111L06k15j139p16N48J176
3890D85Q32j099j370k74J149J563M33k024j335J12K018Q96p29j849j10N77J004
3907B79O71q64j013j44O13P31K99m45m15m77J83P49N15r8o41n21l63Q98Q85J62
3927A004j433o54J20J195J193n50j554p60P86J464N39p79j620j56J204J144l1
3944A112j465m17K57J200J37p56k90k42M25M98J15l27k49m5q2l14O34L82Q1r42
3964b88l84K65J014O76q74j048k16Q86Q62K78j329r57O15J107Q22r41j377rQ35
3983f3Q21L21j078l43K0L46L62k96k31j24O63k99j89J93K20K2o80r2J45P27R8
$$ plain form
3855 1798 1266 -525 -1671 -652 1098 1897 764 -921 -1701 -279 1296 1455 15 -1007 -1055 -15
3871 -15 1217 1026 122 -1105 -589 -55 505 727 31 -678 -773 -586 525 831 616 -523 -1239 -691 485
3890 485 1317 218 -1152 -1426 -277 1286 1719 -305 -1640 -1528 490 1386 657 -1192 -1302 -725 279
3907 279 950 86 -927 -1071 -458 273 572 127 -288 -765 -582 167 682 584 -57 -578 -941 -43 842 1004
3927 1004 -429 -1083 -963 232 1425 875 -679 -1439 -653 811 1350 571 -1049 -1205 -1 1143 1112
3944 1112 -353 -770 -513 687 824 68 -222 -464 -39 459 574 247 -2 -47 -129 -443 191 573 654 -288
3964 -288 -672 -407 607 1283 409 -639 -855 31 893 1171 -158 -1115 -500 607 1429 488 -889 -898 -63
3983 -63 758 1079 1 -342 -322 24 386 90 -141 -265 398 99 -90 103 323 345 -335 -427 -282 445 543
4004E43n39o28j21J064O28o01p87o53O89R74K17q33p88L57J045j60k33m76l09
4023f11N02P05k45r21Q8N27J38k45q0k00L46K86j60l64k80O22J57j17o10J71L8
4044b53M16j4n66J87p3N21P89j362m49L58R42j11o69j82J27O45L33p87l72M61
4064e9M39K21m81p66K14P20M10n85q11L88O75K03j25p84l86N85N25R5m98j73N1
4085a42L56K48k38k74J17J50k36k19K4O77J60j94p62lN96M88k12o43l04L48P76
4106G13l3p73o61K11Q97M17j11j487j91O57J307l93k89n37l88R30L31l58l85q2
4126b25kK65q7MR6o4m7m33M26K55J91l21r04q1J188O90l43j024o63N18J403M51
4148A293j416o86j76J027R22j67j261n65P4J303M87l68q72l19O22K74K23l17n20
$$ plain form
4004 543 4 -624 -745 319 947 346 -441 -1094 -405 569 786 -47 -835 -478 567 407 174 -302 -611
4023 -611 -109 596 351 -570 -482 45 183 -62 -142 -342 4 290 130 -234 -514 108 265 148 -462 -291 -253
4044 -253 163 149 -417 -230 -303 218 1007 -355 -804 -446 496 385 -284 -466 -339 306 639 -148 -520 -59
4064 -59 380 601 120 -646 -432 288 698 113 -698 -310 365 568 443 -341 -727 -142 383 478 -20 -193 -142
4085 -142 214 462 224 -50 67 217 -19 -238 -214 463 623 429 -333 -336 260 748 536 -107 -411 -63 713
4106 713 680 -93 -754 -543 354 771 660 -827 -1018 -361 946 553 264 -273 -661 269 600 242 -143 -225
4126 -225 -227 38 -49 -45 51 -13 -60 -493 -67 188 379 58 -846 -927 261 951 608 -416 -1079 -561 842 1293
4148 1293 -123 -809 -985 42 964 797 -464 -1029 -955 348 835 467 -405 -724 -102 172 395 78 -442
4167d42R0k31M64L32p2j4r02N4M15P10L94q41q47m00J458J121l15j434r55M10
4187a005J493O74o60j248n05P69J585j26q75j215N16M29Q89l57l97l81%L89O95
4206F70J32k02p04n27M17M93P62o28n09p51L76J192L81m20j589n99J449J161L39
4225A443j281j494M45J050J186m19j563o67J008J039N31q88r58k81O51N55M52
4242H09l74m82l01j08O96J44M14n03q52q5O51R89lq53j302M62Q00J424o18j445
4262e37r15O02J651N24p04j616n56J386J218j39r18j042J61P97Q94l06p59m40
4280f99J41K83N13L19l89o56j93M08Q27M1l69r14m19N12J146N66r70j119m77J729
4300B80R06k48j226j190P05J329O31n48j315n85M33J573K28p35p89n46Q66O18
$$ plain form
4167 -442 -352 -583 -119 213 141 127 -775 -721 -306 404 798 -43 -890 -1290 168 1289 974 -460 -1415 -1005
4187 -1005 488 1162 502 -746 -1251 -482 1103 977 102 -1113 -597 -168 721 364 -33 -414 -414 -25 670
4206 670 802 600 -104 -631 -214 279 1041 413 -96 -847 -471 721 1102 682 -907 -1506 -57 1104 1443
4225 1443 162 -1332 -887 163 1349 930 -633 -1300 -292 747 1278 390 -568 -849 -198 357 809
4242 809 435 -47 -348 -456 240 384 798 295 -557 -642 9 998 995 142 -1160 -698 102 1526 908 -537
4262 -537 -1452 -850 801 1325 621 -995 -1551 -165 1053 914 -4 -1046 -885 -88 806 500 -259 -699
4280 -699 -558 -275 238 557 168 -488 -681 -273 554 595 226 -688 -1107 -595 551 1117 147 -972 -1449 280
4300 280 1186 938 -288 -1478 -773 556 1187 639 -676 -1261 -828 745 973 238 -551 -1097 -231 387
4318C87L78p03l33J10l95Q15M25k65k76n82n7O09P83k34p05p45o7J583M97m19
4338H06j230p30Q22J222M01j112j000j33J255N95O7j223l73L56P20N27m96m54
4356B0m63L26O2N18Q8j77p69J83j32O61PK49q54l92L29R27L76n84r65l5N68R20
4378H63J55j046r85O35Q44O78n82j198m09R04R24k30m89k56k80O16K42k40l11
4397a65J85j03P6Q7j98M75k45m98n6L29R50k54n17q41M11O72K45j45p59k63J68
4418d46Q03K07o13p25K80N89M68k38n24j61J15M09K92m83l94K31L87k05j98J78
4438b8J56Q1m54l12N17K19K53l99j53k25O80o4j84m80l31O71R4L25r59L6O53M09
4460E05q8m34j79J00L15K60n28l06L13N81k80J10o31J51M57K46J6j072N20j44
$$ plain form
4318 387 765 62 -271 -161 -556 259 684 419 143 -439 -496 113 896 662 -43 -788 -855 728 1225 806
4338 806 -424 -1154 -332 890 1291 179 -821 -954 301 896 963 -260 -633 -277 443 970 474 20
4356 20 -443 -117 -55 463 551 374 -395 -212 -344 317 324 573 -281 -673 -344 583 959 375 -590 -625 -57 863
4378 863 1018 -28 -1013 -378 466 1144 562 -636 -1045 -141 783 553 64 -192 -472 144 386 146 -165
4397 -165 20 -83 -7 80 -118 357 112 -386 -442 -113 837 583 66 -775 -364 308 553 408 -351 -614 -446
4418 -446 357 564 -49 -774 -494 95 563 325 -199 -360 -245 164 456 -27 -421 -190 197 -8 -206 -28
4438 -28 128 209 -245 -557 -40 179 432 33 -120 -345 335 271 87 -393 -724 -53 41 366 -593 -557 96 505
4460 505 417 -17 -196 -96 219 479 -49 -355 -42 539 259 369 -262 -111 346 592 608 -464 56 -88
4480h8O01l34o08J68L31M98k76l45k24K77K25p2k1j04J51j94M55n73p4M16J18
4501C27j41o58N31oM95o7p33j04J46O63q8m96l87J73N20K46l7p66k90P79M84j17
4523D74m58n15J55N79J4k88p4j79K9L84j63K7m3k05k6p1K71K23J82k74l90Q4K66
4546BN14j88q93m33O37J199l19m15q93J11P37N16O1r52o41L07R95J5k61m15l61
4567f77N95K40J95l11m49J58j63L35l4O72m96m43l82N83N70R7n07n64k15J030
4587B34K68J15j138p13P49R15M70n90q73j35P96P71k54p14l23L6N57L00J71l43
4607B99n79j44L53M29L51o35m32k56J51P73K20j06o26n54N99P77L84p32r56k17
4627i01P01J555l33q61q50j13J065P41l39p33p16N28P97L18o54n67j7J59P24P0
$$ plain form
4480 -88 513 179 -429 -261 70 568 292 -53 -277 0 225 153 132 28 179 -15 440 -133 -207 209 327
4501 327 186 -472 59 53 548 481 -252 -356 -210 453 365 -131 -518 -345 175 421 384 -382 -672 107 591 474
4523 474 16 -499 -344 235 249 -39 -113 -292 -263 121 -42 -15 -58 -263 -289 -360 -89 134 316 42 -348 -264 2
4546 2 516 328 -565 -998 -361 838 519 104 -789 -678 59 575 636 -316 -957 -650 345 360 99 -316 -677
4567 -677 -82 158 353 42 -407 -249 -412 -77 -111 561 65 -378 -760 -177 393 490 -17 -581 -796 234
4587 234 502 617 -521 -1234 -485 430 900 310 -563 -698 98 869 615 -99 -422 -386 171 471 642 299
4607 299 -280 -424 -71 358 709 74 -358 -614 -463 310 530 424 -202 -756 -157 620 1004 272 -684 -901
4627 -901 -200 1355 1022 161 -689 -802 263 1004 665 -68 -784 -256 541 859 205 -362 -379 -220 504 574
4647E74l6p67m27L10L55M74M5o39j84l37M54J039l49p27j104M38J180P19p39q12
4667e33n15P32O83P17j039j275M04P10R51n3j140m52N5M51J042o63k48l73ML88
4687a54O16k1n02j13l33O45J98L97m43o39j36K84R70R5q67r75o6J085P63l9j110
4708c45o44O48Q63K30k08p35o26P54O45K4o15k74n1M34Q9P3j29l36l46L23M61
4729B35K25j47k44o89L01P33L17r1o69o54J79J026K39k32o23r37P02J280J64j085
4749C0o57j51Q68Q13j38r73l84M60L6O82j95m02l67K62J85o7N11m81j57j39P3
4770a91N76K41j89r60J61J12R21Q4p24l98p4M67R75J8j306l24J64Q93L04n79o05
4791d34j21N88P09j77m37m49J10J7N17M6o60j11J75K71k15L60M9j72m19j19P33
$$ plain form
4647 574 538 -229 -656 -346 9 483 528 -111 -295 -632 -178 861 512 -215 -1319 -881 299 1018 279 -533
4667 -533 -1048 -316 367 1084 45 -1230 -826 -116 835 782 -358 -810 -755 -304 738 75 -173 -546 -542 -154
4687 -154 462 441 -61 -174 -507 138 336 733 290 -349 -485 -201 769 864 -3 -978 -1044 41 804 765 -345
4708 -345 -989 -341 522 752 544 -191 -817 -63 582 606 -9 -283 -334 100 189 262 133 -203 -549 -226 235
4729 235 460 313 69 -620 -319 414 731 640 -29 -683 -504 522 761 529 -94 -1031 -329 951 1115 30
4749 30 -627 -778 90 903 765 -208 -592 -132 -96 586 391 -11 -378 -116 69 2 513 32 -125 -264 -191
4770 -191 385 626 437 -523 -362 -250 671 755 31 -367 -441 26 1001 1019 -287 -611 -447 446 750 171 -434
4791 -434 -555 33 742 565 128 -321 -211 -194 323 369 -291 -402 -227 44 -171 189 238 66 -353 -472 261
4812B61Q3J11n58l89o2O94M62m46o53j67N45L13L19o51m50L31M09O09l99n50o7
4833b55K85L26K11n97L6j47K31J2N2j2j75O2j98J34n3J12J54k67l53L88J40O23
4855G09n89k97k89M71L87k62k47k11M24L42o7l22n8k6K02M18p18j89J09M15J88
4876C90p4l87j94L54J33K05p37o0N05K04k94k25K18J59K08k05m29J22l2K83J30
4897B74l88o4J24L64k50j87%o2M83L6n36k30M99K40r1l49NQ6M84n1o55M8j5P25
4921D90o4m89m96j15N17M57j26k73m34K45M88k98Q9l60J44pJ70r8n9K11j92R7
4943a03N9j39J68L50k24n07k4J21N70j83n14l8M74M43k30o4n41j37M88P43m92
4964B20r61L51K06L22L73n49K3k54M50Q4J27n43Q8m7o7N93l51R9j11l9k03J94
$$ plain form
4812 261 344 455 -103 -492 -554 140 602 156 -497 -664 -119 194 513 -138 -588 -257 152 761 362 -188 -255
4833 -255 30 356 567 -30 6 -141 90 102 154 142 -33 29 -169 -35 -88 24 178 -89 -442 -54 86 709
4855 709 120 -177 -466 5 392 130 -117 -328 96 438 371 49 -9 -35 167 585 -133 -322 -213 202 390
4876 390 316 -71 -265 89 222 427 -310 -370 135 339 45 -180 38 197 405 200 -229 -107 -139 144 274
4897 274 -114 -178 -54 310 60 -127 -127 -189 294 330 -206 -436 63 303 212 -137 -132 -46 438 387 -268 -220 -235 490
4921 490 426 -63 -559 -674 -157 300 174 -99 -533 -288 200 -98 -9 -369 -225 -232 -62 -160 -219 -8 -200 -103
4943 -103 -44 -183 -15 335 111 -396 -420 -299 271 88 -426 -464 10 453 223 159 -382 -519 -31 712 220
4964 220 -741 -390 -184 138 511 -38 -15 -269 181 265 392 -151 -63 -110 -177 416 65 164 53 14 -189 5
4986EM12K18p40k89K0N14O08k22r64j48J42J144k7p89m42J42L57O91l00m21k16
5007c05K9M20N14l60n24R5k41M54K36k81O1n6l88M1N37m0j11j86n55M59P09J32
5029F40n43m53k65N94Q32j34q47p50N40M86N75j23p02o64O53L94L63m28m23j48
5049d03L67M1N59m69k07m10M27K02l3J02l18l08K41L17L57K28r59m87RP27N74
5070E57l33q80m26R23N97K97p24p74K28O18N19l35n19n12K8Q91N23l74n49j03
5090c48K62M8L48M8J4n04l27L29N42j07R8q48N1J07Q83J90r87n54J34N46O55k3
5112E57p01p74N30P57P39o84o99j36L43O50K31o11p38J06J69M40J53j63l83j43
5132c57M59L89j75Q7o47l16J11M83M62k5o65m88O5Q98L06r2o86n24N00J156k66
$$ plain form
4986 5 417 635 -105 -394 -374 140 748 526 -438 -586 -444 700 673 -116 -558 -416 -59 632 332 -89 -305
5007 -305 -276 144 658 298 -226 -131 -372 82 318 37 98 42 -346 -305 232 192 81 -105 -660 -201 508 640
5029 640 97 -356 -621 -27 805 671 -176 -926 -386 100 675 552 -150 -814 -161 233 596 168 -255 -403
5049 -403 -36 5 564 95 -112 -522 -95 107 74 176 -142 -450 -209 108 465 693 -266 -753 -744 -17 557
5070 557 224 -656 -1082 -159 438 735 11 -763 -535 83 602 267 -252 -764 -736 155 678 304 -245 -348
5090 -348 -86 -38 310 358 372 -132 -459 -130 412 305 403 -445 -394 -287 596 786 -201 -755 -621 -75 580 557
5112 557 -144 -918 -388 369 1108 424 -275 -411 -68 582 813 202 -536 -430 -261 179 332 169 -214 -357
5132 -357 102 491 316 403 -244 -560 -449 34 496 471 -194 -682 -617 281 587 495 -191 -715 -215 941 675
5153F75n17p37k9O75M84J17q38l02K85K80K67j87l97j04k42M85M99l02j59k33
5173b80p5L33L24M2m04l79L1L82N32q7n59o74L51L53O48r0n44n66K34O64K67n54
5195e1m10j00M87P31pp13n32K2M51N93m73l50K56J68j32o4J50k38J33Q4n98M10
5217a83N42k79l32k55L46N37J8j01q57n2N11L94Q9n69l15J91O81L73m97k67k74
5238b99J89M19J32n74N6J88J51j96J5k19J89j79L21q3r6K35j64l08l91N86L36
5259C08m7j36o75M47m3O25j60n56j67Q4P91J08o10n3J46l9L29J47m55q3J16K24
5281C01m87J67K39l62L59l76R4l4O9J58p4l34l8M42J88l60j91K9M65L8q3n53j9
5304c62N43j03M5l24j31Q8M02k01j34j49l4O66l75k59K16J14K3K89n34l0M49o1
$$ plain form
5153 675 158 -579 -608 67 551 668 -170 -472 -187 93 360 173 -224 -328 -570 -85 414 112 -47 -280
5173 -280 -355 -22 302 344 -60 -439 -408 -26 506 419 -140 -814 -463 -110 538 448 -96 -662 -428 236 503 -51
5195 -51 -461 -561 -74 657 650 -63 -595 -573 -122 471 -2 -352 -96 72 -60 -124 26 -212 -79 5 -593 -183
5217 -183 359 80 -252 -507 -161 376 394 293 -564 -616 -105 289 378 -191 -506 -315 366 739 242 -25 -299
5238 -299 -110 309 441 -133 -77 111 262 66 81 -138 51 -128 193 110 14 249 85 -223 -614 -28 308
5259 308 261 125 -550 -103 -146 479 319 -237 -404 -320 471 579 -31 -84 62 23 352 499 44 -39 77 301
5281 301 -186 -19 220 -142 217 -159 -65 -99 -30 128 54 -280 -318 124 312 -48 -239 -210 255 293 210 -343 -362
5304 -362 181 78 123 -201 -332 -244 158 -43 -177 -326 -360 306 -69 -328 -112 2 25 314 -220 -250 199 138
5326A38L42l83k30k42P21J28l10n54L64J04j60Q0J74m03k5L02k38K74K11l54J58
5347I7j39k86J69M62k25j25j04j14K93J36r6k23k84J54N66Q7l15n37L85J61M15
5368D77l46m16L3J09M29j42Q5n49J88J85J72k28j10K91n51J92J81J17K10r3l82
5389a48Q6oN26j17k59o10L06N21M8j98m68j09K51N18L15m82p78L24L63K62l4j18
5411A93r76N42J94L31j06j06m02R3K21K86j16k69J71l10O7P4P32k08p56j1L06
5432e0M96J69o98l22j95O45L11K24r23j28J83L66O49n76m56j38J15L77L73m82
5452f0k73r6M83O5J61n75R3j92J00K87K15j67J3k73R6K77J87j0m83l50J17N06
5474A21M03k59m70n3p9R47nm53p21L7M37M09K56p36l62M76M3K09J04k55l66n4
$$ plain form
5326 138 480 97 -133 -375 346 474 164 -390 -26 78 -82 -2 172 -231 -256 46 -192 82 293 -61 97
5347 97 -42 -328 -159 303 78 -47 -151 -265 28 164 68 -155 -439 -285 281 368 53 -484 -99 62 477
5368 477 131 -285 -252 -143 286 144 229 -320 -132 53 225 -3 -113 178 -373 -181 0 117 327 234 -148
5389 -148 -62 -68 458 341 82 -528 -222 299 347 149 -319 -428 -177 341 656 174 -604 -280 83 345 311 193
5411 193 -783 -241 -47 284 178 72 -330 -237 -16 270 154 -115 56 -254 -187 -113 619 411 -345 -356 -50
5432 -50 446 615 -83 -405 -600 45 356 580 -343 -471 -288 78 727 151 -305 -443 -328 49 422 -60
5452 -60 -333 -429 54 119 280 -295 -202 -394 -294 -7 208 41 54 -219 -123 154 341 331 -152 -502 -385 121
5474 121 524 265 -205 -258 -337 610 605 152 -569 -532 -95 314 570 -166 -528 -52 -9 200 304 49 -317 -371
5496c71N63JK39l52j2k84R0L48K34k19n72l56P49L01L06n65o16J25K43J018l00
5517E70q58k49L73M25K72m12p47J8N26O89m25N3n27j46M00J05L29k82l38J44k07
5538b87P22l17l1k34l21K39N01K12l58m49j64J62N56K55n59m21j31M57O58j5q36
5559c61k24M75L37L37k01k55q01L78L38Q7l5k32j82J9L60k24J24k5k66k3Q3M43
5581A52K76m49k25k66J95M27k26j04m94K73O82N0J1o97j41L90N79J60p27j85j4
5602c33K96M42j67o52K84k47L08K72j18l41j67K64K73k85J68J75o93K88L1L94
5622A92K72r6o75j78K87N92R2n08l55J29K99P14l51m84k71K19N8P33m86l27o3
5643b07M8L99j16J33n24R7k3K35j6J00n4J20l27J75K25M3l74M9k06Q6M03l28J15
$$ plain form
5496 -371 192 193 432 80 68 -216 -126 222 456 237 -335 -691 58 359 665 100 -516 -391 -148 870 570
5517 570 -288 -537 -164 261 533 121 -626 -608 -82 607 182 235 -292 -438 -38 67 396 114 -224 -80 -287
5538 -287 435 118 87 -147 -468 -229 272 484 126 -323 -487 -325 231 486 -73 -494 -625 -168 490 475 -361
5559 -361 -585 -110 227 564 363 108 -693 -315 23 110 75 -157 -339 -320 40 -184 -60 -85 -351 -374 -291 152
5581 152 428 -21 -246 -512 -317 110 -116 -220 -714 -441 241 291 302 -395 -536 -146 433 593 -134 -319 -333
5602 -333 -37 405 238 -414 -130 -377 -69 203 85 -256 -423 -159 114 -171 -3 172 -521 -233 -202 192
5622 192 464 368 -307 -485 -198 394 486 -22 -377 -248 51 765 414 -70 -341 -122 -64 669 183 -144 -207
5643 -207 -159 240 124 257 -267 -170 -193 42 26 126 72 192 -135 40 265 308 -66 -17 -223 -137 266 -62 53
5666E3m82P72j26K22l17k26k61J78L98P1j08l47n7lN14J30p02J06M72j14l31M01
5688B43k77J9k39M54j14J11j16k29k4m1R4K91k11n6Q1k49L70J24k46m78M34l12
5710c71L05KO9l30J87L42j03j90q5J89J49j43L1j66l4K15j1j30n2O5O6K6j53j21
5734b43j27N41k49K58j54k08K79p9Q7k32m1K49j49K87j42l60K84MO2o8j66L77
5756B10l16K04j46j44M6J82P4j43P4j57K95kk05k12J59J51m2K08j38k80P0M00
5778B88O6n08p7L7J42J43k1J76k50k16N08l69J67q9J43l72J15M00k40K18j64m20
5800c23j42O18J1k74M6l46N97m5L08n34k08M3L02N8N9k45J0l38N05o8j49j33J30
5823a18J81j04P2k17L08j69j20j24L29O4Po26R2K86L66k05J49o49Q2N54K68k15
$$ plain form
5666 53 -429 343 217 439 122 -104 -365 -187 211 282 174 -173 -230 -233 281 411 -291 -185 287 173 -158 243
5688 243 -34 -15 -254 200 86 197 81 -148 -172 -213 -119 172 -39 -95 -14 -263 107 231 -15 -493 -59 -371
5710 -371 -66 -64 5 -325 -138 204 101 -89 -174 15 164 21 52 -114 -148 67 56 -74 -126 -61 5 31 -122 -243
5734 -243 -370 171 -78 180 26 -182 97 18 105 -127 -168 81 -68 219 77 -283 1 5 67 -1 -167 210
5756 210 -106 98 -48 -192 -146 36 110 -33 41 -116 179 177 -28 -240 -81 70 28 236 98 -182 -112 288
5778 288 354 -154 -231 -194 -52 91 70 246 -4 -220 288 -81 86 -3 140 -232 -117 283 43 261 97 -323
5800 -323 -465 153 164 -110 -64 -410 187 142 450 -84 -292 -249 53 111 170 -75 -65 -403 102 34 -115 -248 -118
5823 -118 63 -41 31 -186 122 -47 -167 -291 38 102 109 -517 -425 -139 227 22 171 -478 -396 158 426 211
5845B11m39j51J44L25Q3k47l00r0L52M42L0j78l30j88j33M76Q0o4j74q4J74Q9
5867B8l3L86l63n48M84J44J46j90k85m08L56N32J66k64m96K1K99N14j86l41k19
5888b57j66L73K72K07j93m66j02M00L92j46o31L73R5k25J95J07j61m87K54K39
5908G3K49M5j41l14k49L45N05n0o82K96p24P82P82l99n12k65J10N39M6n03k11
5929b78j02L62M68l43J17m03j59L44O3K42j16k11j88o0L28K69r3k47l85L10n0
5950a32N45L2o44j77N6O00K29o32j1r6M7N93j00k20p79J48Q21J79k51m32l05K82
5972b47J10N00l18k66k79L12P8j50L68n1l86J71K07M4L3l26nK88Q8J93j45l04
5994h5l28j94Q95J84k38n02p3N42n0K45k62m49J91J80L54k26n1o01K98K84R2r6
$$ plain form
5845 211 -228 -379 -235 90 173 -74 -374 -464 -112 330 360 182 -148 -336 -469 7 87 23 -151 -235 -61 28
5867 28 -5 381 18 -530 -46 98 244 54 -231 -639 -283 249 415 151 -345 -324 -25 489 303 -38 -257
5888 -257 -423 -50 222 429 236 -230 -332 68 460 314 -317 56 151 -74 121 228 67 -420 -166 73
5908 73 322 367 226 -88 -337 8 513 463 -219 77 -647 135 917 518 6 -259 -149 390 436 -67 -278
5929 -278 -380 -18 450 107 224 -179 -338 6 69 311 195 -16 -204 -264 64 333 240 -7 -392 -82 -132
5950 -132 413 445 -199 -376 -320 280 509 -123 -134 -230 -183 410 310 90 -689 -541 280 459 208 -224 -529 -247
5972 -247 -137 363 45 -221 -500 -188 -110 -260 108 57 -329 -158 49 93 126 -200 -205 83 171 364 219 -85
5994 -85 -413 -607 288 472 234 -268 -341 201 151 396 134 -315 -124 56 410 184 133 -468 -170 114 206 110
6016A10k04K96k06k00K31J09J58l87o5J96J17k12K68m69k29N51J88K5k68m26R3
6037c24K67N83r4o74j78J81N72o7k72q7j0J0K65Qj69l24J41L08nmN4k85r4K8K52
6062H2j40M90k45j23l54K32J89J62m05l4l56O16J09k49j2j10j11L46K07o39J7
6083c28J44K33M6J21j72j02r1J05K80l16M4J80m60M65n0k74J57j25K98j64K31
6104B22J23n8j11k34p1J34L19j03l27J02K81j62k17L4l34J13L32n1j30oM9K26
6126A31Q8k30j04N7N5L67j43m55K89J6Q0j13k38L70k64J72J08m16K7N11j88j76
6148e6K01j92q9M23k39Kp1M2L90l49j22k15K15M44l63j22j24J43K25Qk72m1J58
6171dJ84q6k46Q6r1J16K28k48j29K38J38L3l0k58K54k34J71J15k9p8j02j89K11
$$ plain form
6016 110 -94 202 -4 -204 27 136 294 -93 -158 38 155 -57 211 -258 -487 64 252 277 9 -417 -324
6037 -324 -57 526 432 -242 -420 -239 333 266 -6 -93 -103 -93 172 180 11 -313 -172 136 131 127 181 -104 -198 -170 82
6062 82 -58 432 187 64 -290 -58 131 293 -112 -146 -502 114 223 -26 -38 -148 -259 87 294 -345 -328
6083 -328 -184 49 95 216 44 -58 -149 -44 236 -80 -36 144 -316 149 99 -175 -18 -143 155 -9 222
6104 222 345 287 176 -58 -129 5 324 221 -106 -4 277 115 -102 -68 -402 -289 43 -8 -138 -144 -95 131
6126 131 219 -11 -115 -58 -3 364 221 -234 55 71 151 38 -200 170 -94 78 186 -230 -203 308 120 -56
6148 -56 145 -47 -136 287 48 50 -21 21 411 62 -60 -275 -60 384 21 -101 -225 -82 143 151 -121 -162 -4
6171 -4 180 94 -152 -66 -157 -41 187 -61 -190 48 186 219 189 -69 185 -49 122 237 208 130 28 -161 50
6194E0P5l48O5K07j26j09L51k09L75l20n2j36J58M22j21m59P2Q5j23P5J13j94
6216a49J95k3J86k36k26k2kN27k3k65j99R5K47r8q9J17r4K1j41k24N7M15q3j28
6240a42r5L85K94n20K04m2l88K94J64J35o00L1J41L61l1k41l7j42K32M75N8o37
6262a01N5j65o8K38L7L12n40K00J40K6J06k37lk21J92J79J46k35k42j07L54J7
6284H3O0R2j18m53K98L06j60k32j31J34K41K05j84j22l41j17O44K01k17k54q6
6305a51J69J4J75j11J59l94O0K4M71j59j59k19j3J81k0J53l13j10m3K00M80l71
6327B3k7m02L95L24j88j22k29p8J22M94K72l26k48k75J52L90j69j55p1P0o1M66
6349C57m60K45n7k94m8P23k05m28J68l48M20K72n2l55m22r6N11L47q3p06k08O18
$$ plain form
6194 50 125 -223 -158 49 -77 -186 165 -44 331 11 -41 -177 -19 403 282 -177 -105 -20 -143 -68 45 -149
6216 -149 46 23 209 -27 -253 -275 -277 250 227 -38 -237 -142 105 7 -82 35 -59 -38 -179 -403 -346 69 -14 -142
6240 -142 -237 148 442 -78 126 84 -304 -10 154 289 -311 -280 -139 222 191 -50 -87 -229 3 478 536 -101
6262 -101 -46 -211 -279 -41 -4 308 -232 -32 108 134 240 3 0 -221 -29 150 296 61 -181 -288 66 83
6284 83 143 235 117 -336 -38 268 108 -124 -255 -121 120 325 141 19 -322 -439 205 406 189 -65 -151
6305 -151 18 32 207 96 255 -139 -79 -55 416 257 98 -121 -134 47 27 180 -133 -243 -286 -86 394 23
6327 23 -4 -406 -11 313 125 3 -226 -304 -182 312 584 258 10 -265 -113 277 108 -47 -118 -48 -109 357
6349 357 -103 142 85 -209 -257 466 261 -167 1 -347 73 345 293 -62 -484 -580 -69 278 195 -511 -719 -101
6371a01M66l7k08l04j59oK68M31k89m74K21J6K66K26m90M6Q1m0L44km37K13l80
6394c49J17J85K22j03k76o8J90N6M51p7m07k52J95K79R8l60j80J35J63L28j69
6415A78k28m8L17n06N08p1l39p0L75n8P6m9j33j4j18R5J98k20J05k36j10J05N07
6438B64p3k83j47N8J42K49l0l75k45PO70L8J22m74j03J21J54J24k03Q3k86K6Q5
6461g6L29m18J84q3j02J87J54o8k27jn1J35nJ23k09K04j45k47P24n78j59Q1J51
6484i7J89Q9L7l59J41Ro0L67m68j64K20Q7R8k36J29r0J13n4J6r7L57j07j40m61
6508d81L47M07l14L8p0K5O2O3p6l24K45M43q9k57k10J74J66J0L5m42J71M5K77
6531B45K2k04k96L24n8O3j24J18K8K6l68L85l84L49k28O7j7K7K0J26n6j68n6j63
$$ plain form
6371 -101 365 328 120 -184 -343 -349 -81 350 61 -413 -192 -176 90 316 -174 -128 -47 -87 257 255 -182 31 -349
6394 -349 -232 -47 175 72 -204 -272 -82 -26 425 348 -59 -311 -116 163 261 -99 -279 -144 19 347 178
6415 178 -50 -98 219 -287 221 150 -189 -259 116 58 134 85 -48 -62 -180 -85 113 -107 -2 -238 -348 -243 264
6438 264 191 -92 -239 -181 -39 210 180 -195 -440 -433 237 275 397 -77 -180 -59 95 219 16 99 -187 -161 -76
6461 -76 253 -165 19 -64 -166 21 175 107 -120 -121 -172 -37 -42 81 -128 76 -69 -316 408 -170 -329 -248 -97
6484 -97 92 181 218 -141 0 9 -51 316 -152 -316 -96 -9 89 -147 -18 -108 5 -49 -33 -130 227 120 -20 -481
6508 -481 -134 273 -41 -3 -73 -48 14 77 1 -323 -78 365 276 19 -191 -17 149 159 194 -248 -77 -32 245
6531 245 267 63 -233 91 33 96 -28 90 118 144 -224 161 -223 126 -102 -35 -52 -25 -5 121 65 -103 -159 -322
6555c22K52M2Lk01K32J78pP7l07p7J84m5k31P5L42k94L81N9k23k5j54L38k80M9
6579D6j99oL05j61O8Q7j07J65j59L60n27Q8k6J29J28l38L39j87M6j88J66m2J07
6602I4O5l28k6J16m9LM1j45k3K08J47M2j73j23J6K62j75J75k48n6M9M88l50l23
6626c13K99K48j97J29k91mN2K34k92R8l5K11l3j88q9n7K00J54p0l6j31M32j79
6649A42j15P3k62M36j29j25O2l53L89L8k65M0j11J41J61J49ll87j24K46j43M36
6671B96o6k2O5l53j00L01l19M02n60K95j05N7K32K23k76j14k96N56K3J5l50k49
6693c45L74N8o1M8l24K44k42O52k91l90j70L04Q5J31O9j02j6l9o8j73K00Nj35
6716a86p9L32m0M1K35k80m58P92j90J08n27j64o6M44M63k27l42K08k62m4K06j6
$$ plain form
6555 -322 -70 -28 -25 -226 6 184 177 254 -53 -130 54 9 -222 -147 195 -99 282 341 118 93 -61 277 -3 46
6579 46 -153 -159 146 -15 53 140 33 198 39 399 -128 -40 -66 63 191 -147 192 5 51 -137 29 -13 94
6602 94 159 -169 -195 -79 -128 -125 -84 -229 -252 -44 103 145 -28 -151 -135 127 -48 127 -121 -177 -128 360 10 -313
6626 -313 -14 234 37 166 -125 -129 -77 157 -135 -37 -72 139 106 -82 -171 -228 -28 126 56 20 -111 321 142
6649 142 27 100 -162 274 145 20 82 -271 118 156 -109 -69 -180 -39 122 271 268 -119 -243 3 -140 296
6671 296 230 208 273 -80 -180 121 -198 204 -356 -61 -166 -109 123 346 70 -44 -340 216 239 254 -96 -345
6693 -345 29 87 26 74 -250 -6 -248 404 113 -277 -447 -143 -58 73 142 40 24 -15 -83 -256 -56 -51 -186
6716 -186 -265 67 27 68 303 23 -435 357 167 275 -252 -416 -482 -38 425 198 -144 64 -198 -242 -36 -52
6738e2k73J39p9L13j62J24j5j1J01o8J78J55j76Ql52L61l06J55j33l58K64J62
6760b5q6K0M4j90P7K02P0k20k37LM53J65j0l85k08J88L84J43k94l39J57L62j11
6783A63j94p8J29J28j49p0M70k54l61K77r7L09o0J3k09k88J22M95l84Q4p9l7M6
6806b4L20R9r6l79j50K42J59j21l0r8k09N00o6J55j66l30Q2L52k30j18L35r8l20
6829a91K55Q0lj50J31k53j18K55L16k34k96K64j23K67k16R0m87R9K36K22J18m49
6851a87Q1j4J47K10m64J8o3L29j71K24j20k01J67J43j70R3N6q3l35L5N52m85L69
6874A31n3k77j17L89K23k70l7m5r1K59O8Q4m22j36K37K43j33K9l7j64o1K40n1
6897IN9j8k45J48K5M9o1n3P1O5k27Q9J39j99N0K32J96k68N9j73p2J28R0j0R4l10
$$ plain form
6738 -52 -325 -186 -265 48 -114 10 -5 -16 85 17 195 350 174 182 -170 191 -115 40 -93 -451 -187 -25
6760 -25 -111 -91 -47 -237 -160 42 112 -108 -345 -342 111 276 266 -119 -327 -139 245 388 94 -245 -88 274 163
6783 163 -31 -109 20 148 -1 -71 399 145 -216 61 -36 273 213 226 17 -271 -149 346 -38 46 -33 -70 -24
6806 -24 296 395 299 -80 -230 12 171 50 20 -78 -287 213 147 302 136 -194 -112 240 10 -108 227 129 -191
6829 -191 64 144 141 -9 122 -131 -249 6 322 88 -208 56 -67 200 -16 74 -413 -314 -78 144 262 -187
6851 -187 -106 -120 27 237 -227 -209 -272 57 -114 110 -10 -211 -44 99 -71 22 78 -5 -340 -305 247 -238 131
6874 131 78 -199 -316 73 296 26 -11 -56 -147 112 180 264 -158 -294 -57 186 53 82 45 -119 -180 60 9
6897 9 68 50 -195 -47 -22 27 -34 -87 -16 49 -178 -89 50 -149 -99 133 329 61 120 -53 -125 3 93 83 177 -133
6923a33o7L29J48k83Q5k5j20M26n9l36j64J81J05q3Q6j61j28K21j38M22k58Qn0
6946FK4k26M72m6M5n07P9M61l34M01k74O5j67O9l82M84k64J50j32r8J96J4P0k52
6970a46K27k78J17K63j33k05J30L5J10j21J57K2j93n0K8L2j43J62q3q2K83j41
6992iJ07q9j15L2R0j08R3k45J59O0J39j31l65N33j60Mm5j69K34k5on4j00K40p3
7017cm6l6j83K02J13J98l85Q0K38k43qJ35J17k21N2j54M37k14M4n1M5l77R5L03
7041A38q4j81K28l16K30Q3j31n5j61J43M2Q4%j65P1R3J25j41P1k64L22m20K51
7064c7L33n88M91k42J27M3j91J1j25J03K25l83K85j17n6j68M57N6j91J93p9K4
7086A71k34L21r1j41j14J23k11L92K6q8n14P7L91M57l17k67l76J60J68l4J12k64
$$ plain form
6923 -133 -200 129 277 -6 79 54 -66 360 301 -35 -199 -18 87 4 90 -71 -199 22 -116 306 48 56 6
6946 6 30 -196 276 230 275 -232 -153 308 -26 375 101 166 -1 68 -314 170 -94 56 -76 -174 22 36 106 -146
6970 -146 81 -197 -80 183 50 -155 -25 10 120 -1 156 178 -15 -65 -37 -5 -148 14 -69 -151 132 -9
6992 -9 98 9 -106 -74 16 -92 1 -244 -85 -25 114 -17 -382 151 -9 -5 -50 -219 15 -10 -16 -70 -170 70 -3
7017 -3 -49 -85 -268 -66 47 245 -140 -60 178 -65 -73 62 179 -42 10 -144 293 79 123 72 117 -260 -165 138
7041 138 54 -127 101 -215 15 98 -33 -88 -249 -106 -64 20 20 -145 -74 19 144 3 74 -190 132 -288 -37
7064 -37 296 -292 199 -43 84 127 -64 -53 -178 -75 150 -233 52 -65 -121 -289 168 224 33 226 147 171
7086 171 -63 258 167 26 -88 35 -176 216 242 154 -360 -283 108 565 248 -19 -395 -235 -67 -101 11 -253
7108b53J66j27K29q8J10j44k05L79k59L49M9k40k43K32j21K47P1k74l1L8Q8p2
7130i9K26j66k85j0K83R0K88l88N3k41L73j21J76n28K66L04j89J8L2k94J22J14
7152B4J22k90L20k83q9L03m2J03m18J72K03P4k38K1n6J95k06J35j6k1ol42R8K76
7176C9L0K98m86j62K58M17j59m1j79k45M69n30O92k48k95o4L31p7R1Q4k53j16
7198a46J35l5Q8J66j18r8j84l4J94K55l91k97M44J92J05j72j12R6J56m7o8k06
7220g7J69l95M68j34j93M01o01J60J54K54l75K78m16K00P1L5j8m4k06r8M56J54
7242B43j51k89K39j91J51K54j14k38k39K20K34L7N6o09J0M64K43j64J18o23L5
7263c14M72k62L75k50M9j03j96K1L35K0k03j53j8L66M5j87K44m47J64r1L53j33
$$ plain form
7108 -253 -87 -214 15 -73 37 -107 -312 67 -192 157 206 -34 -277 -45 -166 81 152 -122 -153 -115 -27 -99
7130 -99 127 -39 -324 -334 -51 39 327 -61 -8 -249 124 3 179 -349 -83 221 32 50 82 -212 -90 24
7152 24 146 -144 176 -107 -196 107 65 168 -250 -78 125 199 -39 -18 -74 121 -85 50 34 13 7 -335 -237 39
7176 39 69 367 -119 -281 -23 394 235 194 15 -230 239 -291 401 153 -142 -206 125 48 139 223 -30 -146
7198 -146 -11 -46 42 208 90 -8 -192 -226 -32 223 -168 -465 -21 171 276 104 -8 88 244 197 129 -77
7220 -77 92 -303 165 31 -162 239 -362 -202 -48 206 -169 109 -307 -107 -36 -1 -19 -63 -269 -367 89 243
7242 243 92 -197 42 -149 2 256 142 -96 -335 -115 119 156 212 -397 -387 77 320 156 274 -349 -314
7263 -314 158 -104 271 21 70 -33 -229 -208 127 147 -56 -209 -227 139 184 -3 241 -206 -42 -133 220 87
7285H7J6l00M15l02K72r3k43J76J0P0M0r8k97K36O5jp6J29J7k0l18J2J89n9O6
7310gq6O8l3J63J20k19o2K78Q2l08k4k13L52j28K41k23l9m2J89J19l3r7n92M48
7334d6K30o3k41r3j70M79j57M61n74N13n05K8J14J02k00J3J30k00J93K22n07J22
7356a49N2p9J92R3k8l29J22l03L05K68j54J20l04J98j33J77q3O7j70J73Q4L6l30
7379a75k09K17J75p8K11l41K29k85M23j62J89j24rj71J55p8o7J05J54p4l39K31
7401b3j41L92j27l70P4J69l2K6N4J7m9m3j4M1K8j68M65k42m46J82J97K92m07M43
7425C18n95L02K4k60J12nJ61m15O76l38k21M23j08M6L6O7k90k13J89J73%Qm31
7448c41K52L5pJ73O1j78L78m07p5M58l15j53N3J7K51k7M5j58l51K46Q0n4k24K3
$$ plain form
7285 87 103 -197 218 -84 188 95 -148 28 38 108 148 50 -247 -11 54 53 -23 106 123 103 -215 -203 -14 -73 -7
7310 -7 -93 -25 -58 105 225 6 -56 222 304 -4 -28 -241 111 -17 224 1 -38 -80 109 228 195 98 -494 -46
7334 -46 184 121 -120 -213 -383 96 -61 400 -174 339 -166 -138 -24 78 -122 -109 21 -179 14 236 -271 -149
7356 -149 -97 -176 16 109 81 -248 -126 -429 -124 144 -10 110 -194 4 -129 48 -35 32 -138 35 119 155 -175
7379 -175 -384 -167 8 -70 141 -200 29 -256 167 5 194 70 61 -110 45 -33 -100 5 159 85 -254 -23
7401 -23 -164 228 101 -269 -195 -26 -58 -32 22 39 -10 -53 -67 -26 2 -166 299 57 -389 -207 -10 282 -125 318
7425 318 -277 25 49 -211 -99 -104 57 -358 318 -20 -241 182 74 120 156 223 -67 -280 -91 82 82 90 -341
7448 -341 -89 -54 -61 112 173 -5 373 -34 -109 349 34 -119 -66 -49 202 175 220 62 -289 -43 37 -17 -241 -218
7472b18J1K9K94j99j70K47j42K27l7O2J35k7l87M7J80M1j60N7j48L87k60L72m12
7495g1n1r6L23j19j9J52m26N40k1k53J53rj67Q0m3P6J68n09l8N6L34J46n28L90
7519F8jl17L91l17J50O2M4q6N2O2j5o4q6k04L41r7J86N2m72K76K40k51j74K28
7543F8n79L81L2J13l3k96K14J02R4k19L02m22J39M33k26k51j8M77o53L74K03n
7565B30l12J05j17P4K87J02m24j33k0O2P8J96o13J82L93N2J00m66K1Or1L56j45
7588g7O7k20P5N5J72q4j90L2J89nJ70J71k19K5m47M1L48K13m68J78k7J3K92j19
7612A85l4j73j62K01J44p2J8l89L85k04M30k52J3k68K0K01j30J61lj57l8K38n9
7635E5m9J17m08K28J84n2K4M4m02J60p7K14M3L8k24m3L78k29m5K97o54J16L63
$$ plain form
7472 -218 -207 -178 116 -83 -253 -6 -148 79 42 104 239 212 -175 -128 52 93 -67 -10 -158 229 -31 341 -71
7495 -71 -122 -218 105 -14 -33 119 -307 233 212 -41 112 103 -64 16 -27 49 217 -292 -330 -274 60 206 -322 68
7519 68 67 -250 141 -176 -26 36 80 -6 46 108 93 29 -57 -261 80 -17 169 221 -251 25 265 14 -160 68
7543 68 -511 -130 -98 15 -18 -314 -100 2 96 -123 179 -243 -104 329 103 -148 -166 311 -342 32 235 230
7565 230 -82 23 -94 -20 267 369 -55 -188 -208 -146 -68 128 -485 -303 90 142 242 -224 -203 -197 -288 68 -77
7588 -77 -10 -230 -155 -100 72 -12 -202 -170 19 14 184 355 136 161 -286 -245 103 316 -152 26 -1 12 304 185
7612 185 151 -22 -184 17 161 89 107 -282 103 -101 329 77 90 -178 -158 43 -87 74 71 -86 -124 114 55
7635 55 6 123 -285 -57 127 75 99 143 -259 -99 -176 38 81 119 -105 -148 230 1 -44 253 -401 -285 78
7658G8k46M14k53p6j66L60k71K9L16k85J62J06k43p5M95n46J45K10m7k66K99m83
7680c43J76K57j94j31nJ40R7r6M15o5k40J04k26J38K69m97K73N7j3J01l36L50
7702B31l60K06j1j00K90r6k08j57N12j14k90K75k07o3K82r8j9O4J45L8m63K8K97
7725A82k53N3N5K8K26P7l39p2p9K80k39K05p4J23l79J52Q5j84L6J33Q1j39K09
7748A67m60L27R1k26P2j17J19j50m4K75m9J41l07N15n03K89j44J4rj2J67l24L02
7771A34J25m50J24k22L43K26l29L9P9l0J31J39n81N8J33r0o7R4J33q3O5L4j20
7794a15K58k90J47M1p2O2lN1j46J38J8o9q5J56lj72J60k20J12J18j61p2J71J20
7818A44q7q3J05k3J38j44k68O3K60m8n6j07K3P1K93M0j40k40J74l1j52k14J54
$$ plain form
7658 78 -168 246 -7 -83 -249 111 -160 -131 185 -100 62 168 -75 -150 345 -201 -56 154 107 -159 140 -343
7680 -343 -167 90 -104 -235 -240 -100 -3 -99 316 251 11 115 -111 27 296 -201 72 129 116 217 -119 231
7702 231 -129 77 66 -34 256 160 -48 -205 307 193 -97 178 -29 -92 190 92 73 137 282 320 -143 -115 182
7725 182 -71 -18 37 65 291 368 29 -43 -122 158 -81 124 50 173 -206 -54 31 -153 -117 16 97 -42 167
7748 167 -293 34 125 -101 -29 -146 -27 -177 -221 54 5 146 -161 354 -149 140 -4 10 1 -11 156 -168 134
7771 134 259 -191 -67 -289 54 280 -49 -10 69 39 170 309 -272 -214 -81 -171 -238 -144 -11 -94 -29 5 -115
7794 -115 143 -147 0 41 -31 31 28 79 -67 71 89 20 -65 91 88 -84 76 -144 -32 86 -75 -147 24 144
7818 144 57 -26 79 56 194 50 -218 -155 105 57 1 -106 -83 -12 281 321 181 -59 115 84 -68 -282 -128
7841a28R8q1O0J01J48k58N4m9rj06L20N3j02j62jl4K81K35j12j55l98Q7K94j16
7865B0q8k7K99n89M18j43mJ37j93M39k87m3m1k57M54k39l1J6P4P9l63M89L1j53
7889bJ78l27j14L04K24j31l01J48j34L21K50m06q1J74k26J47J35l56o9L05K68
7910C07k76lm6j60J27K70j66j61K46k31M04k31j38k3j23n1K03K15O9j90k73L91
7932A60k64L30P3l05j28J78P4l18M51k41k93rL43j2j3k0J3r9J13o0M7o3k71L36
7956B2j35J68j84J24N5J93j32L22k99j10K13m65M75j23j14j61K2K35J01p7j39
7977ij72L4K31rn1P6n42K73L43k92K02r3l70L06J86o1K0N2j53J77q3J45J96l69
8001C7k84N0L02pr2Lr5L0L00o5n3l38J84J28j57K59n59K82k25J80M1K58J08m41
$$ plain form
7841 -128 -30 -111 -51 50 198 -60 -6 -55 -64 -170 150 203 101 -61 -62 -96 185 420 308 153 -245 -158 136 20
7865 20 -68 -95 204 -385 33 -110 -114 23 -170 269 -18 -61 -102 -359 95 -144 -175 -159 -85 -6 -369 120 151 -2
7889 -2 176 -151 -265 39 263 132 -169 -21 -155 166 416 10 -71 103 -123 24 159 -197 -266 39 307
7910 307 31 28 -18 -178 -51 219 53 -108 138 -93 311 80 -58 -81 -204 -255 -52 163 232 42 -231 160
7932 160 -104 226 299 -6 -134 44 118 -200 251 10 -283 -292 51 39 26 6 19 -80 33 -27 20 -43 -314 22
7956 22 -113 55 -129 -5 50 243 111 433 134 24 237 -228 247 124 10 -151 -129 106 207 130 -9
7977 -9 -181 -147 84 75 24 100 -442 -169 174 -118 84 -9 -379 -73 113 52 72 124 -29 148 65 210 406 37
8001 37 -247 -197 105 98 6 9 -86 -56 244 179 126 -212 -28 100 -57 202 -357 -75 -300 -120 -79 179 287 -154
8025a54Q3J68J02k30Q6j46j74O2K98K42j81l82L14j73J98K22m44K49o0J91l9j30
8047A02K2j32j72J74l4N8j75J00o7k7K37K03n96J2K85J37j36J19k28J25n6L32
8069B83Q1k36o6j14J15j73L5K40l63K81M19p23K63j44Q9M6R1j56K5J84m50L55
8091H2j1PK97l67J81k63j08K52K40k59l6l02J81L39j19l05K77J3l3J82l00k6j40
8114b18J4K90k84L46k38L05k80p5L19k7o3j92J06o3K65Lj28j26j66K14J3J05l51
8137b31O8L11L26k53m20J31j78K91K43m82L37j67J3K9p5Q0O6k05J54J19n9R4K01
8160C93l78j9l2Jn6p9L2J09J4j06P6O8P9m01K27O3K44q5k18k79K73L36k22q7J13
8185F6n62O83k6j74j5L9
$$ plain form
8025 -154 -71 97 199 -31 55 -91 -265 -203 95 337 156 -226 88 -85 113 335 -109 140 80 271 232 102
8047 102 124 -8 -180 -6 -40 18 -157 -57 -124 -151 86 289 -307 -295 -10 127 -9 110 -118 7 -49 283
8069 283 364 128 62 -52 63 -110 -75 165 -198 83 502 -221 42 -102 -13 33 124 -32 -7 177 -273 82
8091 82 71 78 375 8 189 -74 -182 70 310 51 15 -287 -106 233 114 -191 86 99 66 248 -52 -78 -218
8114 -218 -204 86 -198 148 -90 215 -65 -140 179 152 89 -103 3 -60 205 208 80 -46 -212 2 15 120 -231
8137 -231 -163 148 474 221 -199 -68 -246 45 288 -194 143 -24 -11 18 -57 23 89 -116 38 157 98 192 393
8160 393 15 -4 -36 -35 -91 -170 -138 -29 -15 -121 -45 23 102 -299 -72 -9 235 150 -68 -347 -74 262 40 -47 66
8185 66 -496 187 161 -13 -28 11
8191A1
$$ Imaginary data points
##PAGE= N=2
##DATA TABLE= (X++(I..I)), XYDATA
0@%%%%%%%%%%JqJ5j6J6j6K1k9L2l6M4m9N7o9P8r0J05j20J36j52J69j91K15k40
34a27K69k98L30l65M06m54N03n54O11o77P53q36R28j033J150j289J453j647J884
53A007k179K560l077L818m974P055j1982M5371L8603p5469m8588Q044O2470L3292
67E5951j9192n2276k2815J8570M0870J6379j7983l4425j3483J3921K5430J0583
79B1530r253j8428j2719j743J3335K1157J0973j7861l4765j3973L0180M4709O213
92C9355m4829m5203Q210N3517L7839k0569n4673k6542K9502N1725J7827l3923
104A2236m6652q129L7832M0332q95l7240k9402R546L1558J7049j0290j8897q293
117a1245K306O686J0251J0539k488j9574j8946N859K9618K0347j3391l5709j9660
$$ plain form
0 0 0 0 0 0 0 0 0 0 0 0 1 -7 8 -8 8 -8 13 -16 16 -20 24 -25 32 -37 41 -49 56 -64 72 -80 89 -102 113 -127
34 -127 142 -156 174 -191 215 -239 264 -290 321 -356 397 -439 489 -544 606 -683 770 -877 1007
53 1007 -1172 1388 -1689 2129 -2845 4210 -7772 37599 76202 733 -47855 -39811 22659 55951
67 55951 36759 -15517 -38332 -19762 21108 37487 19504 -14921 -28404 -14483 10947 21530
79 21530 12277 -6151 -18870 -20613 -7278 13879 24852 6991 -27774 -41747 -11567 33142 39355
92 39355 -5474 -50677 -42467 11050 48889 28320 -26353 -52895 -23393 28332 46159 12236
104 12236 -34416 -42545 -4713 35619 34724 -2516 -31918 -22372 9186 26235 15945 -2952 -11245
117 -11245 -8939 -2253 7998 18537 16049 -3525 -22471 -16612 13006 33353 19962 -15747 -35407
130c5407J9809M0059J5488k8229m4010r015L7239M1736k267m4387l5532J3405
142c1111M5173K3186k3694l9523r711K5222K7261N71k0040j6190N02J1587R977
155C210K303m168p445o922j523Q085J3131N774j0681j9427p046J7978K6528M265
169B4062k6765k8444N251L6399K5083j7116l8334j3796K6377L4581L247k8586
181A959k5523N273K6976J7942r166k2734j0113J1610J7485L230j0605r399J459
194a606N992N32j498K964M477l826j1957m480J2519J6294j942k1720j5388J0893
208h746K5200Q920j8804k4793k112K3234K0566n658k5444j5813J2648K4461O816
221B0475j7987k0061J966J9049J1592r718j5648j057J2224O574o713q111K595
$$ plain form
130 -35407 -15598 24461 39949 11720 -32290 -41305 -4066 37670 35403 -8984 -44516 -31111
142 -31111 14062 37248 13554 -25969 -35680 -10458 16803 17374 -2666 -18856 -18354 -6767 3210
155 3210 5513 1345 -6100 -13022 -14545 -6460 6671 12445 1764 -17663 -24709 -6731 19797 24062
169 24062 -2703 -31147 -25896 10503 35586 18470 -19864 -33660 -7283 27298 30545 1959
181 1959 -23564 -18291 8685 26627 17461 -5273 -15386 -3776 13709 16939 6334 -3065 -1606
194 -1606 4386 4918 3420 6384 10861 7035 -4922 -9402 3117 19411 17469 -4251 -19639 -8746
208 -8746 16454 25374 6570 -18223 -20335 2899 23465 17807 -7637 -23450 -10802 13659 20475
221 20475 2488 -17573 -15607 3442 15034 5316 -10332 -11389 835 7409 696 -7415 -4820
234d820Q046J109q071o001O415J0353R16j1196r667M653J5300O035j1024j5671
248a3623m62J6969J2928p388j8783n748J4017J6218k834j7449r295J0745J5605
261A0900l50j4323q986P723J3389J252j2270r633O242J3016L266j1218j1527K922
275i597J4403P233r760j4954l49J4741J0008p240j4800k676J2070R906m916j1892
289g823k734R492P690m723r427o65Q927O769n720j0892r77J1730J0119n714j5861
304i809n582J3543J7006j298j9278j2994R995K1538O205j5647j8820J693J9173
317E725J3109q083j7059o129J0895J2970J77r613p189K565O926K008l162j735
331A405K415O73m471m096M521J0299J680j2120j3007L536J9088J1893j2723k2533
$$ plain form
234 -4820 3226 4335 -3736 -9737 -3322 7031 7947 -3249 -12916 -8263 7037 13072 2048 -13623
248 -13623 -14085 2884 15812 8424 -10359 -16107 -2090 14128 11294 -6155 -15450 -4705 10900
261 10900 10550 -3773 -12759 -5036 8353 9605 -2665 -12298 -6056 6960 10226 -992 -12519 -9597
275 -9597 4806 12039 2279 -12675 -13024 1717 11725 4485 -10315 -12991 -921 8985 4069 -7823
289 -7823 -10557 -1065 6625 1902 -7525 -8190 737 7506 1786 -9106 -10083 1647 11766 6052 -9809
304 -9809 -15391 -1848 15158 13860 -5418 -18412 -8417 13121 19326 3679 -15141 -13448 5725
317 5725 18834 10751 -6308 -12437 -1542 11428 11605 1992 -5197 -2632 4294 6302 3140 1405
331 1405 3820 4493 22 -4074 447 10746 12426 306 -12701 -9165 9923 21816 9093 -13440
345a3440n955J8811K1812j250k3666j8147Q039K4770J2356j3707k3419o397J6543
358c650J8769K34j6750j2935L697J3220O276m260p001k634P58N90K227N159L281
373F981n326j1912m043J1677J6256J021j8531j7839M543K3873J6183j1077k6922
386a5116j2054J7644K7716N673k2947k5059J777K5099K0014q004k4273j2327J0811
399a1046J9369O822r911j3353l981O091Q620M358j224n919p359l269N615J2025
413F838P107q148j7982q126J3677K2622N753j9925k5330l48K6737K3733o563l0281
427a0236j9202J3792L0941J2570j8828k7585n388K0271K2446M84j8901j6576K305
440a3907J5072J2022k057j0002q626o01N431P903O160k301j0668j1359K136J6567
$$ plain form
345 -13440 -19395 -584 21228 19978 -3688 -21835 -13796 10974 23330 9623 -13796 -20193 -3650
358 -3650 15119 15353 -1397 -14332 -10635 2585 8861 4601 -2400 -5034 -4276 -3686 -1459 3700 6981
373 6981 1655 -10257 -14300 -2623 13633 14654 -3877 -21716 -17173 6700 22883 11806 -15116
386 -15116 -27170 -9526 18190 23863 916 -24143 -22366 2733 22747 14743 -9530 -21857 -11046
399 -11046 8323 15145 5234 -8119 -12100 -6009 2611 6969 5745 -174 -7533 -10802 -5187 6838
413 6838 13945 5797 -12185 -20311 -6634 15988 21741 1816 -23514 -23862 2875 26608 20045 -10236
427 -10236 -29438 -15646 15295 27865 9037 -18548 -23936 -3665 18781 19265 364 -16212 -13907
440 -13907 1165 13187 11130 1128 -7498 -8099 -2668 5235 11395 9094 -1574 -12933 -10797 5770
454E770J5093n364k2461j5339J0902K7114J2955j7609k8924p458K2939K7915J295
467B6828k7070k3880N157K7606J8506j0336k5740j2133J2386K1025P096j1925
479G520j5553m500Q030J1003M002l319p698q300j518Q472J3072L853j2501j7253
493a4690l818J7008K0556M09k2352k1627M247K7074J9240j0587k9335j4920J6747
506a2048K8520Q296k0822k4860j731K1057J9813l125j9459j2996M526J4801Q877
519A0849l350r948p029N03N580P114M247l171j0225q513L776J4804J1146o562
533I221k0083j1144J2623K3228Q068j7656k4461k994K2992K2007l172k4858j7838
546b4067R188K4129J1951j2286k1185o278J3526J6594K154j1887j1179j24P944
$$ plain form
454 5770 20863 15499 -6962 -22301 -11399 15715 28670 11061 -17863 -25321 -2382 25533 26828
467 26828 -242 -24122 -18965 8641 27147 16811 -8929 -21062 -8676 12349 19445 7520
479 7520 -8033 -12533 -4503 6500 10502 7183 -515 -8815 -10333 -1861 11211 15064 2563 -14690
493 -14690 -18508 -1500 19056 19465 -2887 -24514 -20267 6807 26047 15460 -13875 -28795 -12048
506 -12048 16472 24768 3946 -20914 -22645 -1588 18225 15100 -4359 -17355 -12829 1972 10849
519 10849 7499 -2449 -9478 -8975 -3395 3719 7966 4795 -5430 -13943 -10167 4637 15783 9221
533 9221 -10862 -22006 -9383 13845 21913 4257 -20204 -23198 -206 21801 18629 -6229 -24067
546 -24067 -14879 9250 21201 8915 -12270 -18548 -5022 11572 13726 1839 -9340 -9464 -1520
559a520P048J133l355m389m366j104N422R196K841q558j2792k270J3346J5445
573A6077r88j7895j5202N507K1377J3064j1110k2326q047J5602K1035K068j7744
586A418j7013K928J8092J1541p145j5008n381P453J0301J830o413m782k69K014
600d34J396J095K589P06m836o505J79R431P905l266j3431p845Q231J5343N047
615A5605j2991j6190nJ6085J3545n296j7305r317R970J5716L277j1747j2179J259
629i573J1198P286m564r303j936N181M651j400l695r7K508M35l908k156M538N361
645D526j466p823m780N533J0091K132r739r940K273J2391P367p178j2569k416
659a1598J0216J0605k441j1415o659O663J0463J477q759p369L797Q711K093o561
$$ plain form
559 -1520 5528 6661 3306 -1083 -5449 -6553 -1131 8065 10906 2348 -10444 -12714 632 16077
573 16077 15089 -2806 -18008 -12501 8876 21940 10830 -11496 -19543 -3941 17094 19162 1418
586 1418 -15595 -12667 5425 16966 9821 -5187 -10568 -3115 7186 9016 2603 -2179 -2448 -434
600 -434 962 2057 4646 5352 516 -5989 -5810 3621 11526 8260 -5171 -13016 -4785 10558 15605
615 15605 2614 -13576 -13581 2504 16049 10753 -6552 -15869 -5899 9817 13094 1347 -10832 -9573
629 -9573 1625 8911 4347 -4956 -6892 -1711 2940 1540 -2155 -2252 256 691 -3217 -5373 -835 4526
645 4526 3060 -4763 -9543 -4010 6081 8213 -1526 -11466 -9193 3198 10565 3387 -9182 -11598
659 -11598 -1382 9223 6782 -4633 -11292 -4629 5834 7311 -1448 -8817 -5020 3691 5784 -777
673g77n678K682P239J964o748n317L159P794J765p018o075K818Q311L728o585
688A262p635P02Q380M909m655q039n25O903O254l733p699j533O921N753l447p465
704c647k062P127O909l232r186k943O816R474j280j0311o726N982J1116K431r286
719A182r472K371J0408N821n509r748j924P411P114j880p055l170M090M324r39
734C024l719o23L702R61l200m281K825O212J751o518q082K105J0585O391o607
749D526j2781l525J0875J2745j297j4177j0325O074J4428O376r444j3423j681
762a1629J0945R857k012r866o298L656P095K712l225l647m03K30N33M60L045K131
778C584l428o224k365O608R491M01j0733j0696L149J4708R183p509j6714n905
$$ plain form
673 -777 -6455 -3773 3466 5430 -1318 -6635 -3476 4318 6083 -935 -7010 -4192 4119 7847 1262
688 1262 -6373 -5671 2709 7618 2963 -5076 -5601 1302 7556 3823 -3876 -5409 1512 7265 3818 -3647
704 -3647 -5709 1418 8327 5095 -4091 -7034 -218 9256 7976 -2335 -9061 -3079 8037 10468 1182
719 1182 -8290 -5919 4489 10310 4801 -4947 -6871 540 7654 5774 -1281 -4451 -361 3963 3024
734 3024 -695 -1318 2384 3345 145 -4136 -1311 4901 6652 134 -7948 -5843 4742 11133 4526
749 4526 -8255 -11780 -905 11840 10543 -3634 -13959 -7885 6543 12919 3475 -9948 -11629
762 -11629 -684 9173 7161 -2705 -9003 -5347 1748 4460 1235 -2412 -2815 -2585 -2052 -1592 1453 3584
778 3584 156 -6068 -8433 -1825 7666 8067 -2666 -13362 -10213 4495 13678 6169 -10545 -16450
792a6450J1549J6648K062j4984j4035K532J5681J0701o198j4360o183P412J1538
805E913K999o915p553r60M353M130J745q89k260l901k288K605P516M492m531j1103
821f647m894Q729J4234K801j3143j5126J042J6930J3817n334j8857j0726R659
834g515J8900O723j2573j7441k067J3761J3605p58j2898r402K521R682O386j899
848G025o386m892l97L817M792L851j903p571o827K039J1199Q411m050j4695r048
863a4635P773J7532P004j2309j8437l405J5512J7560j062j7694j4779N140J8127
876F327J0405p984j6167o748Q974J2915L114p682r572k083N236O780K359k057
890C817n452m657p51N807P915K004p954j1434j809J1714J3180m85j5487j3725
$$ plain form
792 -16450 -4901 11747 13809 -1175 -15210 -12678 3003 13704 7506 -6854 -13037 -5625 5913
805 5913 8912 1997 -5556 -6516 -2163 1967 3712 2823 563 -3338 -5626 -3021 4495 8987 4456 -6647
821 -6647 -11541 -2812 11422 14223 1080 -14046 -13004 3926 17743 12409 -6448 -17174 -7515
834 -7515 11385 18108 5535 -11906 -13973 -212 13393 12635 -263 -9665 -7144 2538 8924 7025
848 7025 639 -4253 -4650 -833 3959 7810 5907 -1664 -8491 -6452 4747 13158 9108 -5587 -14635
863 -14635 -6862 10670 17674 5365 -13072 -16477 -965 16595 15533 -2161 -16940 -11800 6327
876 6327 16732 8748 -7419 -14167 -5193 7722 10836 3154 -6418 -8501 -3265 3515 5874 3817
890 3817 -1635 -6292 -7043 -1236 6679 8683 729 -10705 -12514 -800 12380 11895 -3592 -17317
904a7317M551J8221J1683q576j9373q456J2396J8701M171j4726j5738j85J4594
917e4J2363k704j3434q162L790J0165N695k915o759m493N79M252N142K558k896
932C127p244n328L273J0908O709o010j3510o314R568J5343M254j2900j5518o94
946a4336J5604J4818l604j7044j1011O977J6503P201r392j4168l351R900J0908
959I005N50q008p308L73N403M852N88k565l752k794j74M323O258J315o655r054
975g643l75R604J0631j509j3618r910N459J5138P669q816j6005m197J1935J3949
989A2312Q62j3708j1292L143J2786P518m909j0996l698N183P535J297m021m247
1003b235o92J474J607J609J500n79l992m269J367O934N114l661r778m407O490
$$ plain form
904 -17317 -12766 5455 17138 8562 -10811 -19267 -6871 11830 16001 1275 -14463 -14648 -54
917 -54 12309 9605 -3829 -11991 -8201 1964 7659 4744 -2015 -6508 -5929 -1677 3465 6023 3127
932 3127 -4117 -9445 -6172 4736 11445 5435 -8075 -14389 -4821 10522 14776 1876 -13642 -14336
946 -14336 1268 16086 12482 -4562 -15573 -8596 7907 15108 5716 -8452 -11803 -1903 9005
959 9005 9555 1547 -5761 -5388 15 4867 5455 2890 -862 -3656 -3830 493 6751 8066 1411 -7643
975 -7643 -8018 1586 12217 10708 -2910 -12820 -7361 7777 15446 6630 -9375 -13572 -1637 12312
989 12312 13174 -534 -11826 -8683 4103 11621 6712 -4284 -7982 -2799 4736 6033 2012 -2235
1003 -2235 -2927 -1453 154 1763 3263 2684 -1308 -5577 -4210 2724 7838 4177 -5601 -10008 -3518
1018c518J1351K147j0129j0716R29J2325Q688m354j2980n805P463J1089K317q877
1032g0q480P73Q551N283l021o506j740L320L205O6k273j13J057q38k107j34M003
1049I76L068k702n974k153N674P024l49q159o208L097R803M376o234r646j228
1064h635Q767P735k555q466n017N166P914R59n880n261K007N543K232l887l402
1079b780J009L955J055l689k229K051M013q0m271k835L129N228M98m845m814K093
1095b512O176K696m763n824O19O157L928l423o263q54N314M617k175n773k016
1110d096M755M737j142o116k392M337N675r72o218l820L945O399N66o228m501
1125e071K270O569K154m468n974Q04N238L348k745m907n86L882K952k193l388
$$ plain form
1018 -3518 7833 9980 -149 -10865 -9936 2389 11077 6723 -6257 -12062 -4599 6490 8807 -70
1032 -70 -8550 -7777 774 6057 3036 -3470 -5210 -1890 1315 1381 -892 -1005 52 -786 -2893 -3027 976
1049 976 4044 1342 -4632 -6785 -1111 5913 5564 -2595 -8803 -5706 4097 8473 2239 -7407 -8635
1064 -8635 132 7867 5312 -3154 -8171 -3005 4909 5868 -12 -5273 -3266 2277 4509 622 -2780
1079 -2780 -1771 2184 3239 -450 -2679 -628 3385 3305 -966 -3801 -672 4556 5054 209 -4605 -2512
1095 -2512 3664 6360 1597 -4227 -3608 2549 6477 3054 -3209 -4063 1251 5868 3693 -2080 -4096
1110 -4096 659 5396 4254 -1862 -4254 83 5758 4786 -1432 -5252 -1307 5092 5658 -570 -5071
1125 -5071 -2801 3768 5922 1454 -4520 -3716 1522 4870 2125 -2782 -3368 514 3466 1273 -2115
1140b115k75L603J356k713l490R60M751J571m162m734Q17O473L842l874p870j503
1156g363O571P390j706q371n250M226R147K416o926p275M81P150N223k681o101
1171c069k564L363M137K63k529j787O94J211r69k02J656J978j382l988k135M038
1187a285O240K82o933o310K202R227N755n526j0565k968Q470J0059n7j0031q316
1202i756L059J0404N591n232q470l162N686P027O04m584m812P14K777K439R8k02
1218B181j121k673j470J898M641K932l270p177k896O040R052J145r180r153J491
1233g560J1327Q219m445j2526n957P448J1695K974q984j0401j9R413P890j850
1247G224q453n275K734O402K942j854m170k116r4J992K889K080r15n000m346J554
$$ plain form
1140 -2115 -2390 1213 2569 -144 -3634 -2674 2077 3648 -514 -5248 -4431 2042 5884 2010 -5860 -7363
1156 -7363 -792 6598 4892 -3479 -8729 -4503 4644 7060 134 -7141 -6660 490 5713 3032 -3069
1171 -3069 -5633 -2270 1867 2130 -399 -2186 -1492 -281 -1250 -1452 204 2182 800 -3188 -5323 -1285
1187 -1285 4955 5237 -1696 -8006 -5804 3423 9178 3652 -6913 -9881 -1411 8648 8591 -1440 -9756
1202 -9756 -6697 3707 9298 4066 -4404 -7566 -1880 5147 5751 1167 -3645 -2931 -154 2285 2383 2181
1218 2181 1060 -1613 -3083 -1185 3456 6388 3118 -4059 -6955 -915 8137 9282 102 -9051 -7560
1233 -7560 3767 11986 7541 -4985 -10942 -3494 8201 11175 2191 -8210 -8229 1184 9074 7224
1247 7224 -1229 -6504 -3770 2632 5574 3720 -450 -2566 -2660 -668 2221 4301 3386 -1614 -5960 -4406
1263d406P438N292l534r585n368O070J1579L387r080j2090p53J1057J1311k343
1277H975j2548q806M961J2260O054o648j1014l223P055Q264J438o233n901m75
1291e841L892M370R64j611l418k962p31M583N457R05o114p132l77Q375Q431j543
1307G248j0995q294M348J2817O465o824j3259l977R290J2159J649j0644j0377
1320a0394J390J0509P524k667r113n076K933P137L363k064m889k865Q80K940L432
1335C040J626k459n148l219L234P548L931n191r207l375P522J0721J275j0051
1349B47j0426J188J2001R276m145j2260p012O489J1524M111p701r644j396P324
1363d24P659m02o318m575K55M482L259l1j768k894j935Q4L698M159K60n331o243
$$ plain form
1263 -4406 3032 8324 4790 -4795 -10163 -4093 7486 10873 1793 -10297 -11050 7 11318 8975
1277 8975 -3573 -12379 -7418 4842 10896 4248 -6766 -9989 -2934 5330 6768 535 -5366 -5841
1291 -5841 -1949 2421 3385 1774 -1644 -4606 -5337 -754 4703 5608 -506 -7638 -8015 360 8791 7248
1307 7248 -3747 -12041 -7693 5124 11589 4765 -8494 -12471 -3181 8978 10627 -17 -10394
1320 -10394 -9004 1505 9029 6362 -2751 -7827 -4894 2243 5606 3542 -1347 -4212 -3332 -392 3040
1335 3040 4666 2207 -2941 -6160 -2926 4622 8553 3362 -5845 -9220 -1698 9023 10298 247
1349 247 -10179 -8991 3010 12286 8141 -4119 -11131 -4642 6882 10993 3292 -6352 -7748 -424
1363 -424 7235 6833 515 -4060 -3805 677 3936 3905 2137 -757 -2692 -2608 1090 5249 5509 178 -6065
1380f065L43P863O777k547r882o190N033J0965L987p211j0524k505R611R228r33
1395G950r567p563K989R382M744m577p373k358M098N180R54l030l159p08J133
1410a905J636J568R87j368l381k461K079N242L138l859p482j927O275P865K12
1425F619q162p626K145R509O294m746r697l582O548Q441Q74p240n999J062O541
1440I81L661k438m644j408K492K595o9r80p90M82j087q64Q99L278J275l000m213
1457c830n53M875M824j178o448m144L358P929J948n438o888k19O987N514k296
1472D441o758l536M240N985O05m547l973J510L261K015j948k574N51K168M22j681
1488A81r76J533J929j214k639j269L214L138r66m176k657K799N044J017m465m700
$$ plain form
1380 -6065 -5722 2141 8918 6371 -3511 -9701 -4668 6297 10284 3073 -7451 -9956 -345 8883 7950
1395 7950 -1617 -9180 -6191 3191 7935 3358 -4015 -6373 -2275 2905 3859 829 -2330 -3038 -1905
1410 -1905 -269 1299 2286 918 -2463 -4924 -2845 2397 5535 1676 -5806 -7733 -1458 6407 6619
1425 6619 -1543 -9169 -7024 2485 8779 4033 -5664 -9246 -2698 5743 6617 -623 -6622 -5560 981
1440 981 4642 2204 -2440 -3848 -1356 1239 1170 190 -600 -118 -1205 -2069 -1170 2108 3383 383 -3830
1457 -3830 -4383 492 5316 4138 -2310 -6454 -3096 4833 6781 1343 -5545 -5764 1223 6737 4441
1472 4441 -2317 -5853 -1613 4372 4977 430 -3543 -2033 1228 3243 1295 -1279 -728 1440 1862 181
1488 181 -795 738 2667 1453 -1186 -2455 759 3897 2931 -1245 -3902 -1103 3941 4958 493 -4207
1504d207J656N155K770l653n003o64M777M012j991m469k211L386M039r67l755
1519a125j738K543L456p91l623j809K370L083Q1l781k263K213L528P16l702l041
1535c883J582M111Q39k712k939K75L733J760k432l084L36L286J171k404k882R98
1551b245L329J320k380m041O64M418K728k905m620j019M620M147j262n442k438
1566e126L189N071P65m421m217R81N104K290k122m360m46K798K746r45j980r77
1582a650J505R06j133q09J048J987n37l370j267K840M216J70m921m012K005O062
1598C040L241l882o885q99N679N832p38o810m831L298O245K781l855n565o22M050
1614G9L832l66l667k211J541J593P09j57j49m78j120j239J109K827J815k057m992
$$ plain form
1504 -4207 -2551 2604 5374 1721 -3282 -3946 831 4843 2852 -1617 -3828 -442 3597 2630 -1125
1519 -1125 -2863 -320 3136 2345 -1278 -3087 -717 2366 2447 -1334 -3597 -1384 2144 2860 -842 -3883
1535 -3883 -2301 1810 2649 -63 -3002 -2727 1006 2766 334 -2750 -2414 872 2043 -361 -3243 -2245
1551 -2245 1084 2404 24 -4017 -3353 1065 3793 888 -3732 -4751 -131 4016 2754 -2688 -5126
1566 -5126 -1937 3134 3899 -522 -4739 -3758 1346 3636 1514 -2846 -3292 -494 2252 1307 -673 -1650
1582 -1650 -145 761 -372 -1181 -133 1854 1317 -2053 -3320 -480 3736 3906 -1015 -5027 -3022 3040
1598 3040 6281 2399 -4486 -5385 294 6126 5388 -1422 -6253 -2955 3290 6071 2216 -3349 -3971 79
1614 79 3911 3545 -122 -2333 -792 801 1510 1353 1204 726 -394 -1633 -524 2303 4118 2061 -2931
1631b931j657M546N530J31o180n774J797P399M989l902q282k681N082Q170Q41
1646G078o829o303R58O613M498k001o063k713K518L926J586j926k036j554N61
1661a687R30J518J637n76l358k854J187M835L288k618o107l275M295P654K032
1676F901o661p617k90Q393O956k581q590n060M335P682L453m767p612j369N201
1691a626N342L30m036l772j05L027K777L71j334k279j752K56K628L607J46l995
1707d15n070M8O598N131j713p570n015L908Q446M153n474r029k084P211Q036N8
1723G219p955o345J569P715M583k797o449k538K431M946J928j713l408j551N72
1738a793J982K319J404k224l550k224K461N369K468l667o814k124N842P489M49
$$ plain form
1631 -2931 -4588 -42 5488 5619 -561 -6335 -4538 2861 7850 3948 -4334 -7015 -1933 6237 7078
1646 7078 249 -6054 -5096 1517 6015 4014 -2049 -4762 -2244 1682 3268 1342 -694 -2248 -1687
1661 -1687 -757 761 2398 1822 -1536 -4390 -3203 1632 4920 2302 -3805 -7080 -2785 4869 6901
1676 6901 240 -7377 -7667 726 7682 5101 -3489 -8549 -4214 3468 6921 2154 -5458 -6827 -1626
1691 -1626 3716 4046 10 -3762 -3867 -840 1937 2308 974 -1305 -3057 -2801 -173 3434 3580 -415
1707 -415 -5485 -5437 1161 6292 4579 -2991 -8006 -4098 4348 8501 3027 -6002 -8086 -875 7161 7219
1723 7219 -736 -7081 -5512 2203 6786 3989 -2460 -4998 -2567 2379 4307 2594 -814 -2365 -1793
1738 -1793 189 2508 3912 1688 -1862 -4086 -1625 3744 6212 2545 -4269 -6393 -551 6938 7387
1753G387p898o753J531Q425N728l328q538m345N214P850K258n985o514m43N461
1768E0M756l55m414l690Q44L050K272K53j680k267j623P15K934L212o44m615l672
1785d874R72N782M109k281p745l283M284P869K518o128p809l68O701O695j283
1800E159p010n076K516O619L155l228n374j696L089M019N63k196k261q93P99J431
1816c84J597N49j336k490j816K032M264J637k940n457r22M746N694m15o472n128
1832f841K184P256L708l388p240k129N306N932K50n256m430J031M683K898j711
1847B253l481j737J814K073M78o82j56o77p56j56J371J985M20k526l251N02M226
1864A700L101j971m997k229L111N664R30m587m910L43N454L843j878n767k105
$$ plain form
1753 7387 -511 -7264 -5733 2692 8420 5092 -3446 -7791 -2577 5273 7531 1546 -4968 -5411 50
1768 50 4806 4451 37 -3653 -2809 241 2513 2766 1086 -1181 -2804 -2089 845 4057 3413 -1202 -4874
1785 -4874 -3902 1880 5989 3708 -4037 -7320 -3036 4833 7351 1223 -6586 -6954 -253 6442 5159
1800 5159 -1851 -6927 -4411 2208 5363 2135 -3239 -4935 -1846 2173 2736 540 -1721 -2614 -1815 -384
1816 -384 1213 1762 426 -2064 -3880 -1848 2416 4053 1113 -4344 -5266 -520 5174 4759 -1713 -6841
1832 -6841 -4657 2599 6307 2919 -4321 -6450 -1144 4788 5038 -218 -4648 -3617 1066 3964 2253
1847 2253 -1228 -2965 -1151 922 1400 718 562 -115 -871 -1027 344 2329 2749 223 -3028 -2526 1700
1864 1700 4801 2830 -2167 -4396 -1285 4379 5309 722 -4188 -3845 1609 5452 3574 -2193 -4298
1879d298L298M411O53l567k713K69L314R64r85j862J09Q07M84p32j92R77O63j429
1897A71j638N16J956K065j475l402j341L230L070K68m353k665J238M590J877l251
1913H56m127J32L626K902j622l681j295K446K651j07k642j432J657K139l58k217
1929a072j043J586J544k95k172p59J784K091m49k557j414J777K499L88k725k021
1945b838J020K994Q00k518j827M73K822J062j731k662N26K500J290j712k555K14
1961b142K679J670j362l143j91K791K326q87l478j384K192L471m8l022k315J445
1977a398K782J177k384j962M38J899J477j434j654J26J769N78j252r73Q81J509
1993A579o6k100j060J462K456M34l098k381J029L985J908k964m066l41L784L872
$$ plain form
1879 -4298 -1000 3411 4064 497 -2216 -1947 1367 2331 1346 -516 -407 400 884 152 -40 937 1600 171
1897 171 -1467 -951 1005 3070 1595 -1807 -3148 82 3152 3420 -933 -3598 -2360 2230 4107 856
1913 856 -3271 -3139 487 3389 1767 -1914 -3209 -763 1888 1781 -861 -2293 -636 1503 1145 -1072
1929 -1072 -2115 -529 1015 720 -1452 -2211 -427 1664 1215 -1342 -2756 -979 1520 1908 -817 -2838
1945 -2838 -1818 1176 1976 -542 -2369 -1896 926 1988 257 -2405 -1879 621 1911 199 -2356 -2142
1961 -2142 537 2207 845 -2298 -2489 302 2628 1741 -1737 -3121 -929 2542 2494 -528 -2843 -1398
1977 -1398 1384 2561 177 -1785 -1347 552 2029 595 -1059 -933 836 1414 162 -811 70 1579
1993 1579 1513 -587 -1647 -185 2271 2705 -393 -2774 -1745 2240 4148 1184 -2882 -3223 561 4433
2009D433r10m542k539K178M035J114k666l597K65K602K484j048k306r12J111J138
2025H40M59p70K46l31p30j080L43K408J218j457l402q06K984L602L9m556l551
2042d544J575N109K914l154n568j416L942N297o1m666l975J133M308K700j868
2057A726l740j510J918K810M40r45j755m40K6R59J066R02n51k395j919J418L517
2074A527J955k304m456j870L634N128O99m975m498K66N950M348k113n898l187
2089e794L077O050J615l768n052l44L583L711k61k991k360M26J854J446N29p61
2105I60j404j583M07K249K361j41l134l273O12M281L587j973n105l410L180O228
2121C842K368m584o064p51N288N176j70n687m446J780N378K976k128m759k056
$$ plain form
2009 4433 3523 -1019 -3558 -1380 2655 3769 1103 -2494 -2229 373 2857 1809 -497 -1409 -298 840
2025 840 1299 529 775 444 -286 -1366 -1023 1385 2603 1146 -2256 -3062 -78 3524 3563 -993 -4544
2042 -4544 -2969 2140 5054 1900 -3668 -5084 -1142 4155 4094 -572 -4547 -3414 894 3594 1726
2057 1726 -2014 -3524 -1606 1204 1644 699 -1056 -1496 -1470 -511 555 1457 906 -1489 -3408 -1990 1527
2074 1527 3482 1178 -3278 -5148 -1514 3614 4313 -662 -5160 -4894 1056 5404 3291 -2607 -5794
2089 -5794 -2717 3333 4948 1180 -3872 -4216 -633 3078 2817 -174 -2534 -2108 -254 1192 1721 960
2105 960 -444 -2027 -1620 629 2990 2849 -285 -3558 -2946 1335 4922 2949 -2156 -5566 -2386 3842
2121 3842 6210 1626 -4438 -5189 99 5275 5105 -582 -5028 -3248 2130 5106 2978 -1781 -3837
2136c837K483L525R24j589k368r67O68J460K008O86k111k888j074K390M059Q57
2152D226l375m337q73M664N001n16n725m922J950O346L743l076o400k474M150
2167a618N883P62m477m552K22L646L859r46l183k555O07K418J731k73q47k136
2183a459j136R83K323J909n10l694k778J602M560K383k290n358k225M010N732
2198D052R15m942n436L22N435M412j017o266k792K435M774K230l003l721j029
2213c631K696K899J49j545j993m98Q03J332J341J55j593j944q73K381L108N4k912
2230g1l549q2M236M002r55n043l644K673N360K042l143n066j134M141M199P8l860
2247A84l808J106L629K037j037k922q12R06J336Q70m20n85j068m75N45J256J401
$$ plain form
2136 -3837 -1354 2171 3095 1506 -862 -1829 -1161 299 2307 2993 882 -2006 -3080 -690 3369 4226
2152 4226 851 -3486 -4359 305 5306 4790 -935 -5857 -3907 2439 6182 3106 -3294 -5768 -1618
2167 -1618 4265 5027 550 -4002 -3780 -134 3725 2779 -404 -2959 -2352 66 1797 1524 677 -1459
2183 -1459 -2595 -1612 711 2620 2110 -1584 -4362 -2760 1800 4183 1893 -3465 -5690 -1680 4052
2198 4052 4967 25 -5411 -5089 346 4758 3741 -2525 -5317 -2882 1892 4122 1119 -2602 -3631
2213 -3631 -935 1964 2113 568 -1425 -1923 -1120 212 1553 1708 115 -1829 -2702 -321 2787 2841 -71
2230 -71 -3620 -3702 534 4536 3581 -1462 -5106 -2433 2927 4969 1826 -3240 -4374 -233 3966 4044 184
2247 184 -3624 -2518 1111 3148 2111 -811 -1623 -717 619 1489 1069 484 -584 -1059 -514 742 2143
2264B143n25k126j943P54L098K335k021m145j185L091M002M60l926l928Q92M401
2280A377K961k123m205j632K884L407L97k745k907Q29K532R41m92j621n18N79
2296c36O85n22M70K83L2j105j088N66K289N91j554k681j11K509K743o85l478k087
2314c479J840L383R56k311l609P71K518K343j044l009j145J641K325L15j895j312
2330a712N40J858j88j114o65R72Q80l99j473K58J175R28j115j299m35J741J852
2347A804o01k656j073J416K855m23j744j742R01K355J021j802j949K21J847J636
2363B066j432j945j43J831J382r49j718o63J792J883j120j833o05J828J364m16
2379A322j840j002J376K082j24j863j065N44J749M01j320j258N08J485M44j451
$$ plain form
2264 2143 1618 -508 -2451 -1697 1401 3736 1715 -2430 -3615 -524 3478 3938 12 -3916 -3024 1377
2280 1377 4338 2215 -1990 -3622 -738 2669 3066 321 -2586 -1757 775 1716 1224 -397 -915 -336
2296 -336 349 -173 297 580 612 -493 -1581 -1015 1274 1865 311 -2370 -2481 28 2771 2086 -1392 -3479
2314 -3479 -1639 1744 2700 389 -3220 -2449 69 2412 1368 -1641 -2786 -1145 1180 1495 -400 -1712
2330 -1712 -1172 686 498 -616 -1281 -309 571 172 -1301 -1043 132 1060 -55 -1354 -1789 -48 1804
2347 1804 1203 -1453 -2526 -1110 1745 1322 -422 -2164 -1263 1092 2113 311 -1638 -1417 430 2066
2363 2066 634 -1311 -1454 377 1759 810 -908 -1571 221 2104 984 -849 -1454 374 1738 1322
2379 1322 -518 -1520 -144 1938 1814 -49 -1114 -570 1179 1580 260 -998 -490 995 1439 -12
2395a2o13P04Q61N68j925p91O45K300J19j852j971J207K494P69j759k716J9K640
2413F87K187j158k913j239J585K723J28k176j704K48K047J099o91j681l11J233
2429F4M24j1p80J69M07q35n66M04J199J252j426j957o45J921K675k90k847k308
2447c150J141L330J641k414l393q45L155L371m00l643k071J248L068J306j482
2462H62k539q52J819J487N4r83o57m7L27J55N26M24Nj572j192R75K184J626j719
2481H83l287q28K918L213L08l931k957J004M080K680k035m231j717K836L833P24
2497C493l254k803J61L054J984p17k225j287L54J531J022K04n74j498o58L64J414
2514E65J760l52k409k204P02L398K234j564m083j636K283M414J320l536m273l
$$ plain form
2395 -12 -625 79 940 1508 -417 -1208 -563 1737 1856 4 -1967 -760 1734 2503 744 -1972 -1953 687
2413 687 2874 1716 -1197 -2436 -851 1872 2000 -176 -1880 -1632 415 1514 823 -858 -1169 64
2429 64 488 477 -303 -134 273 -562 -1128 -724 475 1727 301 -1656 -2301 -380 2295 2005 -842 -3150
2447 -3150 -2009 1321 2962 548 -2845 -3690 -535 2836 2436 -1207 -3278 -2030 1038 2344 862
2462 862 -1677 -2529 -710 777 831 -152 -809 -856 -529 -374 152 576 581 -991 -2183 -1208 976 2602 883
2481 883 -2404 -3232 -314 2899 3207 -724 -3681 -2677 1403 4083 2048 -2183 -3900 -1064 2769 3493
2497 3493 239 -2564 -2403 651 2635 1918 -307 -1594 -1240 291 1313 1517 943 -555 -1213 -849 565
2514 565 2325 1973 -436 -2640 -1938 1460 3694 2130 -1953 -3589 -1306 3108 4428 892 -3381 -3384
2530c384L919L613q41m276k887J705M005K032k090l473p41J790K476L30j249j721
2546g92q12P08J344J256j47j300k247k34J943K618L50k763l288N05L488L186p37
2563C078m531l060J986M808J849k650m675j202L465M062O56l951l328L78L436
2578C21K263q50k552j461M21J840J154Q8j395j161l79M36K292J102n70l150j489
2595c090J587L356J485k203m153j076L376L760O52l734l977N26M867K539j520
2610B395m223k166K150M196Q35k198k894p98K143K161L34j363j804l55R32J295
2626F40Q28K8j481j721P1J727K327J00k623k849P19L471K209j071m196j611K444
2643i88L847J195l001l858m14L616L404j086l081k386J111K850J808j485k258
$$ plain form
2530 -3384 535 4148 3307 -969 -3856 -2151 1854 3886 1796 -1677 -2418 -628 1848 2178 929 -792
2546 -792 -1604 -896 448 1704 1557 257 -1990 -2224 -281 2337 2687 -76 -3364 -2859 629 3815 3078
2563 3078 -1453 -4513 -2527 2281 4130 1480 -3195 -4397 -932 3130 3786 -165 -3493 -3115 321
2578 321 2584 1734 -818 -2279 -1858 -18 1136 1224 -171 -1332 -1711 -1275 1017 2119 1549 -1601 -3090
2595 -3090 -1503 1853 3338 1135 -3018 -4094 -718 3042 3694 -40 -4017 -3491 1376 3915 2395
2610 2395 -1828 -3994 -1844 2352 3187 989 -1905 -2703 -560 1601 1935 572 -1232 -1587 -655 640
2626 640 1468 1496 15 -1706 -1635 92 2419 2519 -104 -2953 -2234 1237 3446 2375 -1821 -3432 -988
2643 -988 2859 4054 1053 -2805 -3219 397 3801 2715 -366 -2752 -1641 1209 3017 1532 -726
2658g26m74O39J419O39p18n89p22n44M61J320R03m81k293j126J548K481Q24j543
2676A018l440n65L229K870n43l068k521Q62L854J494j760l396r39K365K626J56
2692B242k507j987N14J892J242r80o90q50M15N42j67M66M00o54r29k57P63J629
2710A084N78j898k184M39K558J600j119k940q26J746K757L22k511k016k6L061
2726F25J308p66k647o08J250J959L10j969o93Q33P76L14r50l20N10N92p04m93
2744f73N75Q13J04q28j201M47J537Q57r44j780n21J724J766l65k036j356J230
2761f51K041N54j732j326J72J664R67r94j458k65J318Q43l49j310l58J380M76
2778I72k67j352J80Q97P11o74r99m76J300J049l65j161r34J349J103l59j228o51
$$ plain form
2658 -726 -1200 -561 858 1497 779 190 -532 -1076 -615 705 1608 1127 -1166 -2292 -744 1737 2561 1018
2676 1018 -2422 -2987 242 3112 2569 -499 -3020 -2158 1696 3190 1430 -1966 -2905 -540 2086 2242
2692 2242 -265 -2252 -1738 154 1396 416 -274 -1124 -709 -167 -334 132 532 -122 -1051 -1308 -545 1084
2710 1084 1662 -236 -2420 -1981 577 2177 1058 -1882 -2708 -962 1795 2117 -394 -2410 -2436 625
2726 625 1933 1167 -1480 -2088 -838 1121 1431 -538 -1231 -398 378 692 -258 -578 -68 524 -180 -673
2744 -673 -98 715 819 -9 -1210 -763 774 1631 687 -1093 -1614 110 1876 1511 -525 -1881 -651
2761 -651 1390 1944 212 -1114 -942 722 1689 695 -763 -1028 290 1133 784 -526 -884 496 972
2778 972 705 -647 -467 430 1141 467 -532 -1008 292 1341 976 -185 -1119 230 1333 974 -254 -905
2796i05Q37J093j32p64p76L77J488k99r80j015P48J211L10j336j219N14J746O29
2814A527j194j708L64J456J016q77j691p37J540J607m04j607q36O83J544M71j140
2831A4r74N16N85J01n96KJ45M70j87p79j94Q63Q98p88j302l30J581J275J06k492
2851a086j152Q65K658R29k081k466K74K240J958q17k278j550J160K089J025j534
2867B34j591J67J153R11n4p41l28K8k59L54K82P39l82j191o60O02J821P41j077
2886G49k372l73K341K015k04k761j872O88L212J738j951k791o56J838K907L7k401
2903A44k032J98K430J223o73j481q72L83J165L13J8n30m01p98M24Q58J470o20
2921A219j761j490R27K469J257j245l097r08K250K982J70k843k682L76L096K253
$$ plain form
2796 -905 -68 1025 893 129 -647 -270 1218 919 -61 -1076 -328 883 1193 -143 -1362 -848 898 1527
2814 1527 333 -1375 -1011 445 1461 584 -1107 -1844 -304 1303 899 -708 -1544 -861 683 1154 14
2831 14 -960 -444 141 242 -354 -352 -207 263 76 -703 -897 -34 864 76 -1226 -1556 25 1300 1406 -1086
2851 -1086 -2238 -1373 1285 2214 133 -2333 -2059 181 2139 1322 -956 -2506 -1346 743 1768 234
2867 234 -1357 -1190 -37 874 820 79 -249 -221 -480 -126 156 895 513 -678 -1338 -736 1085 1826 749
2886 749 -1623 -1996 345 2360 2156 -605 -2477 -1789 1423 3161 1210 -1581 -2237 -399 2508 2545 144
2903 144 -1888 -1690 740 1963 1290 -191 -1063 -680 485 798 816 286 -115 -913 -489 369 1839 1219
2921 1219 -542 -2032 -1105 1364 2621 1376 -1721 -2629 -379 2603 2773 -70 -2752 -2376 720 2973
2937B973r58l105j672J196L055J052j971k061m62J479J808K8r95j082k97L35P09
2954C2J105O9j404j215m03J552K136j37j985k332J43K786K415j220l312j791J854
2971a707L772J038k586l300m32K694L048l32k918k138Q17K429J560o56k156j112
2987a979N68J541J131k95j033j117j44N43J727J014j616j658j120J676K515J064
3003B817k410k865o78L150K771j23l216k375O97L693J893j798l099j298J803K750
3019A712R11k033k164q6J475J794J48r35j478l87Q42P84N06L9j241j310j0K042
3037F09J700k78k496j631O96K790J952j846l114j236J920L392M14k683k527K4
3053b314K571K396m27k930j311Q86K163J156j309j721n89R83R28O14k53j080n38
$$ plain form
2937 2973 2015 -1090 -2762 -1566 1489 2541 570 -1491 -1953 -474 1334 1362 367 -715 -1012 -677 32
2954 32 1137 1206 -198 -1413 -1816 -264 1872 1735 -250 -2582 -2439 347 2762 1542 -1770 -3561 -1707
2971 -1707 2065 3103 517 -2783 -3215 -521 2527 2195 -723 -2861 -2044 385 1945 1289 -867 -1979
2987 -1979 -1411 130 1261 966 -67 -1184 -1328 -785 942 1956 340 -1318 -2438 -762 1753 2817
3003 2817 407 -2458 -3136 14 2785 2662 -554 -2929 -2232 1461 3354 1556 -1543 -2841 -1038 1712
3019 1712 2623 590 -1574 -1660 -185 1609 1757 822 -656 -1043 -201 583 1089 1128 -113 -1423 -1433 609
3037 609 2309 2031 -465 -2096 -1400 1390 3342 1496 -1618 -2854 -934 2458 2872 189 -2338 -2314
3053 -2314 257 2653 2226 -704 -2015 -1129 1034 2190 881 -840 -1429 -446 482 1096 843 -237 -775
3070g75j93P58J025K63n79j661q66J738K003L42j697k592j64K742J733n29k642
3087a094j825J236L065J064j664k803m67K278J773J74k445j086N35J433O74j49
3103F99q96o88K02K79K39O06k23l50q67j0J012J140j17j830j019M32K270Q05q56
3122H28k338n11J569J949O20k432k047Q64K184J313j002j946q68J434J496j12
3138A001q19q98K52N86O31m55l12K4j38L10o41O03O59l12p06p14N85J399M37r34
3158E58j587m33J829J097nj892j005Q00J753P82j586j454J34J552P33m88j358
3175e70j49Q58R79m00o86m49M46M33k62n51n4N29O55k18j107J31P95N38n70r20
3195e72j85J169N08m02j030l57M92J567j86j268p89P59R79J14j354l53M15Q15
$$ plain form
3070 -775 -968 -210 815 1078 499 -1162 -2028 -290 1713 2055 358 -2234 -2398 344 2077 1548 -1094
3087 -1094 -2919 -1683 1382 2446 782 -2021 -2488 -210 1563 1737 -708 -1794 -1259 174 848 699
3103 699 -197 -885 -683 -404 -165 441 218 -132 -999 -1009 3 1143 1026 -804 -1823 -1391 879 1684 828
3122 828 -1510 -2021 -452 1497 2117 -315 -2362 -1498 686 1999 997 -949 -1817 -383 1113 1001
3138 1001 182 -716 -464 122 753 298 -14 10 -128 182 -459 144 803 491 -215 -929 -344 1055 1492 558
3158 558 -1029 -1462 367 1464 1459 -433 -1438 -638 1115 1897 311 -1143 -1009 543 1276 788 -570
3175 -570 -719 139 1118 718 32 -417 29 462 200 -351 -405 124 779 561 -546 -415 380 918 348 -572
3195 -572 -757 412 920 518 -512 -869 -377 1190 1004 -264 -1053 -294 685 799 -555 -908 -493 322
3213C22K46q50o68M57J037J53r28p79J83Q54J062r23j187l12J326O47M0j251l83
3232i54M63R08Oq35n69M54Q22M8n77l31L03K50J46n12m84Q62M41m88q02m77J496
3253A70Q24p58q09r30O94J981L14j131j599M4J687J194q94j483o14R58J388L33
3271A369r67r33o9Q84N55l37r48L31Q8J23j89L95N60k48r42l63L10J433M39r97
3291D94j678k10K001R30j50j937j247J040J939J056j346k065n34J662J791k88
3307A458j741j199O47J362P19m76j273m40P00P96K64l84k39l39m94n5J236M08
3325I50k43q99j312L98J990P87j137j936r63J968K571l16k214j723J97K344J462
3342A924q27k334j100J386K118J83j196j570j02J084J269l4p36j045j05M41N08
$$ plain form
3213 322 568 -282 -950 -493 544 697 -231 -1010 -827 27 1089 166 -1021 -1333 -7 640 680 -571 -954
3232 -954 -491 417 423 -412 -981 -527 295 343 -234 -565 -262 -12 134 -378 -862 0 441 -47 -849 -1326 170
3253 170 994 236 -573 -1503 -809 1172 1486 355 -1244 -1200 487 1681 787 -696 -1310 -352 1036 1369
3271 1369 402 -531 -600 284 839 502 -446 -115 -27 96 -93 302 862 614 -328 -691 -381 1052 1491 494
3291 494 -1184 -1394 607 1537 1387 -550 -1797 -757 1182 2238 892 -1173 -1707 -45 1746 1458
3307 1458 -283 -1482 -835 527 1246 770 -503 -943 -243 553 817 433 194 -145 -639 -694 542 950
3325 950 707 -192 -1504 -1106 884 1671 534 -1402 -2365 -397 2174 1858 -356 -2079 -1882 462 1924
3342 1924 1097 -1237 -2337 -951 1167 1350 154 -1416 -1518 -434 835 801 65 -980 -1085 -644 -136
3359a36N95J62p07j280O4J370J249p1j861j567R02K006J310r59k649j259J457
3376a374K837Q61j862k802J67K296J831j93k248j537O95K061M85l66j345o64K05
3393i53J184Q61m01p40p59l01O76J440M69r57j482p75J216K190L86j684k279j95
3411b104K192K076l55k133j842N13K928J077j196k479n22J404K072M11j873j438
3427a269l29J747J230K5j073q04j76L01J105K82l52r60q20J39J586J067r08j532
3445g41j196P64K311O60r62k212p80K196J924M14k399k298L85K221J805n45k282
3462g35j334R05J873O30q65j189n72N70J024L29j46p90m82j40N68J142K37q34
3480A91j459l81J256J599J32j373k095M93J907J767o87k635q05R95K181R26j422
$$ plain form
3359 -136 459 621 -86 -1366 -1302 68 1317 1246 -615 -2182 -1280 726 2036 1077 -1572 -2831 -1374
3376 -1374 1463 2324 462 -2340 -2173 123 1954 1761 -487 -2024 -1329 732 1217 851 -494 -1158 -953
3393 -953 231 1092 691 -49 -808 -1109 -433 1007 1476 519 -963 -1738 -522 1668 2054 370 -1909 -2104
3411 -2104 88 2164 1809 -324 -2166 -1653 1275 2352 1156 -1323 -1845 -441 1631 2042 169 -1269
3427 -1269 -1598 149 1379 1404 331 -473 -649 -348 757 1039 687 -273 -1093 -954 632 1699 791 -741
3445 -741 -1937 -1173 1138 1798 836 -1376 -2156 40 1964 2378 -21 -2319 -1934 287 2092 1547 -735
3462 -735 -2069 -1164 709 1339 474 -715 -1287 -717 307 636 490 -300 -782 -922 -354 788 1025 191
3480 191 -1268 -1649 -393 1206 1338 -35 -2130 -1637 270 2037 1350 -1285 -2090 -1095 1086 2012 590
3497E90k083l14J534J515j54j406j209M39J259R85o38r18j74M2L57N96J43l16
3515B48p27j51l61J158R06k97j356r54O76J914O21j255j842k83J477K154k25j919
3533b16j397N17J998O33q13j484k33J174J117k66o00j026J62N63N42q1m43k7N9
3552A79m74PO11M02l66p81l10N36J211K99j224r71k32J470J027m57j482m70R13
3571a12J192L81j456j020J25J411N58n12j159Q2N81O50Mp37l44L62Q9k18j36M68
3591B09j1J30n39j64K82P77l95l96p44J4J002N07j70j144k79O65J267k74j603
3610h66j08M81R60O10j180o61j34J155K32n41p18L45M37M87p19m76m6R47L59p32
3630a68o02M0P96M44n10p80L98K97O32J68j161o5N83J86P5n84O8J79M44l33o09
$$ plain form
3497 590 -1493 -1807 -273 1242 1088 -318 -1527 -1088 171 1156 518 -400 -574 -532 -175 421 564 248
3515 248 -479 -630 -991 167 1073 776 -580 -1534 -858 1056 1677 422 -1420 -1703 -226 1928 1703 -216
3533 -216 -1613 -1096 902 1535 722 -762 -995 179 1296 1030 430 -596 -434 129 671 590 147 120 179
3552 179 -295 -288 323 725 359 -422 -732 -196 1015 1314 90 -881 -1113 357 1384 927 -555 -1025 -112
3571 -112 1080 1461 5 -1015 -890 521 1079 567 -592 -510 71 721 725 -12 -356 6 95 -123 -259 209
3591 209 198 328 -211 -375 -93 684 289 -107 -851 -837 165 672 502 -642 -921 -256 1011 737 -866
3610 -866 -974 -493 467 1077 -103 -764 -898 257 489 -52 -770 -425 12 499 -220 -696 -742 205 564 -168
3630 -168 -770 -730 66 510 0 -780 -382 -85 547 715 -446 -511 72 258 333 -251 -183 -4 440 107 -502
3651e02jP02N68l63q98j13O52M54K40r33p02O58J161pr09q84K54J100O56o12j272
3672g51q7P46R26N4o88r28O54P73l6n94k81j36M23r3j84L09N97m55k16l83p1J065
3694F44J94m23j273K49P60R93J1j609r45O05J736L82j069j215j88J358J148n10
3712H48j022r18P29Q15L99m92o12k98K48M89K83n56M2k52R8j73P08K46K00j411
3732f29o21N39J536K78q65j393l17J453J149J60j829j276O47J742P85o92j952
3749a285m10J343J007J59q07r71l82J241N27M55j118o90M66K35L37L72Q0p22n11
3768f74j41R72O07J64j364j168N44J969N84n39j929q12J297J793O06j767j511
3785a369J98J303J392l24j467q63L82J612M57p26p71n82K93R36L38l42m16p37
$$ plain form
3651 -502 -503 199 767 404 -494 -607 45 499 739 -194 -896 -238 923 916 7 -877 -623 477 1133 521 -751
3672 -751 -838 -92 834 888 200 -728 -74 699 663 69 -212 -348 75 -18 -202 107 704 249 33 -350 -421 644
3694 644 838 415 -858 -609 151 1144 1155 -454 -1399 -794 942 1324 255 -960 -1148 210 1358 848
3712 848 -174 -1092 -363 452 851 359 -253 -551 -303 186 469 -87 -45 -297 -199 -372 336 582 782 -629
3732 -629 -1250 -711 825 1103 238 -1155 -1472 -19 1130 1290 -539 -1815 -1168 574 1359 667 -1285
3749 -1285 -1695 -352 655 814 7 -964 -1346 -105 422 877 -241 -931 -465 -230 107 479 559 -163 -674
3768 -674 -815 157 764 928 -436 -1604 -1060 909 1493 954 -975 -1787 -490 1303 1909 142 -1369
3785 -1369 -1171 132 1524 1200 -267 -1130 -748 864 1321 595 -176 -758 -465 471 809 467 51 -686
3803f86j07N84J190N5o83j234n28J495J359K43j580j488n1J776J555p15j869p92
3821a476R27J705P41j194j568m11J131J303J85j264j295L86Q12J031j99o99q82
3838g67J3M39R84J28k85p45o20K07J277M71m14j206j062P60J942R35j606j555
3856a104p55J578J802j1j828j227K41J596R94r14q72j251R97J347L77n58r51k90
3874h29N31N43L61j01q02l45p0R12O12p5j074r17O7R61J524l39j358j322K94J908
3894D81R45l56j975j106J229J476J121j500j886L25J417J257m37j192j070P21
3910e50J000K33p8q80j88O7O5R66q4k80q30k5K10P76Q03m99j425k79O50J591M62
3931A705j361j424l4J450J237j92j534j187P52J674O12q12j749k59P82J248o8
$$ plain form
3803 -686 -793 -209 981 1036 353 -881 -1409 86 1445 1688 108 -1380 -1431 345 1900 1185 -684 -1476
3821 -1476 -549 1156 1897 703 -865 -1276 -145 1158 1343 79 -1216 -830 -18 1013 814 115 -767
3838 -767 -754 -315 669 797 512 -233 -853 -646 631 1102 688 -518 -1580 -820 1122 2057 451 -1104
3856 -1104 -1859 -281 1521 1510 -318 -1545 -1304 292 1286 372 -500 -1751 -754 593 970 412 -539 -829
3874 -829 -298 245 606 505 -297 -642 -712 200 812 737 -337 -1254 -1187 -226 1298 959 -399 -1721 -1427 481
3894 481 1426 1070 -905 -2011 -782 694 1815 315 -1571 -1246 171 1428 991 -201 -1271 -550
3910 -550 450 683 605 -275 -463 -396 -331 635 551 271 -559 -584 -374 402 1205 706 -719 -998 -348 1243 1705
3931 1705 344 -1080 -1114 336 1573 1381 -153 -1340 -588 1086 1698 886 -863 -1122 -340 908 840
3948H40p95p13Q5P68L19P6m45nm26l38O40K64J93o29l17l10R01O24p6o99r95J28
3970i10J477N39m00j481n20R34J066L86j292p40L48Q02O83l90j197J09M43L90
3988B47J44m67k15K49j42K04j15L1J92j64l18r5K36P24l4q08l61M10M60J69n66
4009b19m96j76Q40Q65n31q16l26N30P98J26p79m69J94P05L24m67n15j61Q35j12
4029A50o1j70l68O46J64n56Pj22Q56l60j56l31KN60K05k14o64J31L57N87l46q03
4051d86l1N11N78j39p27j66K87P06k41k59m87K59P22J81p86m20O48M84o6m52l84
4072b68K8L69N05k50q26K4O39L12l56k82k33J12L89M26n88j88M10j66J96j34m93
4093c74N35L52n09l41l0N42N67n47q26L18K3R88j92r59o16Q24R37k8k70j122j07
$$ plain form
3948 840 45 -668 -583 185 504 580 135 130 -296 -634 6 270 463 -166 -483 -793 108 732 656 -43 -1038 -910
3970 -910 567 1106 706 -775 -1295 -361 705 1091 -201 -941 -593 209 892 502 -695 -586 -143 247
3988 247 391 -76 -291 -42 -184 20 -95 -64 128 -36 -354 -449 -213 511 477 -331 -692 -282 178 347 -219
4009 -219 -715 -891 -51 814 283 -533 -859 -329 469 595 -184 -653 -459 246 570 103 -412 -573 262 150
4029 150 89 -81 -449 197 361 -195 -188 -310 546 186 30 -301 -299 261 466 252 -412 -281 76 663 317 -486
4051 -486 -517 -6 572 433 -294 -460 -173 533 292 33 -454 -195 527 708 -78 -498 150 634 568 116 -268
4072 -268 -240 129 634 384 -442 -418 221 533 177 -105 -338 -226 163 589 1 -187 223 57 253 119 -374
4093 -374 161 513 4 -337 -367 175 742 195 -631 -313 -290 698 506 -453 -1069 -245 692 664 394 -728 -835
4114h35R71K43l78l80m10N83O03k55j77n30K21Q1L14K6k78K36k36n53K68L76O26
4135E16l00o72m32M30Q70N41q08j266o6J432P84o21j001p88P99J124K41o50r68
4154h35k88J082Q61j84n76q66L74M77L38K46n25m40%M4Q29m70L08o58j82J08N00
4175A43O40j36p06q88N14R66P76r04j377j83J065J015K19j175j073J14J576O44
4193A230m17r96p21N77P75M89m39p27k15M45J81K09j27k79o76J32N22P81K11q45
4213A10n24j46L03J169K13j145j378M95J551P05n53j343q76O95J307Q13r34j450
4231i88l01J165J087j35r65o40J32P53O47k11o87m14J26N20J97M30m39q79l30
4250i32M42P78O79n32j002o77N80J341O71r08j423k39J280J119n8j251j415Q76
$$ plain form
4114 -835 136 379 1 -379 -789 -206 397 142 -35 -565 -344 -263 51 77 -201 35 -201 -754 -486 -110 516
4135 516 216 -456 -888 -458 412 953 145 -1121 -1187 245 1029 408 -593 -1381 -582 542 783 133 -835
4154 -835 -1123 -41 820 636 60 -806 -432 45 383 629 104 -336 -336 -292 537 67 375 -283 -465 -357 143
4175 143 783 647 -59 -947 -433 533 1309 405 -972 -1155 -90 925 1144 -31 -1104 -990 586 1230
4193 1230 813 -183 -904 -327 448 937 498 -229 -444 1 182 391 264 -15 -691 -559 -37 744 955 110
4213 110 -414 -560 -257 912 1125 -20 -1398 -903 648 1353 800 -543 -1419 -724 583 1396 462 -988
4231 -988 -1289 -124 963 828 -137 -777 -645 108 755 544 -143 -557 -431 89 286 716 277 -602 -932
4250 -932 -490 288 967 435 -567 -1244 -664 677 1348 440 -983 -1222 58 1177 1119 -132 -1547 -671
4268f71J306O88n53j573n75Q78R25O47j057o70QM61K93L69n2q81m7L8O11L89J80
4289G14r97o21M28Q20N75k32r47p00J06J605O16n98j323p36O82J529K16q52j442
4308a157P8J011J125j79j037p29M95R84Q4m3p39j76l80O74K83K01n05k74J95k29
4328c18Q92K65l6j252j74L90R17M03r08j248J92J041Q57R1j685m10K96J237M42
4347I92m97r41m67P64P82J83o56n12o1M09N22k52k21m4m43J48J21N62J22m39o80
4368f08O0N14O87j22j007n02N52J004J46k32j112n00J013R58N9j195m77k35J192
4387A95N12n88l42k37M55O6p6Lk70j96M23J57j76K35Q8m57k89l6N14N73l58o27
4409d31k93N62R20j87q11l86K32Q19L78m43r02j36L93R60J51p54p67J15P89N24
$$ plain form
4268 -671 635 1323 770 -803 -1378 -500 425 1072 15 -655 -647 -186 107 476 424 -457 -504 -466 145 534 714
4289 714 -283 -904 -476 344 919 687 -260 -960 -854 751 1367 769 -554 -1290 -608 921 1137 285 -1157
4308 -1157 -1079 -68 1057 878 -159 -888 -393 591 675 632 -107 -283 -663 11 294 495 -10 -284 -89 -318
4328 -318 574 839 803 -449 -623 -233 684 1087 179 -1069 -877 164 1021 1112 -573 -983 -687 550 992
4347 992 495 -446 -913 -149 633 816 160 -352 -413 -4 518 266 45 1 -442 -294 -173 389 511 72 -608
4368 -608 -548 -34 653 531 -476 -978 -426 578 724 492 -620 -1120 -107 851 910 -285 -762 -997 195
4387 195 707 119 -223 -460 -5 61 -15 -12 -282 -478 -55 102 -74 161 249 -208 -497 -533 -19 554 196 -431
4409 -431 -724 -162 758 571 -240 -626 -394 425 803 360 -542 -678 -285 675 826 72 -695 -580 209 733
4429G33o35l21J67J07O9J54m00J72o7M03o13n8L04N09k36m36J46l9M90J01o41
4450i1k67K18J27N03j1o91j32N45O28l32o38l92Q30M10m55l50q0Q5N17K07n33
4471I8k55n6O10Lm37j37K83L04L9j74q77J80L77K46Q2m69R4M13j99j04l59j38
4493d76L21K59M2l15J22j70L84k16n75M11L68L97n42m31j59O47N93m02n33m13
4513f88M43O64P0m18o59K00L34P41m79l77m01N08P2L47m14k05m8L88j41j13L62
4534A86p5l6k39L5m2M09j29n73K25j84R05jn44p22j85J188M55Jj051m57N9J142
4556C67M85o45l88n12P27P14R3r97l78J30O45K05k49J0l78J53J37M5Q3J6n00k48
4578d85j88O79M10K28o64n23R8P77L55o6j304P6M81J452l57j104l86J82O94O86
$$ plain form
4429 733 98 -223 -56 51 120 274 -126 46 -21 382 -231 -289 15 524 288 -148 -2 -41 449 550 -91
4450 -91 -358 -140 -13 490 479 -212 -344 201 829 497 -141 -533 297 707 252 -98 -178 -93 424 631 98
4471 98 -157 -213 397 400 -37 -174 109 413 452 278 -599 -419 -42 204 286 -183 -89 324 125 21 -338 -476
4493 -476 -155 104 146 -169 -47 -217 167 -49 -624 -213 155 552 10 -421 -580 67 660 258 -275 -688
4513 -688 -245 419 489 71 -588 -388 -54 687 208 -169 -570 -62 10 357 -57 -262 -310 78 -63 -176 186
4534 186 111 75 -164 -129 -171 238 109 -464 -239 -423 482 481 -63 -785 -970 218 673 674 -377 -834 -775 367
4556 367 852 207 -181 -693 34 748 841 -156 -534 -404 241 446 197 207 -171 -18 119 164 247 263 -237 -485
4578 -485 -673 6 416 644 -20 -543 -445 332 687 621 -683 -607 -126 1326 969 -135 -521 -339 355 1041
4598A041l60r71p59P19Q60J04m86p06J37M8Q16r8j92k90l74K60K66O89l8p05m56
4619d95l26P88Q74r0r13p81m6J179R21k28j265o00P10R68K50r19q36q4P77R55
4639H39l44o31j77l87P39L94k49l29k53J12K51N04n0l84m12k14L21O20J54l50
4659A54r06k61N87J202J46o66j074k72J088J017m50r91o44K10J270N76o60r17
4677e91j88N19Q84j77k46n90k17N25M80J88m95j04l81M6N54L96r3n87o75K70N22
4698D0J133m62j249l61L71J067P04p35j021o92J111Q39K85n68j087m54J231P14
4716H66j05r69l35K74N83L23n08l76k37K71J15M48M02l80p99j47L76O01L65m78
4736B90n94n17R83N88M7q79q44L49R50P25n29r22o19M93R07M08n25j093K62M83
$$ plain form
4598 1041 681 -290 -1049 -330 530 634 148 -558 -421 -373 443 345 153 -137 -511 -251 15 704 666 -39 -495
4619 -495 -821 -33 841 751 -162 -943 -989 190 1111 883 -382 -982 -272 696 946 27 -809 -893 -116 839
4639 839 495 -136 -313 -700 39 433 184 -145 -398 -286 -35 469 419 35 -377 -591 -270 350 504 154
4659 154 -752 -1013 -426 776 922 256 -818 -1090 -2 1015 565 -426 -1070 -860 410 986 326 -591
4677 -591 -779 -260 624 447 201 -389 -606 -81 399 587 92 -12 -393 -347 207 603 510 -77 -752 -482 40
4698 40 1173 711 -538 -899 -528 539 1243 508 -513 -1205 -94 745 1030 462 -625 -1079 152 866
4716 866 761 -208 -543 -269 314 637 129 -247 -484 -213 -98 350 752 372 -427 -574 -198 403 768 290
4736 290 -304 -821 162 750 797 -82 -926 -577 373 1098 569 -353 -972 -479 428 836 311 -782 -520 -37
4756c7L48J75n10m78O30j88M49l74K46p14M2k20O53M14j68k65m07m8M69J71J04
4777B92o44n88M73Q93M82q64p44kM84J167j86j024n44N6P12O57l90m78m98Q10
4797F4j72L05k50k63J67J04Q8J48M8O4m73k77K77J25L75k29n07M2L2Q18L72r43
$$ plain form
4756 -37 311 486 -24 -502 128 -60 389 15 261 -453 -411 -631 22 436 268 3 -404 -452 17 188 292
4777 292 -352 -940 -467 426 908 44 -700 -702 -218 949 763 -261 -805 -749 -37 620 230 -248 -746 64
4797 64 -108 197 -53 -316 -149 -45 43 191 239 303 -170 -447 -170 -45 330 101 -406 -364 -332 486 858 -85
$$ [...]
8191b27
##END NTUPLES=NMR FID
##END=
