##TITLE=1H_LR-644-1A
 DMSO, 8 sc, 
 28.2.2020
##JCAMPDX= 6.0         $$ Bruker NMR JCAMP-DX V2.0
##DATA TYPE= NMR FID
##DATA CLASS= NTUPLES
##ORIGIN= UXNMR, Bruker Analytische Messtechnik GmbH
##OWNER= root
$$ XWIN-NMR		Version 3.5
$$ Fri Feb 28 16:13:23 2020 Russian Standard Time (UT+4h)  she@DPX200
##.OBSERVE FREQUENCY= 200.1315
##.OBSERVE NUCLEUS= ^1H
##.DELAY= (6, 6)
##.ACQUISITION MODE= SIMULTANEOUS
##.ACQUISITION SCHEME= undefined
##.AVERAGES= 8
##.DIGITISER RES= 18
##SPECTROMETER/DATA SYSTEM= spect
##.PULSE SEQUENCE= zg30
##.SOLVENT NAME= D2O
##.SHIFT REFERENCE= (INTERNAL, D2O, 0, 15.7039)
##AUDIT TRAIL= $$ (NUMBER, WHEN, WHO, WHERE, WHAT)
$$ ##TITLE= Audit trail, XWIN-NMR		Version 3.5
$$ ##JCAMPDX= 5.01
$$ ##ORIGIN= Bruker BioSpin GmbH
$$ ##OWNER= she
$$ F:/spectra/data/she/nmr/H-F/1/audita.txt
$$ ##AUDIT TRAIL=  $$ (NUMBER, WHEN, WHO, WHERE, WHAT)
(   1,<2020-02-28 16:12:25.62 +0400>,<she>,<DPX200>,
      <created by zg, POWCHK disabled, PULCHK disabled
       configuration hash MD5:
       00 E9 B6 7A A2 85 ED C7 34 08 36 98 17 FE 4E 26
       data hash MD5: 16K
       53 CE 28 7C 5A 40 8C 40 E1 65 83 A5 89 84 39 64>)
$$ ##END=
$$ 
$$ hash MD5
$$ D8 1A 00 4D E2 10 F7 EC 44 25 57 95 06 DD 9F F8
##$RELAX= 
##$RELAX= 
##$RELAX= 
##$RELAX= 
##$RELAX= 
##$RELAX= 
$$ Bruker specific parameters
$$ --------------------------
##$DU= <F:/spectra>
##$EXPNO= 1
##$NAME= <H-F>
##$PROCNO= 1
##$TYPE= <nmr>
##$USER= <she>
##$AMP= (0..31)
100 100 100 100 100 100 100 100 100 100 100 100 100 100 100 100 100 100 
100 100 100 100 100 100 100 100 100 100 100 100 100 100 
##$AQSEQ= 0
##$AQ_mod= 1
##$AUNM= <au_zg>
##$AUTOPOS= <>
##$BF1= 200.13
##$BF2= 200.13
##$BF3= 200.13
##$BF4= 200.13
##$BF5= 200.13
##$BF6= 200.13
##$BF7= 200.13
##$BF8= 200.13
##$BYTORDA= 1
##$CFDGTYP= 0
##$CFRGTYP= 5
##$CHEMSTR= <none>
##$CNST= (0..31)
1 1 145 1 1 1 1 1 1 1 1 1 1 1 1 1 1 1 1 1 1 1 1 1 1 1 1 1 1 1 1 1 
##$CPDPRG= <>
##$CPDPRG1= <>
##$CPDPRG2= <>
##$CPDPRG3= <>
##$CPDPRG4= <mlev>
##$CPDPRG5= <mlev>
##$CPDPRG6= <mlev>
##$CPDPRG7= <mlev>
##$CPDPRG8= <mlev>
##$CPDPRGB= <>
##$CPDPRGT= <>
##$D= (0..31)
0 1.2 0 0 0 0 0 0 0 0.06 0 0.03 0 0 0 0 0.0002 0 0 0 0 0 0 0 0 0 0 0 0 
0 0 0 
##$DATE= 1582891944
##$DBL= (0..7)
120 120 120 120 120 120 120 120 
##$DBP= (0..7)
150 150 150 150 150 150 150 150 
##$DBP07= 0
##$DBPNAM0= <>
##$DBPNAM1= <>
##$DBPNAM2= <>
##$DBPNAM3= <>
##$DBPNAM4= <>
##$DBPNAM5= <>
##$DBPNAM6= <>
##$DBPNAM7= <>
##$DBPOAL= (0..7)
0.5 0.5 0.5 0.5 0.5 0.5 0.5 0.5 
##$DBPOFFS= (0..7)
0 0 0 0 0 0 0 0 
##$DE= 6
##$DECBNUC= <off>
##$DECIM= 24
##$DECNUC= <off>
##$DECSTAT= 4
##$DIGMOD= 1
##$DIGTYP= 9
##$DL= (0..7)
0 120 120 120 120 120 120 120 
##$DP= (0..7)
150 150 150 150 150 150 150 150 
##$DP07= 0
##$DPNAME0= <>
##$DPNAME1= <>
##$DPNAME2= <>
##$DPNAME3= <>
##$DPNAME4= <>
##$DPNAME5= <>
##$DPNAME6= <>
##$DPNAME7= <>
##$DPOAL= (0..7)
0.5 0.5 0.5 0.5 0.5 0.5 0.5 0.5 
##$DPOFFS= (0..7)
0 0 0 0 0 0 0 0 
##$DQDMODE= 0
##$DR= 18
##$DS= 0
##$DSLIST= <SSSSSSSSSSSSSSS>
##$DSPFIRM= 0
$$ [...]
##$SUBNAM2= <"">
##$SUBNAM3= <"">
##$SUBNAM4= <"">
##$SUBNAM5= <"">
##$SUBNAM6= <"">
##$SUBNAM7= <"">
##$SUBNAM8= <"">
##$SUBNAM9= <"">
##$SW= 24.9337058887773
##$SWIBOX= (0..15)
0 0 2 0 0 0 0 0 0 0 0 0 0 0 0 0 
##$SW_h= 4990.01996007984
##$TD= 16384
##$TD0= 1
##$TE= 0
##$TE2= 300
##$TE3= 300
##$TEG= 300
##$TL= (0..7)
0 120 120 120 120 120 120 120 
##$TP= (0..7)
150 150 150 150 150 150 150 150 
##$TP07= 0
##$TPNAME0= <>
##$TPNAME1= <>
##$TPNAME2= <>
##$TPNAME3= <>
##$TPNAME4= <>
##$TPNAME5= <>
##$TPNAME6= <>
##$TPNAME7= <>
##$TPOAL= (0..7)
0.5 0.5 0.5 0.5 0.5 0.5 0.5 0.5 
##$TPOFFS= (0..7)
0 0 0 0 0 0 0 0 
##$TUNHIN= 0
##$TUNHOUT= 0
##$TUNXOUT= 0
##$USERA1= <user>
##$USERA2= <user>
##$USERA3= <user>
##$USERA4= <user>
##$USERA5= <user>
##$V9= 5
##$VALIST= <valist>
##$VCLIST= <CCCCCCCCCCCCCCC>
##$VD= 0
##$VDLIST= <DDDDDDDDDDDDDDD>
##$VPLIST= <PPPPPPPPPPPPPPP>
##$VTLIST= <TTTTTTTTTTTTTTT>
##$WBST= 1024
##$WBSW= 4
##$XGAIN= (0..3)
0 0 0 0 
##$XL= 0
##$YL= 0
##$YMAX_a= 231253
##$YMIN_a= -127964
##$ZGOPTNS= <>
##$ZL1= 120
##$ZL2= 120
##$ZL3= 120
##$ZL4= 120
##$ABSF1= 10
##$ABSF2= 0
##$ABSG= 5
##$ABSL= 3
##$ALPHA= 0
##$AQORDER= 0
##$ASSFAC= 0
##$ASSFACI= 0
##$ASSFACX= 0
##$ASSWID= 0
##$AUNMP= <proc_1d>
##$AZFE= 0.1
##$AZFW= 0.1
##$BCFW= 1
##$BC_mod= 2
##$BYTORDP= 1
##$COROFFS= 0
##$CY= 11.3945322036743
##$DATMOD= 1
##$DC= 2
##$DFILT= <>
##$DTYPP= 0
##$F1P= 16.9975609425685
##$F2P= -3.02152046262296
##$FCOR= 0.5
##$FTSIZE= 0
##$FT_mod= 4
##$GAMMA= 1
##$GB= 0.15
##$INTBC= 1
##$INTSCL= 1
##$ISEN= 128
##$LB= 0.24
##$LEV0= 0
##$LPBIN= 0
##$MAXI= 10000
##$MC2= 0
##$MEAN= 0
##$ME_mod= 0
##$MI= 1.114404
##$NCOEF= 0
##$NC_proc= 0
##$NLEV= 6
##$NOISF1= 3.799351
##$NOISF2= 2.8
##$NSP= 1
##$NTH_PI= 0
##$NZP= 0
##$OFFSET= 15.70392
##$PC= 1
##$PHC0= -9788.817
##$PHC1= 11.40082
##$PH_mod= 1
##$PKNL= yes
##$PPARMOD= 0
##$PSCAL= 0
##$PSIGN= 0
##$REVERSE= no
##$SF= 200.130013532006
##$SI= 16384
##$SIGF1= 3
##$SIGF2= 2
##$SINO= 400
##$SIOLD= 16384
##$SREGLST= <1H.CDCl3>
##$SSB= 0
##$STSI= 0
##$STSR= 0
##$SW_p= 3612.71676300578
##$SYMM= 0
##$S_DEV= 0
##$TDeff= 0
##$TDoff= 0
##$TI= <>
##$TILT= no
##$TM1= 0
##$TM2= 0
##$TOPLEV= 0
##$USERP1= <user>
##$USERP2= <user>
##$USERP3= <user>
##$USERP4= <user>
##$USERP5= <user>
##$WDW= 1
##$XDIM= 8192
##$YMAX_p= 0
##$YMIN_p= 0
$$ End of Bruker specific parameters
$$ ---------------------------------
##NTUPLES= NMR FID
##VAR_NAME=  TIME,          FID/REAL,        FID/IMAG
##SYMBOL=    X,             R,               I
##VAR_TYPE=  INDEPENDENT,   DEPENDENT,       DEPENDENT
##VAR_FORM=  AFFN,          ASDF,            ASDF
##VAR_DIM=   8192,          8192,            8192
##UNITS=     SECONDS,       ARBITRARY UNITS, ARBITRARY UNITS
##FACTOR=    0.0002004,     1,               1
##FIRST=     0,             0,               0
##LAST=      1.6414764,     0,               0
##MIN=       0,             -127964,         0
##MAX=       1.6414764,     231253,          0
$$ Real data points
##PAGE= N=1
##DATA TABLE= (X++(R..R)), XYDATA
$$ [...]
1937a319O84J736l22q93p58K06J294N19q64j244k84J003J262q4j267n93J17J117
1955C10P93p30r08n41P33J245j03q98j084K40J320O56q05q20l29N67J322j18j074
1974b24j002L57J340O01n93j437k21J191J088l99p35r63J76J625K27p35j008n02
1992a214Q64J327k34j257m29M92R03M30l43j231k71O90J008j80n31j063M49Q95
2010C05P52k37j373P5L05R90J44j199o27K92Q57R61n00j333n06Q42J143K19j173
2029f3j038K92J244P47r10q45l34P71J110j23j011j074L10J395N52p32j144k28
2047a081J057R35j15j155m23J56J084K95p50o02m73R53J128r5j200o68N37Q38
2065D21L47p44o17k34O98R78j66o25r28L87P18O68o10j061l52O78J293n4r02q82
$$ y = [-1319, -635, 1101, 779, -114, -872, -666, 628, 1147, 283, -961, -1245, -242, 1020, 936, -331, -924, -807, 310, 1103, 373, -535, -1076, -343, 902, 799, -99, -1183, -943, 377, 1033, 228, -592, -921, -354, 968, 850, -224, -1226, -869, 471, 1072, 479, -958, -1179, 12, 1100, 701, -34, -997, -821, 804, 1031, 296, -712, -1214, -350, 977, 743, -514, -943, -451, 452, 882, 539, -692, -963, -273, 735, 555, 24, -1039, -590, 305, 1057, 820, -553, -478, -173, 817, 961, -238, -865, -573, 284, 1245, 745, -588, -1094, -252, 891, 1110, -63, -1101, -809, 435, 1182, 272, -573, -907, -136, 974, 851, -160, -1234, -924, 471, 1023, 291, -853, -1081, -24, 911, 796, -359, -782, -626, 458, 753, 3, -599, -1072, -119, 1009, 914, -286, -954, -417, 421, 768, 24, -593, -827, -129, 849, 683, 58, -870, -483, 235, 903, 293, -768, -1120, -442, 851, 797, -105, -987]
2085i87L98R49N40n47j009m53R02J207j48p66q61J0J112P72q31p69m42O04Q81
2104E62K02j023q30N35Q23M57o9j325n24Q53J247k30o60o39k1J013N31n97q83
2123e78j03N08P99K39j025o63M9J174O10p64j008l88R77R25n6o92p09r3J112M10
2143G24j08q33o20O61J023No99j020P1R92O20k72j448L0M38J015l0o34m67l3J073
2164D88L37p40o01k82O30O74K63r91j73p7R38K34n23o11m50Q11N99J44q10l36
2184d76j45Q79M22k75q82m52Q57O78K2m69j049M42L54N41l6o18o02O27M46M44
2204G08l85j449N80P96P53n50p01l46M58N77L63q43n90J61Q26L09m66n28m03N52
2224a78Q16j82l16p32O5Q68L48k58o70m76P97M71J1o43o09K21N56M99l30p06j98
$$ y = [-987, -589, 360, 900, 353, -656, -1109, -207, 1000, 852, 86, -775, -765, 347, 1119, 288, -481, -923, -319, 562, 764, -259, -1089, -554, 269, 726, 657, -668, -1192, -339, 908, 678, 18, -621, -642, 371, 902, 305, -578, -681, -173, 626, 865, -160, -823, -774, 400, 1010, 246, -762, -1150, -173, 752, 696, 4, -705, -798, 314, 724, 616, -217, -837, -176, 847, 852, 153, -867, -796, 196, 816, 544, -904, -874, -436, 579, 549, -85, -552, -585, 488, 825, 85, -516, -798, -168, 506, 769, -222, -395, -472, 466, 700, 177, -434, -884, -73, 526, 670, -140, -476, -621, 258, 680, 405, -477, -929, -72, 606, 628, 159, -890, -448, -94, 447, 411, -207, -809, -182, 264, 708, 323, -1126, -546, 250, 1003, 453, -248, -594, -136, 441, 804, -39, -629, -468, 358, 667, 201, -327, -730, -178, 638, 456, 140, -592, -527, 341, 689, 431, -239, -715, 82, 553, 564, -79, -688, -467, 89, 588, 258, -448, -646]
2245f46N57N77L63j027k36q3M86O83l06q89j92M60R89l0o98p76L61J023j08k8
2265D80q74k57P38L32j0l03n86M3R57K29k40j023r5KJ134J02o25o39L32P20J81
2286E98j56r16n4M66N89l01m50k93L39L66M20k72p43k66L20P33J18n27m53K58
2306b24L95N03m73o48j46L67O94J73n16n98j12P90L83j46r39kO79M34l5p17l88
2327e26QN46N02m07n48r3L58N35J56l43p05K9N99K28j64n20j30K08R83k16n95
2348i5m57P1Q69L36m99n37j45N10M47r7l57q01L83O23N52l60r23o4K10O17J37
2369D20n72l87K81L85O43m70p88q5M47M17Q9n67l70L40L12N15n36m40k02K99N32
2390B63L15m47o53J09M70L61k6o45k19L78L85L97o80n86K34L27J78ql25o88M86
$$ y = [-646, -89, 488, 851, -176, -412, -495, -9, 674, 368, -521, -713, -253, 736, 706, 8, -768, -407, 616, 508, 480, -394, -651, 87, 419, 409, 106, -480, -437, 520, 749, 509, -514, -609, -607, 527, 629, 4, -635, -303, 417, 598, 442, -474, -528, -62, 527, 226, -224, -517, -178, 188, 608, 336, -407, -673, -353, 380, 498, -29, -482, -224, 171, 674, 201, -447, -593, -226, 468, 641, 125, -473, -585, 205, 588, 442, -497, -499, 180, 614, 579, -138, -526, -518, 28, 530, 123, -425, -518, -160, 375, 531, 188, -517, -488, 111, 339, 175, -345, -475, -267, 716, 500, -95, -552, -481, 388, 724, 225, -312, -457, 53, 500, 403, 46, -755, -372, 251, 803, 443, -480, -544, -334, 283, 420, -152, -539, -258, 127, 770, 300, -488, -573, -126, 291, 380, -187, -557, -217, 95, 610, 74, -366, -568, -269, 263, 578, 131, -522, -413, 57, 418, 392, -253, -472, -94, 291, 688, 8, -578, -344, -17, 161, 153, -172, -860, -374]
2411c74P29p4k09p36K10O53j2M91r39l5J39L37L60n27m43M1P13M5m27l69j36L71
2433a92N62L49r14l80P7R42q7j09p91M6M62M54j7k48n84K89L55O6k7n17K47l41
2455c58R49p5n65k44L07m6L11r8l46p3k9M51K94m09m27L3N4O28J75p68k24J80
2477b80M53K20n83k73j35L37N25o9o37n4M30L69K4l29p59J78M66N87j60o28m31
2498g49Q52J42R3n62n3J4M37L16n40j47j7K18M78j84k65l05k3L96K22k23k08l54
2520d62MP82j3m75j07P8L51K97j55p69j69N78K47J06j02p62J46M91L71k32n71
2541c66l15L21O82L9l45l65P0L98L83k91n26r0J83M59k33k51P7N7K79J5m9n53
2563d21j10N51p3L29n28j09N6M98M4k80j20r1j11Q39j89k45k08k6K17M28n35k95
$$ y = [-374, 355, 281, 72, -664, -454, 199, 187, 678, -261, -296, -157, 180, 540, 13, -430, -389, 324, 369, -58, -427, -563, -192, 370, 719, -195, -575, -498, 444, 357, 248, -543, -497, -35, 419, 402, 154, -430, -141, 214, 280, 253, -264, -17, -358, 591, 516, -49, -293, 14, -32, 279, 181, -165, -238, -267, 184, 478, 69, -358, -325, -271, 357, 532, -236, -460, -280, 173, 393, -190, -463, -598, -261, 264, 195, -442, -496, -66, 303, 327, -2, -761, -583, -117, 470, 310, -318, -749, 103, 245, 338, -224, -277, -263, 174, 490, -50, -197, -214, 4, 482, 298, 33, -272, -295, 101, 323, 100, -108, -462, -458, 324, 311, -164, -271, -193, 158, 455, 300, -469, -638, -60, 187, 293, 191, -571, -425, 66, 437, 205, -366, -681, -360, 322, 361, 16, -349, -279, 119, 502, 211, -315, -405, -222, 237, 4, -247, -170, -113, 166, 181, 132, -421, -531, 20, -53, 276, -252, -361, -305, 193, 237, -43, -163, -254, -365, 474, 285, 40, -168, -194, 23, 451, -84, -379]
2585c79n9L25O93k88J19j114L61K41J40R1k4o67L03M32M27o96j54QN10L90o14
2606D5k07m61Q16j04L37o61j52K60O6L36j05m36J06K59K33J63o46j62J7L25K82
2627C11j00o95K53J16N71j46l23j81j35M85R0L1m01k50J93N24O4m06k72L9J56
2648g6K98p7l93k16K27L49J01k14k30k15N79L09m01l21nL05K36J19l61n01K84
2669b03L55J81k18m36k4N53M1k8l19l18L79K94j23k50J30m65M98J41j34L0l25
2690b41M32j29L27l66j45j79J22K61K09j06n74K11L88K72j18m65m15M44J45L77
2710D50n43k92j77P48K83J49q16k34K19N37k4m02k49K79J97K16l01J4m01M80K03
2731C36k96J1l48K27J1J65P1l44k51N45M7l37L6J87j32K31R6k88k80N3J52N93
$$ y = [-379, -438, -113, 580, 292, 411, -703, -342, -101, 39, 130, 106, -561, -258, 174, 601, -95, -249, -241, 269, 659, 45, -162, -623, 193, 89, 426, -235, -387, -127, -61, 275, 170, -266, -160, 99, 332, 495, -151, -313, -296, 29, 311, 211, -484, -231, -115, 456, 310, -13, -194, -329, 156, 246, 277, -124, -374, -181, 343, 407, 1, -271, -232, -76, 222, 145, -248, -464, -237, 112, 213, -1, -231, -446, 133, 442, 41, -280, -285, 20, 256, 375, 14, -487, -203, 152, 333, 115, -321, -345, 208, 249, 221, -98, -416, -37, 257, 134, -116, 14, -451, 47, 188, 54, 84, -241, 191, 62, 389, 23, -122, -301, -179, 82, 291, 185, -389, -178, 210, 482, 364, -101, -516, -72, 73, 450, -93, -385, -562, 186, 469, 618, -198, -432, -213, 324, 300, -102, -351, -72, 125, 341, 40, 54, -347, 133, 336, 40, 51, -297, -70, -59, 106, 177, -167, -418, 127, 174, -163, -127, 60, -72, 159, 255, -33, -313, -260, -108, 485]
2753D85m56L7Pj37M0M40j33k41l88J34M98J43o48Pp8L59K31q7l81j90R6N60L5
2776C33m83j09L2N58r3p7m34L2K41PJ6m47J3K21L06P9j42l80L2J46K49J74k06
2799F8k53j30L82L49m05R2l76J84J46K20j27l67j07L99J23q5k79l31K32M19l4
2820A20O0l83J8L07M2R2k33k78o3N21j60J34o32K54J39L52l9j17j44K45N4l57
2842f8p8o1K1J76L78k00l01r6L49K0N1n18K02O1K95ll34M7l29K12L85O6l25N8
2866Hl20N05k26J41m23nL23L52o1l72m13L32K80P7n3q7k42l7N67j59j19n74M56
2889e0L91m8K7p76K72J40K21p3J45l98L7K22K47q2l29J49k60K49J46j01l98J77
2911i2J08J89p1l46Q1QK62j8k47p7J61K94r0j53l5l1j57N33j63j73o2J03J10K88
$$ y = [485, 29, 66, 73, -64, -24, 416, 283, 42, -346, -212, 286, 429, -219, -212, -290, 69, 300, 213, -168, -358, -262, 298, 333, -150, -259, -227, 331, 238, 161, -273, -241, 0, 7, 23, -424, -411, -190, 116, 195, 53, -327, -295, -149, 100, 274, 68, -185, -315, 67, 416, 11, 103, -273, -89, 57, 277, 150, -217, -324, 75, 198, 113, -166, -497, -265, 154, 120, 180, -203, -185, 122, 164, 256, 23, -255, -318, 203, 43, 177, -455, -201, -62, 290, 251, 134, -10, 235, 289, -68, -146, -207, -186, -10, 368, 168, -133, -229, 120, 140, 191, -327, -125, -64, 231, 228, -106, -59, -388, -176, 209, 275, -50, 8, -312, 193, -33, 108, -315, -320, 3, 355, 294, -78, -491, -159, 121, 198, 145, 58, -184, -221, 346, 187, 68, -506, -50, 341, 293, 320, -456, -184, -44, 177, 104, 249, -149, -112, 110, 357, 275, -54, 95, -165, 84, 230, 129, -269, -92, 16, 205, 134, -212, -131, -123, 139, 121, -126, -203, -42, 252, 162, 9, -26, -57, -214, 319, 156, -17, -79, 24, 134, 422]
2935D22k34m16P8K67J99o6k51j23p7K60Q8J03l41k59J01L27L28n33j44J85r7O40
2957D57m06Nj09P2k12N23j94l59L31p3M58l62l46j04L97Q2J87l48j55l2J01L59
2979B72o8Mr38N83K72J61m85j05K18P7K28m9l81J78J57J29p9m24Q5L8J41K56m0
3002B30n72L49P4J47j69KN0m01K53M21k95j96m8m3l7N33m17k5q6J03M12n7l14
3025h6K25k19L25l36J7o2n8L32r0N5k52l4q3N58j84M24p24p1K2M89o6l09j46J30
3049a43M48O0o77j3K3M22J86j85l50j5J96J54J64j58j49p0K32j5p1k99L16rN5
3072A02j29%R9k95M16O0k76j07J51M8MP3J47l71k53N05j10J12j17k55K39l9q2
3095g8Q4l14M3J13M22k56M4k31OK58M5k72J4K22J3R4N8l13p1J62k24L56k67j52
$$ y = [422, 188, -228, -150, 117, 316, 250, -1, -124, -201, 59, 147, 250, -91, -350, -249, 78, 406, -127, -271, -86, -183, 457, 51, 56, -53, 19, -193, 330, 136, -223, 108, 35, 493, 131, -215, -319, 78, 160, 347, -1, -156, -188, -87, 272, 204, 208, -730, -147, 125, 286, -199, -304, -86, -9, 219, 170, -211, -33, 124, 253, 174, -250, -165, -127, 14, 270, 230, -342, 7, 81, 228, 59, 61, 111, -290, -37, 384, 89, -107, -155, -198, -235, 298, -119, -144, -230, -127, 285, 228, -86, 139, -80, 245, -91, -74, -136, -194, 138, 48, 103, -149, -183, -266, 292, 108, 532, -192, -263, -241, 248, 182, -127, -273, -143, 305, 365, -312, -325, -302, 120, 306, 121, -229, -244, -48, 106, 270, 112, -37, -107, 125, 110, 39, -260, 56, 47, 102, -27, -27, 72, -223, 193, 253, -23, -130, 21, 69, 73, 146, 293, -78, -331, 174, 64, 176, 59, -196, 43, 4, -78, 6, -308, -265, -152, 270, 14, 58, -173, -167, 91, 136, -136, -122, 100, 113, 207, 265, -48, -119, 43, -181, 175, -92, -244]
3119b44L84j53J11k5M8k09N9J07M8j41k9j83OK60j25K47m37J12N4K57n3n10K23
3142a93K03J41J29l65j85K18J36j54L05k07R1M9Lj01k76M0K17K32M3k71J79j75
3164E9K91j39l14n5J2J34J0M1q8O5j88L13R7j47n3l86M08j41J48j50J04k67L58
3187A12R9l54K61p2r0K75r6k67j45J61K94k11J7k69j33K10N51l62k26K1R4K64
3209A34P5k45J49j87K6RJ29j24R7k28Q4j22K44k83k93K84M42Rk09p2P8q3J88P7
3233A79k10j09j52M43k75J82l51r1L97O2k50J42j03L6M36j7k56N7j90L11m23R4
3255h8j38kJ37L41j68n5l04K18P9kk7k34j50N12J71n11K60L02n68R2J15nj97K4
3279a98L64j34k03r9L70j33j60J29M72m79J21O1n4J10j58k65J50qP30n66m5Q5
$$ y = [-244, 140, -13, 98, 73, 121, -88, -29, 78, 126, -15, -44, -227, -221, 39, -86, 161, -276, -164, -110, 147, 94, -416, -193, 10, 151, 280, -85, -270, -52, 84, -70, 235, 28, 119, 168, 171, 70, -206, -166, 51, 283, 326, 55, 234, 59, 350, 211, -103, -158, -146, -12, -2, 39, -49, 16, -172, 141, 238, 91, 38, -348, 60, -81, 67, -83, 21, -246, 112, 211, -143, 118, 46, -44, 231, 135, -132, -277, -116, 178, -33, -16, -285, -418, -208, 343, -19, -245, -224, -130, 134, 209, -36, 113, -74, -48, -39, 90, -34, 63, -165, -81, -203, 41, -242, -535, -251, 191, 200, -9, -81, -3, -86, 102, 179, -31, -140, -292, 151, -124, 58, -293, -384, 13, 75, -175, -33, -136, -100, 336, 319, 63, 120, -70, 241, -182, -88, -226, -228, -91, 250, 82, 27, -277, -59, 20, 18, -9, -243, -393, 119, 290, -221, 39, 341, -227, -135, -20, -25, -222, -198, 166, 32, -171, -270, 100, -33, -193, -64, 408, -71, 50, 111, 57, 167, 9, -256, -106, -114, 616, 50, 5, 90]
3301I0j59J41k50J90p8K82k24R0P9nl61J04Q1l8P4J7QK05k28L6lk62P5J01J03
3326F8J47m05p2L32J18m9j56J3j91N15k72J57k32l0K4o7J44lj90K76L9j75m27
3349d36M78j88O2K64p8l76J6N5J58K27m23R0L15k35k8K54l30R9k50N09m6p3n7
3372Gj68J61Q0J42l47K05j6m3%j98j15K54N25p54L06q4L1k27J56M1l9j1J06J20
3396A32m76M00k00J1K40Q6J2k53K53l10Q2NJ78l58o7J06l5Q9J23k8N3J11P1k23
3420BJ31l12r0J88M38m35J96m2J41k53L02k53O0j05J39L20o24K43j97J43j89K45
3442D8J9o8k53M10K3j09m22K34N89m69R2R9n88N43j52J41p6Nk32N5K35j43O2n7
3466a4K15k30Q7l40K78O7J8J00r6k16r5K64l57M12q0j37J06k33M12k37l7P9K92
$$ y = [90, -69, 72, -178, 12, -66, 216, -8, 82, 161, 156, -205, -101, -20, -58, 16, 33, 41, 246, 18, 54, 51, -211, -136, -35, 68, 215, -190, -262, 70, 188, 139, -17, -4, -195, 320, 48, 205, -27, -57, -33, -100, 44, 41, -149, 127, 166, -9, -436, 42, -146, -84, 180, 102, -274, -258, -203, -45, 182, -241, -151, 164, -71, -99, 155, -175, -76, -326, 183, 137, 64, 7, -161, 0, 80, 222, -125, 80, 64, 21, 21, -177, -292, -38, 487, -267, 39, -45, -14, -241, -85, -44, -83, -94, 12, 132, -344, 56, -144, -133, 107, 193, 205, -48, 205, -105, -23, -18, 160, -198, -265, -159, -194, -105, 18, -10, 43, 154, 225, 2, 133, -179, -269, -81, 357, -78, 118, 76, 217, -36, 266, 13, 73, -32, 107, 427, -197, 46, -151, -8, -197, 48, 67, -1, -254, 156, 179, 70, -352, -118, 471, 2, 94, 193, -395, 148, -4, 137, 61, 66, -166, -111, 124, -19, 43, -14, 201, -29, 58, -282, -4, 63, 81, 181, 85, -131, -226, 38, -319, 93, 13, -124, -18, -251, 161, -76, -113, -34, 258]
3489B58k99OJ54k59K33r3J98j22O1K8j60r7L07l42J35j27pK04m9J74k31M3J11
3512A26l9k14O8Q6j19j66L65j03r8K68l11J74J02k13J80J60k36q4m7O3J91j83
3534c0j4O6R5j3j12o0J05P2j57kM8k13N84l52j76K39l1r8K13k04j9J54J07k89
3558h7j45j01K24J95j80l4K86l78J3K29j2k5l61J89O46l76k07J74r0k37K02l4
3580a09m2K44q6K21j81J97k24kJ89n8j66j47N8R5j10M51l86k54O19m75K48jj88
3603a07O43m83m8Q7r6Q2k60J26o5k54P29m27K83j28j33L42m55J40k6k47J83m7
3625a61L09k45J75k52J4p0K81lP0j68K43m18J38M00k29j06Jj44K10NR8l00m1Q4
3649a09m0J44J25k71J20p0l6L70p4o7Q0k72m5K89l99K94K2M03k97k72J23l9J06
$$ y = [258, -41, -35, 119, -140, 93, 0, 198, 76, 137, 165, 5, -92, 215, -127, 8, -119, -126, 78, 29, 203, -28, 15, 126, 87, -127, -59, 27, -92, -258, 107, 4, -94, 174, -137, 37, 139, -74, 106, 266, 30, -54, -101, -38, 153, -30, -44, 22, 117, 104, -8, -68, 37, 109, -48, -50, -2, -215, 369, 17, -159, 80, 49, -49, 164, -40, -59, 95, 202, -87, -232, -333, -109, 86, -94, -128, 158, -220, -207, 22, 10, -15, -376, -187, 459, 83, -124, 50, -40, -277, -75, -109, -151, 93, 7, 228, 47, 244, 20, 18, 207, 149, -17, -164, -106, -11, -121, 330, -56, -310, 309, -166, 82, 81, -107, 536, 53, 5, 92, -4, 78, -182, -56, -121, -375, 354, -73, 210, 82, -51, 291, -164, -24, -50, -297, -114, -161, 148, -97, 78, -174, -160, -230, 51, 48, 118, -50, 193, -225, -87, 313, 84, -22, -21, -165, 45, 50, 148, -152, -193, -109, -149, -5, 120, -151, -31, -101, -137, 233, 159, 92, 172, -100, -145, 144, -255, 39, 61, 464, 167, -105, 18, -21, 85]
3672H5J76m59J29J67m7r3k22J02K55k33l1L20n8l20J40k24L61M6l06J01K44j36
3694cj5J50J54l70l5N7K18j60J10j06j6k56L99P1m05K96j75M68o02j06N86k53
3716GM14n56q2K51k14L59r8O1k27J77oj89k45K89K34j62j53L43k62Q5j3j02J12
3739B3J34K18o97K25L71j90j64N6L79k95p1n4L63k28o4J51j07K02l15P5Q2m19
3761c25K10K16P0j74m3P3j72L37k90M6P5j14J81m09M34m91L08K0k46L11%L8L2
3784H7J5QN2m51M59j94Q0P2k43R1o1j66J61m8l2L48j09pq6j68J88r5J9J80J34
3809B34j08k45J29j72K49J06m2n0J16j71jj56MJ29j53o6L15l80J85K2j01K4M1
3832i1J52j10L26k16o6j42M4r4K47n5j5k2jk75L31n2k75N69q1k85K04l00L87K19
$$ y = [85, 261, -198, -69, 98, 51, -42, -264, -162, 93, -140, -171, 149, 91, -229, -89, -313, 48, 94, -212, -111, 133, -3, -18, 132, 286, -84, -119, -62, 156, -4, 106, 0, -16, -272, 127, 198, -207, 89, -86, 382, -220, -326, 260, 7, 421, -135, -217, 34, -180, 179, 81, 142, -85, 92, 86, -103, -348, -59, 175, 13, -140, 203, -59, 26, 13, -89, 23, 157, 375, -322, -97, 274, 84, -80, -24, 355, 60, -11, -65, 298, 70, 6, 157, 50, 252, -63, 12, 94, -325, -115, 101, 171, -3, -46, 27, -145, 192, -98, -52, 23, -91, 90, -319, 115, -376, -68, -48, -294, 17, 17, 55, 87, 102, 110, 162, -289, 170, -24, 56, 128, -115, -24, -85, -251, -90, -138, -170, 178, 69, 62, -24, -192, -4, -99, -80, 100, 234, 126, -119, 10, -162, 87, 193, 151, 101, 217, 46, 45, -111, -107, 22, -131, -197, 118, -262, -77, -55, -156, -132, -91, 61, -49, 277, 61, -5, -147, -103, -197, 50, -5, -20, -42, -43, -318, 13, -39, -314, 255, 174, -111, 93, -207, 180, 399]
3856C99k46l6k77K89j08J60k28j7J40q4O5J02j3j93K03k55O1J28j61J38j31J12
3878D8j58o4J55q3L66l10K00l10K51r9O8n64P39j28j36K1j02L8J74J33l07K51
3900A83l01J95nj57o6J45P6ol1J40l34J49j60J56J38p7o3L0L02l02k04L61k69
3923a00J03j66k1J7J19j55J82K04k1l93M33j42k34K2J48j33Qj69J81J34Q8j49
3945d4J15l1K71l27o3Q6J40o2Q0r1k26J83j41J82j17J37k07K47m40K92j82K78
3967H0K11m48N50m18K49k56Q1J16K03l43j44m6K01K23m38J63M4L5M7j45K80k25
3989B0lk80R2K27n7J35o9k2Q0j58j0J54k31L30j22J24m67M36k46J9K68k91j43
4012b14L98j46K52n62M20l38J58k0N3J73k44O3k79J56j43J22K25l87K81J52q1
$$ y = [399, 153, 117, -160, 129, 21, 181, -47, -64, 76, -8, 57, 159, 146, -47, 156, -99, -38, 90, -71, 67, -64, 48, -110, -174, -19, -102, 264, -46, 154, -156, 95, -4, 64, -500, 239, 111, -25, -4, -106, -68, 106, 239, -68, 183, -118, 77, 72, -85, -151, -6, 70, 64, 33, 173, -161, -12, -172, -16, 122, 45, -18, 12, 314, 12, -192, 169, -100, 3, -163, -184, -167, -48, -203, -21, 183, 162, -231, 202, 60, -174, -152, -4, -137, -129, -298, -117, 17, 105, -44, 71, 40, 311, -16, -79, 7, 147, 85, 165, 74, -152, 31, -110, 72, -45, 92, -115, 132, -308, -16, -198, 80, 291, -157, 393, -25, 224, -32, 49, 165, 368, 25, -119, -165, 36, 259, -179, -16, 28, 63, 110, -35, 245, 20, 17, -263, -171, 56, -1, 134, 65, 43, 123, -35, -45, 109, -122, 208, 86, 210, -257, 179, -67, -48, 220, -71, -214, 184, 38, 290, -272, 148, -190, -32, -52, 1, 174, -70, -7, -286, -130, -273, -151, 74, -313, -32, 120, 39]
4033C9L44l30M7p1l58M99j45J66j82j47L38m04K00L35l16J15k23K19ql17K08j52
4055a43L03k35m8J40p6K2K74m14K41r8J86k60j63L05K91l47J13j38M5k13O43n41
4077a13J30J39j04l6o1p9K43m8j60J09j72k84L42N0J86j36rp8J92J2k19J42LK7
4101G6j53l46O27qk88L27k31J55j75k22J57J4l62O69k00l32J48J9J16J62j42M2
4123E3k24N27o2j87k86M1K09j82K47l33J22j00M6J05k44L25j99O5M31l20l77M31
4145H8j11j8J5P3j97p9J91L25j90j36l32M82j49J66Q7k93J17j63J62K30l24M39
4167C83l02k19J20j91P8MK03l15K71m6j04K0Q4M7o8r8K23Q2j51K25j07j78m00
4190d39L31N2K36l79K70j56q8K49J37p8N0k78J39J55m79J11K81q5k47K39rJ64
$$ y = [39, 383, 53, 100, 29, -329, 170, 25, 191, 9, -138, 200, -204, -4, 331, 15, 130, -93, 126, 118, -199, 9, -143, 160, -75, -123, 17, -59, -37, 237, -177, 64, -34, 152, -108, -271, 34, 325, -22, 91, -47, -2, -215, 428, -113, 17, 156, 52, 16, -45, -124, 119, 71, -89, 20, -152, -436, -94, -44, 142, 6, -3, -81, 111, 123, -96, 46, 49, 76, -77, -423, 204, 196, -92, 235, 4, 159, -16, -238, -81, -67, -429, 240, 40, -292, -144, -125, -9, 153, 11, 53, -171, 356, 294, 107, -179, -138, 71, -111, 136, -197, -75, -175, -129, -24, -268, 57, -142, -77, 354, 34, -343, 88, -23, -41, -26, 47, -150, -229, -38, 287, 97, -39, -371, 111, -38, 128, 215, -78, 39, -124, 38, 268, -56, 383, 81, -138, -18, -209, -131, -127, 76, -239, 32, -14, -118, -98, -14, 33, -35, -133, 90, 172, 21, 246, 139, -39, -439, -108, -56, 180, -199, 71, -85, -173, 76, 213, 135, 185, -93, 46, 201, -278, -167, 114, 29, -218, 21, 12, 176]
4212A76j71%J8qk28L15n4J7l66L29M7k66K44l0J49k09K3R5Nj06K69k43n6j34J8
4237a66j0K52j54L19l80K55j11J15k2j22J45l12J69L23j00j48j88J52K04p6k80
4258a35o5J21J42PJ96k42n1j7K04%l5q8j11J77L9Q2k42j59M85l86P4k08N06l28
4282c4Q5j62J60k4n4J62j48J48j96J68O3j19o3j05j09K31K23j94l34L57j90K85
4304A50m4o8j88o3J01J24p7j9K42O3l97P5K38K75m47J71j5j61K60j15j93k01J73
4327a16j64M35mj73J02j38J38J99n72j31O44k77J00r7k8j3J39J03p9l60J60L36
4349B04j50N8j34N24m61m23P11o43N34j76j00M3K12k21K58j08k45o3j63L01P5
4370C3l9J90m71L13j6j57K78j7N7p0K0N7n7l00L17k28q7K04k19L54J00k65Q6l74
$$ y = [176, 5, 5, 23, 15, -213, 102, 48, 65, -301, 28, 75, -191, 53, 23, 172, -37, -14, 81, 86, -20, 249, 6, -50, -184, -166, -176, 76, -78, 241, -139, 116, 5, 120, 98, -24, 121, -191, -22, 301, 201, 53, -135, 17, 221, 145, -135, -200, -79, 63, 70, 266, 24, -27, -44, 160, 160, 125, 37, -74, 103, 142, 224, -18, -177, 308, -78, -4, -212, 294, -34, 51, -111, 49, 25, -29, 133, -15, 133, -63, 105, 168, 49, -14, -119, -228, 3, 226, 32, -302, 55, -135, 150, 106, 38, -150, -213, -112, 12, -65, -84, 158, 221, -176, -101, 137, 412, -35, 136, 121, -40, 220, 105, -88, -289, -116, -280, 155, 151, -22, 80, -58, 80, 279, -293, -424, 220, -57, 43, -54, -82, -95, 44, 147, 68, -292, -132, 204, 54, 112, -22, 502, 41, -382, 329, -314, 220, 44, -56, -13, 199, -22, 236, 128, -117, -180, -343, -42, 33, -6, 184, -287, 26, 10, -147, 131, 114, 171, 101, 121, 178, 121, -179, 138, -90, -177, 27, -192, 162, 262, -3, 83, -291]
4394b91J44K61k05n8J34j68L52l48J70n3K85m83K31Qr8J28J91m15K71J61j40K1
4416I8k35jJ19P2k32K02r4N8n7m4N5l0K86m6J9j28Mk03J90J68J00k38l39K66J75
4441A65J16j38k7k90K32J88m00J94J9l55J00j20K64K72j96K66j21k94Kn1K45j66
4463i5j02J67J1N0j04j53J84K74p4O2k28j84J82j73j8R0J71k47K16P6l04j82L26
4486e5j60K74L7j69K98n44L90j24J34k88K68k65J43k7j45K20q4j5J17J75J18j13
4508A85jk20K15j54j35Q7N2q1K73N7l76J05j00q1L45k5P1j33j47J37l05J92R4
4531E5j86J29J47L6j89k63Q3J96n5K29k88J53l97K25J03n1J67N5k28J2R6j09J17
4554C7J21j43j85K94N5k23J4J33j87j77L92N2l83P3J43J44k40r9K9L06l25M2J36
$$ y = [-291, -147, 114, -91, -149, -15, -183, 169, -179, -9, -62, 223, -260, -29, -21, -119, 9, 200, -215, 56, 217, 77, 98, -137, -138, -19, 53, -179, 23, -71, -13, -70, -114, -59, -89, 197, 151, 170, 42, 46, -157, 33, 201, 301, 63, -276, -10, 165, 281, 143, 116, -174, 58, 246, -154, 40, 59, -296, -196, -316, -52, 220, 24, 290, 169, -125, -123, -174, 71, -95, -197, -30, -19, 31, -73, -226, -42, 232, 158, 220, -8, -192, -10, -183, -201, -111, 60, -187, 29, 105, -199, -381, -55, -215, 59, 96, -73, 225, -319, 71, -53, 81, -207, 61, -204, -61, -88, -233, -13, -97, -112, 5, 180, 298, 185, 184, -36, 179, 25, -110, -23, 29, -52, 221, 278, -98, 7, -93, -174, 171, 146, 217, 84, -63, 74, -231, -39, 55, -131, -2, 145, 181, -8, -271, -188, 8, -47, 182, -106, 47, -350, -125, -22, -73, 94, 149, -79, -67, 29, -80, 37, 158, 15, -170, 124, 179, -44, -30, 103, -84, -261, 131, 183, -200, -127, 16, 160, -80, -179, -150, 156, -169, -127, 9]
4577Ij1J46k34j60L77p3K4q3R9l4m91O31r1K00k57k75L84J69l21l2j05J15j38
4600a51K55N5q3k84L49k19M5j53M7K98k43J41n1jm6L5L5p2J16j30q0L82k40J87
4624A92k66pJ63j96K35L2l44J7P8K08LJ28j17l84M9K38J56j62M22l82m49M50m4
4647B0K8l08K90K6J47l35J83j77J78J17l62L11q8j00N8j01r5K71j53J24J79j14
4669I9pj6m40L46K7k23R1R3J4k6J59k04J88j79p1M29j92jr3j48j44L77o5j33K44
4694A25j19J95m99M00k29K24j73J13J07k6N2Jl74M7L10n1k38j21L27j57j16K14
4716A2j12j9K63m1r8Q2k34Q2K31m24J55k22N20O2J9k68j80O3j22L20l39L71j77
4739e6r3L09q8P9l24K43m2K03l65L00k61J73j60K11j49O7K47k24q1n9K58r5j10
$$ y = [9, -2, 144, -90, -250, 127, 54, 78, -5, 94, 60, -431, 200, 109, 309, 52, -223, 161, 330, 9, -23, -128, -13, -151, 104, 159, 76, -208, 141, -78, -33, -186, -139, 159, -84, 57, 6, 5, -41, -6, 29, -43, 73, -57, -137, 245, 5, 192, -74, -81, 82, -114, 121, 153, -191, -174, -96, 112, 115, 243, 126, -258, -209, 29, 185, 23, 445, 63, -386, 64, 20, 48, -260, 30, 56, 203, -132, 51, -126, 52, 169, -193, 118, 30, -70, -12, -113, -208, 63, -90, 34, 213, 99, 92, 76, -364, -18, 9, -214, -123, -30, -16, -42, 117, -87, 101, -78, -149, 280, 88, 87, -6, -154, -298, 79, 14, -119, 125, 6, 201, -298, 102, -127, 97, -76, 37, 144, 118, 170, 171, -203, -156, 154, 103, -135, -256, 71, -86, -202, 12, -100, -119, 144, 103, 5, 87, -147, -65, 166, -258, -103, -325, 195, 257, 276, 8, -172, -109, -231, 89, -250, 121, -56, -149, 160, 72, 151, -173, 70, 28, 231, -134, 166, -95, 78, -82, 129, -20, 47, 294, 70, -11, -70, 188, 93, -17]
4762a7J03K5k1j37n4J92J84l89J46J07n1m2p0K64J8n28J37K03j6j25Rj52K49r1
4786e6n8kp3J03j57J78J32J13j32n4q6Q6k1k94K16K78j95L38l80j8mJ6L55k58
4810B7J91j23p1M2r4mj20J55K76l12j73J67Q2K3Q0l55p0L78j58L31K2p26N38k39
4834a33J63n6k6K46k67M5k77M45j56o3K17k9m5k38J69K22n04J78J39j73R2n0j26
4857b27N76n27L52j84N7J65k40K26j25l56K94j00P3L56k79k02k2J58L2m15N85
4878A97O1j73k26O11o06Q9J30j90O4LO1k31J17K99j26j85k2J62L1N0m4L0k37J16
4902a9n9%j6K39k17K26r2r3K8J9Q4p5O8l22J52K96n39Q3J62K04o1n0K2j23K6R
4928d8j19J47k14K53K28l43o4K93l47L70j74qR6q2O6Q6j94K49j89l7R7K12l42
$$ y = [-17, 86, 111, 90, -47, -101, 91, 275, -114, 32, 139, 88, 46, -24, 240, 258, -270, -133, 70, 54, -71, -62, -214, 35, -56, -114, -116, -189, -86, -243, -65, 67, 180, 48, -6, -92, -6, -27, -321, -105, 173, -22, 316, -64, -82, -86, -70, 285, 27, 218, 95, 24, 66, -28, -32, -152, 3, 279, -33, -206, -39, 43, 66, 146, -209, -279, 99, -59, 272, 294, -432, 106, -133, 30, -26, -52, 194, -73, -28, -305, 140, -16, -79, 138, 109, 64, -174, -5, 217, -287, -109, 30, -143, -51, -101, -227, 349, -178, 174, -10, 47, 212, -28, 198, 73, -283, 11, -89, -16, 340, 61, -141, -163, -5, 27, -388, 197, 258, 85, -141, 470, -136, -47, 83, -107, -43, -40, 21, -210, -93, 206, 80, -105, -127, 35, 66, 116, 72, 102, -135, -19, -78, -78, -94, 145, -72, 154, 62, -31, -3, 16, 100, 25, 93, -229, -77, 219, -320, -237, -75, 129, 68, 18, 40, -83, -57, -48, -167, -20, -234, 19, 247, -96, -160, 133, -214, 156, -18, -26, 70, -12, 54, 140, -54, 195, 6, -31, 66, 278, -64]
4951f4M8J22k49L1j17L80k03O2k94K83p1J34j2qJ69j36j38L63k10J12k08Q0J02
4974A76k34j52K30m48N97r1p1J08k42M0M21m06J10K46l5k9j60j92N4N2j76n6O7
4997a91K83M1r6J16o0PJ66r1k95N2M1J11j62k1j74K61J40j6m4j77L66l13P0%j52
5022a38J50q0J01p0J0M7j53J21k43M42j92M2k35J71J68l01Q6p6L6J02K23k54j6
5045e9K34j55j11K95j33j2j00J60j75jJ99k61J99j71R9PJ00r2M1JJ26j44k58Q6
5069a25K24k07J27J14m21L68m0o7K2L2pj67m0J25K60k33J0R4k9L1k24K68M6k43
5093h2K08m05m7L27j73L57j1k10q8P0mK14j36rPl2r9J58M3%j21P2q4Rj41O3M41
5120C27l07j8r0J27m3p7JK70k30j7K57k50J67k39M61q3j43l08K76P9k59M40j22
$$ y = [-64, -16, 106, -143, -112, -229, 151, -52, 10, -284, -1, -72, 62, 50, 42, 211, 75, -63, 300, 90, 202, -6, 74, 176, -58, -210, 20, -428, 169, 78, 7, 115, -127, -87, 334, -72, 38, 284, 249, 220, 60, -132, -78, -26, -202, -258, -191, 92, 133, 37, 153, 93, 100, 266, 175, -120, -68, -27, 84, -78, -99, -273, -12, 128, 112, 68, -109, 257, -56, 14, 14, -138, 12, -68, 33, -37, -27, 20, -133, -12, -255, 187, -5, 37, -198, -27, 141, -160, -74, -150, -114, -12, 211, -43, -59, 175, 20, -91, 204, 71, 59, -41, 119, -56, -57, 142, -119, 80, -91, 8, 15, 115, 23, 64, 65, 191, 47, -211, -125, 99, -108, 19, 133, -288, 80, 40, -27, -5, 27, 20, -147, -187, -62, 198, -35, -25, 69, 40, 71, -153, 115, 161, -82, 126, -279, -326, 1, -172, 185, 174, -36, -124, -54, -58, 156, 20, 11, 18, -14, -113, 45, 88, 88, -33, 39, -45, -36, -177, -114, 327, 20, 2, -88, 39, -4, -81, -80, 190, -40, -57, 200, -50, 117, -122, 339, 256, 113, -195, 81, 160, -99, 341, 219]
5143B19k2j99J33m53J73L91k65j29M4j68J07K70L59m96Q8J57k5l82L31J03J50
5164C86l76N3K53l72Kj10J25L48k23o2J69l2m1R8k48Q5k66J28J89J41k01j42J82
5187H6l8k26L73l35q4J32R8k59M05m3j99R6k75J57M9M0L45k14j91K7o5J76k6j31
5211a02j35K59m21M35j03j75L00o7Kr9P1j24L03j47M7Q3q1k35J15L64m88K05J41
5234A48r8j75L27n46M63j64j34L29Q1j16j40k67J80J39j76J75r7J49k57K23J50
5255A94j05K5k95K0K41J41l72J33Q0K82k03k45J78j52Q0J26j04P4K08k06m8j91
5277a39R8r2L80k20P0j66k9L56l35O3K08l50J17J17l25M36q3j83L5kK75l08J45
5300F8k37K86q8O8j20j72L98k44J19k12K57n93O02m5k27K07j76l5K54k61Q5l6
$$ y = [219, 197, -2, 131, -322, -149, 242, -23, -152, -108, -276, -169, 101, 460, -36, 52, 209, 184, -198, 133, 236, 386, 10, 63, 316, -56, -54, -164, -39, 309, 86, 24, 193, 161, 120, 218, -30, 55, -211, -83, 106, 247, 46, -96, 86, 48, -178, 195, -140, -224, -92, 6, -253, 152, 109, -90, 6, -269, -112, -63, -23, 322, 108, -83, -56, -121, 55, 29, -102, -237, 22, -399, 36, -67, -242, 58, -9, -7, -106, -35, -159, 144, -3, 44, 127, 46, -189, -74, 290, -198, 7, 148, 50, -125, 202, -344, 119, -45, -179, 150, 231, 115, -25, -292, -112, 27, -149, 26, -71, 78, -179, 44, 194, 89, 114, -181, -161, 80, 221, -151, -18, 62, 344, 141, -104, 74, -78, 2, 128, 24, 98, 306, 100, 52, -139, -41, -133, 247, 27, 97, -69, -98, 258, -77, -14, 194, -156, -39, 78, -247, 189, 106, -77, -42, -44, 231, -77, 68, -169, 117, 29, 97, -23, -195, 203, -41, 78, -134, 123, -470, 132, 87, -140, 67, -109, -144, 110, -151, -66, -102]
5322a02K52l78K16J50J3n10L25M1J85j06r7K99j3l57K27l54L3K61n14K95LL00
5344A69k10K06l09L56m58M74o3q9n15O1L42L23l40l4L5M1L0J45K0m97K28j90J58
5367a17J63Q2k03M87n75J43K90j58K2r4k03N01k70k15M79k99m4r9K31r0K33l98
5389a34J50l0j31M1N7k24L95j91NK64j92j76L6n1J70r9o8O0L98m68J87qJ31j47
5413b5m0k48K94Q7J7j1n7Q6j86J0j50L07Q2N2k45k78L36j97M1q6L69j46j06J91
5437I7k55%K53j4J8n5j34q5K38R5m7J74l85m5K4N1K88j99k35N1P8j39J47J31k71
5462b19J69J00M8j85n0K20O1M5l08N8prR1o2J02k03r4L47L7m96J55L30j94k88
5486c52K46K12q3M1n5J27j99Mj22k69M00J15O7k67J76r9k4J36r0K29j1k44n7L02
$$ y = [-102, 150, -228, -12, 138, 151, -359, -34, 7, 192, 86, -11, 288, 275, -82, 145, -209, -176, 85, -429, -134, -131, 169, -41, 165, -144, 212, -246, 228, 165, 76, -439, -378, -36, 287, -53, -87, -52, -11, 19, 164, 184, -313, -85, -275, -117, 46, 128, -75, 412, -163, -20, 270, 112, 134, 40, -163, 338, 68, -147, 332, 33, -11, -110, 121, 31, 264, -134, 16, -14, -145, -104, -47, -271, 124, -67, -62, 202, 10, -166, -130, -181, -11, -110, -178, -118, 280, -188, -1, -9, 122, -25, -65, -313, -19, 68, 85, 74, 17, 103, -83, -73, -223, 84, 166, 218, -27, -305, 31, -166, -125, -211, 158, 12, -94, 97, -158, -158, 95, 81, 99, 44, -90, -175, 63, 158, 111, 285, -100, -145, -121, -70, 218, 19, -216, -165, -87, -226, -79, 52, -219, -50, 50, 98, -87, -137, 83, 144, 189, -119, -61, -68, -77, 14, -48, 54, -149, -243, 104, 141, -355, -200, 130, -64, -352, -106, 106, 23, 64, 9, 136, -63, -59, -181, -450, -50, 65, 132, -135, 41, -58, -82, 54, -36, 193, 182, -62, -119, 183]
5510A83m6q3j89j04J73L06j10j51J53J66l66m7J89o0K56k11l96K68R7J47M4j94
5532B5N6k92L55k60K2L47J92n06Q4k88K29J40j6n7j3n7pk47P8J11M3j91K08j09
5556a53K99j02%r7j31k1J85l00K34j15L47k34p6M10mk05R7k5j52J48k91K16l67
5579c37M76%n4j62L5J77k86P8M3K9o0o2N05m84M6R9j87n0O3J90o0r0K09l92N64
5604B90k82o9j74L12k2j15j9PJ98K09l73lj48L02l6k81O1J28m4j42J67kR7q7K28
5629B02m21Q1LQ7j02O8K98l41K61J23j01j44l55O77k14o3j56K29q9r7M6j28J61
5652B5J36n7Q9j78N2j63%K65p0j94L30k90n7J32j26J90nq3K46l73K05j86K38P7
5676B03m85L77j24j83K93k34J9k57K47M09l36O9j97M23j72NLp7L27j82j12k01
$$ y = [183, 137, 54, -135, -239, -66, 240, 130, -21, 132, 298, -68, -115, 74, 14, 270, 59, -337, -69, 28, 175, 219, 25, 81, -211, 144, -116, -94, 253, 445, -61, 23, -265, -36, 104, 88, 31, 18, -39, -46, -293, -215, -104, -61, -252, -44, -153, 146, 44, 44, -53, -184, -205, -20, -320, -86, -201, 146, -88, -164, 246, 242, 37, 134, 109, -43, 105, -186, 30, -337, 139, 139, 85, -77, -42, 135, -151, -73, -30, -1, -61, -123, 382, -102, -56, 43, -144, -194, -131, 59, -1, -91, 118, -274, 290, 8, -61, -235, 77, 55, -60, -79, -72, 126, 335, -38, -41, -189, 113, 77, -204, -143, -15, -59, -201, -34, -36, 61, -26, 202, -219, -138, -135, -48, -150, -82, 216, -125, 136, 259, 158, 14, -341, 336, 122, 59, -97, 132, 43, -54, -8, -136, 25, 161, 104, 193, 15, 67, -96, -96, 169, 99, -95, 235, -55, -112, 20, -106, 84, 79, -4, 242, -131, 74, -112, 126, 203, -282, 95, -29, -212, 81, -153, -134, -391, -144, 265, -71, -2, -199, 224, 52, 57, 60, -17, 310, 128, 16, -185]
5698a85Q2L48m47J19j40J36J54j88L10n09N06k61R0J85k71L7j92J55K3J11K0n6
5720B7j57J99j60K19%j93K16rJ0k85J63J49j71j00K5n4J16j52K90Q8j42k28O9
5743h0L75n56k6L26j3O8j3l5J32l67L93l60j06K9J74K69k57J32j25N4R9j82Q4
5766A5L7n8j22j34M25m0qq3k2q4J53l4P5j82J75j91P8P6j19J59l37L29r2N5J29
5791B00j95J28l72O31l07J36k71K47l45R1j01J83J05j26L9K7j71J73m2k84M55
5812B01k62R8K9r3K14j09j51K72m63N0J44K04j14k41L06l6J54j53q8N9j83K64
5834A02L9k73j47K49K41k55o1O0J49KmO3l23k24L02R4m06L04K94l67L34j61N6
5857F8nj78J99R0k77J25kK6j57K92j68J39j46k72K43j79K53j40J46k67J52Q0R1
$$ y = [-185, -103, 245, -202, -83, -223, -87, 67, -121, 189, -320, 186, -75, 15, 200, -71, -34, -226, -71, -48, 63, 83, 27, -130, 69, -91, 128, 128, -65, 151, 142, 152, -133, 30, 179, 8, -92, -67, -121, -5, -157, 133, 221, 79, -149, -80, 295, -261, -287, 39, 26, 94, 81, 46, 178, -189, 204, -156, -262, -233, -59, 210, -47, 85, -40, 14, 113, -69, 15, 52, -6, -128, -262, 163, 123, 115, 32, 10, -74, 79, 45, 120, -62, 113, -78, 0, 76, -43, 116, -221, 108, 16, 71, 200, 5, 133, -239, 392, 85, 221, -50, 197, -148, -57, -158, 25, 130, 4, 43, 70, -101, 72, 30, -254, 201, -61, 37, 66, -27, 187, 78, -73, 199, -264, -214, -70, 134, 20, -221, 85, 49, 203, 50, -38, 21, -162, 102, 141, -132, -279, -30, 211, -44, -105, -45, 104, 106, 102, 165, -158, -382, -80, 14, -392, -88, 206, -161, 173, 12, 68, 63, -115, 84, 174, -103, 22, 20, 46, -111, 181, 13, 152, 6, -266, -23, -202, 51, -89, 57, -210, -58, 22, 113]
5880A13k57R%J83K6j1L3J65l16n1J05r9N4l9k8PM94m12J32R0o25O59Rl39M6n4
5906a06L92m15r3K63j1o7L17n30L39k27r5K39q4M1Q2k20L80l98J72P0p8K73m60
5929b16K18JQ5R0m2k33Q1J04l53M73j74j39J12J3N4J01m65P3K89j53R9k36M20
5952B02k00k4k03K56q8J28j02J23k99K75J95q9j33k34K06L1k93L15l0j90K54q9
5974A1J92Mj79j00K10j88O6k31K68j15M2J38p1k57K42j5j05O7j96M33m86J09J01
5997f0M8j16K35J5l86J67K30J24j24l54L77k33J23K22j54j52O3j91P3P3j17R3
6019d4M4O4j48L65k31J03m82K82J16k61L00j12J18J01l44o1J92j14K05m00M16
6040A09j71J07r4J0K6J51j72K82j78j22j63N08l07q7K30M0r6K09pj67J67n04J84
$$ y = [113, -144, -135, -135, 48, 74, 63, 96, 261, -55, -106, -1, -100, -46, -85, -113, -106, 388, -24, 108, 198, -427, 232, 241, -98, -52, -106, 286, -129, -222, 41, 30, -37, 280, -250, 89, -138, -233, 6, -78, -37, 45, -175, 205, -193, -21, 49, -29, 244, -216, 2, 3, 88, 178, 136, -97, -16, 88, -265, 208, 34, -105, 7, 20, 74, 175, -290, -217, 72, -81, 18, -218, 202, 2, -22, -225, 31, -57, 71, -31, 92, -207, 68, 263, 174, 41, -193, 13, 44, -249, 66, 36, -154, 100, 11, 203, 207, 28, -72, 138, -50, 16, -215, 53, -62, -20, 118, 47, -210, 32, 17, -88, -21, -217, 216, -270, -161, -60, -12, -128, 107, 122, -264, -97, 133, 257, 133, -221, 156, -77, 46, 268, 114, -38, 25, -166, -93, -20, -137, -44, 0, 64, -84, 281, 50, 153, -329, -47, 69, -192, 108, -4, 114, 215, -129, -190, 2, -112, 93, -307, 109, -62, 45, -49, -39, -13, 138, -34, 248, 70, -52, -215, 293, -14, -101, 129, 169, 73, 282, 275, 108, 275, -229, -45]
6063d5P3O1k94K47j87j16J60OQ5o4j10R7N4J34J71k05O4j4k38N4J94J8j12j2k
6088A9o3r0N3j28J77k97L38q1M1j85K04M4l63J94L1LJ05o9r3L2K30j12j23L86
6112B53l08J62J22m40K18K31j41J61k60l96L89K74k24j60N3J60j64j67J85K79
6132B27m54Q2Q0j25K99K49o10j15M90q5L8k9k50J28j6K98k77p4L65k68Q0j17q3
6155a67J13K72j15j33L2K52N2m51J37O9j54J12l25J98J87J35j8L2l27L7j02O6
6177i8O2K48k54K1O6o7J27j81o1J04l1Jo2l1L11k75K3J95j89k9P8j31P3L6K70
6202B06l87m2l5L45j61K49j84r3j39L73j90J92O1j67J8r3k0K31J58k87N2j37N5
6225E%Q0j50Q4p9M02n58K98k6q3k65L32p3M7J80l02K00l93K72j97J62j19J58k18
$$ y = [-45, 28, 89, -205, 42, -145, -261, -101, -95, -10, -74, -184, -87, -33, 101, 272, 67, 131, 117, -121, -67, 127, 145, 33, 21, 19, -44, -134, -81, -209, -32, -329, 9, -72, -31, -216, -12, 32, -331, -137, -106, -103, 2, -67, -160, -128, 102, -10, -133, 253, -55, 107, 229, -211, 7, 238, 97, 258, -2, -398, -9, 265, 41, -119, -66, 94, -70, -237, -52, 227, -227, -145, -65, -190, 109, 358, -252, -367, 123, 38, 76, 47, -203, -75, -91, 207, -70, -144, 221, -47, 33, -84, -167, -54, 218, 103, -30, 2, 254, 306, -145, -8, 61, -93, 19, -306, -108, 79, 214, 196, 228, -99, -62, -164, -98, -36, 212, -42, -21, 45, -22, 105, -76, -137, -33, -64, -63, -125, -156, 155, -120, -97, 98, -91, -120, -42, -173, -100, -64, 206, -181, -223, -258, 87, -74, 175, -9, -102, -241, 132, -58, 134, 195, 28, 46, -47, -67, 164, 322, 35, 87, -50, 5, 5, 85, -65, 19, -60, 342, -216, 82, 56, -27, -292, 40, -33, 14, 194, -108, 92, -301, -29, -226, -64, -183, -25, -243]
6249b43O3M1J95k64j85K69p3K57j73K22n1J44k48J55j47L1N4QjO6q2j25N4J65
6273A32k3k45J03j8O4N8J80k67j01K52J9Q4l40KK31k23J21r4J26N0p8q9M2L01
6297B87k24j18K3J62n1J49j09q7K07k60J13q5o5k0m7P1j96L12l21K61kL06m20
6320a14K97J2k38J03ml36M36j70l02L97K44k60r0j15L36j53m8J82j62n1J89j78
6342b5j21J45j56m3J19p7K13OJ76m50j01L51K00l39K84O5j51j18o0J55n2J79o
6365A94j43N07l67l0k80Q4j9J56Mo0o4Q7l9o3L8l9l0l1N5L9M4m7K2j09j16M56
6391B49k62J92k53J45j30j93M41l41L18n2l07K61J17j05o4J42J36k28j48q2K62
6412I8k5k24K4J23L0l3J04q8p9R9J52j86R1J9R3k33K0j02p8K34P9j13QJ5l9J00
$$ y = [-243, -180, -139, 56, -208, -393, -124, -197, 60, -113, 109, 58, 202, -46, 109, -38, -7, 47, 55, 54, 120, 38, -87, -33, 132, 109, -136, -33, -51, 13, 71, 251, -16, -117, 135, 154, 238, -102, -100, 131, -92, 29, -65, 61, 111, 33, -56, -14, 287, 63, -55, -32, 130, 79, 228, 119, 32, 239, -21, 92, 7, -58, -78, -125, -54, -250, 62, -259, 2, 0, 306, -114, 183, 195, -43, 60, 56, -280, 156, -14, -316, 81, 325, 65, -25, -140, 196, 43, -5, 177, 15, -36, 153, -25, -146, -1, -157, -200, -81, -158, 55, 61, 237, -213, -314, 37, 237, -102, 182, 247, 96, -22, -82, 73, 21, 200, 194, 51, 558, 191, 161, -119, -35, -54, 102, 106, 46, -18, 69, 30, -33, 5, -34, -64, -95, -40, -1, 43, -4, 18, -91, -207, 249, -13, 179, -74, 71, -59, -252, 189, -152, 166, 114, -193, 68, 185, 80, 16, 158, 294, 66, -82, -164, 98, 73, -151, -127, -4, 26, -7, 97, 9, -70, 29, 181, -5, 86, 105, 198, -35, -15, -117, -195, 39, 118, 5, 13, 28, -11, 89]
6438H9j75K36j93L54l94R8J53k91O8j45M46k16K74l43j10J04J28J06j35j37R4
6459A1j2l1l1j64K95j04J45j23Q6l77J76K78k05L69n57J11J63l89P39n60Qj9m1
6482b32K16j84J09M3O7K25Om31P9J66k20M1J56j03K5o2K17k52L38k39L4K7r0O8
6506DL53l98MK0M7Q5J5m92L20J46O3j04j65J87l6J12m0m08J18L59jl15K48l53
6530b31K39p0m1q9L20j06n1j84L54O6k71J21R7j83m7j94K06n4k07J84J56L42m50
6553i3J23j61L0N2J19J65k80j91K19j96K74J02k10J6j2Q5j36r7M3J48n3pq7Q2
6577f5K6p0J33j56L1J55j02J79k86J33k00J84n2l5J44K5q6J2K53l26n6K84o0l6
6601B9RoJ84l15J62k08j89N64l5j81o5J16Q8m55L30j52J24J3P2pm27L21j8j89
$$ y = [89, -86, 150, -43, 311, -83, 15, 168, -123, -55, -200, 246, 30, 304, -39, -149, -45, 83, 189, 54, -83, 11, -1, -32, -63, -227, 68, -36, 109, -14, 72, -305, -129, 149, -56, 313, -244, -133, 30, -359, 380, -180, -172, -191, -232, -16, -200, -91, -48, 19, 244, 250, -181, -102, 64, -156, -115, 41, -62, -37, -99, 118, -134, 204, -35, -1, 26, -64, 4, 357, -41, -37, -17, 30, 115, 130, -362, -42, 104, 167, 63, -102, 85, 49, 161, 121, -287, -169, 190, 189, -126, 122, -231, 8, -62, -103, -192, 128, 22, -29, -213, 141, 207, -64, 57, 154, -29, -76, -270, -64, -118, -325, -141, 15, 357, -93, 30, -131, -101, -49, 70, 235, -45, -236, -17, -213, 61, 163, -47, -31, -43, 42, -94, -191, -148, 0, -53, -60, -147, -65, -39, -109, 24, -132, -101, 54, -48, 131, -155, -22, -222, -38, -90, -125, 19, 44, -42, -30, 223, -103, -159, 125, 65, 29, 38, 32, 216, -99, 63, -145, -334, 230, 195, 14, -51, 65, 153, -302, 28, -124, 0, 13, 85, 78, -349, -28, -46, -235]
6625b35M22M8n90L40n2M9j23K04J59j46mJ63k61L27j31q4k64K6J84k45N22j16
6647A93k24J77j14N6l46K59o0K95k30Q1Q0j67J03m8Qj30J37n9J19j70p3J78J69
6670B34j72K4j27q9J36j28L41k93J64k3j22l1j72K48Q0q3K64m8k91L02l13J94
6692I5k78J96J03k49M72j77l12J14N9J10K7j1o2j08J79k20k71K04m2J79K1n4K93
6715B68k97K4r6K31P3j67J7j67J2K55J3n2j83Q7j0L8K23j38j35p1K76j17l12J50
6739g8l0l4Q9l2J10J64k38r3J48l8L33j41k38Q1J54r8j20r3J70r8K74k55J39Q
6763H4qK8J25j12r6j57K75K10j61j49J66%j46j55J29J37j60K76m41J5K02J2J2
6786H6nJ60k13Jl8K3J2J06N0m59L27k20K19J79k54J3K12j97QJ36k02K02l87K90
$$ y = [-235, 187, 235, -355, -15, -67, -18, -141, 63, 222, 76, 72, 235, -26, 301, 170, 86, -178, -152, 32, -213, 309, 193, -31, 146, 32, 88, -258, 1, -59, 236, 6, 87, 167, 0, 103, 55, 63, -67, 70, 11, 130, -40, -113, 65, 234, 62, 86, -41, -130, 6, -122, 219, -74, 90, 67, -55, -86, -258, -10, 70, -13, 251, 203, -88, 214, -99, 95, -183, 13, 116, -133, 339, 162, -150, -36, 23, 133, 160, 149, 87, -21, 158, -62, -333, -129, -171, 8, 29, -25, 268, -29, -5, -101, 130, 203, 36, 53, -114, -102, 153, 166, 114, -69, 18, 8, 46, 269, 131, -4, -75, 201, 84, -228, -78, -108, -142, -53, -85, 25, 189, -49, -142, 6, -32, 301, 160, -78, 3, 157, 59, -61, -154, 16, -82, 192, -63, 76, 84, 76, 104, 229, 117, 21, -136, 139, 349, 188, 39, 205, 205, 59, -96, 33, 170, 10, 286, -155, -140, 62, 74, 86, 81, 241, 28, 29, -9, 14, 26, 132, 182, -277, 50, -170, 49, 228, -26, -13, 199, 2, 10, 146, -56, 146, -241, 49]
6810D9K1k67L72K5l16L77k33j54J03J34q4k7J88k14J02j14r5n2J06K23m83J24
6832b15J06K24p9l7J54k50j27M42j30J6l24L64j23j89K51j86J57k26J5L28n6j23
6854hj4K39m90M24O8l70J51K4L2j41K66l19L47j38j17J69L7O7n5Rj68m7K35l40
6878a39Q6J3J93p4j65Q6K40m51J51O5l16K73J57J07j75j95p7K31Q6jl93J09J95
6901Fk24M81l32q9J39L84l09r0J31J50J7l17o1Lk26M33j5k26K71L2k7m9j43j6
6925g7L69l86M25n9n21K87k94K08R5k43K94k88Q9N7K58l56K90l66L33j24l05M12
6947I8j45J37L6k16K32m56K07l33O19j36j27OJ04R5R5q6J44j74J6J75m92N11p23
6970d13N04k41K52j01n0N6o5L3J07J9k24R1L07j23J5j62n0K28k57J88N8k33N6
$$ y = [49, 70, -197, 175, 200, -116, 261, 28, -126, -23, 111, 27, 0, 188, -26, 76, -38, -133, -185, -79, 144, -339, -215, -109, 115, 36, -1, 153, -97, -224, 218, 88, 104, -220, 144, 21, -168, 83, -103, 54, -172, -157, 171, 115, -8, -22, 217, -273, 151, 219, -151, 0, 24, 56, -85, 181, -138, 209, 71, -46, 123, 160, 227, 172, 181, 13, -34, 201, -139, -53, -40, 153, 79, -86, 0, 240, -211, -60, 5, -311, -38, 119, 226, 51, -144, -221, 10, 96, 95, -298, -189, 6, -218, 263, -69, -158, -19, 365, 56, -34, 97, 247, 264, -53, -114, -111, -337, 96, 81, -145, 126, 158, 131, 82, -61, -77, 292, -94, 331, 272, -249, 38, -256, -48, 47, -196, 98, -190, -101, -44, 214, -142, 148, -218, 115, -9, -314, 98, -47, 90, 126, -90, 142, -314, -107, -440, 179, 43, -84, -78, 26, 121, 216, 130, 274, 100, 116, 291, -201, 310, -413, 91, -150, 102, 1, -49, 7, -58, -25, 82, 101, -123, -32, 275, 152, 167, 5, -45, 183, -74, 114, 172, -61, -5]
6993eO6j21L86j99k4j21m9jq5j02L26k96J47L8k65J88j34J61j67J97K2Q4J9j92
7017a27K9J06j82K13k29J83J90k87K40j86J99l42P4L4O8J14J89l41K01k26N4J58
7039A32o6J4J00k12r1J54J51j83m1J02l12J81p4J25J59l42K91l8l08M23j70j21
7061a26N4K04J97k45l00K36l31L69P9l18O5l0J40J5QJ31L4k02J42mj98L39m8k77
7085f6p6J73n6j43L90j72r9p4R1j33L42j10j3k93L55j22j9p5K18l2L5j49kL1j15
7110a14J71j2J26j65k3M0k61L07l56J79K23j42K05q5o5k4j04j49K46L9l2k3L15
7133B96o23J96K58k61P8K43o01K81n1K11K84l03q5J91l77K83p4L38m48M71k48
7154E9m33L28p9j61K5K40l2r5K49K12n13P2K97K4l44R4J01k86J25J28M3k7J09
$$ y = [-5, 61, -60, 326, 127, 103, -18, -67, -68, -153, -255, 71, -225, -78, -40, -305, -117, -251, -90, -257, -60, -38, 46, 65, -127, -98, 8, -174, 39, -190, -7, 183, -104, 136, -50, 149, -193, -119, -85, -17, 97, 286, -55, 146, -80, -26, 132, 66, 80, 180, -32, -123, 31, 182, -1, -42, 60, -252, -71, -145, -20, 139, -203, 88, 50, -258, 165, -5, -126, -72, 132, 329, 84, -216, 20, -311, 58, 137, -181, -116, -146, -6, 9, 17, 148, 182, -20, 122, 118, -80, 259, 211, -66, -142, 31, -25, -168, 222, 50, -49, -123, -32, -165, 177, 67, 54, -239, 116, -6, -25, -100, 118, 86, 121, -28, -30, 1, -114, 57, 45, 171, 6, -17, 23, -238, 69, -287, -108, 115, -27, 178, 93, 28, 4, -100, -249, -3, 36, 4, -19, 296, -327, -131, 127, -134, -56, 187, -414, -133, -184, 27, 311, 8, -77, 114, -263, 20, -54, 284, -164, 307, 59, -374, -46, -125, -286, -261, -21, -53, -148, 101, 313, -200, -128, 169, 193, -151, -57, 44, -242, -117, 11, 54, 27, 136]
7177A36k40L9K6j6M0PJ12R1m7k15J7j87K53m0Km0k10L74L0k17o0L8L6K17J7j34
7203B9j70Q4L83l46L15n29K67j3k8K35j96L05k36q7J90l1j38Q4j7k85K6L71k00
7226A3J15j2j65J98j59J64o2l56K79l9N8j32J73q6m3K50j34J79k01l33K66J99
7248A72l54K9N5K31k08K6K5J52j39J86j11j67J54l0P5J80l74j8M06k48j74k5K00
7271D3O7P1jk75M3l1j79O3M53l45M20n97M62l07J70k9J96j42J93k28J16q1l65
7294b83M71k40L88n89K59J59j30k82O19m10K13l79qK45k8L6o9J1O6K23m43M74
7316C03m90O6K10K17j78%q2K44m90L16j16j35J48j07K40m55K47l1J95k41J52j90
7338a77J32J08q1J65J12j95k39J00L60k49k49J84K97j5q8l76L74k17J47n8j37
$$ y = [136, -104, -65, -39, -55, -15, -8, 104, 195, 148, -67, -50, -237, 16, -24, -22, -62, -272, 102, 132, -85, -145, -107, -71, 146, 163, 29, -141, -57, 326, -20, 295, -234, 33, 20, -8, 227, 31, 336, 100, 13, 203, 172, 34, 118, 101, -184, -158, 213, 13, 128, 116, -49, 149, -10, 154, 92, -264, 15, -24, 34, -98, 75, -11, -54, 196, 62, 241, 40, -293, -27, 172, -182, -153, -98, 133, -75, -49, -24, 128, -11, 175, 64, -103, 51, 21, 96, 276, -98, -116, 290, 42, -132, -157, 43, 110, 181, 180, -95, -52, -83, -262, -199, 254, -91, 329, -268, 194, -113, 57, 28, 224, 82, 275, 47, 163, 82, -283, 188, -52, 336, -253, 6, 165, 35, -247, 372, -38, 175, -204, -212, 33, 5, 41, -28, -17, 49, 272, -171, 303, -187, -121, 89, 306, 128, 128, 46, 290, -200, 116, 0, -135, 13, -94, 146, -309, -62, -93, 102, -139, 13, -177, -45, 63, -18, 147, 259, 64, -175, -75, 285, 36, -213, -29, 268, 253, 165, -211, 163, -54, 93, 35, -102]
7359a02K26n0j18J5j55K09j19KO1L3P1j11l5j64L26j43j43O7K64k80M16j11O0
7382B19p6q4j0j15N1j74KL7J26KK9J6l80M61l2k48J8n1L23l3k13J05L75l54j08
7407a14J32J83l42J00j77J82J06k13J04J41l90K45K7J92P8k59j70NJ58K8j08J66
7429G4J7Q9k35k45J12J66R0K06j81j06R5J19k62J70j96MJ60l23J40N9N7j36K26
7452A00q7l4J82M5J50m67j32K52O9l61M17j06j82j06O3N95k47Mj82J46N4m83L46
7475C6k29J60N8l2j07P4oo1p3J44oj04r8K67R6j07o0j39K48j52K9K2k12J63M96
7500D07o34J53K05o0J14o1J59k90j07K65k08J15j5J29k35L69m73M3J69k21j58
7521c34J34O60m89M6n6l3J00N0m5l7j76k88L70j42J71k7K9K0m9J47j07J7k0j24
$$ y = [-102, 124, 74, -44, -29, -184, 25, -94, -92, -31, 2, 73, -38, -73, -237, 89, -54, -197, -130, 134, -146, 270, 159, 219, 143, 59, 49, -66, -15, -189, -187, -150, -24, -22, 7, 23, -357, 104, 72, -176, -158, -209, 114, 81, -132, -27, 348, -6, -114, 18, 201, -141, -41, -218, -36, 70, -143, -39, 102, -288, -43, -16, 176, 254, -5, -175, -170, -12, 16, -92, 74, 91, 180, -55, -300, -188, -22, 68, 274, 93, -13, 82, 201, -61, 109, -87, -83, 77, -246, -106, -47, 10, -126, 100, 13, -21, 161, 206, 356, -111, -243, 9, 78, -283, 134, 28, -154, -260, -197, 398, 151, 155, -27, 119, 173, -310, 36, -193, -33, 25, -7, -114, -40, -46, -107, -180, -36, -42, -146, -244, 23, 119, 12, -48, -187, 61, -91, -62, -40, -252, -89, 407, -227, -74, 131, 71, 185, 124, 283, -7, -114, 151, -57, 58, 43, 172, -63, 306, -167, -124, 45, -176, -334, -200, 460, -29, 17, -39, -72, 28, 78, 33, -4, -180, -468, -98, -240, -69, -96, -67, -47, -96, 51, -56, -39, -59, -183]
7545a83L08p9q3l05J86K00j85Q2L09j52P3j2k85k72N09M2j91j45L43j29j53k4
7567a46J33l1j63K31q1L32m0k16p3p4K36k49K36k58K16l06J57J61lk38k8R5K4
7590h5mO8R6j23R7j14J18j42o6P2K35j67K9j3L07k20l78J77r4J19J20o2P7k69
7614b22M08k15J36Rp7K06k23L9J4n1J47l58N16k66j36P8K23j08j10J07l13K75
7636G9k93L42k45K2J56K02m33P4j69Q4K23j46K16j54o1K71o0k58J62j66N9K20
7658A25r3j44K68k75J95j99L32k80QL03m34K69k80J60k83N32l08J04Q9j25N1L2
7680D7M9j35J15p7j09K06q7J37p9j88k0K13P5P4l00L7K88k92r6M29m05J43J90
7703B15l2l42P1n4L01R9k03j07K03J3l5j39J22k00Q2m7K03k82M0K14k23K67o2
$$ y = [-183, 125, 46, -37, -342, -156, 44, -141, -59, 250, 98, 171, 159, -126, -398, 111, 153, -38, -183, 160, 31, -122, -146, -13, -44, -207, 24, -57, 275, 235, 19, -54, -128, 108, -141, 95, -163, 53, -253, -96, 65, 62, -176, -204, -109, -85, -89, -21, 75, -48, 49, -65, 53, -89, -155, -83, 152, -15, 14, 1, 308, 88, -290, -113, -207, -88, 32, -30, 47, -222, 186, -29, 107, 116, 39, 245, 22, 61, 75, 24, 171, -187, 329, 63, -73, 5, 228, 120, 10, 117, -196, 79, -214, 128, -117, -95, 61, 263, -170, -96, -265, -181, 42, -104, 112, -42, -103, 168, 108, -150, 12, -154, -95, 125, 32, -112, 156, -119, 76, -123, 209, -71, -63, 240, -194, 75, -205, -45, -328, 204, -104, 0, 89, -36, 15, 47, 96, -39, 76, -1, -110, 96, 9, 146, 67, -121, -141, 72, 147, 221, -79, -42, 246, -46, -142, 287, -118, 25, 215, 183, -159, -88, -142, 159, 258, 55, -52, 151, 164, 129, -10, 112, -88, -6, -53, 150, -132, -92, 122, -101, 166, 104]
7726A04l01P0J81J76p6j42l8J27l83K45M9J48j75j37j3P2J67l2J2j52J70J84n02
7749b46m7M88l05o1P1L1%K87p8j89j04j08L10J00j26n9Q4j9L3Pq4J41OJ59k86
7774EK5j95J93J65j97K04k71Q6J64M3k79L0r7K02j12j35J09J03%Pk75L91k89L3
7798i0J3n4J23j27j08J74j06J31M4J13r8J42l5j56j89J38Q6r2J75k46K87k01R7
7821B1o1k39J79K35j33o1P4N8Q6k0J03m76K76m14J73m9L21j25J58l7R8r7O8l04
7845a66J2K31k75J61j8L06l07O3J86j91k54L30l77K03p1J58J38J20k19l3r8K31
7867A30q8k6p5j22J80j4J03l11L91K27m53K76j7l07R2K1M8l3k4J48k54N9k43o5
7891c57L41P0k17J33o1J90J08j31j60j7J0K65j24j26Q0K0P9m46L12l02N8J09J45
$$ y = [104, -197, -127, 54, 230, 154, 12, -26, 101, -282, -37, 12, 160, -15, -152, -165, -93, 74, 42, 54, -98, 72, 256, -246, -293, 195, -110, -171, -100, -69, -69, 218, 140, -49, -153, -261, 49, 149, 23, -36, 48, 29, 62, 69, -15, 126, 132, 291, 5, 30, -165, 28, 193, -4, 200, -71, 15, 179, 222, -57, -27, -124, 78, -34, -169, -60, 43, 43, 50, -225, 166, -123, -90, -77, -131, -8, -135, -243, -69, -175, -44, 0, 113, 15, 157, 122, -34, -223, -85, 1, -91, 84, -162, 125, -76, 21, -40, -279, -100, 135, 2, -59, 15, 73, 159, 139, 242, -234, 42, -372, -199, -248, 73, -52, 106, 69, 167, 70, 138, -166, -154, 77, -198, -37, -55, 251, -56, 7, 193, 2, -252, 78, -299, -96, -167, -9, 129, 249, 30, -3, -101, 130, 42, 16, -59, -181, -1, -15, 88, -223, 168, 395, -58, 218, 201, -106, -14, 7, 55, 22, -2, 146, -108, -49, -292, -357, -16, 54, -163, -30, -91, 99, 207, 76, -84, -101, -91, 174, 50, -76, 4, 24, 103, -343, -31, -333, -275, -166, -21]
7914b1q8K30q6K01j81k20J23j25M66k45k93K08M74l93j41J25K03l04j7J4L8j35
7936a67N15m78J11j68J51J67l34M34m09J75K82l19R0k09J93l16L62L5k8j9J52
7957B20k75m8p9J13J56l51K45J57q5J68l1nok24Pk19J45R4J35l7j33k85K91J60
7981A13l88J58j00J04J81q2R2j26l2l4PJ28l23M15q4%N0l1j49J21K38m32J01R1
8005A8L6O2k42N0k41R9L25l04p0K80J57J7l45j88L57J3J87m16L00j43J85J8j06
8028D9l18J46K19j54L68k07k18J00K31K9j30n9R2k76J48O6j21n2K08j81l1J41
8050E0j34J63p5J45O1j64m5LK41k33L1J48l65m2K04n4M7J90j2j74oJ87j99K66
8074B33l8k04J77K6j84M3k61K47K46o3k30K60k73J76L9l24r4K25K31r2o9K72m17
$$ y = [-21, -109, 121, 35, 236, 55, -165, -42, -167, 299, 54, -239, -31, 443, 50, -91, 34, 237, -67, -84, -70, -32, -167, 348, -130, -19, -187, -36, 131, -203, 231, -178, -3, 279, -40, 50, -159, 34, -282, 80, 115, 87, 68, 220, -55, -103, -182, -69, 87, -264, -19, 138, 53, 221, 190, 185, 179, -45, -38, -257, -112, -18, 117, 80, -53, -338, -47, 113, -275, -117, -217, -113, 68, -14, 78, -48, -80, -114, -107, 21, -302, 113, 29, 29, 79, 48, -101, 20, 258, -174, -73, 18, 54, 116, -126, -76, -317, -218, 107, -197, -267, 13, 170, 187, -158, -346, 11, 24, 211, -205, 95, -48, 137, 155, 49, -269, -123, 96, -58, 310, 103, -115, -15, 216, 245, 115, 56, 148, -128, 20, 86, -35, -87, 121, -60, -91, 50, -84, 79, 4, 149, 210, 46, 1, 4, 245, 12, 43, 191, -174, -216, -12, -66, -19, 171, 159, -15, -21, 166, -33, 233, 195, -9, 168, 194, 10, 53, -208, 39, 285, 222, -8, 252, -21, 155, 194, -130, -224, 1, 232, 140, 71, 343, -74]
8097g4J98N0j24j5l21L60j93j41J09N8K39j93m1J49j1k04K30l05Q1J05J06Q9l41
8120a89K00k03J59L9j92K46q2K38j42j60j62L89k50K78l02O9R4j15j26j82O64
8141B71m14KJ63j67M3K2K28j12l3L8l3l3K52k73K8Q4j87K30j54L5r1L49l90M08
8165B66k23K2P3o1j64jJ87J65m54K74LM9j71J8J50m12K98k51K57j00J38k26K10
8188D7k21K27L7
$$ y = [-74, 124, 174, 50, 35, -286, 74, -119, -260, -151, -93, 146, -47, -88, 61, 50, -154, 76, -229, -148, -43, 63, 152, -189, 11, -192, -33, 6, -186, 60, -22, 216, 74, -86, -248, 141, -109, 169, -133, -64, 30, -85, -211, -393, 271, -143, -141, 22, -145, -102, -80, 148, 36, 3, 41, 8, -25, 227, -46, -18, 66, -121, 109, -45, -10, -101, 248, -142, 266, 43, 65, 138, 77, -87, -88, 99, 264, -190, 84, 87, 136, -35, -17, 133, -279, 19, -232, 25, -75, 63, -163, 47, -174, 53, 90]
8191I0
$$ Imaginary data points
##PAGE= N=2
##DATA TABLE= (X++(I..I)), XYDATA
0@%%%%%%%qJ6j6J6j6K4l2M0m8N6p2Q8j04J20j37J60j86K13k45K80l18L60m08M61
31B44n18N82o53P29q12R03j001J110j231J365j514J674j853K056k279K528k813
48a483L142l520L964m494N140n949O993q401J0418j3574J9258l2744J23472J29031
62B31253j63722r4714J8484J37841O3058n5833j21088k8180P2014Q6868j9920
73A26061r4770o7975L9706Q1937K4638p2717q6320j5027O8070O2413j3067q0235
85b7286n9879J8437P3245M2881l2468p2598l1411M3708P2729K1387n1751o4084
97f7090L200P2875O5896j4274p5281m1344N0903R2079L0025o5259p8885P530R2150
110G2525P0674l3176r5075m1570O4848R2842R665q5317p8527K0802R0053M6786
$$ y = [0, 0, 0, 0, 0, 0, 0, 0, -8, 8, -8, 8, -8, 16, -16, 24, -24, 32, -40, 48, -56, 64, -73, 87, -99, 114, -131, 149, -169, 191, -217, 244, -274, 308, -345, 384, -428, 475, -526, 584, -647, 718, -796, 878, -975, 1081, -1198, 1330, -1483, 1659, -1861, 2103, -2391, 2749, -3200, 3793, -4608, 5810, -7764, 11494, -21250, 102222, 231253, 67531, -27183, -8699, 129142, 192200, 136367, 15279, -12901, 59113, 145981, 126061, 31291, -36684, 3022, 84959, 109597, 36880, -49440, -64467, 3603, 66016, 52949, -27286, -87165, -68728, 4517, 47398, 14930, -57668, -89079, -45371, 27358, 48745, -3006, -67090, -63890, 8985, 74881, 60607, -14674, -56018, -5115, 86964, 116989, 51730, -27155, -19625, 72525, 143199, 110023, 14948, -26622, 38226, 131068, 140733, 55416, -23111, -2309, 87744, 134530]
122A34530n5018r3051k4495O5581O9345j3951q2556n7888K7952P2186K5420n1680
134A6375o9304j1386N2587N1011r452n7224m0197J9481N4472K9733k5985n0165
146d0054j6541L7769N3194J2764l9187m4431N299N5500M7397j2648n6715l0839
158b8492L6424O6953K1202m9517n9860L075O6343N2207k5339p3779l3945M6051
170B1323P0498P505o7797o3781J3512P1432L8911m3952p6565k1796N5088N9648
182F4026r809o9181m8140K5043O3768K3943m3947n9644p231M9739M6854q789n1254
195b4622l2838K1916N1324K4612k5421m4384j1413L6434M6568P040l7813l8030
207b6627Q026M8058L7541j4647m9163k5948L0693N5343J6322m3048n3392n10N5449
$$ y = [134530, 79512, -13539, -38034, 27547, 96892, 82941, 385, -57503, -29551, 42635, 68055, 16375, -52929, -64315, -11728, 39283, 29831, -27393, -67590, -48109, 6363, 36096, 10111, -40054, -56595, -18826, 34368, 47132, 7945, -36486, -31187, 24313, 71710, 59062, 2347, -28492, 7932, 74885, 96087, 46570, -13290, -10215, 56128, 108335, 82996, 9217, -24728, 21323, 91821, 99326, 31529, -32252, -18740, 52692, 91603, 47651, -28914, -50710, 4378, 64026, 54217, -14964, -63104, -38061, 25707, 49650, 5703, -53941, -61172, -11433, 35421, 26632, -24622, -57460, -35544, 15780, 40392, 14971, -29413, -40826, -4392, 42176, 49216, 11403, -26627, -18601, 29457, 66998, 52351, 3188, -22760, 7933, 63276, 79598, 36550, -16842, -17352, 38097]
220C8097M4832k0863o4561l3567L7486O1948R800n6812n8581P591O2132L9134
232F6636l3434o8316k3423M5263N6758j259n8040m6534J8504N8008K8788l2834
244A0117n4749j1464M2926M6610j537m4895l4229J6255M7732K6410k0979m1980
256a9783j2872L1203M2410Q285l3320l5589L554M0525L3516j1542m4101k5964
268b3678K3377M7170J6652l5587m7945m327M4173M1144j3574n5113l3205K7070
280a3843N3562J4416m5131n2838J009N1516L8710k1496n7186k5436L4883N1804
292B9970O655m6050m3382R879N0033L0836k3755m6934j4437L4384M3037L252l6752
305c264l1481R841M0657K5279j6150l6786j3923K4634L5696Q181k7464l1270P12
$$ y = [38097, 82929, 62066, -2495, -36062, 1424, 63372, 73172, 16360, -42221, -34630, 27502, 66636, 33202, -35114, -58537, -13274, 43484, 42225, -15815, -62349, -43845, 14163, 42951, 10117, -44632, -56096, -13170, 33440, 31903, -12992, -47221, -30966, 16766, 43176, 22197, -19783, -32655, -1452, 40958, 49243, 15923, -19666, -16112, 24413, 57929, 46387, 2286, -23678, -301, 46869, 63521, 27934, -20011, -24338, 19835, 60979, 47405, -7708, -40913, -13843, 39719, 54135, 9004, -43834, -42825, 8691, 47401, 25905, -31281, -56717, -21834, 29970, 36625, -9425, -52807, -42928, 7105, 37941, 14186, -32748, -47185, -12801, 30236, 33488, -3264, -34745, -24904, 15753, 41032, 24882, -11904, -25827, -1193, 34503, 42684, 15220, -16050, -15338]
318a5338L2552K8140q236l6784k3379J6844L7917J4057k7830l9524n941L4863
330G341L3729q836m3767k8369K0075M3960J4198l4602m3286j605M1813L4195j5171
343A9675m6718k2983K8261M4793Q656l7688l7284P436M2816K8153j8866m0893
355b4642j3386K9424L7705L489l2146k8303P977L5391K2373j4303l3185j2924
367b2530K1204L1448O047k5122k7991J016K8264K3363q536l2239j9612J5370L2192
380B2874J1161k4593l3499m010K9514K8638p992l6370k3698J7152L7929J2084
392B9190k8233l6816j392L5798L0363j1655l9753j9734K3907L9078Q518l1045
404a774l3083N129L7139K6109j4957l6580j3779K4408L4707N252k8912k7445N316
$$ y = [-15338, 17214, 45354, 37118, 334, -23045, -6201, 31716, 45773, 17943, -21581, -27522, 7341, 41070, 32234, -11533, -39902, -19827, 24133, 38331, 3729, -39557, -41162, 651, 34846, 19675, -27043, -50026, -21765, 23028, 31684, -6004, -43288, -35852, 6964, 35117, 16251, -24642, -38028, -8604, 29101, 32590, 444, -27859, -19882, 15509, 37882, 23579, -9606, -22530, -1326, 30122, 36169, 11047, -16944, -15928, 12336, 35699, 27163, -5076, -24688, -9318, 22874, 34035, 9442, -24057, -28067, 1447, 30085, 22093, -14277, -37975, -20823, 17106, 29190, 957, -35859, -37251, -1453, 28910, 17255, -22498, -42232, -18325, 20753, 29271, -1774, -34857, -29728, 7411, 33520, 18563, -18017, -31796, -7388, 27319, 32571, 3659, -23786, -18470]
417a8470L1706K1610j3152l1188j3557J9002K9091O141k3630k6807J55K6587K1662
430B9150q034k9574j8444J3603K9414J1061k1737k9945m501K6589K6299n469l2267
443a3855k1516J4532L3877J2795k3747l2449k616L0832K8003q030l4134j9012
455c5320J8800L4996J0141k5763k9876J315L1686K4301j0446l1865j5123J9577
467g577L0779O311k4303k5974L119K6948J9721r567k7939j3287J4896K6029O332
480B5488k0263k4209r01K2382J9974o011k5734j6483J1060K6052J0304j7815k6565
493b2721m202K2846K3507l964k7089j8895J2048K9268J1964j9489k8106k672K5837
506a668K5168o097k8578j7758J5199L0345R863k1823k6674N74K6776K1891q902
$$ y = [-18470, 13236, 34846, 21694, -9494, -23051, -4049, 25042, 31183, 7553, -19254, -19099, 7488, 29150, 21116, -8458, -26902, -13299, 16115, 27176, 5439, -24506, -29007, -2418, 23881, 18412, -13855, -35371, -20839, 13038, 25833, 2086, -30363, -32979, -2147, 25856, 17826, -16308, -35320, -16520, 18476, 28617, 2854, -27022, -25707, 5979, 30280, 19834, -12031, -27154, -7577, 23202, 29513, 5210, -20764, -17645, 9303, 29024, 19457, -8482, -21769, -6873, 19156, 25488, 5225, -18984, -19885, 2497, 22471, 16460, -9274, -25757, -14697, 11355, 21659, 3844, -22721, -26923, -4077, 19430, 15466, -11623, -30518, -18470, 10798, 22762, 3273, -24833, -27505, -1668, 23500, 17403, -11175, -28933, -13734, 16611, 26474, 4651, -22023, -21449, 5327, 27218, 18316]
519A8316k7875j3880J6273K6477O143k0974k2858J436K3169J7299q098k4262j2468
532b1302J3002K2856N965j7662k1391p19J9717J7674n445k2561j4040J0101K2668
545H863R189j5612k2554l271J9861K0543l193k3368j6401J0264K5425J1071j6366
558D451k4877k879K2667K2308m249k6015j6169J2861K6995R443j9143k4472p93
571a9872K4094K0040p221k5262j3778J3901K4395O379j8716k1839p1K2019J6716
584B0785p359k2401j2515J2242K0871O013j6029j9652j280J8354J6536m630k0036
597i101j3032R074K0851Q330j3457j9929l248J7419J8545j917k0228j5145Q388
610a3450K2198J0599j3698k1778l848J9150K0289l098k2107j5563R980K3725R800
$$ y = [18316, -9559, -23439, -7166, 19311, 25454, 4480, -18378, -16942, 6227, 23526, 15428, -8834, -21302, -8300, 14556, 20521, 2859, -18532, -19251, 466, 18140, 12695, -9866, -23906, -13805, 8863, 18052, 2440, -20114, -23385, -3524, 17019, 13826, -9542, -25943, -15679, 9746, 20817, 4451, -20426, -23305, -638, 21670, 17421, -8594, -24763, -11902, 15093, 24536, 5393, -19079, -19872, 4222, 24262, 17041, -8221, -21999, -8098, 16297, 22676, 3960, -17879, -17950, 4069, 20785, 13426, -8975, -21490, -9248, 11623, 17636, 1607, -18045, -19325, -971, 15565, 10935, -9101, -22133, -13059, 7792, 16122, 2665, -17264, -20512, -3093, 15452, 13535, -6693, -21838, -13450, 8748, 19347, 5649, -16129, -19977, -827, 19462, 16364, -5743, -21306, -11326, 12399, 22199]
623B2199j5666k2828k073K0028J8812m232k2840j4046J1006K2162P370j6057k0292
636a6457j338J8538J6414n028k0536j1864R741J9706O580j3975j7928j777J5881
649b043J5555l242j7298j2150P220J8789Q010j1194j7863l552J4921J6361o19
662A2895j7435j3397O422J8818R994j1006j8570m184J5269J6937j220j8003j3318
675a6798O623J9200R645j2340j8681m030J6164J6407k730j8307j2957P831J9149
688I176P218j2856j7639k092J5382J4839l542j7215j1147P620J7549O468j1699
701B062j5735k020J4175J3382k061j5594j0603O544J6481P172j0273j5122k875
714a4467J2875J3835j101j4656j1174N522J6334P809r570j5727l575J2867J4488
$$ y = [22199, 6533, -16295, -18368, 1660, 20472, 16240, -6600, -20646, -9640, 12522, 19892, 3835, -16457, -17795, 743, 17157, 12129, -8407, -20271, -10530, 9176, 15756, 1781, -16147, -17924, -2043, 13512, 10270, -7028, -19178, -11958, 6831, 14841, 3647, -14216, -17768, -2847, 13514, 12895, -4540, -17937, -11515, 7303, 17297, 6291, -12279, -16463, -1194, 15743, 14523, -3480, -16798, -10175, 9025, 18670, 6330, -12351, -16381, -217, 16190, 13460, -4847, -17804, -9973, 9176, 16394, 3538, -14101, -16193, -811, 14028, 10486, -6729, -17876, -10256, 7293, 13761, 2062, -13673, -15693, -1518, 11864, 9803, -5791, -16394, -9850, 6631, 13803, 3530, -11592, -14467, -1592, 12243, 11142, -3514, -14688, -9166, 7168, 14977, 5407, -10320, -13895, -1028, 13460]
727A3460q70j5103j2189N895J6401P590r814j6440l610J3719J4405j795j6062
740d413j1076O295J6427O759j0853j5174k569J3315J3404k160j5470j0233O751
753h997J5585O293j0094j4865k186J3330J2694k067j4587r348N828J4689O372
766A2647q972j3876k384J2010J2619j311j3944r861M699J4782P304q621j4641
779i549l083J1505J3478j129j3785j0994N178J5034P135q954j4916l393J1837
792a636J3196q33j4298j0630N202J4710P260r116j4217l379J1783J3055j437j3686
806d026r824N017J4581O523q349j3869k800J1403J2196j055j2915r416M713J3701
820E880O461p611j3367k948J0922J1616p10j2088r717M008J3421O561p421j3083
$$ y = [13460, 12590, -2513, -14702, -8807, 7594, 15184, 5370, -11070, -14680, -961, 13444, 11649, -4413, -15489, -9194, 7233, 13992, 3139, -12035, -14604, -1289, 12115, 9955, -5515, -15748, -8997, 6588, 12881, 2787, -12078, -14264, -934, 11760, 9693, -4894, -14242, -8414, 6275, 12647, 3675, -10201, -12585, -575, 12044, 10733, -3211, -13072, -8373, 6409, 13713, 5092, -9549, -12632, -1127, 12351, 11222, -2563, -13557, -8379, 6655, 13790, 4836, -10080, -13473, -1636, 11560, 10727, -3571, -14201, -8999, 5711, 12971, 3855, -10362, -13741, -1958, 11097, 9660, -4026, -13850, -8833, 5748, 12271, 3922, -9947, -12747, -1344, 10852, 9797, -3118, -12534, -7821, 5880, 12341, 4730, -8637, -11585, -663, 10953, 10243, -1845, -11562, -7554, 5867, 12428, 5007, -8076]
834h076l158R906J1682m8j1939j0156L677J3122P141p375j3064l761R918J1895
848I764J50j2401r808L810J2974P320p280j3047l655R732J2108j27j1709r690
862a1859L514J3425O426o897j2279l790R685J1404J88j1057r448L234J2523O028
876A1097o193j2237l000R077J0744R5j0590r000K976J1414O414n782j1433l499
890i917Q462J0314nr628r186K626J1092O440n602j1495l522Q125J0516N47j0106
905a339q991K707J0965O600n495j1302l476P830J0771Q96j0376q691K310J1288
919C697O919n426j1291m002Q278J0133Q09r833q809K780J0573O346n263j0884
933e973l271P896R692N63r609q310K486J0090O112n065j0302l408P435R348L81
$$ y = [-8076, -11234, -1328, 10354, 10306, -1633, -11789, -8112, 5010, 12151, 4776, -8288, -12049, -2131, 9764, 9914, -2487, -12295, -8485, 4489, 11809, 4529, -8518, -12173, -2441, 9667, 9540, -2169, -11859, -8345, 5080, 11506, 4609, -7670, -11460, -1775, 9629, 9817, -1240, -10688, -7454, 5069, 11097, 4904, -7333, -10333, -1256, 9488, 9583, -1007, -10007, -7031, 4383, 10797, 5015, -6418, -9917, -1455, 8859, 8854, -774, -9960, -7334, 3758, 10198, 4596, -6899, -10421, -2296, 8220, 8767, -1339, -10330, -7623, 3342, 9942, 4447, -6855, -10331, -2501, 8270, 9166, -1210, -9901, -7591, 3697, 10616, 5190, -6101, -10103, -1825, 8308, 9117, -716, -9525, -6745, 3828, 10174, 4911, -5973, -9244, -1348, 8344, 8907, -702, -9012, -6526, 3564, 9676, 4611, -5691, -9099, -1664, 7684, 8065]
948H065q967p845K086R759N782m877r632l415O797R153N57q222p564J808R336
963B821N959m302r351l946O836Q877J209q579p665K180R000N812l851j0018l495
978h513O548R038J333q588p682J728R307N914m500r547l080O087Q972R21q345
993d07p899J996R474N350m610r314k744O252Q675Q63q246p420K196Q500N438m439
1009C665q382l097N954Q270L87p311p165J867Q334N625m195q255l096N591P569
1024E761J611p427o741J417Q029N216l833p870l442N477Q031R19p123o561R42
1039e594P972N467l756q241l313N332Q205J121p123p379J708Q235N088l781q176
1054d235l242N531Q116J012p515o709J733P579N125l548q340l293O101P777L08
$$ y = [8065, -902, -8747, -6661, 3098, 8880, 4003, -5629, -9044, -2247, 6906, 7463, -759, -8323, -6515, 2821, 8780, 4478, -4873, -8819, -1983, 6894, 8103, -476, -8141, -5961, 3039, 8851, 5000, -5018, -8513, -1965, 7073, 8406, -182, -7864, -6136, 3171, 9085, 4585, -4962, -8042, -1955, 7017, 7938, -407, -8306, -6310, 3164, 8514, 3904, -5410, -8154, -1902, 6773, 7636, -610, -8030, -5834, 2666, 8104, 3665, -4717, -7814, -1860, 6410, 6797, -514, -7679, -5812, 2522, 8147, 3952, -4303, -7399, -1808, 5761, 7372, -55, -6796, -5379, 2650, 7866, 4033, -3837, -7279, -1802, 6229, 7148, 25, -6536, -5594, 2378, 7845, 4089, -4152, -7465, -2133, 6072, 7193, 70, -7309, -5601, 2634, 7722, 3941, -4235, -7477, -1946, 6170, 7182, -333, -7042, -5309, 2270, 7395, 3847, -4493, -7786, -1685, 6092, 6400]
1069F400o605o540J543P751M732l848p505k914N239P442Q79o843o179J419P399
1084B370M640l326p459l178N248O873J396o238o640J030P178M761k470p657l412
1099f884M781O843J790o294o538P91P048N292k811p756l350M646P266J512o116
1114B20o422Q57O976N089k902p497k848M420P205J225o012o160P43O873M537k728
1130C576p169k677M269O766J072n418o120R44O351M510k418o577l071M117O359
1145D514J257n374n566M06O040M780k536o362l007L698O094J860n139n886N0N809
1161F38N031k035o208l400L706O181J546m794n714K73N595M754j787o169l292
1176e675L484O244J467n118n023M13N142M494k005n858l115L648N483J606m661
$$ y = [6400, -205, -6745, -5202, 2549, 7281, 3433, -4072, -6986, -1747, 5695, 6574, -269, -6448, -5029, 2370, 7010, 3684, -3775, -6953, -1705, 5168, 6564, 326, -6314, -5284, 1894, 6655, 4185, -3472, -6884, -2103, 4740, 6530, 236, -6302, -5511, 1537, 6829, 4018, -3738, -7088, -2442, 4824, 6336, 220, -6202, -5345, 1631, 6720, 3818, -3679, -6527, -2107, 5098, 6323, 311, -5849, -5106, 1767, 6304, 3576, -3593, -6270, -2001, 4765, 5837, 419, -5701, -4757, 1594, 6104, 3686, -2891, -5962, -1845, 4514, 5771, 397, -5169, -4763, 1277, 6057, 3521, -2841, -5848, -2150, 3944, 5804, 665, -5221, -5171, 638, 5669, 3634, -2574, -5974, -2268, 3913, 5459, 665, -5049, -4776, 819, 5573, 3786, -2383, -5675, -2191, 4053, 5520, 402, -4621, -4208, 934, 5428, 3423, -2435, -5550, -1902, 3581, 5187, 526]
1191E26n130N20N139M091j889n642k915L640N448P56l966n016K67N174L868j907
1207B964n380k685L223N436J257m332m800K62M604M048j557n173k697K712N647
1222C529P77l702m959P0M890M088j600n392k558K869N209J740m360m893M14M792
1238I14L905j469n889k466L347M967J390m079n033O10M974L760j919n216k679
1253d883K934N727P75m306m340K50M903L591j903n105k143K957N052O77l655m337
1269c806k29N165L246j439m995k617K989M514J302l557m449J58M363L905j456
1284C094n216k531K708M858J592l738m781J72M573L961j633n187k564K454N392
1299C154J157l799m251p2M566L971j858m983k387L091M320J303l494m424LM337
$$ y = [526, -4604, -4084, 1055, 5146, 3257, -2385, -5300, -1660, 3788, 4544, 578, -4438, -4171, 1003, 4871, 2964, -2416, -5101, -1878, 3558, 4815, 483, -4317, -4055, 549, 4597, 3040, -2133, -4830, -2118, 3529, 4306, 604, -4355, -4285, 605, 4693, 3093, -2299, -4857, -1988, 3221, 4961, 601, -4292, -3878, 914, 4819, 3350, -2539, -5005, -1658, 3309, 4699, 620, -4413, -3803, 1171, 4931, 3012, -2204, -4883, -1949, 3778, 4553, 247, -4093, -3843, 1060, 4651, 2748, -2357, -4500, -1543, 3509, 4186, 531, -3806, -4035, 1130, 4376, 2937, -2058, -4675, -1686, 2828, 4130, 573, -3876, -3718, 645, 4550, 3094, -2122, -4653, -1945, 2913, 4505, 767, -4014, -3842, 731, 4692, 3059, -2128, -4692, -2238, 3154, 4311, 512, -3739, -3811, 755, 4726, 2868, -2115, -4502, -1411, 2909, 4212, 718, -3706, -3703, 634]
1315F34L450j402m379k713K676M770Q90l443l983L4M020L233j093m021k408J905
1331a830M347J422k972m064k39L721L385r31l982k742K185M111J516k824l935
1346b832q19L983L548o06m681k661J895M416J787l516l630m90L780L765p50m479
1362a290k808K167M282J454l267l613n65M079L520j502l892k298J850L936J512
1377C565k853l744J88L571K456j181k914k589J849L760J308k358l755o2K928L122
1393C291o95l656k453K248L099J321k381l349l33K833L334o39l426k287J590L459
1409A956J376k266l642n07L190L200o58l570k411J571L737J359k497l487o66L671
1425C56K755q83l227k398J594L716J218k591l153J8L220K232n67l286k078J723
$$ y = [634, 4084, 2682, -1697, -4410, -1734, 3036, 3926, 483, -3500, -3466, 554, 3787, 2694, -1327, -3735, -1830, 2517, 3939, 967, -3097, -3336, 385, 3770, 2839, -1143, -3885, -1700, 2411, 3927, 1103, -2832, -3651, 332, 3880, 3274, -1407, -4068, -2173, 2243, 4030, 514, -3116, -3606, 174, 3939, 3189, -1290, -4098, -1931, 2351, 3805, 538, -3075, -3640, 439, 3959, 2457, -1435, -3733, -1883, 2053, 3565, 712, -3032, -2844, 727, 3183, 2002, -912, -3501, -1652, 2108, 3416, 1058, -2697, -2759, 169, 3291, 2596, -1060, -3513, -1265, 1834, 3155, 774, -2575, -2908, -75, 3259, 2620, -806, -3093, -1503, 1956, 3332, 1066, -2576, -3083, 107, 3307, 2649, -921, -3332, -1761, 1976, 3335, 838, -2649, -3315, 356, 3111, 2228, -999, -3397, -1803, 1913, 3131, 540, -2613, -2595, 625, 2857, 2290, -996, -3074, -1351]
1441a351L242J186k086l446j91K839K660n80l052k224J559L220J013k003l169
1456b383m38L020K686n06l271k285J637L361J135k008l204o38L091K709n67k950
1472f11k381J220L096J947k416l056n60K972K896q54k872k468J401L522J097k462
1488D71k737n05K774L092n54l550j869J577L019J174k145l516R4K822K235m9l222
1505h89j733J039L260J143j995l122k53K422K735n14k511k553J260K932J474j939
1521G56k798n33K292K777l90k819j970R70L031J313j511l190k69K440K333k94
1537B138k811j984J060K927J291j775k987k00K235K569l34l007j900J222L039
1552A483J265j657l169j21K201K183j81k705j818J142K689J303j959k397p59K218
$$ y = [-1351, 1891, 3077, 991, -2455, -2646, 193, 2853, 2273, -779, -3003, -1444, 1776, 2789, 786, -2383, -2821, 199, 2885, 2379, -892, -3177, -1540, 1821, 2956, 948, -2256, -2894, 197, 2906, 2339, -611, -2992, -1772, 1324, 3271, 855, -2201, -2761, 211, 3107, 2253, -619, -3087, -1686, 1836, 2933, 471, -2266, -2771, 3, 3095, 2541, -1009, -2878, -1301, 1718, 2892, 747, -2769, -2675, 147, 2382, 2333, -889, -2622, -1583, 1677, 2820, 825, -2297, -2550, -128, 2607, 2093, -418, -2971, -1711, 1221, 2695, 756, -2042, -2575, -283, 2494, 2104, -715, -2685, -1715, 1316, 2629, 1118, -2072, -2341, 99, 2432, 2138, -673, -2657, -1597, 1330, 2621, 846, -2141, -2341, -106, 2463, 2129, -878, -2778, -1556, 1483, 2748, 1091, -2078, -2199, 2, 2185, 2004, -701, -2519, -1377, 1312, 2615, 656, -1741, -2500, -282]
1568b82K454m37k400j650J075K395J210j557k644l55K004K069k38k265j767J091
1584a297K514J219j940k224m91J972J961l0j960j780M79K824R82j496k089q22
1600b178J947K236l05k439j529P06K944P59j321k440n31K144K014k60k288j820
1616b361P98K738J205j590k331p95K253J960l04k203j644J155K408J029j453k668
1632a803k67K063J994p7k182k153R87K455R87j122k421m34J925J873L8k095k036
1649b268R24K615R15j313k596k64J418K267kk165j745Q34K297J204j376k200o32
1666b087J783J984k74j565j905P14K388J133j465k374m76J838K437k47k208j641
1682a965O52K143J123j121k160n51J631J953j5k180j459N76K385J052j023k388
$$ y = [-282, 2172, 1735, -665, -2315, -1240, 1155, 2365, 808, -1836, -2191, -187, 1882, 1644, -621, -2388, -1297, 1217, 2436, 496, -1728, -2219, -247, 1714, 1684, -276, -2056, -1577, 1247, 2229, 733, -1356, -2178, -231, 2005, 1700, -739, -2268, -1562, 1382, 2141, 820, -1620, -2151, -7, 2007, 1747, -541, -2361, -1563, 1175, 2380, 790, -1541, -2336, -83, 1877, 1573, -630, -2274, -1119, 1289, 2318, 865, -1803, -2070, -7, 1987, 1910, -272, -2425, -1438, 1017, 2004, 882, -1539, -1973, -48, 1825, 1863, -232, -2268, -1344, 1271, 2186, 873, -1723, -1987, -569, 1698, 1696, -469, -2214, -1380, 917, 2121, 745, -1455, -2087, -304, 1680, 1406, -159, -2064, -1350, 1038, 2171, 706, -1668, -2144, -306, 2131, 1884, -324, -1965, -1313, 830, 1953, 832, -1328, -1879, -248, 1705, 1690, -490, -1949, -1373, 1012, 2064, 1041, -1347]
1698a347n85J783J591K39k098j478L38K290J239j300k052o83J834J804J69k218
1714d74j165K07K114J170j066j854n71J259J947j7j850j564L17K035J269q08j878
1731i29j043J491K117j63k014r53L31J653J237j212j648n21J487J567R5j886j429
1748a820P30J766R73o98k042k83J139J662J49j666j286L24J760Q40q68j609o22
1765a551J448J634k05j347j553O49J214J387j051j552l76J148J473l1j415j492
1781a620N17J731Q75l64k151n44J354J541L0j409j464O03J714J010j030j820m11
1798a438J271J692k68j290j742Q51J670P69q21j498n48J088J521l9j400j496O45
1815a033J768O66q31j566m65J461J332k20j059j231J46J580R45j233j417j55J065
$$ y = [-1347, -1932, -149, 1442, 1681, -417, -1895, -1557, 733, 1972, 672, -1380, -2063, -229, 1575, 1744, -474, -1639, -1432, 682, 1852, 786, -1068, -1639, -380, 1567, 1550, -300, -1864, -1547, 488, 1757, 949, -929, -1972, -481, 1636, 1473, -541, -1494, -1163, 490, 1727, 515, -1133, -1654, -167, 1400, 1495, -391, -1820, -1090, 676, 1649, 951, -1091, -1374, -235, 1427, 1576, -90, -1376, -1052, 708, 1548, 680, -929, -1551, -103, 1531, 1326, -21, -1574, -925, 289, 1676, 625, -927, -1303, -155, 1318, 1287, -128, -1620, -1103, 628, 1503, 1139, -1012, -1556, -202, 1339, 1369, -40, -1504, -901, 813, 1823, 793, -1027, -1438, -167, 1525, 1257, -33, -1775, -924, 746, 1515, 694, -804, -1352, -264, 1257, 1218, -182, -1678, -1033, 735, 1401, 570, -996, -1461, 0, 1332, 1112, 53, -1178, -1032, 548, 1493, 260, -1157, -1312, -247]
1832b47J174M76j535j265M90J339J067n76j824m03J097J317J41j251j415M49J516
1849E50R22p65j567p04J347J578m6j201j842P03J563R52p45j916l17J110J693
1866A315N6j456j441O99J317J115p40j804o42J171J632k18r49j025NJ430P15j97
1884I83j773n41J278J257o9j030j319k1J695P33m29j521l81Q02J423j31j053j208
1902a305L32J284R14r07q09n64O76J562j96j024j424M87J592Q53p10j665k76P24
1920d56J438L74j361j614Q05J431P39p50j403n80J184J283j56j098r72K63J420
1937E47R94p88j495k77Q04Q94J03r25j028N07J082M74k19j401n69R66R51K62r44
1956f2p86J18Q61J110q61p92o54R15R48L47j109q03m4J191O82j44j587n40O15
$$ y = [-247, 927, 1403, -132, -1397, -907, 432, 1499, 923, -901, -1304, -207, 1110, 1251, 0, -1415, -966, 550, 1472, 707, -860, -1564, -217, 1361, 1315, 114, -1728, -1025, 538, 1490, 745, -1171, -1488, -378, 1315, 1371, -85, -1526, -827, 490, 1605, 865, -939, -1581, -410, 1222, 1004, 55, -970, -965, 465, 1180, 983, -790, -1331, -53, 1204, 1135, 105, -1214, -1235, 460, 1193, 764, -757, -1138, -336, 1087, 956, -97, -1305, -973, 311, 1225, 318, -491, -1055, -379, 1183, 987, -37, -1461, -974, 618, 1471, 761, -904, -1180, -456, 982, 1356, -5, -1619, -814, 617, 1356, 606, -797, -1377, -193, 1090, 934, -164, -1136, -873, 547, 1541, 753, -742, -1019, -215, 679, 782, -143, -1171, -664, 418, 892, 673, -728, -1297, -331, 620, 882, -62, -848, -730, 131, 1241, 380, -412, -1066, -151, 797, 1144, 35, -768, -812, 379, 1061, 917, -670, -1210, -595]
1975e95J322K00j072j048N75R77N77l00j409l20O47J323m6q28j258K93J306O37
1993I81o56p07o23P38J357k06r90r32J08J167O43m25j089l60O86J308k03r03p79
2012h85K61R07O65o44p46l45K58J309jo56j077K51J222L57l76q97o92R23R54J34
2032I22q41r91n1J007P88l36r93k96M78R33K16r24q37M65Q03Q47p83o70q90Q82
2052b71R79L8n60r53j26J112O28p14o44n63Q07J012L8j013o20Q4Q40P66o72o24
2072d56k65L16J306K7p81j122l0J468L56k69j090l52M89J135N18r09j328L66R67
2091C46N98O6j467m85M62J111L93r93r63K80R35N09k89j061l62N13R77M96j150
2110h4o35N9R91O30o13q89k50K65J076L35r03p25m3J073M40p0j085o33O46J000
$$ y = [-595, 727, 927, -145, -1193, -618, 359, 936, 636, -773, -1093, -446, 877, 831, 3, -1255, -962, 344, 981, 325, -382, -1005, -267, 1090, 884, -106, -1038, -930, 237, 880, 455, -634, -994, -308, 1000, 797, -106, -885, -624, 283, 948, 304, -442, -787, -529, 780, 779, 123, -954, -703, 519, 876, 500, -397, -1089, -166, 788, 922, 81, -910, -961, 46, 834, 498, -495, -791, -313, 620, 836, -88, -925, -460, 343, 1190, 407, -263, -1153, -271, 708, 746, 186, -767, -893, 219, 847, 133, -511, -1074, -267, 745, 783, -230, -850, -766, 74, 840, 168, -456, -721, -405, 901, 928, 147, -975, -1005, 463, 819, 550, -540, -892, -403, 732, 1250, 341, -987, -621, 346, 944, 1010, -457, -942, -480, 631, 1024, 31, -932, -652, 283, 792, 503, -558, -920, -407, 570, 1066, -84, -719, -660, 331, 961, 348, -541, -791, -526, 550, 885, -18, -743, -786, 287, 727, 657, -428, -1061, -415, 585]
2130E85J81p94p86M73O79N19o15o41k07R8J033Q4n47n84l19Q06R56l78j019m78
2150i54M77P09M46o47o10j38Q61N79j10j112k41N63L42N72q21n23r3Q16Q60m45
2170E31q74m82K94J193j14o63o60L38P40M68n97m26p1k21J153q2n69n01l83J116
2190A90O98l10r05m41N97O80J59n74j026K33P71L60l0q62j87J61O53L85m70o73
2210e91N4O32N32k52o91k91K82O88J59l32o68l16J029K93l2p08l22M84M20J40
2230E10n42k99j83Q13L6r2n91k13K94P04J86o09n80j03N68M93J16p98j12L03M28
2251C29L65n09r51J7Q13L86pp18k35L1Q28L62q12n44K0J026Q0k55p55j93M65P29
2273D72K6m08m11k39R31m9J73l83q52L63P52K59o09m60Q5N56M96k72p38n62L86
$$ y = [585, 766, -28, -814, -341, 338, 857, 242, -399, -606, -508, 525, 609, 62, -522, -841, -35, 921, 543, -476, -954, -477, 232, 678, 31, -579, -717, 144, 723, 613, -499, -740, -177, 165, 737, -84, -607, -700, 116, 976, 531, -343, -825, -531, 662, 548, -115, -775, -437, 303, 771, 174, -252, -323, -544, 609, 527, -42, -543, -926, 190, 888, 578, -327, -768, -171, 509, 668, 94, -932, -699, 72, 432, 402, -460, -647, -486, 167, 552, 82, -591, -537, 95, 627, 375, -316, -607, -325, 363, 522, 190, -478, -794, 235, 528, 496, -212, -534, -50, 370, 510, -32, -331, -514, 299, 335, 243, -348, -561, -267, 437, 623, 14, -566, -669, -101, 392, 508, -290, -402, -99, 329, 694, 185, -766, -749, 64, 450, 443, -275, -510, -479, 349, 711, -101, -645, -625, 401, 481, 226, -529, -722, -257, 472, 498, 90, -321, -560, 371, 322, 495, 112, -740, -377, 375, 634, 25, -435, -350, 206, 702, 430, -308, -870, -484]
2294d84R28L92p08o04j57R28Q6J31n94m98M54N88l6l34m81J26J57Q03l56p89l9
2315d87K39N97J74p32l09k59Q84N72k30q04j09L36N93O7m62n91k11O96M74l48
2335I0n61p5L58O76J32o52m22k7O86J05l8o92m3L88L12M3l17k92j41N34K48N5
2357C67n07o36N79M76J48k70p58O7N01Q25o67m24k99N29N62L80q64o40L45M71
2377A85M39j75p01r8K93M69L33m72l34l28O89M54n69l62j34K46L97K54o18j90
2397b22k99N53N19m77k28l33L73K27J46k24m70P4L32N56k73m34k42R7M97K46j44
2418B74n76r0J81Q60k88m80l58K42N53P2m69l00j55M96N71l52j19n57M23L08J79
2439D15l18m77p4O55L39m02l47l37L06N40K00l81n57L6L07M30j28l36l31N43K06
$$ y = [-484, 444, 836, 128, -476, -633, 295, 381, 512, -82, -580, -126, 462, 426, 92, -389, -263, -106, 697, 341, -448, -487, -248, 349, 523, -209, -518, -777, 107, 679, 449, -355, -464, -128, 465, 532, 70, -521, -732, -36, 438, 90, -471, -546, -188, 488, 620, -32, -454, -481, 205, 310, 272, -420, -463, -75, 237, 280, -37, -329, -470, 64, 312, 367, -140, -776, -197, 279, 427, 157, -601, -534, -33, 792, 125, -299, -598, -69, 493, 873, 9, -631, -286, 185, 624, 449, -252, -350, -57, 412, 745, 273, -61, -389, 300, 754, 185, -177, -311, -65, 332, 586, -32, -222, -521, 32, 551, 74, -154, -487, -114, 113, 259, 35, -435, -361, -29, 527, 254, -180, -422, -325, 172, 418, 274, -302, -392, -211, 649, 361, -119, -477, -235, 318, 390, -79, -379, -534, -38, 533, 181, 62, -495, -72, 236, 415, 97, -380, -454, 201, 540, 138, -209, -546, -240, 300, 500, 119, -438, -402, -95, 335, 207, -129, -460, 83, 289]
2460B89o8R1o75J85K13L61l40l27l15N47M77J19n08m77q0L20M84p3n59N5j77Q41
2482C83n2l66j86j38L27J89J81l74n62N08L29m4j39m10K20L56P6J61o81j43M19
2503E4M41j20m83j20O7N33j88j98j68J01J1L70j8m74j55lN07P3j04k47j99j3L23
2526a0O65k23r77K68J80O51k73l38m09M35L57J44j95q52J53N48P3j90l23o3K34
2547a45M46J01j12m55m16Q80J79k78k46n70L97O34K16q13j78R5L47M38m17m04
2567c01q0K33L27q1L3m90l8N39K15j64j34m49K95L40J11j68l73oQ7N62o1l31n15
2590d49K93L23L65l64l83k63N95K67R5o51K45O4L97j62j73m37oM27L31j43n29
2611a58r0k6M15J27l08j35k50L42L46j40m14M1j0J44M09m8m82K4K58J10p6J00
$$ y = [289, 221, 312, -363, -178, 35, 396, 56, -271, -586, -39, 438, 557, 49, -428, -508, -188, 296, 223, -336, -281, -458, 383, 331, -35, -221, -359, -32, 157, 338, -36, -598, -90, 239, 195, 56, -354, -134, 222, 298, 459, -222, -365, 54, 495, 375, -108, -228, -161, 372, 184, -14, -182, -81, -70, 300, 282, -192, -347, -350, 157, 230, 126, -121, -320, -333, -10, 655, 432, -545, -277, -97, 554, 281, -57, -466, -31, 326, 470, 275, -577, -424, 124, 197, 7, -316, -379, -145, 301, 402, 290, -165, -581, 299, 478, 200, -46, -616, -219, 415, 631, -182, -360, -265, 82, 520, 103, -301, -381, -148, 179, 98, 131, -359, -397, 142, 357, 193, 59, -390, -95, 245, 356, 188, -185, -191, -104, 458, 397, 66, -449, -156, 167, 532, 168, -215, -478, 117, 384, 479, -172, 73, 137, 534, 372, 199, -238, -244, 183, 514, 371, -158, -248, -274, 141, 268, -40, -175, -425, -83, 263, 123, -291, -250, -260, -116, 293, 245, -237, -213, 45, 155, 79, 179]
2633A79l65PL74K20m47o7k80M02K01Jl44q8n5L65L59l22m51Q0N87r9p2l41o5r9
2657c20L73K80l30l73M7M26N35n69j79j02M8N04r5r2m83n8P22o0L2l29l04N79
2679B52p6N7k00m56K53R7L76l98Nk31K68J38K78k81j29j39M04N5M7m29j99J65
2701a43K13L42l54j25k47M15J87k16j87n4J21J1L57l88k55P3J88K76j8n24j59
2722d87N19K59P4p7m71r3N28J41k46o05J68L60J74Q7l31k49K22j20J07L2P3p1
2744fj52R1K71r4l91P7K84J78R0j18k62j60K05M78m26k57m0J28M17k76j94j21
2766b78J13L49J28k37l85R1K31K69P2p18q7N89N7J05l96J4p9J17K45P4m73m5l6
2789b80N02J28m10j46R4o5L55k0L8p22M44K43k09J11j86j1P7M77j76k51R0J45
$$ y = [179, -186, -179, 195, 415, -32, -99, -379, 23, 224, 225, -119, -207, -262, 103, 462, 140, -311, -231, 356, 257, 185, -156, -221, -320, 53, 333, 3, -370, -323, 103, 638, 69, -110, -212, -164, 340, 245, 153, -330, -388, 334, 274, 306, -23, -327, 252, 176, 233, 33, -423, -170, -73, 303, -95, -90, -321, -53, 85, 363, 82, -47, -186, 218, 273, 320, -109, -308, -143, 70, 412, 58, -67, -314, 101, 288, 72, -115, -169, -48, -37, 320, -68, -323, -250, -62, 214, 196, -328, -487, 32, 291, 365, 288, -183, -276, 252, 393, 147, -458, -290, 70, 244, 331, 0, -249, -27, -147, -40, -8, 65, -6, -158, -67, 204, 110, -281, -204, 80, 258, 348, 230, -32, -192, 13, 491, 65, -192, -232, -104, 313, 37, -157, -278, -165, 184, 312, 75, -310, -219, 12, 281, 353, -365, -452, 137, 194, 299, -97, -83, -162, -45, 200, 274, -199, -244, -280, 222, 350, -60, -206, -112, -177, 178, 158, 196, -526, -82, 161, -48, 63, -123, -134, -57, 420, 244, -7, 83, 228]
2811B28l32M55k52j79l6j48L13r2O2n60M03L09K10k91m97L91LN7J19l84k1LM42
2834B03O9j70n38J24QN85k46j35r6L19L11n5k43k83n8J56R4Jk33j15K50n8K26
2857A16l07K44j1m1K4m9l08K36L1K22K89k26l65K11P7J77j46k96j21PM36n3J01
2880B48m47M9J21L18k22l66J96O2K19J03m25M2k39L26M93p18K88k97K41P2K18
2901B82m00j05r1M00J30J18l42k5k56K53k1L35k64l54M76L02n63j41J65P3K60
2922B32J30l99k56K63K97l62ok21K19p0L31K3k80k71J21J49K28P0n47p3M82L26
2944C86j08k52kk55L32J68n88M72k04p7M05j22m7L2j20j96L61n0k05N1l6M07p1
2967B81mm76LQ1M59k73j92J74R4O1QLl16l05M67R3k08K77m27J54K75j9m71J95
$$ y = [228, -104, 351, 99, -80, -116, -264, 49, -43, 19, -541, -138, 171, 381, 90, -407, -16, -13, 44, 163, -221, -242, -239, 203, 272, 102, -436, -312, -304, 281, 35, -100, -196, 123, 434, 379, 136, -147, -205, -49, 45, 46, -187, -302, -52, -110, 116, -191, 53, 42, 1, 25, -24, -332, -96, -65, 157, 446, 220, -145, 66, 143, 320, 174, -122, -243, -236, 200, 147, 248, -199, -150, -29, 289, 67, -299, -103, -41, 178, 281, -144, -102, -341, -15, 478, -240, 48, -249, -8, 64, 282, -118, -223, -314, 86, 216, 334, -8, -33, -289, -36, -57, 278, 14, -340, 136, 438, -125, -266, -101, -28, 232, 362, -37, -293, -30, 267, -95, -101, -322, -103, -173, 158, 181, -99, -370, -249, -100, 128, 198, -349, -422, 60, 386, 278, 26, 24, -231, 101, 269, -319, 153, -51, -128, 277, 155, 108, 140, 20, -176, 185, 135, -70, -19, -55, 352, 281, 277, -199, -196, -115, 344, 71, -121, 53, 147, 208, 216, 219, -97, -402, 65, 158, -50, 227, -200, -46, 229, 210, -261, -66]
2991f6j13q8N37k42lj09J86K53j63j69l19J76J0K08J21k16o9O5R3r6K08n45J6
3014c25R9K23J06k13p4L62k57K91l15J92j02Q9l7J74j60j83N9l31O02l91J54j74
3036b11K07O9M1j07P4n1J80j24k75L21l87K69J14p2j76K42j31j09M3M6Q5k11K45
3059H2J64Jm25j4J88j01o6K20j56j29K71R7K55k54n05K02K67J38l67L00k09QK25
3082A92j72K9p5k11K35J50n1k74j5K02J06j1j24k7P5j00M07k63N8k73J79K85l06
3105A6p3k07J67K05m3R1n55N8L41K68J08n06q7K56K09j37j19j11j26J75J7K48
3127A95l75N6K23J09R9m48k17J54J74K01K6k87j4K93j99K70l61l2RN1L09j17j6
3150A03n06M54o6M82m63j11j32L40j84j07k3Oq3O78l82k4m15K75K84q7n1N8j02
$$ y = [-66, -179, -267, 270, 28, 25, -84, 102, 355, 192, 23, -296, -120, -110, 98, 219, 3, -66, -1, 92, -4, 204, -341, -325, -226, -3, 103, -110, -184, 178, -79, 212, -103, 89, -13, 76, 39, 213, 53, -130, -71, -402, 200, -191, -37, -211, -4, 65, 106, -1, 73, 22, 202, 78, -197, 124, -263, 6, 120, 48, -128, 114, -17, -126, -83, -37, 48, -163, 82, 246, 247, -178, -192, -4, -105, -171, 49, -107, -236, 35, 132, 387, 133, -372, -170, 97, 235, -132, 168, -41, -33, 192, 20, 49, -26, -237, -2, 148, 97, -177, -192, 10, 116, 105, -19, -46, 29, -71, 336, 73, 131, -142, 37, 322, 16, -57, -264, -97, 108, 65, 156, -399, -341, 0, 268, 376, -130, -217, 39, 248, 111, -8, -119, -245, -70, -53, 195, -180, -124, 99, 208, 307, -141, -358, -204, -30, 171, 197, -90, -104, 189, -10, 260, -101, -133, -124, -73, 236, 119, 103, -403, 51, -15, 467, 4, -107, -239, 101, -83, -190, -213, -207, -290, 388, 6, -18, -433, -158, 126, 39, -12, 46, -56]
3173e6j5L8J31J5mj45K90j29N3k69N3qJ97Q4j21l21p6N10l24O8M90q27K70K69
3197A73j01j03j04j06L10k9K47l59o4K83k98K94l15J88k26K84O4N8j81k55j86
3218d26N47J6J8k48q2J88N33k88n09L11j61J4K42l47J43L8K10o4M7j78k57K49
3240dk3n2kJ42KOm4j16%J58K03j64J6o4k79M55m45L91p1L1m28M48k54kM9o0rJ71
3268E5J61k65m9%J23m5L44m55L6j47K39j8L07n04N1K42M4qj80L05l77L05k10J05
3292E9r4k00Q3J86j18%r8J72j06R2J66k98r4N35j48k39P9j01m0N7R3K78m14NK40
3317I5J26k02L2k34K62k15J23J70j51j63K89j64j10J76J73m82L14M97n50J00%
3338H6qj81j38N4L88j62j62j9K47l57J83J80O7k29P5k11m7M63L5k86m53M01J40
$$ y = [-56, -71, -33, 98, 113, 109, -36, 254, 125, 178, -91, -38, -46, 151, 235, 114, -207, -283, 227, -97, -29, 461, -366, -96, 173, 72, -31, -135, -241, 69, 40, 287, -72, -136, 147, -151, 143, -172, 16, -210, 74, 138, 196, 15, -240, -426, 121, 137, 155, -93, -175, 13, 546, 258, -251, 60, -101, -87, 155, -192, -49, -11, 199, 135, 182, 4, -253, -4, -27, -79, -81, 61, 63, 69, 25, -91, -91, 67, 270, 106, 122, 58, -221, 234, -211, 180, 109, 140, -288, 160, -94, -96, -47, -107, -116, 55, 216, -49, -98, -98, 25, -20, 324, -131, -95, -242, -3, -21, 286, -218, -167, 75, 119, 111, -69, 236, -141, 164, -46, 59, -35, -235, -152, 34, -84, -84, -182, -10, -116, -24, 142, -156, -250, 285, 137, -102, -23, -124, -164, -107, -14, 264, -150, -145, 95, 221, 19, 51, -183, 79, -136, -13, 157, 6, -157, 132, -32, -142, 34, 207, -275, 39, 536, -14, 86, 86, 78, -103, -241, -187, 201, 39, -123, -142, 105, -252, -69, 111, 178, -51, 24, -187, -234, 229, 264, -22, -475, -74, 66]
3361F6k56M76m42K07N2l8O5J09j91k18N3J14J43o1j51J60J35J32k32j14L6J94
3383B39l60r6L48j85N2j2K52l02J76k09q7R1Q4N5Jo7k10K48L9l28K06j42J78K09
3407A80O9n59Q2K34j49K58j26Oj6rK12o6M4q2j73K06l1l23K60j87N7K77k33R3
3431B4M4j53k87K87j4m6J46o3J61qq7j79J74L38k78m1l58M96J42N0l37nJ82K84
3455D72k77p3j52K53n68K95P9j73q5K4L55k8r6j59q6K22m3n7K30J93m59Q7J54
3478A08j22r7k5LK29O9k84J43J26j21K18k08j67k31K14K92k46L78p46K92R9L37
3500B61j29p0p3QJ17J62k14J43l40J7J38m14K78j91L75j83K43j91K05m8k63K56
3522H7l3L3n9p4k30J74O8Q8R0j86j03J48j05R3j55J88J69l39J52k41J85J20P8
$$ y = [66, -190, 286, -156, 51, 103, 65, 130, 239, 48, -170, -117, -3, 140, 79, -72, 88, 223, 355, 123, 9, 45, 239, -121, -217, 131, -54, -2, -14, 238, -64, 112, -97, -184, -93, -9, 46, 47, -20, -230, 18, 57, -271, -65, -207, -29, 180, 249, -310, -228, 6, -143, 115, -11, -5, -21, -30, 182, 116, 160, 78, -95, 111, 80, -243, 17, -170, -113, 164, -69, 24, 68, -85, -372, -85, -99, -145, 1, -62, 99, 91, 4, -175, -1, 337, 59, 18, -340, 156, 298, 348, 11, 6, 188, 472, 195, 122, -30, 223, -345, -50, 29, -144, -229, -205, 150, 122, 26, -133, -219, 3, -40, -97, 133, 326, -133, -46, 108, -14, -111, -136, -133, 96, 165, -119, 24, 150, 29, 247, 39, -128, -359, -145, 147, -99, 279, -467, -175, -76, 261, 132, 62, -11, -3, 114, 276, 62, 205, -135, -118, 20, -394, -116, -307, 68, -115, 128, -63, 142, 94, -169, 87, 54, 87, 28, -46, -276, -102, -34, 54, 144, -42, -145, 3, -102, -9, -164, 24, 193, -146, 6, -235, -50, 70, 148]
3545A48k20k12J24K75k48K46o9r9K08q1N7R3n22K22K4mk39q6J13O2K05nj1J53
3569A34j01J9q0k6J21j17J80j98J52k95N5L2K02jQJ64k80J8p3K09k83r9J97J35
3593G3J90n47K95r6M04j64k08L07l88M4N3pl57L77r6K17j00J51l34P4L11q9j84
3616g4J74n2K40k54K66k20k34k07K76L88k81j60j18N3K11J7j80R5J0K4J5j1N4
3639C2r1q7J47j7n1N9P5K13l8l94J68J24j27J8J52j61R2j2k01P7r8Q1kj34J70
3664eR3L7k18k4N9J01r5J40m46L60m8K25k76j42L25J22j28Q3j03m86M94k69L84
3687A83l2n2o1J7L7J51k74P7q6K24j93o9K65P8m04L45k56m8j18J67m2J49k51K59
3711F6J44j47L61n35P1J46Q4j12j61J56l6k11M28l59J75J11j07r0k58R1O3J80
$$ y = [148, -72, -284, -160, 115, -133, 113, 44, -55, 153, 72, 129, 222, -300, -78, -54, -58, -297, -383, -270, -208, -3, -8, -19, 134, 33, 52, -28, -54, 67, -50, 130, -68, 84, -211, -156, -124, 78, 77, 85, 249, -31, -13, -86, 123, -160, -259, -62, 73, 263, -284, 11, -85, 319, 155, -53, 254, -134, -90, -37, -44, -401, -24, -120, 97, -3, 148, -186, -112, 199, 110, -74, 100, 48, 288, 34, 300, 80, -154, -361, -85, 303, 22, -138, -256, -203, 8, 25, -155, -60, -50, -26, -11, -22, 32, -59, -146, 1, -16, -67, -8, 67, 280, 242, -152, 16, 140, 13, 31, 183, 22, 114, 102, -99, -22, -120, -39, -41, -175, -5, 88, 125, -93, -117, -58, 43, -52, 88, -358, 2, -46, 179, -97, -239, 86, 208, 80, 163, 60, -426, 68, -201, 183, 151, 99, 38, 55, 92, 243, -31, 46, -40, 184, -9, -78, 187, 265, -139, 206, -50, -98, -216, -49, -91, 58, -193, 66, 210, 63, 424, -111, -40, 106, 190, 78, -83, 73, 37, -174, 254, -105, 70, 181, 74, -16, -274, -183, -120, 60]
3733F0q5q5Rk7K08m2J20P4k03j36M8j72M5K55qJ2o1oj24pj04K25j44J93k0L08
3759C33l87J55j32j35K37k2R2k28J07K1k33K34N6j85J26K36l52J40k0j53l29L39
3781a00J46j63j74O75k32j51K44k08k55J92L49l09K03l83q4N21J04m81K95l20
3801a31j53L65k58L54m68K89Q3K07k52j6K31m24K05P5k24j07K98j23m1l1L06m5
3823A40l7J82n2j09j7j10j88L07n7m77K87J87K9j96K55k11j00J94n0J76k35J11
3845B9J16j74Qk04R1K25N7l38Q5J46M6n7l10J33J91K13k93m17M04j7k05M58l83
3868a96K71k85L64n6k04K2P3J46n88K27L03l5j10P2J48n7p7j22L74l02k96M87
3890A59j00Lk07K2J94p9m3O4r1J29K39k98L4j21R5k45K96k5k26P7J03K41o46K52
$$ y = [60, -25, -110, -101, -128, 80, 38, 158, 232, 29, -107, -59, -231, -186, 69, 61, 73, 12, 6, -118, -125, -229, -4, -148, 45, 25, 333, -54, 101, -31, -166, 71, 49, 141, -87, 20, 41, -192, 42, 98, -87, 39, 275, -77, 63, 43, -110, -439, -100, 46, -117, -291, 384, 152, 1, 245, 37, -218, -26, 323, 14, 217, -166, -250, 271, 375, -106, 189, -131, -284, 81, -177, 177, -291, -2, 81, 288, 36, 20, 251, -173, 32, 107, -117, -224, 74, -49, -90, -121, 185, 140, 103, 285, 233, 124, 107, -3, -191, 116, 59, -418, -131, 56, 85, -111, 144, -67, -167, 27, -23, 153, -82, 29, 145, -29, -21, -225, -134, 91, 148, -190, -105, 41, 87, 30, -280, -147, 44, 257, -36, -453, -49, -66, -271, 187, -196, 75, -210, 154, 98, -106, -84, -11, 135, -453, -226, 77, 42, -68, 4, 152, 95, 18, -104, 270, -32, -328, 159, 59, 62, -145, -123, 71, -8, -51, 13, -78, 51, 290, -8, 26, -95, 0, -245, 51, 26, -200, -123, -20, 221, -425, -173]
3914a73j26K14J80q1k59L79k61J96J58l40J56K3k03j65K55l14R4K54J12p6K6p3
3936b4K11k54J09o2o0M50l13j01N7n0nJ02l25L48P9J6m62J29m0J22M3J24j06k53
3960b65L85j82j24K90k92L10Q3p0l77J50l09L83O4j83k2K74j6l5j32j00K43k72
3982a97J13k6m4J70L39l84J69R7j84j45K3q4L08r5P4r3m2K11J03l07m16N01j68
4005g7Lj06K22m5j74K89j14k43k1K65k99L39R0j22n1p3L44j70P5j11j25J53l38
4028b89L89k83K53J20k97N2k81K27L4k00J99J24r5kpK56q8L0K12m47J07j24J32
4051B2m9Pk35J81O2O9j81K39k48l4J83j0j90N9k02L80k41m4L23j19m4K32N3l75
4075a62J85o1j9Q8P8k68K48j13L36o91K77J1j45N7Q7K05j80j04J78K71j14k00
$$ y = [-173, -299, -85, 95, 14, -245, 134, -127, 69, 227, -113, 43, 66, -137, -302, -47, -361, -267, -13, 99, 23, 49, -24, 187, -67, 42, -20, -80, 370, 57, -44, 13, -37, -42, 60, -265, 83, 162, 178, -284, -155, -195, -73, -30, 94, -12, -265, 120, -62, -186, 104, -188, 122, 205, 135, -242, -92, -401, -18, 46, -137, -159, 115, 99, 64, -68, -168, 75, -197, -84, -110, -154, 16, 355, -29, 140, 237, 53, -92, -69, -153, 155, 60, 134, 41, -1, 210, 313, 6, -410, 91, -77, -74, -180, 42, -3, -177, 112, -2, -245, -266, -1, -300, 39, 129, 7, -44, -117, 227, 57, 132, 21, -104, 49, -289, 100, -183, 70, 190, -107, -55, -336, -109, -75, -275, -76, 48, -47, -49, -56, 200, 112, 142, 354, -93, 14, -110, 22, -27, -20, -255, -74, -12, 57, -124, 115, -133, -167, 16, 6, -184, -125, -327, 53, -188, -232, 91, -28, -72, 160, 213, -162, 23, -38, -57, 31, 109, -159, 89, -24, 312, -379, -102, -91, -236, -179, -92, 113, -67, -171, 7, 278, 164, -36]
4097c6o1J31j34J81J18l43K66P6j29r0j28L68k26K11l93J90K36k74j25J29Qj04
4119a29L6R0r6L70j12j44K75k87j41K06l6p4R4L62n13j0m6M36l74R3J52j94m3
4142h5O5%L8j45J3J72m5k58j6J49K3J39j66K77j43j4p0k53K49R7q9p1O9m4p9K06
4168A9J79k42J11k36L83j77m3j72M12l23K37L8k12Q0l5K32l03j63K79l9J14j40
4190aJ1L5j1M9p1K55k72Q3q2Q8j24l7K16j48QO5n0j38K11q1J42l78M86l15K43
4215A84k4k31J50J35k29k27J35L06k76J21K21m66M06r0P7l54L13j78l1P4o2J20
4237G4p0J37j55J8J2k59K75k85M20P8k74Q1K4k32K14p2k23J94J11j57O0J27l86
4260b88R9K64J6j28j46L04p0j9n4J77N8M8m93K90N9k19J16L54m59K77k63Q5J34
$$ y = [-36, -97, 34, -100, 81, 199, -144, 122, 198, 69, -21, -149, 219, -7, 204, -189, 1, 237, -37, -162, -33, -25, -129, -93, -3, -99, 271, 159, 15, 290, 3, -138, 68, 32, -42, 52, 414, -99, -109, -155, 281, -93, 0, 152, -42, -85, -20, -20, 18, -127, -114, 58, 13, -245, -261, -112, -89, 50, -116, 161, 18, 4, -66, -319, -70, 27, -62, -133, -64, -108, -187, 19, 198, -44, 67, -169, 214, 37, -6, -178, 234, -89, 148, 186, -26, 54, 19, 251, -52, -215, 64, 25, 139, -1, 10, 45, 34, 83, 12, 267, -5, 78, -4, 84, -40, -77, 139, -9, -1, 64, 14, -124, 87, 6, 148, -230, 256, -59, 184, 160, -71, 79, 214, -15, -242, -107, 199, -77, 44, 265, -201, 205, 115, 192, -162, 151, -27, -58, 16, -46, 74, 4, 141, -14, 4, 16, -243, 32, -253, 167, 245, -29, 52, 76, -156, 58, -14, -237, -43, 68, -89, -29, 98, -288, -189, 75, 91, -37, -183, 121, 51, 32, -22, 155, 213, 261, -232, 58, 117, -102, 14, 368, -91, 186, -77, 8, 142]
4283A42k89K53k75J71J26j54O4J2n61N76j20N1p5M8N9L28o08mL72q9O4j42j41
4306a92R1O6J81j03n3j14J29O3L05m78J78L1k97K33j0l25M88m85R1j18K24J7l64
4329d42N33n5j33k5N09l71jP8n1L9q3l5K08j46j26J34J97m80m3L87l15K92K2j84
4353i1J59L9j71M7J28l45N37j94N6j21K83k0k23j19L67l17p7j44j84L97K06l32
4375a19m6J04Q8q7j8P8J69J47o91O08m95O57o19J14N1o9m7K14j02J92J1m7J02
4398A95l16J96l34M91j34k58l9L29L4k06j33M7O4j42L19p9P9k36K09j87J87j27
4420d1L50l73J58l33L72j78J66Mj90J81%l60L23r6K07p7j72j7j84P00k07j44k08
4443a19K89l54L16J4j95o2J14j9O5O0j45J12q0k67J72R6K67k44j62K42k11M05
$$ y = [142, -147, 106, -169, 2, 128, -26, 38, 50, -511, 65, -55, -4, -79, -31, 28, 356, -252, -256, 116, 27, 91, -51, -192, -101, -35, 146, 43, -10, -124, 5, 68, 373, -105, 73, 104, -193, 40, 30, -295, 193, -292, -201, -319, -95, -78, -442, 91, 36, -97, -122, 387, 16, 15, 93, 42, 81, -2, -37, 171, 25, -101, 33, 230, -250, -293, 94, -221, 71, 93, -91, 68, 107, -64, -17, 111, -234, 303, 109, 165, 44, 327, 307, 84, -35, 332, 15, -62, -206, -390, 7, 213, -119, -165, -61, 27, -60, -78, 0, 169, 316, -375, 233, -262, 395, -224, -110, -59, -128, -175, 39, -63, 129, 140, 93, 195, -121, 75, -259, 232, 98, -160, -199, 130, 164, -42, -175, -128, -64, -206, 113, 34, 113, -123, 86, -101, 86, -41, 309, -64, 94, -239, 133, -45, 121, 125, -65, 116, 116, -244, 79, -17, 190, 113, -59, -76, -260, 440, 233, 89, -119, 170, -184, 132, 146, -49, -111, 3, -16, 49, 109, -36, 76, -4, -271, -99, -3, 264, 20, -142, 100, -111, 294]
4465B94j58l1j92j34J69j47K64j8O1k31j46K75k85L27o9o5MR0j78K70rj63k26
4488b98M77k34J07Q3j19o7j06k12L75Qj41J59J78j47l84K58j12K24p5m0J17l62
4510c11J73K31k25M2J0J93M0k91j07K51j48r5K47k9k6J23j0P7n9j08M5j41k7J42
4534cj79l7J55j87n0K66M4J40m7n4n4j06o4L34k85M67k63j91K08r4J49q2q6l1
4558e0J27l6j88J24j2J63l33K81J21O6j68j33RJ35R2j22j00M1o4l4J29l4K6l15
4582b75K45J16o0J95j55N4j05L9M1K51n99J2K64j90J8K00k09k56M39k0Jk4r7K98
4606A83l4k01k5O9J97l53k0J01p6J08K66j51l5l0K18k87p5K77m77K52M29l42J21
4629A15M8j67K90k10j17L3L2Kj26K92j22O6Q6k62m8J43J48k23j1K94l56r1M6R2
$$ y = [294, 136, 105, -87, -221, -52, -199, 65, 47, 108, -123, -269, 6, -279, 48, -21, -86, -82, 8, -170, 100, 91, -72, -298, 179, -55, 52, 135, 16, -51, -157, -369, 6, 14, -127, 32, 210, 63, -321, -63, -175, 49, -26, -66, 51, -311, -138, 93, -132, -90, -80, 113, 153, -138, -245, 6, -142, -237, 10, -19, -45, 78, 68, 145, 86, -22, 23, -118, -145, -3, -182, -219, -64, -251, -301, -35, 9, 149, 102, 48, -6, -112, -176, 158, -127, 340, 77, -114, 94, 0, 149, 67, -19, -50, 77, 41, -147, -23, -35, 128, -205, 76, 197, 263, 95, -38, -29, 106, 198, 76, -24, 17, -47, -81, 48, 14, 40, -275, -30, 86, 26, 221, 66, 120, 15, 54, 95, 346, -253, -241, 23, -167, -149, 51, -158, -414, 25, 5, 6, -18, -115, 183, 149, -52, -77, -8, 189, -164, -184, -83, -159, -51, 215, 64, 29, -1, 217, -70, -145, 132, -345, -93, 336, -6, 115, 163, -4, 286, 76, -41, -8, 24, 26, -100, 192, 70, 136, 222, -40, -88, 55, 203, -20, -31, 263, -93, -184, -138, -46]
4653d6K84m57K42Q1m7nQ4k65J86j1j91K91m8P0J4m45K85l40L24j71K40j19O9j43
4677a18l7K49P7j01r8K04j88k46L50l82K67n6N54k91k60O9Q1K09k50Pj03K27l12
4700a48L3R0K05j10k04K81R2l74K28k18j24K68M35m31j51L3J71k5J81k82J8N3
4722B1J6O0j68j01J78O5p1O6k81K38j32P4R5r9J22R8l6m0k54K37j84j4k11L80
4746E9j18K6j6J04j3q3J88n1K8k78Q8J17k34K48j6l20J87rL50m41M14k11n29L39
4770a71J85j15j33J41M71k85l2l34K06j68M51k96P5K11k07J08j91j0k84K23l4
4791a89j72J9K70J9R5n2J24j70l5j29M83j44j29r5j11L35j40j33R8MK75k91o7
4814a35O2mL64l99o3m2K14J80N3k75%M56o61R8K21O5j79p3K35P2m14K36J12j33
$$ y = [-46, 238, -219, 23, 104, 57, 52, 136, -129, 57, 46, -145, 146, 98, 168, 182, -263, 22, -318, 6, -165, 75, -44, 25, -118, -155, 94, 171, 70, -28, 176, -12, -258, 92, -290, -23, -79, 475, 184, -76, -7, 74, 283, 33, 40, -63, 164, -148, -115, -25, 180, 70, -134, 147, 239, -135, 93, -125, -249, 19, 454, 23, -128, -95, 76, 51, 232, -50, -32, 21, 37, 97, -71, -172, 6, 71, 0, 66, -215, 23, -109, -35, 60, -39, 83, 181, 145, 105, -149, 88, -96, -110, -321, 59, -59, -33, -49, 55, 42, -41, 147, 96, 124, -154, -66, 51, -183, 65, 49, -271, -84, -93, 257, -184, 230, 19, -510, -171, 14, -101, -234, -93, 378, 93, 61, -273, -67, -235, 216, -80, -5, 206, -1, 107, -84, -94, -378, -155, -189, -361, -342, -72, -53, 42, -10, 114, -56, -91, -220, 263, 119, -10, -105, -216, 119, -21, -154, -56, -52, 223, -68, -135, -73, -77, 287, -112, -175, -217, -3, 177, 230, -45, -45, 411, -250, -152, 69, 134, -45, -118, 117, 189, -225, 11, 123, -10]
4838a0P8M8k44o3J90k08K40j88K63l01J88O9K41m90J20oK86n3l19o6L47R6l68
4861a50J82j49L09j69l3N9m09L62oj30L25J06j31k29J43j25r9K07N4j89j2l6L29
4884B09l61K43j4K7k46K17J49k65J17k68J24L1k43M81J02m14L90m26O4k80L60
4905cK81o76M52k0j51M5o3L91k87j27O2K85k78M5L92l42K92j51j43m44M21o0J10
4928C1M5L0j56j60N3K86j21K03k95J00k64M30K7k19K77q1l64P2J64j87K15j12
4950b6J3l19M84Q1l49N3O4L1N1q6p6M7J56k10L27k73K64k39q5O4K92l06j39K94
4974A13k16k26J83L83m25J34L80l03R8k08K68j27M38m50M0q9L39k67k46J92k74
4995b63K60j55K15J36j40l5J47o6k01J23Q6N1l37q8K16k12M14o1q2J33k02n1M4
$$ y = [-10, 68, 116, -128, -191, -1, -209, 31, -157, 106, -195, -7, 62, 303, -187, -67, -73, 213, 160, -159, -225, 122, 218, -150, 32, -117, 192, 23, -10, 49, -360, 2, -4, -134, 191, 297, 166, -63, 80, -45, -144, 63, 117, -72, -84, -120, 209, -152, 91, 77, 104, -142, 75, 224, -41, 76, -192, -68, -37, -280, 201, 303, -111, 279, -147, -83, -363, -3, 278, -398, 54, 34, -117, -72, -135, 256, -31, -158, -96, 189, -89, -44, 348, 6, 298, 147, 4, -440, -19, -79, 31, 76, 106, -50, -210, -157, 129, 8, 211, -84, 16, -248, 182, 209, -10, 267, 186, -178, -106, 58, -129, 86, -26, -13, -332, 152, 233, -116, -63, 1, 32, 83, -3, -79, -32, 124, -86, 241, -32, 232, -7, -92, -28, 264, -42, -181, 113, -103, -329, -146, 237, -188, -54, 326, 23, 121, -87, 181, 54, 492, 42, 82, -7, 332, 65, -181, 11, -263, -3, -158, 57, 193, 53, 18, 165, 99, -102, 21, 107, 158, -179, -267, -51, -263, 151, 90, 8, 141, -61, -112, -68]
5018f8j53J31P0N9k87K21J81R1j62n8J96j78j39L31k96J91k09K90k60K57k53j33
5040a78j19M40p1j70R9k1Q0j56K93m8k24p3J22j63K23J42q5L24l03O2k01n8n8
5063a43N2K2J65J4j41J38Nr8Qj17J62k34R1j55P8M09j78k72J93R1k1j06l9j8j66
5088b60J05J52l2K04j63r7O2k8J45K9j53j09J41J55J84l58p9K03K34l96K08k61
5110a14K91p0k48J7J61k67J88M2K1j15k71N61n04J78K92l9j59J61j43m3J4j00
5132a47K82l03L89j08n1J29j89K45j9j91j25J88j51L50k02j74Kj87K94L8r5j18
5154a43R0L9M5R6nl54K86j26J11j46l6K83k36J53K56j61k11K70k01j01R8m6J38
5177I9J19n6k84j10J17n0K31N2q6m9J29j96p4m7J74k1O0n5j17K41Q2j30J14l61
$$ y = [-68, -221, -90, -20, 39, -248, -27, 154, 245, 83, 25, 221, 43, -96, 235, -61, 130, -79, 211, -49, 208, -45, -178, -297, 143, 72, -98, 1, -20, 60, -96, 197, 149, -75, -148, -26, -189, 34, 176, 91, 415, 112, 174, -27, -85, -143, -91, -69, 96, 110, -31, 107, 112, 14, 22, -95, 67, -167, -76, -231, -153, 256, 78, -194, -1, 90, 69, -37, -76, -94, -260, -155, -3, -35, 169, 6, -91, -29, -57, 88, 117, -36, -145, -4, 151, 335, -23, -102, 101, 335, -61, 147, -114, 177, 107, -141, -124, 37, -230, -42, 0, 21, -94, -365, 196, -308, -130, 162, 123, -36, 125, -18, -61, -47, -147, 135, -168, 221, 113, 62, 191, 2, 247, 228, 37, -88, 100, -51, 299, 97, -77, -75, -262, 32, 70, -25, -143, -53, -14, 31, 127, 122, -232, 54, -72, 39, -107, -143, 140, -96, 57, 313, 152, -59, 211, 10, -91, 7, -39, 99, 218, 162, -122, -232, -115, -165, 66, 118, 32, -17, 112, -84, -158, -205, -31, -52, 8, -47, -164, 77, 159, 29, 143, -218]
5201b18K63l51K20K00j44J36l7lj1r4m3qR4P5J03j36J15k17J08j23k68M55K91
5224D07m25p5m1L32l04J05k05M9K10k16L6o4K10j82L30j54J86k89K05j2j21N7
5246C9j40L5n9p1J46K1J65k82L89k61J17N1m6Q8Q8j07j51k18K73k72N0N19m62
5269h8K23O3l02K07m0j14P2j05j16Q1l1K29K69k64j55o6KJ29p3M0K3J8P7k52J44
5294b9P1j27rK93j78l77M75O7l68J27j00K04l1k5j2J2n7J40J87j72RK2j37L62
5318C47l47J86l78K77l53J52J64k1K07p5m7k86K57j76k08K68j55K62j02r7L00
5339A75k14K67k63R3j23k66N19l46J41M8j7Q6l5N5j75k24K81K10l31K84l06J39
5361bk44J83j9M4Q8j85J27Nk32M42m16J30K44ql69M06k92K02k01N5J72k07J42
$$ y = [-218, 45, -306, -86, 114, -30, 106, 69, 66, 55, -39, -82, -90, 4, 79, 182, 46, 161, -56, 52, -71, -339, 116, 407, -18, -93, -134, 198, -106, -1, -206, -157, 53, -163, -127, -191, 19, -163, 167, 13, 199, -90, 115, 103, -18, 39, -101, -66, -125, -196, -50, -29, 136, -146, 243, -18, 99, 150, 104, 192, 280, 173, 22, -196, 77, -195, -145, 374, -88, 135, 198, -104, 103, 63, -51, 21, -84, -200, -119, -150, 79, 348, 84, -71, -137, -135, -6, -79, -39, -16, 2, 79, -173, -29, 42, -85, -94, 199, 21, -356, 119, 186, -182, -55, -155, 49, 18, -7, -19, -7, -64, 76, 263, 91, 100, 122, -15, 347, 0, 186, -192, 85, -268, -116, 48, 27, 234, 159, 112, -174, 83, -93, -301, -33, -188, 74, -28, -125, 175, -39, 228, -35, 58, -65, -331, 188, -158, -17, 31, 14, 100, 65, 120, -55, -279, 2, 212, -119, 165, -141, -2, -246, -63, -82, -38, 50, -135, -8, -3, -235, 207, -209, -79, 165, 157, -212, 194, -98, 104, -97, -42, 130, -77, 65]
5384F5K94q3m67j33M02K00k51m8J07O4q0q5L5j15j5J80n9J35j79L9j36K03j25
$$ y = [65, 359, 276, -191, -324, 78, 278, 27, -21, 86, 150, 70, -15, 20, -95, -110, 70, 11, 146, -33, 6, -130, 73, -52]
$$ [...]
8191G0
##END NTUPLES=NMR FID
##END=
