##TITLE=1H_LR-641-C1-IPSK
 CDCl3, 8 sc, 
 26.3.2020
##JCAMPDX= 6.0         $$ Bruker NMR JCAMP-DX V2.0
##DATA TYPE= NMR FID
##DATA CLASS= NTUPLES
##ORIGIN= UXNMR, Bruker Analytische Messtechnik GmbH
##OWNER= root
$$ XWIN-NMR		Version 3.5
$$ Thu Mar 26 13:41:14 2020 Russian Standard Time (UT+4h)  she@DPX200
##.OBSERVE FREQUENCY= 200.1315
##.OBSERVE NUCLEUS= ^1H
##.DELAY= (6, 6)
##.ACQUISITION MODE= SIMULTANEOUS
##.ACQUISITION SCHEME= undefined
##.AVERAGES= 8
##.DIGITISER RES= 18
##SPECTROMETER/DATA SYSTEM= spect
##.PULSE SEQUENCE= zg30
##.SOLVENT NAME= CDCl3
##.SHIFT REFERENCE= (INTERNAL, CDCl3, 0, 15.7039)
##AUDIT TRAIL= $$ (NUMBER, WHEN, WHO, WHERE, WHAT)
$$ ##TITLE= Audit trail, XWIN-NMR		Version 3.5
$$ ##JCAMPDX= 5.01
$$ ##ORIGIN= Bruker BioSpin GmbH
$$ ##OWNER= she
$$ F:/spectra/data/she/nmr/H-F/1/audita.txt
$$ ##AUDIT TRAIL=  $$ (NUMBER, WHEN, WHO, WHERE, WHAT)
(   1,<2020-03-26 13:40:19.21 +0400>,<she>,<DPX200>,
      <created by zg, POWCHK disabled, PULCHK disabled
       configuration hash MD5:
       00 E9 B6 7A A2 85 ED C7 34 08 36 98 17 FE 4E 26
       data hash MD5: 16K
       71 B7 D6 7D 1F 43 D7 35 66 F3 B9 B2 E7 77 21 CE>)
$$ ##END=
$$ 
$$ hash MD5
$$ 35 26 9C 50 A4 61 DE 12 86 8F 09 14 0F 34 CA BC
##$RELAX= 
##$RELAX= 
##$RELAX= 
##$RELAX= 
##$RELAX= 
##$RELAX= 
$$ Bruker specific parameters
$$ --------------------------
##$DU= <F:/spectra>
##$EXPNO= 1
##$NAME= <H-F>
##$PROCNO= 1
##$TYPE= <nmr>
##$USER= <she>
##$AMP= (0..31)
100 100 100 100 100 100 100 100 100 100 100 100 100 100 100 100 100 100 
100 100 100 100 100 100 100 100 100 100 100 100 100 100 
##$AQSEQ= 0
##$AQ_mod= 1
##$AUNM= <au_zg>
##$AUTOPOS= <>
##$BF1= 200.13
##$BF2= 200.13
##$BF3= 200.13
##$BF4= 200.13
##$BF5= 200.13
##$BF6= 200.13
##$BF7= 200.13
##$BF8= 200.13
##$BYTORDA= 1
##$CFDGTYP= 0
##$CFRGTYP= 5
##$CHEMSTR= <none>
##$CNST= (0..31)
1 1 145 1 1 1 1 1 1 1 1 1 1 1 1 1 1 1 1 1 1 1 1 1 1 1 1 1 1 1 1 1 
##$CPDPRG= <>
##$CPDPRG1= <>
##$CPDPRG2= <>
##$CPDPRG3= <>
##$CPDPRG4= <mlev>
##$CPDPRG5= <mlev>
##$CPDPRG6= <mlev>
##$CPDPRG7= <mlev>
##$CPDPRG8= <mlev>
##$CPDPRGB= <>
##$CPDPRGT= <>
##$D= (0..31)
0 1.2 0 0 0 0 0 0 0 0.06 0 0.03 0 0 0 0 0.0002 0 0 0 0 0 0 0 0 0 0 0 0 
0 0 0 
##$DATE= 1585215618
##$DBL= (0..7)
120 120 120 120 120 120 120 120 
##$DBP= (0..7)
150 150 150 150 150 150 150 150 
##$DBP07= 0
##$DBPNAM0= <>
##$DBPNAM1= <>
##$DBPNAM2= <>
##$DBPNAM3= <>
##$DBPNAM4= <>
##$DBPNAM5= <>
##$DBPNAM6= <>
##$DBPNAM7= <>
##$DBPOAL= (0..7)
0.5 0.5 0.5 0.5 0.5 0.5 0.5 0.5 
##$DBPOFFS= (0..7)
0 0 0 0 0 0 0 0 
##$DE= 6
##$DECBNUC= <off>
##$DECIM= 24
##$DECNUC= <off>
##$DECSTAT= 4
##$DIGMOD= 1
##$DIGTYP= 9
##$DL= (0..7)
0 120 120 120 120 120 120 120 
##$DP= (0..7)
150 150 150 150 150 150 150 150 
##$DP07= 0
##$DPNAME0= <>
##$DPNAME1= <>
##$DPNAME2= <>
##$DPNAME3= <>
##$DPNAME4= <>
##$DPNAME5= <>
##$DPNAME6= <>
##$DPNAME7= <>
##$DPOAL= (0..7)
0.5 0.5 0.5 0.5 0.5 0.5 0.5 0.5 
##$DPOFFS= (0..7)
0 0 0 0 0 0 0 0 
##$DQDMODE= 0
##$DR= 18
##$DS= 0
##$DSLIST= <SSSSSSSSSSSSSSS>
$$ [...]
##$SUBNAM2= <"">
##$SUBNAM3= <"">
##$SUBNAM4= <"">
##$SUBNAM5= <"">
##$SUBNAM6= <"">
##$SUBNAM7= <"">
##$SUBNAM8= <"">
##$SUBNAM9= <"">
##$SW= 24.9337058887773
##$SWIBOX= (0..15)
0 0 2 0 0 0 0 0 0 0 0 0 0 0 0 0 
##$SW_h= 4990.01996007984
##$TD= 16384
##$TD0= 1
##$TE= 0
##$TE2= 300
##$TE3= 300
##$TEG= 300
##$TL= (0..7)
0 120 120 120 120 120 120 120 
##$TP= (0..7)
150 150 150 150 150 150 150 150 
##$TP07= 0
##$TPNAME0= <>
##$TPNAME1= <>
##$TPNAME2= <>
##$TPNAME3= <>
##$TPNAME4= <>
##$TPNAME5= <>
##$TPNAME6= <>
##$TPNAME7= <>
##$TPOAL= (0..7)
0.5 0.5 0.5 0.5 0.5 0.5 0.5 0.5 
##$TPOFFS= (0..7)
0 0 0 0 0 0 0 0 
##$TUNHIN= 0
##$TUNHOUT= 0
##$TUNXOUT= 0
##$USERA1= <user>
##$USERA2= <user>
##$USERA3= <user>
##$USERA4= <user>
##$USERA5= <user>
##$V9= 5
##$VALIST= <valist>
##$VCLIST= <CCCCCCCCCCCCCCC>
##$VD= 0
##$VDLIST= <DDDDDDDDDDDDDDD>
##$VPLIST= <PPPPPPPPPPPPPPP>
##$VTLIST= <TTTTTTTTTTTTTTT>
##$WBST= 1024
##$WBSW= 4
##$XGAIN= (0..3)
0 0 0 0 
##$XL= 0
##$YL= 0
##$YMAX_a= 73922
##$YMIN_a= -38337
##$ZGOPTNS= <>
##$ZL1= 120
##$ZL2= 120
##$ZL3= 120
##$ZL4= 120
##$ABSF1= 10
##$ABSF2= 0
##$ABSG= 5
##$ABSL= 3
##$ALPHA= 0
##$AQORDER= 0
##$ASSFAC= 0
##$ASSFACI= 0
##$ASSFACX= 0
##$ASSWID= 0
##$AUNMP= <proc_1d>
##$AZFE= 0.1
##$AZFW= 0.1
##$BCFW= 1
##$BC_mod= 2
##$BYTORDP= 1
##$COROFFS= 0
##$CY= 11.3945322036743
##$DATMOD= 1
##$DC= 2
##$DFILT= <>
##$DTYPP= 0
##$F1P= 16.9975609425685
##$F2P= -3.02152046262296
##$FCOR= 0.5
##$FTSIZE= 0
##$FT_mod= 4
##$GAMMA= 1
##$GB= 0.15
##$INTBC= 1
##$INTSCL= 1
##$ISEN= 128
##$LB= 0.24
##$LEV0= 0
##$LPBIN= 0
##$MAXI= 10000
##$MC2= 0
##$MEAN= 0
##$ME_mod= 0
##$MI= 1.114404
##$NCOEF= 0
##$NC_proc= 0
##$NLEV= 6
##$NOISF1= 3.799351
##$NOISF2= 2.8
##$NSP= 1
##$NTH_PI= 0
##$NZP= 0
##$OFFSET= 15.70392
##$PC= 1
##$PHC0= -9779.388
##$PHC1= 6.00082
##$PH_mod= 1
##$PKNL= yes
##$PPARMOD= 0
##$PSCAL= 0
##$PSIGN= 0
##$REVERSE= no
##$SF= 200.130013532006
##$SI= 16384
##$SIGF1= 3
##$SIGF2= 2
##$SINO= 400
##$SIOLD= 16384
##$SREGLST= <1H.CDCl3>
##$SSB= 0
##$STSI= 0
##$STSR= 0
##$SW_p= 3612.71676300578
##$SYMM= 0
##$S_DEV= 0
##$TDeff= 0
##$TDoff= 0
##$TI= <>
##$TILT= no
##$TM1= 0
##$TM2= 0
##$TOPLEV= 0
##$USERP1= <user>
##$USERP2= <user>
##$USERP3= <user>
##$USERP4= <user>
##$USERP5= <user>
##$WDW= 1
##$XDIM= 8192
##$YMAX_p= 0
##$YMIN_p= 0
$$ End of Bruker specific parameters
$$ ---------------------------------
##NTUPLES= NMR FID
##VAR_NAME=  TIME,          FID/REAL,        FID/IMAG
##SYMBOL=    X,             R,               I
##VAR_TYPE=  INDEPENDENT,   DEPENDENT,       DEPENDENT
##VAR_FORM=  AFFN,          ASDF,            ASDF
##VAR_DIM=   8192,          8192,            8192
##UNITS=     SECONDS,       ARBITRARY UNITS, ARBITRARY UNITS
##FACTOR=    0.0002004,     1,               1
##FIRST=     0,             0,               0
##LAST=      1.6414764,     0,               0
##MIN=       0,             -38337,          0
##MAX=       1.6414764,     73922,           0
$$ Real data points
##PAGE= N=1
##DATA TABLE= (X++(R..R)), XYDATA
0@%%%%%%%%%%%%oJ3j5J6j6J6k1K8l1L7m4N0n8O7p7Q5r6J11j26J42j58J76j97K20
$$ 0 0 0 0 0 0 0 0 0 0 0 0 0 -6 7 -8 8 -8 8 -13 15 -16 21 -23 27 -31 36 -41 44 -52 59 -67 75 -83 93 -104 116
36A16k45K72l02L34l71M14m59N08n61O20o89P66q53R54j073J215j384J593j864
$$ 116 -129 143 -159 175 -196 218 -241 267 -294 326 -363 403 -450 504 -569 646 -738 855 -1009
55a009K225k730L499m827P780k9235J7719K3278l2797L392K5238m07l9733j0730
$$ -1009 1216 -1514 1985 -2842 4938 -24297 -6578 16700 -16097 -12705 12533 12126 -27607 -38337
69c8337J7881P437j2547P643K1459Q343p116o31p54j0387p317M782K426k577P456
$$ -38337 -20456 -13019 -25566 -17923 3536 11879 4763 4132 3378 -7009 -14326 -9544 -7118 -9695 -2239
84b239J3793j30o509K922M129j0896p024R309N866p967P24J8280K950j7164m204
$$ -2239 11554 11424 4915 7837 11966 1070 -5954 3355 9221 1254 1978 20258 23208 6044 1840
99A840J6237J311k2138m0K4164P098j8942j853J9827L599k2468q760J5134N891
$$ 1840 18077 19388 -2750 -2790 21374 28472 9530 7677 27504 31103 8635 -125 15009 20900
113B0900r857j380J5229P333o023m360j373m851m339M00p87K24J0493J0702l673
$$ 20900 11043 9663 24892 32225 26202 21842 20469 15618 11279 11679 10892 11116 21609 32311 28638
128B8638p833N995L134j5239j4926Q955J2960o548m784J4692J3294j1293j4313
$$ 28638 20805 26800 29934 14695 -231 8724 21684 15136 10352 25044 38338 27045 12732
141A2732O158N793j6065q953J2951J2101q633k788J4368L647j6641q465J0244
$$ 12732 18890 24683 8618 -335 12616 24717 16084 13296 27664 31311 14670 6205 16449
154A6449K438j3495k413J3394P062q132l401O140Q01r695l337J252J050K433L155
$$ 16449 18887 5392 2979 16373 23435 15303 11902 18042 18843 9148 5811 7063 8113 10546 13701
169A3701j295k372M060L109r150r352N410R311o171q557R129J2781p082j3590
$$ 13701 12406 10034 14094 17203 8053 -1299 4111 13422 7251 -1306 7823 20604 13522 -68
183f8L444Q132p414j2039O726J1072k568n902O544N421q301q658L623J399p522
$$ -68 3376 11508 4094 -7945 -1219 9853 7285 1383 7927 13348 5047 -3611 12 1411 -6111
198f111j055R534N034n309o56N393j799r493l146K829J34j854L220M083m00P00
$$ -6111 -7166 2368 7402 2093 1437 6830 5031 -4462 -7608 -4779 -4645 -6499 -3279 804 404 1104
214A104J740m243p599J035N459m088o946O546J2336m632j1539M220J0097o698
$$ 1104 2844 -1399 -8998 -7963 -2504 -6592 -13538 -6992 5344 712 -10827 -6607 3490 -3208
228c208j3807K790J2678j151j0203L037J1133k321j0719k48O394k541n558L687
$$ -3208 -17015 -14225 -1547 -2698 -12901 -9864 1269 -1052 -11771 -12019 -5625 -8166 -13724 -10037
242a0037M263n23k041K385n04m589k154K349K145l814N78M838L23j647m71J254
$$ -10037 -5774 -6297 -8338 -5953 -6457 -11046 -13200 -10851 -8706 -12520 -11942 -7104 -6781 -8428 -8899 -7645
258g645m130j691K174m32j602K391O552j694n055N79O110n338q845K864Q867l46
$$ -7645 -11775 -13466 -11292 -11724 -13326 -10935 -4383 -6077 -11132 -10553 -4443 -9781 -18626 -15762 -6895 -7241
274g241q230L591J0442r62j0447j571P025o15o530m48P076K620k163p43J464n45
$$ -7241 -15471 -11880 -1438 -2400 -12847 -14418 -7393 -8008 -14538 -14986 -7910 -5290 -7453 -8196 -6732 -7277
290g277o76j243j350j99K271L401r95j583K703K234l459l320K134L020l327Q0
$$ -7277 -7953 -9196 -10546 -10745 -8474 -5073 -6068 -7651 -4948 -2714 -6173 -9493 -7359 -4339 -7666 -7586
306g586M443K525l524j161M458n83o153L01P087m0n645K025P816J08p973j132
$$ -7586 -3143 -618 -4142 -5303 -845 -1428 -7581 -7280 -193 -233 -5878 -3853 3963 4071 -3902 -5034
322e034O860J185o896j366P543M318m344k934L516L114l201l846N09L281K021
$$ -5034 1826 3011 -3885 -5251 2292 6610 2266 -668 2848 5962 2761 -1085 -576 2705 4726
337D726r20j243K302L418j191m233j188L650J613l604j039N093K985k901k972
$$ 4726 3806 2563 4865 8283 7092 2859 1671 5321 6934 3330 2291 7384 10369 7468 4496
352D496L049J633l622k337K887K334k387k56M172J061l969j157K937M02m264q08
$$ 4496 7545 9178 5556 3219 6106 8440 6053 5797 9969 11030 7061 5904 8841 9243 4979 4171
368D171M640K417l524j529K812K309l298l713R66L488M08k891n19L357K155k641
$$ 4171 8811 11228 7704 6175 8987 11296 7998 4285 5251 8739 9147 6256 5737 9094 11249 8608
384H608m453N51L511m10m053l95N124K353m313l335L012K593l964m383K654M409
$$ 8608 4155 4706 8217 7807 3754 3359 8483 10836 6523 3188 6200 8793 4829 446 3100 7509
400G509j054l128J083L198j097l989r58K116m21j868N17K552K56j520k56J190
$$ 7509 6455 3327 4410 7608 6511 2522 1564 3680 3259 1391 1908 4460 4716 3196 2940 4130
416D130j595l002j76K154M40k079K0L158P48k479l350J936K848l165l905J582
$$ 4130 2535 -467 -643 1511 1951 -128 -108 3050 3798 1319 -2031 -95 2753 -412 -4317 -2735
432b735M842R99m719r93L717Q47m317l975L884K897p60l982J271M361n21m527
$$ -2735 2107 3106 -1613 -2606 1111 1958 -2359 -6334 -2450 447 -313 -4295 -3024 1337 816 -3711
448c711k246L383J152k118j885K682L635k323k088m6J876j054k267m6K565J061
$$ -3711 -5957 -2574 -1422 -3540 -5425 -2743 892 -1431 -3519 -3565 -1689 -2743 -5010 -5056 -2491 -1430
464a430j592O26J622j151j974N24O41j694r94J741L092p66k138P09K036r38l417
$$ -1430 -3022 -2396 -774 -1925 -3899 -3375 -2734 -4428 -5422 -3681 -589 -1355 -3493 -2784 -748 -1686 -5103
481e103p41J787K566j537j096J691K392l71l328j632K928M67j999k406L324M139
$$ -5103 -5844 -4057 -1491 -3028 -4124 -2433 -41 -412 -3740 -5372 -2444 -1977 -3976 -6382 -3058 1081
497A081j984l744O49M385j566n105k86N183J202l851o5M048M58l424j722J955
$$ 1081 -903 -4647 -3998 387 -1179 -6284 -6570 -1387 -185 -4036 -4101 -53 405 -3019 -4741 -2786
513b786O21j886K14J985R05j237J036O12j367k214R52Q24l75m85J338J332K1k43
$$ -2786 -2165 -4051 -3837 -1852 -947 -2184 -1148 -536 -1903 -4117 -3165 -2341 -2716 -3201 -1863 -531 -510 -753
531g53j067p30J4O38r41j240K003L514o92l060n0M512j577m991j007O120J022
$$ -753 -1820 -2550 -2536 -1898 -2839 -4079 -2076 1438 746 -2314 -2364 2148 571 -4420 -5427 693 1715
548A715m928N87M784J103m805k058L550J152k384j658K284L526k410j042J341
$$ 1715 -3213 -2626 2158 3261 -1544 -3602 -52 1100 -1284 -2942 -658 2868 458 -584 757
563G57k78k65m78n23J7P87K040o3j084P26J226j016k098K95J391p40n87K289J458
$$ 757 479 214 -264 -787 -770 17 2057 1994 910 1636 2862 1846 -252 43 1434 694 107 2396 3854
582C854j653r69K552J18m036j103M655O66l919J2N399J443n529k208M322J692
$$ 3854 2201 1232 3784 3902 -134 -1237 3418 4084 165 177 5576 7019 1490 -718 3604 5296
598E296m640k130M568K861k273k111K258J647k145k077N81K25M17R26p3n23J107
$$ 5296 656 -1474 3094 5955 3682 1571 3829 5476 3331 1254 1835 2060 2477 3403 3330 2807 3914
615C914J775j583l277L96K807r16l188J695L909l89l951Q02L373k802k706R41
$$ 3914 5689 4106 829 1225 4032 3116 -72 1623 5532 5143 1192 1994 5367 2565 -141 800
631H00L102k913j233M089K079m272j868K868J662m904j959M256K300k983j873
$$ 800 3902 989 -244 3845 5924 1652 -216 2652 4314 -590 -2549 1707 4007 1024 -849
646h49L259J837l096k856J309J477j148o11O14P75M82N67j656k247Q66K253j799
$$ -849 2410 4247 1151 -1705 -396 1081 -67 -678 -64 711 1193 1760 104 -2143 -1277 976 -823
663h23l145J645M716r56m685J234M166j761n586P13M722j102l370J871L613j019
$$ -823 -3968 -2323 2393 1437 -3248 -2014 2152 391 -5195 -4482 240 -862 -4232 -2361 1252 233
679B33l762J236J964k388k934L870J670j895j450L468R16l587j955K953P40k518
$$ 233 -3529 -2293 -329 -2717 -5651 -1781 -111 -2006 -3456 12 928 -2659 -4614 -1661 -921 -3439
695c439p57K172J438j181j80J035j753j86J378r59j846J29M869m31l928O96M517
$$ -3439 -4196 -2024 -586 -1767 -1947 -912 -2665 -2851 -1473 -2432 -4278 -4149 720 289 -3639 -2943 1574
712A574j326n483L7N793J6n086Q89N510j55m185n77L565o91l166L39L046j60j370
$$ 1574 248 -5235 -5198 595 611 -4475 -3586 1924 1769 -2416 -2993 572 -119 -3285 -2946 100 -60 -1430
730a430J665Q34j433j230J704J61k204m03L210K29j881O76J771p11k139N31J097
$$ -1430 235 1069 -364 -1594 110 271 -1933 -2336 874 1103 -778 -102 1669 958 -1181 -650 447
747D47j877Q2L072P0j828k33L371r15l822J65L962j1m698O50N622J98n510m4M745
$$ 447 -1430 -1348 1724 1794 -34 -267 3104 2189 -1633 -1468 2494 2483 -2215 -1565 4057 4255 -1255 -1299 3446
766C446j85m877n08M065J047l083J03K330K88k410P02K45r91m86J746P3j674J067
$$ 3446 3261 -1616 -2124 1941 2988 -95 8 2338 2626 216 918 1163 172 -314 1432 1505 -169 898
784H98K089n82l049L95K307q28k714J424K530j030k006J988J257k350j558K389
$$ 898 2987 2405 -644 -249 2058 1230 -1484 -60 2470 1440 -566 1422 2679 329 -1229 1160
800A160J031l122m89L927O25l894m74L714M12m460j196M443O13l050q25L512R45
$$ 1160 2191 -931 -1420 2507 3132 -762 -1236 2478 2890 -1570 -2766 1677 2290 -760 -1585 1927 2872
817B872k570j517J849K25j203j59J084k96M55J193q43k325J272K176j740k712
$$ 2872 302 -1215 634 859 -344 -503 581 285 740 1933 1090 -1235 37 2213 473 -2239
833b239J587L567j641k709J395L097j539l488J593K454k007j438K262J505j832
$$ -2239 -652 2915 1274 -1435 -40 3057 1518 -1970 -377 2077 70 -1368 894 2399 567
848E67j704K598R12l368p75L297O01l311K3L416N22l061o81K439l2k327k15J907
$$ 567 -1137 1461 2373 -995 -1770 1527 2128 -1183 -1160 2256 2778 -283 -964 1475 1443 -884 -1099 808
866H08L44r38L73L6m94k1J112j101j914J485K580j290k690J062L332j466l626
$$ 808 1152 214 587 623 129 108 1220 119 -1795 -310 2270 980 -1710 -648 2684 1218 -2408
883b408O72L398q60l319J193L150p18k619P25J787j138j686Q02J510j417n53J694
$$ -2408 -1736 1662 802 -2517 -1324 1826 1108 -1511 -786 1001 -137 -1823 -1021 489 -928 -1481 213
900B13L48j825m27J684L61k822K76J782L38j549J94Q74J45j018K81k70j086O82
$$ 213 561 -1264 -1691 -7 354 -2468 -2192 -410 -72 -1621 -1427 -553 -408 -1426 -1145 -1415 -2501 -1819
918a819J306m95j762J290K363j540l193J109K994j238k896J331L568k6m442J442
$$ -1819 -513 -1008 -2770 -1480 883 -657 -3850 -2741 253 -985 -3881 -2550 1018 992 -3450 -2008
934b008K699r18k813j52K763m97j202N37J265n80r67O49L86j038m26J699k34j400
$$ -2008 691 -227 -3040 -3192 -429 -926 -2128 -1591 -326 -906 -1873 -1224 -838 -1876 -2302 -603 -837 -2237
952b237O94J797l66j900N16J400o32q43M84R01o00k39J303Nj568M5K112r92j785
$$ -2237 -1543 254 -112 -2012 -1496 -96 -728 -1571 -1087 -186 -786 -1025 278 283 -1285 -1240 872 -120 -1905
971a905J012K962p55k703M11K958l94k974L61K383M53j968m73K277M12j751l74
$$ -1905 -893 2069 1314 -1389 -978 1980 1586 -1388 -1027 1356 1809 -159 -632 1645 2057 306 -68
988f8R38O5O1K28k91l2O79N18m09j259J213R86n98j930J006J948k169j114J691
$$ -68 870 935 996 1224 933 901 1580 2098 1689 430 1643 2629 2031 101 1107 3055 886 -228 1463
1007A463J250n88j386N60J306k077j07K136K93j955K21J772k64k344p3K545j78
$$ 1463 2713 2125 739 1299 2605 528 421 2557 2850 895 1116 2888 2624 280 207 2752 2574
1024B574k482L73K465K52k101j004J420Q56j044j009N32P40L05q16k6J02J89L77
$$ 2574 92 465 2930 3182 1081 77 1497 2353 1309 300 832 1572 1877 1061 1035 1137 1326 1703
1042A703j281p42J398J082j547j049J342J486j547j742J031J222p91j168P79R92
$$ 1703 422 -320 1078 2160 613 -436 906 2392 845 -897 134 1356 565 -603 176 1168
1058A168p05m92R7O47r31l35Q43K37j061J07J005J26j319k01J196k14j047m28
$$ 1168 463 -29 68 715 -216 -551 292 529 -532 -425 580 706 -613 -814 382 168 -879 -1307
1076a307O68N92J3o67K07N62J07n91r91L12J004J02j470L6J211R83j366j363J356
$$ -1307 -639 -47 -34 -701 -494 68 175 -416 -1407 -1095 -91 11 -1459 -1423 -212 771 -595 -1958 -602
1095f02J420j238j698J156J274l56j268K41R78K66j525k14J033K65p00r5J130
$$ -602 818 -420 -2118 -962 312 -44 -1312 -1071 -93 173 -1352 -1566 -533 -268 -968 -1063 67
1112F7l70k53O3j52j34k79M94L43m38j83N21j9L2n04k66L84N31o95j14M00R27
$$ 67 -303 -556 -493 -645 -779 -1058 -564 -221 -659 -842 -321 -340 -308 -812 -1078 -694 -163 -858 -972 -572 355
1133C55k81r73k22J035q8p32p61R09J558r50j047P7J157J97j682j15J228N35q54
$$ 355 74 -899 -1121 -86 -174 -906 -1667 -758 800 -150 -1197 -1120 37 234 -1448 -1563 -335 200 -654
1152f54r96Q18J308l34j404J17N09M71p96J4L43K91o0r77L65M91J38o51m15M57
$$ -654 -1650 -832 476 142 -1262 -1145 -636 -165 -961 -947 -604 -313 -373 -1350 -985 -494 -356 -1007 -1422 -965
1172i65M53k65M72l19m61J39N66P6p62l27Q66L42n86m95P30N68l96j056K71Q64
$$ -965 -512 -777 -305 -624 -1085 -946 -380 -304 -1066 -1393 -527 -185 -771 -1266 -536 32 -364 -1420 -1149 -285
1192b85L86j286j78R33J115j050j156R14J085k26j744K50J554N5p86m20P73M92
$$ -285 101 -1185 -1363 -430 685 -365 -1521 -607 478 252 -1492 -1242 312 367 -419 -839 -66 426
1210D26o23q40Q75M69mo31OQ82j30j53j60j79J29K26L69l56j09P15K28n12l45
$$ 426 -197 -1037 -162 307 303 -328 -322 560 430 277 117 -62 67 293 662 306 197 912 1140 628 283
1231B83M31k13J55o2j00L76L27L30k10l45j14R45l85j147J13J131N57j311m18
$$ 283 714 501 656 594 494 870 1197 1527 1317 972 858 1803 1418 271 384 1515 2072 761 343
1250C43J432J072k135o52J235J179j050j052J124N97l17n77n9K67N71o12p00M22
$$ 343 1775 2847 712 60 1295 2474 1424 372 1496 2093 1776 1199 1140 1407 1978 1366 666 1088
1268A088K10O27k37r11M76Q49p04r19L21Q66j35o54J64O71k68n73J66k5n81J1
$$ 1088 1298 1925 1688 777 1253 2102 1398 479 800 1666 1531 877 1041 1712 1444 871 1037 1012 431 442
1288D42N17J25r11L74J018Q5j739l32J413L55j324o28J220J040j244j360J440
$$ 442 959 1084 173 547 1565 1650 -89 -421 992 1347 23 -605 615 1655 411 -949 491
1305D91M19q97n97Q5J92L33m83J131j247k62O21L33j203Q87O21q98j123R69J130
$$ 491 910 13 -584 -499 -307 26 -457 674 -573 -835 -214 119 -1084 -197 424 -474 -1597 -628 502
1324E02l3k122O73R51L61j199j098K041j018p5L43P75l09p71L67L49j418l57J371
$$ 502 469 -1653 -980 -29 332 -867 -1965 76 -942 -1017 -674 101 -208 -979 -612 -263 -1681 -2038 -667
1343f67P35j037j348J482N54r40l00K50O76J05o97j63L54j69M71p47l0K97Q28
$$ -667 68 -969 -2317 -835 -281 -1221 -1521 -1271 -595 -490 -1187 -1350 -996 -1165 -694 -1441 -1471 -1174 -346
1362c46k07q87O86P90R44k783O98J064j09j788J299P61M64q77j290J605k37j99
$$ -346 -553 -1440 -754 36 980 -1803 -1105 -41 -150 -1938 -639 122 586 -291 -1581 24 -213 -412
1380d12q79M64L06N42P8J54r21l30J301o39n49j44J149M99j006n62Q77O36j371
$$ -412 -1291 -827 -521 21 99 253 -668 -998 303 -336 -885 -1029 120 619 -387 -949 -72 564 -807
1399h07Q10K94m25q34J106p82P9N51N01j05r71L22R27l02j534P58R68M12j376
$$ -807 3 297 -128 -962 144 -638 -559 -8 493 388 -583 -261 666 364 -1170 -412 556 968 -408
1418d08o43J842J65j514q65J455M59r73l78J582l94o21j14P21n20L54K67m91m37
$$ -408 -1051 791 956 -558 -1423 32 491 -482 -860 722 328 -293 -407 314 -206 148 415 -76 -513
1437e13NJ112j9j395P2J625r33m19o17J720J57p49K70L68r45K69J04M92n41o12
$$ -513 -508 604 585 -810 -738 887 -46 -465 -1082 638 795 46 316 684 -261 8 112 604 63 -549
1457e49J409N33j612P6J400J10j953n13J735P11k189J197J276j46j604R7Q04m3
$$ -549 860 1393 -219 -143 1257 1367 -586 -1099 636 1347 -842 355 1631 1485 -119 -22 782 739
1475G39r05J28R01M1M9j02p83P86l34M67J55j495O65R90K82j288j78J704N78k166
$$ 739 -166 -38 863 904 953 851 68 854 520 987 1142 -353 312 1302 1584 296 118 1822 2400 234
1495B34L29Q90j942J177P7o5Q6l8N21l89J5n82O33J348k014k0R82J007j898M04
$$ 234 563 1453 -489 688 765 700 786 748 1269 880 895 313 946 2294 280 260 1242 2249 351 755
1515G55k2P51j366K67R53r9l24o14M33k41L48K11l33l08K92N01m30r56P06R29
$$ 755 733 1484 118 385 1338 1239 915 301 734 493 841 1052 719 411 703 1204 774 -182 524 1453
1535A453m87j346N95J067j26j501N80O84P4j600P32R12j477n11J201Q51j573j
$$ 1453 966 -380 215 1282 1156 -345 235 919 993 -607 125 1037 -440 -951 250 1101 -472 -473
1553d73J639k12j305o36J386O2j586N62J289l36l34n83Q23j60j348L2P50N30q40
$$ -473 1166 954 -351 -987 399 461 -1125 -563 726 390 56 -527 296 136 -1212 -1180 -430 100 -740
1572g40M00L1p97j89J645n22j071k0J132m98j561R12J456l99j765m47K757l98
$$ -740 -340 -309 -1106 -1295 350 -172 -1243 -1263 -131 -629 -2190 -1278 178 -221 -1986 -2433 324 -74
1590g4j128M96M9n03p6K15M32K26r23J009q39J97j66L87K63n14n21J429j44p12
$$ -74 -1202 -706 -657 -1160 -1236 -1021 -589 -363 -1286 -277 -1116 -919 -1085 -698 -435 -949 -1470 -41 -185 -897
1610h97m34J175m59j036J141P7k47j46K94j59j40p9L00n0r44P90Q03m09r55M05
$$ -897 -1331 -156 -615 -1651 -510 -433 -680 -826 -532 -691 -831 -910 -610 -660 -1604 -814 -11 -420 -1375 -970
1630i70J641m05j725N74J180O2j250L7J008K21o76J51M06l41j11K95m81o1L18
$$ -970 671 266 -1459 -885 295 357 -893 -856 152 373 -303 -152 254 -87 -198 97 -384 -445 -127
1649a27N87l77l98L7R95o14n72Q39P24r68j194Q15J217j24j257J336m35j69k21
$$ -127 460 83 -315 -278 717 103 -469 370 1094 126 -1068 -253 964 840 -417 919 484 315 94
1668I4J32L9r98M35J661r97m71K67O15p60j005O12J726p33j032P7J566o70o01
$$ 94 226 265 -733 -298 1363 366 -105 162 777 17 -988 -376 1350 617 -415 -338 1228 558 -43
1687d3J09K33J21p49J08J16K14K99Q45r41j274J237O73k04j626J386O02l05j047
$$ -43 66 299 420 -329 -221 -105 109 408 1253 312 -962 275 948 744 -882 504 1106 801 -246
1706b46K29N36l48k92J53M98l26m26M42M83o87Q1M60k82l60o9M71M04q70Q9J198
$$ -246 -17 519 171 -121 32 530 204 -222 220 703 16 97 557 275 -85 -154 317 721 -149 -60 1138
1727A138n25q48J37L42N82j035L94k43M15o3J84l92Q1L90k25j62k66O47L33n66
$$ 1138 613 -235 -98 244 826 -209 185 -58 357 294 478 86 167 557 332 170 -96 551 884 318
1747C18n13P25M84p73p78P54P37l47o23L57K89J1j87l59O78p7p99P31k92L42m24
$$ 318 -195 530 1014 241 -537 217 954 607 -16 341 630 641 454 95 773 696 -103 628 336 678 254
1768B54N43K6j302R66M08m17J28q24L89L35n31k61O20J36o62K88K02q29J853j449
$$ 254 797 823 -479 487 895 478 606 -218 171 506 -25 -286 334 470 -192 96 298 -531 1322 -127
1788a27L9O3r82J533K46k167J657N21o60n25J53P15k51q50K68N87o7p88L5N45
$$ -127 -88 -25 -1007 526 772 -1395 262 783 123 -402 -249 466 215 -635 -367 220 153 -635 -600 -55
1808e5K92o37J85J09k35J35j03j9l23K64K42q6n88O45N1j92j30j77K74P0k57n29
$$ -55 237 -400 -215 -106 -341 -206 -309 -328 -651 -387 -145 -231 -819 -174 -123 -315 -445 -622 -348 -278 -535 -1064
1830a064O53M3P82r33M05l28k21N06o90J73j39O83m17o91L16J206k63r20r0k25
$$ -1064 -411 -368 414 -519 -114 -442 -663 -157 -847 -674 -813 -130 -547 -1238 -922 284 21 -899 -989 -1214
1850a214J007l03j78K65J80j39q54O89J59j93p7j53L35L65j88m64L01M3K98k16
$$ -1214 -207 -510 -688 -423 -243 -382 -1236 -547 -388 -581 -658 -811 -476 -111 -299 -763 -462 -419 -121 -337
1870c37n39O00J04j56R6K35j44J09p4q8k32J42L70q2JQj81L62l17r3J04P45l6
$$ -337 -876 -276 -172 -328 -232 3 -141 -32 -106 -194 -426 -284 86 4 5 13 -168 194 -123 -216 -112 633 597
1893E97p40J52L09J07k79J5J34J48Ql22J50L59n8o79L2K64J91L3m28L69K15R2
$$ 597 -143 9 318 425 146 161 295 443 451 129 279 638 580 -99 -67 197 388 421 -7 362 577 669
1915F69l05j67L51J35l18m04o7O65q4j58l25j21Q66J33r07L69j33P17p07J03J80
$$ 669 364 197 548 683 365 -39 -106 559 475 317 -8 -129 737 870 -37 332 199 916 209 312 492
1936D92K53N94j201j52L7K48N65l08p99R04q38M46J24L7J02K76n78q10R28K43
$$ 492 745 1339 138 -14 23 271 836 528 -271 633 -205 241 365 402 504 780 202 -608 320 563
1956E63J28l25q64Q56J25m37l69L96J88k66o7P8J89l4l23k68O01O2k88j45L68
$$ 563 691 366 -498 358 483 46 -323 73 261 -5 -72 6 195 161 -162 -430 171 233 -55 -200 168
1977A68q3J44n29M18j09l7o9M3l3Q1Lk7M77o31j43M81j32k14j36K29M90m39m49
$$ 168 85 229 -300 118 9 -28 -97 -54 -87 -6 -3 -30 447 -184 -327 154 22 -192 -328 -99 391 -48 -497
2000d97K19N81p02Q9R7N94l52j33R6j1J74K19p54L33L82K14n69m08N83J55l39
$$ -497 -278 303 -399 -310 -213 381 29 -104 -8 -19 155 374 -380 -47 335 549 -20 -428 155 310 -29
2021b9k23J63O18j42r24K35P15r5k47k94K60K45n15J32J37K05o16N15j3l93J1
$$ -29 -252 -89 529 387 -537 -302 413 318 71 -223 37 282 -233 -101 36 241 -375 140 127 -266 -255
2042b55P31o1m23n7L0J10m1l88K64K37l37p3J76J91J32k56K5m2o0K8k06p2J67
$$ -255 476 415 -8 -65 -35 75 34 -354 -90 147 -190 -263 -87 104 236 -20 5 -37 -97 -69 -275 -347 -180
2065a80K31l29k79L65N68n59j03j58N45l4o03O1J70L45p27K56K71M8k94J77j82
$$ -180 51 -278 -557 -192 376 -183 -286 -444 101 67 -536 -475 -305 40 -687 -431 -160 -112 -406 -229 -411
2086d11J55J5m3L0r9l47L23N5l02j62P20N9l89k82L72k0K4J68k37J12n1Q4J69
$$ -411 -256 -241 -284 -254 -353 -700 -377 -322 -624 -786 -66 -7 -396 -678 -306 -326 -302 -134 -371 -259 -310 -226 -57
2109e7n26M25K30k59n5j90Q03j71q26K68O54m7n77j46N92m0k99m15P28K00k94
$$ -57 -583 -158 72 -187 -242 -432 371 200 -626 -358 296 249 -328 -474 118 78 -221 -636 92 292 -2
2130bJ9K07j83k89M01l8k50L14J12nn46N5O79j61m92K7O81k18k11K27J63m09K13
$$ -2 17 224 41 -248 153 115 -135 179 291 286 -260 -205 474 313 -179 -152 529 311 100 327 490 81 294
2153B94r3L6P0j20J71L88p49K00M14l03k38k9M85J33o03K23O75j12n20j79K60
$$ 294 201 237 307 187 358 746 -3 197 611 308 70 41 526 659 56 279 954 842 322 143 403
2174D03P3m03J75K53q4L39n8k33l58j5N25j22k93K21O4L20n49k61P97k15m20J3
$$ 403 476 73 248 501 417 756 698 465 107 92 617 495 202 423 487 807 258 -3 794 579 159 172
2196A72K55k01k71O6M10j57k33j27L74k11k00L39J20n97j62N61K92m62n36O19
$$ 172 427 226 -45 21 431 274 41 -86 288 77 -123 216 336 -261 -423 138 430 -32 -568 51
2216E1M96r82l2J24M75k11j14K53l27jJ9RR0K04M2k56n03N84m1j49l22L09J097
$$ 51 547 -435 -467 -343 132 -79 -193 60 -267 -268 -249 -240 -150 54 96 -160 -663 -79 -120 -269 -591 -282 815
2239H15o77j042O74NM41r29K78M88m64J95J57N01j87j022M67P63j464O32Q97p47
$$ 815 138 -904 -230 -225 216 -713 -435 53 -411 -216 -59 442 255 -767 -300 463 -1001 -369 528 -219
2259b19j192N36Q62j80R4n55N88J40j52K84m74q28J725l32r15M93m83R47K1r39
$$ -219 -1411 -875 -13 -193 -99 -654 -66 74 -78 206 -268 -1096 629 297 -618 -125 -608 339 360 -579
2279e79k3J008j10j841J641M00k03j043J143M25p01j002N32L68J88K51o33K26
$$ -579 -602 406 296 -1545 96 496 293 -750 393 818 117 -885 -353 15 203 454 -179 47
2297D7K36k05j63j20m0r5J70L86l76K45J54k60k41P4M42j01l06j77J79M77k48
$$ 47 283 78 -85 -205 -245 -340 -170 216 -160 85 239 -21 -262 -188 254 153 -153 -330 -151 326 78
2318G8K5j51J81J47k35J6k31QL86r6m33K37K30M3o66J55Q20m26k01l49N90L17
$$ 78 103 -48 133 280 45 61 -170 -162 224 128 -305 -68 162 205 -461 -306 514 88 -113 -462 128 445
2340D45r66l9P43j70j5j52J52j77M9M52j54o30J84L81j73j29m9N07j43l35J95
$$ 445 -521 -560 183 13 -2 -154 -2 -179 -130 322 168 -462 -278 103 -70 -199 -248 259 116 -219 -24
2361b4K56r8o70J80M98k13j27M45k13l28K2O16j08n17N47j70J80n76K58O29k81
$$ -24 232 134 -536 -356 142 -71 -198 247 34 -294 -272 344 236 -281 266 96 276 -300 -42 587 306
2382C06m90J15K81j14o3k12N50j12j27N1j2j81P1J04J67m75K85K82k94o6K02M32
$$ 306 -184 -69 212 98 35 -177 373 261 134 185 173 -8 63 167 334 -141 144 426 132 66 268 700
2404G00n40k69J82M89k22o5%L19k73q2q8J70k68K52l6QR2k55L93j91j66K46J25
$$ 700 160 -109 73 562 340 275 275 594 321 239 151 321 53 305 269 277 369 114 507 316 150 396 521
2427E21j46j46k3M60k10m41R4M18m36K16k57J18K43j99k3Mj09lO7K7l35K94J16
$$ 521 375 229 206 666 456 15 109 527 91 307 50 168 411 212 189 193 84 81 148 175 -160 134 250
2450B50j58n75N24M01l69m10K77J04J20m98O7L67o9k24O0L9J40k50k1J52k52J07
$$ 250 92 -483 41 442 73 -337 -60 44 164 -334 -267 100 31 -193 -133 -94 46 -204 -225 -73 -325 -218
2472b18N20k41m00N6L04M2p21M99p3j33J9k6L49M3l00m48L94q7R7L65l46j62J79
$$ -218 302 61 -339 -283 21 63 -658 -159 -232 -365 -346 -372 -23 20 -280 -728 -334 -421 -324 41 -305 -467 -288
2495b88M47o92m33N93J25r7j72P3J91L7m98J09N48k52k33o5K87J20O1o5J83k03
$$ -288 159 -533 -966 -373 -248 -345 -517 -444 -253 -216 -714 -605 -57 -309 -542 -607 -320 -200 -139 -204 -21 -224
2517b24J70L6L2k83j7K84j25k24m3O89j021Q81n01M78J8l91J32l50Q07J82m47
$$ -224 -54 -18 14 -269 -286 -2 -127 -351 -394 295 -726 155 -346 132 150 -241 -109 -459 348 530 83
2538H3j91R4K66j78l83n3P76r30J027q95j60J575k11j085J118l83o11J90M78M70
$$ 83 -108 -14 252 74 -309 -362 414 -516 511 -384 -544 1031 820 -265 853 470 -141 49 527 997
2558I97p16n89N96K99l37l19P42p88l0N4O97j61q2j30l22P39k37J31j3L37j382
$$ 997 281 -308 288 587 250 -69 673 -115 -145 -91 606 445 363 233 -89 650 413 544 531 868 -514
2579e14N33M38m26p6j59K82J10M17l5n26j401J632K45o21K71m32J59J75L65j23
$$ -514 19 457 31 -45 -204 78 188 605 570 44 -1357 275 520 -101 170 -262 -103 72 437 314
2599C14k30J76o13P25p96R17q9j087M88K85k03N34K56q51J054l92j001J132j135
$$ 314 84 260 -353 372 -424 493 404 -683 -195 90 -113 421 677 -174 880 488 -513 619 -516
2618e16N2J266m63p1j434Q28o0l16J524r91N41Q32N0q20n6o15O57p94L53n27J238
$$ -516 -464 802 339 268 -1166 -338 -398 -714 810 -181 360 1192 1242 422 366 -249 408 -386 -33 -560 678
2639F78r01K06j705J761L90j265N24J785j124J81k65n89J339k176R72q5O47k76
$$ 678 -223 -17 -1722 39 429 -836 -312 1473 349 530 265 -324 1015 -1161 -189 -274 373 97
2657I7K54k72k82N50q14O13p4N14m98r9J65k13L63n43M36K69k83k21j61J33K5
$$ 97 351 79 -203 347 -467 146 72 586 88 -11 154 -59 304 -239 197 466 183 -38 -199 -66 -41
2678d1l2l97J187j020J53N1n78J014p97J118l07k64L36L75j17q14m05K38O38l82
$$ -41 -73 -470 717 -303 -150 -99 -677 337 -460 658 351 87 423 798 681 -133 -538 -300 338 -44
2698d4l09N29l71O1k76M75r9K30l41j60K70K46j25k23j01J57N6MN5n6P3M6ll14
$$ -44 -353 176 -195 -134 -410 65 -34 196 -145 -305 -35 211 86 -137 -238 -81 -25 -21 34 -22 51 97 94 -220
2722b20m4L84j98j38j5K64r6kj72J4L60r6n23K59M3j6j25R7K5J62R5n42K50J42
$$ -220 -264 120 -78 -216 -231 33 -63 -65 -237 -223 137 41 -482 -223 -180 -196 -321 -224 -199 -37 58 -484 -234 -92
2746i2jj84M3m9K74J39m78k23M28n0R4j50j04L36k3k56K92l82M58n2j00o38J44
$$ -92 -93 -277 -234 -283 -9 130 -348 -571 -143 -193 -99 -249 -353 -17 -40 -296 -4 -386 72 20 -80 -718 -574
2769e74Q98k42l31j84O64n6l72J1K52K6j87j09K48J89l20j05K31j9q8K27j13l16
$$ -574 324 82 -249 -433 231 175 -197 -186 66 92 -95 -204 44 233 -87 -192 39 20 -68 159 46 -270
2791b70K36K01k8O2j80K07k67M12l41k15L81k41M10m08K23l4K01j91j53P1J69
$$ -270 -34 167 139 201 21 228 -39 373 32 -183 198 -43 367 -41 182 148 349 158 5 76 245
2812B45j42m14L69K88r8l67L2M84J64m30j11K67K78k26j23j02J70K11o05J16K29
$$ 245 103 -311 58 346 248 -119 -87 397 561 131 20 287 565 339 216 114 284 495 -110 6 235
2833B35j68J02k54L20J38j46j6j54j07L46m37J13Q3L31l88lJ0N1O9N2J7k28K8
$$ 235 67 169 -85 235 373 227 211 57 -50 296 -141 -28 55 386 -2 -5 5 56 125 177 194 -34 -6
2856fL2p0K90k46m0M16k85qq9J60R5l01k08K18l1O2K0l3J8q5r1K28j16l4n6J03
$$ -6 26 -44 246 0 -40 376 91 83 -6 154 249 -52 -260 -42 -73 -11 9 -24 -6 -91 -182 46 -70 -104 -160 -57
2882e7J24j07k00M8jK69K39k31l83J69J9K08l56K45K27l05P6k63M05j49j21K67
$$ -57 67 -40 -240 -192 -193 76 315 84 -299 -130 -111 97 -259 -14 213 -92 -16 -279 126 -23 -144 123
2904A23l0j20J8J41j73J12M0q82Q70J70j66O0J89o43J80K3L15j06m04N56k18j74
$$ 123 93 -27 -9 132 -41 71 111 -771 99 269 103 163 352 -291 -111 -88 227 121 -283 273 55 -119
2926a19k86N85l52P2J89k65J09jJ23K15p54R24o62M52r3m12R89m28m45k48L13
$$ -119 -405 180 -172 -100 89 -176 -67 -68 55 270 -484 440 -222 230 137 -275 714 286 -159 -407 -94
2947i4J3m24K13Q19l84P6K2l40N08m17K36j61o9Q6J05j04m71M24m5mJ85n75K44
$$ -94 -81 -505 -292 527 143 219 241 -99 409 -8 228 67 -2 84 189 85 -386 38 -7 -11 174 -401 -157
2970a57K87J3k18K73j38l8Ln7o8j03J80j1p6k91M26q5j21K55L3N6m58m1L71l8
$$ -157 130 143 -75 198 60 22 25 -32 -100 -203 -23 -34 -110 -401 25 -60 -181 74 107 163 -295 -336 35 -3
2994cl83j5M68Qp9M7o9M1m68M26k7j91j31L91k02j04J12L21k29j92l6M04L3j81
$$ -3 -386 -401 67 75 -4 43 -26 15 -453 -27 -54 -245 -376 15 -187 -291 -179 142 -87 -279 -315 89 122 -59
3018e9j8K86m55Q0K39m6p6j28M30l13J73l07P54l99k85RJ13J45j95L0O2R7l05
$$ -59 -77 209 -246 -166 73 27 -49 -177 253 -60 113 -194 560 161 -124 -115 -2 143 -52 -22 40 137 -168
3041a68M4J77J52q2Qr0J64j22J11k33K10J08R1k95j78L95K0l48m1M87j25k49J6
$$ -168 -124 53 205 123 131 41 205 83 194 -39 171 279 370 75 -103 292 312 -36 -77 410 285 36 52
3064E2j31L40l0j1l2J82J13k54J34n27J59L60k08M5j78K40J40r6l5M0j37k1l76
$$ 52 -79 261 231 220 188 370 483 229 363 -164 -5 355 147 192 14 254 394 298 263 303 166 145 -231
3087b31M75o0K7j23P1J84l02K64j73p2o6N0j51J92j24J87j18j03r4K14q7pk27
$$ -231 244 184 211 88 159 343 41 305 132 60 -6 44 -107 85 -39 148 30 -73 -167 47 -40 -47 -274
3110b74O7M82n5k96Q8J79k82k94L00j16p3J86n3L01k88KO5j14O7j79K62l5o9Q5
$$ -274 -207 275 220 -76 12 191 -91 -385 -85 -201 -274 -88 -141 160 -128 -126 -61 -175 -108 -287 -25 -60 -129 -44
3134d4k78M75n56L9J67J36P5q6J00o7oj04J83j31R6k17j40M04j97P4J28j71J11
$$ -44 -322 153 -403 -364 -197 -61 14 -72 28 -39 -45 -149 34 -97 -1 -218 -358 46 -151 -77 51 -120 -9
3157iL46l44j75j98L84j84%k64L82j06k00L99k26M14k74K99l90K20J7J00k19j29
$$ -9 337 -7 -182 -380 4 -180 -180 -444 -62 -168 -368 31 -195 219 -55 244 -146 74 91 191 -28 -157
3179a57J53M15m80R2n4K93m51K64m54L62L98l80P9k87L05j51K31j26K9j33J67
$$ -157 -4 411 -69 23 -31 262 -189 75 -379 -17 381 1 80 -207 98 -53 178 52 81 -52 115
3200A15P4k75J29K00k54j06K25K08j97o8K05L5m31M03m24L06k02K32j15l62N79
$$ 115 189 -86 43 243 -11 -117 108 316 119 51 256 291 -140 263 -161 145 -57 175 60 -302 277
3221B77k07k45K70j44j22K78o8m1J04K47l02J60o48N40r9M4l8j44q0oj25L44n76
$$ 277 70 -175 95 -49 -171 107 39 -2 102 349 47 207 -441 99 0 44 6 -138 -218 -224 -349 -5 -581
3244e81L85Q9oK66q1j16K15l77J48R7K54l35p1J36J75m28K74m3j30J75j28K0k87
$$ -581 -196 -107 -113 153 72 -44 171 -206 -58 39 293 -42 -113 23 198 -230 44 1 -129 46 -82 -62 -349
3267c49O12r8l19r1J90K43k18k86M94j91K29m61m7K24J85k48K46l80J56K41m4
$$ -349 263 165 -154 -245 -55 188 -30 -316 178 -13 216 -245 -292 -68 117 -131 115 -265 -109 132 88
3288H8k17L09k2k15k7J17M2j68L15l26j52L73j13K27j54j07K29%Nj90o5j02K38
$$ 88 -129 180 158 -57 -84 33 75 -93 222 -104 -256 117 4 231 77 -30 199 199 204 14 -51 -153 85
3311H5k5nQ3m0J75j21J04r6j79k28M06N5j95j62o5M84l55k8J85j69K72j94k12
$$ 85 60 55 138 98 273 152 256 160 -19 -247 159 214 19 -143 -208 276 -79 -107 78 -91 181 -13 -225
3334b25L01Lj74L19l8j86k9k41M31k03J97j07K92k73J87k63K4k5K6jj1j63K90
$$ -225 76 79 -95 224 186 0 -29 -270 161 -42 155 48 340 67 254 -9 15 -10 16 15 4 -159 131
3357A31k01N6J77l09o3L18j08q5o1j03L26k11M67k18k64J98k9j91N1q1K77M6m7
$$ 131 -70 -14 163 -146 -209 109 1 -84 -145 -248 78 -133 334 116 -148 50 21 -170 -119 -200 77 123 76
3380G6n1p9l5j50M06k58J5K73n49K16j32N30m80J84k60K83J27k41k20N6M55l41
$$ 76 25 -54 -89 -239 167 -91 -76 197 -352 -136 -268 262 -218 -34 -294 -11 116 -125 -345 -289 166 -175
3402a75k94M75L6k67M6N5K78l48J65K7J04K2o0j7l86N2K28j22J51j48K37j32l4
$$ -175 -469 6 42 -225 -179 -124 154 -194 -29 -2 102 124 64 47 -339 -287 -59 -181 -30 -178 59 -73 -107
3425a07J23l33J10L40n39L19k33N35m2p3j03j1M8O2K49j86j62K18k28Q7J42M9
$$ -107 16 -317 -207 133 -406 -87 -320 215 173 100 -3 -14 34 96 345 159 -3 215 -13 74 216 265
3447B65o5k46r2J13JP1K11m47M83j05n42L11K8K4J46j96P3p8K80j56j69R6J47
$$ 265 200 -46 -138 -25 -24 47 258 -189 294 189 -353 -42 -14 10 156 -40 33 -45 235 79 -90 6 153
3470A53M2j32n0J65p5j8m6L02p3R7l98M16r9l92q9K36J14j74K12Mj99K16j27J00
$$ 153 195 63 13 178 103 85 39 341 268 365 -33 383 284 -108 -197 39 153 -21 191 195 -4 212 85 185
3494A85j18P8k39K51l70J42M9K44m33J34J36k39K83l17K18j47L43l64O6Q8n4j33
$$ 185 67 145 -94 157 -213 -71 -22 222 -211 -77 59 -180 103 -214 4 -143 200 -164 -98 -10 -64 -197
3516a97N51m42j40q1L34R9k39j9P7k73L74j24J68J28k01k47R0M2j44K86J46m16
$$ -197 354 -88 -228 -309 25 124 -115 -134 -57 -330 44 -80 88 216 15 -232 -142 -100 -244 42 188 -228
3538b28R1m4k4L91l05J69q2q1OJ80qQ1M4q6l42L82l26k3K52j36m5K98pP1rj42
$$ -228 -137 -181 -205 186 -119 50 -32 -113 -107 73 65 146 190 104 -238 144 -182 -205 47 -89 -134 164 157 228 219 77
3564G7j61L11j24J8j44K11p2j0J46l08jK28l7k71J48p5jj2J95k43L60m57J43K99
$$ 77 -84 227 103 121 -23 188 116 106 252 -56 -57 171 134 -137 11 -64 -65 -77 118 -125 235 -222 -79 220
3588B20k18L51l57k1K77k81J24N4p6k97K77r2J22P8j28j25J87N1k66K04k49K42
$$ 220 2 353 -4 -25 252 -29 95 149 73 -224 53 -39 83 161 33 -92 95 146 -120 84 -165 77
3610G7L6p0J8j5L1J39n69M59M5j38j91P96j428R86M50p07j51J08j25O1K7r9J49
$$ 77 113 43 61 46 77 216 -353 106 151 13 -178 618 -810 176 626 -81 -232 -124 -249 -188 -161 -260 -111
3633a11m0J34j47K21l39M27l32L2O1J39pM0n9L5Mk81J17J90R1r6o09N1J25j03
$$ -111 -151 -17 -164 57 -282 145 -187 -155 -94 45 38 78 19 54 58 -223 -106 84 175 79 -530 -479 -354 -457
3657d57N74o31K39K55q69N1K40K94K56J14o4j82k9K46k06K09j80K19K68k08j87
$$ -457 117 -514 -275 -20 -889 -838 -598 -304 -48 66 2 -180 -209 37 -169 40 -140 79 347 139 -48
3678d8L1M61m77J27k97K55J5q4n7l5L62k19p4K03j08N6j89q6L86J13k40l42N22
$$ -48 -17 444 -33 94 -203 52 67 -17 -74 -109 253 34 -40 163 55 111 -78 -164 222 335 95 -247 275
3701B75k36o9R6m9l4m4n9J62l4J05Pj75l00M55l7K07k96J90J27j98o3o2J94J53
$$ 275 39 -30 66 17 -17 -61 -120 42 8 113 120 -55 -355 100 63 270 -26 164 291 93 30 -32 162 315
3725C15l50J49o8o0J85j12j31J5N7J19O0j0l82J51K44k5l13K32P2k82m4L22K0
$$ 315 -35 114 46 -14 171 59 -72 -57 0 119 179 169 -213 -62 182 157 -156 76 148 -134 -178 144 164
3748A64k19O9M4J57l55O4N9L9k38J84L5n8M51m28M2mk66L43l55K22O2M7j74O6
$$ 164 -55 14 58 215 -140 -76 -17 22 -216 -32 3 -55 396 -32 10 6 -260 83 -272 -50 12 59 -115 -49
3772d9Ln0l9J27n0J86j23J2KK6j93m8K93K2j58M9j71K42j22j89K28L49n35L52
$$ -49 -46 -96 -135 -8 -58 128 5 17 19 45 -148 -196 97 119 -39 10 -161 81 -41 -230 -2 347 -188 164
3796A64j32q8n2k07O64k42kn36L10l38k5j02K81M1M19k37K46k97j9k58O00O8M5
$$ 164 32 -56 -108 -315 349 107 105 -431 -121 -459 -484 -586 -305 -264 155 -82 164 -133 -152 -410 190 258 303
3819C03K96n10J34q65Q75n48N25k57R8j87O9J83j61R2%L37k69M2l17J69p0N5k58
$$ 303 599 89 223 -642 233 -315 210 -47 51 -136 -67 116 -45 47 47 384 115 157 -160 9 -61 -6 -264
3842b64L93m6J43j60n1M6k68K62J96j87k33L16j1m1k72K46j51L0j49k4K06j90
$$ -264 129 83 226 66 15 61 -207 55 251 64 -169 147 136 95 -177 69 -82 -52 -201 -225 -19 -209
3864b09N7J49J06m57K65J28j06J67ol52K95J72J23l31n4k6J99j5j7m12M24K45
$$ -209 -152 -3 103 -354 -89 39 -67 100 94 -258 37 209 332 1 -53 -79 120 105 88 -324 100 345
3886C45n21K75k53j2J6J29m3M9j23J39j03j81M14l9k27R1k92L55J26k91J04K96
$$ 345 -176 99 -154 -166 -150 -21 -64 -15 -138 1 -102 -283 131 92 -135 -44 -336 19 145 -146 -42 254
3908B54j38k37K4O7o2m2n5J12p1j42N66l44M8l65L59j28k0m2K45Ml06L01q4k7
$$ 254 116 -121 -97 -30 -92 -134 -189 -77 -148 -290 276 -68 -20 -385 -26 -154 -174 -216 29 33 -273 28 -56 -83
3932h3r3oJ26j20J40r5K28n1J14l25L05N7l99J82K22q2k11K5J92J07j90q9K59
$$ -83 -176 -182 -56 -176 -36 -131 97 46 160 -165 140 197 -202 -20 202 120 -91 -66 126 233 43 -46 213
3955B13k26N9P9j3j24J77K62m21J12k68L51m75N34m30K08L16k26n3m0L8N9k61
$$ 213 -13 46 125 112 -12 165 427 6 118 -150 201 -274 260 -170 38 354 128 75 35 73 132 -129
3977a29Rj4J76n1J9L8l4k23p9j52M4K45K10P96m64k52m03N73L1k24m06J89L56
$$ -129 -120 -134 42 -9 10 48 14 -209 -288 -440 -396 -151 59 855 391 139 -264 309 340 116 -290 -101 255
4000B55L89p90L74k62n72N42l75M47k98R49r14L2J06k5J84K1K53j9k07n5j90M74
$$ 255 644 -146 228 -34 -606 -64 -439 8 -290 659 -255 -223 -117 -142 42 63 316 297 90 35 -155 319
4022C19n42L0L48m46K10n89O17l39M40q2Q8J37o7j022K88O33k28l3l07P53j65
$$ 319 -223 -193 155 -291 -81 -670 -53 -392 48 -34 54 191 124 -898 -610 23 -205 -238 -545 208 43
4043D3q3k18j12m06K33N32k28J97n62K60J101q17k9M83p04L14J63j68m62O04n43
$$ 43 -40 -258 -370 -776 -543 -11 -239 -42 -604 -344 757 -60 -89 394 -310 4 167 -1 -463 141 -402
4064d02J42J26K72n69L44N33j133N91l34K25J0M38M51m79k11L35o79L2O28l67
$$ -402 -260 -134 138 -431 -87 446 -687 -96 -430 -205 -195 243 694 215 4 339 -340 -308 320 -47
4084d7qN12m1j69j56j09k42K89J05j10J69j33J47l54M98k85O8Q5k57J28Kj16N1
$$ -47 -55 457 416 247 91 -18 -260 29 134 24 193 60 207 -147 351 66 134 219 -38 90 92 -24 27
4107B7M06l63J71k02m4j77L69j24n8j75L88l45M0K08q1mj80L54n29N14k94L26
$$ 27 433 70 241 39 -5 -182 187 63 5 -170 218 -127 -87 121 40 36 -144 210 -319 195 -99 227
4129B27k28j50K06J92j94Q5j77m5J01j43K36p0k37J98p9K3j66K32r1M81p04L20
$$ 227 -1 -151 55 247 53 138 -39 -84 17 -126 110 40 -197 1 -78 -55 -221 11 -80 401 -303 17
4151A7o3j12P1j93J31K00j61J68O1m2j88R1o3K00j96K84j57k63J49o8J49J18k66
$$ 17 -46 -158 -87 -280 -149 51 -110 58 119 77 -111 -20 -83 117 -79 205 48 -215 -66 -134 15 133 -133
4174a33J01L10j52j52q7K70j25r4L29l45K9K91k73O0j81L49k38J7q3RJ0J37nm5
$$ -133 -32 278 126 -26 -113 157 32 -62 267 -78 -49 242 -31 29 -152 197 -41 -24 -107 -98 -88 49 44 -1
4198am69M22K4j1J30q1m5p6M06k73j28j30J04J74j94R9J91k14K24q3p9K50j73
$$ -1 -470 -48 -24 -35 95 14 -31 -107 299 26 -102 -232 -128 46 -148 -49 142 -72 152 69 -10 240 67
4221F7o7J03O2m47M76q7J04o0m67J41J30K97m59K63Q82j769K79Q23o00M57O8J16
$$ 67 0 103 165 -282 194 107 211 151 -316 -175 -45 252 -207 56 938 -831 -552 271 -329 128 196 312
4243C12k56J11J05j96m31P50n15m75Q17l81M36k32n8q7M35j27J40j53r1K93Oj87
$$ 312 56 167 272 76 -355 395 -120 -595 222 -159 277 45 -13 -100 335 208 348 195 104 397 403 216
4265B16j24j41J13m52O22o65Q45r80L83J69l46J22N0J48m34O95m5m68k20M07J98
$$ 216 92 -49 64 -388 234 -431 414 -566 -183 -14 -360 -238 -188 -40 -474 221 176 -292 -512 -105 93
4286I3L16l95J77M3j55l54M15j05k15K56j09j1N3j4R7j3j48l0K77k07j19j93L25
$$ 93 409 14 191 234 79 -275 140 35 -180 76 -33 -44 9 -5 92 79 -69 -99 178 -29 -148 -341 -16
4309a6j32m6J01k7k58N10j89K35m42L95q6j18M1m0k21L77j77K08j0j82K10J0p5
$$ -16 -148 -194 -93 -120 -378 132 -57 178 -264 131 45 -73 -32 -72 -293 84 -93 115 105 -77 133 143 68
4332F8m4k52K10K01j39j89J94l10K74J89l68J70k28K55m8P4k46K67j60j20L87
$$ 68 24 -228 -18 183 44 -145 49 -261 13 202 -166 4 -224 31 -17 57 -189 78 -82 -202 185
4353A85k1Kl12K89k89M26P7N27o54k14P91j259O95L20l17l81o8k86L13j7N89l90
$$ 185 164 166 -146 143 -146 280 357 884 230 16 807 -452 243 563 246 -135 -203 -489 -176 -193 396 6
4375Fn90R50j24k1J00l77L28p00O79m6L16l65j54j44P28q25M4J27M71j9p58k20
$$ 6 -584 366 242 221 321 -56 272 -428 251 205 521 156 2 -142 586 -239 -195 -68 403 384 -374 -594
4397e94N99K27n78j72R03n2m08J15n2M5L1K39M31m93p9J27o10M51l21k80N04n85
$$ -594 5 232 -346 -518 385 333 -75 40 -12 33 64 303 734 241 162 289 -321 130 -191 -471 33 -552
4419e52R65m16L71J98q89J63K45O6L1J5j41P9Kj57M20m25RO1j73J74k60P7R5J58
$$ -552 413 -3 368 566 -323 -160 85 151 182 197 56 135 137 -20 400 -25 -16 45 -128 46 -214 -137 -42 116
4443A16r3M9l61K78J11Kj18J4J4J04m1k38K50j4j19k6QJ81J3O0l81J52j53j4L72
$$ 116 23 72 -289 -11 100 102 -16 -2 12 116 75 -163 87 73 -46 -72 -64 117 130 190 -191 -39 -192 -206 166
4468A66k70J35P3l10J26K15R4j08p8r2k4J45j26L6K10J35l44M28k06m69M52j95
$$ 166 -104 31 104 -206 -80 135 229 121 43 -49 -73 72 -54 -18 192 327 -17 411 205 -264 188 -7
4490gj13J96J4n2K84k88L4P3j13m9J62k32J7q0K04J51j95J14m19K0L65j66N2N1
$$ -7 -120 76 90 38 322 34 68 141 28 -21 141 -91 -74 -154 50 201 6 120 -299 -279 86 -80 -28 23
4514B3K54Kl56o0K93j05rJ00l8j75L08k05j83jL1m7o3J11O4J27j5j5m31N38j52
$$ 23 277 279 -77 -137 156 51 42 142 104 -71 237 32 -151 -152 -121 -168 -231 -120 -56 71 56 41 -390 148 -4
4539dr8J46J54l73M46k39j08J50j43K68j85k0J60k00j74L59k34n3K48l78J70R4
$$ -4 -102 44 198 -175 271 32 -76 74 -69 199 14 -6 154 -46 -220 139 -95 -148 100 -278 -108 -14
4561a4Q4j74o0K30k89L7K01j79j06K62M24k32j52j02J53j47J30J79k75J13j73
$$ -14 70 -104 -164 66 -223 -186 15 -164 -270 -8 416 184 32 -70 83 -64 66 245 -30 83 -90
4582i0l35M29J43k31R7m6J32j25rl4J65k07J54p0j50q9K26m3j60J69K09m34K79
$$ -90 -425 4 147 -84 13 -33 99 -26 -35 -69 96 -111 43 -27 -177 -266 -40 -83 -243 -74 135 -299 -20
4605b0Q0q0J09k27K54j94l8O8K17p1l60K97J4mk30O6R3K3q2J49L1j33K04j09P7
$$ -20 60 -20 89 -138 116 -78 -116 -48 169 98 -262 35 49 45 -185 -119 -26 -3 -85 64 95 -38 166 57 134
4630A34k83M02l45J47O7j13L8J79j58L5k25J4K46rJ2j20l50L45J19J81m01l7J65
$$ 134 -149 253 -92 55 122 9 47 226 68 103 -122 -108 138 129 141 21 -329 16 135 316 -85 -122 43
4653D3p4K05k99J03j76J90K06q3j29Jj7LLj14J20p1K26k49N8J68n6j16J46M2k16
$$ 43 -31 174 -125 -22 -198 -8 198 115 -14 -13 -30 -27 -24 -138 -18 -89 137 -112 -54 114 58 -58 88 130 -86
4678h6k20L15p8J2J84j13k4k3M58o46L59j46P20j572M31N46J62m76K58j82j24
$$ -86 -306 9 -69 -57 127 14 -10 -33 425 -221 138 -8 712 -860 -429 117 279 -197 61 -121 -245
4699b45m1J06K02k15M37k09l09J69J52k03K12L6L9k20N6K67j7j97j82Q8L36k66
$$ -245 -286 -180 22 -193 244 35 -274 -105 47 -156 56 92 131 -89 -33 234 217 20 -162 -74 262 -4
4721dP4J18p72J228q65m91Q49l55O24n51L82j85K44k67k51M1K48m73K05J53J71
$$ -4 70 188 -584 644 -221 -712 137 -218 406 -145 237 52 296 29 -222 -181 67 -406 -201 -48 123
4742A23k14M5k2P9J39j42J6Q7j6L6n3p6L7k4j85J83J58j84j84J09J65k32K78j83
$$ 123 -91 -46 -68 11 150 8 24 111 95 131 78 2 39 15 -170 13 171 -13 -197 -88 77 -155 123 -60
4766f0L0K07m15L43j51N97q23J51K64o16Q09l03l21K53P6j83M44m42O42j144K24
$$ -60 -30 177 -238 105 -46 551 -272 -121 143 -473 336 33 -288 -35 41 -142 302 -140 502 -642 -418
4787d18K43n6L91r05R29j48M57m89L69m47K6Q4k23Q43j251L32J22l31J93J13J22
$$ -418 -175 -231 160 -745 184 36 493 4 373 -74 -48 36 -187 656 -595 -263 -141 -472 -279 -166 -44
4808d4MK20j59j60o8K92j18l4l02O16l12J93R3j65k50J71j9K72k70J35j36J43
$$ -44 -40 180 21 -139 -207 85 -33 -67 -369 247 -65 128 221 56 -194 -23 -42 230 -40 95 -41 102
4830A02k19j79J07K12j52P9j35j00k13O42J90J63l83k41K19k59k56Q7O61k59m8
$$ 102 -117 -296 -189 23 -129 -50 -185 -285 -498 144 334 497 114 -127 92 -167 -423 -336 325 66 18
4851A8J22o11N42l3k6K71l77j1K07k64M15P9k60K45m25K8k72M0J74K42j05M0J34
$$ 18 140 -471 71 38 12 283 -94 -105 102 -162 253 332 72 317 -108 -80 -352 -312 -138 104 -1 39 173
4874A73m4l0n7j44m06M89J36j7j59J31K7l20J01J38J30j07l41N54m0L03q66R78
$$ 173 129 99 42 -102 -508 -19 117 100 -59 72 99 -221 -120 18 148 41 -300 254 214 517 -349 629
4896F29o72r17Q49L3L10k67O67l10P7k38n93M69l87j86l43J190N49j905R80n42
$$ 629 -43 -960 -111 -78 232 -35 632 322 399 161 -432 37 -350 -536 -879 311 860 -1045 -65 -607
4916f07N12j73k42O26J0n6j27J39J28j29J74l99K28k02J40j27J88m8J04J0q0p3
$$ -607 -95 -268 -510 116 126 70 -57 82 210 81 255 -144 84 -118 22 -105 83 35 139 149 69 -4
4938dl7l7P9l79L56K05L94o44j1K77p30N18o1L57m99Q1N5K59l04J10p5J0J48j7
$$ -4 -41 -78 1 -378 -22 183 577 -67 -78 199 -531 -13 -74 283 -216 -135 -80 179 -125 -15 -90 -80 68 51
4962E1n8J12r8o6o3J40j35K79j12j80L32j76j44J75r0J82J32l49Q6nk38L48n3
$$ 51 -7 105 7 -59 -122 18 -117 162 50 -130 202 26 -118 57 -33 149 281 -68 18 13 -225 123 70
4985G0k82P2J5%L42j42K81o44L60J11k45M7j13N8L20k63q9J13J17k65J78k8o1
$$ 70 -212 -140 -125 -125 217 75 356 -288 72 183 -62 -15 -128 -70 250 -13 -102 11 128 -137 41 13 -48
5008d8rK79j83p3K6J8N1K1k7k87K24R7k0K91l81j73J74J49j59j20K81l73J49m5
$$ -48 -57 222 39 -34 -8 10 61 82 55 -232 -8 89 69 360 -21 -194 -20 129 -30 -150 131 -242 -93 -138
5032a38J89p1Jj56K91n9k7j01L19j22l06LJ79j76J06J49r7j42M1m9P8J40R1J35
$$ -138 51 -20 -19 -175 116 57 30 -71 248 126 -180 -177 2 -174 -68 81 -16 -158 -117 -166 -88 52 143 278
5056B78k11k18j39L59L7P4o6k96N62q9l80J19O8j08k1r7K41j43M8K04o6j53k1
$$ 278 67 -151 -290 69 106 180 114 -182 380 291 -89 30 98 -10 -31 -128 113 -30 18 222 156 3 -18
5079a8j90L44o3Pq3l29L14J0k36L42j36J19j13j51P5J85k32J19k9k98J47K06l7
$$ -18 -208 136 73 80 -3 -332 -18 -8 -244 98 -38 81 -32 -183 -108 77 -155 -36 -65 -363 -216 -10 -47
5102d7q0R1rm3N25n43P9m6P6N5j58K52l7j75Q6J60l31M06j58k56K31k31OK18q6
$$ -47 -127 -36 -45 -88 437 -106 -27 -73 3 58 -100 152 115 -60 26 186 -145 261 103 -153 78 -153 -147 71 -15
5127a5M8j32n6K91Qj14J96j36j92j23N88m11J44l35m0J08J46Jq2NM9pN8J29k38
$$ -15 33 -99 -155 136 144 30 226 90 -102 -225 363 -48 96 -239 -279 -171 -25 -24 -106 -101 -52 -59 -1 128 -110
5152a10J97j05M9j36L2J37K14l12K31n55L54O3J0l04K59L20k22k50R9K92k41k05
$$ -110 87 -18 31 -105 -73 64 278 -34 197 -358 -4 59 69 -235 24 344 122 -128 -29 263 22 -183
5174a83J16m9J84M51k96j29j52J78l95J4R2K08Nq9p9j8q3K01l8K35m66J70J22
$$ -183 -67 -116 68 519 223 94 -58 120 -275 -261 -169 39 44 -45 -124 -142 -225 -24 -62 173 -293 -123 -1
5197aj16K56l1kj93q0MK9J10k62J30J62j84M0J10O0m3p1J19J22N6k75N9k07j6
$$ -1 -117 139 108 106 -87 -167 -163 -134 -24 -286 -156 6 -178 -138 -28 32 -11 -82 37 159 215 -60 -1 -208 -224
5222b24J42j76L92q9N5j15k09K24q2J89j21m09N40k49L00o2j44r9J53P8J50n31
$$ -224 -82 -258 134 45 100 -15 -224 0 -82 107 -14 -423 117 -132 168 106 -38 -137 16 94 244 -287
5244b87M89l13Q0k19O08l44j78K45Kk98k53N59K51j47J93j49j16n91Q78K93p38
$$ -287 202 -111 -31 -250 358 14 -164 81 83 -215 -468 91 342 195 388 239 123 -468 410 703 -35
5265c5N21l11j09K18m33J96n79Q96m5m04J43o22O25Q29p53q75J090r2o59m70Q00
$$ -35 486 175 66 284 -149 47 -532 364 319 -85 58 -564 61 890 137 -738 352 260 -399 -869 -69
5286f9K39j31j35K1k8L52Q3l12k55M48K20m95j12J45J79j52JJ15m16L54j28L41
$$ -69 170 39 -96 -75 -103 249 332 20 -235 213 433 -62 -174 -29 150 -2 -1 114 -302 52 -76 265
5308B65k23K06m86K14J41J26l41M5P1q9j84L12Lq6N7k84M35j89M4l4o0J46l02
$$ 265 42 248 -238 -24 117 243 -98 -53 18 -71 -255 57 60 -26 31 -253 182 -7 37 3 -57 89 -213
5331b13R6j13K70J6J46k91J21j90K49k66J16o6M63l47m0k66L30j42k5o1j5m1L57
$$ -213 -117 -230 40 56 202 -89 32 -158 91 -175 -59 -125 338 -9 -49 -315 15 -127 -152 -213 -228 -269 88
5354H8K25p86M8L82l27L57O16o52J09K41j82k85j54m7J65L42m40J74K44L39m39
$$ 88 313 -473 -425 -43 -370 -13 603 -49 60 301 119 -166 -320 -367 -202 140 -300 -126 118 457 18
5375A8J01l6m8m4M35L01r33L7K3N12m23J7J82J59p80M90m03j05kJ44J12n19P36
$$ 18 119 83 35 -9 426 727 -206 -169 -146 366 -57 -40 142 301 -479 11 -392 -497 -499 -355 -243 -762 -26
5398b6P4J64m15J268n37R0m61k50j16J505r10m18K37l62J29n52m08J065o28L28
$$ -26 48 212 -203 1065 528 618 157 -93 -209 1296 386 -32 205 -157 -28 -580 -988 77 -551 -223
5418b23j99Q45m72%q2m24O54o19P95j40m15M95O14j337L9M94o24K79O41o32M91
$$ -223 -422 423 -49 -49 -131 -555 99 -520 275 135 -280 215 829 -508 -469 25 -599 -320 321 -311 180
5439A80m56O33K58r76K55m50O2K15P67j095J265k36o41J63O91m97n00J88N37m07
$$ 180 -276 357 615 -361 -106 -556 -494 -279 488 -607 658 422 -219 -56 635 138 -362 -174 363 -44
5459d4K54O08K19j754O23l1M10l18M0K02j259J066K1O5J47q8p03O65m74L33O02
$$ -44 210 818 1037 -717 -94 -125 285 -33 7 209 -1050 16 37 102 249 161 -542 123 -351 -18 584
5480E84o12Q4k9j6M2O5j83K35k02R4O3k84L29j41k26L62l46R4J03j94M33j42R2
$$ 584 -28 56 27 11 53 118 -65 170 -32 62 125 -159 170 29 -197 165 -181 -87 16 -178 255 113 205
5503B05j39J31K21o92N30o65N55k5m17K99M75m70l21O76l26l4O93p69M13k69j56
$$ 205 66 197 418 -274 256 -409 146 121 -296 3 478 8 -313 363 37 3 696 -73 340 71 -85
5524h5K42q9O4k36J5J61Q5j98Q8K8j11N5q5P5k6Q2l42N44j79N7j6m03L87m30J89
$$ -85 157 68 132 -104 -89 72 157 -41 47 75 -36 19 -66 9 -17 65 -277 267 88 145 129 -274 113 -317 -128
5549a28K24jK94m46P8j15N5R4j74K17j69O2j44Q8J78q2M6m9J52q8k24L42j38j75
$$ -128 96 95 389 -57 21 -94 -39 55 -119 98 -71 -9 -153 -65 113 31 77 28 180 92 -132 210 72 -103
5573a03K72K1j29L7k80K27mj18l4N9O6l3%K04l49L96j58j57J63L66o47K95k73
$$ -103 169 190 61 98 -182 45 41 -77 -111 -52 14 -19 -19 185 -164 232 74 -83 80 446 -201 94 -179
5596a79J91N1m98L52k55K23j88J25Q8K83m15K55k60L21N7k11n4J32K94o7j0k35
$$ -179 12 63 -435 -83 -338 -115 -303 -178 -90 193 -222 33 -227 94 151 -60 -114 18 312 245 235 0
5618@l16J12L38j46K08Q7k78Q0K1l64L32m9j0qq4q9L33m56J91N09o96J68K51k71
$$ 0 -316 -204 134 -12 196 283 5 85 106 -258 74 25 15 7 -77 -166 167 -289 -98 411 -285 -117 134 -137
5642a37O6k14P6J93J31j53K00l87O8K50J22l43Q8K70j05m49M19K6k20K45j43j67
$$ -137 -71 -285 -209 -16 115 -38 162 -225 -157 93 215 -128 -40 230 125 -324 95 121 -99 146 3 -164
5664a64J96Q0j25K2J41O9j39K5j89L26j66n6j35K07k81J38p9N2L38m87L76j03
$$ -164 32 112 -13 9 150 219 80 105 -84 242 76 20 -115 92 -189 -51 -130 -78 260 -227 149 46
5686D6k57L30O8j42l95L76j00j81K68m8p4j28N27L2j73J75q04J201q73Q13J46
$$ 46 -211 119 187 45 -350 26 -74 -255 13 -35 -109 -237 290 322 149 324 -480 721 -152 661 807
5707H07o94O43j025O36n3l79k59R90l97r19L19j31R2N13P3j87r5m3j96N48J61
$$ 807 113 756 -269 367 314 -65 -324 666 269 -650 -331 -462 -370 143 216 29 -66 -109 -305 243 404
5728D04n34M81l93j58R08r01q1J42N06l81J37o02N69k07L90j61k46j29J57k85
$$ 404 -130 351 -42 -200 708 -193 -274 -132 374 -7 130 -472 97 -110 280 119 -127 -256 -99 -384
5748c84l65O79M6K68n78M89j22j49J65l1j58M33m17K83j00oj78K72j91J22K7k41
$$ -384 -749 -70 -24 244 -334 155 33 -116 49 18 -140 293 -124 159 59 53 -125 147 -44 78 105 -136
5770a36K04j83L7p0J80l9J54j65j31L7J04k2m9m7l0M2K87q4jP9j73J39j21l2L18
$$ -136 68 -115 -78 -148 32 -7 147 -18 -149 -112 -8 -30 -79 -126 -156 -114 173 89 88 167 -6 133 12 -20 298
5795B98j22j00j71L03j63L0K32j10l94J54J46J2k88J04J42l1j80J44K78m14R3
$$ 298 176 76 -95 208 45 75 307 197 -197 -43 103 115 -173 -69 73 42 -138 6 284 -130 -37
5816c7J1J4M00k88O2j45j65J53L36k94J30k79L26l04M5J4M0k3q3K41l2k60N8M4
$$ -37 -26 -12 388 100 162 17 -148 5 341 47 177 -102 224 -80 -35 -21 19 -4 -87 154 122 -138 -80 -36
5840c6K29l08K27k44J82l5l50J44M45n85K70P7K28m39j52P29p67R64p24N03j95
$$ -36 193 -115 112 -132 50 15 -335 -191 254 -331 -61 16 244 -195 -347 382 -385 579 -145 358 163
5861A63l12O8N91l75l7j32m44k17M47J4J63k18l77J6N97k08m22N84N56J23k34
$$ 163 -149 -81 510 135 98 -34 -478 -695 -248 -234 -71 -289 -666 -650 -53 -261 -683 -99 457 580 346
5882C46p63J045o69k07J196n79Jo68O30m07J42k64L6k88M57N78m25M96k84o00
$$ 346 -417 628 -41 -248 948 369 370 -298 332 -75 67 -197 -161 -449 8 586 161 657 373 -227
5902b27K09O44p75L28K12m65L68K68m92l98N02l53k8N30n71K75n20R67k56j59
$$ -227 -18 626 -149 179 391 -74 294 562 70 -328 174 -179 -207 323 -248 27 -493 474 218 59
5922E9K55m70M42k73l3o15l25j41J287r96J020N2n37P45r97M95l49j21J132o28
$$ 59 314 -156 286 13 -20 -635 -960 -1101 186 -810 210 262 -275 470 -527 -32 -381 -502 630 2
5942Bk99K50j93R00r63K96L17l10K65o73L28J88p3k05m97M92R8L98l46L62k03
$$ 2 -297 -47 -240 660 -303 -7 310 0 265 -408 -80 108 35 -170 -667 -175 -77 321 -25 337 134
5963A34k27M85o51M37k57L03p08L06M93p84j52R86k84j64K11j14k38J69M3k5J58
$$ 134 -93 392 -259 178 -79 224 -484 -178 315 -469 -621 365 81 -83 128 14 -224 -55 -12 -37 121
5984A21J44q9k51P8l6P7K23l07Q3J43m91O36j19j09m7j0pl91K01K85j07K5l61
$$ 121 265 176 -75 3 -33 44 267 -40 43 186 -305 331 212 103 56 46 39 -352 -151 134 27 52 -309
6007c09J6L30k17J37J89m09J77N14j60k17M11q74J98M55j93k4j38mJ07J16r5L28
$$ -309 -293 37 -180 -43 146 -263 -86 428 268 51 462 -412 -214 241 48 24 -114 -118 -11 105 10 338
6029C38m04M92n29K26o6j5K4M4m49K30Q8K15L36o00L48k21p1k04L5R0O1r8J77
$$ 338 -66 426 -103 123 57 42 66 110 -339 -109 -21 194 530 -70 278 57 -14 -218 -183 -93 -32 -130 47
6052D7Q9q8o4j56L65k67N8j52J83j5P7K48m95L57J5q4M5J55j24L0kp7j02p6J05
$$ 47 136 48 -16 -172 193 -74 -16 -168 15 0 77 325 -170 187 202 118 163 318 194 224 222 145 43 -33 72
6077G2K31l16J9J34j94J73J1j68l71M74N5o09O15q3K05l96O1J12K22j11l44N00
$$ 72 303 -13 6 140 -54 119 130 -38 -409 65 120 -489 126 43 248 -148 -87 25 247 136 -208 292
6099B92j21k39j14L72l15K09j70J4j12L04k77l6L09L6j81p0J4L0%r5L4K10l66
$$ 292 171 -68 -182 190 -125 84 -86 -72 -184 120 -157 -193 116 152 -29 -99 -85 -55 -55 -150 -116 94 -272
6122b72L75l57J06J47j69J0K56l0Q1j64P1n1O4n2p8j82J62J44O8l0j84j63L51
$$ -272 103 -254 -148 -1 -170 -160 96 66 147 -17 54 3 67 15 -63 -245 -83 61 129 99 -85 -248 103
6145A03l2n06P86m30J9J16j8J0O1k55L50l08k55K47J74J06k50K19j38K7k8K65
$$ 103 71 -435 351 -79 -60 56 38 48 109 -146 204 -104 -359 -112 62 168 -82 137 -1 26 -2 263
6167B63q6k23j41J07O6J90j79J37k96J38K56r8k38J64j36%m0R0l29L91j40J10
$$ 263 177 -46 -187 -80 -14 176 -3 134 -162 -24 232 134 -104 60 -76 -76 -116 -26 -355 36 -104 6
6189FJ86j83j65K71p2R5j78k17J60J77k3j92K88l21O45l52m6l03L5K39j7l2J97
$$ 6 192 9 -156 115 43 138 -40 -257 -97 80 57 -135 153 -168 477 125 79 -224 -189 50 33 1 198
6212A98k00j9L68J03k69n9k74J91L8J7mJ23k39j99K63l2P0l41M22k77K01K26n28
$$ 198 -2 -21 347 450 181 122 -152 39 77 94 90 213 -26 -225 38 6 76 -265 157 -120 81 307 -221
6235b21K8j75O52k71l23N3L08k93N55m56R9%j90L10n9l27M67j20j6k04M27k91
$$ -221 -193 -368 284 13 -310 -257 51 -242 313 -143 -44 -44 -234 76 17 -310 157 37 21 -183 244 -47
6257d7k45L89k09J14Kjn2o8P5p2K69k17l8K17k03l8o9K36j72L01j09J1k6P3r3
$$ -47 -292 97 -112 2 4 3 -49 -117 -42 -114 155 -62 -100 117 -86 -124 -193 43 -129 172 63 74 48 121 28
6282B8N5r9N6J82k82N2M6K6p0j63o6J90J88j36L7R4J3k08J61j64L49j18k24n56
$$ 28 83 -16 40 222 -60 -8 38 64 -6 -169 -235 -45 143 7 44 138 151 -57 104 -60 289 171 -53 -609
6306f09J454n84N22n46k29Q1o97J095r17Q15k99q19N57N06n77j85j6N5o0K51K76
$$ -609 845 261 783 237 8 89 -608 487 -430 385 86 -733 -176 330 -247 -432 -448 -393 -453 -202 74
6327G4K36j48k53n7R9n09L61K98l64M30k16OK41j6k20J50r5o7l4m6K9P0k85P63
$$ 74 310 162 -91 -148 -49 -558 -197 101 -263 167 -49 -43 198 182 -38 112 17 -50 -84 -130 -101 -31 -316 447
6351D47j70l0n49J1J027r89L51j81J34k59O01k51k23J30L64m53J64n16L35N4M4
$$ 447 277 247 -302 -291 736 -253 98 -83 51 -208 393 142 -81 49 413 -40 124 -392 -57 -3 41
6372D1O8L5k96r0O00k87j63M07o06K83K11l11L87l17k63J09J9J71K60k68j02J2
$$ 41 109 144 -152 -242 358 71 -92 315 -291 -8 203 -108 279 -38 -301 -192 -173 -2 258 -10 -112 -100
6394a00J18K45j97pM81j110O35K36n47N1L54l71N4J23m0J21k9q1J12j12J32k69
$$ -100 18 263 66 59 540 -570 65 301 -246 -195 159 -212 -158 -35 -75 46 17 -64 48 -64 68 -201
6416b01k7J70J37k30%P7K57N1j44O9J34n52L81K28o01K55Rk17L83m84o8J22q4
$$ -201 -228 -58 79 -151 -151 -74 183 234 90 159 293 -259 122 350 -251 4 13 -204 179 -305 -373 -251 -335
6439c35k05L84J396r83k41K9k17k37J5M74k28R5K30N2l57L76j98J53j91q2k80
$$ -335 -540 -156 1240 257 16 45 -172 -409 -394 80 -148 -53 177 229 -128 248 50 203 12 -70 -350
6460c50K90K72j82m9j2R8j66J80J09n10L82k27K07J6j9j54R3m8Q7j31%N9Rk00
$$ -350 -60 212 30 -19 -31 67 -99 81 190 -320 62 -165 42 58 39 -115 -22 -70 17 -114 -114 -55 -46 -246
6484b46N25l08q0K53j50j9Kq7R1k19L70qJ5L30m85J13r6j41J44L0k03J67J39j98
$$ -246 279 -29 -109 144 -6 -25 -23 -110 -19 -238 132 124 139 469 -16 97 1 -140 4 34 -169 -2 137 -61
6508f1J04j35MM8O8K00m95J02J43n0q2K27N7k53J04k50L00j74K19j87K73r0l66
$$ -61 43 -92 -88 -40 28 228 -267 -165 -22 -72 -154 73 130 -123 -19 -269 31 -143 76 -111 162 72 -294
6531b94L10j86O0Q7j07J21J07k59m9L79l47MK46nl2J89l31P7J25j59p3L82p3l2
$$ -294 16 -170 -110 -23 -130 -9 98 -161 -210 169 -178 -174 72 67 35 224 -107 -30 95 -64 -137 245 172 140
6555A40j42k8J16k50m8J21K05j91J18J62j25j27L2J0N1j75j7l4K53j58J99m32
$$ 140 -2 -30 86 -164 -212 -91 114 -77 41 203 78 -49 -17 -7 44 -131 -148 -182 71 -87 112 -320
6577c20M62M1k8j15L5Q0j28J0n5k37J33R7L60j51m4l38K00J5r4K03m6j80J9n2
$$ -320 142 183 155 40 75 155 27 37 -18 -255 -122 -25 335 184 140 -198 2 17 -77 126 80 -100 -81 -133
6601a33K28j06K4r5L7j6J47l38L40M6m90L74j71J85L08j31n41N31r4l28K25K28
$$ -133 95 -11 13 -82 -45 -61 86 -252 88 134 -356 18 -153 32 340 209 -332 199 105 -223 2 230
6623B30m34J09p8M42l63J73l27k0J09J13J0L9j15J85p8n1m1J31m5J70j72j23j15
$$ 230 -204 -95 -173 269 -94 79 -248 -268 -159 -46 -36 3 -112 73 -5 -56 -97 34 -11 159 -13 -136 -251
6646b51L66Mm55O95J47n06L70r7k2o44m8j19O92JK0n56J20L69k00mJ26k04J30
$$ -251 115 119 -336 359 506 0 370 273 251 -393 -441 -560 132 133 153 -403 -283 86 -114 -118 8 -196 -66
6669f6J24O9%j44J6j5M56m86k0k91M45q2m8j16J20M8M8j39L82l46j14M1J64R9
$$ -66 58 127 127 -17 -1 -16 440 -46 -66 -357 88 6 -42 -158 -38 10 58 -81 301 -45 -159 -118 46 145
6693A45l73j17P3N31j43r2J6N9j97O45n16p8j70M05m64M9N74q54M49k3k10M30
$$ 145 -228 -345 -272 259 116 24 40 99 -98 547 31 -47 -217 188 -276 -227 347 -507 -58 -81 -291 139
6715A39l89M63J97l55n7m3L72J19p24N08k21n9L64l97L51n11J45k48O34k21q7
$$ 139 -250 213 410 55 -2 -45 327 446 -278 230 9 -50 314 -83 268 -243 -98 -346 288 67 -20
6736b0L61k68l44M83k51j15L29m10j43Q23J71p65Q9K98n23P4O03k51k50N46q94
$$ -20 341 73 -271 212 -39 -154 175 -235 -378 445 616 -149 -60 238 -285 -211 392 141 -109 437 -457
6757d57O13p87L82M76j90j20m87J241j031P06j571O65J382p94L28N8k57q74J468
$$ -457 156 -631 -249 227 37 -83 -570 671 -360 346 -1225 -560 822 28 356 414 157 -717 751
6776G51j286Q43l73l18P17n46p7M92j5k1M36o83L39k95K97j011O06l8J19o2J81
$$ 751 -535 308 -65 -383 334 -212 -289 203 188 167 603 -80 259 -36 261 -750 -144 -182 -63 -125 56
6797E6k76N78J11k57R0p86L26N54j3J27q49K17j33k05N40m35N20rn8j96K06l1
$$ 56 -220 358 469 212 302 -484 -158 396 383 510 -339 -122 -255 -460 80 -355 165 156 98 -98 108 77
6819G7J79l62J61J0N7P5l36P3k1K54Q5m50K24Q6l8j42K00J57k42k04l6K20K03
$$ 77 256 -106 55 65 122 197 -139 -66 -87 167 252 -198 26 112 74 -68 132 289 47 -157 -193 27 230
6842B30qk59J51k47N1J50q4L42r7j22j15O7k97R7R3k29L85n7K58k97r2M26p7m91
$$ 230 222 -37 114 -133 -82 68 -16 326 229 107 -8 59 -238 -141 -48 -277 108 51 309 12 -80 346 269 -222
6866b22M04j68j21m40J112p3k40o87L93m14Q96m54p1j55l9R1O8m20M51J23k32
$$ -222 182 14 -107 -547 565 492 252 -435 -42 -456 440 -14 -85 -240 -279 -188 -120 -540 -89 34 -198
6887a98p2J71m6k0J3M00l3L1j07l35L60k33J09n0k54L10J43j04k71K45M1O7l3
$$ -198 -270 -99 -145 -165 -152 248 215 246 139 -196 164 -69 40 -10 -264 46 189 85 -186 59 100 167 134
6910A34J34m05j38K15K94N2n5n66K29K01o3r6J55m14M09lj30K8P5P5j11pk14n7
$$ 134 268 -137 -275 -60 234 286 231 -335 -106 95 32 -64 91 -323 86 83 -47 -19 56 131 20 13 -201 -258
6934b58K68J67l03j9p9M40k93O4R5k62L96m69N67j43j77O4n8j8K6q2p4N03n13
$$ -258 10 177 -126 -145 -224 216 -77 -13 82 -180 216 -253 314 171 -6 58 0 -18 8 -74 -148 355 -158
6957a58J91o4l2K59l33l6N67k81J7l4J04P4j94n1j51K22JK07k9m00o3J51O5k08
$$ -158 33 -31 -63 196 -137 -173 394 113 130 96 200 274 80 29 -122 100 101 308 279 -121 -184 -33 32 -176
6981a76K05j55K51l88N34k31m0O5J49j80J0j15J72j35n7J72k3j10J63J28k61M4
$$ -176 29 -126 125 -263 271 40 0 65 214 34 44 -71 101 -34 -91 81 58 -52 111 239 -22 22
7003B2j49j48L48r2j78L00P2j40K85o40M92l27L18r6k31l2K65l52K59J18J10l55
$$ 22 -127 -275 73 -19 -197 103 175 35 320 -320 172 -155 163 67 -164 -196 69 -283 -24 94 204 -151
7025a51RpL41j78l21Q4Q5K36j84j51N30l61N1P7k9J6L9k65J59K9m1K24m46J62
$$ -151 -142 -149 192 14 -307 -223 -138 98 -86 -237 293 -68 -17 60 31 47 86 -179 -20 9 -32 192 -254 -92
7049i2J56j00K14JJ07j30k43k2J13J53r9j15J6N1k76J75K5j62J86K64l1L2l02
$$ -92 64 -36 178 179 286 156 -87 -109 4 157 58 -57 -41 10 -266 -91 -66 -228 -42 222 191 223 -79
7072g9K35j56K73p9j92p1q8K18k62K36j92o6K64j3k7n4K45k01k7K5k07M2K32K1
$$ -79 156 0 273 194 2 -69 -157 61 -201 35 -157 -223 41 28 1 -53 192 -9 -36 -11 -218 -176 56 77
7096G7J84o62L70JO8J79o3N3j15q5j45j7L02j61j06J86Q0j78m7J37j77j3K97J28
$$ 77 261 -401 -31 -30 38 217 154 207 92 7 -138 -155 147 -14 -120 66 146 -32 -79 58 -119 -132 165 293
7120B93k15j06Pj28J08mJ62K41l15J31k30O6j63J08m1QO4K13l48J78k55R6M19
$$ 293 78 -28 -21 -149 -41 -45 117 358 43 174 -56 10 -153 -45 -86 -78 -14 199 -149 29 -226 -130 289
7143B89j65j15J37l43L13N8n2k42O7J41m8O7m1j76J68k62J6K06n2J11j2o8N3l
$$ 289 124 9 146 -197 116 174 122 -120 -53 88 40 107 66 -110 58 -204 -188 18 -34 77 65 -3 50 47
7167D7k53K78l67L65p1L20l43L6k28l8L66q3Q6N1O9j63k87L98P55j720P82K91
$$ 47 -206 72 -295 70 -1 319 -24 12 -216 -254 112 29 115 166 235 72 -215 183 938 -782 0 291
7189B91j222N45j43P46N33p50K55k10K13r3j52J8o7j28j75L17L12m67L87r4L2
$$ 291 -931 -386 -529 217 750 0 255 45 258 165 13 31 -36 -164 -339 -22 290 -177 210 116 148
7210A48j54m6K71k74k3L38k51j44J03L01r3k38j07R6n7J45j80J49K26k48j57R0
$$ 148 -6 -52 219 -55 -78 260 9 -135 -32 269 176 -62 -169 -73 -130 15 -165 -16 210 -38 -195 -105
7232a05L23L1j04k6P5J60l16k7J2m9K48j11q2l2J77L1l25O3n8J14j45J54K2k02
$$ -105 218 249 145 119 194 354 38 11 23 -26 222 111 29 -3 174 205 -120 -57 -115 -1 -146 8 30 -172
7256a72J78pk67J68J95L3j09q7j17K31j2K2J21m04O12q8p76Q46k76k88K35L29
$$ -172 6 -1 -268 -100 95 128 19 -68 -185 46 34 56 177 -227 385 297 -479 367 91 -197 38 367
7278C67k36q0J98l23O0M9J0l37L34j4j41L37j89q4J08j28r6j17M20k3J51l79m3
$$ 367 131 51 249 -74 -14 35 45 -292 42 28 -113 224 35 -49 59 -69 -165 -282 138 115 266 -113 -156
7301a56K16MQ8j17j62j88K43P7J97j78j14J80K23k90n0P8R9l64J04R1k38L16l3
$$ -156 60 64 152 35 -127 -315 -72 5 202 24 -90 90 313 23 -27 51 150 -214 -110 -19 -257 59 26
7324B6J5p3q9O6O3P0o3N2jJ09j72l7K2K9j61R6J6j18k8O4K2j23M33k7k8k07K06
$$ 26 41 -32 -121 -55 8 78 15 67 66 175 3 -34 -12 17 -144 -48 -32 -150 -178 -114 -92 -215 218 191 163 -44 162
7351A62q5q3K4j08J65k42L59l99L94j84K09m49N35l23Nr75J058O93j030R77o47
$$ 162 77 -6 18 -90 75 -167 192 -207 187 3 212 -237 298 -25 -20 -995 63 756 -274 703 56
7372E6j92L85l81J47N32J89m37k60J48o2K25K24k203K230N75j773J740j802K17
$$ 56 -136 249 -132 15 547 736 299 39 187 125 350 574 -1629 601 1176 -597 1143 -659 -442
7391d42Q00J65m17L96l69m86O94m51o65J101j94R0n57J283p40o50J056j134J205
$$ -442 358 523 106 502 133 -353 341 -110 -775 326 132 222 -335 948 208 -442 614 -520 685
7410F85l36L40o49J16k70m01J443o13k00Q36j630P8M04P32oq19Q29p8o87j05O02
$$ 685 349 689 40 156 -114 -515 928 315 115 951 -679 -601 -197 535 529 -290 539 461 -226 -331 271
7431B71j84j89m49K47M36kJ33r5j0j11k77M56j28j48K51l72M24o61N21n10L80
$$ 271 87 -102 -551 -304 132 130 263 168 158 47 -230 226 98 -50 201 -171 253 -408 113 -397 -17
7452a7j45k67J77j09L81l39L18q71K27L67m91O44j03j36Q23m03K13m75J77J79
$$ -17 -162 -429 -252 -361 20 -319 -1 -872 -645 -278 -769 -125 -228 -364 459 56 269 -206 -29 150
7472A50m94J7J0O8K0K73K28k32q2j09K8r0L97j06J42L5J54m02j16M69o66J98O48
$$ 150 -344 -327 -317 -249 -229 44 272 40 -42 -151 -123 -213 184 78 220 255 409 7 -109 360 -306 -108 540
7495E40j73J42l95M51o19Q23r08n7N5K84L28j188O21N10r13J86N97l63O42L55
$$ 540 367 509 114 565 -54 769 -139 -196 -141 143 471 -717 -96 414 -499 -313 284 -79 563 918
7515I18j059R6P39M04j589R33n27J50l70L10j17K4Q3J02O5l43K11k91P28n86J82
$$ 918 -141 -45 694 1098 -491 442 -85 65 -305 5 -112 -88 -5 97 162 -181 30 -261 467 -119 63
7536F3r1K63l52L36m3m45m9N62k27L9j62J85l68J03o3o6L70J61N45j006K39P7
$$ 63 -28 235 -117 219 176 -269 -318 244 17 56 -106 79 -289 -186 -249 -315 55 216 761 -245 -6 71
7558G1j65O24r0p69rJ28k98N23O4J84O7j2j07J21n90K69K46j340J113k06M08M41
$$ 71 -94 530 440 -329 -338 -210 -508 15 79 263 330 318 211 332 -258 11 257 -1083 30 -176 232 673
7580F73j018K45qk58k63P98O27j440J66J374p69K79m71l64N72l81J02K63K59n41
$$ 673 -345 -100 -108 -366 -629 169 796 -644 -478 896 127 406 -65 -429 143 -238 -136 127 386 -155
7600a55j107O01M43K96L8k3J7j21L42r05N08O6j46n04O14j9J03J28K08n37K33
$$ -155 -1262 -661 -218 78 116 93 110 -11 331 -574 -66 0 -146 -650 -36 -55 48 176 384 -153 80
7621H0J92m58O51p19j38P9J62N15m32oO9j3R5l61O8L42l13K61p8J95k30m8K32
$$ 80 272 -186 465 -254 -392 -313 -151 364 -68 -74 -5 -18 77 -284 -216 126 -187 74 -4 191 -39 -87 145
7644A45n69K40J2n7O40k80k3J67j84l81J45K57q8k03J83m5Q4P4m29N9K80J72l19
$$ 145 -424 -184 -172 -229 411 131 108 275 91 -290 -145 112 24 -179 4 -41 43 117 -312 -253 27 199 -120
7667a20J08j98J34m0k21L39o0Q3m4Q5J17k09j31P8K61j80k57m8P00j26l68J18
$$ -120 -12 -210 -76 -116 -337 2 -58 25 -19 66 183 -26 -157 -79 182 2 -255 -303 397 271 -97 21
7689B1j14K05k39J09J14k49K70L6k23L3m7K32l7n47r8M99k1J83n6j72J49k04J17
$$ 21 -93 112 -127 -18 96 -153 117 153 -70 -37 -84 148 111 -436 -534 -35 -56 127 71 -101 48 -156 -39
7712c9j25K10r9K03k36K78k21K91j43k33L11l65l6J99m6L0R2j6j82k2J06L5l6
$$ -39 -164 46 -53 150 -86 192 -29 262 119 -114 197 -168 -204 -5 -51 -21 71 55 -127 -149 -43 -8 -44
7735d4l04M96k99N40k45J58n95L08q7J76j5l73L03k86K46L31k04j96O8J50n7k79
$$ -44 -348 148 -151 389 144 302 -293 15 -72 104 89 -284 19 -267 -21 310 106 -90 -22 128 71 -208
7757b08Q6J99n6J37n14N46m56K77M9j09K9j43M37j81l05N21k95J48l85K77r3q1
$$ -208 -122 77 21 158 -356 190 -266 11 60 -49 -20 -163 274 93 -212 309 14 162 -223 54 -39 -120
7779a20K66p5r3j07L60q8J53m40J56l39L70L7k34J90m2J22k28N0J74l06J36q1
$$ -120 146 71 -22 -129 231 143 296 -144 12 -327 43 80 -154 36 -6 116 -112 -62 112 -194 -58 -139
7801a39N2K07l23L18j65L38o8l76L23k44J3K9JJJ3j07K40J21k68j34K90n6j10
$$ -139 -87 120 -203 115 -50 288 220 -156 167 -77 -64 -35 -34 -33 -20 -127 113 234 -34 -168 122 66 -44
7824d4K46m46L54j62j76K87n8J49R5k67r0L24k14qK14j14k04J55j22K61n9K2j4
$$ -44 202 -244 110 -52 -228 59 1 150 245 -22 -112 212 -2 -10 204 90 -114 41 -81 180 121 143 129
7847A29j08L59p5m23L05j52m0nj29Q9k46L94k5Q0r5k29L69k2j4p6n5kJ8K38l37
$$ 129 21 380 305 -118 187 35 -5 -10 -139 -50 -296 98 73 153 58 -171 198 176 162 86 31 29 47 285 -52
7872e2O7N7K44j98j87j09J00J21n3M4j57K1M8k25J72K48m02k13M10K00j32J09
$$ -52 15 72 316 118 -69 -178 -78 43 -10 34 -123 -102 -54 -279 -107 141 -261 -474 -64 136 4 113
7894A13n2J63j66j03j8r3K48j33l4O5K03j89J02n0J14j42j45K78k70K6R8J93L21
$$ 113 61 224 58 -45 -63 -156 92 -41 -75 -10 193 4 106 56 170 28 -117 161 -109 -83 15 208 529
7917E29k73o30P59n39M21J06l35p12P98m34J33j1Q8k84N13j50j03L24j28m74P6
$$ 529 256 -374 385 -154 267 373 38 -674 124 -310 -177 -188 -100 -384 129 -21 -124 200 72 -402 -326
7938c26L41K8l44K59M1j82O6O4Q6qK06p2p9m4M8R5R4l36L84m13K77j63r6K07n5
$$ -326 15 43 -301 -42 -1 -183 -117 -53 33 25 231 159 80 36 84 179 273 -63 321 -92 185 22 -74 133 78
7963G8K6Q4k62L07j52m4N6J24n5q3l6l00M50N9j11j6j83j34R4L16j44k98J25J60
$$ 78 104 188 -74 233 81 37 93 217 162 79 43 -257 193 252 141 125 -58 -192 -98 218 74 -224 -99 61
7987F1j12J02j31m6M10k33K6J3P8k96q5J11K88J48j71o1k46q1J64j9J5J44K2J79
$$ 61 -51 51 -80 -126 284 51 77 90 168 -128 -213 -102 186 334 163 102 -144 -225 -61 -80 -65 79 101 280
8011B80j97m68M27N0l21J06L58l67K27J63J01m12JJ69k12K85k57l5K28j95K6K66
$$ 280 83 -385 42 92 -229 -123 235 -132 95 258 359 -53 -52 117 -95 190 -67 -102 126 -69 -43 223
8033B23j89L1o4k16J17P8K46l65K45k51NJ09O6nJ59l86j75J80J95J9K0p0K26O1
$$ 223 34 65 1 -215 -98 -20 226 -139 106 -145 -140 -31 35 30 189 -197 -372 -192 3 22 42 -28 198 259
8057B59m00K26k45j28J84K91k99p2K55o1j15J08j89J47j02J56J89l40K20j32j5
$$ 259 -141 85 -160 -288 -104 187 -112 -184 71 10 -105 3 -186 -39 -141 15 204 -136 84 -48 -63
8078f3J12j85K80l09J20j50K67pk35J24J0J53J23m34K48qq6K81J1j42R3j24O4
$$ -63 49 -136 144 -165 -45 -195 72 65 -170 -46 -36 117 240 -194 54 46 -40 241 252 110 203 79 143
8101A43J1m72M02l97L23k22L73j25k56M9J19j14K26n1r3J49k18K18k96L57k41
$$ 143 154 -318 84 -313 10 -212 161 36 -220 -171 -52 -166 60 9 -84 65 -153 65 -231 126 -115
8122a15R5J00J79k30K69m19K96j21j30j87N26k76j7K26k48O4K08K9m31L6N1J6
$$ -115 -20 80 259 29 298 -121 175 54 -76 -263 263 -13 -30 196 -52 12 220 249 -182 -146 -95 -79
8144g9N1K2k2J11j60J34J58k51J52j70K45j19J96l68R4k22N74m72n2m8J84j1K16
$$ -79 -28 -6 -28 83 -77 57 215 -36 116 -54 191 72 268 -100 -6 -228 346 -126 -178 -226 -42 -53 163
8167A63l07K49j22M2J50j16J00p9j53K61k95N0J08K01k50n6P6j65J77n3j33j46
$$ 163 -144 105 -17 25 175 59 159 80 -73 188 -107 -57 51 252 2 -54 22 -143 34 -19 -152 -298
8189b98N29k44
$$ -298 231 -13
8191a3
$$ Imaginary data points
##PAGE= N=2
##DATA TABLE= (X++(I..I)), XYDATA
0@%%%%%%%%%%%pJ4j5J6j6J8k5L0l2M0m6N3o3P1q3R7j09J23j41J58j74J96k20K44
$$ 0 0 0 0 0 0 0 0 0 0 0 0 -7 7 -8 8 -8 10 -15 15 -17 23 -23 30 -33 38 -45 52 -57 66 -75 83 -91 105 -115 129
35A29k73L04l36L73m16M61n08N62o22O89p65Q48r44J056j184J334j512J728k003
$$ 129 -144 160 -176 197 -219 242 -266 296 -326 363 -402 446 -498 558 -626 708 -804 924 -1079
54a079K358k838L527m604O552j1151M0603M0554n2594l047J8273j880l8533l155
$$ -1079 1279 -1559 1968 -2636 3916 -7235 33368 73922 21328 18281 36554 34674 -3859 -7014
68g014K8844J5992j2598M751J7451J029j7673p160j635o297l456R598O509l35
$$ -7014 21830 37822 25224 29975 47426 48455 30782 23622 21987 15690 12234 21832 28341 28006
82B8006M307R356n802j1440p08K818q512m919J0632Q125q046k376J2978P47k0149
$$ 28006 32313 41669 35867 24427 23719 26537 18025 13106 23738 31863 23817 21441 34419 35166 15017
97A5017n555J6882J355j8279J34K3335M470k2960n337J7251J06k1820o487J9036
$$ 15017 9462 26344 27699 9420 9554 32889 37359 14399 9062 26313 26419 4599 -1888 17148
111A7148P720j0543k332J2197K224j3594p495J96j766k000L230L803K497O195
$$ 17148 24868 14325 11993 24190 26414 12820 5325 5521 3755 1755 4985 8788 11285 17480
125A7480M768r139j1744J904K558j2070q267J2014J6963o434q481J0502R080j6818
$$ 17480 22248 13109 1365 3269 5827 -6243 -14510 -2496 14467 8033 -448 10054 19134 2316
139B316j6179N403Q210r858n900J6513J2350j2167p083J0004J887j7283q646J2098
$$ 2316 -13863 -8460 -250 -10108 -16008 505 12855 688 -6395 3609 5496 -11787 -20433 -8335
153h335N442r701j016J3910M202j0679o608O558L77p745l594N995K911J742N47
$$ -8335 -2893 -12594 -13610 300 4502 -6177 -12785 -6227 -5850 -13595 -17189 -11194 -8283 -6541 -5994
168e994j532l426J336J619o985p380P771J0290m804q402P957R909q874j4659M057
$$ -5994 -7526 -10952 -9616 -7997 -14982 -22362 -14591 -4301 -9105 -17507 -9550 359 -8515 -23174 -19117
183a9117J0725n382r203Q310J2631l624q977L727M412q725p463N309N304l700
$$ -19117 -8392 -13774 -22977 -14667 -2036 -5660 -14637 -10910 -6498 -15223 -22686 -17377 -12073 -15773
197a5773P6R610L741p907l794M305j531q506p16P174K834j371L160L646k376k482
$$ -15773 -15697 -6087 -2346 -10253 -14047 -9742 -11273 -19779 -20495 -13321 -10487 -11858 -8698 -5052 -7428 -9910
213i910o6l304n249K393P507j393n305O916R654n974j2365L261R997m810j2115
$$ -9910 -9976 -13280 -18529 -16136 -8629 -10022 -15327 -8411 1243 -4731 -17096 -13835 -3838 -8648 -20763
228b0763N911J4534j255j1108J067J1679m231j0817J377Q684j054m579K966O191
$$ -20763 -14852 -318 -1573 -12681 -11614 65 -4166 -14983 -13606 -4922 -5976 -10555 -7589 -1398
242a398j418l860K229P37m356k530M928K026j275R72L814j68m008K87M57j315
$$ -1398 -2816 -6676 -4447 -3710 -8066 -10596 -5668 -3642 -4917 -3945 -131 -299 -4307 -4020 -3563 -4878
258d878j626M343J640j550K190M595l001n605Q98N579l066q176N202J0830j087
$$ -4878 -6504 -2161 -521 -2071 119 4714 1713 -3892 -2994 2585 -481 -8657 -3455 7375 6288
273F288q789L243R098k559j1458M4Q714J534o374R20P384K011m611j554J754J2
$$ 6288 -2501 742 9840 7281 -4177 -4133 4581 6115 -259 661 8045 10056 5445 3891 5645 5657
289E657k463M79qJ199K852K534j794k338K231J265l604l116L561L588k781n20
$$ 5657 3194 3673 3665 4864 7716 10250 8456 6118 8349 9614 6010 2894 6455 10043 7262 6742
305F742L855K000m234k023L918p12m307P06O775L85o014N19P045j142q630p66
$$ 6742 10597 12597 8363 6340 10258 9546 5239 5945 12720 13105 7091 7610 14655 13513 4883 4117
321D117P245J611o893m56P378K921o285l945L672K209l645l514K087M088J147
$$ 4117 11362 12973 6080 5624 13002 15923 9638 5693 9365 11574 7929 4415 6502 10590 11737
336A1737k104j656J075J951k204m608n12L955J718l212j226M516K250m836l475
$$ 11737 9633 7977 9052 11003 8799 4191 3679 7634 9352 6140 4914 9430 11680 6844 3369
351C369K387J194l495j763L807J876k318j322K765J29m680j704L023Q40l786o38
$$ 3369 5756 6950 3455 1692 5499 7375 5057 3735 6500 6629 1949 245 3268 4108 322 -316
367c16M768J582m928j986K528J653l618l356K174L362K19l475n85K573Q85l443
$$ -316 4452 6034 1106 -880 1648 3301 -317 -3673 -1499 1863 2082 -1393 -1978 595 1480 -1963
383a963l549J162L879k36m088P3M823J411n580l441L513L013l728l730L549M487
$$ -1963 -5512 -4350 -471 -707 -4795 -4722 101 1512 -4068 -7509 -3996 -983 -4711 -8441 -4892 -405
399d05j385m169J156K285j488l863J62K608N38j373P77J978j59k179m43N57n21
$$ -405 -1790 -5959 -4803 -2518 -4006 -7869 -7707 -5099 -4561 -5934 -5157 -3179 -3338 -5517 -5960 -5403 -5924
416e924k179J212K346Q64j093l31J782Q05l867k865L705K677j586k865K213M036
$$ -5924 -8103 -6891 -4545 -3681 -4774 -5105 -3323 -2518 -6385 -9250 -5545 -2868 -4454 -7319 -5106 -1070
432a070q07m940R2L342L87l579j719L702M473k164l451N70L537k31m135j047L115
$$ -1070 -1877 -6817 -6725 -3383 -2996 -6575 -8294 -4592 -119 -2283 -5734 -5164 -1627 -1858 -5993 -7040 -3925
449c925L182l246j509L319K777k148l819P34K008o6k024J174L092M67k404O63
$$ -3925 -743 -3989 -5498 -2179 598 -1550 -5369 -4635 -2627 -2693 -4717 -3543 -451 16 -2388 -1725
465a725J109j346j842P50J921j429m95J953K409p54k616M74J485p52k608J46L054
$$ -1725 -616 -1962 -3804 -3054 -1133 -2562 -3057 -1104 1305 551 -2065 -1591 -106 -858 -3466 -3320 -266
482b66J577j035j288J028K248q42l966q48L298J305k118j597L273L547k386m567
$$ -266 1311 276 -1012 16 2264 1422 -2544 -3392 -94 1211 -907 -2504 769 4316 1930 -2637
498b637R15M518j441m756J066N766M74m041r82L961L80l917j686K736J492j614
$$ -2637 -1722 2796 1355 -3401 -2335 3431 3905 -136 -1118 2843 3223 -694 -2380 356 1848 234
514B34P4K450J33j437j88P09j336j321J323J393q0m59J067J052n01j803m23j84
$$ 234 308 2758 2891 1454 1266 1975 639 -682 641 2034 1954 1495 2562 3614 3113 1310 887 703
532G03O27L37k76n05J836K032n01l937O18L162j007n129J158O045P99m520j253
$$ 703 1330 1667 1391 886 2722 4754 4253 316 934 4096 3089 -2040 -882 5163 5962 1442 189
549A89N269l1m458l129M726K805k829k225L337K822k499k301Q03J02r96N01n0
$$ 189 5458 5427 969 -2160 2566 5371 2542 317 3654 6476 3977 1676 2479 2581 1585 2086 2036
566B036K8M38J335M76j556L5J159j475j812O31K206q36o45J354J357k116j320
$$ 2036 2064 2502 3837 4313 2757 2792 3951 2476 664 1295 3501 2665 2020 3374 4731 2615 1295
583A295J544L41l774r8M078J330l739m30M435M19n739k185M779J579m314j772
$$ 1295 2839 3180 -594 -692 3386 4716 977 547 4982 5401 -338 -2523 2256 3835 -479 -2251
599b251M835K712l802k563K214J298k294j854P73J366L5N45L2j258N11J155k217
$$ -2251 2584 5296 1494 -1069 1145 2443 149 -1705 -932 434 469 1014 1046 -212 299 1454 -763
616g63k679J037L386q96l231J598L986j843l825K96L434k029l350K697K430j535
$$ -763 -3442 -2405 981 85 -3146 -1548 2438 595 -3230 -2934 500 -1529 -4879 -2182 248 -1287
632a287j486J285J927k746l255L267J299l368j418M376K566l669j983L069J101
$$ -1287 -2773 -1488 439 -2307 -5562 -2295 -996 -4364 -5782 -1406 1160 -2509 -4492 -1423 -322
647c22l210k418K289J873m96j216J301M56n4q7j348j718J299K398j496k596K490
$$ -322 -3532 -5950 -3661 -1788 -2284 -3500 -2199 -1743 -1797 -1884 -3232 -4950 -3651 -1253 -2749 -5345 -2855
664b855M193j694m682J125M119j593m755J250N195j72l674R22L750j567l891J337
$$ -2855 1338 -356 -5038 -3913 206 -1387 -6142 -4892 303 131 -3543 -2621 1129 -438 -4329 -2992
680b992K375j113k941L833K133j814l103M386J65l208m71K735J463k984L31K646
$$ -2992 -617 -1730 -4671 -838 1295 -519 -3622 764 929 -2279 -2750 -15 1448 -1536 -1205 1441
696A441j89j043N6L18N5j038O62Q86j624J55L314n85l118J23L973j063m673M94
$$ 1441 1252 209 265 583 638 -400 262 1148 -476 -321 2993 2408 -710 -587 3386 2323 -2350 -1856
714a856N729nn068O49N156n06n053l05L798%l162M14L400L1k018L86J497j853
$$ -1856 3873 3868 -1200 -551 4605 4099 -954 -1259 2539 2539 -623 -209 3191 3222 1204 1590 3087 1234
732A234j509J712J007j855k93K748P15k249o02K150m32l183J21J868j48k43J165
$$ 1234 -275 1437 2444 589 296 3044 3759 1510 908 3058 2626 -557 -436 1432 1284 1041 2206
749B206Q60j736j020K524o50l946P12L950K58m547M73N362m11n315p03M908j69
$$ 2206 3066 1330 310 2834 2184 -1762 -1050 2900 3158 -1389 -916 4446 4035 -1280 -1983 2925 2756
766B756m554k56M508J039l872j57K803m28k554j27J412p53m77J663M52j624j77
$$ 2756 -1798 -2054 2454 3493 -379 -536 2267 1839 -715 -842 570 -183 -660 1003 1455 -169 -346
783c46K043j034k606O26K488r98k005J311K828j383k377J158J470j949j670K717
$$ -346 1697 663 -1943 -1317 1171 173 -1832 -521 2307 924 -1453 -295 1175 -774 -2444 273
799B73J389k681o71L411O71l934j284M172M18m379n10M675J063l836r74L658O36
$$ 273 1662 -1019 -1690 1721 2392 -1542 -2826 1346 1764 -2615 -3125 1550 2613 -1223 -2197 1461 2097
816B097l437j157K230R14j320K82M22K43k4O43j152j872J045K272j576k198J922
$$ 2097 -1340 -2497 -267 647 -673 -391 31 274 250 893 -259 -2131 -1086 1186 -390 -2588 -666
833f66L523j631l242J340L050k327l216J942K903j675k155K249J868k435j630
$$ -666 2857 1226 -2016 -676 2374 47 -3169 -1227 1676 1 -2154 95 1963 -472 -2102
848b102K040J189k959r36L560P30l052p73L970K17l615r94K844N03k444m31K349
$$ -2102 -62 1127 -1832 -2768 792 1522 -1530 -2303 1667 1884 -1731 -2725 119 622 -1822 -2253 96
865I6N93j392Q6k6m31k42P86l32j543J235K769j565l115J636K892j572l762P49
$$ 96 689 -703 -617 -643 -1074 -1316 -530 -862 -2405 -1170 1599 34 -3081 -1445 1447 -125 -3887 -3138
883c138M209r70l135R75L579j185k851L32K141r15k282J375J818m92j578J900
$$ -3138 1071 101 -3034 -2059 1520 335 -2516 -2184 -43 -958 -3240 -1865 -47 -539 -2117 -217
899b17M78j971o13J782J11j844J59K556j79j622q1J219j69j173N16K64k32K83
$$ -217 261 -1710 -2323 -541 -430 -2274 -2115 441 262 -1360 -1441 -222 -391 -1564 -1048 -784 -1016 -733
917g33J179m29j435R26J976j581k608J223L212j165k850J889J963N52m121N08
$$ -733 446 17 -1418 -492 1484 -97 -2705 -1482 1730 565 -2285 -396 1567 2119 -2002 -1494
933a494L140o70k523P02K740k90j798L95J355n63j081J107J74j055L59J493R7
$$ -1494 1646 976 -1547 -845 1895 1605 -193 202 1557 994 -87 1020 1194 139 498 1991 2088
950B088j454L01J626q30j431L22J501m35r69P80J042n80p99J121O4j854J70J890
$$ 2088 634 935 2561 1731 300 622 2123 1688 719 1499 2541 1961 1162 2283 2347 493 663 2553
968B553j6k182N26K808o62l033O82L122r46l149O48K616M06k440n46K239K14j410
$$ 2553 2537 355 881 3689 3027 -6 676 3798 2852 -297 351 2967 3373 933 387 2626 2840 1430
986A430r34J126M83m29l47J19J19N71k44j230k59K61J150q03j005J328P90m86
$$ 1430 496 1622 2105 1676 1329 1448 1567 2138 1894 664 405 666 1816 1013 8 1336 2126 1640
1004A640j047K5J268j348j209Q20J213j669K04J536Kj856j12J655o81k192L50
$$ 1640 593 618 1886 538 -671 149 1362 -307 -103 1433 1435 -421 -533 1122 441 -1751 -1401
1021a401K325J59k458j62K478k10k128p51K016P75j346r95R77O71k30r95j53K53
$$ -1401 924 1083 -1375 -1537 941 731 -1397 -2148 -132 643 -703 -1698 -721 -50 -280 -1275 -1428 -1175
1039a175N71k48r02m78J661P60j179j259J518R80j603j454Q42J708o68j100O34
$$ -1175 -604 -852 -1754 -2232 -571 189 -990 -2249 -731 249 -1354 -2808 -1966 -258 -926 -2026 -1392
1056a392J079n55p97K07M07n14k20N84N28o22J6N32J97j282j06R36J69q93j00
$$ -1392 -313 -868 -1665 -1458 -1051 -1565 -1785 -1201 -673 -1295 -1279 -747 -550 -1832 -1938 -1002 -833 -1726 -1826
1075a826J050O28o77p01O10L67J5p96o01P67Q99J79j415n0J477O20j383j620J731
$$ -1826 -776 -148 -825 -1526 -916 -549 -534 -1330 -1931 -1164 -265 -86 -1501 -1551 -74 546 -837 -2457 -726
1094g26J281j075j261J017J715p36j756L17J265q1j256J65J152K07n72p9M78o
$$ -726 555 -520 -1781 -764 951 215 -1541 -1224 41 -40 -1296 -1131 21 228 -344 -423 55 49
1112D9l41n1M4l51J33N34L55m22o25Q34n1m71m50L52O40M7k33l26N71K27l47r08
$$ 49 -292 -343 -299 -650 -517 17 372 -50 -675 159 108 -363 -813 -461 179 226 -7 -333 238 465 118 -790
1134g90l61J180N53j021q20J523Q92j020j064M04J183M0j790k02J603N30r72n93
$$ -790 -1151 29 582 -439 -1259 264 1156 136 -928 -524 659 699 -1091 -1293 310 840 -132 -725
1152g25P85R08p74p96p6J120k35m25j51P19M67n75l79o7K43J76j64j85M95J76
$$ -725 60 968 194 -602 -678 442 207 -218 -369 350 817 242 -137 -204 39 215 51 -134 361 537
1172E37j17N08o24m2J33j11L40p04j39R67L67p38m88R35K72k90r12L59J013Q7
$$ 537 420 928 304 262 395 284 624 -80 -219 748 1115 377 -111 824 1096 806 -106 253 1266 1353
1192A353j174J19J258J15q24r34P85J390q14j293M07J560k52j303j87J236K79
$$ 1353 179 298 1556 1671 847 -87 698 2088 1274 -19 388 1948 1696 393 206 1442 1721
1209A721p94p56N25J080l58k73l09R86k28o10r0J25q6J44K80l85L22J82Q5o95
$$ 1721 927 171 696 1776 1418 1145 836 1822 1594 984 894 1019 933 1077 1357 972 1294 1476 1561 866
1229H66N9j37L65J37l32m6M7K45M2m06m74J39P55l14j235N56J252j24j541j65
$$ 866 925 788 1153 1290 958 912 959 1204 1246 840 366 505 1260 946 -289 267 1519 1395 -146 -311
1249c11J631L62j986m54J377J082j326r26P53P90o80j003L15M57J17o57k42M05
$$ -311 1320 1682 -304 -758 619 1701 375 -551 202 992 312 -691 -376 81 198 -459 -701 -296
1267b96L90K75p48n58J31P30m15j164O55Q43k6o13j41M82l92j85j40L72n86r0
$$ -296 94 369 -379 -937 -806 -76 -491 -1655 -1000 -157 -183 -796 -937 -455 -847 -1032 -1172 -800 -1386 -1476
1287a476Q89j4q45l95J453K20j644n30J555N84j565n63J417Q13j436p02O06J301
$$ -1476 -587 -601 -1446 -1841 -388 -168 -1812 -2342 -787 -203 -1768 -2331 -914 -101 -1537 -2239 -1633 -332
1305c32p37m17l86M08N43k88j68J68M24M41j557j9Q19J234j064l91n80K028j51
$$ -332 -1069 -1486 -1872 -1464 -921 -1209 -1377 -1209 -785 -344 -1901 -1920 -1101 133 -931 -1322 -1902 126 -25
1324b5j466lM11L94m69m36J339k79j229J089Qj5m80Q02K78o47l56J230L38j245
$$ -25 -1491 -1494 -1083 -689 -1158 -1594 -255 -534 -1763 -674 -666 -681 -1161 -359 -81 -728 -1084 146 484 -761
1344g61l88J073N46j090n44J353L50p17l76J37Q56j6l13m81LO33O04l45j196O94
$$ -761 -1149 -76 470 -620 -1164 189 539 -178 -554 -417 439 423 110 -371 -368 265 869 524 -672 22
1364B2J289m57j444J0J460L46j179n65J999J80k789J012J307M59j467m61J146
$$ 22 1311 854 -590 -580 880 1226 47 -518 1481 1661 -1128 -116 1191 1650 183 -278 868
1381H68P97j217l23K95k0K82p42J416j721N4O32P27m72q90J301K03q31m27P34
$$ 868 1665 448 125 420 400 682 -60 1356 -365 -311 321 1048 576 -314 987 1190 359 -68 666
1400F66j93k86k29M55j22NR3N91j229P32M65j11j880J011J428p9j810L42J442
$$ 666 473 187 -42 413 291 296 389 980 -249 483 948 837 -1043 -32 1396 1317 -493 -151 1291
1419A291R0j427n52J253P76j166n45J049M46p84k64L07M3n73N05K2n43L86P4O31
$$ 1291 1381 -46 -598 655 1431 265 -280 769 1215 431 167 474 517 -56 449 471 -72 314 388 1019
1439A019j232L03R78m81j007N16J020p27j51j34R96n27j55J93J20l16m77J895
$$ 1019 -213 90 1068 587 -420 96 1116 389 238 104 1100 573 418 611 731 415 -62 1833
1457A833q54j765J169R76L50k341M35J504J06j864l1J685Q32j837m73O06O22p69
$$ 1833 979 -786 383 1359 1709 -632 -197 1307 1413 -451 -482 1203 2035 198 -275 331 953 184
1475A84r15J308p8m65Q40J45k27m61P05K7j099k05P27O51j527O94J308q65j236
$$ 184 -731 577 499 34 874 1019 792 331 1036 1063 -36 -241 486 1137 -390 304 1612 747 -489
1494d89P7J287j164O10K5N10o19n95J84N31m59m25J432l01j812j6J434N03j279
$$ -489 -412 875 -289 321 346 856 237 -358 -174 357 -102 -527 905 604 -1208 -1224 210 713 -566
1513e66M5J414J76j283r56J195L73q25j22L3j72P90q06N19j273N56O60j53q36
$$ -566 -521 893 1069 -214 -1170 25 398 -427 -549 -516 -688 102 -704 -185 -1458 -902 -242 -395 -1231
1532a231K48J241j65k054R85K55Q7j285L56J898j189n35r1J308j218m63Q17L99
$$ -1231 -983 258 93 -1961 -976 -721 -634 -1919 -1563 335 -854 -1389 -1480 -172 -1390 -1853 -1036 -637
1550f37j1j147J087O86r00l73J085J6j339k7J659p85j69m16M81K69j277M23P32
$$ -637 -648 -1795 -708 -22 -922 -1295 -210 -194 -1533 -1560 99 -686 -855 -1271 -790 -521 -1798 -1375 -643
1569f43j12j36N76m99P8n41J552m40j562M10J481j92j907R48J419L83j756m9J588
$$ -643 -755 -891 -315 -814 -736 -1277 275 -165 -1727 -1317 164 -28 -1935 -987 432 815 -941 -990 598
1588E98m5j848R29R39n97m08kJ348j170J7q8O8L63o65Q86k83q73L85J467l97r46
$$ 598 553 -1295 -366 573 -24 -432 -434 914 -256 -239 -327 -259 104 -561 325 42 -831 -446 1021 624 -322
1609c22N54M50J28j104O42J36M35n04J94K84K13r17Q58j35n27m6R97m97j014O67
$$ -322 232 682 810 -294 348 484 919 415 609 893 1106 189 1047 912 385 339 1336 839 -175 492
1629D92J012l20o18l28R74n5j300J99J450m91o04r3O62j37n79M18j10m7LO82o53
$$ 492 1504 1184 566 238 1212 1157 -143 56 1506 1015 411 318 980 843 264 682 572 525 528 1210 557
1650E57k14K27K45j88l91J06N62j27j387J193l11K75j126N47Q76n88l03P82P19
$$ 557 343 570 815 627 236 342 904 777 -610 583 272 547 -579 -32 844 256 -47 735 1454
1669A454j668n19K728j593m07p1J735j122j366Q87O94M00j491J70K0P96j167o5
$$ 1454 -214 -733 1995 402 -5 -76 1659 537 -829 58 752 1152 -339 -169 -149 647 -520 -585
1687e85J012J42q74ml8J421j082N27K62q52Mj16M04p22R26M19r51p0R2P73n62
$$ -585 427 569 -305 -309 -347 1074 -8 519 781 -71 -67 -183 221 -501 425 844 -107 -177 -85 688 126
1708A26m03L81N92k54m82M05K45m90p8L57l50k72j60J002J0q78M4O03j01q47J83
$$ 126 -277 104 696 442 -40 365 610 120 42 399 49 -223 -383 619 629 -249 -205 398 297 -550 -367
1729c67R55o4o93k99P08j03M6k52j08J22J58M7l58m8L41N01n52l15L85L29n14
$$ -367 588 524 -169 -468 240 137 183 -69 -177 -55 103 150 -208 -256 85 586 34 -281 104 433 -81
1750h1m33J36R45j82q53J75Q20o05k90M62j10l7q7j45K80P7m98P66n84r42O89
$$ -81 -514 -378 567 385 -468 -293 527 -78 -368 94 -16 -53 -140 -285 -5 72 -426 340 -244 -1186 -497
1771d97J109j085J87q48J460m55p64M53L38k36P7Q0p21P43K10K54j380O13k68
$$ -497 612 -473 -286 -1134 326 -129 -893 -440 -102 -338 -261 -181 -902 -159 51 305 -1075 -462 -730
1790g30P51k50n89q03O25M10n74J010%j99n14J30L38Kn97L17J65K93k87j89Q7
$$ -730 21 -229 -818 -1621 -996 -586 -1160 -150 -150 -349 -863 -733 -395 -393 -990 -673 -508 -215 -502 -691 -604
1811f04M03l85j5l12M88n6K0k71J51J49P1J27m45J40L28P8p88O91P7K22m27j86
$$ -604 -201 -586 -601 -913 -425 -481 -461 -732 -581 -432 -361 -234 -679 -539 -211 -133 -921 -230 -153 69 -358 -544
1833e44J95j2O21n03J86o15Q13M71m65p11K59K38Nq12J161k49K94l28k35O48n6
$$ -544 -349 -361 260 -243 -57 -672 141 612 147 -564 -305 -67 -62 -874 287 38 332 4 -231 417 361
1854C61m21l24L98N98k19k76j94L66L20k80k77J84M49j4k44j50M26K02n14j99
$$ 361 -60 -384 14 612 393 117 -77 289 609 329 52 236 685 671 427 277 703 905 391 192
1874A92K84j08K49Oj34J45K43rm3l25LJ94p8k7j49J95J38o6m09L11N5L14o76o23
$$ 192 476 368 617 623 489 634 877 868 825 500 503 697 619 592 443 638 776 710 301 612 667 981 305 -318
1898c18R26L25m91j06j41O58k12n57O9M40J8n07n1o5N89r1l78Q6M49M7o89j31
$$ -318 608 933 442 336 195 853 641 84 153 593 611 104 53 -12 577 486 108 194 643 690 1 -130
1920a30k7N65m33O2l72K57Q76k25j088R04k9m04l69Q47m02k82R57r11n26Q05l07
$$ -130 -157 408 -25 37 -335 -78 798 573 -515 389 360 -44 -413 434 32 -250 707 -204 -730 75 -232
1941b32K86o88J42J12Q98n72k04k49P78j19l61n60N89N30m92m09L46O13l20p08
$$ -232 54 -634 -492 -380 518 -54 -258 -507 271 152 -209 -769 -180 350 -142 -551 -205 408 88 -620
1961f20N56k63M00k8m61M75j05j20j42k05L08J53o1l21KO72n55K46l03L21p9p7
$$ -620 -64 -327 73 45 -416 59 -46 -166 -308 -513 -205 -52 -113 -434 -432 240 -315 -69 -372 -51 -130 -207
1983b07j55K27J41K1n0o0m8k07K93o4n01J48N07M16q72K43M13J98o09l18M06L53
$$ -207 -362 -135 6 27 -23 -83 -131 -338 -45 -109 -610 -462 45 461 -411 -168 245 443 -166 -484 -78 275
2005B75k99k13K54K90L3n72O6k02M09M94q59J70R9M69m25l49N85j10J65m85j95
$$ 275 -24 -237 17 307 340 -232 -166 -368 41 535 -324 -154 -55 414 -11 -360 225 115 280 -205 -400
2026d00N69n8n15l9O38k00m3m59P45m43Q0j9J96k21j02N2L48m23q6M01K24m65
$$ -400 169 111 -404 -443 195 -5 -48 -507 238 -205 -125 -144 52 -169 -271 -219 129 -294 -380 21 245 -220
2048b20r6L76J84n56m3K36J06j35k23R9r0J27P5j04k65K81M99k30m69J55O30l07
$$ -220 -316 60 244 -312 -355 -119 -13 -148 -371 -272 -362 -235 -160 -264 -529 -248 251 21 -448 -293 337 30
2070C0o41P2Q60o6n88j20N74K17l45j06J16K38k13j86J77m4o5L7L08l98m41R45
$$ 30 -611 -539 321 255 -333 -453 121 338 -7 -113 3 241 28 -158 19 -25 -90 -53 255 -143 -584 361
2092C61l2n09pJ97M39o71P2N13k06l3K66j4j77o5K22k39qJ79P6N7n07L39M75l07
$$ 361 329 -180 -187 10 449 -222 -150 363 157 124 390 376 199 134 356 117 109 288 364 421 -86 253 728 421
2116D21l30J54L95l3m89j66N45K32m35k75M16M50o44n5M82k12R6k23k5q4L8N42
$$ 421 91 245 640 607 118 -48 497 729 294 19 435 885 241 186 668 456 552 329 304 220 258 800
2138H00n15K7n9L11k32j74n0O79n26l79J62L60j34j88K10K39l65k25P9M22l63
$$ 800 285 312 253 564 332 158 108 787 261 -118 44 404 270 82 292 531 166 -59 20 442 79
2159G9J0L93m06m64J72P50m71j53j95N16j22j39j80K47J98l03k1K63j95N3K5k10
$$ 79 89 482 76 -388 -216 534 63 -90 -285 231 109 -30 -210 37 235 -68 -89 174 -21 32 57 -153
2181a53j0j70L65n49j49M25L92m72k61K9O04N0r55M70N78n45k73L81N0j87j70
$$ -153 -163 -333 32 -517 -666 -241 151 -321 -582 -553 51 101 -854 -384 194 -351 -624 -243 -193 -380 -550
2202e50L37P6j68k54N45l36k75K34K70j29l30m2K90Q9n16L77K35j41n5l05O23
$$ -550 -213 -137 -305 -559 -14 -350 -625 -391 -121 -250 -580 -622 -332 -243 -759 -382 -147 -288 -343 -648 -25
2223b5N7k57l07J33K44p7K37m41l1L08L99m75q3J55N26o61K47m78J004n62l93
$$ -25 32 -225 -532 -399 -155 -232 5 -436 -467 -159 240 -235 -318 -163 363 -298 -51 -529 475 -87 -480
2244d80l9R62N6p39L26O15m06m31M41o28L15m21Q22l90K35L02J4q15P65Q2J95
$$ -480 -519 443 499 -240 86 701 295 -136 305 -323 -8 -429 393 3 238 540 554 -261 504 586 781
2265G81K2j460L97N97J20r74J147L36j66m24J31n16q72J133q1N12j115N90R86
$$ 781 803 -657 -260 337 457 -517 630 966 800 376 507 -9 -881 252 171 683 -432 158 1144
2284A144r64l78N98P16j031n38O75J40P6p67J29N32l13J06K45r3n22K88L82k68
$$ 1144 180 -198 400 1116 85 -453 222 362 438 -329 -200 332 19 125 370 277 -245 43 425 157
2304A57k71K30J23k49l5J98m6K04n40O4N12n13J7K3L19o8J32l36R1k24K0M01j62
$$ 157 -114 116 239 -10 -45 153 107 311 -229 -165 347 -166 -149 -126 193 125 257 -79 12 -212 -192 209 47
2327D7j65l6M59m77j04j7O03k38j77k51P11p3n08J6K80mm2j69j53J85P6j05K58
$$ 47 -118 -154 305 -172 -276 -293 310 72 -105 -356 355 282 -226 -210 70 66 24 -145 -298 -113 -37 -142 116
2350A16k45J53L86k92l50O22K0n20m6J51M00j14l96K88J11K5k49q3J38Lq3R6K64
$$ 116 -129 24 410 118 -232 390 410 -110 -156 -5 395 281 -115 173 284 309 60 -23 115 118 35 131 395
2373C95m08O6K47N5n78J19O56k64l04J13L88j46l66k3J66K68l41r9J33L03k33
$$ 395 -13 53 300 355 -223 -104 552 288 -16 97 485 339 -27 -50 116 384 43 -56 77 380 147
2394A47K85k07k53J64l5j67J33K32N2l32p3k05K08j44j73J17M96j06l18n5L32
$$ 147 432 225 -28 136 101 -66 67 299 351 19 -54 -259 -51 -195 -368 -251 245 139 -179 -234 98
2415I8K9m31J50K17j11qJ54l14K3j11J85K43l82J79J05m1j49k55J42J13m16M9
$$ 98 127 -304 -154 63 -48 -56 98 -216 -193 -304 -119 124 -258 -79 26 -15 -164 -419 -277 -164 -580 -531
2437e31J12L71k22N1p5k48L35Ll14J4j03N94l61l25L22K96m82J94k03M45k7l94
$$ -531 -419 -48 -270 -219 -294 -542 -207 -204 -518 -504 -607 -13 -374 -699 -377 -81 -563 -369 -572 -127 -154 -548
2459e48K73j59L24o41O63j30P1p5J71l41K72k22K30J06j14N7k65K02l89K20J43
$$ -548 -275 -434 -110 -751 -88 -218 -147 -222 -51 -392 -120 -342 -112 -6 -120 -63 -328 -126 -515 -295 -152
2480a52L12l24j95L38j70L00m66K73P0O0q6l04L9J87L69o25O1L58O9k42j37K16
$$ -152 160 -164 -359 -21 -191 109 -357 -84 -14 46 -40 -344 -305 -118 251 -374 -313 45 114 -128 -265 -49
2502d9N19k29n26N23J7M1k68J25J22j58K90Mp18N78p2j39M07m81J35K14l6n1l10
$$ -49 470 241 -285 238 255 296 28 153 275 117 407 411 -307 271 199 60 467 -14 121 335 299 248 -62
2525f2M03k67K52j67j7M64o28M15K6m2k84J98k52j14O80O47r51O99m94l95J84
$$ -62 341 74 326 159 142 606 -22 393 419 377 93 291 39 -75 605 1252 301 1000 506 111 295
2546B95l27P80l10K92j289J418o25l19p83J074r04P85m9o79O00J080o07o34L72
$$ 295 -32 748 438 730 -559 859 234 -85 -868 206 -698 87 38 -641 -41 1039 432 -202 170
2565A70j21K29M01p40O21oq24O84l0l00N7O2N8l03p07O59L05l96qN72p24N50j23
$$ 170 49 278 679 -61 560 554 -270 414 384 84 141 203 261 -42 -749 -90 215 -181 -189 383 -341 209 86
2588H6L47P23J75j385m6j220J002J265j352J36p1j59J13j98R04p5K46m54o6R1
$$ 86 433 1156 1331 -54 -100 -1320 -318 947 -405 -269 -340 -499 -386 -584 320 245 491 37 -29 62
2608F2j51J47j285J156n42P88j748N62J571o6j174q7J642l40J0j705K294j485
$$ 62 -89 58 -1227 -71 -613 175 -1573 -1011 560 494 -680 -767 875 535 545 -1160 1134 -351
2626c51K91J60n7Q01p08J36r24L85J46l23k0O35P5j14n78K82k74p56J818o16J7
$$ -351 -60 100 43 844 136 272 -652 -267 -121 -444 -464 171 246 132 -446 -164 -438 -1194 624 8 25
2647B5N09r04j05K08j6r18J395k17Q48k47q17M04K03m78NN5K77m55J40O2M1k2
$$ 25 534 -370 -475 -267 -283 -1201 194 -23 825 578 -239 165 368 -110 -105 -50 227 -228 -88 -26 15 -7
2669gk03K27J08l48J89K03l74pp1L22k60N64r03M43M78k11k54M48j66k70J45J91
$$ -7 -210 17 125 -223 -34 169 -205 -212 -283 39 -221 343 -560 -117 361 150 -104 344 178 -92 53 244
2691B44l22q1J77k22M21n50L11m69Q62m79l56L24l1J42j04p3J47k3J27j95J93
$$ 244 -78 -159 18 -204 217 -333 -22 -491 371 -108 -464 -140 -171 -29 -133 -206 -59 -82 45 -150 43
2712D3n08K14o0k78q7N47J48j66J50k26M0R2n43M02N40k18k82J58q1Kj60K30n4
$$ 43 -465 -251 -311 -589 -676 -129 19 -147 3 -223 -183 -91 -634 -232 308 90 -192 -34 -115 -113 -273 -43 -97
2735i7J80K8p7oJ36K29k33k11j87K74QJ06r6q9k4N9J86j44Q8p6J66k69Q8k06L68
$$ -97 83 111 34 28 164 393 160 -51 -238 36 44 150 54 -35 -59 0 186 42 130 54 220 -49 39 -167 201
2760B01K5k76J17J44J85m50P2P8L57j73k41k3M04k5k72r1L68j22j30k3K55n2r
$$ 201 226 -50 67 211 396 -54 18 96 453 280 39 16 420 395 123 32 400 278 148 125 380 328 319
2783C19j13k10J04k46L26J0J16n2L23k66j13M2k16J57k46l5K10J2k78K16J81K47
$$ 319 206 -4 100 -146 180 190 306 254 577 311 198 240 24 181 -65 -100 110 122 -156 60 241 488
2805D88l29j7q6K09k25J14j86K28j19L43l33k38M41Qj54n27K22K03k4l6l1L42
$$ 488 159 142 56 265 40 154 -32 196 77 420 87 -151 290 298 144 -383 -161 42 18 -18 -49 293
2827B93J10l84o9k5Q5K21k28J54l58N06m61o8J04j07L15k56p8J78o8K54j91k23
$$ 293 403 19 -50 -75 10 231 3 157 -201 305 -156 -224 -120 -227 88 -168 -246 -68 -136 118 -73 -296
2849b96L90l6k83j34K03M08m46nP3K2R5l6j60J6k5J39L65p00J24L51J91n42J01
$$ -296 94 58 -225 -359 -156 252 -194 -199 -126 -104 -9 -45 -205 -189 -214 -75 290 -410 -286 65 256 -286 -185
2872a85O7L40k32k34K31M8P8j74Qo1J11j83J85p5J85k8j95j72K56M71o16n9j0
$$ -185 -118 222 -10 -244 -13 35 113 -61 -53 -114 -3 -186 -1 -76 109 81 -114 -286 -30 441 -175 -234 -244
2895b44L82Jk85K61J91m6j58l80K46j11r1J05j61M98k66J71n89R6P17j12K4l32
$$ -244 138 139 -146 115 306 260 102 -278 -32 -143 -234 -129 -290 208 -58 113 -476 -380 337 225 249 -83
2917h3q1M29l32j45l6L80P2j33l73M19Lkk41oK14j46j6L43m83L46P24n41o75o61
$$ -83 -164 265 -67 -212 -248 132 204 71 -302 117 120 118 -123 -129 85 -61 -77 266 -217 129 853 312 -363 -1024
2941a024J039O47p00Q68j153L69M24r02M43n88M74J29K01j78Nj9k0k50L25K8j34
$$ -1024 15 662 -38 830 -323 46 470 -432 11 -577 -103 26 227 49 54 35 15 -235 90 118 -16
2962a6l18j71M63J69l79K78j05k5nJ67j63J95j22J84l30j76J44J03L17r9l28L09
$$ -16 -334 -505 -42 127 -252 26 -79 -104 -109 58 -105 90 -32 152 -178 -354 -210 -107 210 111 -217 92
2984I2k96j74J51K41L5k00K74J8j00j49JL51j80k45K87m3J18m69L58J79k43J66
$$ 92 -204 -378 -227 14 49 -151 123 141 41 -108 -107 244 64 -181 106 63 181 -288 70 249 6 172
3006A72Q0q4j12j02J89k82R3O0J77k77J08K59q9M7k25J13pj04j51K34L9l33K74
$$ 172 252 168 56 -46 143 -139 -46 14 191 -86 22 281 192 239 14 127 120 16 -135 99 138 -195 79
3029G9K4J5j34J90J47o5r7n7K18J31n09m3M49j90Q8K2j36L25l18k31O7m9M62l88
$$ 79 103 118 -16 174 321 256 159 102 320 451 -58 -101 348 158 246 268 132 457 139 -92 -25 -74 388 0
3053@K39l96J13K67o3q6L4K13j17qj18K1Q5l51J7J14M1JP5K42j15j97K16k40N1
$$ 0 239 -157 -44 223 160 74 108 321 204 196 78 99 184 -167 -150 -36 5 6 81 323 208 11 227 -13 38
3078C8j13N00m69q2J28j46K35m01K60K57%k16m43L90J04k25R2M2j06J37j47M15
$$ 38 -75 425 -44 -126 2 -144 91 -310 -50 207 207 -9 -452 -62 42 -183 -91 -49 -155 -18 -165 250
3100B50l34r1J46j16q0n4L72n2m80J78M49l73j56O3J81J12j82j48k74N82K5j70
$$ 250 -84 -175 -29 -145 -225 -279 93 41 -439 -261 188 -185 -341 -278 -97 15 -167 -315 -589 -7 18 -152
3122a52j65J86r7K86R4m99J10K51k67J02K49m98L00k9P0L0k26L20R9k88J15p0
$$ -152 -317 -131 -228 58 152 -347 -237 14 -253 -151 98 -400 -100 -129 -59 -29 -255 65 164 -124 -9 -79
3144g9R0o7K2J02L08k98k68r9M20k05k75L09K19l1l90L44L71k52K9k44J28Q5%
$$ -79 11 -56 -34 68 376 78 -190 -289 131 -74 -349 -40 179 148 -242 102 473 221 250 6 134 219 219
3167B19l06J75j59K64J55l60R4j10L49k11l8j55K71q4k27J35Q5O4l49L22Lr2M
$$ 219 -87 88 -71 193 348 -12 82 -28 321 110 72 -83 188 104 -123 12 97 161 -188 134 137 45 49
3190D9J50j80o0Q4J91j68l6R3K03l71o3n7J02m1P9j7J58lj50K01j95L60j77j99
$$ 49 199 19 -41 43 234 66 30 123 326 -45 -108 -165 -63 -104 -25 -42 116 113 -37 164 -31 329 152 -47
3214d7K71m11K49j35O9k76K41K98m89L7L60P7l31L2L0K16k53L26k92Q4k90L22
$$ -47 224 -187 62 -73 -4 -280 -39 259 -230 -193 167 244 -87 -55 -25 191 -62 264 -28 56 -234 88
3236H8J9j61j05J84j60J52k6O3k63k0K4J07L83k48j74J87k6o4m5M9K20j49oJ56
$$ 88 107 -54 -159 25 -135 17 -9 54 -209 -229 -205 -98 285 37 -137 50 24 -40 -85 -36 184 35 29 185
3260A85J9j24l94M0K53p1L2K60o1km8n3J70L1N0m00K4k00N19k21J37o7P4k06N5
$$ 185 204 80 -314 -274 -21 -92 -60 200 139 137 89 36 206 237 287 -113 -89 -289 230 9 146 79 153 -53 2
3285BN4M1j13pJ70k15q8J10L86K7j28k35m6L81j7o7j99R5l9K9j48j98J36J81j76
$$ 2 56 97 -16 -23 147 -68 -156 -46 340 367 239 4 -42 339 322 255 56 151 112 141 -7 -205 -69 112 -64
3310f4K56M7j59P7k06l1R5K00l31J0k8K33l47J36Q8p7J13J26N5j15j23l2Q5j94
$$ -64 192 239 80 157 -49 -80 15 215 -116 -106 -134 99 -248 -112 -24 -101 12 138 193 78 -45 -77 8 -186
3334a86K21k95L31k41K82r4J23j56r8qK43j5r1k53K3K1J50j23k2K01N2k68QK21
$$ -186 35 -260 71 -170 112 18 141 -15 -113 -121 122 107 16 -237 -214 -193 -43 -166 -188 13 65 -203 -195 26
$$ [...]
8191a05
##END NTUPLES=NMR FID
##END=
