##TITLE=1H_LR-640-0-2
 CDCl3, 8 sc, 
 25.12.2019
##JCAMPDX= 6.0         $$ Bruker NMR JCAMP-DX V2.0
##DATA TYPE= NMR FID
##DATA CLASS= NTUPLES
##ORIGIN= UXNMR, Bruker Analytische Messtechnik GmbH
##OWNER= root
$$ XWIN-NMR		Version 3.5
$$ Wed Dec 25 14:09:03 2019 Russian Standard Time (UT+4h)  she@DPX200
##.OBSERVE FREQUENCY= 200.1315
##.OBSERVE NUCLEUS= ^1H
##.DELAY= (6, 6)
##.ACQUISITION MODE= SIMULTANEOUS
##.ACQUISITION SCHEME= undefined
##.AVERAGES= 8
##.DIGITISER RES= 18
##SPECTROMETER/DATA SYSTEM= spect
##.PULSE SEQUENCE= zg30
##.SOLVENT NAME= DMSO
##.SHIFT REFERENCE= (INTERNAL, DMSO, 0, 15.7039)
##AUDIT TRAIL= $$ (NUMBER, WHEN, WHO, WHERE, WHAT)
$$ ##TITLE= Audit trail, XWIN-NMR		Version 3.5
$$ ##JCAMPDX= 5.01
$$ ##ORIGIN= Bruker BioSpin GmbH
$$ ##OWNER= she
$$ F:/spectra/data/she/nmr/H-F/1/audita.txt
$$ ##AUDIT TRAIL=  $$ (NUMBER, WHEN, WHO, WHERE, WHAT)
(   1,<2019-12-25 14:07:14.20 +0400>,<she>,<DPX200>,
      <created by zg, POWCHK disabled, PULCHK disabled
       configuration hash MD5:
       00 E9 B6 7A A2 85 ED C7 34 08 36 98 17 FE 4E 26
       data hash MD5: 16K
       23 4A A9 4C B7 5B 84 A0 A0 63 2D 43 BB C9 20 BF>)
$$ ##END=
$$ 
$$ hash MD5
$$ DB 7B 66 36 5A A8 5F 4E 5E 8F 6D E6 61 D8 F9 32
##$RELAX= 
##$RELAX= 
##$RELAX= 
##$RELAX= 
##$RELAX= 
##$RELAX= 
$$ Bruker specific parameters
$$ --------------------------
##$DU= <F:/spectra>
##$EXPNO= 1
##$NAME= <H-F>
##$PROCNO= 1
##$TYPE= <nmr>
##$USER= <she>
##$AMP= (0..31)
100 100 100 100 100 100 100 100 100 100 100 100 100 100 100 100 100 100 
100 100 100 100 100 100 100 100 100 100 100 100 100 100 
##$AQSEQ= 0
##$AQ_mod= 1
##$AUNM= <au_zg>
##$AUTOPOS= <>
##$BF1= 200.13
##$BF2= 200.13
##$BF3= 200.13
##$BF4= 200.13
##$BF5= 200.13
##$BF6= 200.13
##$BF7= 200.13
##$BF8= 200.13
##$BYTORDA= 1
##$CFDGTYP= 0
##$CFRGTYP= 5
##$CHEMSTR= <none>
##$CNST= (0..31)
1 1 145 1 1 1 1 1 1 1 1 1 1 1 1 1 1 1 1 1 1 1 1 1 1 1 1 1 1 1 1 1 
##$CPDPRG= <>
##$CPDPRG1= <>
##$CPDPRG2= <>
##$CPDPRG3= <>
##$CPDPRG4= <mlev>
##$CPDPRG5= <mlev>
##$CPDPRG6= <mlev>
##$CPDPRG7= <mlev>
##$CPDPRG8= <mlev>
##$CPDPRGB= <>
##$CPDPRGT= <>
##$D= (0..31)
0 1.2 0 0 0 0 0 0 0 0.06 0 0.03 0 0 0 0 0.0002 0 0 0 0 0 0 0 0 0 0 0 0 
0 0 0 
##$DATE= 1577268433
##$DBL= (0..7)
120 120 120 120 120 120 120 120 
##$DBP= (0..7)
150 150 150 150 150 150 150 150 
##$DBP07= 0
##$DBPNAM0= <>
##$DBPNAM1= <>
##$DBPNAM2= <>
##$DBPNAM3= <>
##$DBPNAM4= <>
##$DBPNAM5= <>
##$DBPNAM6= <>
##$DBPNAM7= <>
##$DBPOAL= (0..7)
0.5 0.5 0.5 0.5 0.5 0.5 0.5 0.5 
##$DBPOFFS= (0..7)
0 0 0 0 0 0 0 0 
##$DE= 6
##$DECBNUC= <off>
##$DECIM= 24
##$DECNUC= <off>
##$DECSTAT= 4
##$DIGMOD= 1
##$DIGTYP= 9
##$DL= (0..7)
0 120 120 120 120 120 120 120 
##$DP= (0..7)
150 150 150 150 150 150 150 150 
##$DP07= 0
##$DPNAME0= <>
##$DPNAME1= <>
##$DPNAME2= <>
##$DPNAME3= <>
##$DPNAME4= <>
##$DPNAME5= <>
##$DPNAME6= <>
##$DPNAME7= <>
##$DPOAL= (0..7)
0.5 0.5 0.5 0.5 0.5 0.5 0.5 0.5 
##$DPOFFS= (0..7)
0 0 0 0 0 0 0 0 
##$DQDMODE= 0
##$DR= 18
##$DS= 0
##$DSLIST= <SSSSSSSSSSSSSSS>
$$ [...]
##$SUBNAM2= <"">
##$SUBNAM3= <"">
##$SUBNAM4= <"">
##$SUBNAM5= <"">
##$SUBNAM6= <"">
##$SUBNAM7= <"">
##$SUBNAM8= <"">
##$SUBNAM9= <"">
##$SW= 24.9337058887773
##$SWIBOX= (0..15)
0 0 2 0 0 0 0 0 0 0 0 0 0 0 0 0 
##$SW_h= 4990.01996007984
##$TD= 16384
##$TD0= 1
##$TE= 0
##$TE2= 300
##$TE3= 300
##$TEG= 300
##$TL= (0..7)
0 120 120 120 120 120 120 120 
##$TP= (0..7)
150 150 150 150 150 150 150 150 
##$TP07= 0
##$TPNAME0= <>
##$TPNAME1= <>
##$TPNAME2= <>
##$TPNAME3= <>
##$TPNAME4= <>
##$TPNAME5= <>
##$TPNAME6= <>
##$TPNAME7= <>
##$TPOAL= (0..7)
0.5 0.5 0.5 0.5 0.5 0.5 0.5 0.5 
##$TPOFFS= (0..7)
0 0 0 0 0 0 0 0 
##$TUNHIN= 0
##$TUNHOUT= 0
##$TUNXOUT= 0
##$USERA1= <user>
##$USERA2= <user>
##$USERA3= <user>
##$USERA4= <user>
##$USERA5= <user>
##$V9= 5
##$VALIST= <valist>
##$VCLIST= <CCCCCCCCCCCCCCC>
##$VD= 0
##$VDLIST= <DDDDDDDDDDDDDDD>
##$VPLIST= <PPPPPPPPPPPPPPP>
##$VTLIST= <TTTTTTTTTTTTTTT>
##$WBST= 1024
##$WBSW= 4
##$XGAIN= (0..3)
0 0 0 0 
##$XL= 0
##$YL= 0
##$YMAX_a= 255309
##$YMIN_a= -189207
##$ZGOPTNS= <>
##$ZL1= 120
##$ZL2= 120
##$ZL3= 120
##$ZL4= 120
##$ABSF1= 10
##$ABSF2= 0
##$ABSG= 5
##$ABSL= 3
##$ALPHA= 0
##$AQORDER= 0
##$ASSFAC= 0
##$ASSFACI= 0
##$ASSFACX= 0
##$ASSWID= 0
##$AUNMP= <proc_1d>
##$AZFE= 0.1
##$AZFW= 0.1
##$BCFW= 1
##$BC_mod= 2
##$BYTORDP= 1
##$COROFFS= 0
##$CY= 11.3945322036743
##$DATMOD= 1
##$DC= 2
##$DFILT= <>
##$DTYPP= 0
##$F1P= 16.9975609425685
##$F2P= -3.02152046262296
##$FCOR= 0.5
##$FTSIZE= 0
##$FT_mod= 4
##$GAMMA= 1
##$GB= 0.15
##$INTBC= 1
##$INTSCL= 1
##$ISEN= 128
##$LB= 0.24
##$LEV0= 0
##$LPBIN= 0
##$MAXI= 10000
##$MC2= 0
##$MEAN= 0
##$ME_mod= 0
##$MI= 1.114404
##$NCOEF= 0
##$NC_proc= 0
##$NLEV= 6
##$NOISF1= 3.799351
##$NOISF2= 2.8
##$NSP= 1
##$NTH_PI= 0
##$NZP= 0
##$OFFSET= 15.70392
##$PC= 1
##$PHC0= -10158.74
##$PHC1= 26.0008
##$PH_mod= 1
##$PKNL= yes
##$PPARMOD= 0
##$PSCAL= 0
##$PSIGN= 0
##$REVERSE= no
##$SF= 200.130013532006
##$SI= 16384
##$SIGF1= 3
##$SIGF2= 2
##$SINO= 400
##$SIOLD= 16384
##$SREGLST= <1H.CDCl3>
##$SSB= 0
##$STSI= 0
##$STSR= 0
##$SW_p= 3612.71676300578
##$SYMM= 0
##$S_DEV= 0
##$TDeff= 0
##$TDoff= 0
##$TI= <>
##$TILT= no
##$TM1= 0
##$TM2= 0
##$TOPLEV= 0
##$USERP1= <user>
##$USERP2= <user>
##$USERP3= <user>
##$USERP4= <user>
##$USERP5= <user>
##$WDW= 1
##$XDIM= 8192
##$YMAX_p= 0
##$YMIN_p= 0
$$ End of Bruker specific parameters
$$ ---------------------------------
##NTUPLES= NMR FID
##VAR_NAME=  TIME,          FID/REAL,        FID/IMAG
##SYMBOL=    X,             R,               I
##VAR_TYPE=  INDEPENDENT,   DEPENDENT,       DEPENDENT
##VAR_FORM=  AFFN,          ASDF,            ASDF
##VAR_DIM=   8192,          8192,            8192
##UNITS=     SECONDS,       ARBITRARY UNITS, ARBITRARY UNITS
##FACTOR=    0.0002004,     1,               1
##FIRST=     0,             0,               0
##LAST=      1.6414764,     0,               0
##MIN=       0,             -189207,         0
##MAX=       1.6414764,     255309,          0
$$ Real data points
##PAGE= N=1
##DATA TABLE= (X++(R..R)), XYDATA
$$ [...]
$$ plain form
2398 -695 254 1186 331 -486 -256 645 -210 -865 -142 864 598 -420 -165 423 -75 -578 -13 760 46
2417 46 -377 -10 462 288 -127 657 1501 893 75 106 603 362 -321 -15 483 105 -846 -407 355 471 190
2438 190 558 905 701 318 391 713 660 353 12 341 70 -381 -190 111 165 -25 -154 530 197 -3 -145
2459 -145 432 17 -190 -193 4 148 101 12 337 627 137 4 -20 152 -214 -393 -276 -58 -722 -633 -514 -254
2481 -254 -350 -112 74 449 73 176 412 282 -88 -428 -382 -486 -381 -551 112 -352 -551 -561 81 105 -227
2502 -227 -233 -142 61 -20 -305 -189 -488 -453 231 -24 -187 -111 -176 334 217 -403 -317 -365 -112 -120 -431 -171 -376 -385
2526 -385 230 230 223 -65 391 730 534 24 -396 -261 606 87 -620 -894 -311 534 173 -16 190 305 273 679
2548 679 816 114 22 436 468 -133 -209 151 737 344 -85 -137 327 334 43 246 250 -427 -211 -203 563 81 -867
$$ packed form
2398f95R49R32q55q17K30R01q55o55P23J006k66j018K55N88m98n03N65P73p14
2417D6m23L67M72j74m15P84Q44o08q18L1M97k41o83L06M98l78r51M39P62J16k81
2438A90L68L47k04l83P3L22n3l07l41L29k71m51J91L01N4j90j29O84l33k00j42
2459a45N77m15k07lJ97J44m7q9L25K90m90j33k4J72l66j79J17K18o64Q9J19K60
2481b54r6K38J86L75l76J03K36j30l70l40M6j04J05j70O63m64j99j0O42K4l32
2502b27oR1K03q1k85J16k99L5O84k55j63P6o5N10j17o20Q6m8K53ql11K60k05r
2526c85O15%pk88M56L39j96n10m20J35Q67n19p07k74N83Q45l61j89K06J15l2M06
2548F79J37p02r2M14L2o01p6L60N86l93m29n2M64Pk91K03Mo77K16QP66m82r48
$$ plain form
2571 -867 126 1086 1122 129 -256 828 1032 679 -127 -483 -454 -238 647 5 -851 -435 413 1080 -322 -761
2591 -761 247 1838 813 -734 -605 304 409 -491 -323 472 -104 -537 -186 493 206 -454 -73 627 347
2610 347 -650 -934 -351 -131 -76 3 194 -263 -389 235 1140 -299 -1565 267 1619 115 -2355 -2013 418
2629 418 1139 -1049 -1508 -20 417 -244 -708 344 822 158 239 631 -151 -1827 -724 989 830 -970
2647 -970 -869 575 254 -956 -792 1395 1045 -1125 -762 1019 374 -1839 -1217 1823 2015 -784 -1857
2664 -1857 440 1709 26 -1215 501 1633 -242 -831 -332 -137 -620 225 1749 1106 -1100 -1255 1423
2681 1423 1896 -346 -869 1913 2257 -1228 -2172 397 1565 -364 -1143 1094 1538 -1330 -2238 855 2196
2698 2196 608 -822 498 1510 -651 -1495 102 1660 669 -530 794 738 -1587 -1567 1728 2394 -524
$$ packed form
2571h67R93R60L6r93l85J084K04l53q06l56K9K16Q85o42q56M16Q48O67j402m39
2591g61J008J591j025j547J29R09J05r00J68P95n76m33L51O79k87o60L81P00k80
2610C47r97k84N83K20N5P9J91m57j26O24R05j439j266J832J352j504k470L42K431
2629D18P21k188m59J488M37o61m64J052M78o64Q1L92p82j676J103J713j59j800
2647i70J01J444l21j210J64K187l50k170L63J781o45k213O22L040J92k799j073
2664a857K297J269j683j241J716J132j875n89M99J95m83Q45J524o43k206j55K678
2681A423M73k242n23K782L44l485r44K569J168j929p79K237M44k868r08L093J341
2698B196j588j430J320J012k161q44J597J558r91j199J324n6k325K0L295O66k918
$$ plain form
2715 -524 -2106 400 1675 -1144 -2830 1036 3255 853 -1896 -448 1591 -315 -1408 1235 2659
2730 2659 175 -2451 -1070 1023 -751 -1864 367 2504 -163 -2782 -791 1626 131 -1126 1311
2745 1311 2347 -835 -3360 -1042 1874 508 -1991 279 2290 -758 -3444 -1556 2218 1111 -1454
2760 -1454 -379 1188 -760 -3465 -1236 2670 1507 -1391 -385 1520 -296 -2874 -316 2964 1628
2775 1628 -1642 -1508 922 -834 -3077 -604 3241 2051 -2312 -1758 1200 239 -2295 -117 3795 1902
2791 1902 -2157 -2014 1098 419 -1816 -326 3337 2032 -2671 -2781 1322 1504 -1149 -183 3339 1330
2807 1330 -2818 -2797 1085 1896 -614 -158 3100 1493 -3013 -2558 2293 2658 -599 -971 1749 1102 -3448
2824 -3448 -2589 1737 2912 -434 -1155 1878 1044 -2688 -2083 2474 3516 -314 -1905 1001 985 -2522
$$ packed form
2715e24j582K506J275k819j686L866K219k402k749J448K039j906j093K643J424
2730B659k484k626J381K093j774j113K231K137k667k619J991K417j495j257K437
2745A311J036l182k525K318K916j366k499K270K011l048k686J888L774j107k565
2760a454J075J567j948k705K229L906j163k898J006J905j816k578K558L280j336
2775A628l270J34K430j756k243K473L845j190m363N54K958r61k534K178L912j893
2791A902m059J43L112o79k235J490L663j305m703j10M103J82k653R66L522k009
2807A330m148K1L882Q11k510M56L258j607m506M55M851L65l257l72K720o47m550
2824c448Q59M326J175l346p21L033q34l732O05M557J042l830j591K906j6l507
$$ plain form
2840 -2522 -2114 2143 3670 -507 -2280 496 899 -1968 -1373 3058 3182 -1260 -3115 -202 1741 -1378
2856 -1378 -1527 2447 3641 -884 -3525 -418 1981 -399 -1411 2074 2573 -1608 -4052 -209 1924
2871 1924 -258 -1338 1754 2741 -1673 -3770 -228 2374 258 -1278 694 1375 -2150 -4141 87
2886 87 2865 446 -2230 419 1659 -1564 -3207 215 3663 834 -2061 -417 1096 -1394 -2665
2901 -2665 750 3212 504 -2242 -760 1004 -850 -2547 592 3059 781 -3025 -1499 1213 -622
2916 -622 -1754 1058 3302 516 -2985 -1177 1673 879 -1584 708 2981 50 -3382 -1773 1814
2931 1814 1019 -969 40 2804 725 -2825 -1185 2038 1442 -990 85 2163 384 -2869 -1358
2946 -1358 2460 2166 -817 -233 1356 245 -2625 -761 2722 1861 -977 -1032 1094 79 -2167 -693
$$ packed form
2840b522M08M257J527m177j773K776M03k867N95M431J24m442j855K913J943l119
2856a378j49L974J194m525k641L107K399k380j012L485M99m181k444L843K133
2871A924k182j080L092R87m414k097L542K602k116j536J972O81l525j991M228
2886H7K778k419k676K649J240l223j643L422L448k829k895J644J513k490j271
2901b665L415K462k708k746J482J764j854j697L139K467k278l806J526K712j835
2916f22j132K812K244k786l501J808K850p94k463K292K273k931l432J609L587
2931A814p95j988J009K764k079l550J640L223n96k432J075K078j779l253J511
2946a358L818k94k983N84J589j111k870J864L483q61k838n5K126j015k246J474
$$ plain form
2962 -693 2964 1933 -863 -614 1052 174 -1567 -213 2565 1557 -1561 -1704 348 460 -1352 -254
2978 -254 2315 1534 -1317 -1584 962 977 -846 -130 1958 1192 -1953 -2108 795 777 -988 -662 1420 741
2996 741 -1613 -1934 463 1302 -418 -823 988 808 -1625 -1826 898 1468 -283 -710 361 841 -1232
3013 -1232 -1418 386 1511 -550 -1585 -170 479 -1629 -1231 1031 1484 -599 -1302 13 723 -715
3029 -715 -1062 899 1639 -786 -1487 -122 293 -763 -683 605 1448 -700 -1519 101 700 -300 -587 500
3047 500 892 -563 -1353 24 714 -13 -653 685 990 -442 -1141 23 835 -10 -704 225 850 -103
3065 -103 -1002 94 785 401 -453 481 881 250 -551 129 1079 538 -400 83 402 -98 -495 82 1042 191
3085 191 -430 -60 818 230 -439 401 1069 401 -708 15 685 29 -148 194 907 605 -836 -130 381
$$ packed form
2962f93L657j031k796K49J666q78j741J354K778j008l118j43K052J12j812J098
2978b54K569p81k851k67K546J5j823P16K088p66l145j55K903j8j765L26K082o79
2996G41k354l21K397Q39j720m05J811j80k433k01K724N70j751m27J071M80k073
3013a232j86J804J125k061j035J415O49k108L98K262M53k083p03J315P10j438
3029g15l47J961P40k425p01J365M15j056Q0J288Q43k148q19J620N99j000k87J087
3047E00L92j455p90J377O90p27o40J338L05j432o99J164Q12q45o94R29O25r53
3065a03q99J096O91l84q54R34M00o31q01O80R50n41r38M83L19n00l97N77R60q51
3085A91o21L70Q78n88o69Q40O68o68j109P23O70o56j77L42P13l02j441P06N11
$$ plain form
3104 381 234 -480 14 498 203 -497 67 103 347 -199 305 470 186 -447 -384 338 264 -176 -428 357 -392
3125 -392 -827 -300 484 403 -208 -219 397 195 -336 -275 250 413 -202 -520 -202 -94 -299 -57 73 375 -307
3146 -307 -232 -254 -27 -291 -285 165 -55 -376 -696 77 107 -341 -259 140 -4 -410 -85 308 197 -319 -367 -238
3168 -238 -169 -171 -264 -144 -66 61 -44 26 199 212 154 67 328 -20 192 272 73 -345 -84 255 311 -75 -151 240
3192 240 363 200 -102 22 63 202 73 206 114 77 371 697 184 89 134 406 405 199 64 264 18 83 46
3215 46 258 -156 -133 359 243 311 353 -109 242 303 404 -320 -444 317 422 43 -240 -13 176 122 -24 17
3237 17 -211 44 426 285 -506 -463 168 478 150 -281 -228 241 23 -353 83 -12 132 -282 10 -154 -54
3258 -54 -561 92 -171 -127 -400 -118 221 -55 54 -331 -111 -28 79 -11 -104 -710 -162 0 566 -449 -509 -410
$$ packed form
3104C81j47p14M94M84k95p00N64L6K44n46N04J65k84o33O3P22p4m40k52P85p49
3125c92m35N27P84q1o11j1O16k02n31O1N25J63o15l18L18J08k05K42J30L02o82
3146c07P5k2K27k64OM50k20l21l20P73L0m48Q2L99j44m06L25L93j11n16m8J29
3168b38O9kr3J20P8J27j05P0J73J3n8q7K61l48K12Q0j99m18K61L39N6l86p6L91
3192B40J23j63l02J24M1J39j29J33r2l7K94L26n13r5M5K72jk06j35K00k46O5l7
3215D6K12m14K3M92j16O8M2m62L51O1J01p24j24P61J05l79k83K27J89n4j46M1
3237A7k28K55L82j41p91M3O31L10l28m31N3M69k18l76M36r5J44m14K92j64J00
3258e4n07O53k63M4k73K82L39k76J09l85K20Q3J07r0r3o06N48J62N66j015o0R9
$$ plain form
3280 -410 258 173 -630 -336 264 388 -419 -519 -366 166 24 -382 -74 -131 -334 150 183 192 -583 -77 557 141
3302 141 -551 -567 5 336 -429 -155 440 -291 -720 39 975 519 -473 -170 725 436 -493 -495 461 907 -197
3323 -197 -336 99 304 -397 -27 681 651 -172 150 829 621 -732 -508 932 1005 -89 -716 435 478 -407
3343 -407 -67 966 1003 -586 -643 527 719 -243 -359 837 947 -585 -629 337 580 -278 3 831 775 -553
3363 -553 -1063 368 943 -390 -388 847 850 -839 -1226 561 1342 -57 -624 405 586 -885 -1072 305
3381 305 946 143 -872 206 475 -749 -1076 439 1520 -40 -1273 -222 420 -930 -1390 269 1323
3398 1323 37 -1288 -184 908 -859 -1326 600 1499 -114 -1713 -577 420 -462 -1030 222 1255
3414 1255 -265 -2012 -306 1082 -189 -569 381 1539 -310 -2360 -739 1277 525 -1021 137 1346
$$ packed form
3280d10O68q5q03K94O00J24q07j00J53N32j42m06L08n7k03M84L3Rp75N06O34m16
3302A41o92j6N72L31p65K74N95p31m29P59R36m56r92L03Q95k89r29kR56M46j104
3323a97j39M35K05p01L70P08l0q23L22O79k08j353K24J440P3j094o27J151M3q85
3343d07L40J033L7j589n7J170J92r62j16J196J10j532m4R66K43q58K81Q28n6j328
3363e53n10J431N75j333KJ235Lj689l87J787P81j399n67J029J81j471j87J377
3381C05O41q03j015J078K69j224l27J515J081j560j233J051O42j350m60J659J054
3398A323j286j325J104J092j767m67J926Q99j613j599J136R97q82n68J252J033
3414A255j520j747J706J388j271l80R50J158j849k050J621K016p52j546J158J209
$$ plain form
3430 1346 -389 -1843 -243 1206 558 -808 478 1381 -412 -1919 -275 1898 911 -1021 -75 761
3446 761 -434 -1623 -28 2020 686 -1091 -554 1178 -422 -1826 -155 2171 1288 -1286 -804 933
3462 933 44 -1075 221 2419 1276 -1639 -1197 718 432 -1222 75 2243 978 -1662 -1440 1002
3478 1002 911 -669 140 1604 650 -1921 -1435 990 1336 -513 -126 1642 749 -1887 -1279 1198 1703
3495 1703 -481 -333 952 504 -2066 -1608 1502 1799 -860 -763 1146 634 -2180 -1504 1694 2135 -636
3512 -636 -1261 665 -139 -2002 -1323 1584 1951 -864 -1715 278 466 -1321 -1296 1682 1974 -1156 -2149 284
3530 284 596 -1252 -1100 1980 1742 -1528 -2142 185 811 -621 -624 1553 1900 -1547 -2576 109 1540
3547 1540 -382 -751 1384 1270 -1388 -2482 142 1794 -292 -725 1067 990 -1616 -2302 535 2293
$$ packed form
3430A346j735j454J600J449o48j366J286R03j793j507J644K173r87j932R46Q36
3446G61j195j189J595K048j334j777N37J732j600j404J671K326q83k574M82J737
3462I33q89j119J296K198j143k915M42J915k86j654J297K168j265k640K22K442
3478A002r1j580Q09J464r54k571M86K425L46j849L87J768q93k636O08K477N05
3495A703k184J48J285m48k570M58L110K97k659R7J909n12k814O76L198M41k771
3512f36o25J926q04j863O79K907L67k815q51J993J88j787K5K978K92l130r93K433
3530B84L12j848J52L080k38l270o14K327O26j432lK177L47l447j029K685J431
3547A540j922l69K135j14k658j094K624J652k086m33J792p7k606o86K837J758
$$ plain form
3563 2293 207 -1268 588 1203 -1242 -1926 843 2246 421 -1412 339 1097 -962 -1755 827 2487
3579 2487 529 -1454 -397 1025 -276 -1386 755 2319 289 -1919 -347 1286 -261 -1081 1177
3594 1177 2630 93 -2128 -492 1207 251 -807 869 2011 -236 -1924 -700 1502 807 -931
3609 -931 691 1834 -350 -2115 -831 1638 1100 -724 301 1472 -1 -2266 -499 1613 624 -884
3625 -884 -76 1241 -231 -2141 -531 2050 1398 -1002 -951 820 -159 -1760 -319 1799 999 -851 -939
3642 -939 593 -94 -1635 -257 1915 823 -1250 -1288 696 321 -1044 -156 1635 749 -1448 -1251 586
3659 586 761 -1067 -204 1133 675 -1697 -1202 346 541 -391 -447 1153 597 -1466 -1033 631 1121 -692
3677 -692 -521 943 614 -1578 -1347 783 1329 -346 -876 483 333 -1074 -1091 856 1067 -189 -704 418
$$ packed form
3563B293k086j475J856O15k445o84K769J403j825j833J751P58k059p93K582J660
3579B487j958j983J057J422j301j110K141J564k030k208J572J633j547q20K258
3594A177J453k537k221J636J699r56j058J676J142k247j688J224K202o95j738
3609i31J622J143k184j765J284K469n38j824J025J171j473k265J767K112r89j508
3625h84Q08J317j472j910J610K581o52k400N1J771r79j601J441K118q00j850q8
3642i39J532o87j541J378K172j092k073l8J984l75j365Q88J791q86k197J97J837
3659E86J75j828Q63J337m58k372M95J548J95r32n6J600n56k063M33J664M90j813
3677f92J71J464l29k192K31K130N46j675n30J359j50j407j7J947K11j256n15J122
$$ plain form
3695 418 636 -1062 -885 1021 1268 -505 -912 150 605 -765 -489 1306 1445 -355 -1067 57 801
3712 801 -50 -513 1047 839 -220 -848 7 621 38 -622 437 974 109 -1042 62 891 -105 -394
3730 -394 418 1049 -303 -1086 -213 748 172 -355 279 509 -303 -798 114 1180 509 -225 223 424 -325
3749 -325 -979 206 1026 -124 -768 301 746 -179 -782 147 642 -55 -474 -349 811 66 -653 316 732
3768 732 -140 -958 -65 612 36 -318 -159 159 -153 -764 -481 231 190 -597 -68 375 -67 -622 -368 28
3788 28 298 -450 -160 120 90 -777 -509 516 -13 -665 -428 51 -290 -417 -302 190 201 -298 -246 156 113
3809 113 -389 -543 116 10 -221 -7 174 14 -140 -105 178 -71 -223 -103 163 33 -586 24 455 265
3829 265 -107 57 54 -111 39 243 168 378 -212 -64 490 22 8 39 287 529 102 -48 65 151 107 -338
$$ packed form
3695D18K18j698J77J906K47j773m07J062M55j370K76J795J39j800p12J124P44
3712H01q51m63J560k08j059o28Q55O14n83o60J059N37q65j151J104Q29r96k89
3730c94Q12O31j352p83Q73R61n76n27O34K30q12m95R12J066o71p34M48K01p49
3749c25o54J185Q20j150o44J069M45r25o03R29M95o97m19J25J160p45p19R69M16
3768G32q72q18Q93O77n76l54J59L18l12o11K83P12m1p87N29M43m42n55K54L96
3788B8K70p48K90K80l0q67K68J025n29o52K37M79l41j27J15M92J1m99N2M02m3
3809A13n02j54O59j06k31K14J81j60j54L5K83k49j52J20K66j30o19O10M31j90
3829B65l72J64lj65J50K04p5K10n90J48N54m68j4L1K48K42m27j50J13Q6m4m45
$$ plain form
3851 -338 91 114 -42 161 286 241 -60 129 238 160 -158 -61 252 140 114 108 -273 204 269 -282 -17 289 -67
3874 -67 74 254 242 26 -143 205 -6 -33 -141 55 55 138 -138 -202 274 120 -54 -304 184 -281 -54 196
3896 196 271 -35 116 202 -94 -112 -203 -223 210 -4 144 -21 -152 -302 35 -30 -358 -188 -187 -74 96 -268 -249
3919 -249 -405 -18 37 -296 -75 -220 -174 -197 59 -268 -132 -228 -404 128 -210 -66 -240 -52 36 -162 180 117
3941 117 223 231 -254 326 56 -2 -208 -225 -90 -584 -69 328 336 -325 -293 71 141 -481 274 63 47 32 -82
3964 -82 241 200 -57 -130 460 -82 -123 -11 69 226 -150 -8 102 270 -199 -256 152 227 -79 65 209 4
3986 4 -577 -128 308 319 -51 -168 175 154 -103 -303 273 263 76 61 244 -83 -94 -51 531 288 -83 -603 185
4009 185 -39 -347 15 483 384 -294 -452 262 175 -417 -46 548 322 -326 -637 267 151 -417 -420 215 312 -550
$$ packed form
3851c38M29K3j56K03J25m5l01J89J09p8l18R7L13j12k6ol81M77O5n51K65L06l56
3874f7J41J80j2k16j69L48k11k7j08J96%Q3k76o4M76j54j74k50M88m65K27K50
3896A96P5l06J51Q6k96j8r1k0M33k14J48j65j31j50L37o5l28J70JJ13J70l64J9
3919b49j56L87N5l33K21j45M6k3K56l27J36r6j76N32l38J44j74J88Q8j98L42o3
3941A17J06Qm85N80k70n8k06j7J35m94N15L97Qo61L2L64P0o22P55k11j6j5j14
3964h2L23m1k57p3N90n42m1J12Q0J57l76J42J10J68m69n7M08P5l06J44J44k05
3986Dn81M49M36J1l70j17L43k1k57k00N76j0j87j5J83l27j1M3N82k43l71n20P88
4009A85k24l08L62M68r9o78j58P14q7n92L71N94k26o48l11R04j16n68lO35R7q62
$$ plain form
4031 -550 -418 222 216 -551 -237 597 615 -665 -375 7 389 45 -590 282 173 -561 -915 45 332 -247 -527
4052 -527 473 149 -686 -962 218 582 -71 -607 -89 228 -376 -775 486 888 -363 -559 -6 540 -579
4071 -579 -942 361 663 -96 -448 39 421 -396 -703 369 1024 -524 -755 -54 459 -119 -590 604 769
4090 769 -165 -988 -82 678 -126 -624 320 992 -388 -902 -35 990 111 -444 313 899 -24 -1168 37
4109 37 975 355 -886 -2 823 -180 -1062 -14 1104 370 -777 176 808 -343 -905 -76 1370 548
4127 548 -448 -224 543 -53 -1129 243 1506 344 -600 -310 749 87 -994 29 1260 289 -1440
4144 -1440 -642 688 173 -706 -100 1182 182 -1322 -813 706 204 -612 -98 1400 238 -1418 -850
4161 -850 863 426 -977 -361 641 71 -1319 -849 770 496 -908 -597 1176 166 -1305 -837 999
$$ packed form
4031e50J32O40op67L14Q34J8j280K90L82L82l44o35Q72j09p34l54R60K87n79k80
4052e27J000l24q35k76J180L64o53n36N18L17o04l99J261M02j251j96N53N46j119
4071e79l63J303L02p59l52M87L82q17l07J072O55j548k31P01N13n78m71J194J65
4090G69r34q23R06P60q04m98R44O72j380n14Q67J025q79n55P57N86r23j144J205
4109C7R38o20j241Q84Q25j003q82J048J118p34j147R53O32j151n62Q29J446q22
4127E48r96K24P67n96j076J372J263j162r44K90J059o62j081J023J231r71j729
4144a440P98J330n15q79O06J282j000j504N09J519n02q16N14J498j162j656N68
4161h50J713m37j403O16J002n70j390M70J619k74j404L11J773j010j471M68J836
$$ plain form
4178 999 956 -797 -761 607 383 -1500 -843 1187 934 -736 -770 533 -136 -1254 -857 852 929 -812
4196 -812 -1199 290 488 -825 -749 792 1221 -1007 -1311 362 525 -875 -632 1401 1006 -1116 -1223 393
4214 393 653 -308 -329 1369 1078 -1101 -1466 473 1144 -633 -327 1195 712 -996 -1390 955 1221 -10
4232 -10 -645 911 767 -1155 -1293 525 1546 -106 -813 636 595 -575 -981 904 1455 -86 -951 234
4250 234 828 -820 -1254 710 1651 37 -941 176 578 -544 -1119 990 1558 -301 -1267 -281 623 -183
4268 -183 -704 834 1757 -103 -1360 -135 760 -34 -980 694 1590 -396 -1642 -145 1420 50 -897
4285 -897 703 1114 -221 -1672 -183 1215 186 -834 57 969 -804 -1536 -301 1345 254 -896
4301 -896 -8 804 -407 -1474 -364 1059 208 -1076 -362 608 -269 -1425 -257 1257 418 -968 -480
$$ packed form
4178I99m3j753L6J368k24j883O57K030k53j670l4J303o69j118L97J709P7j741
4196h12l87J489J98j313P6J541M29k228l04J673J63j400K43K033l95k122j07J616
4214C93K60r61k1J698k91k179l65J939O71j777L06J522m83j708l94K345K66j231
4232a0o35J556j44j922j38J818J021j652p07J449m1j170m06J885N51j541q65J185
4250B34N94j648m34J964R41j614r78J117M02j122n75K109N68j859r66R86R04q06
4268a83n21J538R23j860j257J225Q95p94r46J674Q96j986j246J497J565j370r47
4285h97J600M11j335j451J489J398j029j020Q91R12j773p32J235J646j091j150
4301h96Q88Q12j211j067J110J423q51j284P14R70q77j156J168J514q39j386M88
$$ plain form
4318 -480 326 -48 -1197 -81 1694 558 -1007 -846 490 333 -812 31 1510 413 -1142 -484 321
4335 321 284 -780 95 1237 93 -1210 -444 625 821 -546 -301 810 366 -1200 -895 1044 838
4352 838 -469 -264 1053 498 -1217 -897 670 847 -575 -375 788 452 -709 -382 905 937 -331
4369 -331 -480 486 292 -801 -613 1053 1013 -160 -275 422 327 -509 -441 864 950 -328 -865 377 504
4388 504 -155 -294 643 398 -281 -620 296 650 -200 -24 612 323 -522 -921 232 857 -137 -285 901
4407 901 418 -592 -847 522 771 -437 -208 160 173 -515 -668 134 662 -203 -526 160 422 -423 -620
4426 -620 197 483 -162 -505 -174 377 -387 -639 168 445 -51 -436 -69 298 -564 -500 214 639 49 -533
4446 -533 -255 215 -142 -215 152 666 -32 -295 -213 256 -31 -298 -7 456 259 -737 -429 299 118 -374 87
$$ packed form
4318d80Q06l74j149J116J775j136j565J61J336j57j145Q43J479j097j555O58Q05
4335C21l7j064Q75J142j144j303P66J069J96j367K45J111m44j566L05J939k06
4352H38j307K05J317n55j715L20J567J77j422K00J163l36j161L27J287L2j268
4369c31j49R66j94j093J88J666m0j173j15O97r5q36O8J305Q6j278n37J242J27
4388E04o59j39R37k45o79l39R16L54q50J76O36k89q45l99J153O25r94j48J186
4407I01m83j010k55J369K49j208K29L68J3o88j53Q02N28q65l23O86K62q45j97
4426f20Q17K86o45l43L31N51p64k52Q07K77m96l85L67L67q62O4P14M25n90n82
4446e33K78M70l57p3L67N14o98k63Q2M69k87k67K91M63j97r96L08P28j81m92M61
$$ plain form
4467 87 196 -220 -336 351 447 78 -308 -204 5 -227 -179 -7 181 328 -333 -10 457 348 -187 191 253
4488 253 398 22 57 439 -25 -195 -217 318 23 -280 -77 250 79 -209 -25 315 347 -16 284 221 58
4509 58 73 323 269 9 -201 -294 268 106 30 -38 289 -132 -146 -280 239 170 137 134 124 236 -67 -99 123 -30
4533 -30 64 133 210 77 -444 115 -24 -119 -185 223 -84 -289 78 -148 198 87 -311 5 -89 107 1 -124
4555 -124 -131 -268 -230 -196 -245 124 -141 129 39 -201 -326 -124 183 272 -209 -352 159 -83 -35 -74 225 158 97 -310
4579 -310 -51 -193 -31 72 -230 -11 -255 149 -272 -283 294 -4 -7 221 -53 7 54 53 -209 -63 -71 -34 -108 30
4603 30 248 263 -76 266 174 77 69 -124 -11 31 593 -471 -372 116 174 202 57 54 -2 -211 64 286 14 97
4627 97 62 -69 194 132 -115 -127 250 235 236 428 288 88 46 178 170 -62 -89 216 -181 -364 -150 -174 120 -12
$$ packed form
4467H7J09m16j16O87R6l69l86J04K09k32M8J72J88J47o61L23M67j09n35L78O2
4488B53J45l76L5L82m64j70k2N35k95l03K03L27j71k88J84L40L2l63L00o3j63
4509E8J5K50n4k60k10r3N62j62p6o8L27m21j4j34N19o9l3lj0J12l03l2K22j53
4533c0R4O9P7j33n21N59j39r5o6M08l07k05L67k26L46j11l98L16r4J96j06j25
4555a24pj37L8L4m9L69k65K70r0k40j25K02L07Q9m81j43N11k42M8l9K99o7o1m07
4579c10K59j42J62J03l02K19k44M04m21j1N77k98lK28k74O0M7jk62J46qL7p4J38
4603C0K18J5l39L42r2r7qj93J13M2N62j064R9M88N8K8j45ln6k09K75K22k72Q3
4627I7l5j31K63o2k47j2L77j5JJ92j40k00m2J32qk32k7L05l97j83K14k4K94j32
$$ plain form
4651 -12 -37 155 1 -325 158 66 -17 124 -93 -169 -80 41 249 98 247 -88 -98 155 -139 -81 46 57 1
4674 1 -129 -211 -178 360 -100 25 314 111 -332 -135 26 -56 -274 -307 194 3 113 -186 -121 183 -197 -241 144
4697 144 120 -242 -256 153 -62 -332 -272 170 78 -5 -429 170 285 -97 135 207 38 -255 -347 182 429 -126
4719 -126 -295 204 127 -40 -247 331 197 -29 -97 150 202 -585 -27 165 282 -54 -198 323 275 -292 -118
4740 -118 122 331 39 -235 525 348 -268 -234 519 637 257 -197 230 328 -111 -207 398 400 -124 -214 41 277
4762 277 19 -376 443 661 -139 -522 -107 529 -152 -99 661 264 -131 -534 239 756 -163 -356 272 730
4782 730 -256 -594 -19 379 144 -89 262 592 -335 -663 42 753 157 -344 -142 531 -103 -962 -12 639
4802 639 -153 -516 -129 153 -537 -591 -218 847 110 -619 -227 474 284 -680 -72 659 149 -833 -319 503
$$ packed form
4651a2k5J92j54l26M83r2q3J41k17p6Q9J21K08j51J49l35j0K53k94N8J27J1n6
4674Aj30q2L3N38m60J25K89k03m43J97J61q2k18l3N01j91J10k99O5L04l80m4L85
4697A44k4l62j4M09k15k70O0M42r2q3m24N99J15l82K32P2j69k93r2N29K47n55
4719a26j69M99p7j67k07N78j34k26o8K47N2p87N58J92J17l36j44N21m8n67J74
4740a18K40K09k92k74P60j77o16L4P53J18l80m54M27R8m39r6O05Kn24r0K55K36
4762B77k58l95Q19K18q00l83M15O36o81N3P60l97l95m03P73N17r19j93O28M58
4782G30r86l38N75L98k35k33L51L30r27l28P05P11n96n01K02O73o34q59R50O51
4802F39p92l63L87K82o90n4L73J065p37p29L92P01j90r64O08P31n10r82N14Q22
$$ plain form
4822 503 -107 -615 163 586 32 -859 -532 350 37 -685 -330 353 33 -873 -538 529 226 -497 -106 731
4842 731 123 -1086 -715 470 371 -247 -103 753 4 -1043 -352 658 407 -464 -134 466 431 -748 -403
4861 -403 928 415 -538 -156 337 49 -646 -312 750 613 -659 -685 706 206 -586 -58 901 849 -640
4880 -640 -646 634 652 -541 -332 971 427 -1090 -766 315 156 -584 -421 841 432 -890 -830 285 811
4899 811 -396 -118 489 529 -611 -1071 458 648 -167 -424 447 632 -784 -719 446 1004 -29 -639 357
4918 357 539 -360 -454 530 990 -162 -586 288 75 -529 -727 482 615 53 -701 22 497 -596 -407
4937 -407 616 715 -20 -855 -104 432 -63 -503 352 649 -334 -870 45 564 41 -520 278 984 -695 -1111
4957 -1111 -346 558 -278 -675 411 500 -581 -913 -92 840 -135 -852 192 723 -138 -877 -200 988 324
$$ packed form
4822E03o10n08P78M23n54q91L27Q82l13p22L55O83l20r06L35J067l03p23L91Q37
4842G31o08j209L71J185r9o18J44Q56p49j047O91J010k51q71L30O00l5j179L45
4861d03J331n13r53L82M93k88o95L34J062j37j272k6J391n00p92N28R59n2j489
4880f40oJ280J8j193K09J303n44j517L24J081j59p40J63J262m09j322O0J115N26
4899H11j207K78O07M0j140m60J529J90q15k57Q71J85j416O5J165N58j033o10R96
4918C57J82q99r4R84M60j152m24Q74k13o04j98J209J33n62p54P23M75j093J89
4937d07J023R9p35q35P51N36m95m40Q55K97r83n36R15N19n23n61P98P06j679m16
4957a111P65R04q36l97J086Q9j081l32Q21R32r75p17J044N31q61p39O77J188o64
$$ plain form
4976 324 -619 -98 493 88 -909 -78 911 129 -641 -40 785 61 -991 107 768 235 -716 -255 336
4995 336 -7 -826 2 739 165 -700 -539 353 178 -471 46 808 178 -608 -341 782 361 -539 -50 855
5015 855 174 -852 -356 527 377 -695 43 996 378 -539 -218 825 689 -627 -360 703 203 -847
5033 -847 -247 765 275 -161 -66 610 334 -756 -162 678 479 -67 -328 360 16 -467 -279 626 363 -317
5053 -317 -344 380 -49 -545 -421 595 321 -430 -472 254 456 -455 -414 466 120 -396 -527 88 281 -356 -180
5074 -180 514 278 -572 -814 160 332 -26 -232 136 218 -522 -226 115 364 -105 -111 359 81 -125 -439 214
5095 214 286 -379 -655 87 269 292 -528 279 800 39 -155 21 270 90 -401 386 501 -345 -311 131 519
5116 519 -361 -477 385 335 -59 -486 55 317 -158 -324 94 328 -133 -625 -215 348 -111 -434 334 430 132
$$ packed form
4976C24r43N21N91m05r97Q31R89p82p70O01Q25p24j052J098O61n33r51M61N91
4995C36l43q19Q28P37n74q65J61Q92j75o49N17P62o30p86K67J123m21r00M89R05
5015H55o81j026M96Q83j50j072P38R53o18r17L21J043j36j316K67J063n00j050
5033h47O00J012m90m36R5O76k76j090N94Q40j99n46k61O88l44m83J88R05k63o80
5053c17k7P24m29m96J24J016k74p51m2P26K02r11M1Q80l46n16j31O15J93o37J76
5074a80O94k36q50k42R74J72l58k06L68Q2p40K96L41K49m69oM70k78k06l14O53
5095B14P2o65k76P42J82K3q20Q07N21p61j94J76K49j80m91P87J15q46L4M42L88
5116E19q80j16Q62n0l94m27N41K62m75j66M18K34m61m92M10N63m59l23P68R6k98
$$ plain form
5137 132 -364 26 341 180 -374 64 397 -110 -262 -9 290 134 -457 113 299 -33 -26 296 429 91 -104
5158 -104 169 339 -91 -347 304 270 40 2 -205 291 -46 -96 -56 322 210 -314 6 360 -22 -151 -64 -44
5180 -44 -169 -51 -182 -112 -206 -265 108 57 77 -200 -259 316 159 -261 -256 222 342 -137 -164 297 87 -412 -158
5203 -158 141 135 60 -95 279 -151 -62 -230 8 269 47 -25 278 -58 -169 -57 239 60 -132 -38 196 -43
5225 -43 -309 44 108 102 -389 -239 -119 -34 -484 -272 52 -456 -27 -159 -168 -168 68 19 -126 -66 -24 -329 -51 174
5249 174 -151 -175 121 69 -80 -77 129 -152 -153 185 -26 177 34 80 154 -147 308 73 91 40 264 -119 196
5272 196 128 295 179 82 105 110 124 429 157 67 8 -34 295 -47 104 17 271 -160 32 271 180 39 -293 -201
5296 -201 -28 64 261 -188 121 162 285 -126 15 254 108 -12 -62 -4 198 -288 -8 -6 -39 -130 -4 -228 -57
$$ packed form
5137A32m96L90L15j61n54M38L33n07j52K53K99j56n91N70J86l32PL22J33l38j95
5158a04K73J70m30k56O51l4k30l8k07M96l37n0M0L78j12n24L20L54l82j29Q7K0
5180d4j25J18j31P0r4n9L73n1K0k77n9N75j57m20NM78J20m79k7M61k10m99K54
5203a58K99op5j55L74m30Q9j68K38K61k22p2L03l36j11J12K96j79j92R4K34k39
5225d3k66L53O4om91J50J20Q5m50K12L24n08M29j32r%K36m9j45O0M2l05K78K25
5249A74l25k4K96n2j49LK06k81jL38k11K03j43M6P4l01M55k35J8n1K24l83L15
5272A96o8J67j16r7K3NJ4L05k72r0n9m2L29l42J51q7K54m31J92K39r1j41l32R2
5296b01J73R2J97m49L09M1J23m11J41K39j46j20n0N8K02m86K80Kl3r1J26k24J71
$$ plain form
5319 -57 35 163 -13 2 -69 -81 -3 -284 387 223 77 -102 -174 79 260 -275 -133 -332 212 -220 -129 -79 -60
5342 -60 16 -34 -153 -93 -74 330 -52 -34 -75 160 -40 -272 -31 -229 233 -205 -310 -337 206 -159 -207 69 78 363
5366 363 -421 -7 -102 82 -98 -273 -33 218 -171 -193 193 -100 94 88 156 239 -96 -322 -4 28 -67 -41 542
5389 542 -26 -35 -148 96 -93 -65 -102 -12 122 338 -34 253 494 104 -105 73 109 -39 -23 234 356 9
5411 9 -76 154 447 -105 -195 211 250 -96 39 175 -48 -357 -221 -89 130 -108 -104 -18 -319 122 -128 289 210
5434 210 -169 -600 128 222 11 -176 37 358 -286 -65 39 338 27 47 138 284 -163 -56 -25 407 -105
5455 -105 -291 -201 58 -272 -106 -19 154 -2 -473 -106 464 -97 -482 -145 104 -198 -589 -40 207 -45 -136
5476 -136 -120 407 207 -255 154 130 -612 -231 76 551 -287 -220 -100 251 204 -147 119 312 -11 -483 -43
$$ packed form
5319e7R2J28j76J5p1j2P8k81O71j64j46j79p2K53J81n35J42j99N44m32R1N0J9
5342f0P6n0j19O0J9M04l82J8m1K35k00k32K41j98M62m38j05k7N43l65m8K76RK85
5366C63p84M14r5J84j80j75K40K51l89k2L86k93J94oO8Q3l35k26L18L2r5K6N83
5389E42n68rj13K44j89K8l7R0J34K16l72K87K41l90k09J78L6j48J6K57J22l47
5411Iq5K30K93n52r0M06L9l46J35J36k23l09J36J32K19k38MQ6l01M41k50M17p9
5434B10l79m31P28R4k11j87K13L21o44K21J04K99l11K0R1J46m47J07L1M32n12
5455a05j86R0K59l30J66Q7J73j56m71L67N70n61l85L37K49l02l91N49K47k52r1
5476a36J6N27k00m62M09k4p42L81L07M75q38O7J20L51m7l51K66J93l23m72M40
$$ plain form
5497 -43 361 318 -164 148 393 47 -407 -224 418 -131 -350 158 633 -189 -317 -164 138 -30 -373 134 299
5518 299 47 -358 -172 383 198 -122 -221 166 232 -375 -71 96 330 -22 -156 453 42 -382 108 528 142
5539 142 -369 -50 455 64 -139 132 633 392 -143 -337 464 127 -640 -116 462 326 -395 -78 496 338
5559 338 -717 -164 282 170 -371 -207 486 116 -168 -93 252 332 -509 -236 235 218 -471 -401 172 202 -149
5580 -149 -622 587 443 -217 -163 399 191 -351 -501 137 336 -455 -691 117 494 -348 -680 374 781 -272
5600 -272 -534 -2 203 -469 -563 232 378 -54 -276 -19 -19 -541 -405 245 535 -132 -533 -12 327 -495 -185
5621 -185 377 406 -262 -560 -84 510 -310 -275 507 524 -141 -931 188 244 -186 -219 -18 438 -227 -293 209 694
5643 694 -96 -405 189 611 -397 -612 208 606 146 -267 137 281 -105 -616 34 522 34 -497 -121 294
$$ packed form
5497d3M04m3m82L12K45l46m54J83O42n49k19N08M75q22j28J53L02j68l43N07J65
5518B99k52m05J86N55j85l20r9L87O6o07L04J67K34l52j34O09m11m24M90M20l86
5539A42n11L19N05l91k03K71N01k41n35j94Q01l37p67N24N78j36p21L17N74j58
5559C38j055N53M46j12n41J64O93l70k84P5L45Q0q41K73M71j7o89P0N73L0l51
5580a49m73J209j44o60N4N62k08n42j50O38J99p91k36Q08L77q42l32J054M07j053
5600b72k62N32K05o72r4P95J46m32k22K57%n22J36O50K90o67m01N21L39q22L10
5621a85N62K9o68k98M76N94q20L5P82J7o65p90J119N6m30l3K01M56o65o6N02M85
5643F94p90l09N94M22j008k15Q20L98m60m13M04J44l86n11O50M88m88n31L76M15
$$ plain form
5663 294 -53 -371 181 771 132 -465 -79 79 -97 -136 15 727 154 -404 -163 713 -239 -321 14 561 91
5684 91 -301 -12 553 209 -270 12 489 -72 -366 7 273 203 -601 -138 673 36 -502 -248 484 227 -152
5705 -152 -184 251 204 -205 -332 403 346 -287 26 363 16 -555 -397 632 255 -505 -61 101 -159 -439 -263
5726 -263 401 306 -334 -201 250 37 -498 -110 574 242 -300 -439 38 187 -376 -121 385 360 -141 -249 170
5747 170 109 -306 -4 387 470 -439 -86 374 148 -187 -431 215 165 -411 -411 192 206 -147 -109 269 6 -187
5769 -187 -100 243 280 -103 -429 -69 271 -95 -39 215 228 -54 -236 159 123 -334 -310 160 341 0 -258 304
5791 304 -71 -264 -92 205 420 -68 -178 143 133 -34 160 194 436 -130 -452 -292 401 -86 -102 136 265
5812 265 -203 -472 -118 -42 -214 -188 110 324 -122 -228 -92 172 -99 -180 123 -70 73 -204 162 -16 68
$$ packed form
5663B94l47l18N52N90o39n97L86J58j76l9J51P12n73n58K41Q76r52q2L35N47m70
5684I1l92K89N65l44m79K82M77n61k94L73K66p0q04M63Q11o37n38K54P32k57l79
5705a52l2M35m7m09j27P35n7o33L13L37l47n71J58J029l77p60M44J62k60k80J76
5726b63O64r5o40J33M51k13n35L88O84l32n42j39M77J49n63K55N06k5n01j08M19
5747A70o1m15L02L91Q3r09L53M60k26l35k44O46n0n76%O03J4l53L8L78k63j93
5769a87Q7L43L7l83l26L60L40l66N6K54J3k82j82L95l6m57K4M70J81l41k58N62
5791C04l75j93J72K97K15m88j10L21j0j67J94L4K42n66l22J60O93m87j6K38J29
5812B65m68k69L54P6j72K6K98K14m46j06J36K64k71q1L03j93J43k77L66j78Q4
$$ plain form
5833 68 104 53 384 225 -334 152 175 31 -265 -219 188 -235 -199 -74 253 93 -116 -215 -3 8 -390 -9 504
5856 504 -259 -138 -142 77 -33 -141 -198 175 33 -283 -45 146 301 -261 -35 86 290 -191 -40 246 154
5877 154 -166 -108 57 23 -356 -87 -112 -3 -126 -37 39 17 -14 -45 -295 150 6 -198 54 24 14 27 131 307
5901 307 -46 167 -80 -105 176 -107 66 272 219 39 219 183 226 -11 -105 -223 -68 -309 -3 -16 93 138
5923 138 -86 248 218 -58 -19 55 170 325 -12 7 -104 54 101 246 -113 284 -3 88 142 -121 -52 299 -98
5946 -98 -91 108 -90 -328 -56 -15 165 -217 -83 -96 -132 -147 21 34 10 -137 43 -336 51 37 -7 240 188 -165
5970 -165 -300 226 -39 -34 -336 -89 167 54 -30 -198 15 12 4 29 -238 -88 -157 62 166 -6 49 19 -145 91
5994 91 -185 -177 -278 -247 47 -119 -126 -171 -268 -299 -54 -39 119 144 304 -115 -167 91 94 60 164 -41 13 258 -193
$$ packed form
5833F8L6n1L31j59n59M86K3j44k96M6M07m23L6J25L27j60k09r9K12J1l98L81N13
5856E04p63J21mK19j10j08n7L73j42l16K38J91J55n62K26J21K04m81J51K86r2
5877A54l20N8J65l4l79K69k5J09j23Q9P6k2l1l1k50M45j44k04K52l0j0J3J04J76
5901C07l53K13k47k5K81k83J73K06n3j80J80l6M3k37r4j18J55k41L06j3J09M5
5923A38k24L34l0k76L9P4J15J55l37J9j11J58M7J45l59L97k87R1N4k63O9L51l97
5946i8PJ99j98k38K72M1J80l82J34j3l6j5J68J3k4j47J80l79L87j4m4K47n2l53
5970a65j35N26k65Nl02K47K56j13q4j68K13lqK5k67J50o9K19J04j72N5l0j64K36
5994I1k76Qj01L1K94j66pm5r7l1K45J5J58K5J60m19n2K58Ll4J04k05N4K45m51
$$ plain form
6019 -193 -30 13 -219 -194 -413 249 85 -55 -114 -4 -283 -130 -181 75 72 67 56 -134 96 -85 163 23 48
6042 48 -86 75 82 145 14 -41 68 -306 247 -85 234 278 -187 -75 215 320 119 4 166 -123 -249 21
6064 21 -3 -157 -432 166 62 124 100 -139 318 38 46 -249 352 -19 -139 -217 121 187 57 -132 168 504 64
6087 64 -21 33 -164 -286 -14 207 178 -43 -216 60 288 -23 -191 114 103 -4 88 56 259 -195 -378 -369 -64
6110 -64 -197 -393 -308 31 -94 -368 185 -140 81 -247 -66 -55 -60 183 -109 24 -69 -147 239 -93 -489 118
6132 118 156 33 -273 -142 240 -31 2 -362 -219 -98 -55 32 404 376 -122 -272 81 4 -16 -43 532 238 98
6155 98 -51 -61 -40 38 -32 217 345 -201 61 93 465 -75 139 68 394 -1 -277 -244 263 -43 -178 -103 299
6178 299 -152 -315 -182 92 62 108 -26 301 185 -145 -115 40 144 -338 151 573 35 -265 -45 365 32
$$ packed form
6019a93J63M3k32K5k19O62j64j40n9J10k79J53n1K56lnj1j90K30j81K48j40K5
6042D8j34J61PO3j31n5J09l74N53l32L19M4m65J12K90J05k01j15J62k89j26K70
6064B1k4j54k75N98j04O2k4k39M57k80Qk95O01l71j20p8L38O6j30j89L00L36m40
6087F4q5N4j97j22K72K21k9k21j73K76K28l11j68L05j1j07R2l2K03m54j83RL05
6110f4j33j96Q5L39j25k74N53l25K21l28J81J1nK43k92J33r3p8L86l32l96O07
6132A18L8j23l06J31L82k71L3l64J43J21M3Q7L72k8m98j50L53p7k0k7N75k94j40
6155I8j49j0K1P8p0K49J28n46K62L2L72n40K14p1L26l95k76L3N07l06j35P5M02
6178B99m51j63J33K74l0M6j34L27j16l30L0J55J04m82M89M22n38l00K20M10l33
$$ plain form
6199 32 -84 152 287 229 -654 -171 31 273 -121 -141 114 -19 -487 436 106 74 -298 50 364 524 -475
6220 -475 -269 214 -71 -193 -147 -142 76 -135 -107 169 -163 -351 83 419 13 -433 -171 434 10 -181 146
6241 146 228 2 -62 127 82 116 -629 -365 163 263 -247 148 265 91 -278 -269 140 16 -142 -165 305 26
6263 26 -283 -73 432 177 -57 -142 310 81 -296 -10 253 306 -79 -319 118 49 -55 -100 591 278 -62 -276
6285 -276 -10 402 -132 -289 -38 395 56 -352 292 467 -63 -324 111 106 -35 -376 -42 434 -158 -114 158
6306 158 167 -116 -299 -15 248 -545 -323 32 338 -170 -531 136 171 70 -394 183 177 -248 -408 465 728 29
6328 29 -455 195 145 -232 -597 192 531 206 -220 -10 294 0 -437 45 521 -25 -552 -123 129 -251 -223
6349 -223 407 491 12 -312 -1 34 -239 -143 274 414 18 -326 17 661 -13 -223 47 228 -46 -338 -210
$$ packed form
6199C2j16K36J35n8q83M83K02K42l94k0K55j33m68R23l30l2l72L48L14J60r99
6220d75K06M83k85j22M6NK18k11K8K76l32j88M34L36m06m46K62O05m24j91L27
6241A46Q2k26o4J89m5L4p45K64N28J00n10L95J17j74l69RM09j24j58k3M70k79
6263B6l09K10N05k55k34q5M52k29l77K86K63N3l85k40M37o9j04m5O91l13l40k14
6285b76K66M12n34j57K51M33l39m08O44J75n30k61M35nj41l41L34M76n92M4K72
6306A58Rk83j83K84K63p93K22L55L06n08l61O67L5j01m64N77om25j60Q73K63o99
6328B9m84O50n0l77l65P89L39l25m26K10L04k94m37M82M76n46n27M29K52l80K8
6349b23O30Q4m79l24L11L5k73R6M17J40l96l44L43O44o74k10K70J81k74k92J28
$$ plain form
6370 -210 385 130 -440 57 121 -123 -521 75 479 185 -250 78 584 -260 -492 196 724 228 -342 89
6390 89 212 -5 -403 -120 295 160 -217 -190 344 46 -522 -193 222 266 -339 -62 167 -6 -414 -366 384
6411 384 150 -127 -237 202 241 -38 -84 240 431 -519 -130 150 99 -194 -187 233 179 -183 -393 259 474 -214
6433 -214 -83 374 -65 -115 -149 316 251 57 -237 115 266 -233 -144 198 381 -24 -246 75 150 -150 -26 233
6455 233 380 51 -54 94 177 -428 -213 260 383 25 63 345 36 -175 -420 439 182 -32 -177 227 299
6476 299 -128 -313 -199 124 132 -182 52 87 -208 -358 -78 96 -46 -143 33 -55 -164 -307 -125 327 -206 -100
6498 -100 69 142 61 -160 135 33 -411 -331 -155 427 215 -66 185 316 -47 -187 19 84 -25 -285 58
6519 58 -49 221 -179 166 98 310 -270 -112 72 -582 -125 22 69 -234 -391 72 57 138 -60 -161 103 -131
$$ packed form
6370b10N95k55n70M97O4k44l98N96M04k94m35L28N06q44k32O88N28m96n70M31
6390H9J23k17l98K83M15j35l77K7N34k98n68L29M15M4o05K77K29j73m08M8P50
6411C84k34k77j10M39L9k79m6L24J91r50L89K80n1k93PM20n4l62k10O52K15o88
6433b14J31M57m39n0l4M65o5j94k94L52J51m99Q9L42J83m05k22L21P5l00J24K59
6455B33J47l29j05J48Q3o05K15M73J23l58L8K82l09k11k45Q59k57k14j45M04P2
6476B99m27j85J14L23Ql14K34L5k95j50K80J74j42r7J76q8j09j43J82M52n33J06
6498a00J69P3q1k21K95j02m44Q0J76N82k12k81K51J31l63j40K06O5j09k60L43
6519E8j07K70m00L45o8K12n80J58J84o54M57J47M7l03j57M63j5Q1j98j01K64k34
$$ plain form
6541 -131 -163 188 190 137 135 128 148 -139 242 -127 159 -61 184 -119 259 -107 -213 148 216 55 -33 119 -18 153
6565 153 -117 -137 83 42 -257 26 -15 42 108 -155 172 162 -79 72 246 -257 -208 -71 -34 -70 -117 22 70 31
6589 31 81 -120 10 -39 -109 -119 2 213 11 -35 305 -66 -141 -56 194 261 -98 -28 155 -100 -192 -80 -242 -99
6613 -99 -31 -77 -89 -23 193 29 -16 -276 132 91 -81 -221 -267 114 -154 308 328 -320 30 -97 -409 -118 69
6636 69 -173 92 102 203 74 -5 24 91 -5 -159 -159 -257 -91 -217 -171 253 152 -157 -38 -41 -69 374 121 -114
6660 -114 13 79 155 -249 -201 93 -24 -108 109 -214 225 -275 34 18 -103 503 56 -307 -44 458 199 390
6682 390 50 170 67 -79 -13 -189 -69 3 189 358 -204 172 87 -141 166 -156 234 -63 220 -178 70
6703 70 -24 78 116 469 -192 73 61 121 11 172 -161 -98 37 -93 -105 -252 199 -41 258 22 -195 54
$$ packed form
6541a31l2L51Kn3kpK0k87L81l69K86k20K45l03L78l66j06L61O8j61q8J52j37J71
6565A53k70k0K20m1k99K83m1N7O6k63L27j0k41J51J74n03M9J37L7l6m7J39M8l9
6589C1N0k01J30m9p0j0J21K11k02m6L40l71p5Q5K50O7l59P0J83k55r2J12j62J43
6613i9O8m6j2O6K16j64m5k60M08m1j72j40m6L81k68M62K0o48L50j27l12K91J87
6636F9k42K65J0J01j29p9K9O7r6j54%r8J66j26M6M24j01l09J19lk8M43k53k35
6660a14J27O6P6m04M8K94j17q4K17l23M39n00L09j6j21O06m47l63K63N02k59J91
6682C90l40J20j03j46O6j76J20P2J86J69n62L76q5k28L07l22L90k97K83l98K48
6703G0r4J02L8L53o61K65j2O0j10J61l33O3J35j30j2j47M51k40K99k36k17K49
$$ plain form
6725 54 -102 -69 49 -24 399 115 59 -27 5 -24 -169 90 -117 171 -294 137 278 -140 -57 -106 -72 205 -156
6748 -156 -50 -57 -211 -17 10 81 111 -104 -94 102 -80 -385 -61 -139 -208 -201 189 47 132 -71 165 -13 -163 -250
6772 -250 -31 -69 -219 -356 -124 286 -62 -262 41 -433 78 6 18 -156 -61 266 -67 -102 70 -177 234 212
6794 212 71 -262 140 179 214 53 219 475 -187 2 72 186 -132 156 42 -185 68 218 108 45 -446
6815 -446 -315 22 63 156 -42 317 -27 -478 74 63 -35 -92 -111 20 142 -3 -333 109 15 -42 -99 -75 110
6838 110 150 -28 114 83 30 109 27 85 -201 -146 207 -26 1 -203 87 532 22 -227 -117 146 123 -128 46
6861 46 104 51 -396 -187 43 -37 -28 25 266 76 -413 168 228 140 76 -140 207 101 -195 -257 72 -235 -48 -206
6885 -206 169 -194 -371 -52 406 -12 -332 211 6 -25 -69 327 326 78 -242 420 265 -85 -238 137 333
$$ packed form
6725E4j56L3J18p3M23k84n6q6L2k9j45K59k07K88m65M31J41m18Q3m9L4K77l61
6748a56J06pj54J94K7P1L0k15J0J96j82l05L24p8o9PL90j42Q5k03K36j78j50q7
6772b50K19l8j50j37K32M10l48k00L03m74N11p2J2j74R5L27l33l5J72k47M11k2
6794B12j41l33M02L9L5j61J66K56o62J89P0J14l18K88j14k27K53J50j10o3m91
6815d46J31L37M1R3j98L59l44m51N52j1r8n7j9J31J22j45l30M42r4n7n7K4J85
6838A10M0j78J42l1n3P9q2N8k86N5L53k33K7k04K90M45n10k49J10K63k3k51J74
6861D6N8n3m47K09K30q0RN3K41j90m89N81O0q8o4k16L47j06k96o2L29l07J87j58
6885b06L75l63j77L19M58m18l20N43k05l1m4L96jk48l20O62j55l50j53L75J96
$$ plain form
6906 333 -139 -91 -74 117 -104 17 101 0 89 -172 -311 73 167 -112 163 524 125 -224 -107 384 383 -133
6928 -133 -71 110 -150 -393 -92 308 168 -183 -117 194 580 -308 -25 415 225 -225 -187 201 115 -40 96
6949 96 425 475 -66 -46 206 223 -209 69 395 379 -181 -232 197 127 -28 -275 408 57 -32 -504 92 75 -184
6972 -184 -149 79 209 -144 25 174 379 279 -344 181 98 -174 -38 88 662 -117 64 75 191 -8 -309
6993 -309 66 310 -65 -265 325 95 26 -377 204 551 81 -362 322 158 -320 -115 177 146 -381 -298 -25
7014 -25 182 101 -355 -127 135 -147 -242 76 228 -169 -270 224 571 -218 -521 -12 260 127 -272 241 355
7035 355 -163 -51 -92 200 70 -447 305 329 -116 -192 -64 245 -157 -322 -51 407 -252 -225 -253 311 -62 -173
7057 -173 245 384 10 -462 10 517 59 -385 -105 371 95 -300 41 316 34 -490 254 238 -98 -162 103
$$ packed form
6906C33m72M8J7J91k21J21Q4j01Q9k61j39L84R4k79K75L61l99l49J17M91jn16
6928a33O2J81k60k43L01M00j40l51O6L11L86q88K83M40j90m50L8L88q6j55J36
6949I6L29N0n41K0K52J7m32K78L26j6n60n1M29p0j55k47O83l51q9m72N96j7k59
6972a84L5K28J30l53J69J49K05j00o23N25q3k72J36J26N74p79J81J1J16j99l01
6993c09L75K44l75k00N90k30o9m03N81L47m70m43O84j64m78K05K92l1n27Q3K73
7014b5K07q1m56K28K62k82r5L18J52l97j01M94L47p89l03N09K72j33l99N13J14
7035C55n18J12m1K92j30n17P52K4m45p6J28L09m02j65K71M58o59K7k8N64l73j11
7057a73M18J39l74m72M72N07m58m44K80M76k76l95L41K75k82n24P44j6l36o4K65
$$ plain form
7078 103 348 -146 -179 -157 161 117 -259 188 548 132 -28 -231 362 292 -316 -192 496 85 -441 -101 59
7099 59 158 -290 175 585 -5 -307 -24 289 281 -188 -121 491 89 -298 -215 -15 199 0 -242 400 220 -479
7121 -479 -241 92 236 -54 -171 22 154 -177 -139 263 3 -233 110 9 329 -256 -124 333 429 12 -313
7142 -313 354 68 -76 -245 342 412 0 -146 95 127 -307 -374 44 -13 -268 -341 52 325 -352 -187 407 172
7164 172 -74 -536 94 224 30 -338 -63 374 -214 -178 -28 397 -203 -158 105 415 38 -226 58 418 114
7185 114 -397 -17 8 -196 -111 -53 218 342 -345 -14 205 71 -161 -64 97 100 -154 173 187 61 -132 160
7207 160 353 74 85 117 221 222 -145 -64 337 -142 -125 -201 252 197 -329 -174 282 50 -211 163 190 57 -285
7230 -285 -30 170 -234 -154 -43 19 4 -108 58 312 -114 48 -66 243 111 129 -127 259 -96 -3 -292 212
$$ packed form
7078A03K45m94l3K2L18m4l76M47L60m16j60k03N93p0o08J24O88m11n26L40J60
7099E9R9m48M65M10n90l02K83L13qm69O7O12m02l87Q3K00K14j99k42O42j80o99
7121d79K38L33J44k90j17J93J32l31L8M02k60k36L43j01L20n85J32M57R6m17l25
7142c13O67k86j44j69N87P0m12j46K41L2m34o7M18n7k55p3L93K73o77J65N94k35
7164A72k46m62O30J30j94l68K75M37n88L6J50M25o00M5K63L10l77k64K84L60l04
7185A14n11L80K5k04Q5N8K71J24o87L31K19j34k32R7J61Lk54L27J4j26j93K92
7207A60J93k79J1L2J04Jl67Q1M01m79J7p6M53n5n26J55M56k32k61L74K7j33l42
7230b85K55K00m04Q0J11O2j5j12J66K54m26J62j14L09j32J8k56L86l55R3k89N04
$$ plain form
7252 212 116 190 -93 -7 18 6 -229 -54 182 -228 -280 -9 10 -156 -138 215 142 -265 9 -284 -91 -209 -43
7275 -43 -88 -22 -200 -269 -31 78 -76 -138 111 399 -73 -197 237 -67 93 173 129 82 -98 -74 11 117 -8
7298 -8 -105 -167 229 198 127 417 47 -358 -231 72 -155 75 -49 41 -25 3 -254 -11 156 -108 202 147 -205
7321 -205 159 137 129 -101 -89 -68 157 367 311 75 -196 214 -102 -191 159 205 -90 36 144 49 -115 44 93
7344 93 8 29 -48 97 57 -73 -126 -212 272 469 50 -54 26 300 -109 100 261 117 85 -77 8 10 159 -231
7368 -231 195 180 16 -252 56 5 -211 137 -15 200 -135 196 162 3 12 -199 -138 73 64 -69 -115 113 64
7391 64 -157 -354 -81 -40 -220 -66 -154 110 152 47 219 -95 105 172 208 -94 48 -100 -92 178 -94 41 -182
7414 -182 -95 60 -100 -93 12 -8 -117 204 -333 -26 77 -160 -108 -270 121 276 -103 -229 63 372 -38 -21
$$ packed form
7252B12r6P4k83Q6K5j2k35J75K36m10n2K71J9j66J8L53p3m07K74k93J93j18J66
7275d3m5O6j78o9K38J09j54o2K49K88m72j24M34l04J60Q0m4m7j80K4Q5J06j25
7298hr7o2L96l1p1K90l70m05J27L03k27K30j24R0o6K8k57K43J67k64L10n5l52
7321b05L64k2qk30J2K1K25K10n6k36k71M10l16q9L50M6k95J26J08r5j64J59M9
7344I3q5K1p7J45m0j30n3q6M84J97m19j04Q0K74m09K09J61j44l2j62Q5KJ49l90
7368b31M26j5j64k68L08n1k16L48j52K15l35L31l4j59Rk11O1K11rj33m6K28m9
7391F4k21j97K73M1j80J54q8K64M2j05J72l14K00O7L6l02J42j48QK70k72J35k23
7414a82Q7J55j60PJ05k0j09L21n37L07J03k37N2j62L91J55l79j26K92L09m10J7
$$ plain form
7436 -21 107 -134 -307 31 49 -24 146 53 132 200 -120 13 147 53 172 1 -97 -52 282 111 24 -164 -24
7459 -24 110 121 234 -79 164 178 34 344 39 56 -128 -28 -94 17 -69 140 45 -114 -79 -164 -9 288 201
7482 201 106 -14 15 120 22 137 -39 367 231 255 -183 -220 -45 -119 -295 229 -102 -176 149 58 105 126 98 141
7506 141 44 -312 -236 36 -223 -141 52 30 15 49 -231 80 56 -216 -8 140 110 142 93 55 17 -245 65 170
7530 170 -77 -76 27 54 -96 -249 139 -85 -96 -259 89 138 -135 -165 -199 283 63 -114 -6 260 -93 -192 4
7553 4 -11 116 -352 -26 160 -170 -76 31 140 -153 -126 -157 118 -74 -202 132 -184 56 124 20 390 -72
7575 -72 -59 -367 12 -84 -58 87 239 -182 -141 288 220 283 67 -194 304 155 64 -63 287 285 169 -8 385
7598 385 -28 -98 -100 382 600 -181 -63 171 30 -342 106 407 414 -131 -210 233 -37 -118 200 -186 -141 -419 80
$$ packed form
7436b1J28k41j73L38J8p3J70r3P9O8l20J33J34r4J19j71r8M5L34j71q7j88J40
7459b4J34J1J13l13K43J4j44L10l05J7j84J00o6J11q6K09r5j59L5q5J55K97q7
7482B01r5j20K9J05r8J15j76M06j36K4m38l7J75p4j76N24l31p4L25r1M7K1k8M3
7506A41r7l56P6K72k59Q2J93k2j5L4k80L11k4k72K08J48l0L2m9l8l8k62L10J05
7530A70k47JJ03K7j50j53L88k24j1j63L48M9k73l0l4M82k20j77J08K66l53r9J96
7553Dj5J27m68L26J86l30R4J07J09k93K7l1K75j92j28L34l16K40O8j04L70m62
7575g2J3l08L79r6K6J45J52m21M1M29o8O3k16k61M98j49r1j27L50kj16j77L93
7598C85m13p0kM82K18p81J18K34j41l72M48L01Pn45p9M43k70q1L18l86M5k78M99
$$ plain form
7621 80 -48 -147 -127 100 223 125 -296 291 329 156 -291 -181 5 245 -186 -173 256 -110 -201 -271 463 70 -103
7644 -103 -200 94 541 -157 -80 256 10 -191 100 11 315 72 -37 46 199 -338 -188 148 22 -20 -186 -20
7666 -20 179 -254 -152 606 393 69 -11 91 -129 -37 -258 138 -50 46 -218 -136 198 -428 -232 173 356 -8
7688 -8 -389 52 460 -100 -464 -3 609 -367 -440 114 644 45 -404 77 121 13 -263 -11 272 -201 -96
7709 -96 3 102 48 -279 152 141 -217 50 396 180 -48 -304 -147 269 -24 -342 198 277 -42 -115 -42 121 -232
7732 -232 98 38 200 -124 -253 10 408 19 -415 -2 237 -365 -358 29 372 251 -192 113 315 179 -111
7753 -111 154 211 22 -183 91 165 -126 -302 -181 216 225 -500 -112 89 -190 22 -58 506 204 -313 -110 60
7775 60 -4 -33 47 62 185 -615 50 69 155 -385 -202 132 7 -428 -329 437 -111 93 88 266 -114 -102 -22 215
$$ packed form
7621H0j28r9K0K27J23r8m21N87L8j73m47J10J86K40m31J3M29l66r1p0P34l93j73
7644a03r7K94M47o98P7L36k46k01K91q9L04k43j09Q3J53n37J50L36j26m2j66J66
7666b0J99m33J02P58k13l24q0J02k20R2k21L96j88R6k64Q2L34o26J96M05J83l64
7688hl81M41M08n60l64M61O12r76p3N54N30n99m49M81M4j08k76K52K83m73J05
7709i6R9R9n4l27M31j1l58K67L46k16k28k56J57M16k93l18N40P9l19p3P3J63l53
7732b32L30o0J62l24j29K63L98l89m34M13K39o02PL87L43j21m43L05K02j36k90
7753a11K65N7j89k05K74P4k91j76J21L97Rp25L88K01k79K12q0N64l02n17K03J70
7775F0o4k9Q0J5J23q00O65J9Q6n40J83L34j25m35R9P66n48K04nJ78l80J2Q0K37
$$ plain form
7799 215 542 -127 -288 142 -341 -408 -286 399 36 -58 -7 186 154 -318 -227 347 268 -52 -41 102 129 -124 -170
7822 -170 143 131 -165 19 -12 189 -73 229 278 -30 -219 -249 -34 398 -254 -241 127 309 -326 72 329 91
7844 91 99 -241 256 473 -111 -379 -124 192 -20 -114 142 99 -63 -388 19 48 -138 -94 318 357 -283 -89 339
7867 339 254 117 -165 245 314 22 71 91 419 50 -141 58 411 -140 -37 -52 77 -91 -306 126 42 -150
7889 -150 152 141 88 75 123 -233 -36 203 -57 60 286 214 -457 -24 182 -2 -95 -425 69 -177 -109 -115 287
7912 287 44 -335 27 140 -170 -192 -264 9 46 -138 119 298 55 -2 -19 50 -260 70 -71 188 20 -36
7934 -36 213 29 -200 -54 -1 174 -89 -290 -60 -48 104 -243 189 317 90 -376 -85 59 86 -36 -176
7955 -176 197 75 -54 -188 -53 14 -84 143 23 -10 -194 159 68 52 31 85 106 54 258 -82 74 -136 -51
$$ packed form
7799B15L27o69j61M30m83o7J22O85l63r4N1J93l2m72R1N74p9l20J1J43K7k53m6
7822a70L13j2k96J84l1K01k62L02M9l08j89l0K15M32o52J3L68J82o35L98K57k38
7844I1Ql40M97K17n84k68K55L16k12r4K56m3j62l25M07K9j86M4M12L9o40J94M28
7867C39q5j37k82M10O9k92M9K0L28l69j91J99L53n51J03j5J29j68k15M32q4j92
7889a50L02j1n3j3M8l56J97K39k60J17K26p2o71M33K06j84r3l30M94k46O8oM02
7912B87k43l79L62J13l10k2p2K73L7j84K57J79k43n7j7O9l10L30j41K59j68n6
7934c6K49j84k29J46N3J75k63k01K30J2J52l47M32J28k27m66K91J44K7j22j40
7955a76L73j22j29j34J35O7r8K27j20l3j84L53r1j6k1N4K1n2K04l40J56k10Q5
$$ plain form
7978 -51 30 44 310 186 201 363 -18 -184 107 44 417 -98 -256 211 217 -314 43 -65 58 -16 -44 89 172
8001 172 108 -14 -4 254 -111 -75 286 18 116 195 113 209 92 9 -97 62 -101 78 -67 61 123 21 168
8024 168 88 351 32 133 -108 6 -130 -307 9 -115 -212 -34 -96 -229 -44 164 -243 -86 -224 102 121
8045 121 -165 -178 -319 -131 -425 84 76 -15 -88 317 -40 -48 -55 -21 -123 16 -86 -14 79 -35 -131 -348 -162 7
8069 7 -18 -151 28 -298 -188 -150 -415 -26 -105 -135 -29 169 21 -36 -6 -172 -30 45 -106 141 30 27 -260 197
8093 197 -105 -131 3 -138 3 -33 145 81 -114 114 44 -92 198 181 -269 383 -137 27 -29 69 -18 -160 19
8116 19 -123 12 83 -30 -183 75 -95 -106 199 162 46 58 326 282 -148 98 -201 -291 -161 39 76 82 -332
8139 -332 -73 36 154 48 -156 -193 -38 -46 213 192 83 369 243 69 44 135 -13 61 -107 -144 -375 -122 222
$$ packed form
7978e1Q1J4K66j24J5J62l81j66K91o3L73n15j58M67On31L57j08J23p4k8J33Q3
8001A72o4j22J0K58l65L6L61k68R8P9q2R6j17q3j06J59j63J79j45J28O2j02J47
8024A68q0K63l19J01k41J14j36j77L16j24r7J78o2j33J85K08m07J57j38L26J9
8045A21k86j3j41J88k94N09qr1p3M05l57qpL4j02J39j02P2R3j14r6k17J86J69
8069Gk5j33J79l26J10L8k65L89p9l0J06J98j48n7L0j66J42P5j51K47j11lk87M57
8093A97l02k6J34j41J41l6J78o4j95K28p0j36K90j7m50O52n20J64n6R8q7j42J79
8116A9j42J35P1j13j53K58j70j1L05l7j16J2K68m4m30K46k99r0J30K00L7Om14
8139c32K59J09J18j06k04l7J55qK59k1j09K86j26j74k5R1j48P4j68l7k31K53L44
$$ plain form
8162 222 121 -103 10 -189 114 -105 90 -39 39 -51 57 -143 12 97 -81 196 -198 -77 174 -234 -270
8183 -270 -70 -62 41 -35 -116 86 -141 -13
$$ packed form
8162B22j01k24J13j99L03k19J95j29P8r0J08k00J55Q5j78K77l94J21K51m08l6
8183b70K00QJ03p6q1K02k27J28
8191a3
$$ Imaginary data points
##PAGE= N=2
##DATA TABLE= (X++(I..I)), XYDATA
$$ plain form
0 0 0 0 0 0 0 0 8 -8 8 -8 16 -16 24 -24 32 -40 46 -54 64 -73 88 -99 115 -134 155 -175 201 -228 257 -290
30 -290 329 -370 415 -463 515 -574 639 -708 787 -872 966 -1068 1184 -1310 1452 -1609 1792
47 1792 -1994 2231 -2505 2830 -3221 3702 -4314 5117 -6226 7861 -10519 15584 -28701 132344
61 132344 255309 -90638 -189207 -27659 112183 9410 -59485 37 47994 -33567 -78950
72 -78950 -41748 -7341 -6499 61320 122305 48521 -85255 -61495 65313 81831 -14858 -24355
84 -24355 42521 15246 -79333 -49612 57533 35779 -73286 -36466 106871 86161 -96747
95 -96747 -137172 33539 127556 4297 -103295 -21371 89229 49313 -46631 -47371 14347 50725
107 50725 66974 56613 -25857 -111360 -64796 52557 44798 -68394 -69437 50783 59011 -80020
$$ packed form
0@%%%%%%Qj6J6j6K4l2M0m8N6p2Q6j00J18j37J61j87K14k49K89l30L76m29M85n47
30b90O19o99P85q78R78j089J213j347J495j659J838k034K252k494K762l061L401
47A792l786M225m736N335o051O923q016R431j1343J4087j8380K6103m4285J61045
61A32344J22965l45947r8569J61548J39842j02773o8895N9522M7957q1561m5383
72g8950L7202L4407Q42O7819O0985p3784j33776K3760J26808J6518r6689r497
84b4355O6876k7275r4579K9721J07145k1754j09065L6820J43337k0710j82908
95i6747m0425J70711R4017j23259j07592Q1924J10600l9916r5944p40O1718L6378
107E0725J6249j0361q2470q5503M6564J17353p759j13192j043J20220Q228j39031
$$ plain form
119 -80020 -118219 33578 139773 62682 -25968 2649 17406 -60039 -75199 44615 110649
130 110649 4795 -101161 -57936 11438 -18887 -47243 26567 88948 30044 -54914 -58903 -31557
142 -31557 -21785 26569 94632 54407 -75378 -101651 14557 77988 5040 -34552 47296 84158
154 84158 -30349 -129993 -62904 52242 48975 -18011 -24753 -6403 -35193 -49174 16702 77075
166 77075 47146 -2228 10046 23987 -19736 -44886 8815 52987 9242 -46548 -31497 -1790
178 -1790 -23753 -32532 25646 62733 7549 -47341 -6729 48682 13833 -40436 -6101 54496
190 54496 27137 -37164 -24120 30103 23299 -17456 -2071 35792 14762 -28039 -15022 14896
202 14896 -11455 -45493 -9887 41150 18805 -29873 -13458 32821 22667 -9581 17596 60820
$$ packed form
119h0020l8199J51797J06195p7091q8650K8617J4757p7445j5160J19814O6034
130A10649j05854j05956M3225O9374l0325k8356P3810O2381n8904q4958l989K7346
142c1557R772M8354O8063m0225j29785k6273J16208O3431p2948l9592Q1848L6862
154H4158j14507r9644O7089J15146l267o6986o742J8350k8790j3981O5876O0373
166G7075k9929m9374J2274J3941m3723k5150N3701M4172m3745n5790J5051K9707
178a790k1963q779N8178L7087n5184n4890M0612N5411l4849n4269L4335O0597
190E4496k7359o4301J3044N4223o804m0755J5385L7863k1030m2801J3017K9918
202A4896k6351l4038L5606N1037k2345m8678J6415M6279j0154l2248K7177M3224
$$ plain form
214 60820 31329 -32242 -32439 7430 1932 -27968 -8749 25830 688 -48232 -33337 20439 28718
227 28718 4335 14760 37111 7255 -39858 -25447 28759 35545 -3357 -15174 3640 -3239
239 -3239 -29567 -16402 25951 30881 -4220 -19478 -9320 -15071 -28987 -7746 27529 17637 -21855
252 -21855 -25321 6998 17041 1673 8502 32586 22992 -17371 -28507 -2964 4863 -17471 -22320
265 -22320 -1204 -2306 -31041 -31218 8190 29199 7810 -7334 8054 17836 2685 -5228 5808
278 5808 6739 -9724 -12919 -842 -2658 -17372 -10500 12692 10383 -16473 -19763 8862 19779 -4945
292 -4945 -21609 -5829 8792 -1720 -8375 7666 18394 6555 -3054 6997 14141 5086 -503
305 -503 5242 2189 -16094 -24918 -12643 -425 -2062 -3920 2187 4010 -300 4351 20353 26295
$$ packed form
214F0820k9491o3571j97L9869n498k9900J9219L4579k5142m8920J4895N3776Q279
227B8718k4383J0425K2351k9856m7113J4411N4206O786l8902j1817J8814o879
239c239k6328J3165M2353M930l5101j5258J0158n751j3916K1241L5275r892l9492
252b1855l466L2319J0043j5368O829K4084r594m0363j1136K5543P827k2334m849
265b2320K1116j102k8735j77L9408K1009k1389j5144J5388R782j5151p913J1036
278E808R31j6463l195J2077j816j4714O872K3192k309k6856l290K8625J0917k4724
292d945j6664J5780J4621j0512o655J6041J0728j1839r609J0051P144r055n589
305e03N745l053j8283q824J2275J2218j637j858O107J823m310M651J6002N942
$$ plain form
319 26295 13489 1970 4981 5260 -6876 -12472 378 9588 -1482 -15789 -11901 1372 7178
332 7178 6437 7464 6971 618 -4380 -1131 3909 4920 4501 6124 5052 -650 -1496 7860 16311 10928
348 10928 395 -3661 -3752 -7438 -10316 -5909 -2334 -6051 -10315 -6719 1194 7129 11220 14431 13772
363 13772 8052 2577 2206 4280 2177 -3250 -8263 -11024 -12973 -11959 -6070 647 1979 -767 -1850
378 -1850 -631 1097 2677 4762 4509 -449 -5338 -5695 -2688 1148 3576 3628 1029 -2348 -4077 -3613
394 -3613 -2701 -2366 -4358 -9070 -12017 -12625 -9150 -3236 2566 4889 4047 3734 4705 6752 8140 8147 4733
411 4733 -1604 -7665 -10887 -11208 -8822 -5797 -4382 -5727 -6002 -3586 817 5837 8480 7425 4317 1435
427 1435 -528 -948 1078 3617 2902 -586 -3317 -2704 497 3358 4615 2381 -2143 -4984 -4631 -3466
$$ packed form
319B6295j2806j1519L011K79j2136n596J2850R210j1070j4307L888J3273N806
332G178p41J027m93o353m998L249N040J011m19J623j072n702q46R356Q451n383
348A0928j0533m056r1l686k878M407L575l717m264L596P913N935M091L211o59
363A3772n720n475l71K074k103n427n013k761j949J014N889O717J332k746j083
378a850J219J728J580K085k53m958m889l57L007L836K428N2k599l377j729M64
394c613R12L35j992m712k947o08L475N914N802K323q42l13R71K047J388Pl414
411D733o337o061l222l21K386L025J415j345k75K416M403N020K643j055l108k882
427A435j963m20K026K539p15l488k731O13L201K861J257k234m524k841L53J165
$$ plain form
443 -3466 -2980 -1291 1426 2611 748 -226 4250 12621 16128 10400 3682 2106 2047 -414 -2942 -3006 -3069
460 -3069 -6483 -8235 -6300 -3014 1395 6494 10051 7787 2874 2148 6571 8883 5879 2438 847
475 847 -1741 -5671 -4673 2590 5537 296 -2901 939 2036 -4456 -6165 2246 7620 -863 -9538 -6041
491 -6041 2481 4867 3591 5900 7099 3608 852 3293 2936 -2718 -5040 -496 -2105 -13116 -16996
506 -16996 -5147 4481 -1845 -7543 820 9517 4018 -1989 5024 10245 1685 -7296 -1897 3248 -4349
521 -4349 -11943 -5886 1969 -3291 -9533 -2549 6473 674 -8261 -3891 3499 -1369 -7533 610 8204
536 8204 -1200 -11840 -2714 10476 6260 -2926 2790 9415 -1854 -15245 -7777 6367 1385 -11359
550 -11359 -7587 2435 -4326 -14533 -2606 18372 16223 -1178 -2298 8413 3801 -8318 -123
$$ packed form
443c466M86J689K717J185j863r74M476Q371L507n728o718j576n9k461k528o4o3
460c069l414j752J935L286M409N099L557k264m913p26M423K312l004l441j591
475H47k588l930R98P263K947n241l197L840J097o492j709Q411N374q483q675L497
491f041Q522K386j276K309J199l491k756K441l57n654k322M544j609j1011l880
506a6996J1849R628o326n698Q363Q697n499o007P013N221q560q981N399N145p597
521d349p594O057P855n260o242O984R022n799q935M370P390m868o164Q143P594
536H204r404j0640R126J3190m216r186N716O625j1269j3391P468J4144m982j2744
550a1359L772J0022o761j0207J1927K0978k149j7401j120J0711m612j2119Q195
$$ plain form
563 -123 16315 6709 -15471 -14624 1891 1109 -10482 -2015 18006 12926 -10170 -12515 3883 8562
577 8562 447 5305 14263 1380 -17370 -6739 16024 10830 -9060 63 23490 11797 -22601
590 -22601 -22105 11431 20620 -3107 -13173 879 3585 -10890 -7698 12977 15825 1140 2401
603 2401 15884 7333 -16084 -12025 15864 19374 -6012 -15800 -1822 -795 -15131 -7721 17141
616 17141 14884 -9903 -8067 16427 9861 -22835 -19095 25303 36839 -6726 -35705 -10855 17226
629 17226 6105 -10549 1336 14571 2231 -11493 -6946 -6761 -14485 -687 26764 16178 -27683
642 -27683 -35995 5799 26968 793 -12928 13770 24889 -9565 -30761 -4764 15997 -825
654 -825 -10817 10343 12340 -27381 -43461 545 38863 17187 -17711 -9575 11874 1313 -16642
$$ packed form
563a23J6438r606k2180Q47J6515p82j1591Q467K0021n080k3096k345J6398M679
577H562q115M858Q958j2883j8750J0631K2763n194j9890R123K3427j1693l4398
590b2601M96L3536R189k3727j0066J4052K706j4475L192K0675K848j4685J261
603B401J3483q551k3417M059K7889L510k5386r788J3978J027j4336P410K4862
616A7141k257k4787J836K4494o566l2696L740M4398J1536m3565k8979K4850K8081
629A7226j1121j6654J1885J3235j2340j3724M547J85p724J3798K7451j0586m3861
642b7683q312M1794K1169k6175j3721K6698J1119l4454k1196K5997K0761j6822
654h25r992K1160J997l9721j6080M4006L8318k1676l4898Q136K1449j0561j7955
$$ plain form
667 -16642 -4686 12631 9652 4042 6139 -9951 -36721 -20856 32442 43001 -9028 -40077 -3708
680 -3708 26973 -3696 -34777 -3889 38527 21653 -22199 -24286 -38 3258 -639 18131 29036
693 29036 -113 -29390 -11783 16393 5271 -15374 714 23220 4648 -25556 -18649 5052
705 5052 6158 4389 24329 25830 -15338 -39572 -33 40132 13714 -28087 -6891 35501 13752
718 13752 -41254 -36318 19887 39663 9162 -9485 -3427 -8056 -16561 2361 23623 9740 -10674
731 -10674 2647 18235 -8541 -35464 -5327 41152 31375 -11965 -19299 1201 -5066 -20704 1978
744 1978 33554 14111 -27075 -21431 12499 6343 -23088 -6074 38500 33536 -17015 -37106 -7066
757 -7066 13817 6447 4707 12447 -1216 -23243 -15185 7716 1808 -14306 5631 34086 10214
$$ packed form
667a6642J1956J7317k979n610K097j6090k6770J5865N3298J0559n2029l1049L6369
680c708L0681l0669l1081L0888M2416j6874m3852k087K4248L296l897J8770J0905
693B9036k9149k9277J7607K8176j1122k0645J6088K2506j8572l0204O907K3701
705E052J106j769J9940J501m1168k4234L9539M0165k6418m1801K1196M2392k1749
718A3752n5006M936N6205J9776l0501j8647O058m629q505J8922K1262j3883k0414
731a0674J3321J5588k6776k6923L0137M6479r777m3340p334K0500o267j5638K2682
744A978L1576j9443m1186N644L3930o156k9431J7014M4574m964n0551k0091L0040
757g066K0883p370j740P740j3663k2027Q058K2901n908j6114J9937K8455k3872
$$ plain form
770 10214 -39491 -35430 16298 31925 -1511 -13910 9652 10094 -22378 -25404 10674 24129 110
783 110 -8525 9406 3871 -28251 -27080 14792 30491 24 -19385 -3328 3075 -15148 -13128
796 -13128 17969 25050 -2908 -13005 5386 2848 -23416 -16041 25864 31710 -11642 -32862 -4941
809 -4941 13021 -6989 -13661 14699 27192 -2855 -23281 -6095 8194 -3087 -3588 19054 20671
822 20671 -12618 -27339 -1450 16590 617 -6553 14301 18433 -11738 -27653 -2754 17794
834 17794 4086 -6271 10117 14696 -12556 -25612 1970 25659 10881 -7181 4351 12440
846 12440 -8945 -23140 1114 24329 9647 -11728 -3481 7071 -8103 -18375 5102 27234
858 27234 10454 -12922 -5141 7843 -3717 -13713 6314 24543 6191 -17530 -9426 8156 276
$$ packed form
770A0214m9705M061N1728J5627l3436j2399K3562M42l2472l026L6078J3455k4019
783A10q635J7931n535l2122J171M1872J5699l0467j9409J6057O403j8223K020
796a3128L1097P081k7958j0097J8391k538k6264P375M1905N846m3352k1220K7921
809d941J7962k0010o672K8360J2493l0047k0426J7186J4289j1281n01K2642J617
822B0671l3289j4721K5889J8040j5973p170K0854M132l0171j5915K4899K0548
834A7794j3708j0357J6388M579k7252j3056K7582K3689j4778j8062J1532Q089
846A2440k1385j4195K4254K3215j4682k1375Q247J0552j5174j0272K3477K2132
858B7234j6780k3376P781J2984j1560r996K0027J8229j8352k3721Q104J7582p880
$$ plain form
871 276 -11133 4524 21712 4806 -18576 -10941 8098 2755 -8263 3833 16988 735 -19335
884 -19335 -8061 12298 6347 -8193 1552 15931 2485 -18546 -11615 8454 7082 -5971 -2628
897 -2628 6896 -2016 -15631 -6653 10414 6710 -5837 -573 10255 -115 -16611 -7902 12154
910 12154 9599 -6901 -7052 3643 -325 -12396 -5673 10189 8669 -6316 -6905 3758 374 -11147
924 -11147 -5676 11053 10186 -6391 -10213 1194 3635 -5207 -2757 9378 7291 -6598 -8072 2492
938 2492 1875 -7177 -2935 9877 6472 -9471 -10695 3787 8250 -1563 -3102 6826 7108 -4909 -7489
953 -7489 2298 6233 -1223 -2433 5013 3417 -6998 -6958 5129 8216 -885 -3245 4562 4634 -4025 -5026
969 -5026 4223 6979 -92 -2830 3016 3763 -2598 -3442 5044 7356 -1026 -4053 1912 4257 -2026 -4210
$$ packed form
871B76j1409J5657J7188j6906k3382P635J9039n343j1018J2096J3155j6253k0070
884a9335J1274K0359n951j4540R745J4379j3446k1031O931K0069j372j3053L343
897b628R524q912j3615Q978J7067l704j2547N264J0828j0370j6496Q709K0056
910A2154k555j6500j51J0695l968j2071O723J5862j520j4985n89J0663l384j1521
924a1147N471J6729q67j6577l822J1407K441q842K450J2135k087j3889j474J0564
938B492o17r052M242J2812l405j5943j224J4482M463r813j539R928K82j2017k580
953g489R787L935p456j210P446j596j0415M0J2087L087r101k360P807P2q659j001
969e026R249K756p071k738N846P47o361q44Q486K312q382l027N965K345o283k184
$$ plain form
985 -4210 2472 5832 -31 -3653 1221 3812 -465 -1733 3485 5477 -16 -2569 960 2964 -1204
1000 -1204 -3581 1229 3674 -925 -4140 -307 3007 -26 -2397 1057 3848 -46 -3493 -1089 1697
1015 1697 -489 -2031 1075 2238 -1574 -4188 -576 2392 -240 -2977 -298 2020 -1037 -4099 -1970
1030 -1970 1034 344 -1795 -996 272 -977 -2331 -308 1858 -68 -2283 -760 722 -1475 -3236
1045 -3236 -1411 494 -403 -2337 -1662 -166 -480 -942 -261 516 -391 -1567 -697 434 -268 -1380 -1154
1062 -1154 635 291 -1448 -1267 24 560 -243 -480 -283 -564 -83 93 248 -318 -705 522 878 505
1080 505 -274 -73 1020 1275 54 -171 752 1235 475 -199 -129 277 377 621 1123 589 631 1186 1126 769
1100 769 603 1319 1132 985 316 231 523 1135 1034 428 730 601 406 453 608 926 651 829 817 496 407
$$ packed form
985d210O682L360n863l622M874K591m277j268N218J992n493k553L529K004m168
1000a204k377M810K445m599l215L833L314l033k371L454K791l894l447K404K786
1015A697k186j542L106J163l812k614L612K968k632k737K679K318l057l062K129
1030a970L004o90k139P99J268j249j354K023K166j926k215J523J482k197j761
1045c236J825J905q97j934O75J496l14m62O81P77r07j176Q70J131p02j112K26
1062a154J789l44j739J81J291N36q03k37J97k81M81J76J55n66l87J227L56l73
1080E05p79K01J093K55j221k25R23M83p60o74P0M06J00K44N02n34M2N55o0l57
1100G69j66P16j87j47o69q5K92O12j01o06L02j29j95M7J55L18k75J78j2l21q9
$$ plain form
1121 407 596 1355 1303 545 369 400 666 537 429 330 186 -4 -154 -239 -56 -408 -383 328 311 -388 -996 467
1143 467 916 -55 -893 -498 366 -503 -506 -114 -304 -1113 -1179 -354 -359 -1611 -1203 77 88 -1486 -1796 -344 488
1164 488 -628 -1832 -818 160 -1158 -1517 -267 583 -1186 -1757 -69 247 -1450 -1692 31 1145 -1035
1181 -1035 -2587 -547 200 -1249 -1672 675 1311 -774 -2222 -350 1387 -107 -1764 -122 1346 -677
1197 -677 -2348 -100 1364 -573 -1684 1024 1957 -1274 -2924 487 3353 827 -1980 -178 2541
1212 2541 698 -1929 -586 2496 1342 -1224 649 2668 -852 -3416 791 5273 1933 -3364 -1090
1227 -1090 3444 1408 -2394 -560 3718 2542 -704 93 1894 -982 -2701 2405 6931 1311 -5530
1242 -5530 -2331 5109 2640 -3886 -1966 5436 4211 -2474 -3265 1269 978 -974 2545 5492 -723
$$ packed form
1121D07J89P59n2p58j76L1K66j29j08r9j44j90j50q5J83l52K5P11j7o99o08J463
1143D67M49r71q38L95Q64q69lL92j90q09o6Q25nj252M08J280J1j574l10J452Q32
1164D88j116j204J014R78j318l59J250Q50j769n71J688L16j697k42J723J114k180
1181a035j552K040P47j449m23K347O36k085j448J872J737j494j657J642J468k023
1197f77j671K248J464j937j111K708R33l231j650L411K866k526k807J802K719
1212B541j843k627J343L082j154k566J873K019l520k564M207M482l340n297K274
1227a090M534k036l802J834M278j176l246P97J801k876j719N106M526n620o841
1242e530L199P440k469o526J920P402j225o685p91M534k91j952L519K947o215
$$ plain form
1257 -723 -7001 -2010 6049 2860 -4416 -1622 6186 3792 -5231 -5966 1924 3938 562 335 2344 -2392
1273 -2392 -7115 -1509 7076 3834 -5778 -3677 5570 3726 -7556 -7617 3547 8114 501 -4776 -1809
1288 -1809 -1519 -4053 -214 5917 2701 -6456 -4468 4876 2504 -8524 -7212 7135 10506 -2757
1302 -2757 -10449 -2904 2618 -870 -928 4626 2682 -6560 -5916 3992 3089 -7317 -4926 9355 9998 -6874
1318 -6874 -14334 -1447 8594 2810 -2948 1960 2333 -5887 -6298 3649 5305 -3679 -2897 8891 7040
1333 7040 -10661 -14128 3412 14453 3723 -6715 -1282 3185 -2514 -5565 3476 7324 -290 -2675
1347 -2675 4399 3245 -9805 -10442 8171 17168 2470 -11524 -4508 5883 1075 -4972 2506 9525
1361 9525 2418 -5489 -1399 1501 -4850 -4018 10269 15225 -2373 -15417 -4334 9704 4162 -5001
$$ packed form
1257g23o278M991Q059l189p276K794P808k394r023p35P890K014l376k27K009m736
1273b392m723N606Q585l242r612K101R247j844j1282o1J1164M567p613n277K967
1288a809K90k534L839O131l216r157J988R344k372j1028J312J4347L371j3263
1302b757p692P545N522l488n8N554j944r242O44R908r03j0406K391J4281O43j6872
1318f874p460J2887J0041n784n758M908L73q220m11R947J656q984P82J1788j851
1333G040j7701l467J7540J1041j0730j0438N433M467n699l051R041L848p614k385
1347b675P074j154j3050o37J8613Q997j4698j3994P016J0391m808o047P478P019
1361I525p107p907M090K900o351Q32J4287M956j7598j3044J1083J4038n542r163
$$ plain form
1375 -5001 1368 10131 1165 -10259 -4873 4707 1508 -1550 7593 10224 -5794 -16666 -2318 14176
1389 14176 6351 -7094 -1404 8483 140 -12362 -5441 8547 6706 -1584 1386 3561 -7238 -13766
1403 -13766 1386 15914 5246 -9753 -4106 6575 -867 -12577 -3645 12997 8754 -5760 -6366
1416 -6366 641 -3270 -8650 2866 13918 4457 -11224 -8005 4306 1333 -8162 -934 12605 7390
1430 7390 -9891 -11115 210 2422 -2827 2235 10476 1476 -13598 -9455 6146 5650 -4982 -1133
1444 -1133 10199 4318 -13004 -12291 4916 9721 -613 -2100 5575 540 -11829 -8208 7602 9892
1458 9892 -2502 -3334 5705 1839 -12364 -8773 9563 12328 -2023 -6011 2775 1023 -9775 -5461
1472 -5461 11281 12145 -3270 -7529 2120 2345 -8047 -4506 11427 12205 -4169 -10267 472 3854
$$ packed form
1375e001O369Q763q966j1424N386R580l199l058R143K631j6018j0872J4348J6494
1389A4176p825j3445N690R887q343j2502O921J3988j841q290K970K175j0799o528
1403a3766J5152J4528j0668j4999N647J0681p442j1710Q932J6642m243j4514o06
1416f366P007l911n380J1516J1052r461j5681L219J2311k973r495P228J3539n215
1430G390j7281j224J1325K212n249N062Q241r000j5074M143J5601m96j0632L849
1444a133J1332n881j7322P13J7207M805j0334j487P675n035j2369L621J5810K290
1458I892j2394q32R039l866j4203L591J8336K765j4351l988Q786j752j0798M314
1472e461J6742Q64j5415m259R649K25j0392L541J5933P78j6374o098J0739L382
$$ plain form
1486 3854 -4369 -2750 10693 10779 -5248 -10835 1046 5672 -2197 -2039 9031 8672 -6318 -11462 508
1501 508 7212 -269 -2300 7125 7278 -6574 -11549 848 9332 1606 -3305 3794 5706 -5901 -10580
1516 -10580 1324 9801 2255 -3801 2965 4301 -6600 -10526 2822 11299 2126 -6511 -529 3955
1530 3955 -4549 -8843 2857 10837 2355 -6538 -1653 2932 -4387 -7366 4495 11158 367 -10040
1544 -10040 -3687 4086 -2015 -6536 3079 9948 118 -9544 -4312 3226 -299 -4231 3501 8280 -1741
1559 -1741 -10653 -3830 5805 1371 -4557 1082 6865 -921 -9789 -4466 4788 2589 -2731 481 4595
1574 4595 -2213 -8994 -2274 6617 2998 -4028 -610 4712 -344 -8059 -3201 6552 5150 -3129 -2554
1589 -2554 2387 -760 -5914 -1122 6926 4232 -3802 -2641 3152 780 -5062 -1101 6959 5257 -3537
$$ packed form
1486C854q223J619J3443Q6j6027n587J1881M626p869J58J1070l59j4990n144J1970
1501E08O704p481k031R425J53j3852m975J2397Q484p726m911P099J912j1607m679
1516a0580J1904Q477p546o056O766J336j0901l926J3348Q477r173q637N982M484
1530C955q504m294J1700P980q482q893M885M585p319k979J1861O663j0791j0407
1544a0040O353P773o101m521R615O869r830r662N232P538l525l932P732M779j0021
1559a741q912O823R635m434n928N639N783p786q868N323R254k199n320L212M114
1574D595o808o781O720Q891l619p026L418N322n056p715M858R753j402q279N75
1589b554M941l147n154M792Q048k694q034J161N793k372n842L961Q060j702q794
$$ plain form
1604 -3537 -3867 2485 1385 -3006 -207 6239 3791 -3980 -3614 2852 2460 -3073 -1071 5758 3775 -4269
1620 -4269 -4752 2808 3794 -1085 -357 4790 3026 -3716 -3420 2427 3160 -1493 -890 3385 1814 -4064
1636 -4064 -3533 2732 3997 -630 -1449 2781 2205 -2907 -3474 2307 3935 -374 -1948 1539 1328 -3045
1652 -3045 -2683 2658 3390 -802 -2398 651 1215 -2178 -2537 2061 3413 -903 -3067 -143 1379 -1220
1668 -1220 -1523 1480 2755 -1240 -3206 -334 1316 -1542 -2319 953 1821 -1402 -3408 -295 1397 -587
1684 -587 -1500 851 1680 -843 -2324 -439 1410 -663 -1811 359 1302 -1340 -2635 -513 1652 -87
1700 -87 -1819 -35 1053 -613 -2034 -321 1277 82 -1088 146 303 -507 -1117 521 1586 82
1716 82 -994 -191 828 -295 -1520 45 1118 364 -817 -124 781 157 -666 437 1474 884 -333
$$ packed form
1604c537l30O352j100m391K799O446k448p771L66O466l92n533K002O829j983q044
1620d269m83P560R86m879P28N147j764o742K96N847P33m653O03M275j571n878
1636d064N31O265J265m627q19M230n76n112n67N781J628m309j574L487k11m373
1652c045L62N341P32m192j596L049N64l393l59M598J352m316k164K924J522k599
1668a220l03L003J275l995j966K872J650k858p77L272Q68l223k006L113J692j984
1684e87r13K351Q29k523j481J885J849k073j148K170R43k642j295K122K165j739
1700h7j732J784J088j666j421J713J598j195j170J234J57q10o10J638J065j504
1716H2j076Q03J019j123j225J565J073p54j181O93R05o24q23J103J037n90j217
$$ plain form
1733 -333 215 1023 48 -488 316 923 635 -695 -303 877 586 212 472 1178 614 -8 198 847 584
1752 584 -154 290 777 840 -120 91 981 1099 276 344 432 286 -482 -70 446 204 4 59 363 308 225 743
1774 743 1165 526 122 289 200 495 -73 -356 67 213 -203 -261 -347 -216 -103 208 191 70 25 -37 -108 -1
1796 -1 -124 -107 -231 -225 -144 -226 -230 -250 -214 -389 -225 -396 -711 -613 -464 -549 -892 -786 -520 -176 -406 -13 69 -351 131
1821 131 -73 -124 -425 -342 -819 -406 -268 -921 -474 -827 -130 -358 -342 -245 308 -120 53 316 -32 -149 -361
1842 -361 452 117 -731 -727 133 329 229 -568 -361 296 -94 -211 6 171 -163 -245 381 705 52 -121 848
1863 848 1404 626 149 108 468 572 396 308 166 -523 -116 730 483 -302 -1143 1439 1950 604 -916 234
1883 234 2306 1595 -148 -610 624 537 150 -19 44 -21 167 1229 835 -642 -1397 393 1946 889
$$ packed form
1733c33N48Q08r75n36Q04O07k88j330L92J180k91l74K60P06n64o22K06O49k63
1752E84p38M44M87O3r60K11Q90J18q23O8Q8j46p68M12N16k42k00N5L04n5q3N18
1774G43M22o39m04J67q9K95n68k83M23J46m16n8q6J31J13L11j7j21m5o2p1J07
1796aj23J7j24OQ1q2mk0L6j75J64j71l15R8J49q5l43J06K66L44k30L93Q2m20M82
1821A31k04n1l01Q3m77M13J38o53M47l53O97k28J6R7N53m28J73K63l48j17k12
1842c61Q13l35q48MQ60J96j00p97K07O57l90j17K17J65l34q2O26L24o53j73R69
1863H48N56p78m77m1L60J04j76q8j42o89M07Q46k47p85q41K582N11j346j520J150
1883B34K072p11j743m62J234q7l87j69O3o5J88J062l94j477p55J790J553j057
$$ plain form
1901 889 -1207 -667 914 605 -295 449 1483 102 -764 635 1719 -457 -2429 -47 2809 588
1917 588 -2932 -2649 933 1528 -499 -1084 492 906 384 392 7 -1151 -910 1841 2200 -1154 -3781 -1179
1935 -1179 2305 655 -2625 -1780 1891 1322 -2175 -1913 761 827 -1316 -340 1451 -492 -3415 -1705
1951 -1705 2214 2468 -1429 -2303 753 1301 -1239 -2035 -123 797 -352 -91 26 -2121 -3440 432 4772
1968 4772 1824 -3683 -2464 3380 3112 -2772 -3785 1962 4383 -666 -3961 -1334 746 -613 -43
1983 -43 2376 1631 -2319 -2344 2036 2091 -1423 -1208 3002 2922 -1854 -3452 646 1926 -401 367 3605 1226
2001 1226 -4349 -3466 3711 4318 -2004 -3644 2466 4557 -2307 -5544 81 5800 2888 -963 -392 635
2017 635 -1220 -850 2443 2831 -1407 -1757 2122 1463 -3999 -4099 3266 6447 126 -4082 -403 2558
$$ packed form
1901H89k096N40J581l09r00P44J034j381q66J399J084k176j972K382K856k221
1917E88l520K83L582N95k027n85J576M14n22Ql85j158K41K751L59l354k627K602
1935a179L484j650l280Q45L671n69l497K62K674O6k143R76J791j943k923J710
1951a705L919K54l897q74L056N48k540p96J912R20j149K61J17k147j319L872M340
1968D772k948n507J219N844k68n884j013N747K421n049l295K627K080j359N70
1983d3K419p45l950k5M380N5l514K15M210q0m776j598M098J280k327P68L238k379
2001A226n575Q83P177O07o322j640O110K091o864l237N625N719k912l851N71J027
2017F35j855L70L293L88m238l50L879o59n462j00P365L181o321m208L679K961
$$ plain form
2033 2558 -933 -2892 3001 5399 -656 -4911 -382 2896 -1585 -4036 1848 6408 415 -5819 -3146
2048 -3146 2125 1103 -1189 1557 2719 -1696 -4575 -471 2528 -905 -2315 3690 5779 -2561 -8123
2063 -8123 -1368 5783 1877 -4085 -887 3260 -1391 -6923 -2188 4503 2718 -1911 -26 2901 -1660
2078 -1660 -5698 -593 6119 2918 -3015 -1726 1363 -1709 -4717 -206 5559 1876 -3819 -1631 1942
2093 1942 -1532 -5605 519 7490 3052 -5722 -4235 2366 1042 -3522 -138 6245 3133 -4557 -3959
2108 -3959 1759 1231 -2829 119 5148 1398 -6185 -4788 2761 3144 -1575 379 5677 1921 -5759
2123 -5759 -3942 4034 4218 -1612 -677 3901 1293 -6144 -4865 4422 5236 -952 -1535 3178 1348 -5036
2139 -5036 -3350 5077 5801 -1193 -2591 1991 1288 -4709 -2953 5487 6401 -1407 -3707 1198 1159 -4012
$$ packed form
2033B558l491j959N893K398o055m255M529L278m481k451N884M560n993o234K673
2048c146N271j022k292K746J162m415k879M104K999l433j410O005K089q340n562
2063h123O755P151l906n962L198M147m651n532M735O691j785m629J885K927m561
2078a660m038N105O712l201n933J289L089l072l008M511N765l683n695K188L573
2093A942l474m073O124O971m438q774J487O601j324m564L384O383l112p690N98
2108c959N718n28m060K948N029l750p583J397P549L83m719J954N298l756p680
2123e759J817P976J84n830R35M578k608p437J279R287Q14o188n83M713j830o384
2139e036J686Q427P24o994j398M582p03n997J756Q440R14p808k300M905l9n171
$$ plain form
2155 -4012 -2435 5000 5194 -2891 -4710 606 1938 -2737 -1467 5824 5990 -2311 -5378 39 2810
2170 2810 -1192 -1489 4062 3962 -4071 -6458 256 3420 -1187 -2006 3697 4160 -3459 -6201 501 4817
2186 4817 744 -1887 1763 2338 -3558 -5579 1185 4783 -102 -2466 1661 2296 -4294 -6382 1203
2201 1203 5814 189 -4238 -830 2209 -2236 -4693 1800 5937 1240 -3324 -279 1869 -2343 -4679
2216 -4679 1860 5492 357 -5197 -1945 1468 -1226 -2981 2428 5126 115 -4577 -1123 2350 -667
2231 -667 -2629 2433 5213 -1079 -5848 -1940 3409 873 -1935 988 4276 33 -4999 -1988 2967
2246 2967 1557 -1531 783 3203 -1070 -4305 -929 4102 2322 -1332 438 3526 -191 -4435 -1042
2261 -1042 3817 2140 -2139 -836 2068 -372 -3851 -468 4737 3025 -1742 -980 2431 567 -2893
$$ packed form
2155d012J577P435J94q085j819N316J332m675J270P291J66q301l067N417K771
2170B810m002k97N551j00q033k387O714L164m607q19N703M63p619k742O702M316
2186D817m073k631L650N75n896k021O764L598m885k364M127O35o590k088P585
2201A203M611n625m427L408L039m445k457O493M137m697m564L045K148m212k336
2216d679O539L632n135n554L252L413k694j755N409K698n011m692L454L473l017
2231f67j962N062K780o292m769L908N349k536k808K923L288m243n032L011M955
2246B967j410l088K314K420m273l235L376N031j780l654J770L088l717m244L393
2261a042M859j677m279J303K904k440l479L383N205j712m767P62L411j864l460
$$ plain form
2276 -2893 -684 4130 2834 -2300 -2266 1190 417 -2273 289 4055 1873 -2822 -2248 1707 978 -2359
2292 -2359 -120 3301 1881 -3187 -2317 1630 1751 -735 -41 2561 1306 -2888 -2680 1197 1591 -1504
2308 -1504 -931 1449 582 -3126 -2366 1644 2164 -507 -447 1853 1151 -2379 -2343 1224 1993 -883 -1803 462
2326 462 -118 -2500 -2428 1352 1948 -762 -1467 359 537 -1466 -1668 1465 2038 -799 -1710 210 746 -1044
2344 -1044 -1227 1632 1760 -1070 -2209 151 595 -706 -1651 679 1403 -1320 -2227 -138 1543 82
2360 82 -299 1024 2020 -778 -1390 203 1359 -481 -721 213 875 -1107 -1782 13 1475 146 -470
2377 -470 656 1087 106 -1349 436 1397 375 -411 379 668 -438 -1037 558 1406 566 -714 -61 701
2395 701 -302 -1006 294 1117 344 -710 -71 993 732 -409 598 1363 675 -256 -113 668 -152 -786
$$ packed form
2276b893K209M814j296n134L4L456p73k690K562L766k182m695N74L955p29l337
2292b359K239L421j420n068Q70L947J21k486O94K602j255m194K08L877L94l095
2308a504N73K380q67l708P60M010N20k671O0K300p02l530L6L567P69k876r20K265
2326D62n80k382P2L780N96k710p05J826J78k003k02L133N73k837r11J920N36j790
2344a044j83K859J28k830j139K360M44j301r45K330P24k723r07K089J681j461
2360H2l81J323R96k798o12J593J156j840k40R34O62j982o75J795J462j329o16
2377d70J126M31r81j455J785R61j022p86P90K89j106n99J595Q48q40j280O53P62
2395G01j003p04J300Q23p73j054O39J064k61j141J007P65o88r31J43P81q20o34
$$ plain form
2413 -786 -177 443 100 -811 -501 428 442 -301 345 981 922 -187 171 583 536 -545 -35 651 52 -769
2433 -769 -376 473 187 -46 -272 346 -212 -470 -468 152 175 -399 -415 339 197 -45 322 728 318 8 -114
2454 -114 16 -199 -680 -244 -737 -461 -551 -850 -257 -207 -274 -188 137 375 47 -325 -127 -610 -202 -326 -279 -322
2476 -322 -269 -503 -163 24 -193 -53 81 4 -337 -293 -69 -409 -247 -47 -176 62 -61 39 352 572 320
2497 320 140 104 71 -90 -641 -257 -165 -351 -361 -200 -23 400 246 244 591 468 387 599 351 17 -69 240 405
2520 405 201 -234 236 -258 290 223 287 393 -89 509 337 336 -156 -118 583 894 492 -296 -53 534 787 127
2542 127 1 330 315 286 126 -664 -351 57 444 332 -328 66 393 827 484 -267 368 288 252 92 74 -255
2564 -255 -563 -893 -116 55 -508 -700 -271 738 282 -542 -738 132 633 167 -288 -489 -282 157 270 77
$$ packed form
2413g86O09O20l43r11L10R29J4p43O46O36n9j109L58M12m7j081N10O86n99q21
2433g69L93Q49k86k33k26O18n58k58KO20K3n74j6P54j42k42L67M06m10l10j22
2454a14J30k15m81M36m93K76r0k99N93N0o7Q6L25K38l28l72J98m83M08j24M7m3
2476c22N3k34L40J87k17J40J34p7l41M4K24l40J62K00j29K38j23J00L13K20k52
2497C20j80l6l3j61n51L84R2j86j0J61J77M23j54kL47j23q1K12k48l34q6L09J65
2520D05k04m35M70m94N48o7O4J06m82N98j72jm92L8P01L11m02p88K43N87K53o60
2542A27j26L29j5k9j60p90L13M08L87j12o60L94L27M34l43p51O35q0l6j60j8l29
2564b55l08l30P77J71n63j92M29J009m56q24j96Q70N01m66m55k01K07M39J13j93
$$ plain form
2584 77 -749 -686 737 789 -694 -1349 -355 836 -175 -1673 -1160 -18 393 -351 -461 403 435 -307 -114
2603 -114 533 398 -790 -716 562 -41 -1440 -1063 -332 166 -190 -159 223 -106 -348 716 1180 -46 -884
2622 -884 178 1253 71 -2241 -1134 1342 1547 -495 -1672 381 1009 -219 -1070 163 680 62
2638 62 -276 336 -190 -1002 -130 1817 1373 -558 -401 1110 712 -877 -492 1338 621 -1221 -1042 705
2656 705 243 -1209 -530 1964 2042 -873 -1840 891 2124 401 -1013 463 1451 -109 -1040 -352 191
2673 191 -196 497 1590 145 -1773 -1208 1655 1808 -838 -1240 1517 1415 -1377 -2164 403 2422 318
2690 318 -806 663 1096 -1310 -1982 646 2087 -176 -2009 -602 464 -677 -2235 342 2006 659
2706 659 -1070 187 695 -1042 -1045 1605 2459 -1018 -2582 -288 1318 -1256 -2387 872 2714 -198
$$ packed form
2584G7q26O3J423N2j483o55R94J191j011j498N13J142M11p44j10Q64L2p42J93
2603a14O47j35j188P4J278o03j399L77P31M98l56L1L82l29k42J064M64j226q38
2622h84J062J075j182k312J107K476K05k042j177K053O28j228q51J233N17o18
2638F2l38O12n26q12Q72J947m44j931J57J511l98j589L85J830p17j842J79J747
2656G05m62j452O79K494P8k915r67K731J233j723j414J476R88j560r31O88N43
2673A91l87O93J093j445j918N65K863J53k646m02K757j02k792p87K567K019k104
2690C18j124J469M33k406o72K628J441k263j833J407J066j141j558K577J664j347
2706F59j729J257N08j737lK650Q54l477j564K294J606k574j131L259J842k912
$$ plain form
2722 -198 -3243 -1195 1559 174 -1382 637 2445 -508 -3081 -724 1672 244 -1358 1043 1865
2737 1865 -616 -2989 -873 1999 293 -1273 418 1485 -1295 -3303 -527 2810 1193 -1730 185
2752 185 2188 -308 -3030 -535 2772 1428 -1648 -958 1062 -740 -2801 -157 3212 1399 -1788
2767 -1788 -1066 1455 132 -2063 95 3550 1556 -2104 -1331 1338 62 -1667 410 3704 1803
2782 1803 -2538 -1988 1580 1027 -1737 150 2878 1263 -2893 -2463 1494 1825 -802 426 3091 1200
2798 1200 -2992 -2359 1947 2206 -888 -733 2218 620 -3464 -2356 2277 2986 -589 -552 2121 475
2814 475 -3062 -1578 3077 3081 -1307 -1944 1482 606 -3237 -2155 2867 3129 -1199 -2158 473 493 -2632
2831 -2632 -1634 2687 2925 -1712 -3012 324 1115 -1706 -1460 2833 3143 -1409 -3213 -79 1263 -972
$$ packed form
2722a98l045K048K754j385j556K019J808k953k573K357K396j428j602K401Q22
2737A865k481k373K116K872j706j566J691J067k780k008K776L337j617k923J915
2752A85K003k496k722K495L307j344l076O90K020j802k061K644L369j813l187
2767a788P22K521j323k195K158L455j994l660P73K669j276j729K077L294j901
2782A803m341N50L568n53k764J887K728j615m156M30L957L31k627J228K665j891
2798A200m192O33M306K59l094J55K951j598m084J108M633P09l575L7K673j646
2814D75l537J484M655Mm388o37L426q76l843J082N022K62m328r59K631K0l125
2831b632R98M321K38m637j300L336P91k821K46M293L10m552j804L134J342k235
$$ plain form
2847 -972 -1031 2410 2066 -2803 -3915 265 2109 -606 -1369 1911 2602 -1986 -3751 423 2815 313
2863 313 -1235 912 1627 -2373 -3885 437 2742 308 -1511 784 1782 -2197 -3578 817 3390 223
2879 223 -2106 123 1458 -1962 -2828 1462 3853 454 -2383 157 1520 -1495 -2969 1229 3666
2894 3666 563 -2844 -911 1330 -584 -1281 1529 3424 226 -2833 -719 1561 74 -1103 1245
2909 1245 3536 32 -3444 -1225 1970 842 -1541 1034 3077 -428 -3240 -1134 2427 1261 -1124
2924 -1124 216 2331 -144 -3176 -939 2574 1665 -992 -172 1641 22 -2690 -717 2630 1636 -1153
2940 -1153 -547 1371 -82 -2753 -755 3008 1868 -1151 -815 1031 -60 -1975 -685 2637 1440
2955 1440 -1868 -1514 428 -286 -2088 -185 2880 1301 -2169 -1714 951 629 -1309 -330 2335 1270
$$ packed form
2847i72n9L441l44m869j112M180J844k715p63L280O91m588j765M174K392k502
2863C13j548K147P15m000j512M322K305k434j819K295R98l979j381M395K573l167
2879B23k329K229J335l420q66M290K391l399k837K540J363l015j474M198K437
2894C666l103l407J933K241j914o97K810J895l198l059K114K280j487j177K348
2909A245K291l504l476K219L195j128k383K575K043l505k812K106L561j166k385
2924a124J340K115k475l032K237L513r09k657Q20J813j619k712J973L347r94k789
2940a153O06J918j453k671J998L763j140l019L36J846j091j915J290L322j197
2955A440l308L54J942p14j802J903L065j579l470M55K665l22j938R79K665j065
$$ plain form
2971 1270 -2448 -1993 851 1187 -1113 -280 1773 1061 -2086 -2039 694 893 -957 -979 1140 490 -1763
2988 -1763 -1852 1325 1406 -825 -852 1307 520 -1838 -1975 1208 1623 -844 -1164 689 544 -1792 -1531 1369
3006 1369 2106 -400 -1216 644 741 -1174 -1075 1350 1675 -681 -1393 262 904 -879 -916 1098 1913 -681
3024 -681 -1693 308 809 -165 -630 777 1439 -718 -1272 133 1240 209 -383 901 1171 -382 -1126
3041 -1126 375 1073 68 -688 561 1111 -204 -1316 87 1266 193 -243 448 1126 -296 -857 372
3058 372 1020 233 -900 193 773 -391 -1034 332 1299 228 -648 -17 604 -59 -414 96 1042 212
3076 212 -671 -366 510 95 -393 -4 795 352 -827 -478 606 51 -667 77 592 -80 -1044 -882 322
3095 322 308 -283 74 753 -223 -776 -411 547 38 -614 -232 296 -59 -707 -348 542 -64 -165 -520 108
$$ packed form
2971A270l718M55K844L36k300Q33K053p12l147M7K733J99j850k2K119o50k253
2988a763q9L177Q1k231k7K159p87k358j37L183M15k467l20J853j45k336K61K900
3006A369P37k506q16J860R7j915R9K425L25k356p12J655O42j783l7K014Q15k594
3024f81j012K001N01r74m65J407O62k157n54J405J107j031n92J284K70j553p44
3041a126J501O98j005p56J249N50j315j112J403J179j073m36O91O78j422n61J229
3058C72O48p87j133J093N80j164o43J366R67j071q76O31O21o63l55N10R46q30
3076B12q83L05Q76m15m88L89P99m43j179L49J084n55p18P44N15o72r64J62J204
3095C22j4n91L57O79r76n53L65R58n09o52L82N28l55o48L59Q90o06j01l55O28
$$ plain form
3115 108 -438 -505 -329 453 -345 -484 -412 104 301 -379 -393 520 145 -478 -406 554 -5 -463 -196 -70 -113 -444
3137 -444 -422 -33 194 -125 236 182 168 181 -71 209 263 -127 31 196 -52 -368 -172 253 284 104 54 -14 140
3160 140 -2 -301 120 226 -28 -275 371 505 79 217 -53 330 220 31 -75 60 -77 44 305 62
3180 62 -21 158 -61 134 341 -30 228 466 116 176 107 144 619 -36 -89 -44 216 182 -169 251 219 -138 68
3203 68 -16 -130 69 292 245 -57 -66 -226 154 -117 -142 -158 -50 -113 -16 5 -8 -187 -255 109 -28 -84 -376 -376 301
3228 301 207 -212 -450 17 127 -225 18 -215 -521 -63 -443 -407 -583 -394 37 210 -51 -397 -62 76 173
3249 173 -358 -241 107 113 -278 -290 41 -279 -358 -2 84 -31 -309 -197 2 -131 -62 -121 99 -74 293 185
3271 185 -155 -257 -89 255 386 -248 -558 60 739 239 -651 -332 567 219 -344 -610 -26 327 148 193
$$ packed form
3115A08n46o7J76P82p98j39P2N16J97o80j4R13l75o23P2R60n59m58K67J26m3l31
3137d44K2L89K27l19L61n4j4J3k52K80N4l90J58J65k48l16J96M25L1j80n0o8J54
3160A40j42k99M21J06k54k47O46J34m26J38k70L83j10j89j06J35j37J21K61k43
3180F2q3J79k19J95K07l71K58K38l50O0o9L7M75o55n3M5K60l4l51M20l2l57K06
3203F8q4j14J99K23m7l02rj60L80k71k5j6J08o3R7K1j3j79o8L64j37n6k92%O77
3228C01r4m19k38M67J10l52K43k33l06M58l80L6j76J89M31J73k61l46L35J38R7
3249A73n31J17L48Ol91j2L31l20p9L56Q6j15k78J12J99j33O9n9K20j73L67j08
3271A85l40j02J68L44J31o34l10O18O79n00q90L19Q99l48n63k66N84L53j79M5
$$ plain form
3291 193 277 170 -276 215 769 223 9 -23 712 104 -939 -296 780 328 -37 177 443 -43 -832 248
3311 248 1119 525 -644 -257 702 421 -341 -531 729 934 -119 -163 151 161 -135 223 760 41 -500 -449
3331 -449 371 311 -724 -242 762 614 -635 -817 338 774 -384 -291 950 391 -691 -1119 439 390
3349 390 -763 -271 780 550 -625 -999 379 857 -425 -452 362 117 -983 -999 33 903 -609 -760
3367 -760 407 496 -1113 -1063 703 1074 -489 -944 186 399 -721 -1163 573 1116 -337 -1070 154 389
3385 389 -516 -930 968 1399 -236 -1599 -389 572 -447 -856 801 1497 -324 -1834 -117 1009 -42
3402 -42 -990 922 1175 -533 -1744 -316 1171 226 -984 733 1261 -318 -1644 -30 1392 377
3418 377 -775 375 1402 -283 -1868 98 1878 631 -715 -4 890 -49 -1577 258 1996 559
$$ packed form
3291A93Q4j07m46M91N54n46k14l2P35o08j043O43J076m52l65K14K66m86p89J080
3311B48Q71n94j169L87R59k81p62j90J260K05j053m4L14J0k96L58N37p19n41N1
3331d49Q20o0j035M82J004j48j249j82J155M36j158R3J241n59j082m28J558m9
3349C90j153M92J051k30j175l74J378M78j282k7Q14k45j100j6J032Q70j512j51
3367g60J167Q9j609N0J766L71j563m55J130K13j120m42J736N43j453p33J224K35
3385C89r05m14J898M31j635j363J210R61j019m09J657O96j821j510J717J126j051
3402d2r48J912K53j708j211J428J487r45j210J717N28j579j326J614J422j015
3418C77j152J150J027j685j585J966J780j247j346P11Q94r39j528J835J738j437
$$ plain form
3434 559 -1175 -164 949 -266 -1748 345 2216 981 -1169 -516 997 -157 -1192 187 2324
3449 2324 924 -1440 -721 1055 167 -1281 71 2088 751 -1852 -1056 1141 497 -1069 326 1760
3465 1760 203 -2178 -1118 1178 691 -951 84 1990 256 -2619 -1556 1380 1300 -853 -353 1299
3481 1299 -19 -2311 -1061 1633 1320 -720 -664 1256 -50 -2347 -1172 1747 1857 -790 -1267 608
3497 608 12 -1888 -893 1737 1294 -1136 -1492 804 382 -1693 -692 2027 1820 -1250 -1629 194 431
3514 431 -1191 -621 1933 1457 -1658 -1960 522 955 -1133 -482 1842 1483 -1571 -2442 243 1385 -521
3531 -521 -850 1448 1501 -1454 -2020 815 1570 -297 -842 1343 946 -1905 -2054 816 2365 338 -774
3548 -774 884 976 -1480 -1814 920 2858 175 -1397 291 1222 -1167 -1522 1264 2593 150 -1461
$$ packed form
3434E59j734J011J113j215j482K093J871j235k150O53J513j154j035J379K137
3449B324j400k364P19J776q88j448J352K017j337k603P96K197o44j566J395J434
3465A760j557k381J060K296m87j642J035J906j734k875J063K936q0k153N00J652
3481A299j318k292J250K694l13k040N6J920j306k297J175K919J10k647m77J875
3497F08n96j900R95K630m43k430l56K296m22k075J001K719k07l070l79J823K37
3514D31j622N70K554m76l115l02K482M33k088O51K324l59l054q71K685J142j906
3531e21l29K298N3k955n66K835P55j867n45K185l97k851j49K870J549k027j112
3548g74J658R2k456l34K734J938k683j572J688R31k389l55K786J329k443j611
$$ plain form
3564 -1461 -13 1170 -625 -1530 1558 2426 -176 -1925 12 834 -477 -961 1284 2455 -306 -2156
3580 -2156 -157 977 -312 -1270 1202 2008 -456 -2319 -707 1571 447 -1024 769 1748 -527 -2402
3596 -2402 -644 1640 475 -693 417 1492 -545 -2226 -446 1889 583 -916 -153 1286 -518
3611 -518 -1977 -599 1946 885 -1268 -667 973 -204 -1838 -178 1995 754 -1353 -989 681 -769
3627 -769 -1807 -222 2249 645 -1597 -1069 547 194 -1576 -78 1761 672 -1650 -1184 558 421
3643 421 -982 68 1719 674 -1666 -1164 835 1044 -642 -258 1057 456 -1642 -1257 777 1089 -308
3660 -308 -276 1124 481 -1780 -884 997 1219 -636 -551 816 488 -1317 -909 1326 1416 -517 -904 762
3678 762 431 -1014 -706 1478 1319 -276 -958 533 384 -807 -690 1273 1446 -571 -641 649 457 -473
$$ packed form
3564a461J448J183j795r05L088Q68k602j749J937Q22j311m84K245J171k761j850
3580b156J999J134j289r58K472Q06k464j863J612K278j124j471J793R79k275j875
3596b402J758K284j165j168J110J075k037j681J780K335j306j499P63J439j804
3611e18j459J378K545j061k153O01J640j177j634J660K173j241k107L64J670j450
3627g69j038J585K471j604k242N28J616l53j770J498J839j089k322M66J742j37
3643D21j403J050J651j045k340N02J999K09j686L84J315o01k098L85K034L12j397
3660c08L2J400o43k261Q96J881K22j855Q5J367l28j805M08K235R0j933l87J666
3678G62l31j445L08K184j59j595o82J491j49j191J17J963J73k017p0J290j92r30
$$ plain form
3696 -473 -535 1305 1467 -472 -1009 167 896 -479 -147 1076 1216 -578 -1322 -13 743 -170 -571 714
3714 714 819 -622 -995 241 1094 104 -380 438 785 -755 -1114 385 749 41 -440 371 334 -543 -1083
3733 -1083 163 676 -84 -953 122 565 -547 -460 555 958 -84 -657 38 357 5 -927 112 693
3751 693 152 -535 -336 38 -221 -603 179 361 2 -817 -317 356 -234 -389 186 473 29 -804 -416 535
3771 535 10 -782 -91 275 -33 -725 -370 498 60 -351 -198 342 -135 -378 -419 592 375 -428 -54 656
3791 656 -26 -287 62 321 159 -294 -289 394 88 -296 -62 393 412 -332 -236 410 359 -92 -120 310 721 -215
3813 -215 -30 264 292 -20 -132 319 54 -106 -346 534 319 -26 19 384 552 -263 -393 161 348 60 -19
3834 -19 293 -14 -89 -25 376 270 -140 -38 391 267 120 132 -61 330 -1 -56 -13 72 -192 79 -65 -16 -538
$$ packed form
3696d73o2J840J62j939n37J176P29j375L32J223J40j794p44J309P56r13m01J285
3714G14J05j441l73J236Q53r90m84Q18L47j540l59J499L64p08m81Q11l7q77n40
3733a083J246N13p60q69J075M43j112Q7J015M03j042n73O95L19l52r32J039N81
3751F93n41o87J99L74k59l82P82J82l59q19N00O73n90j55N75K87m44q33L88R51
3771E35n25p92O91L66l08o92L55Q68m38m11J53N40m77k43m1J011k17q03L74P10
3791F56o82k61L49K59j62m53NO83l06l84K34M55J9p44R6O46n1m51k8M30M11r36
3813b15J85K94K8l12j12M51k65j60k40Q80k15l45M5L65J68q15j30N54J87k88p9
3834a9L12l07p5O4M01j06m10J02M29j24j47J2j93L91l31n5M3Q5k64K71j44M9n22
$$ plain form
3857 -538 -77 -209 57 -229 -298 292 473 -123 -220 -161 -83 -301 -69 -298 79 -289 -391 208 -32 -49 -450 54
3879 54 59 -107 -474 54 318 -161 -410 -110 60 -157 -139 -252 -75 -167 -79 -164 -163 -209 -233 119 314 167 -155 316
3903 316 -40 549 -145 -427 -373 -216 -110 134 -34 -98 220 -36 8 77 0 -242 322 13 -116 -253 33 49
3925 49 103 -183 194 -5 -147 94 214 27 -355 -100 114 -49 -260 70 217 367 335 105 96 125 156 276
3947 276 -56 274 -278 78 38 316 -108 -59 34 293 26 43 -50 102 -13 -166 194 353 -29 291 79 193
3969 193 -12 -106 282 233 -385 142 275 -200 -334 -15 515 142 6 13 147 -116 -132 -65 384 -77 -496 -331
3991 -331 -3 459 89 -232 144 -1 -586 -360 -2 173 -320 -215 212 544 -511 -279 164 2 -362 -340
4011 -340 606 26 -657 -419 153 329 -70 -322 278 -3 -291 -318 -47 241 -129 -232 187 318 -532 -575 170
$$ packed form
3857e38M61j32K66k86o9N90J81n96r7N9P8k18K32k29L77l68j02N99k40j7m01N04
3879E4Nj66l67N28K64m79k49L00J70k17J8j13J77r2Q8q5Jm6k4L52J95j47l22M71
3903C16l56N89o94k82N4J57J06K44j68o4L18k56M4O9p7k42N64l09j29j37K86J6
3925D9N4k86L77j99j42K41J20j87l82K55K14j63k11L30J47J50l2k30rK9L1J20
3947B76l32L30n52L56m0K78m24M9R3K59k67J7r3J52j15j53L60J59l82L20k12J14
3969A93k05r4L88m9o18N27J33m75j34L19N30l73j36PJ34k63j6O7M49m61m19J65
3991c31L28M62l70l21L76j45n85K26L58J75m93J05M27L32j055K32M43j62l64K2
4011c40R46n80o83K38N72J76l99k52O00k81k88k7K71K88l70j03M19J31q50m3P45
$$ plain form
4032 170 413 -56 -96 416 1 -610 -568 107 365 -255 -500 18 317 -533 -383 390 471 -246 -516 150 309
4053 309 -671 -493 662 930 -178 -423 352 428 -165 -385 447 654 -324 -725 417 519 -419 -405 717
4072 717 475 -198 -725 207 756 -99 -334 427 629 -155 -876 -41 1037 -91 -403 602 841 -404 -863
4091 -863 170 721 0 -672 161 853 -230 -762 673 974 90 -494 363 544 -610 -978 51 1251
4109 1251 262 -1081 -145 1011 -32 -941 429 1153 78 -1059 -179 503 -424 -724 105 1408 58
4126 58 -951 -347 646 -40 -971 315 1076 -154 -1206 -648 917 -175 -1255 190 851 199 -1558
4143 -1558 -839 705 236 -812 -173 1212 -184 -1665 -804 718 455 -553 -180 724 -309 -1542 -769
4160 -769 1004 870 -532 -304 788 198 -1425 -553 1350 999 -748 -254 502 24 -1076 -789 1148
$$ packed form
4032A70K43m69m0N12m15o11M2O75K58o20k45N18K99q50J50P73Q1p17k70O66J59
4053C09r80J78J155K68j108k45P75P6n93k20Q32K07r78m01J142J02r38J4J122
4072G17k42o73n27R32N49q55k35P61K02p84p21Q35J078j128l12J005K39j245m59
4091h63J033N51p21o72Q33O92j083n32J435L01q84n84Q57J81j154l68J029J200
4109A251r89j343R36J156j043r09J370P24j075j137Q80O82r27l00Q29J303j350
4126E8j009O04R93o86r31J286P61j230j052N58J565j092j080J445O61o52j757
4143a558P19J544m69j048O39J385j396j481Q61J522k63j008L73R04j033j233P73
4160g69J773j34j402K28J092n90j623Q72J903l51j747M94P56m78j100K87J937
$$ plain form
4177 1148 1003 -893 -670 593 426 -844 -363 1508 1121 -1344 -1208 530 591 -714 -536 1148 1138 -887
4195 -887 -1032 770 450 -395 -418 1258 832 -1126 -1470 869 866 -313 -401 1083 920 -1316 -1344 910 1211
4214 1211 -502 -253 777 785 -1055 -1311 789 1229 -262 -525 466 610 -793 -1126 820 1432 -262 -726
4232 -726 335 857 -593 -1047 776 1795 38 -1102 -141 709 -728 -841 1043 1366 -271 -1343 -49
4249 -49 726 -660 -915 905 1388 -276 -1472 -329 732 -258 -597 730 1440 -695 -1597 -368 844
4266 844 22 -571 669 1170 -743 -1837 -18 896 139 -737 505 913 -517 -1716 -121 1662 176
4283 176 -1102 188 637 -772 -1597 87 1527 389 -875 -455 707 -371 -1533 -12 1561 80
4299 80 -1003 -222 861 -234 -1357 82 1402 453 -996 -363 777 -66 -879 434 1408 142 -1193
$$ packed form
4177A148j45j896K23J263j67j270M81J871l87k465J36J738O1j305J78J684j0k025
4195h87j45J802l20q45k3J676m26j958l44K339lj179q8J484j63k236k8K254L01
4214A211j713K49J030Qj840k56K100M40j491k63R91J44j403l33J946O12j694m64
4232g26J061N22j450m54J823J019j757j140R61Q50j437j13J884L23j637j072J294
4249d9P75j386k55J820M83j664j196J143J061r90l39J327P10k135r02J229J212
4266H44q22n93J240N01j913j094J819R14p57q76J242M08j430j199J595J783j486
4283A76j278J290M49j409q25J684J440j138j264M20J162j078j162J521J573j481
4299H0j083P81J083j095j123J439J320r49j449O33J140q43q13J313R74j266j335
$$ plain form
4316 -1193 -534 971 113 -698 159 1292 284 -1287 -877 783 471 -653 241 997 305 -1054 -592
4333 -592 948 507 -515 -154 943 464 -1112 -714 1366 862 -504 -194 931 295 -1029 -457 1046
4350 1046 921 -439 -178 756 498 -982 -359 1204 1066 -688 -716 501 -167 -897 -341 769 891 -741
4368 -741 -766 288 393 -848 -191 750 578 -676 -883 333 289 -842 -414 945 511 -536 -961 148
4386 148 568 -446 -612 442 450 -639 -882 154 612 -452 -492 457 350 -861 -487 265 583 -343 -441
4405 -441 275 108 -731 -602 318 751 -233 -583 -54 345 -405 -427 141 668 -106 -570 86 651 -574 -670
4425 -670 326 595 109 -913 -232 186 -21 -609 137 740 -88 -740 -42 452 -244 -375 307 663 -94 -444
4445 -444 16 594 366 -170 339 417 -49 -716 92 654 226 -269 120 132 -156 -709 -19 479 172 -110 93
$$ packed form
4316a193O59J505q58q11Q57J133j008j571M10J660l12j124Q94P56o92j359M62
4333e92J540m41j022L61J097m79j576L98K080n04j366L10J125o36j324N72J503
4350A046j25j360K61R34k58j480O23J563j38j754k8J217o68p30N56J110J22j632
4368g41k5J054J05j241O57R41j72j254k07J216m4j131M28J359m34j047m25J109
4386A48M20j014j66J054Qj089k43J036M58j064m0R49j07j211L74P52L18r26r8
4405d41P16j67q39J29R20M33r84l50N29L99p50k2N68N27p74m64O56N65j225r6
4425f70R96K69m86j022O81M18k07n88P46O03q28o52O98M94o96j31O82L56p57l50
4445d44M60N78k28n36N09P8m66o67Q08N62m28m95L89J2k88n53O90M98l07k82K03
$$ plain form
4466 93 364 118 -229 31 238 296 -219 -39 381 -116 -328 323 566 29 -346 -262 118 234 -379 -56 393
4487 393 187 -22 -48 398 201 -14 58 273 235 -527 -255 259 23 -567 -231 84 40 -25 -167 -131 113 -25
4509 -25 -364 326 -280 -86 35 135 166 -184 -354 60 -128 -156 -170 13 144 -15 -106 -122 -226 -293 -97 -230
4531 -230 97 -109 -228 -28 -34 -99 -138 -122 170 -75 76 172 124 -312 -214 -62 -137 -208 -596 14 56 -89 -90 -116 -10
4556 -10 -238 -149 59 -255 224 -39 193 -116 -13 -64 -103 165 -17 -271 153 190 -208 219 206 -36 99 -146
4578 -146 10 130 -126 -90 20 -147 -334 204 27 90 55 -114 8 -194 37 174 46 43 79 374 83 185
4600 185 73 148 202 -29 286 -161 297 193 -245 -339 -204 357 -30 -21 -63 -93 -163 162 52 58 429 -308 74
4623 74 220 -104 -56 -106 184 -166 -413 -161 -6 173 -76 -62 -99 34 -360 136 121 -9 -220 -169 107 -120
$$ packed form
4466I3K71k46l47K60K07N8n15J80M20m97k12O51K43n37l75Q4L80J16o13L23M49
4487C93k06k09k6M46j97k15P2K15l8p62K72N14k36n90L36L15m4o5j42L6K44j38
4509b5l39O90o06J94J21J00L1l50j70M14j88k8j4J83J31j59r1j6j04o7J96j33
4531b30L27k06j19K00oo5l9J6K92k45J51R6m8m36R8J52p5p1l88O10M2j45jk6J06
4556a0k28Q9K08l14M79k63K32l09J03n1l9K68j82k54M24L7l98M27j3k42J35k45
4578a46J56J20k56L6J10j67j87N38j77O3l5j69J22k02K31J37j28lL6K95k91J02
4600A85j12P5N4k31L15m47M58j04m38r4J35N61l87Rm2l0p0L25j10OL71p37L82
4623G4J46l24M8n0K90l50k47K52J55J79k49J4l7J33l94M96j5j30k11N1K76k27
$$ plain form
4645 -120 46 -326 117 192 -75 -9 -95 -117 -33 14 -65 -98 51 247 216 -136 -125 -29 35 210 -187 -238 105 146 -153
4670 -153 -152 245 230 -196 -247 348 141 -197 -78 249 40 -267 -187 49 -54 34 -5 246 -81 -35 24 181 44
4693 44 -76 208 550 -77 -384 188 162 -25 -153 -240 406 189 -332 -10 230 16 -226 37 109 328 -107
4714 -107 -385 345 505 -98 -242 623 302 -36 34 265 176 -3 -288 229 97 -368 -103 644 488 84 -186
4735 -186 134 188 -454 -130 216 511 -317 -612 -34 116 -185 -335 96 341 -458 -324 56 376 80 -282
4755 -282 244 20 -179 -503 384 304 -594 -246 261 176 -231 -649 20 270 -316 -704 -44 129 -550 -487 189
4776 189 575 334 -339 70 405 -439 -688 116 600 -38 -418 -92 151 -463 -477 -177 407 53 -405 -152
4796 -152 440 -384 -575 433 686 -198 -514 -217 410 -231 -336 148 610 105 -443 -291 421 167 -403 321
$$ packed form
4645a20J66l72M43P5k67O6q6k2Q4M7p9l3J49J96l1l52J1R6O4J75l97n1L43M1k99
4670a53JL97j5m26n1N95k07l38J19L27k09l07Q0K36j03Q8l9K51l27M6N9J57j37
4693D4j20K84L42o27l07N72k6j87j28q7O46k17n21L22K40k14k42K63P2K19m35
4714a07k78P30J60o03j44Q65l21l38P0K31q9j79k85N17j32m65K65P47j56m04k70
4735a86L20N4o42L24L46K95q28k95N78J50l01j50M31K45p99J34L80L20k96l62
4755b82N26k24j99l24Q87q0q98L48N07q5m07m18O69K50n86l88O60J73o79O3O76
4776A89L86k41o73M09L35q44k49Q04M84o38l80L26K43o14j4L00N84l54m58K53
4796a52N92q24j91J008K53q84l16K97O27o41j05M84M62n05n48J52P12k54n70P24
$$ plain form
4816 321 512 -555 -615 -465 484 230 -379 -63 869 -110 -1024 -303 571 472 -134 -67 781 31 -1090 -225
4836 -225 808 -70 -438 -49 571 -104 -830 -398 958 378 -462 -157 604 278 -521 -182 672 630 -595
4855 -595 16 177 129 -271 -22 1043 603 -574 -265 246 285 -744 -174 1011 221 -431 -612 657 696
4874 696 -420 -282 938 251 -810 -648 597 605 -645 -396 943 372 -719 -572 498 676 -644 -423
4892 -423 675 241 -872 -721 427 667 -357 -594 484 405 -836 -847 621 877 -347 -662 498 490
$$ packed form
4816C21J91j067o0J50R49k54o09L16R32r79r14P21Q74r9o06O7Q48p50j121Q65
4836b25J033q78l68L89O20o75p26M32J356n80q40L05P61l26p99L39Q54m2j225
4855e95O11J61m8m00K49J065m40j177L09N11L9j029N70J185p90o52j81J269L9
4874F96j116J38J220o87j061J62J245Qj250K49J339n71j091J47J070J78j320K21
4892d23J098m34j113J51J148K40j024k37J078p9j241j1J468K56j224l15J160q
$$ [...]
8191A6
##END NTUPLES=NMR FID
##END=
