##TITLE=1H_LR-634-C1-0
 CDCl3, 8 sc, 
 5.3.2019
##JCAMPDX= 6.0         $$ Bruker NMR JCAMP-DX V2.0
##DATA TYPE= NMR FID
##DATA CLASS= NTUPLES
##ORIGIN= UXNMR, Bruker Analytische Messtechnik GmbH
##OWNER= root
$$ XWIN-NMR		Version 3.5
$$ Tue Mar  5 14:58:59 2019 Russian Standard Time (UT+4h)  she@DPX200
##.OBSERVE FREQUENCY= 200.1316
##.OBSERVE NUCLEUS= ^1H
##.DELAY= (6, 6)
##.ACQUISITION MODE= SIMULTANEOUS
##.ACQUISITION SCHEME= undefined
##.AVERAGES= 8
##.DIGITISER RES= 18
##SPECTROMETER/DATA SYSTEM= spect
##.PULSE SEQUENCE= zg30
##.SOLVENT NAME= CDCl3
##.SHIFT REFERENCE= (INTERNAL, CDCl3, 0, 15.7039)
##AUDIT TRAIL= $$ (NUMBER, WHEN, WHO, WHERE, WHAT)
$$ ##TITLE= Audit trail, XWIN-NMR		Version 3.5
$$ ##JCAMPDX= 5.01
$$ ##ORIGIN= Bruker BioSpin GmbH
$$ ##OWNER= she
$$ F:/spectra/data/she/nmr/H-F/1/audita.txt
$$ ##AUDIT TRAIL=  $$ (NUMBER, WHEN, WHO, WHERE, WHAT)
(   1,<2019-03-05 14:57:20.23 +0400>,<she>,<DPX200>,
      <created by zg, POWCHK disabled, PULCHK disabled
       configuration hash MD5:
       00 E9 B6 7A A2 85 ED C7 34 08 36 98 17 FE 4E 26
       data hash MD5: 16K
       2A 15 F8 69 1A DD F4 57 C9 0D 8D 3A 0E 95 A4 F4>)
$$ ##END=
$$ 
$$ hash MD5
$$ AC 57 08 5A 67 AA EF A2 98 91 29 46 57 F6 10 66
##$RELAX= 
##$RELAX= 
##$RELAX= 
##$RELAX= 
##$RELAX= 
##$RELAX= 
$$ Bruker specific parameters
$$ --------------------------
##$DU= <F:/spectra>
##$EXPNO= 1
##$NAME= <H-F>
##$PROCNO= 1
##$TYPE= <nmr>
##$USER= <she>
##$AMP= (0..31)
100 100 100 100 100 100 100 100 100 100 100 100 100 100 100 100 100 100 
100 100 100 100 100 100 100 100 100 100 100 100 100 100 
##$AQSEQ= 0
##$AQ_mod= 1
##$AUNM= <au_zg>
##$AUTOPOS= <>
##$BF1= 200.13
##$BF2= 200.13
##$BF3= 200.13
##$BF4= 200.13
##$BF5= 200.13
##$BF6= 200.13
##$BF7= 200.13
##$BF8= 200.13
##$BYTORDA= 1
##$CFDGTYP= 0
##$CFRGTYP= 5
##$CHEMSTR= <none>
##$CNST= (0..31)
1 1 145 1 1 1 1 1 1 1 1 1 1 1 1 1 1 1 1 1 1 1 1 1 1 1 1 1 1 1 1 1 
##$CPDPRG= <>
##$CPDPRG1= <>
##$CPDPRG2= <>
##$CPDPRG3= <>
##$CPDPRG4= <mlev>
##$CPDPRG5= <mlev>
##$CPDPRG6= <mlev>
##$CPDPRG7= <mlev>
##$CPDPRG8= <mlev>
##$CPDPRGB= <>
##$CPDPRGT= <>
##$D= (0..31)
0 1.2 0 0 0 0 0 0 0 0 0 0.03 0 0 0 0 0 0 0 0 0 0 0 0 0 0 0 0 0 0 0 0 
##$DATE= 1551783439
##$DBL= (0..7)
120 120 120 120 120 120 120 120 
##$DBP= (0..7)
150 150 150 150 150 150 150 150 
##$DBP07= 0
##$DBPNAM0= <>
##$DBPNAM1= <>
##$DBPNAM2= <>
##$DBPNAM3= <>
##$DBPNAM4= <>
##$DBPNAM5= <>
##$DBPNAM6= <>
##$DBPNAM7= <>
##$DBPOAL= (0..7)
0.5 0.5 0.5 0.5 0.5 0.5 0.5 0.5 
##$DBPOFFS= (0..7)
0 0 0 0 0 0 0 0 
##$DE= 6
##$DECBNUC= <off>
##$DECIM= 24
##$DECNUC= <off>
##$DECSTAT= 4
##$DIGMOD= 1
##$DIGTYP= 9
##$DL= (0..7)
0 120 120 120 120 120 120 120 
##$DP= (0..7)
150 150 150 150 150 150 150 150 
##$DP07= 0
##$DPNAME0= <>
##$DPNAME1= <>
##$DPNAME2= <>
##$DPNAME3= <>
##$DPNAME4= <>
##$DPNAME5= <>
##$DPNAME6= <>
##$DPNAME7= <>
##$DPOAL= (0..7)
0.5 0.5 0.5 0.5 0.5 0.5 0.5 0.5 
##$DPOFFS= (0..7)
0 0 0 0 0 0 0 0 
##$DQDMODE= 0
##$DR= 18
##$DS= 0
##$DSLIST= <SSSSSSSSSSSSSSS>
##$DSPFIRM= 0
$$ [...]
##$SUBNAM2= <"">
##$SUBNAM3= <"">
##$SUBNAM4= <"">
##$SUBNAM5= <"">
##$SUBNAM6= <"">
##$SUBNAM7= <"">
##$SUBNAM8= <"">
##$SUBNAM9= <"">
##$SW= 24.9336934301222
##$SWIBOX= (0..15)
0 0 2 0 0 0 0 0 0 0 0 0 0 0 0 0 
##$SW_h= 4990.01996007984
##$TD= 16384
##$TD0= 1
##$TE= 0
##$TE2= 300
##$TE3= 300
##$TEG= 300
##$TL= (0..7)
0 120 120 120 120 120 120 120 
##$TP= (0..7)
150 150 150 150 150 150 150 150 
##$TP07= 0
##$TPNAME0= <>
##$TPNAME1= <>
##$TPNAME2= <>
##$TPNAME3= <>
##$TPNAME4= <>
##$TPNAME5= <>
##$TPNAME6= <>
##$TPNAME7= <>
##$TPOAL= (0..7)
0.5 0.5 0.5 0.5 0.5 0.5 0.5 0.5 
##$TPOFFS= (0..7)
0 0 0 0 0 0 0 0 
##$TUNHIN= 0
##$TUNHOUT= 0
##$TUNXOUT= 0
##$USERA1= <user>
##$USERA2= <user>
##$USERA3= <user>
##$USERA4= <user>
##$USERA5= <user>
##$V9= 5
##$VALIST= <valist>
##$VCLIST= <CCCCCCCCCCCCCCC>
##$VD= 0
##$VDLIST= <DDDDDDDDDDDDDDD>
##$VPLIST= <PPPPPPPPPPPPPPP>
##$VTLIST= <TTTTTTTTTTTTTTT>
##$WBST= 1024
##$WBSW= 4
##$XGAIN= (0..3)
0 0 0 0 
##$XL= 0
##$YL= 0
##$YMAX_a= 361716
##$YMIN_a= -447792
##$ZGOPTNS= <>
##$ZL1= 120
##$ZL2= 120
##$ZL3= 120
##$ZL4= 120
##$ABSF1= 10
##$ABSF2= 0
##$ABSG= 5
##$ABSL= 3
##$ALPHA= 0
##$AQORDER= 0
##$ASSFAC= 0
##$ASSFACI= 0
##$ASSFACX= 0
##$ASSWID= 0
##$AUNMP= <proc_1d>
##$AZFE= 0.1
##$AZFW= 0.1
##$BCFW= 1
##$BC_mod= 2
##$BYTORDP= 1
##$COROFFS= 0
##$CY= 11.3945322036743
##$DATMOD= 1
##$DC= 2
##$DFILT= <>
##$DTYPP= 0
##$F1P= 18.9103706918063
##$F2P= -1.10871071338519
##$FCOR= 0.5
##$FTSIZE= 0
##$FT_mod= 4
##$GAMMA= 1
##$GB= 0.15
##$INTBC= 1
##$INTSCL= 1
##$ISEN= 128
##$LB= 0.24
##$LEV0= 0
##$LPBIN= 0
##$MAXI= 10000
##$MC2= 0
##$MEAN= 0
##$ME_mod= 0
##$MI= 1.114404
##$NCOEF= 0
##$NC_proc= 0
##$NLEV= 6
##$NOISF1= 3.799351
##$NOISF2= 2.8
##$NSP= 1
##$NTH_PI= 0
##$NZP= 0
##$OFFSET= 15.70392
##$PC= 1
##$PHC0= -8867.349
##$PHC1= 21.80013
##$PH_mod= 1
##$PKNL= yes
##$PPARMOD= 0
##$PSCAL= 0
##$PSIGN= 0
##$REVERSE= no
##$SF= 200.130013532006
##$SI= 16384
##$SIGF1= 3
##$SIGF2= 2
##$SINO= 400
##$SIOLD= 16384
##$SREGLST= <1H.CDCl3>
##$SSB= 0
##$STSI= 0
##$STSR= 0
##$SW_p= 3612.71676300578
##$SYMM= 0
##$S_DEV= 0
##$TDeff= 0
##$TDoff= 0
##$TI= <>
##$TILT= no
##$TM1= 0
##$TM2= 0
##$TOPLEV= 0
##$USERP1= <user>
##$USERP2= <user>
##$USERP3= <user>
##$USERP4= <user>
##$USERP5= <user>
##$WDW= 1
##$XDIM= 8192
##$YMAX_p= 0
##$YMIN_p= 0
$$ End of Bruker specific parameters
$$ ---------------------------------
##NTUPLES= NMR FID
##VAR_NAME=  TIME,          FID/REAL,        FID/IMAG
##SYMBOL=    X,             R,               I
##VAR_TYPE=  INDEPENDENT,   DEPENDENT,       DEPENDENT
##VAR_FORM=  AFFN,          ASDF,            ASDF
##VAR_DIM=   8192,          8192,            8192
##UNITS=     SECONDS,       ARBITRARY UNITS, ARBITRARY UNITS
##FACTOR=    0.0002004,     1,               1
##FIRST=     0,             0,               0
##LAST=      1.6414764,     0,               0
##MIN=       0,             -447792,         0
##MAX=       1.6414764,     361716,          0
$$ Real data points
##PAGE= N=1
##DATA TABLE= (X++(R..R)), XYDATA
0 0 0 0 0 0 8 -8 8 -8 16 -16 16 -24 32 -40 47 -56 71 -80 96 -113 134 -153 177 -207 239 -271 310 -357
28 -357 400 -453 510 -575 646 -719 806 -898 999 -1108 1231 -1364 1509 -1673 1853 -2050
44 -2050 2271 -2519 2800 -3117 3477 -3902 4399 -4991 5714 -6627 7808 -9407 11711 -15341
58 -15341 21918 -37625 153501 -16686 -379497 -37236 198151 -19781 -265902 26392 314474
69 314474 83317 -297555 -130715 253041 166254 -258866 -251365 154469 254280 -89612 -200552
80 -200552 102537 211268 -144009 -333353 11616 328783 99466 -225657 -83377 212602
90 212602 83402 -223564 -113386 246257 210718 -158253 -212108 115688 204508 -106159 -239194
101 -239194 53708 243346 5241 -197677 15976 238863 30690 -266581 -141849 168509
111 168509 126567 -141862 -114648 148057 128576 -169649 -211015 93327 218759 -25756 -172118
122 -172118 35734 190150 -8739 -198587 -35168 176039 54179 -156747 -49676 186979
132 186979 116112 -145575 -144266 94977 137509 -59394 -99152 97709 146233 -75823 -192392
143 -192392 -12068 126549 -16198 -151705 -8434 166458 66008 -120590 -69942 85721
153 85721 31800 -128673 -75144 120805 114271 -80892 -119721 50424 112054 -30161 -93719
164 -93719 41336 115190 -13795 -100159 25507 133984 18711 -122076 -47004 96395 50138
175 50138 -85946 -58297 65642 38786 -88333 -59391 99819 109584 -54874 -118026 979
186 979 59590 -45024 -93957 25939 102476 -7085 -100662 -4738 106153 30986 -88903
197 -88903 -35768 86647 53735 -62131 -36689 81796 60484 -78333 -88358 50978 97644
208 97644 -15004 -67682 29006 76201 -29938 -95471 9229 100579 12353 -100915 -47210
219 -47210 58048 18520 -81720 -44386 66497 46795 -63059 -50209 71292 82661 -40987
230 -40987 -88167 7606 59943 -15436 -55856 30105 85121 -953 -77934 -6421 87035 40340
242 40340 -55002 -29758 53541 32111 -51696 -35833 49940 38523 -59852 -69961 25807 57554
254 57554 -21830 -58933 10651 48947 -14245 -53072 12211 59225 -7346 -75933 -28140 44857
266 44857 19226 -38458 -5464 61248 35348 -37463 -21608 52453 42852 -36084 -42060 30371
278 30371 42964 -24479 -39515 28666 46754 -28656 -60898 12551 60013 -1342 -53867 -2896
290 -2896 45367 -9435 -68344 -15452 54857 10018 -71385 -38455 51108 39166 -40951 -29489
302 -29489 55769 50804 -42421 -50438 47177 72007 -28245 -75302 12879 73294 -956 -60714
314 -60714 15094 86518 10774 -83310 -24163 82306 41108 -75682 -57422 54026 46140 -68592
326 -68592 -72175 49575 72139 -51797 -96349 26068 100219 -3811 -91764 -5376 88640
337 88640 8927 -97669 -25895 101974 51817 -90121 -66344 82044 89900 -49034 -71981
348 -71981 63640 100495 -40050 -105247 25689 111973 -10710 -123558 -23940 107307 34467
359 34467 -101897 -47860 93036 54064 -99073 -83360 78517 94987 -64961 -112854 33025
370 33025 102044 -30266 -115282 9682 119339 15780 -106427 -18651 121308 56419 -97553
381 -97553 -63304 91870 81988 -71702 -85578 63156 97694 -47736 -106050 30758 114687
392 114687 -5213 -108878 -10999 102178 19016 -110323 -51130 85307 49142 -89901 -74179
403 -74179 67858 75839 -63325 -93233 42793 100546 -16303 -85403 19868 98659 -1967
414 -1967 -103778 -23417 94347 42112 -72565 -33659 85839 63296 -62236 -64503 52716
425 52716 68685 -45961 -77521 35364 87902 -16488 -93154 -15549 61319 -2836 -78017
436 -78017 -11569 81669 31393 -74138 -48172 55781 46851 -52692 -57018 38388 56611 -30422
448 -30422 -54156 32881 69134 -14382 -63543 13480 80734 21333 -52416 -14829 48271 10305
460 10305 -56737 -20006 59694 37356 -49296 -48834 30383 39903 -32013 -47548 22475 45084 -23478
473 -23478 -54562 8377 46202 -15967 -65332 -9513 54637 19590 -39135 -8731 47916 17666
485 17666 -47583 -22908 54288 48636 -26308 -35600 28797 37745 -30029 -48207 22488 57628 -2396
498 -2396 -43325 11345 55580 -2503 -66931 -28201 38077 11800 -48534 -20033 51454 31808
510 31808 -51604 -54012 24444 40971 -27059 -44749 28060 59761 -8769 -52942 6835 57553
522 57553 2407 -59948 -14697 59490 32938 -38648 -21580 52221 42496 -35921 -41385 33652
534 33652 46199 -33768 -66751 5532 54881 -554 -49970 -1051 51661 2252 -66394 -32945
546 -32945 42431 27104 -42771 -32770 43119 46997 -29978 -54404 11282 42650 -12558 -42886
558 -42886 19568 69844 17424 -47122 -17223 42815 19971 -41129 -23490 45067 41334 -29954
570 -29954 -43997 16506 35462 -21658 -47118 11822 52438 3878 -49206 -20076 25569 -1127
582 -1127 -50090 -24239 40453 37398 -20531 -29823 18864 27877 -22897 -40255 12184 48141 12239
595 12239 -24338 3443 36853 7500 -37275 -18066 31237 27830 -14620 -17066 21565 24489 -17985
608 -17985 -32140 5189 27131 -3698 -31216 -10509 14447 -5058 -32489 -13639 23370 21198
620 21198 -9451 -13025 9729 7857 -22485 -29293 2901 26927 14092 497 13503 22390 -713
633 -713 -25641 -16046 10924 16191 4628 8356 22899 16351 -10449 -23392 -11441 -1959 -7286 -8080
647 -8080 7840 18027 5631 -13273 -15539 -7302 -7633 -11929 -3710 10253 9425 -3658 -10553 -4688
661 -4688 314 -1554 1217 11427 15771 8286 -307 -1031 343 -2251 -2765 5275 13978 13833 6687 550
677 550 -3892 -9413 -13125 -7889 3100 8061 4289 285 -1576 -6044 -13358 -14188 -6773 -1224 -2340
692 -2340 -1893 4182 6763 183 -5589 -1918 4154 2807 -569 2977 8986 5735 -2408 -1680 8717
707 8717 12981 5953 1375 4994 5495 -5699 -13708 -4720 7655 5783 -3114 -844 7209 1264 -15643
722 -15643 -19165 -6838 -413 -7592 -7647 8640 17175 2076 -14623 -9570 3077 -711 -10922 -1173
736 -1173 18273 17689 -1099 -5813 10020 15350 -2384 -12958 3009 18163 5174 -11431 -1573
749 -1573 15822 6935 -15348 -11723 11140 10916 -14253 -21728 -1124 9379 -8491 -19656 684
762 684 18925 2780 -20626 -11771 11900 5665 -18046 -13556 16428 23113 -1819 -11702 11337
775 11337 22091 -2078 -20959 -610 24073 11182 -13192 -2882 23574 15587 -16415 -19566
787 -19566 8321 14741 -12301 -23295 2633 19284 -3432 -24821 -6399 18704 5051 -24321
799 -24321 -17699 11722 11426 -16745 -18238 12766 24252 -3123 -18661 5524 25597 4485 -20718
812 -20718 -5748 22114 15212 -12166 -7390 21911 21114 -12499 -23361 3808 19300 -3598 -21960
825 -21960 -1569 21111 4898 -23132 -13813 13813 8097 -23314 -25570 6197 18110 -6062 -19478
838 -19478 3954 21975 1522 -21502 -4402 23188 13911 -16659 -14712 15794 21467 -4196 -12891
851 -12891 12740 25933 -534 -22842 -3433 22632 9192 -19582 -12711 16273 14573 -16088
863 -16088 -22358 5622 14831 -14289 -30922 -3067 24121 6391 -21230 -9836 17873 8824 -22743
876 -22743 -19200 17061 23139 -10245 -22914 9555 31372 5313 -19912 1338 29534 10559
888 10559 -23592 -11616 26226 21268 -19579 -24888 13448 25786 -9568 -28669 2798 25694
900 25694 -4883 -35783 -9992 28692 12415 -28764 -21921 18205 16996 -24214 -28194 15838 31685
913 31685 -8089 -29872 7339 37622 7618 -27601 -4101 33322 14697 -28149 -17168 29117
925 29117 26714 -19497 -26796 18417 33990 -7632 -30795 3721 28743 -6898 -41090 -10645
937 -10645 32967 13711 -31731 -22385 20070 15214 -28567 -28567 20137 32468 -11253 -29200 11983
950 11983 36373 -2417 -35801 -5527 32774 10861 -25523 -4425 38688 24023 -25153 -23512
962 -23512 22301 27157 -16070 -26377 15448 30422 -12687 -38389 -2059 29229 -1032 -35107
974 -35107 -8509 29980 9799 -31780 -18545 25220 17546 -27362 -27659 18595 27498 -14701 -28239
987 -28239 12747 32822 -3669 -26481 8816 39021 7398 -30125 -7879 30733 14277 -25067
999 -25067 -12916 27679 18622 -26868 -27713 17641 27179 -14567 -28710 10576 29026 -10900 -38005
1012 -38005 -5185 24986 -3882 -36440 -8295 34282 16633 -27229 -16927 25444 19737 -24197
1024 -24197 -21870 27568 36492 -10457 -28761 11899 32322 -7860 -34315 4220 41021 9973
1036 9973 -30571 -6024 35800 13560 -37104 -26802 23419 20952 -28077 -30574 20572 30683
1048 30683 -21617 -42556 5904 36766 -3259 -37451 -506 39375 8168 -37928 -13907 36226
1060 36226 20753 -32873 -25210 31638 36657 -16085 -27920 23285 41892 -8426 -37834 5099
1072 5099 38996 -1483 -44332 -12191 37581 16983 -34111 -21606 28242 20085 -34165 -35876
1084 -35876 20030 35052 -15062 -37604 7456 35143 -7039 -42508 -7061 35550 10840 -31465
1096 -31465 -8339 41549 30136 -22261 -24754 22163 28026 -18047 -30255 15483 37058 -4159
1108 -4159 -33627 1147 35186 7101 -33374 -14378 25165 11988 -28012 -20190 21849 21043 -23724
1121 -23724 -35080 3878 22558 -7154 -24837 5832 30364 4606 -24671 -6003 24849 11814
1133 11814 -21347 -14689 19353 21930 -6409 -12211 12031 17648 -8255 -19413 6429 26844 10076
1146 10076 -12865 -7674 6693 -2729 -20574 -13818 7725 9727 -7199 -11110 4270 10354 -3512
1159 -3512 -14497 -7159 2876 641 -3951 2108 10577 6204 -6103 -10464 -1979 7473 8684 5884
1173 5884 5842 7941 6040 244 -3305 1295 6036 1241 -8547 -8587 1677 6009 -2204 -7731 567 7581
1189 7581 -344 -10642 -3699 7617 -749 -20117 -18116 4234 12299 -1283 -6070 8967 13405
1202 13405 -7869 -20406 1167 23951 12796 -9400 -1709 19320 10441 -17038 -15168 12352
1214 12352 14854 -12127 -16768 15486 30171 844 -23831 -6350 13867 -5045 -26923 -6581
1226 -6581 24233 10093 -28278 -25193 11767 18064 -11634 -16670 16032 25766 -9628 -28604 2767
1239 2767 28134 2226 -27899 -6023 29561 17089 -16580 -8327 24150 16110 -22762 -22192 21241
1252 21241 34246 -3525 -24901 724 17348 -12477 -34590 -3734 28409 7338 -27872 -12344
1264 -12344 24765 16226 -22467 -22090 12369 14255 -19876 -23199 15899 29741 -6612 -28473 1006
1277 1006 28602 8397 -15662 4679 29209 6768 -27405 -14526 23509 19770 -14195 -16119
1289 -16119 14042 16470 -15732 -22736 9003 21384 -7836 -24383 2932 24361 1104 -25942
1301 -25942 -12505 9677 -4399 -25381 -6668 26430 20116 -12113 -13349 13133 14372 -11458
1313 -11458 -13216 14879 21214 -6979 -18923 6865 22599 738 -17253 1853 21571 4867
1325 4867 -16592 -2135 19362 3980 -24551 -16312 13770 11780 -14704 -16080 8712 7688 -20403
1338 -20403 -22420 11324 26062 -143 -16714 3882 18140 -6172 -26557 -3911 22451 7714
1350 7714 -17380 -1420 28874 18470 -15158 -13531 16501 16336 -14200 -15875 17062 23751 -11868
1363 -11868 -29840 -622 20718 -2572 -22803 154 24453 1676 -29790 -13489 21174 12787
1375 12787 -21376 -18013 16030 16725 -17635 -23519 10701 23216 -6872 -20759 12189 36197 8585
1388 8585 -21298 -5124 20376 3121 -25391 -9345 26095 20002 -16110 -17872 14819 19318 -13105
1401 -13105 -22894 7233 20932 -8319 -26718 -1948 20543 -1332 -27760 -11344 17917 8449
1413 8449 -18380 -10257 19043 15926 -13845 -14904 15128 22018 -5979 -18294 4112 16982 -3283
1426 -3283 -16825 5074 24829 8645 -13171 -3016 16992 7453 -15833 -12144 8828 6451 -14067
1439 -14067 -13481 6960 9890 -9647 -15880 2121 10710 -3024 -11307 1579 10244 -2839 -13568
1452 -13568 -1859 11013 3029 -8673 -855 10861 4888 -6043 1003 14123 9351 -3998 -1462
1465 -1462 10083 5921 -8423 -8176 4305 2588 -10105 -7891 8968 10481 -5329 -10226 3176
1478 3176 7281 -8280 -14877 85 8281 -7134 -17123 504 16847 3930 -13211 -3047 14626
1491 14626 5014 -13836 -3178 21458 16280 -10431 -11320 13454 15604 -12400 -19957 7184 20724
1504 20724 -2414 -15756 8645 25897 246 -28308 -11991 16920 5034 -24124 -13875 18483
1516 18483 12948 -21710 -22067 14607 22875 -11661 -24913 8168 27888 -2108 -26203 288 28129
1529 28129 5298 -27317 -8351 29630 18569 -20697 -16441 23220 25646 -13024 -21414 15011
1541 15011 26436 -12329 -34751 -738 27766 706 -30085 -7263 26336 8272 -29225 -17677
1553 -17677 22712 18405 -21941 -23650 16563 25394 -14094 -30920 3630 26745 -1414 -23294
1565 -23294 6371 36196 11425 -25651 -11737 23882 15011 -20596 -15908 21842 23514 -13866
1577 -13866 -23053 8970 21342 -11303 -28112 3189 27958 4347 -23793 -7933 16950 1289
1589 1289 -28067 -16084 16590 13778 -15521 -14886 15499 20541 -8059 -17760 7414 20002 -1855
1602 -1855 -16335 3764 20571 2818 -16864 -3148 18426 9754 -11750 -7212 12403 9433 -10152
1615 -10152 -9016 10303 11058 -10245 -17423 -850 6622 -7545 -14414 1123 11318 -204 -9729
1628 -9729 663 10038 -1418 -13688 -4299 10113 5954 -4538 104 9729 3203 -9390 -3475
1641 -3475 12370 11883 -1720 -1840 9616 7442 -7285 -9307 4152 6450 -7897 -11328 4480 10891
1655 10891 -4170 -13770 -1247 8410 -2767 -12452 245 12799 -901 -18427 -9201 10562 7070
1668 7070 -9981 -5146 13528 10999 -9281 -9517 13291 17536 -4404 -13023 7644 19075 -864
1681 -864 -16647 -1322 14508 646 -16389 -1247 21493 10270 -17715 -15354 8533 8734 -14657
1694 -14657 -15749 9586 14187 -11160 -21866 2144 17450 -2912 -19596 -440 22090 8421
1706 8421 -14620 -4618 16948 7121 -18552 -12362 18013 21163 -5420 -12527 10124 17133 -7144
1719 -7144 -18414 5321 21068 542 -19084 -3469 16742 1643 -22238 -13770 11219 7104
1731 7104 -15092 -10039 14985 14745 -12624 -18822 4566 13970 -5856 -15839 4664 18499 173
1744 173 -15672 325 19304 6968 -12871 -3271 17978 11610 -10169 -7718 12196 9815 -12232
1757 -12232 -13727 8185 13833 -6208 -14818 2680 11583 -5778 -16895 -348 13824 -141 -16298
1770 -16298 -4835 11430 1376 -16730 -8682 11815 8833 -8874 -4833 15909 14343 -7771 -12183
1783 -12183 7438 13536 -5034 -11495 8614 18838 -877 -15148 620 15793 703 -16915
1795 -16915 -3511 16897 5965 -16589 -10529 11521 6225 -18269 -16494 10105 13758 -11071 -17489
1808 -17489 7025 16962 -6363 -19604 4225 23049 3164 -19047 -3104 20082 6250 -19541
1820 -19541 -8429 22201 18469 -10772 -11414 16685 17848 -13994 -23387 6888 22305 -3393 -21825
1833 -21825 1096 21488 -1255 -27532 -10727 19331 8889 -20652 -13162 19075 15821 -18114
1845 -18114 -22647 9647 19955 -9181 -21114 8596 26763 81 -23791 -2101 26100 10885
1857 10885 -17912 -5868 23486 14554 -19166 -18340 13923 18690 -11781 -20658 10237 24434 -3907
1870 -3907 -25216 -3834 17538 -1528 -25612 -7525 21803 11026 -20194 -16682 12626 12966 -14621
1883 -14621 -17704 12399 21353 -4734 -17911 6265 22915 1550 -19290 -2728 20185 8475
1895 8475 -14714 -6356 17287 11985 -13350 -12238 12795 16863 -7510 -17544 835 11129 -6075
1908 -6075 -17332 -768 14169 843 -16099 -6987 10851 4973 -12707 -10032 7503 8492 -5535
1921 -5535 -6023 8815 11336 -4508 -11060 1994 11391 3171 -4992 2597 10448 3305 -5373 -18
1935 -18 8132 2713 -7864 -6183 2900 3093 -4417 -4331 1897 1156 -5328 -4974 1969 2324 -5251 -7491 -1266
1952 -1266 905 -2220 -1755 4264 4984 -2003 -3609 2428 5346 -352 -2970 4179 8034 2076 -2110
1967 -2110 4447 8419 -879 -9000 -2745 6289 2154 -5697 -291 8604 3184 -9646 -8575 3935
1981 3935 2994 -9384 -10973 3127 7934 -4342 -9746 1933 9479 -2691 -12518 -795 13812
1994 13812 5678 -9014 -3324 11365 7853 -8089 -6001 11409 13117 -4750 -10386 6096 13731
2007 13731 -2821 -13776 363 14379 2253 -13864 -5248 10346 2461 -16453 -11407 8959
2019 8959 9673 -9761 -12951 5818 12137 -5699 -15815 425 13161 55 -13176 -81 16842
2032 16842 6984 -11907 -6260 14487 12966 -6773 -9200 8882 12381 -5953 -12089 6060 16317
2045 16317 -114 -14234 -2723 11325 819 -15877 -8594 9465 6696 -10195 -8336 8801
2057 8801 8910 -10595 -16739 -209 9775 -1561 -8860 4386 15247 3404 -11463 -4753 9674
2070 9674 6260 -6907 -2986 11732 11000 -3562 -6424 5953 9435 -3994 -11142 309 10163 1953
2084 1953 -7622 -2623 5083 -1495 -11139 -5308 6352 4990 -7209 -8739 955 3681 -4001 -5251
2098 -5251 3172 6556 -1989 -5934 2231 8160 2526 -4900 -912 6564 4692 -375 1635 6882 3101
2113 3101 -4541 -3608 3887 4872 -1367 -3178 1363 1901 -3582 -5372 402 2341 -3161 -6934 -2642 1195
2129 1195 -1833 -5197 -1025 3466 214 -3820 -1183 4228 2531 -2941 -1949 3243 3931 39 1142
2144 1142 7202 6394 -1181 -4269 926 4755 472 -2168 1738 4912 749 -5094 -1795 3160 -775
2159 -775 -8340 -6696 893 2851 -2474 -3267 1738 2351 -4677 -7595 -282 4913 -364 -5272 582 7269
2175 7269 4686 -2905 -1440 4749 4020 -2721 -1564 6419 8189 -56 -4425 1565 5577 -394 -6822
2190 -6822 -2023 5203 2418 -5048 -3752 2751 1136 -7128 -7934 1124 5151 -2041 -7014 -1379 4124
2205 4124 -681 -6639 -2146 5801 4133 -2802 -1138 6709 7157 -2244 -5857 1688 7268 2564 -2201
2220 -2201 2508 7779 2463 -6259 -4363 4053 4127 -3816 -5289 2359 4797 -3350 -8451 -2881 2712
2235 2712 -1596 -8062 -3201 5735 4213 -5238 -6229 1972 4090 -2767 -4560 3801 9023 1552 -5990
2250 -5990 -1288 7110 4792 -3164 -1569 7240 7049 -1973 -4458 3696 6028 -3098 -8931 -1391 7295
2265 7295 2184 -6483 -5287 1936 203 -7540 -6228 4485 5918 -4209 -8981 -451 6541 -233
2279 -233 -7266 -2384 6643 4234 -3938 -964 8529 7195 -3855 -6330 4181 10547 2831 -4589 424
2294 424 6068 578 -7810 -2870 7459 4626 -6588 -7583 2944 5998 -3519 -9027 -1958 4049 -2239
2309 -2239 -8547 -2160 7234 2562 -8712 -7120 4481 7668 -988 -3949 4334 7998 -563 -6594
2323 -6594 1472 10137 4530 -6299 -3660 7719 7621 -2740 -4876 4016 5790 -4188 -9562 375 8421
2338 8421 598 -9797 -5960 4037 1648 -8546 -7527 4198 5405 -4791 -8046 2981 9772 98
2352 98 -9523 -3443 7068 3501 -5174 -1043 11097 9281 -4454 -7167 4755 10203 -812 -7508
2366 -7508 1938 10560 1827 -9195 -4128 7038 2544 -10605 -8711 5569 8254 -5047 -10117 1294
2380 1294 7174 -4506 -12667 -1680 10655 3417 -10249 -5386 8113 5839 -7249 -6236 9803
2393 9803 13154 -1626 -8421 3724 11252 -336 -10411 -527 12777 5285 -9156 -4819 9311
2406 9311 6418 -10008 -11347 4841 9631 -4293 -11033 1729 9173 -5258 -16409 -4686 10910
2419 10910 4664 -9829 -5275 9038 6182 -8982 -7830 9964 12637 -3726 -10522 3835 12915
2432 12915 49 -10719 624 13266 4692 -8311 -1104 13176 6534 -12400 -11957 5026 8484
2445 8484 -5146 -8742 4976 8610 -7451 -16064 -2392 10237 1240 -10554 -2485 10505 3890
2458 3890 -10758 -6155 8566 6699 -8321 -8171 8915 13337 -1060 -8227 3782 10913 -529
2471 -529 -8400 4093 14339 3075 -12801 -7051 7186 4249 -8235 -4681 9609 6559 -10099
2484 -10099 -11781 4092 7798 -6924 -13236 1142 10334 -1036 -10397 -100 9776 -1192 -13386
2497 -13386 -3067 14449 10270 -6354 -5281 9214 8062 -7123 -7652 9055 12322 -5083 -11972
2510 -11972 3534 13450 36 -11491 329 12978 1852 -14140 -6348 9890 3127 -15336
2522 -15336 -10795 9391 10692 -8156 -11900 5534 10156 -7477 -15459 2949 17051 3127 -12185
2535 -12185 -700 14924 4023 -14505 -6454 14718 11586 -8999 -8545 12493 15142 -7138 -14616
2548 -14616 4866 14456 -4192 -16815 -256 15116 984 -18426 -7695 13710 7458 -14442
2560 -14442 -11233 10991 11272 -12008 -16288 6976 15331 -5279 -16319 3788 18850 2093 -16107
2573 -16107 -2333 18209 8505 -12775 -6572 16071 12837 -11067 -12629 10285 15031 -7651 -17066
2586 -17066 3156 15742 -981 -17102 -2334 15536 3189 -16882 -9014 12600 6980 -15893
2598 -15893 -15412 8090 13736 -5498 -12497 6355 16005 -2347 -15906 32 16427 4515 -13001
2611 -13001 -3634 15858 10527 -9057 -9020 8757 10442 -7654 -11791 6936 15468 -1439 -13446
2624 -13446 -1349 10833 -505 -14602 -6815 8361 3359 -11335 -8129 8599 9332 -6534 -10328
2637 -10328 3267 9113 -3099 -10080 1078 10628 2163 -7497 -1022 10248 6036 -5424 -3907
2650 -3907 6845 7211 -2440 -4182 4774 7143 -2387 -8187 -1490 4896 -96 -6264 -2317 3330 732
2665 732 -5689 -4177 2469 2169 -3953 -5145 48 2341 -1445 -3989 -998 2143 1176 -75 2185 4780
2681 4780 4009 568 -779 269 1502 1676 1145 628 1395 1864 802 -906 -982 173 -29 -2073 -2770
2698 -2770 -117 2041 -738 -4485 -3417 -118 -1269 -4776 -3781 2076 2464 -2566 -3295 2363 5170 -23
2714 -23 -3433 1543 5731 1091 -4583 -861 6732 4453 -3016 -1806 6383 6413 -2428 -4716 2935 5458
2730 5458 -3347 -8304 -253 6534 481 -8198 -3825 4204 436 -8516 -5468 5450 4946 -5355 -6240
2745 -6240 4079 6924 -3389 -8404 303 7703 623 -5801 1908 10743 5147 -5761 -2504 7856
2759 7856 6658 -4392 -4578 5516 6636 -4213 -8119 1719 6960 -1957 -8557 -798 7206 655
2773 655 -9439 -4661 4351 1071 -7781 -4946 6124 5172 -5301 -7235 2366 5735 -1939 -4792 4748
2788 4748 10138 2068 -5102 714 7233 1405 -6691 -1774 7466 4948 -3264 -1825 5804 3548 -6183
2803 -6183 -6831 2904 5050 -3161 -6779 700 3464 -4365 -8742 -1085 4827 -1134 -6690 -721 6931
2818 6931 2301 -5834 -2663 5477 3529 -3954 -1670 6811 6156 -3518 -4485 4589 7393 -955 -4463
2833 -4463 3895 8025 -656 -7105 154 6745 -686 -9907 -3708 6226 2162 -7865 -4797 5238
2847 5238 3491 -7573 -7533 4403 6485 -5664 -9397 2676 8965 -1168 -8160 1524 10424 1512
2861 1512 -8431 -576 11959 6553 -7060 -4370 9229 7954 -7212 -8575 5657 9191 -4409
2874 -4409 -10521 3252 11359 -1863 -13285 -2864 9580 1741 -12326 -5862 8932 4302 -11603
2887 -11603 -9751 7902 9662 -6678 -10335 5670 13032 -1641 -11260 1907 13364 2270 -11147
2900 -11147 -1265 14281 6646 -10708 -7726 9794 10193 -6747 -8471 7884 11758 -6320 -14982
2913 -14982 241 11028 -1387 -14123 -3275 11708 3466 -13138 -7907 8628 6412 -10140
2925 -10140 -9046 9513 12829 -4417 -12171 1737 10562 -1415 -10336 2576 15400 5472 -10020
2938 -10020 -4167 11272 7010 -8448 -6874 8723 9692 -5902 -10317 3350 8392 -5143 -13030
2951 -13030 -1 10916 1544 -10600 -4135 6873 805 -11456 -6472 8450 7606 -6268 -7268
2964 -7268 4795 7799 -3952 -7627 4327 10821 1170 -6102 2356 10116 1860 -8338 -3059 7366
2978 7366 4652 -5020 -2526 6558 4438 -6315 -7451 2420 5484 -3255 -6991 803 4511 -3794 -8900
2993 -8900 -1532 5044 -68 -6254 -1092 6537 2134 -5633 -2564 5458 4389 -2816 -1566 6629 6248
3008 6248 -3156 -4576 2971 5660 -1383 -3640 4698 7651 -765 -6914 -783 4313 -1524 -7883 -2001
3023 -2001 5985 1141 -8000 -4765 3987 2214 -6810 -5435 4937 5206 -4499 -6328 2956 6415 -2781
3038 -2781 -7111 3076 9967 1764 -6311 327 9067 2838 -7548 -2131 9477 6347 -5800 -5785
3052 -5785 5853 6552 -6539 -9804 2808 8259 -3410 -10124 400 9561 -606 -11766 -4723
3065 -4723 7614 2275 -10306 -6464 8681 7942 -6411 -8275 6581 10960 -3444 -10024 3026
3078 3026 12333 1372 -9273 729 12907 4749 -10248 -5547 9181 7361 -8302 -8156 7493
3091 7493 9897 -5983 -11950 1907 9600 -3285 -13826 -2512 9778 1636 -11910 -5110 9944
3104 9944 6169 -9273 -8313 7761 9904 -5942 -10285 4476 12274 -511 -9464 1829 13100
3117 13100 3045 -10373 -2714 11184 6218 -8067 -6421 8280 8314 -6454 -9996 3397 8806
3130 8806 -4451 -12246 -743 9358 -33 -11171 -3954 8028 3213 -9458 -6358 7329 6935
3143 6935 -6286 -8511 4462 9179 -1723 -6570 3854 11171 1848 -7499 -1445 8602 3900 -6712
3157 -6712 -3673 7326 6211 -4414 -5739 3501 5185 -4766 -8786 82 6227 -399 -6712 -1757
3171 -1757 4347 -612 -7657 -4128 4098 3099 -4663 -3914 3581 5271 -1064 -2855 2820 5177 -288
3186 -288 -3812 980 5482 1760 -2935 -251 4601 3096 -1628 -910 2709 1289 -3104 -4019 275 2025
3202 2025 -1065 -2788 -352 197 -2438 -3900 -1454 358 -995 -2392 -407 1636 1129 -668 -173 935
3218 935 313 -751 419 2635 2255 740 1269 2422 1463 350 1192 2186 736 -1445 -1284 298 246
3235 246 -1474 -907 953 154 -2592 -2898 -14 311 -2542 -3392 -348 1406 -791 -1532 657 2335 -574
3252 -574 -3284 -851 2703 2079 -102 1481 4402 2913 -721 -1055 2064 2494 -1288 -1774 1900 3451
3268 3451 326 -2022 199 1787 -1747 -4570 -1777 1642 420 -3144 -2220 514 -475 -3721 -2667
3283 -2667 1252 2134 -1164 -2127 1026 2569 37 -1650 1405 3416 1253 -397 1859 3653 1377
3298 1377 -1642 -655 2227 1311 -475 1192 3262 1465 -3012 -2909 -505 -419 -3052 -2328 1306 1278 -2450
3315 -2450 -3226 -45 539 -2983 -4269 90 2523 -118 -1969 1185 3666 328 -3376 225 5094
3330 5094 2812 -2130 -305 4689 3112 -2328 -1356 4722 4378 -3096 -4765 1699 3858 -2986 -5936
3345 -5936 548 5190 -839 -6930 -1726 4613 -193 -8718 -4936 4958 3953 -5133 -4275 5453 6193
3360 6193 -4319 -7330 3297 8810 -131 -6945 2339 10580 2317 -7706 -1460 9629 5009 -8035
3374 -8035 -5063 8228 7707 -6399 -8969 4632 8471 -5054 -11714 841 9886 -1320 -12547
3387 -12547 -3414 9926 2835 -11364 -6091 9693 7954 -8820 -9261 7483 11692 -4740 -11513
3400 -11513 4236 13897 424 -11303 979 14864 4740 -12119 -5403 12319 7850 -10411
3412 -10411 -9674 9437 11825 -7378 -13721 4165 12367 -4648 -15983 -1163 13452 1784 -14192
3425 -14192 -5375 12725 5708 -13532 -10325 10512 11503 -7980 -11587 7792 15117 -2851 -13958
3438 -13958 2445 15966 1881 -13409 -1985 15650 7085 -12535 -8183 11980 10147 -9921
3450 -9921 -12403 7047 12315 -6534 -15555 1411 13565 -1227 -15274 -3748 12708 3493 -14450
3463 -14450 -7801 11239 8446 -10341 -10441 8877 12852 -4927 -12054 4388 14199 -635 -12284
3476 -12284 790 15063 4494 -11991 -4614 11957 7292 -9814 -8364 8703 9113 -7556 -12003
3489 -12003 3937 11064 -4352 -12949 -211 10097 -175 -12447 -3781 9822 3385 -10665 -6363
3502 -6363 9184 7762 -6378 -7897 6033 9699 -3522 -8573 4485 11840 429 -8847 245
3515 245 10474 2894 -8405 -3069 8697 4366 -7698 -5748 6306 6243 -6340 -8504 2026 5983
3529 5983 -3819 -8363 815 6894 -1663 -9071 -1982 6873 2041 -6698 -2969 6618 4408 -4402 -3466
3544 -3466 5981 5999 -3305 -4700 4332 7668 -343 -4741 2361 6751 -485 -6565 -363 6399 1418
3559 1418 -5895 -3032 4496 1243 -5981 -4826 3421 2843 -5089 -5672 2043 4432 -2683 -5901 932
3574 932 5201 -775 -5226 1165 6827 1736 -4559 -751 5950 3943 -2953 -1705 5404 4574 -3293
3589 -3293 -4011 2982 5159 -1681 -5093 941 4637 -960 -5612 -1019 3985 -67 -6233 -3569 3423
3604 3423 2283 -4445 -4036 2413 2717 -3640 -3824 2543 5391 1 -4018 932 5355 1593 -2664 557
3620 557 5299 2843 -3015 -1771 3808 3740 -1872 -2694 1798 3370 -1298 -3718 -21 2542 -1415 -5482
3636 -5482 -2847 1907 1028 -2757 -2321 1119 1029 -3126 -3193 1068 2743 -298 -2246 605 3638 2261
3652 2261 -702 87 2116 1688 -372 -264 2747 3432 950 -1196 -245 1265 645 -1465 -1180 226 304
3669 304 -1961 -2761 -743 872 -281 -2508 -2196 95 375 -1584 -2170 -41 1219 -417 -2136 453
3685 453 3514 2441 -1618 -740 2249 2493 -536 -875 2895 4736 461 -2804 685 4236 993 -3845
3701 -3845 -2115 2981 2197 -3380 -3498 2128 2777 -3600 -6317 -351 3804 -1528 -5805 -1281 4487 1072
3717 1072 -5096 -1993 5433 3761 -4333 -4030 4068 6033 -1453 -4676 3180 7362 765 -5341 227
3732 227 6903 1996 -6253 -2632 6076 4037 -5014 -5266 3529 4973 -4594 -8058 738 5624 -1963
3747 -1963 -7866 -636 6889 896 -7786 -3218 6128 3822 -5639 -5049 5039 6729 -3344 -5760 4062
3762 4062 9321 342 -6392 1224 8259 1638 -7130 -2483 6966 4157 -5724 -4598 5184 5506 -5483
3777 -5483 -8151 1367 5393 -2720 -7927 -10 6799 91 -7939 -2951 5929 2537 -6427 -4608 5680
3792 5680 5856 -3143 -4221 4310 7232 -1553 -5790 1890 7181 1163 -5615 -175 7122 2791 -4935
3807 -4935 -2795 4796 3075 -5376 -5501 2518 4163 -2807 -5675 610 4230 -2039 -6693 -1151 4135
3822 4135 93 -5438 -1792 4616 2737 -3276 -2253 3606 3806 -2227 -3015 3015 4840 -496 -2827
3837 -2827 2268 5676 1123 -2778 275 3186 106 -3903 -1666 3351 1698 -3184 -2480 1458 902
3852 902 -4144 -3748 689 1489 -2289 -3260 826 2173 -1462 -3761 -65 3020 665 -1926 842 3839
3868 3839 922 -2571 -415 3907 3007 -621 292 3837 1910 -2782 -3124 1250 1901 -1800 -1905 2343
3884 2343 3582 -1770 -4778 -1784 724 -2440 -4773 -207 4119 1178 -3856 -2277 2024 776 -4207
3899 -4207 -2380 4065 4850 -937 -1829 2884 4083 -1071 -3860 1767 5889 1766 -3239 82 4552
3914 4552 1329 -4560 -2436 4121 3215 -3168 -4180 1329 2338 -4176 -6178 323 4612 -457 -4737
3929 -4737 -729 3688 -193 -6169 -3025 4475 3553 -2332 -2179 4513 4750 -2519 -4690 1984 5808 912
3945 912 -3255 1809 5964 1203 -5034 -2270 4511 2850 -3779 -3249 2992 2895 -3826 -5869 639 3766
3961 3766 -1305 -4902 68 3907 -434 -5962 -2961 3377 2194 -2895 -1547 4263 4301 -2118 -3869
3976 -3869 2004 4420 95 -2615 2370 5615 1838 -3118 -1039 3564 1813 -3134 -1937 2937 2424
3991 2424 -2541 -3652 608 2168 -1936 -4115 -521 2064 -973 -4346 -1756 1831 802 -2273 -1210
4006 -1210 2625 2281 -1704 -2118 1339 2939 914 -992 1851 3649 1331 -1475 446 2178 1222 -1229
4022 -1229 -305 2104 1420 -1275 -1544 -275 73 -1420 -2224 -238 317 -1276 -2513 -1234 -125 -603 -1146
4039 -1146 -300 711 385 -833 -668 177 397 -85 791 2144 2016 771 805 827 381 -483 191 1662 1509
4058 1509 330 -49 833 -382 -1538 -1591 -99 274 -1036 -1241 -444 -299 -2278 -2730 -813 883 -170
4075 -170 -1879 -778 1108 180 -1241 -495 2033 2100 64 -53 1961 2194 9 -1499 1352 3127 1141
4092 1141 -478 588 2428 491 -2782 -1901 1390 1424 -1561 -1926 635 808 -2647 -3873 -1061 1849
4108 1849 -351 -2806 -713 2094 545 -2734 -2100 2027 2347 -944 -950 2742 3675 -131 -2367 660
4124 660 3324 1522 -901 1062 3739 1638 -2668 -2357 1812 1949 -1542 -2633 603 2212 -1460 -3782
4140 -3782 -1618 1525 -632 -3708 -1978 2264 2000 -2556 -2858 946 2179 -1060 -2019 1678 4018 864
4156 864 -2319 -159 3455 2142 -1722 -881 3594 3374 -864 -2353 1015 2565 -701 -3232 -396 2881
4172 2881 555 -3656 -2329 1612 649 -3299 -3470 1024 2084 -1526 -3579 -193 2547 85 -3053
4187 -3053 -544 3541 2228 -1760 -1475 2771 3268 -770 -2364 2078 4420 726 -2067 235 3714
4202 3714 937 -3104 -1832 2406 2273 -2396 -3628 953 2204 -2418 -4783 -681 3152 -67 -4247
4217 -4247 -1860 2724 1482 -3421 -2662 2549 3353 -1439 -2924 1766 4298 463 -3199 272 4818
4232 4818 2445 -2404 -700 4149 3179 -3055 -3421 1921 4054 -1202 -3928 324 3528 -730 -5422
4247 -5422 -2144 2829 998 -4815 -3446 2980 2859 -2948 -4325 1493 3595 -1926 -3996 1148 5779
4262 5779 1906 -3600 -757 4687 2936 -2852 -1662 4383 4230 -2053 -3380 2532 5115 -1001 -4646
4277 -4646 -19 4391 189 -5362 -2548 2813 654 -4642 -3298 3064 2861 -3352 -5059 658 3199
4292 3199 -1682 -4211 820 5300 1086 -3758 -792 4678 2491 -3338 -1790 4470 4322 -1263 -2899
4307 -2899 2669 4260 -1342 -4185 733 4533 61 -4182 -1068 3455 144 -4857 -3003 2395 2085
4322 2085 -3409 -3226 1404 2070 -3299 -4307 1135 3835 132 -3081 943 4195 879 -3547 -630
4337 -630 4286 2615 -1982 -650 4069 3167 -1635 -2524 1639 2902 -1573 -3059 970 3018 -1210 -3810
4353 -3810 -874 2888 -344 -4096 -2011 1627 58 -3878 -2175 2642 2136 -2207 -2834 1815 2968
4368 2968 -1641 -2693 1766 4458 384 -1692 1760 4657 813 -3424 -944 3636 2112 -1825 -605
4383 -605 3394 2031 -3361 -3596 1784 3035 -2494 -4255 204 2341 -1658 -5124 -655 3254 -207
4398 -207 -4374 -1233 3701 1904 -3508 -2612 2477 3357 -1848 -1515 4162 5274 -963 -4110 748 4507
4414 4507 473 -3298 437 4974 1721 -4095 -2549 3214 1847 -4201 -3854 2428 3624 -2860 -5011
4429 -5011 196 3100 -2109 -5258 -194 4284 549 -4762 -2356 3395 1870 -3140 -1878 4612 5167
4444 5167 -1278 -3317 1533 3883 -805 -3740 1509 6196 2169 -3056 -1306 3394 807 -4553 -3543
4459 -3543 2576 3293 -2192 -3696 1055 2603 -2721 -5677 -1183 3003 509 -3395 -1200 3294 1505
4474 1505 -3577 -2538 2743 3431 -906 -2490 2047 3725 133 -2500 847 4306 1844 -1842 -223
4489 -223 2846 1844 -2301 -2888 1098 2439 -713 -2311 358 1650 -1079 -4023 -2349 939 677 -1662
4505 -1662 -1495 809 1378 -943 -1957 16 2229 413 -1638 -108 2734 1965 -257 -657 1902 2518
4521 2518 284 -1098 821 2559 591 -1735 -976 2162 1650 -1408 -2512 519 1064 -1685 -3308 -722
4537 -722 2198 60 -3214 -1909 1995 1480 -2603 -2939 1314 2471 -1066 -2433 1568 4225 570 -2652
4553 -2652 -74 4076 2299 -2169 -1142 3147 3213 -2014 -2927 1997 4002 -983 -4189 -80 3710 -554
4569 -554 -5146 -1888 3136 1320 -4442 -3128 2811 2494 -3861 -4470 1322 4186 -1362 -4153 1214 5574
4585 5574 957 -4400 -820 4906 2764 -3539 -1966 4832 4143 -2480 -3388 3165 5068 -1651 -4933
4600 -4933 828 4703 -644 -5882 -1517 4328 856 -5324 -2795 3794 2366 -5017 -5094 2265 3896
4615 3896 -2673 -4863 1734 5349 -471 -4620 113 5416 1265 -4056 -893 5645 3454 -3027 -2211
4630 -2211 3935 4021 -2752 -3793 2577 4644 -1470 -4622 568 4107 -978 -5270 -1047 3847 344
4645 344 -4906 -2523 3048 1726 -3815 -3336 3116 3168 -2546 -3526 2335 3989 -1549 -3641 1454 5219
4661 5219 1012 -2808 807 4658 1015 -3544 -846 3721 2518 -2913 -2240 2937 2380 -3017 -3581 1553
4677 1553 2549 -2723 -4749 557 3356 -1295 -4722 -778 3155 -42 -4254 -1211 3531 1398 -3729
4692 -3729 -1898 3728 3149 -2540 -1977 4099 4217 -1836 -3122 2285 4596 -670 -3731 1212 4735 184
4708 184 -4640 -1104 3616 721 -5035 -2848 3231 2112 -4017 -4082 2362 2823 -3685 -4934 1409 4406
4724 4406 -989 -4479 644 4755 335 -4479 -434 5808 2860 -3609 -1484 4403 3572 -2839 -3081
4739 -3081 3796 4653 -1689 -4081 1645 4803 -1278 -5841 -541 4284 216 -5483 -1950 3726 1493
4754 1493 -5496 -4089 2848 2837 -3656 -4397 2496 4200 -1927 -4502 1359 5313 345 -4364 137 5474
4770 5474 2503 -3600 -799 4651 2705 -2936 -2363 3617 3543 -2636 -3827 1429 3779 -1320 -4016 -82
4786 -82 2846 -1189 -4910 -1027 3145 576 -3919 -2179 2334 1335 -2796 -2147 2385 2406 -1580 -2063 2336
4803 2336 3562 -605 -1886 1349 3177 239 -1975 916 3147 809 -1901 -399 2105 442 -2623
4818 -2623 -1269 1696 599 -2310 -1678 1254 226 -2834 -2602 847 897 -1948 -2083 905 1865 -1134
4834 -1134 -1993 1063 2579 -137 -2285 1499 3725 573 -1792 483 3528 1143 -2112 -328 3522
4849 3522 1583 -2748 -1737 2702 2168 -2971 -3199 1632 2056 -2632 -4136 979 2921 -1847 -4929 -123
4865 -123 3670 -126 -4467 -1058 4213 1496 -4171 -1898 4393 3463 -3034 -2832 3848 5149 -1785 -3932
4881 -3932 2206 5348 -535 -4924 653 5496 849 -5270 -1994 4812 2161 -5306 -3932 3872 3119
4896 3119 -5021 -5849 2104 4854 -2607 -6367 861 5592 -842 -6356 -945 5953 1731 -5422 -1990
4911 -1990 6225 4592 -4116 -3438 4259 5452 -2720 -5186 3171 6738 -640 -5586 416 6118 477
4926 477 -6701 -2208 4945 2164 -5800 -3975 4274 3584 -4893 -5938 2383 4384 -2481 -5728 1311
4941 1311 5885 -268 -5699 8 6033 2017 -4712 -1611 5428 3606 -3619 -2888 4366 4923 -2716
4956 -2716 -4012 2474 5069 -1114 -5015 447 4413 -750 -5144 -1086 3859 626 -4828 -2800 3007
4971 3007 1443 -4106 -3688 2469 3143 -2179 -3327 2309 4014 -1216 -3466 1089 4088 244 -2800
4986 -2800 412 4432 1584 -2985 -543 3449 1628 -2879 -1549 2823 2447 -2267 -2695 1322 1900 -2415
5002 -2415 -3595 876 2551 -1770 -3956 -50 2411 -887 -3717 -146 3307 698 -2920 -744 2847
5017 2847 1361 -2788 -928 3476 3193 -1089 -1217 3397 3164 -2071 -3052 1990 3767 -892 -2782 1350
5033 1350 3675 -1013 -4613 -1142 2721 -58 -4317 -1708 3607 1347 -3917 -3046 2112 1941 -3200
5048 -3200 -3068 2921 3964 -1663 -3767 1371 4426 91 -3271 1180 5324 1448 -3881 -930 4484
5063 4484 2362 -3611 -2218 4204 3391 -2968 -3946 1264 3195 -2955 -5082 584 4087 -478 -5012
5078 -5012 -936 3336 -29 -5637 -2280 3865 2319 -3391 -2443 3694 3622 -2545 -3679 2626 4514 -329
5094 -329 -3511 1428 4581 503 -3783 -236 4648 1574 -3722 -1573 3302 1560 -4090 -3268 2175
5109 2175 2446 -2759 -3882 1311 3088 -2569 -4594 5 3436 -651 -3497 -138 3758 761 -3606
5124 -3606 -1466 3390 1901 -2770 -1086 3840 3151 -1272 -1869 2577 3423 -1268 -2874 1375 3372 -374
5140 -374 -3288 291 3121 -297 -3863 -957 2596 400 -3650 -2438 2235 1142 -3282 -2499 2518
5155 2518 2425 -2066 -2824 1781 3046 -1619 -2488 1769 4106 401 -2710 1064 4306 422 -3283 -435
5171 -435 4099 1611 -3117 -1443 3468 2151 -3335 -3198 2351 2510 -3109 -4661 1300 3415 -1865 -4719
5187 -4719 -192 3570 -689 -4918 -1001 4024 1521 -3858 -2086 4224 3125 -2902 -2661 3883 4503
5202 4503 -1900 -3758 2136 5181 -691 -4317 1063 5324 841 -4865 -1369 4384 1761 -4982 -3520
5217 -3520 3521 2996 -4016 -4668 2265 3835 -2823 -5662 723 4685 -597 -5126 -255 5389 1721
5232 1721 -4187 -1812 5025 3636 -3330 -3024 4130 4735 -2120 -3748 2634 5510 -581 -4713 415
5247 415 4740 193 -4993 -1609 4374 1940 -4623 -3362 2857 2486 -3652 -4329 1675 3493 -1828 -4476
5263 -4476 820 4137 -255 -4132 -552 4249 1565 -3462 -1191 4156 2760 -2399 -2243 3162 3620
5278 3620 -1165 -2780 1569 3444 -719 -3711 -100 3344 222 -3405 -1462 2424 462 -3608 -2608
5293 -2608 1234 1354 -2287 -2376 1060 1880 -1512 -2301 667 2043 -97 -1656 467 2646 991 -1150
5309 -1150 -39 2427 1358 -785 240 2020 1254 -844 -1015 979 993 -665 -760 566 441 -1070 -1788
5326 -1788 -124 142 -1233 -1354 -223 697 -608 -1434 -245 662 -529 -1141 615 1750 417 -635
5342 -635 527 1483 424 -561 126 2072 1225 -406 -93 1523 974 -1375 -1248 1169 1415 -1122 -1699
5359 -1699 641 1241 -1419 -2719 -460 837 -191 -2896 -706 1630 -305 -2814 -1137 2027 1728
5374 1728 -1437 -1267 2036 2306 -938 -2086 1518 3261 397 -1701 1005 2960 427 -2686 -870
5389 -870 2485 1254 -1986 -1377 1912 1502 -2975 -2953 1024 1956 -1203 -2758 17 1912 -1041 -3512
5405 -3512 -1101 2259 1028 -2036 -685 2503 1487 -2080 -1841 1829 2590 -481 -1314 2000 3382 91
5421 91 -2220 18 2641 913 -1629 -167 2286 1340 -2263 -1948 725 1179 -1645 -1826 720 1500 -1285
5438 -1285 -2791 -688 1081 -326 -2317 -687 1920 671 -1799 -862 1270 1177 -869 -512 2088 2279
5454 2279 -217 -1412 713 1843 207 -1136 791 2353 274 -1709 -996 481 -43 -1522 -791 746
5470 746 560 -1581 -1633 -117 138 -1259 -1640 278 1067 -72 -1031 253 770 9 -1025 202 1642
5487 1642 1196 -117 470 1375 836 -222 32 1321 1108 -575 -536 539 981 -801 -1005 76 385 -1005
5505 -1005 -1155 -280 568 -617 -1874 -938 625 -1 -1000 -419 893 375 -1413 -882 1003 1475 57
5522 57 -140 1043 1479 197 -759 796 2108 470 -887 -39 1577 627 -1462 -921 975 945 -929
5539 -929 -1593 565 851 -1562 -2470 -412 1227 -263 -1802 -594 1279 197 -2205 -1582 1177 1558
5555 1558 -556 -514 1404 2146 -213 -1430 466 2086 433 -738 652 2555 1356 -1296 -825 1154
5571 1154 1269 -1235 -1250 785 1378 -894 -2485 -729 879 -438 -2267 -778 1371 418 -2283 -1510
5587 -1510 716 1553 -854 -1207 1011 2236 240 -1755 219 2148 718 -1030 -54 2436 1999 -867
5603 -867 -844 740 1504 -1078 -2002 379 2087 -105 -2248 -937 1097 -289 -2556 -1906 1012 1018 -1817
5620 -1817 -1739 637 1520 -814 -1973 510 2113 553 -1342 -185 2080 1426 -989 -704 2084 2397
5636 2397 -314 -1251 982 1858 -292 -1661 79 1858 193 -1648 -1004 1236 634 -1915 -1888 71
5652 71 601 -1546 -2041 153 1579 -572 -2355 -619 1491 679 -1299 -395 2005 1665 -618 -928 1345
5669 1345 1919 53 -1128 649 1950 708 -942 -132 1371 472 -1452 -1166 813 647 -1506 -1795
5685 -1795 -293 330 -820 -1317 -123 797 -158 -1324 -1141 81 355 -734 -503 862 1366 361 -375
5702 -375 304 1286 410 -714 4 1231 1387 185 -345 578 1026 137 -684 -140 530 128 -1098 -891 -194
5721 -194 263 -634 -1332 60 616 -596 -1662 -791 163 21 -1034 -1030 862 1230 -217 -933 611 1542
5739 1542 99 -795 546 1840 1035 -388 -330 1439 1058 -747 -1053 222 1656 -649 -1590 -16 908
5756 908 -370 -2002 -1147 1081 412 -1856 -1540 760 839 -1491 -1461 429 1907 -60 -1775 193 1750
5773 1750 621 -1263 -409 2510 1809 -740 -545 1833 1746 -1009 -1524 1351 2477 -54 -1945 95
5789 95 1483 24 -2350 -1047 1271 676 -2588 -1869 948 1094 -1691 -2277 792 1723 -699 -1818 179
5806 179 1610 9 -1649 287 2831 1555 -1061 -609 2218 1502 -1402 -1373 1707 2420 -631 -1552 825
5823 825 2040 -911 -2569 -572 1691 -356 -2251 -1107 1305 -153 -2473 -1654 1206 841 -1528 -1866
5839 -1866 1039 1574 -1025 -1604 1118 2452 153 -1468 838 2536 602 -1748 -163 2509 1266
5854 1266 -1485 -213 2190 1504 -1535 -2013 1010 1157 -1558 -2186 843 1743 -802 -2799 -312 1485
5870 1485 -618 -2609 -754 2066 372 -2246 -1033 2229 1344 -1559 -1175 2218 2574 -875 -1715 1333
5886 1333 2617 -331 -1705 1052 3137 102 -2752 -375 2614 560 -3069 -1229 2537 1437 -2520
5901 -2520 -2416 1125 1629 -2399 -3137 481 2326 -774 -3202 -47 2671 -83 -3042 -238 3284 1665
5917 1665 -2233 -1383 3096 2712 -1441 -1722 2453 3686 -1099 -2743 1078 3386 -219 -3520 -603 3172
5933 3172 904 -3165 -1885 2136 1227 -3215 -3021 1906 2328 -1925 -3024 690 2840 -1020 -3518 -136
5949 -136 3633 719 -3033 -737 3423 2139 -2306 -1340 3001 3070 -1355 -2495 1899 3309 -568 -2856
5965 -2856 227 3237 115 -2687 -654 2411 703 -3092 -1843 1972 1285 -2610 -2265 1145 1971 -1210
5981 -1210 -2818 368 2629 -88 -2447 49 2727 908 -1823 -999 2427 2162 -1350 -976 1545 2294
5997 2294 -562 -1544 510 1914 -314 -2072 -166 1764 446 -1948 -1287 950 70 -1658 -1601 495
6013 495 973 -1102 -1538 89 974 -259 -1281 -281 1152 261 -822 -10 1165 587 -200 135 685
6030 685 703 359 180 864 1064 433 -6 9 -84 -140 65 -339 -418 -407 -115 -408 -489 -910 -417 118 -804 -723 40
6053 40 274 -497 -849 54 610 398 -529 53 1221 875 -339 71 1459 848 -279 -653 957 1770 -8
6072 -8 -1068 339 1265 -199 -1462 -355 1266 190 -1677 -1028 651 325 -1381 -1736 715 1066 -1049
6089 -1049 -1959 314 1828 -386 -1633 158 1837 726 -1542 -248 2277 1252 -909 -535 2005
6104 2005 2002 -637 -1157 1170 2096 -497 -1904 209 1876 -306 -2258 -511 1536 301 -2469 -1550
6120 -1550 1186 470 -2129 -1685 967 1553 -723 -1552 627 1703 -132 -1840 80 2335 775 -1326
6136 -1326 212 2483 1421 -1411 -569 1716 1363 -880 -1053 913 1536 -676 -1812 427 1365 -665
6152 -665 -2196 -249 1096 -376 -1911 -1117 948 248 -1741 -1055 1259 793 -1298 -1013 1158 1267 -684
6169 -684 -693 1010 1751 200 -969 403 1497 390 -1179 395 1667 870 -1107 -561 1276 192 -1562
6186 -1562 -1198 922 697 -1582 -1472 648 732 -1340 -1922 187 1295 -586 -1761 -217 1960 277
6202 277 -1321 165 1795 443 -1107 -362 1969 1257 -1245 -750 1858 1854 -600 -1202 1108 1588 -546
6219 -546 -2006 -27 1448 -352 -2165 -752 1898 625 -2178 -1625 1283 779 -2154 -1659 1230 1710
6235 1710 -1178 -1786 820 2281 -273 -2065 359 2321 799 -1437 -474 2241 1668 -1371 -913 1828
6251 1828 1888 -1488 -1658 1104 1862 -1066 -2300 110 1650 -209 -2364 -512 1398 -356 -2599 -1247
6267 -1247 1304 994 -1722 -1405 1277 1688 -1046 -1580 497 2002 448 -942 785 2234 527 -1604
6283 -1604 -452 1886 992 -926 -792 1392 1236 -817 -1173 100 1146 -694 -1618 -164 945 -505
6299 -505 -1600 -714 737 285 -1120 -1039 767 449 -961 -1007 133 839 -463 -505 587 1284 641 -210
6317 -210 460 716 771 38 -15 1211 889 -26 -252 298 126 -621 -577 -163 -335 -74 -404 -354 -545 -759 -569
6338 -569 -398 -374 -414 -240 89 -218 -412 224 541 623 -86 314 669 838 -209 -123 779 1024 -45 124 941
6359 941 809 -193 -684 218 720 -512 -831 -123 650 -381 -1432 -1026 41 -376 -1343 -957 494 597
6377 597 -745 -1300 355 1216 -310 -1060 700 1519 86 -1056 27 1436 592 -602 105 1909 1352
6394 1352 -862 -701 945 902 -336 -1471 362 1381 -434 -1705 -350 1048 -461 -1860 -782 1001
6410 1001 235 -1167 -1099 696 898 -1128 -1354 571 1383 -158 -868 653 1337 545 -676 109 1716
6427 1716 1139 -456 -470 1045 783 -731 -862 611 1166 -388 -1097 22 284 -633 -1420 -677 195 -77
6445 -77 -1080 -372 23 20 -710 -509 528 672 -81 -326 454 731 94 -58 408 926 503 233 365 590
6465 590 344 -33 355 466 40 79 297 -91 -473 -422 -312 -487 -627 -384 44 -116 -788 -853 -178 -1 -574
6486 -574 -604 29 765 -36 -718 223 1092 239 -1020 -46 1461 984 -281 -13 1257 1159 -292 -563 738
6505 738 1268 -531 -1169 263 879 -205 -1645 -275 1212 219 -1667 -1376 446 417 -1802 -1493 570
6522 570 1543 -662 -1484 759 1871 -209 -1437 9 2066 576 -1128 -45 2158 1040 -1599 -748
6538 -748 1379 1955 -1114 -1749 782 1437 -939 -2155 301 1673 -34 -2570 -983 1411 344 -2404
6554 -2404 -1284 1425 1248 -1735 -2030 1471 1693 -641 -1797 934 2261 134 -1529 619 2311 713
6570 713 -1959 -288 2560 1136 -1507 -886 1641 1486 -1240 -1487 983 1707 -1276 -2091 -24 1498
6586 1498 -443 -2450 -350 1273 -285 -2008 -734 1599 1082 -1575 -1187 1011 1563 -1014 -1381 1385
6602 1385 2074 -123 -1242 1019 2009 68 -1667 174 2086 734 -1266 -483 1320 385 -1717 -1265
6618 -1265 745 555 -1437 -1552 943 1237 -1537 -2003 496 1062 -986 -2036 -131 1673 254 -1520
6634 -1520 -394 1863 857 -1258 -351 1879 1475 -930 -896 1756 1681 -1062 -913 1141 1870 -608 -1845
6651 -1845 466 1476 -156 -2510 -484 1437 77 -2224 -997 1317 515 -2128 -1773 1298 1253 -1401
6667 -1401 -1842 976 1850 -603 -1400 607 2424 367 -1657 73 2280 815 -1572 -658 2109 1445
6683 1445 -1319 -1454 1238 1885 -1248 -2098 608 1696 -952 -2484 -42 1671 -298 -2785 -884 1778
6699 1778 529 -1882 -1431 1676 1121 -1295 -1533 1154 2394 -612 -1881 707 2116 81 -1436 203
6715 203 2232 794 -1550 -278 1822 1101 -1827 -1269 1082 1306 -1041 -1997 423 1272 -503 -2285
6731 -2285 -524 958 -334 -1803 -546 1001 548 -1412 -779 1040 1157 -711 -878 675 1316 123
6747 123 -633 765 1435 427 -308 484 1242 693 -696 -369 675 287 -219 -475 369 72 -720 -619 -307
6766 -307 -430 -634 -418 -389 177 -351 -381 -265 -334 -318 50 335 94 89 264 406 -2 -38 499 814 724 -114 60
6789 60 882 236 -803 -358 918 816 -400 -725 210 768 -1012 -1932 -118 1016 -230 -1558 -440
6806 -440 877 -59 -1529 -1025 1103 764 -1172 -650 1320 1349 -771 -1416 776 2173 117 -1269 368
6823 368 2178 389 -1834 -693 1931 1471 -1231 -1216 1482 1249 -1792 -2580 611 1930 -832 -2245
6839 -2245 -179 1906 -263 -2579 -945 1994 439 -2354 -1084 2391 1506 -1777 -2152 1556 2160 -786
6855 -786 -1898 1330 3210 -209 -2080 366 3097 1035 -2160 -655 2733 1289 -2169 -1793 1819
6870 1819 1789 -1868 -2459 1075 2261 -1025 -3259 -156 2206 -500 -2971 -356 2386 825 -2721 -1643
6886 -1643 2173 1839 -1871 -1605 1948 2396 -953 -1965 1463 2761 -537 -2310 544 2821 542 -2333
6902 -2333 -514 2104 811 -2529 -1419 1606 1432 -1850 -2109 934 1723 -1770 -2502 89 2422 -530
6918 -530 -2301 91 2174 342 -2534 -298 2613 1056 -1528 -706 2255 1843 -1512 -1158 1713 1890
6934 1890 -1040 -1953 794 1859 -628 -2586 -75 2001 151 -2338 -568 1694 190 -2576 -1581
6949 -1581 1440 1253 -2027 -1394 1269 1596 -1476 -2179 762 2305 -225 -1797 718 2794 397 -1751
6965 -1751 -66 2281 983 -1624 -673 2117 1710 -1966 -1834 1000 1939 -1145 -1920 806 1798 -1260
6981 -1260 -2462 -8 1879 -279 -2322 -547 1887 829 -2096 -1266 1665 1443 -1427 -1655 1462 2316
6997 2316 -750 -1784 700 2248 216 -1662 248 2829 976 -1763 -820 1847 1057 -1689 -1367 1382
7013 1382 1397 -1563 -1957 971 1377 -829 -2566 -513 1610 -256 -2162 -539 1662 772 -2055 -598
7029 -598 1725 1190 -1130 -1415 1323 1851 -190 -1269 733 2059 -12 -1415 130 1978 638 -1220
7045 -1220 -560 1487 789 -1488 -909 660 771 -1304 -1643 241 833 -596 -1701 -8 374 -167 -1348
7062 -1348 -186 1251 347 -1122 -618 625 704 -352 -531 787 1519 300 -322 206 871 200 -276 3
7080 3 819 278 -331 -350 106 150 -732 -554 -292 72 -357 -606 -367 -142 -358 -219 -526 -131 223 290 81 37
7102 37 5 358 507 107 238 510 795 159 82 674 923 438 -478 250 574 34 -486 -153 474 -16 -691
7123 -691 -395 349 218 -776 -855 -34 692 -504 -1191 -267 856 108 -979 -201 1459 882 -739 -678 1082
7142 1082 1340 -592 -359 937 1492 6 -737 198 1195 125 -1183 -345 1287 323 -989 -1060 695
7159 695 722 -1272 -1681 417 907 -700 -1457 15 1008 -402 -1511 -177 1538 301 -1186 -445 1486
7176 1486 1017 -720 -814 1201 1430 -274 -570 889 1345 61 -879 -150 1659 70 -1106 -192 1192
7193 1192 452 -1178 -1306 530 278 -1166 -1036 408 870 -703 -1543 -63 1041 -102 -1132 92
7209 92 967 377 -1123 -330 1222 558 -216 -322 966 1013 -102 -633 653 927 -123 -634 630 961
7227 961 -367 -969 -308 516 -85 -941 -756 574 79 -988 -923 227 497 -747 -385 145 404 -173 -395
7246 -395 244 868 46 -243 315 878 213 -221 143 976 414 -316 179 687 -53 -651 -301 213 -133 -612
7266 -612 -463 157 282 -678 -958 -224 -84 -536 -709 11 507 -127 -708 -147 298 132 -567 -91 954 514
7286 514 -248 -228 839 753 -233 -261 986 1016 -25 -598 462 800 -9 -1058 -258 389 -58 -933 -515 646
7306 646 -1 -1244 -833 274 507 -600 -970 278 615 -288 -838 282 1121 489 -628 236 1029 520
7324 520 -556 -137 986 801 -74 -508 579 1017 -433 -862 328 596 -26 -786 -46 501 -202 -1206
7342 -1206 -997 431 146 -612 -702 267 492 -611 -642 427 731 324 -517 202 604 315 -237 -27 944
7361 944 822 -6 -146 806 532 -87 -169 74 341 -51 -590 -149 235 -283 -681 -355 -316 -106 -247 -509 -66
7382 -66 83 -393 -213 -61 166 312 246 53 371 335 306 186 408 359 699 234 50 477 146 431 54 27
7404 27 366 -74 -164 48 190 111 -429 -534 -392 -301 -226 -281 -204 70 -553 -770 -308 67 112 -213 -201 334 221
7427 221 366 -101 438 767 362 -163 311 575 482 -29 -326 661 561 -130 -104 426 123 -341 -639 -249 164
7448 164 -371 -594 -405 218 -329 -583 -675 133 -169 -132 -467 146 478 194 -169 166 553 523 248 -209 532
7469 532 377 145 58 597 615 -122 -166 -55 312 -81 -358 -333 43 -129 -370 -264 -258 -509 -311 -509 -206 -166
7491 -166 -130 -198 -210 45 -181 -110 108 111 458 273 -49 51 311 416 424 148 199 548 99 -244 -33 252 425
7514 425 -397 -517 89 467 -286 -400 -384 36 -549 -765 -329 79 -100 -577 -455 471 411 -428 -319 317 421
7535 421 -107 -138 468 1196 411 -522 244 1060 637 -656 -491 988 749 -684 -1093 279 674 -406 -1203
7554 -1203 -421 778 -357 -1342 -550 513 190 -1400 -1174 648 598 -681 -960 504 844 -496 -863
7571 -863 562 1569 2 -880 348 1522 768 -702 -251 1127 1048 -790 -701 860 1478 -472 -1179
7588 -1179 18 1269 -586 -1636 -471 1080 266 -1491 -764 1131 570 -1288 -1273 859 935 -578 -1325
7605 -1325 643 1424 102 -1131 176 1326 634 -1128 -56 1494 1032 -580 -618 1221 678 -365
7621 -365 -1104 472 925 -449 -1427 -292 1033 -179 -1283 -498 720 101 -1181 -1122 354 609 -905
7638 -905 -946 573 1017 -351 -680 526 1467 -26 -913 266 1459 668 -731 20 1253 555 -324 -763
7656 -763 905 735 -863 -829 297 437 -668 -1246 -188 252 5 -1161 -489 450 -217 -1037 -696 352
7674 352 698 -654 -552 637 392 -384 13 546 1188 206 -111 580 1170 -26 -49 237 657 78 -379
7693 -379 139 621 4 -538 -460 42 -138 -788 -962 180 -67 -827 -810 -141 397 -215 -859 -57 313 196
7713 196 -331 -118 485 497 -384 154 428 422 58 84 639 451 -162 -407 265 741 -377 -307 52 447 -265
7734 -265 -679 96 152 -296 -1096 -547 98 -177 -666 -507 295 269 -156 -601 19 344 -114 -18 688 817 132
7755 132 -286 328 502 220 37 157 742 531 -418 -422 189 257 75 -402 -303 10 -496 -605 -496 -64 -28 -313
7777 -313 -470 -3 83 -307 -209 -240 -68 -87 -285 329 138 203 2 119 63 531 337 501 277 477 388 65
7799 65 -150 209 270 -184 -122 -61 157 -276 -361 -457 100 -183 -319 -848 -300 -44 -337 -415 -76 500 247 -617
7821 -617 -99 304 614 -191 141 651 862 -6 -297 479 978 228 -585 -121 750 209 -456 -259 535 297
7841 297 -1064 -1154 71 318 -494 -1373 -122 597 -274 -1080 -108 583 171 -1263 -383 819 872 -407 -826
7860 -826 893 1064 -403 -695 808 1504 50 -1072 147 1245 416 -806 -363 1013 765 -789 -794
7877 -794 456 554 -1069 -1497 153 1117 -142 -1305 -255 834 179 -1302 -700 1187 621 -1302 -701
7894 -701 729 1307 -457 -870 607 1689 27 -1286 166 1396 191 -915 -377 1379 1008 -1092
7910 -1092 -955 1021 901 -987 -1446 336 1234 -523 -1460 -118 1100 -551 -1590 -278 1361 673
7926 673 -989 -755 1136 956 -652 -948 739 1312 -162 -980 317 1185 -97 -687 164 1147 236 -915
7944 -915 -245 688 447 -931 -1010 571 448 -848 -1183 -127 946 -336 -1092 -218 571 69 -962 -119
7962 -119 815 187 -743 -642 614 898 -55 -564 689 826 132 -380 187 481 328 -201 -50 424 55
7981 55 -553 -554 266 306 -280 -624 256 12 -577 -944 -270 -24 -243 -441 -11 308 -76 -519 215 185 -34 -13
8003 -13 -174 464 574 153 91 243 455 -166 -117 549 477 68 232 48 -165 -231 -278 -84 47 -180 -168 -120 -333
8026 -333 -534 -525 -394 -212 -256 -671 -481 94 -58 -37 -263 -27 234 357 3 109 254 -5 -3 502 643 378
8048 378 261 75 316 97 -192 -160 9 272 -478 -453 -327 -198 -490 -186 -231 -41 -105 -288 -142 -20 68 -505
8070 -505 -209 69 -6 158 551 211 638 130 -167 20 485 391 -91 275 86 247 273 -346 -45 530 325
8091 325 -184 -354 -59 54 -358 -309 81 -28 -526 -609 -302 119 -95 -442 -249 59 166 -207 -368 475 708
8112 708 376 -296 95 654 337 -176 18 522 537 11 -393 305 439 -159 -655 40 276 -288 -474 -321
8132 -321 194 -3 -561 -37 284 72 -717 -645 234 301 -179 -769 448 855 441 -519 165 1027 395 -359
8152 -359 140 932 705 -228 -97 490 448 -358 -666 343 989 18 -879 58 666 104 -1225 -700 441
8171 441 5 -750 -558 442 327 -632 -777 402 550 -19 -219 -114 1146 113 -508 -228 966 635
8189 635 -384 -100
8191a00
$$ Imaginary data points
##PAGE= N=2
##DATA TABLE= (X++(I..I)), XYDATA
0 0 0 0 0 0 0 0 -8 8 -8 8 -11 16 -16 24 -31 34 -40 48 -57 68 -76 90 -106 122 -138 156 -181 205 -229 261
30 261 -294 327 -366 411 -459 508 -565 627 -698 770 -852 944 -1046 1156 -1282 1426 -1585
47 -1585 1766 -1978 2228 -2520 2877 -3322 3890 -4644 5703 -7297 9961 -15223 29575 -149869
61 -149869 -447792 -31045 251118 16596 -225632 43305 292193 27050 -321705 -117515
71 -117515 262025 140885 -265804 -209221 212760 268276 -111897 -225318 84904 191667
81 191667 -134240 -266915 99161 361716 67179 -267178 -93856 214827 82262 -211528
91 -211528 -87849 244548 163532 -210437 -225871 123663 198913 -115656 -221922 84784 248433
102 248433 -18624 -220965 -2669 201937 -14370 -273387 -97569 219286 144325 -144683
112 -144683 -115468 143490 116513 -161477 -164492 146323 234083 -43735 -187773 31765 178490
123 178490 -26101 -196623 -11647 193161 53069 -157959 -44926 174374 79141 -175300
133 -175300 -138572 117515 143839 -73235 -118875 69771 105813 -107897 -188564 20771 158102
144 158102 4758 -127943 16656 169630 40937 -147335 -77106 94625 48448 -102030
154 -102030 -41872 137773 105131 -95920 -114657 69756 122798 -31800 -95791 40855 107094
165 107094 -26398 -107254 18121 112453 -12495 -139139 -42241 102888 43878 -95424 -59434
176 -59434 71242 46679 -74432 -43626 98207 82078 -87262 -127397 16861 84686 -18551
187 -18551 -66785 47447 108850 -7922 -94192 8070 110134 23267 -93955 -30705 91366
198 91366 48475 -71816 -45225 68395 42317 -86214 -77450 66171 96136 -31115 -85184
209 -85184 14984 62592 -38169 -92348 15384 93950 -4732 -108984 -37678 75564 33711
220 33711 -65451 -24414 82365 53772 -56677 -41243 72714 68458 -58252 -88861 23280
231 23280 77596 -3817 -48789 30196 74655 -14682 -81625 -2245 83078 22404 -74896 -42249
243 -42249 46161 23669 -58871 -40215 44068 29857 -61873 -58611 42118 65466 -21735 -56768
255 -56768 16969 54926 -10657 -49098 14650 56086 -11475 -68348 -7894 67539 34301 -30614
267 -30614 -2112 57285 24570 -47928 -28684 43259 28884 -48593 -47577 29071 39311 -30216
279 -30216 -44652 22292 38050 -33942 -57597 18225 58814 -8540 -60794 -5889 44111 -7623
291 -7623 -59067 -2783 63127 14458 -59624 -18845 69026 48082 -36410 -26533 53537 43012
303 43012 -47129 -49295 45714 60863 -39405 -75620 20055 76059 -3882 -64751 7454 70249
315 70249 -8019 -91607 -23387 77797 26547 -86558 -56791 58269 47583 -63091 -59044
326 -59044 60254 74046 -48631 -80584 44271 104248 -10471 -93845 310 91509 9209
337 9209 -89396 -12472 105209 42992 -93325 -55754 90896 83232 -62292 -80556 53310
348 53310 81205 -58447 -109710 26333 101895 -24919 -123835 -10389 114226 28632 -105495
359 -105495 -43058 94911 48527 -97496 -68970 90636 90927 -71627 -103992 50352 110772
370 110772 -26961 -102183 27652 124835 9725 -107097 -12586 116827 37944 -110987 -61866
381 -61866 92651 70991 -84264 -87322 64236 88716 -58615 -104672 37479 108592 -21313
392 -21313 -116648 -8249 99805 9444 -110984 -38512 97032 50831 -85787 -59148 82410
403 82410 79299 -60949 -78925 59693 104240 -23326 -89200 19373 91607 -12371 -102222
414 -102222 -9095 103297 37530 -79491 -36429 78354 45475 -78379 -70200 51794 62228
425 62228 -53372 -76343 37474 78204 -32289 -97941 -5183 74479 7919 -65230 780
436 780 84066 23446 -77780 -39854 66292 50012 -51039 -48747 49670 61889 -28954 -50072
448 -50072 36422 65301 -20929 -64040 16525 73520 2693 -71047 -24889 43435 7203 -55451
460 -55451 -16533 56803 25890 -59356 -47850 35933 42350 -32267 -44409 26391 45515 -23799
472 -23799 -50612 15719 50591 -10724 -52524 9223 67873 22261 -40494 -10316 45814 15008
484 15008 -45460 -16840 54580 38227 -40619 -45406 23070 32817 -32020 -44350 26878 53728
496 53728 -13480 -53029 2228 41842 -15901 -69679 -18639 50242 20904 -40377 -13098 51612
508 51612 25617 -53065 -43485 39828 52316 -19411 -35988 33920 56839 -15476 -54802 8621
520 8621 55351 -1466 -57644 -5797 63197 27202 -46990 -27119 43539 27999 -49248 -47879
532 -47879 28279 36934 -40575 -60829 18220 61380 -2004 -52188 -1811 47847 -2033 -62024
544 -62024 -17780 56947 34905 -37174 -25140 46921 42312 -35848 -50056 22349 52680 -5522
556 -5522 -35449 22928 60719 -486 -61655 -22072 41029 16135 -43467 -22887 41881 29501
568 29501 -41897 -47835 18102 36115 -21126 -41847 16607 49078 -6778 -55482 -17291 34040
580 34040 8730 -34700 -5230 52895 37484 -26546 -31912 20544 29434 -18744 -30187 23512
592 23512 50471 4135 -34085 -5306 27745 -1302 -40284 -14213 34464 23412 -24122 -25070
604 -25070 14209 15348 -25150 -33200 7274 26192 -7713 -32603 -6607 20450 2270 -20959
616 -20959 -500 32906 22415 -13651 -16584 8622 9692 -15200 -14782 19713 36975 13749 -7490
629 -7490 968 8509 -11478 -28225 -9484 19867 19597 73 -3169 5795 -2943 -26170 -29873 -7793
643 -7793 7171 2121 -1036 9363 13347 -3252 -20155 -15097 -39 3654 393 6645 15505 9868
657 9868 -4707 -8659 1934 9039 6400 6278 11785 10972 -146 -9061 -6792 -1651 -1289 -658 5081
672 5081 9218 3428 -7239 -12794 -12351 -11974 -9178 -446 8646 8580 127 -5917 -6630 -7770 -9610 -5716
688 -5716 4362 9691 7023 4652 7440 7969 875 -3753 903 7595 5619 904 2615 7059 2962
703 2962 -4698 -2818 6859 7676 -1953 -8326 -4438 -3296 -10918 -13636 -1991 9252 4351 -6817 -5661
718 -5661 1524 -3660 -16158 -13295 3823 11401 3591 1423 12945 15934 -1618 -15778 -5624 10212
732 10212 8137 -1644 5536 19858 13909 -7418 -11360 4985 9404 -7740 -15720 1618 14306
745 14306 -357 -16625 -6193 10388 512 -19344 -13245 9386 7992 -16110 -19700 4886 15427
758 15427 -2792 -12670 7014 21671 2381 -19168 -6062 18127 11600 -10701 -4520 23068 23729
771 23729 -5216 -14976 7367 16689 -7406 -21880 683 23260 6560 -18831 -8542 15405
783 15405 4923 -24915 -22559 7876 13908 -12902 -20818 6321 20058 -3720 -22848 -2155 21713
796 21713 5565 -21634 -10933 19683 16991 -10579 -10611 19484 25772 -4508 -18593 6420 23880
809 23880 506 -23062 -4458 22869 11369 -17338 -11840 15445 11017 -21615 -27009 4518 18330
822 18330 -5447 -22798 -856 19830 701 -24924 -11674 16117 9219 -19326 -15955 17004
834 17004 25339 -2216 -15188 8300 23496 1367 -19424 -325 24650 11313 -18173 -13026
846 -13026 18068 20001 -8318 -16695 7915 17198 -9856 -27696 -4884 20004 3944 -23815 -13967
859 -13967 15238 10683 -19388 -22020 8055 16288 -11348 -22063 7769 30476 7620 -20861 -6839
872 -6839 20725 10379 -18532 -11163 23463 24952 -10253 -19902 13010 30365 -164 -24982 -2390
885 -2390 23530 2803 -28763 -12932 22987 13814 -26066 -26577 13629 22871 -14237 -30203 3425
898 3425 24676 -6024 -31854 -2849 32591 11663 -28614 -17197 24167 20999 -18944 -19181 24072
911 24072 34446 -7748 -26791 11274 36835 2454 -31766 -6180 30142 8815 -31983 -16599
923 -16599 27835 21247 -25944 -28674 17052 27900 -15928 -35824 1462 25123 -9084 -37234
935 -37234 -2821 37062 11759 -32761 -18778 25621 19856 -22587 -18819 29101 35148 -12046 -27893
948 -27893 13629 33983 -6518 -35774 -358 36919 10737 -25978 -5539 33388 13332 -34497
960 -34497 -26955 20678 22775 -21795 -29575 12650 24731 -18354 -38314 3041 32588 -253 -32001
973 -32001 -3645 33213 10029 -30498 -13517 29764 19123 -24789 -20109 26387 30959 -13335
985 -13335 -24192 17168 33139 -5281 -27100 8151 33401 -1733 -36451 -9933 28366 9510
997 9510 -29875 -16140 23251 12484 -30516 -25714 20803 26269 -17219 -29370 10849 26462 -13136
1010 -13136 -35709 1710 31947 2325 -27787 1826 39868 16615 -27874 -14498 28410 20467
1022 20467 -22632 -17607 28609 30933 -18328 -33392 9411 29129 -10754 -34108 6893 38210
1034 38210 2262 -37748 -11363 28821 5034 -41416 -24485 27503 22245 -26377 -26005 24376
1046 24376 30517 -21364 -35677 15719 42408 -1593 -34010 4466 40940 6299 -37099 -9519
1058 -9519 39253 19558 -32379 -20746 34683 33422 -22436 -31737 19005 32888 -19051 -43817
1070 -43817 2592 34696 -6848 -44498 -7498 40085 13519 -37254 -20916 28745 18849 -32371
1082 -32371 -28021 28525 36781 -16128 -35260 11700 37125 -5751 -36683 2827 43289 13806
1094 13806 -28688 -5368 39781 20842 -32747 -29381 20144 24183 -21474 -30186 16281 33055
1106 33055 -11423 -37465 205 31755 -47 -37245 -13524 26411 11259 -28006 -17667 23768
1118 23768 19021 -24491 -28706 14597 31785 -876 -19054 10899 31005 1620 -25993 -4321
1130 -4321 25933 9691 -22100 -12168 22245 20133 -11818 -17105 8161 13547 -11408 -19556 6924
1143 6924 22502 -572 -24301 -14690 4244 -2398 -16557 -6338 15023 13274 -6126 -9204 6386
1156 6386 11034 -4190 -12507 -1456 11050 7326 -23 4202 10013 3673 -7668 -7263 4414 12302
1170 12302 8913 2425 -178 474 -2124 -6778 -7585 -2576 1512 -3319 -10613 -7486 3550 6407 -2420
1185 -2420 -7603 303 6474 -1582 -10550 -3468 7393 60 -14726 -7260 15560 20397 2433 -5089
1199 -5089 7440 10979 -7329 -15041 7147 25958 9144 -15304 -7642 12781 3307 -21044 -14818
1212 -14818 13226 14734 -12333 -15189 13820 22496 -10384 -32176 -9007 13986 -1881 -21547
1224 -21547 -1111 26047 8359 -26664 -17277 21933 25079 -7739 -13912 16410 22376 -12228 -26651
1237 -26651 7060 29733 1405 -26009 -1756 31089 13664 -22123 -13150 18588 9780 -25567
1249 -25567 -20740 21649 27376 -15138 -34396 -3380 15937 -10614 -27425 4946 33135 6945
1261 6945 -27215 -9302 26787 14474 -24342 -19898 16924 19012 -14009 -15267 21694 30304 -8634
1274 -8634 -27236 6500 31762 6384 -19979 -1772 21092 -1311 -31340 -12538 24521 16241
1286 16241 -20238 -20351 11471 13465 -17309 -21421 11042 21002 -9523 -23775 4687 23134 -2857
1299 -2857 -27631 -8873 17262 6078 -13507 4657 32065 18025 -16413 -15359 13040 14573
1311 14573 -11029 -12419 14060 17976 -10792 -20308 6719 20847 -3499 -20488 -289 18070
1323 18070 -398 -21424 -6362 14306 -734 -25285 -12549 17937 13659 -15069 -14778 10838
1335 10838 11428 -13130 -12376 20000 28905 -2387 -19877 1901 16722 -5655 -21214 3381 27701
1348 27701 9594 -16351 -1570 25075 10786 -23118 -18443 13096 12717 -17186 -17978 13344 16731
1361 16731 -18187 -30604 2855 24287 -799 -21502 1204 23037 -393 -28374 -8106 25942
1373 25942 14760 -19971 -14264 19988 19132 -14859 -17827 17530 27430 -4867 -17988 12960 30409
1386 30409 -1601 -30613 -10307 17714 2147 -23727 -6740 26000 14664 -22611 -21354 12904
1398 12904 15967 -16383 -23294 8038 20061 -9224 -25330 2493 23229 -39 -23686 -3579
1410 -3579 25362 12777 -14704 -5993 21738 15566 -14679 -13548 16041 19534 -10180 -20852 4673
1423 4673 18033 -2750 -15572 5386 21668 1605 -20927 -8467 11923 1765 -20274 -13190
1435 -13190 9009 6776 -12715 -10852 9988 11161 -8580 -12606 6935 14888 -883 -9547 4001
1448 4001 11662 -1537 -10540 2350 14755 4916 -7219 236 11693 4808 -6719 -205 10834
1461 10834 4222 -9986 -7513 4271 491 -12537 -10588 3670 3542 -7998 -5490 9489 8822 -7866
1475 -7866 -12277 2682 6964 -7408 -11946 4455 12161 -2550 -10554 6847 20594 4945 -12886
1488 -12886 -1602 15356 5924 -12180 -1896 19485 10779 -16255 -15510 9682 11392 -14591 -18867
1501 -18867 9277 20552 -4196 -18733 4092 18185 -8457 -31817 -9805 20253 7198 -20882
1513 -20882 -9006 21662 14278 -19195 -15848 20594 24824 -11063 -22215 11679 28384 -3749
1525 -3749 -25660 2424 28306 3353 -26599 -5462 29513 14330 -24880 -17759 21399 20277
1537 20277 -19574 -26005 10792 20018 -17756 -33802 3620 30120 427 -29213 -4481 27612
1549 27612 7786 -27894 -12953 27099 18873 -21009 -19932 20275 25559 -14223 -26952 10985
1561 10985 32025 1590 -20592 7365 31522 2825 -32470 -13446 22905 12286 -23034 -15979
1573 -15979 20327 18207 -20016 -25981 8899 20108 -11711 -25183 7003 28011 30 -27785
1585 -27785 -8263 18038 2864 -22912 -7057 24903 18640 -12718 -11314 18521 20183 -9808
1597 -9808 -17889 8667 19856 -3462 -17311 3393 18524 -383 -18962 -3409 17593 5791
1609 5791 -16760 -10143 9833 6467 -13320 -11327 7806 7381 -13284 -16922 2756 10974 -3047
1622 -3047 -8832 6385 14925 1733 -9146 1638 10807 -232 -10631 554 14294 8247 -5151
1635 -5151 -1391 8323 2053 -8633 -2101 11968 8658 -6822 -7739 3280 1592 -11704 -11375 3121
1649 3121 5125 -8033 -9864 5432 10086 -5250 -13459 279 10768 -701 -9858 1984 12724
1662 12724 -638 -15037 -2886 17076 11340 -7297 -3133 14457 10323 -9973 -8761 12578 14133
1675 14133 -8786 -15552 5040 14495 -6126 -19700 -1894 14479 -231 -16232 -1669 18196
1687 18196 3640 -22609 -15828 10557 10574 -12026 -11828 12249 15150 -10252 -17754 8491 21790
1700 21790 396 -15656 4485 23664 6316 -16825 -6067 15907 5644 -17411 -8680 20287
1712 20287 18410 -11541 -17801 6164 12654 -10791 -19071 4757 18437 -4348 -22184 -4637 15056
1725 15056 -55 -21842 -9134 16659 11319 -11390 -6611 16389 13088 -13640 -16855 9250 18272
1738 18272 -3208 -12313 7555 19420 -431 -15273 1606 19162 4484 -15386 -4903 15163
1750 15163 6547 -15562 -11582 8589 6384 -14797 -13611 8957 12764 -8521 -15852 2753 11545
1763 11545 -5147 -15002 2564 15726 149 -15256 -2051 14124 4096 -12597 -2659 17009
1775 17009 11976 -6847 -3823 14751 10775 -11750 -13893 7312 12980 -5946 -12026 6941 14712
1788 14712 -5766 -18616 -1152 13472 -1773 -17943 -3597 15464 2971 -18862 -10189 12000
1800 12000 6687 -15525 -11236 15294 16480 -8883 -14225 10530 18686 -4742 -16082 7228 23121
1813 23121 763 -19986 -2457 20127 5250 -18675 -6038 22520 14357 -16484 -15971 11482
1825 11482 11943 -18054 -23137 8432 21626 -6496 -23337 810 19697 -3212 -26478 -5472
1837 -5472 23838 10878 -18851 -9773 20931 15063 -18346 -19376 15035 23438 -6492 -17915 11291
1850 11291 26022 -2678 -24366 -21 26049 7283 -21494 -9131 19353 8794 -23951 -19186
1862 -19186 14747 17407 -13615 -20195 10369 20948 -9485 -27067 -2219 19761 61 -21245
1874 -21245 -1994 25010 9955 -20557 -13514 17561 16272 -11379 -12453 16363 22236 -6452 -18283
1887 -18283 6296 20903 -2111 -21335 -2142 19979 5880 -17404 -8126 14999 8054 -16350
1899 -16350 -13430 10960 12620 -12631 -19978 1720 12439 -4351 -14505 2966 16266 1361
1911 1361 -15003 -3764 14381 7215 -10703 -6116 12174 11514 -3954 -5237 8689 9512 -5910
1924 -5910 -10818 4301 12780 1955 -7482 -520 6908 -491 -9228 -3515 4643 -832 -10106 -6591
1938 -6591 3735 3567 -4496 -4447 2095 1779 -4083 -3293 3746 3225 -4071 -4455 2801 5722 1663 1140 6008
1955 6008 5194 -1693 -3325 3246 5826 -296 -2283 3672 6270 -1001 -5479 132 3410 -4779 -10675
1970 -10675 -2870 6535 1398 -6806 -2024 5407 -470 -11399 -7543 5028 4991 -6884 -6766 7098
1984 7098 10766 -2422 -7389 4625 11064 -1244 -9424 3223 15186 5050 -9481 -3334 11088
1997 11088 6288 -9229 -6564 9897 9449 -9157 -12704 4101 10686 -6075 -15315 -216 12421
2010 12421 -618 -15797 -5778 9699 2021 -14495 -7542 13144 11246 -8504 -10449 8923 13496
2023 13496 -5339 -12933 4153 16187 1854 -10894 2223 17184 4999 -13441 -6070 13575
2035 13575 9998 -10450 -11270 7227 9653 -8321 -13324 4976 12970 -5232 -17888 -3849 10811
2048 10811 165 -14926 -5443 12363 7880 -9331 -7415 9452 8553 -9985 -12726 6474 15893
2061 15893 2372 -6301 5298 13926 512 -13180 -3936 11496 6504 -7151 -3753 9849 7287
2074 7287 -8620 -10199 3052 5983 -6989 -11920 1441 9316 -342 -10474 -4059 4509 -1349 -9188
2088 -9188 -2369 9249 5652 -6796 -6803 5033 7331 -661 -2596 5702 7657 -826 -4639 3560 8776
2103 8776 1342 -5963 -716 6764 3619 -3247 -1670 2571 -978 -7527 -5271 2891 3123 -4000 -5794
2118 -5794 -588 800 -3631 -5051 913 2979 -2260 -5074 -536 4228 1325 -1899 1823 5701 2402
2133 2402 -1812 1105 5631 3107 -2313 -924 4539 4496 -179 -354 3970 2442 -4923 -6710 -188 3309
2149 3309 -1287 -3954 -662 2395 -2533 -7078 -2720 2120 -1422 -7118 -3815 5037 5325 -1181 -2788
2164 -2788 2738 3057 -3067 -4114 3623 8192 2353 -2781 2398 8368 3421 -4230 -2191 4293 3273
2179 3273 -3054 -2309 4852 4614 -4209 -7824 -1201 2661 -2698 -7967 -2166 4708 947 -6370 -4308
2194 -4308 2725 1538 -6000 -4698 4383 7194 -1103 -4992 1274 6587 1527 -4242 745 8149 5418
2209 5418 -2059 -858 5764 4573 -4281 -6487 1884 6697 392 -4669 -358 3675 -1758 -9125 -5474
2224 -5474 3469 2854 -4950 -6039 1920 3744 -4491 -8308 -800 5177 682 -4674 429 8323 5100
2239 5100 -4557 -4177 4348 6545 -300 -2183 4825 7862 -294 -6740 -1141 7060 3303 -4913 -3223
2254 -3223 4716 3375 -6065 -7205 588 2820 -5506 -8874 -188 7208 702 -8147 -5400 3146 1974
2269 1974 -5073 -2449 6927 6929 -3347 -6842 2676 8855 1714 -5469 482 8722 5369 -3315 -1287
2284 -1287 7058 4564 -6203 -7055 4426 8328 -1430 -8772 -3135 3942 -1423 -8669 -2612 6182 2189
2299 2189 -8168 -7593 3525 5884 -4070 -8574 15 6490 531 -5511 1221 9501 3490 -6510
2313 -6510 -3470 8365 9518 -608 -4122 3912 7232 -2124 -7055 1404 8492 1499 -8566 -4706
2327 -4706 6125 4862 -5993 -7838 1451 3355 -5804 -9153 1162 7912 -1168 -10681 -4623 5867
2341 5867 3846 -5699 -3614 7154 7620 -3296 -5239 5773 10233 -902 -9133 -973 9914 5184
2355 5184 -4510 -485 9158 5624 -7871 -8569 4096 7782 -3847 -9462 564 7791 -1657 -11857
2369 -11857 -4973 6489 1352 -10235 -6387 7974 8620 -5830 -9639 2424 8418 -2495 -9252
2382 -9252 2214 13143 4001 -8937 -3281 10302 7380 -5875 -4097 10148 10908 -5012 -11000
2395 -11000 1594 9047 -2423 -11569 -411 11525 2249 -12349 -6499 7395 3973 -11216 -10178
2408 -10178 6754 9599 -5394 -10827 2264 8956 -4024 -12682 971 15588 6476 -8578 -3587
2421 -3587 10729 6945 -7490 -5143 10815 11516 -5981 -11292 4051 11639 -1930 -11613 277
2434 277 11740 1677 -11230 -3805 9017 1267 -14972 -11689 7179 9701 -5705 -8953 4100
2447 4100 7414 -7802 -13102 2655 14825 3247 -9029 -719 11416 4064 -10062 -4527 10929
2460 10929 8083 -6806 -5911 10654 12530 -4230 -10502 2446 9134 -2461 -9952 1930 10648
2473 10648 -2495 -15964 -7215 8627 4776 -8134 -4557 8106 4543 -11162 -10538 6154 9512
2486 9512 -5401 -10194 4816 12909 601 -9294 1058 10946 631 -10003 1344 16734 8674
2499 8674 -9122 -7107 7894 6387 -8518 -8000 8359 9542 -8095 -13222 3367 12219 -2830
2512 -2830 -13695 -1315 10515 -1301 -15367 -5621 10432 3814 -12687 -6796 13068 11841 -7862
2525 -7862 -10594 7216 11765 -5527 -11339 7595 18630 1631 -13620 -1213 13690 2395 -14169
2538 -14169 -4660 15595 9958 -11309 -10158 10130 10497 -11599 -16789 3800 12880 -5739 -17147
2551 -17147 539 14904 -388 -17950 -4744 16304 8100 -13605 -9074 12845 11240 -10968
2563 -10968 -12719 10397 17162 -4337 -14160 5987 19047 670 -16210 -1127 17816 5930
2575 5930 -15103 -7715 14022 8907 -14623 -13929 9478 12576 -10088 -17257 4075 15758 -2618
2588 -2618 -17420 -1182 15585 2135 -17297 -6871 14308 7506 -14283 -10513 13801 16916 -5053
2601 -5053 -11423 7549 14976 -3442 -14883 2099 17155 3650 -13809 -3645 14511 7141 -13251
2614 -13251 -11008 8335 8682 -9255 -11764 6845 12636 -5332 -16084 -1726 10102 -1212 -13924
2627 -13924 -4026 11561 5498 -8976 -4849 11116 9665 -6341 -9004 5326 10197 -2004 -8130
2640 -8130 3535 11514 2262 -8132 -626 9642 3758 -7852 -5391 6098 5410 -5180 -6404 2566
2654 2566 3969 -5696 -9826 -1271 5375 -287 -6338 -1783 4286 905 -4853 -2511 3788 3269 -2613
2669 -2613 -3012 2394 4438 455 -1824 1623 4535 3246 1356 2160 3690 1329 -2478 -2548 -560 828
2685 828 328 -858 -864 -852 -378 -1616 -2973 -2577 -1112 -368 -2040 -2602 485 1226 -1671 -4267 -1970 2062
2703 2062 1092 -1995 -181 5282 4937 -865 -1559 4071 5739 75 -3547 1220 5305 266 -4825 -637
2719 -637 6065 3259 -4422 -3576 4173 3230 -5695 -6935 952 2968 -4766 -7833 396 6505 -615 -8435
2735 -8435 -2812 5638 1903 -6285 -2207 7918 6543 -4090 -4698 5356 7115 -2936 -6972 2918
2749 2918 9491 1525 -4916 1835 9494 1898 -8671 -4372 6390 4221 -6846 -6717 3694 4179
2763 4179 -6515 -8833 1908 6806 -2588 -8515 -145 7434 -119 -8729 -3350 6615 3122 -5516
2777 -5516 -2104 8169 6485 -4728 -5324 4570 7818 -398 -3249 4815 8931 -703 -7746 -787 5507
2792 5507 -325 -7181 -1719 6939 3343 -5722 -4466 3131 725 -7867 -6456 3313 5136 -3691 -6872
2807 -6872 996 4646 -2746 -5894 2440 7756 1714 -4436 1366 7988 2579 -5306 -1649 6465 4182
2822 4182 -3547 -1853 6520 4654 -5291 -5634 4420 5942 -3131 -6549 1806 4949 -3859 -9370 -1185
2837 -1185 5175 -2101 -9225 -2664 7463 2254 -7041 -3671 6631 4436 -6096 -5175 6789 7803
2851 7803 -4218 -6627 5273 10531 -328 -7337 2579 10470 1198 -8829 -251 11023 3953 -9621
2865 -9621 -6390 6881 4943 -9443 -9748 5181 7872 -6135 -10907 3047 9878 -3784 -13439 -1637
2879 -1637 10637 1895 -11658 -3484 10861 5515 -9718 -6157 11424 11072 -5515 -8639 7689
2892 7689 13154 -3078 -11474 2396 13146 513 -12070 -1661 12688 3538 -13409 -8155 9509
2905 9509 8477 -9070 -10243 5792 8608 -8947 -15100 1713 12144 -1285 -12705 -832 12860
2918 12860 3270 -12111 -5506 11564 8141 -8200 -5797 11307 12277 -6169 -12406 3444 11831
2931 11831 -310 -9168 3274 13859 1865 -13169 -5492 9749 4730 -10709 -8178 7917 7068
2944 7068 -8708 -11333 3480 8018 -5542 -11303 2247 12066 792 -10942 -3231 8154 2208
2957 2208 -8901 -2309 11252 8479 -6022 -6736 6439 8470 -3142 -6501 5294 10505 -886
2970 -886 -8086 91 7130 -945 -10128 -3441 7587 3504 -6546 -4264 4706 1925 -7935 -7485 3344
2985 3344 5775 -3756 -7079 1575 5339 -2444 -6672 1668 8123 1856 -4154 681 7723 2582 -5220
3000 -5220 -1340 6339 4454 -3309 -1949 5227 3803 -5050 -5568 3124 4944 -2261 -4933 2382 4562
3015 4562 -4121 -8842 -1951 3786 -1286 -6663 -859 6525 1035 -7331 -3132 5906 3644 -4933 -2777
3030 -2777 6951 6257 -3785 -5034 4853 7533 -2000 -5435 4497 9920 546 -7490 -452 7127 805
3045 805 -8711 -2901 8287 3809 -9195 -7676 4452 5084 -7910 -9131 4151 8440 -3536 -9536
3059 -9536 1886 9470 -858 -11382 -2291 10031 4240 -8133 -3213 11223 8533 -6072 -6894
3072 -6894 7685 10412 -4161 -9990 3796 11791 -90 -10398 -315 10931 1466 -12575 -6668
3085 -6668 8963 5633 -9478 -8721 6873 8096 -7699 -12288 2652 10048 -3265 -12460 37
3098 37 12339 2984 -10156 -2488 12058 6818 -8670 -6178 9524 9776 -6145 -9133 6091 12228
3112 12228 -1679 -10183 2183 11463 -2 -12366 -3752 10151 4271 -10462 -7191 7243 5938
3125 5938 -8980 -10747 3928 8244 -4529 -11132 1592 10804 499 -9966 -1702 10292 4383
3138 4383 -8283 -3710 9308 7824 -5521 -6359 6436 9975 -1401 -6705 3554 9451 -878
3151 -878 -9992 -2190 7433 2187 -8043 -4457 6493 4046 -7161 -7159 2579 4172 -5079 -8186 1847
3166 1847 7283 13 -6389 -1204 5166 482 -5872 -1449 6651 4891 -2773 -2304 5536 5968 -1432
3181 -1432 -3213 2629 4812 -992 -4208 736 4713 420 -4072 -1589 2977 984 -3996 -3276 599
3196 599 -251 -4419 -3812 1053 2347 -1133 -2978 -340 853 -1205 -2269 840 2921 1252 -346 1244
3212 1244 3285 1777 -199 278 1664 595 -38 1130 2471 1683 -484 -436 680 -250 -1497 -855 56
3229 56 -1417 -3111 -2431 -128 -329 -2126 -1645 198 -233 -2528 -2234 707 1224 -1165 -1290 1669 3208
3246 3208 980 -611 1626 2904 387 -1812 560 4024 2849 -144 336 2690 1084 -3053 -2659
3261 -2659 784 1404 -2332 -3024 644 2119 -1523 -3725 -1651 390 -2377 -4071 -1005 2745 1004
3276 1004 -2386 -1383 1678 1232 -1880 -461 3749 3659 107 -866 2136 3115 263 -1071 1836 3159
3292 3159 564 -1181 682 2251 -858 -3454 -1384 1646 966 -1489 -764 881 -1285 -4967 -4050 -86
3308 -86 448 -1698 -895 2229 1607 -1933 -2305 1282 1943 -1320 -1722 2692 4752 1405 -1097 1734 3641
3325 3641 156 -2895 966 4956 1941 -3275 -1244 3107 1693 -4298 -3391 2709 1953 -5107 -5910 965
3341 965 3457 -3172 -5659 1223 5429 -1270 -6650 -817 5418 687 -6606 -1752 7829 5559 -3974
3356 -3974 -2890 6326 6065 -4264 -5909 4680 8944 -1007 -6946 2210 9165 -58 -9690 -2431 8219
3371 8219 2348 -9610 -5734 7417 5246 -8117 -9775 3985 7464 -5593 -10884 2161 10218
3384 10218 -1381 -11533 -841 11789 3536 -10439 -3734 11579 8205 -8281 -7331 9355 11078
3397 11078 -5379 -10995 5417 13333 -1002 -12240 461 12819 1429 -14162 -5662 11480
3409 11480 5886 -11966 -9411 9147 9478 -9671 -13650 4534 11986 -4965 -14626 1560 15316
3422 15316 1605 -13674 -2795 14136 6427 -12618 -7166 13002 12302 -8144 -10264 8805 14089
3435 14089 -4836 -13787 3395 15238 -247 -15300 -2249 14238 4368 -14886 -8480 11183
3447 11183 8103 -11880 -12546 7650 11325 -7909 -14598 3524 14509 -1382 -14553 -970 14088
3460 14088 3764 -13062 -4701 13926 9204 -9798 -8358 10442 12788 -6317 -11969 5450 13607
3473 13607 -2234 -12916 863 13413 1183 -13999 -5195 10747 5438 -11624 -9029 8080
3485 8080 7746 -9318 -11634 5356 11072 -4664 -12445 1636 11890 290 -11143 -1469 11665
3498 11665 4269 -9637 -3994 11165 8587 -6611 -7120 6976 9344 -4144 -8414 4675 10501
3511 10501 -1701 -10592 -584 9152 681 -9905 -3641 7194 2754 -9163 -6148 5485 4850
3524 4850 -7241 -8314 3391 6712 -3009 -7336 2355 7681 -991 -7313 461 9108 3134 -6062
3538 -6062 -1507 7418 4667 -4766 -2997 5908 5181 -4411 -5022 4278 6525 -2656 -6619 237 4730
3553 4730 -2501 -7456 -958 5620 -117 -7314 -3178 4557 1438 -6000 -3760 4427 3766 -3857 -3968
3568 -3968 4370 5607 -1792 -4616 2622 6029 85 -3941 2035 6601 1436 -5013 -852 5570 2535
3583 2535 -4517 -2670 3939 2209 -4795 -5483 2107 3590 -3360 -5998 704 3684 -2391 -6029 -629
3598 -629 4165 125 -5332 -1306 5242 3447 -3485 -2149 4044 4322 -1930 -2213 4171 5915 -277 -4055
3614 -4055 1586 5248 783 -3548 -123 4117 881 -4710 -2939 2885 2295 -3586 -4096 1030 2316
3629 2316 -2492 -4606 -592 2129 -1752 -4477 -770 4046 2164 -2247 -1084 2326 2027 -1447 -1541 3111
3645 3111 4224 395 -1204 1393 3917 1727 -1494 -770 1673 992 -1393 -995 1490 1337 -1369 -3051
3661 -3051 -1397 513 -461 -2242 -1940 -226 -188 -2105 -2150 239 1480 -107 -2049 -1190 1157 1774 -349
3678 -349 -741 1802 2802 652 -651 1390 3970 1785 -1954 -1227 1997 2167 -1124 -1813 1522 2576
3694 2576 -1782 -4427 -899 2418 -892 -5137 -2432 2780 1163 -3949 -3091 1968 2346 -3537 -4997
3709 -4997 1571 4536 -289 -4326 1004 6067 2059 -3950 -849 5984 3643 -3850 -3220 4754 5694
3724 5694 -2372 -4411 2676 6011 -1390 -6839 -830 5505 242 -7424 -2865 5475 2391 -6725 -5584
3739 -5584 3588 4191 -4733 -6993 2342 6684 -1278 -6658 840 7729 1506 -6454 -1610 8063 4624
3754 4624 -5037 -3619 6521 6583 -3143 -5086 4033 7573 -1770 -7577 332 6838 -303 -8219 -2789
3769 -2789 6440 2869 -6986 -5352 4607 3977 -6540 -7416 2962 6437 -2142 -6592 1686 7733 163
3784 163 -7249 -1027 7585 3368 -5409 -2063 7359 6286 -3067 -4217 4548 6049 -2947 -6338 1731
3799 1731 6722 -531 -6351 -1067 5854 906 -7039 -4063 3984 1747 -6054 -5241 3439 4456 -3258
3814 -3258 -5479 1794 4641 -1331 -5157 688 5850 1189 -3857 -176 5958 3299 -3156 -1720 4325
3829 4325 3276 -2207 -2732 3243 4028 -1600 -3618 1348 3797 -728 -4725 -1291 1884 -1194 -5096
3844 -5096 -1812 2569 798 -3957 -2526 1633 1285 -3014 -2462 2294 2713 -1225 -2059 2088 3234 -734
3860 -734 -2070 1845 4358 1164 -1936 1289 3130 357 -2814 -232 3827 1925 -2168 -1631 1301
3875 1301 -295 -4659 -3440 1395 2084 -1903 -2462 1605 2003 -2964 -5371 -890 2330 -70 -2241 1768
3891 1768 5225 1708 -3866 -1728 3297 2182 -2063 -140 5191 4489 -1533 -3027 2491 3489 -1854
3906 -1854 -3855 1488 4911 -36 -5162 -1613 2840 -383 -5363 -2450 3463 2450 -4720 -4664 1159
3921 1159 2289 -3417 -4526 2357 6091 508 -4236 -44 4457 703 -4387 -592 6546 4817 -1899
3936 -1899 -2016 3711 3703 -3214 -4268 2338 5651 -103 -4099 -23 4264 -891 -6634 -2555 3852 1817
3952 1817 -4836 -3860 2359 2213 -4537 -5276 1931 5019 -651 -4371 709 4464 58 -4690 -401 5730
3968 5730 3556 -1712 -912 4467 3693 -2839 -3620 2328 4661 -481 -3211 1407 3900 -730 -5100 -2214
3984 -2214 2662 586 -4246 -2624 2278 1592 -3792 -4349 854 2318 -1700 -3589 515 3178 -119
3999 -119 -3145 -22 3988 2293 -1254 -196 3296 2362 -1561 -1696 2133 3203 350 -1282 987 2292
4015 2292 -822 -2945 -1118 1552 -54 -2223 -1096 570 63 -2546 -2847 15 175 -1493 -1552 427
4031 427 1183 -615 -1748 636 1920 740 71 941 1404 588 8 274 1295 1258 710 1468 2017 657
4049 657 -509 -739 -165 -368 -863 -624 146 205 -1268 -1495 -1002 -945 -2175 -1749 -104 779 -595 -944 -232
4068 -232 310 -1194 -1139 1028 2445 1172 -396 492 2130 1223 -290 453 2665 2254 -467 -604 1083
4085 1083 1624 -804 -1810 462 1804 -141 -2402 -913 745 -1271 -3253 -1916 1195 968 -1950
4100 -1950 -2485 323 707 -2153 -2588 1125 3026 301 -1348 426 3163 1421 -1680 -174 2935 2933
4116 2933 -315 -1070 2353 2409 -1321 -2787 305 2948 779 -2362 -695 1897 -316 -4098 -3005 1375
4132 1375 1403 -2341 -2956 661 1895 -1704 -3343 -290 2808 223 -2330 -12 3952 2161 -2366 -1604
4148 -1604 2565 3569 39 -1092 2205 3859 127 -3019 -235 3059 1264 -2533 -1665 2250 1602
4163 1602 -2679 -3328 435 1731 -1830 -3637 -254 2277 -151 -3810 -2326 1877 1344 -2449 -1963 2165
4179 2165 3216 -748 -2186 1313 3991 1065 -2208 396 4021 2334 -2108 -1498 2353 2458 -1691
4194 -1691 -2619 1385 3053 -856 -3911 -783 2232 -249 -4188 -2611 2239 1432 -3235 -3410 778 2044
4210 2044 -2036 -3843 900 3841 384 -2979 -246 3932 2468 -2319 -1344 3828 3519 -1168 -2639
4225 -2639 2199 4573 -3 -3345 192 4278 990 -3905 -1920 2818 1026 -4598 -4164 1736 2978
4240 2978 -2502 -4621 -108 3245 -1430 -5195 -1194 4059 1438 -3652 -1747 4215 3573 -2955 -3247
4255 -3247 2829 4510 -302 -2828 2468 6096 957 -4457 -755 4698 2112 -3635 -2676 3073 2712
4270 2712 -3653 -4350 1719 3536 -2321 -5314 -240 3670 -820 -5576 -1914 3704 1337 -4142 -2253
4285 -2253 4033 3465 -3059 -3605 2421 4754 -411 -3086 2220 5839 881 -3810 -179 4419 1651
4300 1651 -3632 -1603 4253 3119 -3040 -3792 1547 3067 -2476 -4785 626 3160 -1088 -5225 -1417
4315 -1417 2977 63 -4706 -1789 3775 2748 -3014 -2976 2262 2811 -1970 -2656 2999 5329 526 -2784
4331 -2784 1140 4047 925 -3493 -325 3947 2057 -2624 -1261 2688 1833 -3594 -3925 897 1714 -2427
4347 -2427 -3291 699 2368 -1934 -4122 -146 2709 -122 -3710 -893 2770 1524 -2320 -407 4036
4362 4036 2964 -1815 -1968 2614 3166 -914 -2271 2641 4123 295 -2476 905 2993 -855 -4503
4377 -4503 -1312 3005 1405 -3154 -2015 1982 193 -4443 -3664 2068 2457 -2470 -3833 931 3059
4392 3059 -1278 -3619 907 4398 972 -3378 -23 4934 2241 -2959 -1837 3928 3759 -1470 -1475 3425
4408 3425 3636 -2495 -4761 784 3961 -613 -4341 -512 3604 -415 -5447 -3068 2781 1163 -4142
4423 -4142 -3125 2736 3409 -2698 -4323 1345 3899 -703 -3689 1374 5113 908 -4400 -1171 4824
4438 4824 3102 -2549 -966 4983 4229 -2469 -4407 1285 3430 -1055 -3717 1356 4575 -363 -5363
4453 -5363 -2643 1817 -167 -4771 -2450 3271 3186 -2518 -3502 1016 2496 -2244 -4401 665 4915 1537
4469 1537 -2594 -143 3887 1991 -2676 -1189 3665 3649 -1064 -2465 1608 3133 -794 -2987 -8
4484 -8 3175 55 -3472 -1858 1846 512 -3265 -3171 968 1956 -1145 -2884 -132 1300 -1138 -3366
4500 -3366 -473 2672 1974 -975 -489 2200 1961 -409 -1301 1383 2602 820 -1228 295 2789 1717
4516 1717 -1001 -1128 866 1313 -820 -1935 -276 1318 -447 -2775 -1486 1606 974 -2476 -2819 -107
4532 -107 966 -1634 -2493 476 2879 630 -2364 -223 2909 1876 -1803 -1767 2396 3445 -266 -1814
4548 -1814 1859 4047 214 -2720 -212 3467 1032 -3309 -2023 2491 1993 -3089 -3662 1274 3115
4563 3115 -2045 -4841 -211 2994 -852 -4597 -1078 4205 1784 -4082 -2215 3577 3040 -2992 -3127
4578 -3127 3263 5030 -420 -3418 2012 5721 257 -4470 -44 5064 2001 -3990 -1955 3955 2960
4593 2960 -4090 -4279 2432 3642 -3290 -5650 710 4178 -1279 -5809 -679 4573 903 -4823 -1858
4608 -1858 4542 2272 -4176 -3329 3947 5250 -1782 -3207 3026 5549 -518 -4346 963 5671 1222
4623 1222 -4331 -770 5090 2518 -4219 -3019 3043 2598 -4236 -4769 1985 3709 -2568 -5265 465
4638 465 3805 -1179 -5362 -741 4288 644 -4459 -1529 4268 2458 -3210 -2111 3981 3649 -2068
4653 -2068 -2556 2841 4444 -1112 -3101 1659 4879 237 -3683 -270 3627 164 -4663 -1654 3140
4668 3140 1344 -3671 -2864 2157 1735 -3660 -3822 1537 2578 -2306 -3771 1576 3870 -799 -3902 560
4684 560 4458 692 -3405 119 4626 1614 -3131 -889 4658 3348 -2313 -2254 3163 3055 -2645 -3851
4700 -3851 1540 3570 -1794 -4850 539 3500 -1145 -5652 -1514 3709 168 -5021 -2249 3629 2100
4715 2100 -3852 -3347 3459 3177 -2467 -3581 3200 5329 -494 -3988 1375 5222 742 -3830 49
4730 49 5562 1972 -4343 -2006 4339 2568 -3900 -3780 3051 3029 -3432 -5292 1174 3764 -2585 -5964
4746 -5964 -31 4627 191 -5209 -1206 4231 1468 -4852 -2472 4450 4108 -2306 -3142 3334 4645
4761 4645 -1451 -3571 2228 5371 -243 -4397 535 5516 1251 -4031 -1856 3582 1921 -3829 -3067
4776 -3067 3144 2312 -3660 -4514 1497 3309 -2294 -4316 331 3382 -926 -3927 -29 4064 1360
4791 1360 -3216 -1059 3626 1897 -1981 -901 3267 3081 -1092 -1636 2677 2992 -684 -2597 892 2437
4807 2437 -536 -2602 8 2091 -572 -3365 -1381 1325 -275 -3076 -1649 1382 606 -2395 -1626
4822 -1626 1647 905 -1755 -1507 1947 1930 -1101 -1073 1995 2555 -559 -1490 1826 3068 -198 -1690 1362
4839 1362 3105 -279 -2432 91 2412 25 -3396 -1395 2372 461 -3544 -2018 2040 1293 -3142
4854 -3142 -3232 1745 2195 -2416 -3451 1555 3564 -1358 -4085 1158 4684 631 -3589 -12 5066 1590
4870 1590 -3722 -1094 5010 3165 -3544 -2889 3610 4037 -2425 -4648 1710 4094 -2050 -5633 163
4885 163 4853 -428 -6350 -1995 4675 1263 -5690 -3357 3957 3124 -4704 -4609 3732 5445 -1722 -5012
4901 -5012 2081 6301 -310 -5306 687 6641 1690 -5122 -1551 6629 3438 -4783 -3957 3827 4195
4916 4195 -3762 -5292 2629 5726 -2361 -6772 -427 5048 -660 -7048 -1924 5538 2080 -5792 -3167
4931 -3167 4631 3902 -4599 -4708 3572 5449 -1553 -4478 2609 6488 -318 -5151 630 6155 1399
4946 1399 -4742 -1360 5394 2974 -4286 -3310 3773 3371 -4072 -4999 2257 3869 -2745 -5609 145 4100
4962 4100 -1202 -5177 -621 4181 601 -4808 -1616 4059 2107 -3689 -2281 3754 3898 -2000 -2406
4977 -2406 3043 4061 -1255 -3275 1757 4302 235 -3192 283 3731 497 -4080 -1452 2511 195
4992 195 -3592 -2270 2216 1367 -3403 -2984 1148 1709 -2498 -2968 1231 2874 -1356 -3349 1211 3140
5008 3140 -161 -2414 1005 4055 1066 -2359 -69 3323 1619 -2706 -1008 3475 2280 -2109 -2128
5023 -2128 2288 1835 -3164 -3348 1519 3044 -1381 -3881 766 2338 -2176 -4567 -814 3232 362
5038 362 -3798 -637 3885 1683 -3957 -2231 3472 2978 -1860 -2128 3641 4183 -1540 -3584 1673 4698
5054 4698 -263 -3483 617 4615 437 -4822 -1659 3881 1406 -4321 -2504 3407 2234 -4344 -4552
5069 -4552 1390 2893 -2423 -4420 1736 4776 -772 -4712 -417 4138 302 -4068 -551 5443 3253
5084 3253 -2700 -1834 3728 3748 -2374 -3153 2805 4258 -1188 -3787 1224 3912 -829 -4794 -868 3891
5100 3891 415 -4662 -2244 2614 1164 -4383 -3103 2627 2680 -2958 -3520 2056 3242 -1924 -3395 1508
5116 1508 4520 369 -2699 708 4487 594 -3263 -366 3952 2179 -2429 -1133 3030 2600 -2523
5131 -2523 -2993 1711 2361 -2274 -3679 687 2756 -1763 -3959 -205 2458 -738 -3958 -715 2767
5146 2767 295 -3360 -1207 3010 1836 -2187 -1360 3188 2617 -1894 -2116 2522 3513 -1052 -2423 2440
5162 2440 4033 -276 -3550 311 3202 -482 -4138 -1117 3493 668 -3924 -2082 2729 1246 -3808
5177 -3808 -3355 1908 2466 -3044 -3701 1799 3875 -1189 -4072 1092 4406 150 -3694 304 4939 1836
5193 1836 -3779 -962 4657 3067 -3173 -2630 3454 3678 -2776 -3962 1993 4427 -1590 -4975 364
5208 364 4555 -547 -5944 -1680 3870 958 -5282 -2543 4148 3152 -4051 -4227 2834 3953 -2187 -4576
5224 -4576 1855 5806 -338 -4198 734 5948 1658 -4372 -1419 4972 3032 -3815 -2793 3950 3668
5239 3668 -3629 -4705 2069 4227 -2207 -5412 -18 4144 -853 -5060 -1283 4261 1251 -4738 -2928
5254 -2928 3454 2921 -3385 -3063 3239 4184 -1598 -3488 1809 5126 -103 -3751 234 4569 1327 -3271
5270 -3271 -867 3931 2234 -2917 -2713 2605 2634 -2395 -3537 1128 2505 -1608 -4111 -206 2802 -515
5286 -515 -3416 -1272 2518 404 -3135 -1162 2420 2099 -1611 -1557 2246 2514 -1082 -1708 1367 3230
5302 3230 567 -1201 855 2696 487 -1778 -188 1730 919 -1397 -861 768 486 -2072 -1595 404
5318 404 428 -1379 -1353 -179 452 -1376 -1784 41 771 -351 -793 736 1205 190 -589 465 1322 601
5336 601 -9 1316 2095 715 -719 139 1109 78 -1099 37 1599 597 -1536 -1015 977 -154
5352 -154 -2047 -1557 687 495 -1766 -2095 598 845 -1211 -1845 30 1995 0 -1825 -196 2301
5368 2301 654 -1853 63 2797 2110 -1076 -897 2043 1937 -1197 -1773 1575 2651 -640 -2851 40
5384 40 1939 -661 -2960 -767 2289 262 -2672 -1800 1263 725 -2812 -2607 1340 2290 -1092 -2584
5400 -2584 871 2730 -434 -2443 434 3414 1579 -1407 -306 2596 1664 -1862 -1612 2339 2637 -783
5416 -783 -1681 1214 2192 -1178 -2993 -642 2009 275 -2631 -808 1693 141 -3151 -2339 1237 1146
5432 1146 -1385 -1716 1392 1831 -1364 -2536 401 2206 454 -1345 665 2626 1274 -1645 -663 1909
5448 1909 1899 -634 -364 1735 1721 -957 -2093 -5 1354 -671 -1544 86 1246 -451 -2494 -1160
5464 -1160 433 -227 -1547 -965 936 877 -1313 -1293 428 827 -494 -491 1107 1820 334 -489 770 1240
5482 1240 305 -717 750 1960 935 -396 -218 722 50 -1159 -770 486 201 -1499 -1389 171 191
5499 191 -1219 -1480 293 499 -850 -1474 193 741 -427 -805 159 1582 860 -725 79 942 884 -535
5517 -535 -294 1668 1725 12 -532 860 1247 -303 -1043 250 1404 -434 -1813 -652 767 -67 -2149
5534 -2149 -1335 452 534 -1526 -1292 210 667 -1302 -1938 601 1932 264 -998 138 1552 313
5550 313 -1463 -14 2134 1873 -11 -336 1396 1635 -846 -1649 593 1971 -45 -1457 -435 1414
5566 1414 166 -2308 -1784 656 469 -1449 -1821 596 851 -1401 -2379 -36 1666 283 -1422 152
5582 152 1880 713 -1481 -841 1656 2138 -510 -942 1627 2186 23 -1723 104 1866 740 -1352
5598 -1352 -92 2036 695 -1828 -1976 272 447 -1955 -2242 510 1345 -771 -2455 -791 1491 34
5614 34 -2079 -856 1650 1433 -1231 -898 1140 2176 -117 -1322 1059 2653 934 -1371 104 1815
5630 1815 992 -1511 -517 1798 1445 -972 -1832 497 794 -1147 -2433 -71 1640 -214 -2153 -1118
5646 -1118 988 396 -2189 -1640 994 1638 -334 -947 952 2051 97 -1516 431 2000 997 -665
5662 -665 15 1837 1347 -1042 -764 1173 1444 -511 -1523 302 1251 -48 -1828 -752 882 -156
5678 -156 -1696 -1035 378 564 -1542 -1811 33 801 -206 -1098 247 1366 202 -949 -449 1259 1504
5695 1504 -26 311 1725 1465 326 -294 354 918 243 -837 -246 1087 673 -749 -948 -163 198 -438
5713 -438 -1361 -598 140 -512 -1523 -807 235 479 -606 -839 375 767 -73 -552 -276 1422 837 -63
5731 -63 486 1444 1533 247 -949 786 1497 155 -558 -64 1691 576 -1113 -879 347 182 -1320 -1679
5749 -1679 48 669 -1057 -2009 -694 1204 -456 -2182 -567 1060 563 -1267 -765 1484 1626 -480
5765 -480 -599 1509 2314 208 -1275 274 1877 653 -1417 113 2227 1248 -1244 -1327 926 973 -1770
5782 -1770 -2182 294 1361 -1045 -2323 -550 1384 -698 -2602 -962 1154 694 -1858 -1167 1790 1368
5798 1368 -1144 -953 1620 2279 -174 -1697 682 2668 373 -1427 738 2811 926 -1828 -930 1696
5814 1696 837 -1718 -1236 1025 1619 -1598 -2378 -248 1069 -1506 -2840 -142 1650 -379 -2352 -591
5830 -591 1593 341 -2280 -699 2147 1674 -1049 -1035 1796 2115 -872 -1402 1653 2537 -104 -1589 587
5847 587 1972 -183 -2021 -498 1999 735 -1804 -585 1464 302 -2644 -2000 636 1044 -1750 -2127
5863 -2127 915 1269 -1002 -2530 403 1731 -32 -1893 551 2732 795 -1655 -755 2791 1328
5878 1328 -1590 -903 2127 2217 -1536 -2048 1370 1952 -1021 -2241 608 2239 -567 -3419 -755 2016
5894 2016 51 -3101 -1498 2087 1022 -2690 -2337 1519 1633 -1989 -2470 1556 3399 -446 -2434 875
5910 875 3487 447 -2699 8 3736 1635 -2400 -1110 2763 2185 -2318 -2109 2098 2532 -2087 -3204
5926 -3204 507 2944 -1256 -3646 -285 2988 444 -3641 -1713 2486 1019 -2941 -2210 2514 2992
5941 2992 -1671 -2766 1763 3174 -730 -2890 1026 4028 1275 -2868 -198 3155 1533 -2787 -1546
5956 -1546 2823 2080 -2295 -2511 1605 2229 -1455 -3332 160 2301 -719 -3535 -861 2260 532 -3156
5972 -3156 -1954 1805 1611 -1946 -1705 1918 2251 -1191 -2468 1282 3244 235 -1392 525 3082 1135
5988 1135 -1957 -641 2428 1351 -1567 -1111 1471 1287 -1181 -2321 327 1301 -522 -2468 -527 1551
6004 1551 -487 -2125 -927 871 40 -1563 -959 1183 867 -625 -945 734 1450 237 -613 814
6020 814 1624 640 -248 329 1074 407 -475 -122 895 508 -407 -437 -17 215 -696 -653 -385 -345 -574 -285 -218
6041 -218 -391 -249 -239 -239 -511 -228 255 348 103 89 855 836 245 25 735 1103 422 -363 69 1079 644 -720
6063 -720 -360 1051 581 -800 -929 276 747 -1202 -1680 -71 840 -742 -1787 -552 1099 15 -1866
6080 -1866 -817 1319 357 -1356 -1255 1398 1731 -678 -1304 1179 2272 35 -1174 462 2554 892
6096 892 -1647 -195 2033 764 -1752 -797 1485 1101 -1302 -2082 630 1175 -1336 -2446 213 1364
6112 1364 -692 -2197 -450 1496 196 -1959 -1139 1732 1260 -1324 -1145 1761 1872 -697 -1310 1168
6128 1168 2420 -282 -1572 794 2270 500 -1533 -173 1820 740 -1724 -1218 1341 908 -1411
6143 -1411 -1714 500 1008 -1082 -2238 401 1283 -678 -2006 -54 1516 -11 -1754 -227 1691 665
6159 665 -910 -261 1729 1402 -883 -961 1490 1739 -399 -633 1111 1816 -665 -1517 -17 959 -257
6176 -257 -1471 -243 1201 228 -1912 -1051 755 -150 -1824 -1152 715 446 -1291 -1137 741 1181 -955
6193 -955 -1275 813 1808 -3 -1151 683 2012 458 -1025 122 2274 845 -1410 -466 1650 962
6209 962 -1267 -1318 1380 1240 -1402 -2004 466 1312 -1380 -2609 -178 1575 -173 -2136 -462 1725
6225 1725 268 -2029 -1111 1930 1217 -1328 -1019 2007 2250 -762 -1261 1586 2393 -91 -1271 629
6241 629 2662 226 -1838 -227 2106 847 -2105 -1234 1498 1109 -1928 -2353 433 1365 -753 -2307
6257 -2307 161 1772 -794 -2443 -739 1897 293 -2101 -530 2165 1341 -1005 -634 1501 1939 -847
6273 -847 -1199 1032 2300 42 -1277 112 2091 39 -1901 -590 1427 641 -1672 -1042 807 851
6289 851 -1255 -1611 327 1097 -1048 -1621 286 1026 -623 -1513 94 1281 634 -899 -300 1119 781
6306 781 -638 -365 1137 1360 187 56 579 1000 96 -784 -142 433 111 -862 -277 166 -131 -567 -560 -84
6326 -84 -586 -678 -661 -28 -31 -265 -346 -342 49 -32 227 398 -77 251 449 317 399 70 302 910 489 192 492
6349 492 739 185 -392 -73 711 407 -484 -552 227 273 -1237 -1139 -384 393 -670 -1122 -284 574 -85 -1132
6369 -1132 -348 895 252 -824 -248 1228 1196 -395 -551 897 1561 -413 -788 796 1439 87 -1040
6386 -1040 -350 1278 439 -984 -491 1226 419 -1811 -1270 441 654 -1405 -1429 287 746 -773 -1740
6403 -1740 -133 961 -306 -1302 -272 1379 1142 -870 -290 1272 1001 -423 -185 1461 1610 -112
6419 -112 -796 864 1722 104 -786 -13 1241 286 -1213 -801 631 360 -997 -983 115 606 -1155 -1364
6437 -1364 -564 465 -355 -969 -186 829 411 -756 -2 771 789 -346 159 1024 1086 250 129 687 890
6456 890 286 -41 398 346 208 -269 -57 204 -225 -356 -369 50 -401 -647 -509 -690 -626 -662 -17 -165 -280
6477 -280 -248 680 376 -273 -415 354 588 -230 -210 685 1120 351 -730 561 1103 365 -571 22 773 795
6497 795 -875 -529 592 220 -1114 -1186 304 609 -980 -1519 -103 779 -548 -1713 -375 1372 85
6514 85 -1813 -641 1012 1104 -1091 -679 1513 1865 -316 -1074 931 2052 -165 -1489 602 2012 450
6531 450 -1687 -341 1810 893 -1847 -1197 1065 937 -1660 -2073 761 1099 -1189 -2439 320 2015
6547 2015 2 -2233 -391 1640 474 -1705 -832 2199 1603 -1488 -1167 1589 1946 -712 -1521 984
6563 984 2435 69 -1891 421 2146 150 -2175 -725 1853 520 -1834 -1525 1406 848 -1899 -1908
6579 -1908 722 1570 -1288 -2221 169 1511 -803 -2162 -136 2114 479 -1610 -407 1739 1222 -1293
6595 -1293 -764 1923 1659 -928 -1228 1531 1787 -474 -1537 841 1808 -449 -1884 -84 1337 -233
6611 -233 -2126 -729 1029 98 -1952 -1199 1130 897 -1292 -1418 827 1084 -1063 -1445 448 1972 -303
6628 -303 -1304 943 2345 359 -1578 576 1968 765 -1341 -141 1874 870 -1797 -1198 1048
6643 1048 1120 -1230 -1464 733 1344 -1175 -2094 -159 1410 -467 -2437 -302 1754 43 -1728 -446
6659 -446 1860 552 -1573 -789 1805 1667 -1228 -1221 1299 2269 -503 -1639 1370 2367 -25 -1960 -164
6676 -164 2224 152 -2418 -553 1654 558 -2004 -1876 1008 1119 -1741 -2096 514 1579 -1124 -2436
6692 -2436 138 1946 -229 -2109 -322 2180 1008 -1642 -630 1931 1458 -1210 -945 1835 2366 -561
6708 -561 -1446 907 1848 -230 -2077 66 1943 -110 -1979 -738 1349 253 -2015 -1321 1306 1176
6724 1176 -1212 -2016 314 1057 -753 -1938 464 1807 142 -1320 -122 1717 855 -628 -328 1347
6740 1347 1210 -438 -653 1111 1149 -469 -779 282 1304 133 -927 -94 515 -456 -1179 -828 317
6757 317 438 -501 -428 -43 -179 -763 -762 113 249 128 115 448 268 -457 106 230 528 531 317 511 811 379
6779 379 343 364 338 -156 119 667 542 -804 -702 366 -151 -1251 -1005 593 300 -1109 -1337 80 267
6798 267 -875 -1048 474 1054 -64 -1217 -159 972 472 -1093 -282 1795 1351 -651 -633 1375 1459
6815 1459 -1010 -1121 1138 1831 -303 -1631 25 1738 -182 -2081 -509 1862 880 -2077 -1545 1295
6831 1295 1006 -2165 -2237 817 1970 -1065 -2326 627 2268 -283 -2724 -240 2553 1250 -1895 -367
6847 -367 2838 1812 -1550 -1638 1946 2641 -1097 -1856 1250 2754 -947 -2727 -32 2675 0 -2782
6863 -2782 -1195 2214 625 -2683 -1948 1546 1393 -2148 -2175 1214 2234 -1397 -3115 377 3016 31
6879 31 -2176 -4 3397 1031 -2501 -635 2634 1594 -1562 -1381 1722 2204 -1081 -2215 1035 2016
6895 2016 -1071 -2664 235 2054 -426 -2775 -910 1841 18 -2455 -1333 1965 1279 -2283 -1968
6910 -1968 1414 1881 -1187 -1730 1131 2787 -239 -1893 284 2405 444 -2053 58 2695 1272
6925 1272 -2072 -963 2015 1029 -1624 -1716 1460 1710 -1597 -2528 626 1867 -1082 -2569 -331 1967
6941 1967 -509 -2560 -549 1605 601 -2230 -614 2221 1181 -1347 -1186 1584 1743 -1344 -1490 1485
6957 1485 2269 45 -1564 864 2354 12 -2145 -132 2050 608 -2234 -784 1705 954 -2287
6972 -2287 -1709 1355 1235 -1573 -2138 692 1642 -1255 -2499 211 2360 33 -2261 -296 2172 688
6988 688 -1937 -546 2443 1851 -1504 -1415 1880 2008 -1110 -1793 655 2198 -246 -2075 125 2180
7004 2180 -72 -2501 -914 1911 210 -2103 -1517 1313 1185 -1533 -1835 1072 1846 -688 -2099 615
7020 615 2234 -79 -1614 -15 2241 734 -1282 -490 1705 1535 -1368 -1415 1606 1939 -753 -1250 601
7037 601 1584 -66 -2084 -229 1138 62 -1932 -638 1194 220 -1722 -1479 810 510 -1133 -1487
7053 -1487 373 1118 -458 -956 390 1499 337 -1002 -31 935 906 -170 -293 1274 1086 -163 -286
7070 -286 889 946 -211 -972 195 568 -205 -836 -203 673 -125 -946 -595 -79 24 -746 -397 -139 129
7089 129 -235 -188 -157 511 123 -77 412 303 618 250 493 181 432 530 336 133 91 324 112 -119 -584
7110 -584 202 417 -262 -480 -360 327 -190 -626 -705 643 -11 -1083 -767 506 566 -403 -501 664 777 -218
$$ [...]
8191E23
##END NTUPLES=NMR FID
##END=
