##TITLE=1H_LR-629-H2
 D2O, 8 sc, 
 17.10.2019
##JCAMPDX= 6.0         $$ Bruker NMR JCAMP-DX V2.0
##DATA TYPE= NMR FID
##DATA CLASS= NTUPLES
##ORIGIN= UXNMR, Bruker Analytische Messtechnik GmbH
##OWNER= root
$$ XWIN-NMR		Version 3.5
$$ Thu Oct 17 13:51:57 2019 Russian Standard Time (UT+4h)  she@DPX200
##.OBSERVE FREQUENCY= 200.1315
##.OBSERVE NUCLEUS= ^1H
##.DELAY= (6, 6)
##.ACQUISITION MODE= SIMULTANEOUS
##.ACQUISITION SCHEME= undefined
##.AVERAGES= 8
##.DIGITISER RES= 18
##SPECTROMETER/DATA SYSTEM= spect
##.PULSE SEQUENCE= zg30
##.SOLVENT NAME= D2O
##.SHIFT REFERENCE= (INTERNAL, D2O, 0, 15.7039)
##AUDIT TRAIL= $$ (NUMBER, WHEN, WHO, WHERE, WHAT)
$$ ##TITLE= Audit trail, XWIN-NMR		Version 3.5
$$ ##JCAMPDX= 5.01
$$ ##ORIGIN= Bruker BioSpin GmbH
$$ ##OWNER= she
$$ F:/spectra/data/she/nmr/H-F/1/audita.txt
$$ ##AUDIT TRAIL=  $$ (NUMBER, WHEN, WHO, WHERE, WHAT)
(   1,<2019-10-17 13:51:02.03 +0400>,<she>,<DPX200>,
      <created by zg, POWCHK disabled, PULCHK disabled
       configuration hash MD5:
       00 E9 B6 7A A2 85 ED C7 34 08 36 98 17 FE 4E 26
       data hash MD5: 16K
       76 50 AB A4 69 CE E2 BC 21 00 FF 1C FB 39 66 E5>)
$$ ##END=
$$ 
$$ hash MD5
$$ 3B FE CB 20 28 9D FB F5 56 5D 9D C9 25 33 89 2A
##$RELAX= 
##$RELAX= 
##$RELAX= 
##$RELAX= 
##$RELAX= 
##$RELAX= 
$$ Bruker specific parameters
$$ --------------------------
##$DU= <F:/spectra>
##$EXPNO= 1
##$NAME= <H-F>
##$PROCNO= 1
##$TYPE= <nmr>
##$USER= <she>
##$AMP= (0..31)
100 100 100 100 100 100 100 100 100 100 100 100 100 100 100 100 100 100 
100 100 100 100 100 100 100 100 100 100 100 100 100 100 
##$AQSEQ= 0
##$AQ_mod= 1
##$AUNM= <au_zg>
##$AUTOPOS= <>
##$BF1= 200.13
##$BF2= 200.13
##$BF3= 200.13
##$BF4= 200.13
##$BF5= 200.13
##$BF6= 200.13
##$BF7= 200.13
##$BF8= 200.13
##$BYTORDA= 1
##$CFDGTYP= 0
##$CFRGTYP= 5
##$CHEMSTR= <none>
##$CNST= (0..31)
1 1 145 1 1 1 1 1 1 1 1 1 1 1 1 1 1 1 1 1 1 1 1 1 1 1 1 1 1 1 1 1 
##$CPDPRG= <>
##$CPDPRG1= <>
##$CPDPRG2= <>
##$CPDPRG3= <>
##$CPDPRG4= <mlev>
##$CPDPRG5= <mlev>
##$CPDPRG6= <mlev>
##$CPDPRG7= <mlev>
##$CPDPRG8= <mlev>
##$CPDPRGB= <>
##$CPDPRGT= <>
##$D= (0..31)
0 1.2 0 0 0 0 0 0 0 0.06 0 0.03 0 0 0 0 0.0002 0 0 0 0 0 0 0 0 0 0 0 0 
0 0 0 
##$DATE= 1571305861
##$DBL= (0..7)
120 120 120 120 120 120 120 120 
##$DBP= (0..7)
150 150 150 150 150 150 150 150 
##$DBP07= 0
##$DBPNAM0= <>
##$DBPNAM1= <>
##$DBPNAM2= <>
##$DBPNAM3= <>
##$DBPNAM4= <>
##$DBPNAM5= <>
##$DBPNAM6= <>
##$DBPNAM7= <>
##$DBPOAL= (0..7)
0.5 0.5 0.5 0.5 0.5 0.5 0.5 0.5 
##$DBPOFFS= (0..7)
0 0 0 0 0 0 0 0 
##$DE= 6
##$DECBNUC= <off>
##$DECIM= 24
##$DECNUC= <off>
##$DECSTAT= 4
##$DIGMOD= 1
##$DIGTYP= 9
##$DL= (0..7)
0 120 120 120 120 120 120 120 
##$DP= (0..7)
150 150 150 150 150 150 150 150 
##$DP07= 0
##$DPNAME0= <>
##$DPNAME1= <>
##$DPNAME2= <>
##$DPNAME3= <>
##$DPNAME4= <>
##$DPNAME5= <>
##$DPNAME6= <>
##$DPNAME7= <>
##$DPOAL= (0..7)
0.5 0.5 0.5 0.5 0.5 0.5 0.5 0.5 
##$DPOFFS= (0..7)
0 0 0 0 0 0 0 0 
##$DQDMODE= 0
##$DR= 18
##$DS= 0
##$DSLIST= <SSSSSSSSSSSSSSS>
##$DSPFIRM= 0
$$ [...]
##$SUBNAM2= <"">
##$SUBNAM3= <"">
##$SUBNAM4= <"">
##$SUBNAM5= <"">
##$SUBNAM6= <"">
##$SUBNAM7= <"">
##$SUBNAM8= <"">
##$SUBNAM9= <"">
##$SW= 24.0689530833862
##$SWIBOX= (0..15)
0 0 2 0 0 0 0 0 0 0 0 0 0 0 0 0 
##$SW_h= 4816.95568400771
##$TD= 16384
##$TD0= 1
##$TE= 0
##$TE2= 300
##$TE3= 300
##$TEG= 300
##$TL= (0..7)
0 120 120 120 120 120 120 120 
##$TP= (0..7)
150 150 150 150 150 150 150 150 
##$TP07= 0
##$TPNAME0= <>
##$TPNAME1= <>
##$TPNAME2= <>
##$TPNAME3= <>
##$TPNAME4= <>
##$TPNAME5= <>
##$TPNAME6= <>
##$TPNAME7= <>
##$TPOAL= (0..7)
0.5 0.5 0.5 0.5 0.5 0.5 0.5 0.5 
##$TPOFFS= (0..7)
0 0 0 0 0 0 0 0 
##$TUNHIN= 0
##$TUNHOUT= 0
##$TUNXOUT= 0
##$USERA1= <user>
##$USERA2= <user>
##$USERA3= <user>
##$USERA4= <user>
##$USERA5= <user>
##$V9= 5
##$VALIST= <valist>
##$VCLIST= <CCCCCCCCCCCCCCC>
##$VD= 0
##$VDLIST= <DDDDDDDDDDDDDDD>
##$VPLIST= <PPPPPPPPPPPPPPP>
##$VTLIST= <TTTTTTTTTTTTTTT>
##$WBST= 1024
##$WBSW= 4
##$XGAIN= (0..3)
0 0 0 0 
##$XL= 0
##$YL= 0
##$YMAX_a= 507122
##$YMIN_a= -776365
##$ZGOPTNS= <>
##$ZL1= 120
##$ZL2= 120
##$ZL3= 120
##$ZL4= 120
##$ABSF1= 10
##$ABSF2= 0
##$ABSG= 5
##$ABSL= 3
##$ALPHA= 0
##$AQORDER= 0
##$ASSFAC= 0
##$ASSFACI= 0
##$ASSFACX= 0
##$ASSWID= 0
##$AUNMP= <proc_1d>
##$AZFE= 0.1
##$AZFW= 0.1
##$BCFW= 1
##$BC_mod= 2
##$BYTORDP= 1
##$COROFFS= 0
##$CY= 11.3945322036743
##$DATMOD= 1
##$DC= 2
##$DFILT= <>
##$DTYPP= 0
##$F1P= 20.1720416913024
##$F2P= 0.152960286110954
##$FCOR= 0.5
##$FTSIZE= 0
##$FT_mod= 4
##$GAMMA= 1
##$GB= 0.15
##$INTBC= 1
##$INTSCL= 1
##$ISEN= 128
##$LB= 0.24
##$LEV0= 0
##$LPBIN= 0
##$MAXI= 10000
##$MC2= 0
##$MEAN= 0
##$ME_mod= 0
##$MI= 1.114404
##$NCOEF= 0
##$NC_proc= 0
##$NLEV= 6
##$NOISF1= 3.799351
##$NOISF2= 2.8
##$NSP= 1
##$NTH_PI= 0
##$NZP= 0
##$OFFSET= 15.70392
##$PC= 1
##$PHC0= -9577.901
##$PHC1= 19.60091
##$PH_mod= 1
##$PKNL= yes
##$PPARMOD= 0
##$PSCAL= 0
##$PSIGN= 0
##$REVERSE= no
##$SF= 200.130013532006
##$SI= 16384
##$SIGF1= 3
##$SIGF2= 2
##$SINO= 400
##$SIOLD= 16384
##$SREGLST= <1H.CDCl3>
##$SSB= 0
##$STSI= 0
##$STSR= 0
##$SW_p= 3612.71676300578
##$SYMM= 0
##$S_DEV= 0
##$TDeff= 0
##$TDoff= 0
##$TI= <>
##$TILT= no
##$TM1= 0
##$TM2= 0
##$TOPLEV= 0
##$USERP1= <user>
##$USERP2= <user>
##$USERP3= <user>
##$USERP4= <user>
##$USERP5= <user>
##$WDW= 1
##$XDIM= 8192
##$YMAX_p= 0
##$YMIN_p= 0
$$ End of Bruker specific parameters
$$ ---------------------------------
##NTUPLES= NMR FID
##VAR_NAME=  TIME,          FID/REAL,        FID/IMAG
##SYMBOL=    X,             R,               I
##VAR_TYPE=  INDEPENDENT,   DEPENDENT,       DEPENDENT
##VAR_FORM=  AFFN,          ASDF,            ASDF
##VAR_DIM=   8192,          8192,            8192
##UNITS=     SECONDS,       ARBITRARY UNITS, ARBITRARY UNITS
##FACTOR=    0.0002076,     1,               1
##FIRST=     0,             0,               0
##LAST=      1.7004516,     0,               0
##MIN=       0,             -776365,         0
##MAX=       1.7004516,     507122,          0
$$ Real data points
##PAGE= N=1
##DATA TABLE= (X++(R..R)), XYDATA
0 0 0 0 0 -8 8 -8 8 -16 16 -26 32 -40 56 -64 80 -97 115 -138 162 -194 227 -260 307 -352 403 -465 529
27 529 -602 681 -769 869 -974 1092 -1223 1366 -1521 1689 -1880 2087 -2311 2562 -2836 3139
43 3139 -3477 3849 -4274 4747 -5285 5907 -6625 7473 -8492 9738 -11309 13352 -16147
56 -16147 20217 -26709 38783 -68922 304835 317670 -431804 -542207 -355741 -29460 129997
67 129997 297423 324036 203910 -31729 -116358 -121035 -164845 -266403 -141894 218419 507122
78 507122 368604 -44089 -342190 -320024 -168338 -35740 100502 270766 295674 95368
88 95368 -152893 -218261 -160403 -133798 -100499 84423 309227 301310 26053 -230156 -266056
99 -266056 -175121 -103817 -8491 172042 307458 214339 -57633 -271730 -295830 -198634 -63743
110 -63743 110666 283737 297926 74639 -215778 -323858 -217267 -65627 24957 105677 199862
121 199862 201166 45165 -156215 -247619 -212640 -123770 -86 165475 278866 205700 -34314
132 -34314 -244666 -267859 -143835 -10131 77224 144058 179867 125324 -20291 -161746 -211656
143 -211656 -164872 -57844 87533 225455 255010 110166 -127713 -272759 -222031 -49738
153 -49738 99822 165637 174976 137983 30386 -123453 -217796 -173524 -30115 112915 200062
164 200062 215426 131954 -49408 -219544 -235816 -86056 89388 167510 164101 141352 84720
175 84720 -46430 -192310 -220569 -89799 89975 197083 210752 158602 34916 -138013 -244905
186 -244905 -174720 14966 155098 172983 142641 111080 19729 -140755 -235380 -147399 43224
197 43224 165480 171114 133859 75515 -45190 -186598 -208433 -68190 99895 160056 131184
208 131184 94493 35098 -93116 -209711 -172724 7330 152025 152444 82336 34801 -20249
219 -20249 -123916 -187570 -106606 55527 141020 114236 67764 33743 -50756 -174003 -199217
230 -199217 -63545 106159 156027 101785 46471 -117 -93955 -190992 -167970 -16956 118407
241 118407 137175 92205 53899 -12438 -135078 -214954 -140427 32152 140402 129618 78624
252 78624 32854 -49189 -158817 -186794 -77750 67328 122603 97929 67971 29564 -64990
263 -64990 -168266 -162165 -32981 95249 124838 89968 51291 -7515 -102497 -158451 -97308 31555
275 31555 105463 94516 65419 43884 -18119 -115701 -149433 -63241 63514 122733 106975 69366
287 69366 14844 -73968 -144138 -113433 5037 104544 120932 89506 51812 -9392 -97512 -142531
299 -142531 -81916 40967 123441 127501 88024 30408 -50523 -125477 -125119 -32759 77195 125999
311 125999 109898 69045 10638 -70533 -128811 -102807 -1196 92646 120854 96681 50784 -15840
323 -15840 -90845 -121175 -69537 25886 93118 106507 83479 34738 -39873 -107295 -112485 -43766
335 -43766 47481 101382 101885 61357 -2734 -71603 -109800 -86518 -12284 64295 99245 82601
347 82601 31941 -31567 -86993 -104548 -65884 10628 77001 95933 66051 7473 -56884 -100315
359 -100315 -98863 -46282 32057 91005 96477 47675 -25884 -84061 -100920 -75525 -19502 46133
371 46133 88540 78957 23064 -39462 -77282 -87886 -73399 -22356 56304 108138 84542 4463
383 4463 -68487 -96849 -87209 -47195 22577 89721 97402 34453 -41039 -70487 -61555 -49426 -29350
396 -29350 21686 80316 85596 25878 -41582 -69008 -66181 -53041 -11893 62554 111638 73828
408 73828 -21203 -79726 -67264 -35947 -18887 13710 73824 98347 41012 -40953 -66123 -43087
420 -43087 -32848 -29318 20858 97160 107433 28434 -52593 -66833 -49091 -44943 -20239 58629
432 58629 127992 98252 -7970 -80828 -71719 -36787 -19372 11679 75041 106855 50888 -37275
444 -37275 -63257 -31007 -19043 -34546 -4405 78097 112393 42829 -47535 -66006 -37552 -29347
456 -29347 -21368 36520 100108 78484 -14748 -69347 -43847 -10608 -18278 -16854 37293 86323 55947
469 55947 -22922 -61423 -43587 -27096 -28097 3164 71577 95772 26846 -64030 -82146 -39682
481 -39682 -12616 -8178 26511 80642 73204 -9958 -80178 -73834 -33718 -14242 5166 55036 87977
494 87977 40899 -50230 -89923 -54623 -10680 -1411 8403 45243 67322 29294 -40151 -73296
506 -73296 -57507 -30280 -6461 33556 76156 65849 -8360 -77310 -73935 -23363 7462 8511
518 8511 19399 45036 43426 -1739 -48370 -57212 -37968 -13960 16699 54953 68129 26534 -41932
531 -41932 -75033 -49170 -1895 25240 32043 37656 35895 7696 -35848 -57172 -36982 1513 28180
544 28180 38917 42185 30853 -5188 -46647 -56099 -23937 16023 34887 38115 39604 28060 -11154
557 -11154 -54438 -56984 -14362 31557 45186 36417 27950 14025 -17199 -47923 -42666 -3726 29175
570 29175 34254 30660 33350 21107 -22604 -61567 -47821 6387 44499 42811 29604 23366 654
583 654 -42409 -61451 -23223 32447 47476 26351 13483 15303 -4969 -46488 -56741 -12495 39057
596 39057 47155 26127 14413 4742 -28943 -63184 -44879 17653 55141 35479 5181 4072 3258
609 3258 -30892 -63075 -38910 22596 52566 34380 12286 5111 -16301 -55244 -61213 -10105 45261
622 45261 46120 12030 -353 6193 -12974 -53751 -56891 -4267 45167 41526 13509 4105 -1358
635 -1358 -33310 -61410 -35398 24927 50125 23766 -2253 516 -3956 -36028 -51459 -14292 35651
648 35651 40712 9746 -5707 1829 -6691 -36390 -40843 -245 38847 34231 7231 -915 -706 -20932
662 -20932 -43460 -25077 25352 47706 21384 -6393 -3980 841 -19826 -37025 -14034 27397
674 27397 39955 20659 5829 2670 -12610 -38375 -36441 5452 44734 42031 14214 -1512 -6421
687 -6421 -20944 -36003 -21272 19264 43716 32001 8429 -855 -6812 -23345 -34638 -14791 23485
700 23485 41824 30352 11051 -2258 -17342 -35114 -31930 2539 36911 39775 16662 -1587
712 -1587 -7893 -16012 -27513 -22415 4804 29816 31374 18053 3836 -11587 -28925 -34675 -14079
725 -14079 19372 37317 28260 5752 -12334 -22331 -26052 -20568 -900 22481 31192 17246 -4800
738 -4800 -17530 -20418 -20237 -14187 3541 22915 26113 9671 -8793 -18465 -22515 -21328 -9474 12346
752 12346 28403 23482 829 -19597 -25568 -18960 -9020 1619 13302 22367 15916 -4215 -19857
765 -19857 -20294 -14126 -10993 -3183 16120 30867 19110 -9631 -26566 -23454 -14341 -6621 8180 26767
779 26767 28439 5220 -20115 -24167 -12526 -5474 -4638 5142 22849 26968 6931 -16138 -21545 -14397
793 -14397 -10632 -5737 14224 35421 27538 -6014 -27966 -20054 -4889 -2894 12 18811 32264
806 32264 16331 -14069 -23181 -9521 -1900 -6332 874 24341 33402 9694 -20073 -22240 -7297
819 -7297 -1664 -3606 10005 30773 27293 -5094 -27154 -16610 1878 1515 -3589 11059 30350
832 30350 21623 -9770 -25868 -13859 -1701 -3153 2538 25014 35080 7449 -28561 -30814 -4234
845 -4234 9831 2149 3196 20954 23647 -2554 -26540 -19263 -545 672 -2904 12207 31130
858 31130 18433 -18929 -35878 -15623 8642 8956 1671 9274 18474 4700 -20201 -23898 -4615
871 -4615 5547 -2951 -2729 16907 26206 1504 -29200 -28149 -3875 6980 1067 6325 21107 16218
885 16218 -12980 -32437 -19514 2593 6684 2269 9929 18801 6672 -18654 -27067 -10475 5244
898 5244 2609 -1490 9813 21264 8805 -17929 -27546 -12972 2265 4967 8516 18014 16269 -6491
912 -6491 -26443 -18699 2977 9216 472 -336 12316 15955 -190 -17150 -17240 -6021 2360 7373
926 7373 15412 18598 4856 -18328 -25412 -7080 14021 16237 5181 481 4410 1921 -9080 -12657
940 -12657 -2872 7980 8217 6175 9365 9198 -3898 -19182 -15879 3411 17039 13440 4928 4052
954 4052 3962 -5360 -16937 -14096 2989 16116 15719 9095 5212 -1000 -14206 -20866 -8007 12934
968 12934 19915 10083 1590 3381 1465 -11675 -21197 -9857 11284 20399 13466 4029 -397 -8148
982 -8148 -18194 -15713 2909 18573 13218 -1707 -4368 4063 1877 -12274 -17797 -3105 12215
995 12215 11556 3250 2920 2939 -8523 -21205 -13472 9113 18746 6853 -4848 -2164 896 -8835 -17880
1010 -17880 -7276 12616 16919 2734 -6641 -3459 -2514 -12206 -14760 1006 17928 13299 -3844
1023 -3844 -8300 -1264 -3351 -15943 -13636 8809 23482 11034 -8726 -11652 -4402 -5712 -10920 -2670
1037 -2670 13648 14607 -194 -7939 -382 3024 -9602 -18856 -4961 18537 21612 3580 -10732
1050 -10732 -8040 -4492 -8013 -6273 7989 17329 7022 -7434 -5076 4759 -217 -14580 -11656 11004
1064 11004 23334 10472 -7748 -10078 -3904 -4179 -5755 3896 16107 12425 -2748 -8251 -295 3085
1078 3085 -6045 -10584 2673 17898 13678 -2347 -7710 -621 1570 -6233 -7558 4192 13728 8917
1092 8917 410 771 1875 -7203 -15337 -6181 13238 18978 5765 -5854 -3456 792 -4204 -9313
1106 -9313 -2223 9484 9981 2751 -733 548 -2835 -10895 -8601 5182 14662 8411 -3722 -6999
1120 -6999 -2457 -1994 -5033 -2520 6257 9768 3244 -5243 -5938 -3620 -5041 -5998 1860 11702 10601 -1479
1136 -1479 -10129 -7834 -4294 -5196 -3443 5340 12335 8619 -1533 -8048 -9949 -10231 -7532 1726 13249
1151 13249 15378 4924 -8561 -14199 -9699 -2802 274 2458 6347 8608 3645 -4406 -8750 -8191
1165 -8191 -6235 -2363 5836 12075 7707 -4003 -11244 -6777 1226 3305 -278 -2288 583 4426 3645
1180 3645 -838 -4417 -4781 -2354 898 5364 7471 2383 -6240 -8210 -541 7019 4342 -2356 -1916
1195 -1916 4408 4588 -1891 -5781 -1561 3262 3109 1202 2794 4391 685 -5125 -3552 2809 3788 -1887
1211 -1887 -2037 6572 11107 2256 -9099 -8419 1732 5437 -34 -1113 6069 9397 1630 -5485 -4267
1226 -4267 -1480 -3744 -4207 5869 17088 11118 -8044 -16300 -5107 5989 3470 -1783 3852 10610
1240 10610 4066 -8461 -9760 -522 2720 -2459 -244 11171 12882 -3654 -17691 -11189 4300
1253 4300 7428 625 2023 9637 5771 -10605 -17799 -5653 8347 6798 -460 2802 9876 1751
1267 1751 -14977 -16591 -929 8720 2622 -1324 7477 10997 -3908 -19682 -13703 4318 9748 1766
1281 1766 -490 6366 4799 -9382 -16279 -4094 9667 6735 -4044 -3477 6041 4206 -8429 -11562
1295 -11562 904 9711 1788 -5789 -270 6511 -1050 -13016 -7350 9691 13579 -374 -9575 -3114
1309 -3114 3296 -1453 -6013 977 9153 4324 -5798 -4570 5333 4513 -6593 -10495 1301 11549
1323 11549 6534 -3845 -4019 2876 2447 -4859 -5713 2450 6430 322 -2199 3789 7988 -56 -9408
1338 -9408 -6530 3570 6354 1074 -417 4929 7662 252 -7538 -6680 -136 3495 3545 5119 6611
1353 6611 3045 -5014 -8247 -2725 4092 3656 487 1115 5040 4598 -2165 -7362 -5378 495 4581 5036
1369 5036 4339 2667 -1801 -6818 -6864 63 6659 6444 1225 -2116 -1100 -1303 -4430 -4709 1190 7691
1385 7691 6903 -338 -4432 -3381 -2686 -4536 -3266 4487 9212 3852 -5190 -6494 -1940 -1118 -5010 -3196
1401 -3196 5976 9868 2162 -6980 -6862 -1505 -853 -4197 -975 7443 7470 -2707 -9034 -3621 2807 -844
1417 -844 -6072 -50 9180 5736 -6596 -9622 -348 4516 -1833 -5172 2186 8127 881 -8388 -5770
1432 -5770 3859 3577 -4841 -5117 4681 8316 -1477 -8819 -2797 5566 1638 -6509 -3427 7655 7820
1447 7820 -3814 -7862 1346 6193 -2040 -8027 117 9588 4525 -5994 -3298 6128 4337 -7438
1461 -7438 -9466 3930 11276 3824 -4573 -1044 3779 -887 -7572 -2466 8801 8548 -2513 -6382
1475 -6382 1625 7263 -803 -7923 -1616 8104 6017 -2179 -2113 3717 1629 -6884 -5075 6737 11877
1490 11877 976 -8048 -3997 4039 2141 -3620 -896 6303 5684 -2286 -4268 462 1566 -4213 -5025
1505 -5025 4294 11305 5371 -5641 -7878 -2072 945 -1233 -150 5565 6352 -1142 -5716 -2657 784
1520 784 -1828 -4748 680 7998 5812 -2834 -6243 -2484 -136 -2267 -2113 3039 5071 711 -3848
1535 -3848 -2609 134 -1604 -3961 -1357 3680 3238 -1570 -3051 -138 731 -1952 -3412 -568 2214
1550 2214 1566 -40 -29 -505 -2837 -4934 -1477 4383 5292 -5 -4348 -3746 -875 678 1785 2270 696
1567 696 -2985 -3538 729 4128 765 -3894 -3566 1019 4183 2454 286 -1825 -3810 -3581 1118 6046
1583 6046 4348 -2280 -4417 -435 3728 2581 -1603 -3026 -1572 840 3391 5173 3845 -2889 -7836
1598 -7836 -4185 4578 8108 3115 -2440 -2193 444 375 -418 509 2338 255 -1364 2511 5785 1295
1614 1295 -6979 -6910 2416 8251 4003 -1824 -1626 451 -1488 -3222 1206 5417 1639 -4279 -2006 5425
1630 5425 5406 -3493 -7757 -1150 5516 2649 -2443 -237 4463 1281 -5056 -3928 2660 3388 -3558 -3454
1646 -3454 4796 7839 -1678 -9628 -4034 5253 3746 -4112 -3687 4275 5220 -3225 -6808 3 3617
1661 3617 -1913 -5477 2080 8188 130 -10607 -6592 6253 8148 -2251 -7920 -467 5176 -494
1675 -494 -6314 -1024 5167 976 -5481 -1757 6765 3520 -8827 -10112 2825 10548 2609 -6528 -3019
1690 -3019 4669 1127 -6790 -4617 4206 5047 -2666 -2996 5207 6338 -4850 -11791 -3785 8322 7067
1705 7067 -1501 -2065 4090 1846 -6724 -7388 2473 8297 2094 -3959 1 5617 802 -7158 -4233
1720 -4233 4798 5858 13 -2919 2095 4045 -1510 -5279 66 6106 3266 -4227 -3580 2917 4480
1735 4480 -838 -2742 1134 3646 153 -3205 -59 3290 1616 -2296 -888 3568 2944 -1993 -3223
1750 -3223 557 2821 399 -1549 -335 1982 1777 -68 -994 -353 -530 -522 185 1127 1028 -718 -1167 -120
1768 -120 1020 405 -460 -1089 -1294 -640 1088 1190 -36 -1705 -427 1404 -322 -3696 -2363 1915 3008
1785 3008 749 -2281 -1132 -297 -2609 -3248 1193 4613 1827 -3162 -3633 917 824 -3812 -3794 2301 6532
1802 6532 1294 -5153 -3666 1300 317 -3778 -1263 5904 5107 -3667 -6309 -44 4409 -1055 -5881
1817 -5881 -143 7137 4398 -4373 -4777 1668 1797 -4170 -4173 4423 8771 203 -7692 -3481 4779 3430
1833 3430 -3789 -3540 4184 5393 -2572 -5315 1629 5923 -895 -6540 116 8791 3905 -7513 -6433
1848 -6433 4373 7393 -188 -4282 1709 4832 -2133 -6681 624 8087 3526 -5076 -3751 5340 5514
1863 5514 -3580 -6556 1130 7543 2434 -4438 -1513 4951 2305 -5021 -3457 4694 4739 -3144 -5317
1878 -5317 2805 7017 160 -6959 -2196 4895 2220 -4222 -2722 4174 4249 -2016 -3704 1092 2576
1893 2576 -2595 -5117 560 6526 3251 -3754 -3684 1247 1772 -3065 -3562 1758 3626 -81 -3205 66
1909 66 2325 -1781 -5911 -2355 3968 4016 -753 -2350 -81 26 -3042 -3489 1114 3555 652 -2710
1925 -2710 -1473 420 -1106 -3246 -609 3147 2423 -2180 -3150 -287 414 -1265 -1211 1224 2139 -582
1941 -582 -2483 -1035 567 -787 -1573 1193 3786 1304 -3024 -3699 -281 1362 286 314 1712 1393
1957 1393 -1686 -2249 580 2632 13 -3239 -835 3376 3315 -708 -1720 280 -58 -2273 -825 3837
1973 3837 4580 -292 -3457 -846 2278 382 -2285 49 3733 2783 -748 -1537 1384 1515 -1870 -1879 2510
1990 2510 4295 202 -3409 -883 3379 2732 -1478 -1577 1602 1718 -1706 -862 3721 3957 -1591 -4654
2006 -4654 -868 3517 972 -2499 -164 3583 2074 -3046 -3090 1351 1913 -1761 -2108 2354 4157 -749
2022 -749 -4917 -2074 2571 1727 -1887 -619 2396 1065 -4224 -4423 2129 5136 -91 -4693 -1995 1994
2038 1994 576 -3031 -673 3287 1314 -3933 -3109 2726 3360 -2907 -5650 -454 4678 1668 -2806
2053 -2806 -1947 1766 -29 -4499 -2543 3760 4247 -2451 -4569 800 4022 -1174 -5581 -1772 4495
2068 4495 2200 -3298 -2027 3108 2210 -4119 -4726 1790 5218 279 -3917 -225 4003 656 -4948
2083 -4948 -2281 3685 3595 -2567 -3222 2724 4167 -1293 -5233 -170 5123 2292 -3105 -1852 3257 2728
2099 2728 -2496 -2420 3218 4145 -1924 -4390 1271 5984 2131 -3814 -2146 3434 2908 -2012 -2162 2371
2115 2371 3446 -771 -2431 1748 4240 -196 -4653 -1201 4972 4031 -1522 -3118 523 2202 -62
2130 -62 -852 1693 2601 -1653 -4169 -7 4686 2883 -2205 -2962 228 1782 -266 -1277 539 1236
2146 1236 -635 -1164 1376 2234 -1018 -3863 -2153 1928 2943 420 -1077 -707 -701 -1593 -1379 825 1137
2163 1137 -521 -1380 416 1266 -268 -2163 -1456 -481 -925 -934 705 1948 197 -2206 -2055 -289 -540
2180 -540 -1160 -215 1896 1264 -1723 -2358 68 1273 -846 -2602 -1002 1565 604 -1304 -342 1269 -303
2197 -303 -3490 -1999 2818 3407 -1028 -3977 -755 3353 1520 -1946 -769 1474 165 -2624 -653
2212 -653 3842 3080 -2475 -4428 1201 5053 1292 -3780 -2135 2650 2012 -1035 -517 3319 2084 -3371
2228 -3371 -3755 2271 4984 567 -4161 -613 5210 3472 -2708 -3292 1930 2728 -1229 -2233 3050 4863
2244 4863 -712 -4913 -775 4577 2264 -3030 -2028 3975 4140 -1995 -3929 882 4084 421 -3185
2259 -3185 -301 3763 1257 -3403 -2169 3468 3476 -2245 -4038 1330 4128 196 -4128 -1360 3259 1466
2275 1466 -2819 -1852 2821 2057 -3061 -3638 1725 3709 -479 -4384 -989 3049 1645 -2331 -1404 1607
2291 1607 387 -2798 -2538 2081 3228 -856 -3535 -1058 2295 679 -2696 -2101 930 738 -1232 -1036
2307 -1036 1206 1339 -2045 -3707 -414 2318 824 -1824 -585 1099 -184 -2209 -793 1425 1058
2322 1058 -1546 -1670 249 1211 -325 -917 321 1052 -349 -1226 52 581 -672 -1746 246 2477
2338 2477 2586 -338 -1945 -1898 -843 -118 1325 2914 2629 -772 -2232 -741 612 76 -900 364 2935
2355 2935 2635 -159 -1315 -428 -149 -920 189 2450 2263 -768 -2143 782 3014 736 -2149 -1322
2371 -1322 1304 1632 -309 -419 1250 1401 -567 -825 1789 2143 -1253 -3631 -918 3247 3234 -421 -1288
2388 -1288 443 780 -1855 -1717 1398 2554 61 -1509 985 3106 261 -4237 -3293 1607 3008 367
2404 367 -1039 933 657 -2281 -2766 505 3137 625 -2707 -1414 1604 1311 -1951 -2119 1599 2520
2420 2520 -993 -3751 -1136 942 126 -1201 954 2525 83 -4051 -3531 1106 2220 -970 -1618 1316
2436 1316 2922 -53 -3711 -2791 76 656 -22 1163 2762 285 -4092 -3747 1515 3488 936 -2339
2452 -2339 -1043 1295 387 -1823 -1052 1052 962 -825 -31 2231 936 -2944 -3989 350 4397 2945
2468 2945 -682 -1552 -240 -596 -1792 -248 2664 2389 -508 -1122 576 1221 -1347 -2548 59 3630
2484 3630 2277 -536 -1111 342 414 -1131 -614 2408 2633 -648 -2174 -66 1964 403 -1127 166
2500 166 3010 1854 -818 -1961 -115 680 -50 604 2971 2396 -977 -3445 -2024 1259 1768 603
2516 603 319 1691 603 -1409 -1628 76 727 -770 -1007 1446 2768 542 -2470 -2057 463 1049 367
2533 367 -67 584 -482 -2020 -1268 1785 2757 -232 -2944 -2020 427 628 -616 -72 860 902 -627 -1157
2551 -1157 -314 -847 -2497 -1702 1592 3545 1577 -1842 -2597 -1418 -840 -636 561 1596 1043 -939 -1590
2568 -1590 -230 214 -1264 -1667 257 1812 656 -1062 -928 152 166 -685 -45 1219 238 -1955 -1880
2585 -1880 390 1951 1152 -318 -114 480 -1101 -2085 -723 1419 1443 318 111 1053 434 -1810 -2595
2602 -2595 -118 1717 1729 438 873 1149 -168 -2164 -1355 1297 1985 381 -168 1437 1572 -859 -1667
2619 -1667 36 2347 1325 -665 -853 708 402 -702 -623 1389 2065 -232 -1467 -478 1038 -411
2635 -411 -1319 719 3035 1974 -1361 -2453 -493 886 206 -192 1420 1765 -174 -1624 -691 1131
2651 1131 572 -1476 -348 1947 2047 -747 -2173 -617 906 609 -474 252 577 -505 -2203 -965
2667 -965 1760 1809 -594 -1571 -146 894 -477 -1566 -196 717 265 -924 -219 1114 -85 -2429 -2130
2684 -2130 400 2083 927 -689 -1039 -317 -612 -961 64 1215 -22 -1712 -799 700 1128 -574
2700 -574 -1897 -864 791 821 -503 -584 6 -783 -932 850 2222 1079 -1342 -2164 -556 621 695 124
2718 124 923 1011 -43 -1196 -689 53 471 48 674 1443 1228 -670 -1535 -217 1014 462 -594 75
2736 75 892 683 -271 251 872 -38 -1137 -610 951 1238 425 -49 435 915 357 -573 -423 443 -143 -332
2756 -332 412 1701 1506 -336 -1443 -157 929 473 -438 86 686 595 360 452 976 -162 -2173 -1537
2774 -1537 911 2238 1137 -462 -568 -304 -465 -820 477 891 58 -1040 -524 1170 1597 -298 -1323
2791 -1323 -955 -244 -357 -494 269 1239 361 -553 -628 190 -193 -1122 -1093 60 712 250 -157 156 69 -947
2811 -947 -1707 -1156 776 1011 -107 -826 -342 235 -580 -599 -191 351 -938 -1457 -248 1389 1175 -399
2829 -399 -953 -669 -185 50 -246 626 64 -459 -671 449 733 -98 -1077 -580 148 604 181 -204 201 179
2849 179 -239 -311 -84 291 -198 -512 96 850 376 -362 -305 771 603 -504 -803 -88 545 454 913 1019
2869 1019 690 -274 -1257 -286 1381 938 61 -298 298 793 232 -294 541 468 -259 -360 634 1030 89 -970
2889 -970 -774 731 1635 457 -305 -440 -327 -624 -525 1064 1739 619 -1010 -1140 423 552 -440 -708
2907 -708 381 829 371 -141 112 206 -805 -1594 -513 961 1775 335 -832 -913 -429 -1131 -453 607
2925 607 1025 -104 -1512 -914 157 984 -331 -847 -111 57 -257 -1141 -31 704 -173 -394 127 1168
2943 1168 248 -2130 -1984 -266 1563 1318 383 -211 -377 -1074 -1560 -499 1154 920 -433 -640 569
2960 569 901 -620 -1540 -509 378 521 -31 219 381 -343 -819 -542 675 566 -681 -629 23 988 125
2979 125 -295 138 385 360 -155 -860 78 -39 190 429 1207 892 -217 -1269 -628 488 592 255 482
2998 482 1037 664 -188 -560 -128 3 346 768 1593 1091 -291 -1223 -606 770 878 239 -228 -120 61
3017 61 -156 -105 359 44 -5 -62 486 228 -350 -943 -437 1007 1047 259 -150 -594 -244 -562 -510 587 514 214
3039 214 -48 -59 -258 -366 -1019 -280 1217 625 -190 -809 -474 189 -412 -221 142 674 -69 -493 -343 305
3059 305 -373 -793 -131 888 763 -668 -1107 -680 -128 -308 -308 383 910 -168 -1589 -1250 15 600 50
3078 50 48 291 303 -471 -1449 -131 617 -14 -283 -170 513 157 -534 -1115 255 1162 591 -688 -411 82
3098 82 -373 -531 311 749 544 -307 -404 426 396 -707 -1082 354 1329 1015 12 -610 -167 -255 -30 130
3118 130 805 678 -160 -442 437 904 -250 -1136 -71 1359 1381 -144 -615 -178 333 -85 49 957 1053
3137 1053 -484 -1050 -186 1115 624 -244 -66 570 281 -973 -681 840 1131 -64 4 539 424 -1052
3155 -1052 -1118 -189 976 596 70 301 1012 238 -1359 -932 459 1182 235 -77 155 211 -684 -859 -63
3174 -63 1192 324 -955 -567 97 440 -266 -430 46 591 -343 -755 -52 548 -126 -1188 -394 914 599
3193 599 -974 -1397 -316 447 -89 -621 173 577 -481 -1237 -742 649 68 -727 -879 527 1221 -509
3211 -509 -1838 -619 421 186 -817 185 710 232 -1085 -532 832 485 -964 -832 376 1204 12
3228 12 -1329 -947 1226 948 -573 -518 -100 158 -602 -562 1128 1167 -225 -1313 -193 908 303 -758
3246 -758 -420 1105 860 -94 -683 221 595 -64 -597 379 1247 381 -1105 -446 862 847 -343 -495 1116
3265 1116 1223 -314 -878 -349 817 543 -186 235 511 104 -600 25 754 624 -387 -576 424 965
3283 965 250 -524 56 398 -332 -286 3 625 110 -555 -369 567 570 -263 -343 -99 204 -345 -516 -19 16 82
3305 82 -311 -48 66 -217 -934 -226 723 444 -224 -570 -60 325 -199 -528 233 186 -251 -994 53 665
3325 665 197 -881 -476 514 797 -565 -818 -103 301 -331 -897 144 734 -332 -1643 -702 1257 1056
3343 1056 -803 -1139 -4 964 -737 -1104 227 1125 190 -1119 -484 1137 682 -1250 -889 842 1335
3360 1335 -834 -1096 492 1362 -14 -1799 -509 1461 802 -641 -666 1201 1178 -764 -1260 718 1492
3377 1492 -110 -1176 60 1884 664 -1553 -823 1001 1282 -447 -838 484 1429 -327 -1201 152
3393 152 1778 521 -1172 -1005 1093 1790 -317 -1209 453 1061 -357 -1292 114 1387 319 -1219
3409 -1219 -514 1258 1021 -1100 -1293 756 1393 109 -1174 -371 753 147 -825 -331 923 272 -1153
3426 -1153 -763 1220 1200 -781 -1374 145 867 -6 -712 -350 765 521 -435 -463 342 283 -797 -911 564
3445 564 1235 117 -910 -659 341 294 -490 -616 46 -164 -454 -252 805 176 -1013 -1290 -143 538
3463 538 124 -648 -304 65 -143 -254 -18 435 -83 -1014 -231 501 540 -229 -455 56 233 -159 -507 63
3483 63 449 5 -274 115 960 375 -1143 -577 452 748 -415 -342 704 1017 -702 -1223 172 1067 148
3502 148 -659 437 1020 252 -1243 -521 1231 1122 -680 -989 295 988 127 -525 39 1140 546 -881
3520 -881 -760 887 891 -754 -964 665 1668 -52 -1308 -442 1258 363 -824 -275 1541 661 -1471
3537 -1471 -1370 864 1474 -56 -1305 117 1326 195 -1167 -164 1230 397 -1099 -913 1123 1407
3553 1407 -852 -1781 -15 1674 571 -1224 -664 829 129 -1146 -721 1081 1152 -729 -1161 280 1340
3570 1340 -393 -1950 -39 1783 1030 -1001 -1134 385 527 -996 -903 395 1309 -445 -1695 -376
3586 -376 1359 29 -1173 -675 1219 950 -912 -1539 7 423 -298 -380 888 1019 -907 -2295 -1223
3603 -1223 1238 594 -516 -399 850 461 -945 -1195 247 695 -74 -772 236 1329 73 -1480 -1171
3620 -1171 816 1187 13 -691 -5 364 -642 -726 770 1453 257 -1519 -546 1032 689 -789 -723 836
3638 836 1162 -145 -391 185 117 -660 -976 528 1745 784 -862 -605 400 179 -729 -555 937 1174
3656 1174 274 -797 -137 822 -265 -628 603 1564 571 -657 -781 416 671 -144 -244 668 1064 -390
3674 -390 -1076 -162 669 8 -120 370 1052 373 -1279 -1363 265 926 385 -366 462 434 -937 -1230 179
3693 179 688 306 -910 -21 1055 436 -1209 -1338 97 928 134 -451 522 98 -1067 -1557 -27 1430
3711 1430 206 -1188 -633 548 330 -752 -941 374 982 -298 -734 37 423 -536 -1156 201 1646
3728 1646 854 -1289 -962 184 578 -881 -886 844 1282 -288 -1490 -540 954 230 -897 -51 1662
3745 1662 1049 -1333 -1494 749 1573 -373 -1278 346 1584 -159 -1451 -940 908 847 -948 -226 1146
3762 1146 757 -1428 -1792 474 1977 770 -1214 -527 1113 367 -1244 -726 1173 1403 -661 -1388 479
3779 479 1643 -522 -1968 -529 1656 1389 -871 -1141 761 784 -1029 -802 998 2222 -194 -1895
3795 -1895 -448 1285 677 -1170 -328 1791 1234 -899 -1763 107 867 -281 -583 657 1708 365
3811 365 -1549 -1132 786 924 -601 -936 1096 1593 -449 -1707 -423 872 199 -553 21 860 131
3828 131 -1610 -903 1158 1335 -298 -1245 -481 965 62 -936 -257 520 584 -501 -193 311 34 -1209
3846 -1209 -1081 764 1611 211 -1046 -756 -159 -59 -633 124 765 482 -546 54 386 -97 -1393 -892
3864 -892 554 802 427 -230 -558 -41 -387 -322 407 629 -183 -680 -316 386 110 -597 -542 616 652 -441
3884 -441 -556 296 21 -398 74 795 1279 -211 -1579 -500 928 773 12 -445 786 559 -711 -440
3902 -440 412 925 -440 -1026 778 1970 389 -1610 -1208 943 1618 -48 -832 281 971 -492 -1083
3919 -1083 434 1471 -2 -1763 -348 1661 1166 -1130 -1368 773 1475 -223 -1224 51 1008 -537
3935 -537 -1119 78 2149 873 -1257 -1497 849 1448 -670 -1485 10 1616 244 -1469 -328 1053
3951 1053 437 -1520 -885 1448 1397 -1329 -2243 172 1846 301 -1619 -499 939 465 -934 -897 560
3968 560 800 -887 -1122 1081 1594 -549 -2355 -689 1573 1247 -965 -990 179 882 -649 -847 602
3985 602 891 -539 -1451 231 1829 479 -1889 -1120 513 1170 -163 -594 -158 502 -327 -689 568
4002 568 945 -395 -1740 -621 754 1073 -671 -926 107 796 283 -180 -70 318 -608 -386 261 1166
4020 1166 378 -862 -511 515 809 -235 -733 -122 285 127 72 747 548 -314 -813 -238 855 644 -140
4039 -140 -543 274 502 -235 -175 297 213 -322 -2 815 854 24 -830 77 729 354 -461 -137 553 134 -60
4060 -60 -216 596 515 -836 -483 446 1216 -178 -533 216 878 357 -556 -244 286 64 -837 -397 780 992
4080 992 -502 -941 309 833 -400 -1038 -57 1111 715 -374 -523 551 -35 -1305 -946 724 1109
4097 1109 -315 -1247 -351 829 364 -909 -402 1034 398 -727 -913 757 833 -162 -1155 473 1466 166
4115 166 -1088 -959 660 536 -779 -414 749 313 -1093 -1305 467 1256 160 -1196 -514 1065 631
4132 631 -1146 -980 489 518 -240 -588 689 1185 -427 -1683 -114 1589 157 -1164 -658 1150 603
4149 603 -790 -1044 572 1159 -127 -1082 -145 788 -146 -1085 -66 1260 697 -788 -1064 573 1081 -331
4167 -331 -989 331 1147 405 -1179 -408 860 503 -618 -421 801 1051 -734 -1193 345 1209 59
4184 59 -407 18 1110 308 -1114 -776 644 833 -154 -527 197 894 -311 -1045 -154 1089 260 -391 -85
4203 -85 614 361 -943 -995 419 1266 129 -744 -151 375 -219 -612 -65 741 617 -384 -429 328 404 -312
4223 -312 -704 264 640 85 -657 -598 -6 -25 -440 -232 581 113 -573 -503 -197 45 135 -199 395 593 -130
4244 -130 -317 -501 95 -80 -99 181 385 192 -299 -597 -211 109 -54 -153 123 442 -161 -742 -53 155 -153
4265 -153 -390 271 716 66 -685 -441 255 387 377 34 343 161 -1008 -882 572 929 279 -732 -597
4284 -597 350 189 -531 -125 476 399 -113 -123 423 524 -969 -1206 157 1264 784 -761 -853 103 169 -414
4304 -414 -488 717 784 -363 -1300 312 1108 -54 -695 -87 1177 711 -603 -752 564 483 -520 -899
4322 -899 629 1280 82 -1537 -828 1040 678 -642 -286 832 890 -663 -1241 32 978 -13 -513 1
4340 1 1212 682 -1521 -1052 776 1145 -250 -974 357 395 -292 -1090 -563 1226 779 -917 -795 803
4358 803 670 -913 -1403 711 1013 405 -775 -442 929 -110 -1002 -770 834 1285 -449 -839 -100 627
4376 627 -388 -1196 27 1324 495 -1052 -880 231 512 -399 -821 232 847 -121 -1019 -330 816 318
4394 318 -509 -396 1005 509 -539 -1231 -205 511 391 -192 249 373 -240 -500 -101 820 779 -259 -509
4413 -509 265 263 246 -426 -66 261 25 177 59 417 396 -549 -216 258 797 373 -67 -199 96 384 387 249
4435 249 -60 -90 -45 -64 11 180 8 -150 153 248 309 200 -140 -778 -234 452 710 491 -188 -404 -280 40
4457 40 114 219 513 167 -265 -307 339 364 -83 -441 102 689 242 -586 -267 67 278 -348 -120 411 155
4478 155 -198 -783 -57 650 473 -432 -484 -153 143 -745 -598 186 859 -163 -748 29 1112 189 -951
4497 -951 -711 642 872 -371 -616 194 663 -452 -781 23 1012 138 -958 -877 579 814 -597 -642 220
4516 220 671 -17 -466 162 713 -36 -936 -261 477 693 -375 -737 242 660 90 -984 299 837 134
4535 134 -786 -549 773 755 -597 -940 194 1025 -63 -859 66 1133 778 -485 -215 455 596 -475
4553 -475 -789 454 1054 -110 -594 34 869 234 -868 -100 628 914 -108 -1275 -7 515 -25 -746
4571 -746 86 665 457 -437 -83 702 279 -430 -796 242 786 109 -709 -620 428 429 -67 -347 269 523
4591 523 -448 -389 258 692 212 -642 -73 428 490 -215 -496 338 281 -71 -157 -50 382 -35 -238 -326 151 276
4613 276 92 -383 -196 162 108 -946 -396 105 121 -304 -371 -66 -196 112 -199 4 170 29 -480 -331 -286
4634 -286 163 -157 -270 16 -113 251 -379 -325 55 -65 -60 40 -170 13 134 -272 -281 154 504 -68 -86 -142
4656 -142 209 364 -145 -104 216 259 33 -217 -4 159 127 -187 55 305 245 -113 -308 98 542 -122 -83 6
4678 6 729 142 -102 -345 238 427 -303 -731 125 522 127 -381 131 701 529 -295 -188 157 714 -16 36
4699 36 -40 621 -91 -427 5 571 346 -617 -332 212 654 -73 -390 -28 687 122 -429 -282 415 300 -627
4720 -627 -381 836 600 -439 -731 -91 583 307 -189 -239 434 235 -554 -677 299 589 7 -600 140 589
4740 589 87 -496 -669 980 362 -267 -483 209 494 -20 -512 -232 502 291 -122 -360 294 302 -655 -328
4760 -328 96 618 -224 -922 -229 122 215 -391 -196 310 178 -396 -512 -91 461 39 -398 -276 398 494 -199
4781 -199 -508 -10 302 39 -364 -31 112 -167 -746 -766 527 518 11 -411 193 394 15 -219 -176 448 -28
4802 -28 -463 90 426 219 -548 -371 -221 630 364 -497 84 -83 -83 -20 -143 88 252 115 -146 254 192 176
4824 176 -197 -129 280 210 -320 -578 41 362 239 -192 4 200 379 -271 -210 52 351 136 217 172 244 -38
4846 -38 -505 -5 101 39 -23 -37 105 -69 -82 -576 -76 633 346 52 -87 14 147 -122 -432 -27 488 81
4868 81 -390 -433 212 415 202 -393 9 447 46 -189 -562 201 129 -203 -233 129 638 -195 -449 -299 84
4889 84 392 3 63 416 -95 -408 -406 -112 257 221 53 -147 174 126 -524 -569 -64 402 179 -218 -152 -17 231
4912 231 -178 -209 401 264 -113 -549 -149 111 325 -270 116 364 78 -238 -438 206 370 -149 -105 -30 727
4933 727 369 -458 -555 96 205 108 65 342 266 -101 -253 -127 422 325 -143 -246 618 666 -222 -715 -179 601
4955 601 15 -147 -7 430 -133 -807 -314 676 709 178 -1028 -33 308 38 -501 189 615 328 -207 -477
4975 -477 241 391 -185 -564 165 828 377 -753 -533 212 73 -317 -235 488 540 -369 -785 -217 249 513
4995 513 -509 -383 174 458 -345 -689 203 167 249 -361 -157 257 -58 -613 -673 590 795 -90 -501 68
5015 68 453 -255 -817 -341 664 157 -210 -464 72 75 -134 -424 176 447 56 -463 -125 362 89 -154 -404
5036 -404 779 741 -163 -841 -248 175 360 -167 11 350 300 -271 -605 10 677 -1 -208 75 358 206
5056 206 -610 -200 292 414 267 -273 -94 147 -314 -501 -60 685 253 0 -124 12 174 -133 -212 143
5076 143 300 570 -290 -63 159 159 -98 209 165 90 -78 -231 -553 -9 408 86 137 9 422 75 -207 -53
5098 -53 97 258 -59 -237 172 274 -123 -97 -594 102 270 87 -136 31 478 -275 -472 -173 415 150 -30
5119 -30 -409 -151 430 -232 -392 119 609 275 -598 -341 205 259 56 -361 297 379 -172 -342 -64 231 180
5140 180 -215 -475 67 419 -162 -692 59 652 58 -635 49 514 431 -354 -1017 195 421 -153 -485 -241
5160 -241 534 -226 -929 -145 570 748 -82 -535 70 406 -94 -540 -136 633 75 -371 -395 685 731 -487
5180 -487 -839 344 805 16 -676 -559 434 670 -384 -337 562 412 -485 -473 466 1079 76 -562 148 824
5200 824 162 -597 -577 287 578 -14 -286 231 817 276 -602 -324 481 399 -289 -351 718 805 -231 -583 -154
5221 -154 740 180 -381 -69 418 391 -253 -100 332 715 -166 -530 2 403 -16 -285 -114 328 76 30 -166
5242 -166 80 471 -294 -621 -66 448 84 -289 -147 491 339 169 -82 121 231 -145 -338 -236 -3 -42
5262 -42 -627 10 81 145 -455 33 -52 8 -5 158 208 30 -108 -49 188 -289 -145 -200 -102 -32 -307 123 -209 -111
5286 -111 -99 6 240 -53 89 -117 174 -59 -194 -31 57 131 -90 22 243 382 2 -18 -66 238 246 -253
5308 -253 -217 247 140 -14 -454 -70 377 10 -129 253 183 -160 -313 -508 201 510 94 -762 -273 268 217
5329 217 -378 -312 605 391 -368 -398 -98 491 -1 -675 18 887 476 -381 -148 404 399 -121 -304 351 603
5350 603 -18 -601 249 649 176 -720 -441 449 480 -270 -266 284 666 -121 -274 519 615 289 -687 -459 597
5371 597 376 -353 -593 -371 333 -121 -553 47 576 245 -262 -225 394 43 -420 -748 229 766 57 -799
5391 -799 -214 12 88 -384 -420 593 164 -291 -536 472 339 -333 -768 -179 961 34 -721 -599 440
5410 440 353 -334 -261 468 372 -461 -711 195 656 26 -532 -129 646 395 -539 -498 309 552 -282 -473 313
5431 313 484 -274 -571 186 548 571 -333 -148 36 475 -293 -568 341 673 -42 -66 -49 7 172 -410 -67
5452 -67 485 577 -102 -279 349 359 1 -321 305 509 -146 -407 -307 3 -135 0 -59 341 209 -154 -305
5473 -305 134 -79 63 136 -81 248 -91 -216 -282 -36 -127 -191 194 262 107 -227 -204 -201 -12 -35 147 90 680
5496 680 -460 -521 202 48 325 -72 28 -4 -220 -318 -145 287 1 -521 -204 299 351 -560 -947 52 504
5517 504 -89 108 -100 29 -228 -473 -133 693 334 -352 -477 307 320 -414 -875 -207 750 57 -465 -104
5537 -104 443 -260 -778 -395 717 584 -566 -498 375 299 -293 -577 -164 644 776 -427 -374 162 354 -279
5557 -279 -520 359 841 -129 -759 -406 484 484 -432 -315 665 579 -184 -641 299 624 -58 -793 132 1099 548
5578 548 -634 -695 561 610 -221 -623 147 404 -146 -1160 -162 949 581 -335 -352 553 355 -566 -963 463
5598 463 620 112 -638 -155 538 136 -575 -713 290 595 -460 -706 141 423 -234 -560 79 786 617
5617 617 -456 -509 289 506 -15 -367 315 433 -245 -621 -63 566 312 -485 48 364 188 -219 -374 -29
5637 -29 198 3 -504 69 264 172 -324 -24 230 178 -31 -214 182 157 -10 -144 -13 301 -18 -102 -92 119
5659 119 156 -46 -3 14 138 71 156 215 81 13 -174 -42 306 -177 -211 290 -89 -228 12 42 100 -244 -245 17
5683 17 44 -270 -268 121 122 11 -268 -64 233 -4 -518 -294 301 519 260 -369 -69 304 106 -192 112 365
5705 365 334 -99 -435 35 388 -13 -255 327 531 -176 -511 -117 365 129 -606 55 571 424 -509 -551 103
5726 103 756 284 -599 -81 553 443 -379 -248 210 585 -245 -659 -183 795 -101 -851 23 731 473 -415
5746 -415 -555 643 655 -499 -421 457 793 103 -610 75 548 239 -292 -392 736 680 -74 -521 306 971
5766 971 -156 -758 -119 515 399 -568 -324 713 473 -309 -812 227 702 -245 -686 -131 466 202 -601
5785 -601 -299 576 423 -545 -546 490 603 -54 -515 -64 691 137 -623 -42 583 585 -389 -267 458 387 -166
5806 -166 -263 194 667 6 -338 -51 361 255 -316 -160 -67 175 -317 -310 131 147 9 -306 -29 347 41 -621
5828 -621 -361 90 -122 -74 -198 265 449 -192 -240 251 93 44 -491 33 341 132 -367 -60 331 93 3
5849 3 -251 179 138 -354 101 43 184 217 -32 -105 -120 -259 -358 52 65 110 -143 -92 -47 204 -116 -77 39 325
5873 325 -151 -268 -44 5 94 -178 -198 317 394 -158 -295 297 6 -165 -359 55 314 -85 -256 -84 248
5894 248 297 -284 -65 26 121 -503 -276 364 259 -260 -250 68 471 80 -570 -260 297 401 -21 135 511
5915 511 518 11 -125 213 499 -122 -385 138 678 409 -333 -302 499 137 -527 -558 165 349 15 -500 263
5936 263 772 188 -591 -228 585 304 -345 -479 327 666 -424 -663 360 603 4 -213 -441 406 255
5955 255 -539 -162 590 327 -376 -428 -107 311 -131 -694 -100 468 357 -632 -560 506 490 -104 -288 308 560
5976 560 -232 -637 -29 564 102 -375 -99 746 368 -393 -366 241 463 100 -441 -225 477 379 -691 -106
5996 -106 468 339 -236 -246 5 416 -228 -531 197 603 139 -595 -382 325 406 -356 -153 367 347 -214 -124
6017 -124 -134 326 -34 -431 -205 349 500 -9 -492 172 158 -61 -169 148 127 26 -476 -222 273 364 -296
6038 -296 -79 -115 524 70 -337 278 -94 123 -104 128 -96 -12 -429 1 191 189 -256 -261 -64 188 2 91
6060 91 -56 -161 -140 -163 113 22 -98 -298 130 177 -57 -165 -85 36 -25 -309 168 231 -224 -317 69 282 140
6083 140 -350 -280 188 261 -283 -254 282 235 -127 -140 -110 315 262 -374 -134 225 267 -317 -225 191 287 202 -284 -142
6107 -142 219 351 -180 -153 507 267 -373 -537 388 702 -127 -600 -45 730 79 -438 -433 396 639 -226 -621
6128 -621 478 776 -59 -692 -398 597 539 -382 -204 296 166 -292 -205 199 413 27 -644 28 687 -14
6148 -14 -443 -222 515 711 -180 -809 51 458 -42 -743 -176 642 301 -465 -480 142 285 -260 -481 498 540
6169 540 32 -895 -129 632 377 -526 -276 420 337 -326 -643 155 323 273 -335 188 300 -29 -836 -211 314
6190 314 95 -177 -561 184 379 -210 -663 -13 306 391 -238 -286 179 -40 -285 -623 66 356 -5 -172 -247
6211 -247 16 283 -217 -253 43 46 -114 -8 -15 -13 7 231 12 389 133 -204 -159 -122 28 -15 186 -110 -29 204
6235 204 40 20 -181 -224 168 367 225 -111 33 -112 -85 35 203 217 -53 8 -172 -81 58 55 66 88 52 -306
6259 -306 -527 -341 504 325 60 -181 -10 -98 -93 -96 43 220 -195 153 105 553 87 -577 -179 158 315 -11
6281 -11 -246 -105 10 -69 28 -164 197 250 -260 -284 265 87 -274 -656 521 537 104 -366 -406 324 114 -57
6303 -57 124 270 528 -166 -119 125 339 -239 -496 17 463 209 -432 -497 289 317 1 -399 359 277 1 -572
6325 -572 -156 311 45 -138 -150 265 140 -180 -558 -170 216 -103 -133 229 399 -165 -269 -304 471 523 -25
6346 -25 -403 -108 234 -84 -225 -4 287 -133 -391 176 292 -53 -551 -468 385 471 56 -121 -89 70 20 -222
6368 -222 113 104 50 -134 -227 450 262 -187 -76 198 528 48 -159 -137 292 157 14 18 243 -102 -122 -484 311
6391 311 579 113 -222 -44 305 -65 -335 -339 108 141 62 -52 273 35 -181 -305 -150 141 308 -184 -293
6412 -293 65 49 -38 80 2 -96 -66 -45 -200 95 -250 -88 -48 -96 98 3 -284 -293 -146 -256 63 352 -6 -188
6436 -188 90 241 5 22 -144 -193 -26 263 26 112 72 42 -21 -16 268 -61 -115 -212 27 106 21 -60 -161 -89 -86
6461 -86 56 64 109 28 15 113 10 110 54 -194 -103 184 6 58 -29 84 116 89 59 227 -241 -445 -94 124 327
6486 327 -15 136 30 -3 5 -228 -110 170 -306 -105 93 175 89 -398 66 146 166 -102 -239 107 267 -19
6508 -19 -165 -15 206 281 -369 107 173 135 -476 -148 201 192 -175 -116 -226 -177 16 -56 -241 400 443 -221 -642
6531 -642 9 307 -420 -452 -66 209 137 -248 -308 439 145 -56 -426 326 563 -15 -501 -315 226 359 -272
6552 -272 -358 391 48 -139 -242 -50 82 -120 -383 60 189 281 -301 -221 163 278 -92 -399 9 -18 -24 97
6574 97 79 418 47 -315 -177 569 -151 -66 -408 -178 159 -143 -65 -199 94 94 -182 -88 382 62 -276 -494
6596 -494 -345 153 -208 -313 -65 -21 193 -159 -351 171 338 29 77 -436 49 -106 -556 -50 174 300 182
6617 182 -402 -81 -224 -248 -84 -44 12 70 150 -158 -165 82 174 -306 13 312 120 -254 -12 -236 69 348 -107
6640 -107 -56 220 338 -48 -365 67 156 -14 -161 54 167 27 -168 -286 110 236 -114 84 -246 70 47
6661 47 66 -154 239 394 144 -376 143 -23 -313 -264 18 249 378 -60 0 129 43 -80 -203 354 446 196
6683 196 -248 -475 133 280 -22 -312 -105 360 115 -115 -272 283 -3 -38 134 241 353 -67 -423 -116
6703 -116 294 208 74 -226 -1 373 -226 -183 -44 30 233 35 47 180 -74 -280 -145 280 305 -71 42 -83
6725 -83 175 -163 -124 313 417 -71 -384 -102 88 235 -144 -278 -177 390 13 -279 -28 188 -86 -59 17
6746 17 33 323 20 -162 -277 1 -86 154 -126 -96 71 -104 -364 158 114 -53 136 -10 118 269 -285 -292
6768 -292 -27 406 103 -67 198 337 -80 -313 -246 196 159 -232 -137 15 -390 -96 -235 183 347 451 -101
6789 -101 -346 -130 55 -113 -239 162 36 61 -369 -48 274 73 60 -255 144 184 -124 -220 -138 116 252 296
6811 296 30 193 308 -280 -425 263 -12 199 4 -43 262 -147 -89 26 69 96 62 -50 -47 205 -196 -61
6833 -61 16 91 478 100 -60 168 166 35 -90 -73 316 -66 -132 -47 112 266 -32 146 -114 199 -106 -481 -200
6856 -200 61 96 -218 185 247 266 -2 -70 10 50 -130 0 -207 393 -229 -172 -290 -8 74 104 -41 23 132
6879 132 -172 -69 -160 223 163 -290 -22 29 -117 -243 -145 83 -15 -57 -40 136 312 -108 162 -122 -53 194 12
6902 12 -212 -70 68 331 293 -120 -215 4 9 -7 -123 162 121 -112 54 321 162 112 -141 172 227 61 109
6925 109 184 -53 27 -79 -221 140 218 121 -232 -205 216 -62 -175 -74 118 229 405 -178 -250 -354 21 -21
6947 -21 239 308 161 73 -212 85 286 -71 -41 -86 261 226 -180 -231 -34 -2 -42 -216 -17 278 39 -302 22
6970 22 236 131 -104 -232 -33 449 -54 -86 80 206 -28 -62 -150 -6 289 -161 -170 -18 114 -203 -208 -446 368
6993 368 225 -253 217 142 140 -164 -324 56 7 -126 -164 -67 384 372 -161 -426 -185 241 -124 -175 68 210 -159
7016 -159 -430 148 77 -127 -79 -344 231 -120 -88 -140 40 142 138 62 -248 186 227 -94 -320 217 236 -119 -311
7039 -311 132 286 108 -336 -92 181 216 -107 -322 226 204 82 116 15 400 -308 -364 141 254 52 216
7060 216 -145 -232 -81 -60 83 -189 64 -42 -11 -115 -18 88 -59 -130 218 -167 228 -147 -36 176 51 115
7082 115 103 -42 -232 35 -75 -143 0 157 168 148 32 48 174 -206 -125 -154 5 133 91 -91 -144 150 -65
7105 -65 -238 133 34 16 -93 -208 -130 45 346 6 -273 97 202 -142 235 110 -176 -77 -157 186 270 -44
7127 -44 -196 216 261 -5 9 -231 -80 118 0 108 -192 217 -141 19 22 35 224 -42 -188 162 64 26 -8
7150 -8 337 342 11 -134 321 245 50 -168 -150 152 -5 -118 -81 163 121 -114 -134 -136 104 -220 -125 -111 365 128
7174 128 -481 58 348 197 -341 -589 14 310 -447 -130 49 -84 -152 -402 149 284 19 -43 -185 -19 27
7195 27 -60 -261 249 47 -76 -134 3 -35 119 -545 -468 5 47 162 -241 101 335 -64 -403 73 325 161
7217 161 -126 81 19 87 -168 -144 78 115 221 -15 159 124 192 132 -185 163 368 -105 -329 92 205 -34
7239 -34 -259 161 244 -150 -142 80 225 124 -56 -313 -203 208 -267 -229 55 16 108 220 245 395 308 11 -248
7262 -248 -81 -95 -203 -339 42 92 -7 -119 -109 153 91 -116 -223 533 258 -327 67 35 -32 -157 -446 126
7284 126 54 134 -371 -82 -137 -85 -39 180 -164 167 -158 -372 96 77 37 -32 -106 133 -30 -22 68 279 -125 -311
7308 -311 175 128 289 -148 26 134 178 -23 -274 -257 4 -175 147 15 -114 107 -41 34 165 103 144 29
7330 29 190 265 105 70 -126 56 -98 -167 -266 358 -135 -278 -44 343 178 -250 91 -64 247 -36 -39 68
7352 68 120 5 -374 -335 391 22 45 -18 330 373 -104 -328 106 451 -201 -477 -70 243 177 -161 -63 -172 181
7375 181 -201 -318 -171 224 -122 -304 146 561 -140 -168 -376 161 472 -79 -470 -64 273 -103 -436 -104
7395 -104 337 106 -71 -382 364 240 -275 -224 102 432 -385 -505 -125 18 232 -106 64 188 91 -158 -371
7416 -371 410 272 -219 -217 295 351 -44 -329 -280 226 104 -71 -188 124 -31 -123 -353 64 266 88 -339 -182
7438 -182 -34 244 -303 -373 216 354 -35 -21 63 351 -135 -107 96 291 116 -17 -317 -206 273 146 79 53
7460 53 81 -12 -130 -287 339 271 71 -99 158 198 -84 -120 -148 98 117 363 -105 171 105 -200 55 168 -147
7483 -147 -79 211 150 -194 -146 -135 10 186 6 -134 208 170 -578 35 -59 -219 100 -126 -6 223 -108 -296
7505 -296 -107 -32 66 -33 199 199 90 -33 -79 66 326 222 -122 -275 150 201 38 -169 418 324 -71 -230 93
7528 93 193 -52 -152 49 500 115 -244 -261 13 -95 -325 19 57 185 -55 -464 53 358 -109 -355 21
7549 21 302 474 54 217 15 20 74 -323 154 235 92 -311 -368 353 334 70 -17 -17 421 -185 -319 426 180
7572 180 -73 -155 -210 275 130 -455 -87 538 184 -231 -403 88 367 -326 -225 -82 161 32 -148 387 165
7593 165 312 -174 -211 4 403 -189 39 131 257 -300 -191 -116 335 21 -267 -306 -134 169 -147 -261 -88
7614 -88 182 -96 -286 -81 587 310 -124 93 125 -112 -352 -271 -74 231 -96 -320 23 232 80 -415 172
7635 172 293 -140 -88 108 513 -184 -59 -129 -173 104 208 -169 -68 182 -70 -328 182 135 -120 -279 60
7656 60 101 215 -73 -272 267 305 199 -23 97 237 37 -253 -196 -26 339 -33 -89 -38 201 -37 -146 251
7678 251 -9 -34 -192 -71 193 -100 -317 161 -143 202 32 -63 492 302 174 -297 179 104 5 -177 -50
7699 -50 159 55 -235 -177 151 346 26 25 388 594 -141 -407 -115 321 178 -435 18 154 385 -177 6
7720 6 121 206 213 -352 166 308 -134 -293 -1 61 -14 -101 -44 0 84 102 -340 -6 15 -88 -371 -146 17 45 -153
7745 -153 -261 24 -14 -50 -394 -46 152 259 -116 45 229 378 -212 133 236 196 -275 -213 170 29 -210
7766 -210 -362 247 406 144 -513 -51 145 84 -327 -229 244 174 -130 -30 -25 199 -47 -174 -161 211 120 -91
7788 -91 -220 62 307 -379 -64 -161 170 129 -202 69 254 274 -183 96 279 187 276 -58 212 384 -219 -675
7810 -675 8 177 167 -235 -198 138 59 -403 -92 -59 282 -328 -483 -23 186 39 -257 -33 317 161 -317
7831 -317 -164 244 228 -341 20 118 265 -70 -261 -169 -56 47 -261 16 282 109 -125 -251 364 148 -202
7852 -202 -226 58 250 -121 -168 -92 -41 38 -37 -260 -110 291 158 81 89 81 -245 -80 103 74 -190 -335 -86 293
7876 293 -45 -119 36 196 18 -283 3 159 -42 -117 -65 193 81 292 8 246 46 227 -304 -159 389
7897 389 -192 -331 70 -16 395 -39 -369 -220 150 73 -71 48 -64 -225 -4 -136 145 124 -279 -393 -130
7918 -130 157 -85 -188 -106 178 75 14 150 127 4 -139 -253 -83 269 -27 -56 -1 366 -22 -193 -238 179
7940 179 157 -33 -9 226 198 -224 -290 -6 55 115 -286 -93 336 0 -39 -57 262 83 -219 -163 55 319 -93
7963 -93 -176 -54 393 -17 9 -275 141 -70 -199 -263 264 333 71 26 -112 332 198 -80 22 271 164 -523
7985 -523 -223 87 -211 -44 -83 184 99 38 -383 -169 284 21 -173 -174 -26 327 -78 -126 -35 168 119 -295 103
8008 103 79 -167 -548 -64 131 98 -205 -119 38 263 28 -113 51 310 -168 -64 23 20 -232 -297 -154 428
8030 428 287 -140 -34 11 104 -244 -130 16 366 -249 -225 -44 292 214 -40 -135 -70 298 123 -53 -133 228
8052 228 -230 -251 115 -69 228 -232 118 176 -51 13 -181 41 216 4 -82 30 125 -79 160 -134 211 154
8074 154 -117 -40 53 183 50 143 30 195 -92 84 86 104 -41 114 63 -97 -88 -161 -269 247 377 -172 -9
8097 -9 100 69 -291 186 -151 371 113 -151 173 60 -34 -341 -237 128 283 -83 -394 -189 -50 -230 -341
8118 -341 216 238 240 -78 57 -217 139 -37 -113 -121 104 79 -119 195 367 -99 -81 267 414 169 -192 -86 185
8141 185 -1 -131 -97 133 135 143 -228 179 194 308 -122 -119 -88 135 -127 -233 67 300 156 -234 95 6 126
8164 126 -283 -66 115 191 33 -136 90 258 -125 -424 -104 52 441 -53 -6 239 207 -241 -195 186 268 -91
8186 -91 -394 51 81 84 100
8191A00
$$ Imaginary data points
##PAGE= N=2
##DATA TABLE= (X++(I..I)), XYDATA
0 0 0 0 0 5 0 0 -8 8 -8 16 -16 21 -24 24 -32 40 -48 56 -70 80 -93 111 -127 143 -168 189 -219 248 -277 316
30 316 -355 396 -448 497 -557 620 -686 763 -844 936 -1039 1148 -1274 1409 -1561 1734 -1928
47 -1928 2152 -2410 2710 -3072 3505 -4045 4739 -5659 6958 -8912 12199 -18780 37168 -197761
61 -197761 -776365 -568547 -64104 304767 347162 287088 150628 -61424 -265082 -268659 -150892
72 -150892 -82460 -72461 78476 334174 392476 62705 -368786 -490705 -243767 53151 186977
83 186977 215898 221538 109060 -139974 -321247 -256043 -68538 35183 74667 178282 255396
94 255396 105873 -206747 -366783 -237647 -13459 103815 151792 212168 194610 -5148 -265428
105 -265428 -346573 -193408 27441 173788 246739 248412 108810 -158579 -352251 -286786 -36677
116 -36677 158375 196277 169643 142804 51853 -125138 -255092 -213450 -52118 97030 187292
127 187292 235593 198020 19380 -211867 -300755 -167562 53619 186051 195655 154212 91615
138 91615 -16925 -145949 -201687 -132300 8338 136894 214603 220685 118077 -81005 -252874
149 -252874 -249584 -62586 152717 241763 191397 89110 -11311 -112818 -187734 -163777 -21339
160 -21339 146129 224101 189074 85113 -53851 -191165 -237665 -121014 91672 229277 203575
171 203575 90183 -6006 -77374 -156928 -196193 -108308 79877 221928 216643 102623 -29315
182 -29315 -145622 -224591 -195796 -26614 170789 230798 135271 12149 -60534 -125955 -197873
193 -197873 -174697 -4989 180472 215265 106246 -15019 -91971 -160619 -196925 -113822 71168
204 71168 197963 161438 37013 -51883 -103579 -162392 -173820 -53243 134149 206790 106055
215 106055 -34851 -96115 -111098 -136876 -115779 12918 154923 164312 52341 -47865 -84411
226 -84411 -119444 -154514 -93063 74949 197795 152916 14360 -75859 -101724 -128519 -134996 -40493
238 -40493 119615 194441 120254 -95 -66133 -104282 -148140 -130726 7358 168806 197802
249 197802 90533 -24423 -77868 -112787 -138651 -82652 63200 176700 154493 49991 -25468
260 -25468 -62952 -108286 -130185 -50188 100239 181955 128897 22865 -44315 -80049 -111144 -91739
272 -91739 16348 135344 151824 70215 -6660 -39698 -72080 -107300 -71890 49644 152549
283 152549 141489 51723 -26497 -72241 -106935 -101550 -13180 109552 158137 98839 8342 -48574
295 -48574 -83412 -109912 -82578 21978 131641 150235 75631 -15203 -75621 -110922 -112248 -45548
307 -45548 68505 143367 120146 35818 -38876 -85645 -112968 -100030 -19192 88461 136298 92661
319 92661 9911 -55650 -96832 -112778 -77419 13254 99000 114746 62403 -7448 -64346 -105011
331 -105011 -109713 -54537 39920 107321 101698 39555 -33689 -87873 -109426 -85175 -15749 64021
343 64021 103120 78072 10666 -55643 -95583 -98179 -59144 11801 79101 98950 59495 -10717
355 -10717 -72231 -100303 -86683 -33911 38300 93381 96189 44288 -33843 -93500 -102394 -61994
367 -61994 2459 60863 91812 79843 23536 -47608 -89080 -80873 -41027 7005 58151 98798
379 98798 91081 19283 -69726 -107628 -76812 -16300 42043 88155 101646 55542 -31789 -89450
391 -89450 -76427 -23668 15401 37960 66528 82222 44672 -33155 -83092 -67966 -20200 18969
403 18969 55567 91536 85160 9389 -81480 -98822 -38212 24722 45360 55820 74703 56500
415 56500 -20457 -87717 -73811 -11455 22679 29088 57342 89362 53724 -43623 -103488 -71255
427 -71255 -9197 19833 40729 84088 97002 21791 -87291 -118896 -54958 17046 41244 51054
439 51054 72831 58857 -19119 -93897 -82344 -14459 18583 10302 28308 75645 65582 -27515
451 -27515 -103923 -81399 -11766 18256 22897 52813 73616 18321 -75486 -99050 -35503 20192
463 20192 16951 9855 41508 57319 2024 -74546 -83142 -29454 11326 16205 31646 63934 47496
476 47496 -37699 -106261 -79522 -685 38411 31619 38083 54260 17419 -66334 -103610 -52494
488 -52494 18068 40955 40140 53142 46846 -18980 -92928 -89335 -14841 42801 42775 30019 38491 32616
502 32616 -19135 -74078 -71658 -18495 27671 45501 55164 56922 16236 -57293 -91829 -46408 27125
515 27125 54102 36110 24225 28408 11012 -34517 -60518 -37341 6945 36288 49418 53983
527 53983 33993 -20108 -70517 -64428 -6022 48242 57075 36871 18154 2585 -24211 -48556
539 -48556 -40571 1696 42904 52526 36421 15420 -7192 -35279 -51857 -31354 17026 51478
551 51478 48591 25564 6396 -12308 -39797 -54519 -27709 27493 60710 47153 12772 -9696
563 -9696 -22031 -37725 -42911 -16144 29440 49917 32583 7682 -3604 -17433 -44684 -54118 -15231
576 -15231 42749 60705 29540 -5422 -18906 -30978 -49635 -39744 11785 57445 47287 2841
588 2841 -20799 -18169 -26341 -44773 -31375 21546 59623 40438 -3976 -25011 -27447 -39246 -44672
601 -44672 -7730 49796 62457 16408 -27372 -27322 -17797 -33024 -40968 -724 54369 58614 12930
614 12930 -24169 -28816 -31906 -43535 -25607 30597 66922 40059 -12807 -29763 -16251 -20464 -39407
627 -39407 -21865 34066 65341 34645 -13043 -25772 -20829 -31066 -34894 4462 56250 56769 7399
640 7399 -26459 -19585 -11686 -25372 -23388 19304 56317 39025 -7613 -25253 -10926 -8193 -22631
653 -22631 -13469 27873 52712 27148 -12433 -21049 -11754 -16476 -22096 5294 46687 47895 4629
666 4629 -27470 -18535 -3458 -11948 -17035 10801 43936 37823 2029 -19231 -16795 -18091 -24975 -8564
680 -8564 32705 53724 27985 -13667 -28892 -21465 -18272 -16805 5308 39025 43990 12352 -19791
693 -19791 -25138 -18726 -19588 -15553 10075 39701 38035 7060 -20147 -27581 -26688 -24383 -6703 26184
707 26184 44641 25802 -10812 -28909 -24014 -17584 -15572 -1878 22570 34179 18050 -7566 -22723
720 -22723 -27850 -27055 -15717 10854 35713 33713 6407 -21750 -31525 -25712 -14000 844 18022
733 18022 28936 20577 -4449 -25641 -27608 -16769 -4891 5236 17956 25279 13878 -9661 -25116
746 -25116 -23308 -12871 -2137 11359 24579 25107 6174 -18732 -29905 -20597 -2295 11594 17319
759 17319 18676 14569 573 -17815 -24752 -13467 2156 9168 13530 22295 21723 673 -26064 -30208
773 -30208 -11057 7601 15741 21255 24766 13225 -13376 -30429 -20680 1843 12823 11609 14418
786 14418 21088 13617 -10107 -27147 -19491 -469 9222 12555 22538 27589 8021 -25115 -34978 -11695
800 -11695 12149 14673 11466 18693 20211 -2536 -28098 -25420 -845 11998 7331 8887 21883
813 21883 18530 -10135 -33052 -22003 3823 12934 8193 12758 21537 7804 -23438 -34181 -10871
826 -10871 13924 12626 2861 9785 18973 2658 -26713 -30780 -6747 11754 9671 7879 18445
839 18445 15687 -14405 -40458 -26304 9650 22787 8130 998 10142 6933 -18833 -32989 -13638
852 -13638 11801 12910 3500 9639 16914 -1503 -33349 -34667 -1854 23418 16771 933 1734 6452
866 6452 -7602 -25919 -19261 5796 16355 4962 -230 11617 12704 -13273 -34476 -19583 12273
879 12273 21585 8395 4231 10933 1531 -23684 -30164 -5551 19594 18442 5722 5262 8048 -5076
893 -5076 -24476 -21072 3538 19302 12021 2300 7029 11687 -3482 -24549 -22437 1950 19108
906 19108 16219 9582 9830 2916 -16430 -25515 -7534 16553 18664 4025 -371 8505 7679 -8586
920 -8586 -19716 -10224 7719 14759 12720 11667 6510 -7989 -22749 -17577 6980 24563 17424 -1099
934 -1099 -7162 -2017 -1947 -8645 -7721 5377 14211 9543 1597 1040 -1045 -10533 -17233 -6086 14577
949 14577 21190 8851 -4958 -6891 -4757 -8837 -12788 -3877 13402 19975 9961 -3151 -8777 -10982
963 -10982 -14859 -12166 4596 21383 18734 437 -11057 -7911 -5765 -12562 -13510 2325 20387 19709
977 19709 2456 -10660 -12651 -12576 -13112 -4093 13337 20536 7449 -10543 -11867 -1201 -1118 -11386
991 -11386 -11139 5937 17653 9882 -4179 -7147 -4867 -10604 -15005 -1897 17940 19361 373 -13079
1005 -13079 -7987 -1358 -6019 -10228 2610 18522 14269 -4208 -13861 -6645 -1087 -5597 -4302 10096
1019 10096 19612 7578 -11932 -13528 -1875 68 -7291 -1947 16917 22411 2391 -18148 -14960
1032 -14960 -944 2344 -1157 5481 16267 11280 -6434 -12560 -2146 4000 -5042 -9121 6449
1045 6449 23589 16635 -7375 -18482 -8791 1556 1279 2775 12513 15423 849 -12942 -7567 4690
1059 4690 1788 -8836 -2521 16894 21114 973 -17288 -13486 -132 3355 1893 8103 13687 5354
1073 5354 -10304 -12492 -694 4760 -2603 -5301 7274 16496 6473 -11036 -13281 -1793 3014
1086 3014 -2803 -3051 7534 12726 3381 -7660 -6817 -3054 -6681 -9501 2053 17357 14807 -3768
1100 -3768 -14871 -8357 307 -2447 -5492 1749 10793 7302 -4052 -7494 -4068 -4571 -7789 -2673 9348
1115 9348 13182 1157 -11366 -10885 -2557 664 -1479 751 6614 6478 -3154 -10396 -7519 -1252 -318
1130 -318 -357 5243 10705 4246 -9041 -13756 -6366 1319 1966 2780 8060 9388 973 -9833 -12561 -7826
1146 -7826 -2011 3342 9821 14033 8258 -5083 -15439 -13396 -2040 6646 7736 6075 6060 4098 -2397
1161 -2397 -8710 -8526 -2997 2178 5740 9538 10053 1188 -9671 -11217 -2360 7343 6747 1338 -1304
1176 -1304 1875 4002 1785 -2603 -4240 -1790 2154 4869 5777 4624 -1421 -7372 -5421 3799 9447
1191 9447 4211 -3378 -2537 3412 3307 -2826 -4938 681 5748 3915 25 378 1412 -1799 -5139 -1976
1207 -1976 4328 4471 -765 -1565 4981 6353 -3182 -12169 -6655 5000 7766 536 -1955 3459 4774
1222 4774 -3494 -9262 -4981 900 513 120 6908 11602 1161 -15307 -17011 -604 10882 5802
1236 5802 -2414 677 5042 -1868 -12378 -9352 2836 6211 162 -64 7192 4762 -10891 -18451
1250 -18451 -5737 11287 10995 188 -2000 3013 -1321 -13999 -14302 2220 14985 8663 -2687
1263 -2687 -1823 3205 -3953 -15765 -10972 7751 14815 4385 -3184 2291 4028 -9070 -18293 -6010
1277 -6010 13299 14621 1363 -4057 1661 699 -10391 -11637 3068 14762 7210 -5373 -4867 4716
1291 4716 3192 -7741 -7587 5705 12336 2246 -7058 -1391 5813 -1031 -9647 -1723 13552 12221
1305 12221 -4616 -11664 -2074 6152 1817 -2817 2929 9141 2541 -7160 -4215 5064 4764 -5407
1319 -5407 -6732 5928 13326 4301 -7511 -5600 2732 3118 -3839 -2991 4816 7429 119 -3219 2345
1334 2345 4410 -2785 -9399 -3576 7434 8142 27 -2155 2024 3377 -3979 -8691 -4360 4251 6987
1349 6987 3736 1818 1124 -3189 -8046 -7077 721 6845 4334 -835 -1055 2021 190 -5553 -7914 -2820
1365 -2820 4356 5989 3117 -63 -2772 -5398 -6719 -3422 4058 7648 4056 -3447 -6051 -3193 -1345
1380 -1345 -2475 -1640 3774 7101 2949 -5286 -7508 -3711 -542 -748 1035 6095 6574 -828 -8723 -7140
1396 -7140 -342 1667 -969 539 7029 6703 -2701 -10694 -6796 1905 2896 -455 1702 6946 4257
1411 4257 -5963 -9936 -1615 5458 1702 -3473 1436 8289 3380 -8365 -8345 2510 7174 289 -3385
1426 -3385 2924 7052 -807 -8652 -3576 6631 5641 -3281 -3204 5922 7210 -3020 -8812 -862 7588
1441 7588 3081 -4762 -896 7928 5823 -5281 -8036 2508 7416 -1051 -5948 2564 10108 3223
1455 3223 -7473 -3965 5627 3877 -6663 -5798 6976 11496 1392 -7704 -3300 3075 -393 -5421
1469 -5421 676 9276 6094 -5596 -7874 1845 6307 -1643 -7697 -39 8654 4564 -5181 -4867 1880
1484 1880 1296 -5480 -2980 7619 9033 -3389 -11403 -3865 5172 3154 -3368 -814 4918 2512 -5576
1499 -5576 -6153 149 1938 -2622 -2502 5260 8395 -120 -10372 -8847 428 3912 956 632 3674
1514 3674 2487 -4683 -7866 -2703 2644 -27 -2224 2359 6778 2115 -6714 -7636 -1107 2453 560
1529 560 184 3343 4087 -1708 -5722 -2876 1399 -50 -1978 898 4846 2717 -2898 -3810 262 1751
1545 1751 -1004 -1964 1064 3416 1842 -575 -801 -695 -1908 -1910 2015 5625 3787 -2391 -5075 -1832
1561 -1832 2096 3253 2252 1795 -149 -2577 -1746 2209 4122 614 -3783 -1665 3311 4595 1558
1576 1558 -1800 -2456 -2359 -386 3667 5977 2442 -3791 -4671 680 4766 1913 -2482 -2685 481 2874
1592 2874 3598 2839 -332 -5235 -6568 -114 7723 7607 -213 -5900 -3527 1010 1183 -297 333 1786
1608 1786 -30 -1413 1451 3112 -1618 -7516 -4422 5571 8424 1570 -5683 -4259 -131 -880 -1826
1623 -1826 1422 4522 524 -5242 -2302 4639 2719 -5526 -7578 853 6645 2138 -3983 -1460 2852
1638 2852 -479 -5879 -3556 3610 3335 -3123 -3087 4092 5012 -4454 -9707 -1825 7255 3992 -4462 -3491
1654 -3491 4069 3815 -4416 -6658 1058 5252 -523 -3863 2700 6621 -1728 -10122 -3791 8558 8042
1669 8042 -4249 -8160 700 6303 111 -5128 270 5539 1531 -5115 -1014 6103 2102 -8262
1683 -8262 -6441 6815 11877 628 -8555 -3129 5307 1916 -5199 -2399 6469 5977 -2500 -3366 3973
1698 3973 4321 -5820 -9619 1275 11641 7043 -3740 -4287 2281 1027 -5676 -4347 6136 9341
1712 9341 1027 -5486 -704 4418 -393 -6831 -2358 6583 6348 -1945 -4371 1250 3471 -2012 -4426
1727 -4426 1286 6138 1815 -5336 -3443 3574 4307 -1800 -4060 568 2821 -722 -3690 -379 2915
1742 2915 675 -2975 -1253 2387 1648 -3269 -3632 907 2985 177 -2649 -818 1463 831 -1631 -1641
1758 -1641 -754 -588 -663 403 681 -270 -1489 -1335 -82 227 -465 -1214 -1609 -924 119 1235 895 -931
1776 -931 -1920 -632 1048 -251 -2223 -781 2542 2998 -1165 -3438 -1564 -159 -996 -1107 2515 4336
1792 4336 503 -4377 -3145 1652 2200 -2026 -1683 3898 5540 -858 -6401 -3009 3041 2591 -1400 430
1808 430 5304 3181 -5221 -6094 1421 5552 -189 -4064 1439 7548 2415 -5941 -4786 3157 3548 -2146
1824 -2146 -1910 5350 6935 -2089 -8193 -2066 6567 3860 -3475 -2688 4679 4795 -3252 -5734 2456 6239
1840 6239 -1077 -5859 1104 7880 1827 -8589 -5471 5893 7785 -1820 -5548 492 3766 -2013
1854 -2013 -5497 1689 7783 1646 -6898 -4153 4702 3875 -4731 -6216 2394 7527 684 -6547 -2721
1869 -2721 3738 1067 -5050 -3055 4950 4247 -4311 -5352 3131 5790 -1969 -7570 -1319 5208 2039
1884 2039 -4470 -2656 4139 3308 -3201 -5053 455 2499 -2203 -4063 2004 6159 1164 -5761 -4481
1899 -4481 1597 2111 -2386 -2533 2338 3729 -967 -3687 -351 1833 -1382 -4669 -224 5629 3563
1914 3563 -2486 -3755 -234 465 -1733 -1274 2777 3744 -106 -3489 -1396 1032 -220 -1421 540 3970
1930 3970 1639 -2505 -2711 861 2109 -79 -341 1985 1934 -844 -2558 -124 1676 586 -180 1913
1946 1913 3134 427 -3254 -2482 1777 3124 1056 75 893 555 -1869 -1474 1562 2877 -87 -2293
1962 -2293 298 3438 2763 -1997 -2464 102 799 -775 463 3843 3009 -1743 -4234 -435 2853 531
1978 531 -1625 261 3310 1455 -2415 -2246 615 1106 -1644 -1189 2323 3200 -1148 -4273 -929 3160
1994 3160 1543 -2739 -2624 1301 1393 -1403 -1068 2245 2120 -3519 -4885 -110 3704 1138 -3123 -613
2010 -613 2558 730 -3972 -3213 1616 2293 -1588 -2534 1529 2861 -1884 -5409 -1625 3461 2092 -2419
2026 -2419 -1820 1719 306 -3951 -2969 3478 4604 -1306 -5448 -1698 3250 1007 -2477 -861 2999
2041 2999 1094 -3543 -2466 3343 2826 -3426 -4840 1599 5724 1526 -3884 -2017 2159 455 -2992
2056 -2992 -612 4786 3845 -2813 -4327 1470 4258 -497 -4568 139 5856 2613 -3213 -1924 3247
2071 3247 2288 -3454 -3287 3704 5955 -7 -4026 29 4220 365 -4130 -1052 4872 3482 -2462
2086 -2462 -2692 2933 3997 -1606 -4458 1096 5774 1993 -3822 -2070 3485 2285 -2678 -1940 2967
2101 2967 3334 -2450 -3769 1811 5245 380 -4809 -2078 3564 2810 -2488 -2714 2192 2815 -1624 -3021
2117 -3021 925 2966 -1634 -4362 -455 4836 2517 -3254 -4095 547 2637 -324 -1652 836 1048
2132 1048 -2547 -3734 686 4150 1265 -4096 -4028 608 2072 -733 -1742 306 949 -690 -1636 449
2148 449 1022 -1949 -3747 -802 2880 2870 -952 -2683 -1631 -743 -650 -41 1594 1062 -946 -1430 177
2165 177 890 -683 -2211 -943 589 589 25 972 1348 -521 -2253 -1467 669 710 -241 121 1644 985
2183 985 -1879 -1942 988 1876 -200 -1754 246 2272 1261 -888 -368 1218 277 -2014 -282 3450
2199 3450 3209 -1774 -3522 493 4004 1271 -2125 -933 1492 869 -1793 479 4051 2161 -2991
2214 -2991 -3592 2098 5208 396 -4171 -1554 3279 2517 -1521 -1054 2259 1228 -3160 -3030 3093 4893
2230 4893 -481 -4763 -547 4712 2197 -4057 -3513 2290 3212 -1606 -2146 2409 3390 -2170 -5601 -568
2246 -568 4497 1596 -3989 -2121 3533 2825 -3491 -4522 1080 3958 -314 -4103 -1006 2927 335
2261 335 -4127 -1778 3247 2444 -3296 -4168 1631 3848 -1064 -4809 -1134 3108 1132 -3350 -1787 2300
2277 2300 1166 -3497 -3107 2174 3352 -1360 -4363 -176 3593 1185 -3010 -2223 903 589 -2290 -1595
2293 -1595 2352 2471 -1721 -3629 -288 2943 1014 -2412 -1410 2082 1629 -910 -973 1262 996 -2005
2309 -2005 -2906 1064 3657 1301 -1458 -302 1147 -4 -1227 205 2091 1534 -975 -1338 1014 2014
2325 2014 92 -679 544 1106 275 -1025 549 1156 72 -472 1171 2659 1372 -1299 -2901 -950
2341 -950 931 1564 2330 2249 736 -1836 -2560 -424 1429 924 -252 1156 2476 1409 -1843 -2376 -359
2358 -359 463 -12 307 2079 988 -1593 -2124 869 2453 37 -2355 -908 2095 1398 -921 -1276 794
2375 794 757 -1317 -1125 779 1162 -1966 -3128 310 3553 2003 -2180 -2584 -112 -113 -1758 -1474 1657
2392 1657 2389 -856 -2478 -11 1791 -1145 -4287 -2041 2767 3125 -319 -2193 -29 -82 -2104 -2492
2408 -2492 1139 3184 -267 -3227 -1441 1810 1096 -2040 -1671 1402 1997 -1627 -3388 -242 2291 1137
2424 1137 -937 323 1416 -962 -3992 -1891 2523 2993 -485 -1682 1395 2383 -958 -3797 -1550
2439 -1550 2034 2322 611 833 1601 -967 -3796 -2029 3004 4505 413 -3025 -997 2024 1121 -969
2455 -969 -381 1842 1172 -1120 -149 1729 555 -2540 -2175 2726 4617 1894 -2373 -2569 -182 193 -324
2472 -324 1063 2893 1913 -1378 -1929 321 1544 -624 -1614 1224 3413 1434 -2080 -2189 299 586
2488 586 -449 112 2018 1764 -1335 -2418 193 2226 294 -1304 373 1808 546 -2312 -2062 176
2504 176 1126 753 280 1459 767 -2595 -4027 -820 2748 2215 -359 -643 398 -712 -2272 -1740 588
2521 588 920 -597 -630 1270 1757 -1022 -3441 -2131 1236 1659 -82 -1030 -159 -696 -1418 -583 1809 1914
2539 1914 -1199 -3166 -1405 1484 1400 -214 -445 939 426 -815 -1409 -61 153 -951 -161 2577 2885
2556 2885 -265 -2851 -2726 -317 805 693 1160 1500 694 -1342 -1250 162 584 -369 -392 1102 2066 588
2574 588 -1418 -1244 933 961 -47 -38 1045 524 -1263 -1108 1515 2601 652 -917 -372 150 -547 -956
2592 -956 562 2574 1870 -288 -404 399 -61 -1723 -1318 1525 2453 1817 -413 -511 497 -814 -1724 -385
2610 -385 2000 1878 -260 -776 524 564 -1006 -1932 721 2405 768 -1695 -899 693 647 -965 -513
2627 -513 1189 1212 -772 -2202 -483 1086 -28 -1190 502 1883 422 -2871 -2929 432 1433 400
2643 400 -476 601 534 -1101 -2299 -724 1121 -11 -1277 -689 1523 822 -1743 -2354 -424 1483 745
2660 745 -630 -376 124 -855 -1716 -522 2132 1605 -1418 -2255 148 822 -151 -1460 -119 1368 305
2677 305 -1118 -240 530 -538 -2012 -944 1935 2691 180 -1376 -1185 -228 23 -183 723 1358 38
2694 38 -1283 -569 1544 1435 -433 -1698 1 1692 688 -609 -628 199 -2 94 1057 1895 337 -1801
2712 -1801 -1673 575 2162 1256 235 661 295 -516 -965 -351 1053 1098 398 724 1186 438 -950 -1207
2730 -1207 300 1135 605 5 510 895 346 -374 -315 432 132 -1205 -268 1411 1435 136 -728 0 501
2749 501 72 -1210 -417 374 32 -348 575 1094 186 -1701 -1616 -63 1239 65 -761 -317 508 -20 -661
2768 -661 -315 -232 -1124 -2119 -871 1458 2133 297 -1869 -1232 -348 -313 -668 385 799 -269 -1301 -554
2786 -554 873 735 -569 -1775 -686 391 5 -147 434 1114 158 -1432 -749 -200 129 -596 -769 635
2804 635 1116 -73 -594 -249 -8 -570 -929 -163 1045 965 -200 -511 -187 626 -202 -81 -107 284 -106 -481
2824 -481 610 1585 995 -936 -983 -153 690 652 176 827 -80 108 -169 161 939 -87 -781 16 1201
2843 1201 1033 255 -176 336 350 -21 143 275 537 -132 -343 250 1095 385 -441 -95 691 105 -497 -857
2863 -857 234 843 713 443 245 94 -939 -879 168 1247 933 -567 -681 15 -220 5 -432 -22 415
2882 415 -314 -151 425 672 -270 -1364 -465 827 1348 -423 -1387 -596 -371 -448 162 891 1082 -651 -1838
2901 -1838 -1190 468 534 -506 -348 529 595 -107 -1063 -424 -76 -1068 -1289 93 1760 1208 -583 -1521 -1021
2920 -1021 -306 -260 -75 1087 821 -682 -1694 -641 1038 1094 -588 -1078 19 311 -156 -619 92 525
2938 525 80 -805 145 635 -278 -1508 -841 882 2285 1090 -362 -969 -742 -1185 -436 769 1669 841
2956 841 -277 -311 828 433 -671 -1180 -75 1521 1274 210 3 212 -123 -584 -101 1006 802 -80
2974 -80 -441 276 878 675 -161 -94 563 330 -602 -403 316 569 283 802 1078 261 -993 -1371 -22 845
2994 845 1094 429 348 628 -61 -1003 -944 -379 360 788 570 474 -48 -1107 -1506 -186 1033 937 -200 -642
3014 -642 -498 -69 -136 -222 -38 28 -151 -424 43 -55 -411 -931 -28 942 779 -695 -1117 -619 -416 -309 -3
3035 -3 420 354 -113 -702 -449 -593 -855 -615 109 857 747 -674 -1213 -416 -5 -253 -5 448 479 -256 -777
3056 -777 -273 511 -12 -747 -4 757 476 -762 -984 -345 563 461 272 581 231 -260 -1322 -754 717
3075 717 844 113 -373 165 151 -525 -331 442 887 292 -674 -7 457 207 -1004 -366 736 1537 232
3094 232 -830 -362 355 36 5 738 925 315 -743 -466 671 449 -502 -618 994 1340 789 -834 -946
3113 -946 133 516 163 360 1136 429 -549 -778 414 645 -533 -547 110 1578 743 -336 -993 -67 366
3132 366 -38 221 628 345 -912 -826 411 1058 204 -858 -325 333 -433 -952 -426 620 784 202 -756
3151 -756 -267 -422 -580 -825 107 1208 153 -482 -310 115 -478 -1284 -843 838 1209 -3 -728 -407 -20
3170 -20 -291 -729 59 1010 248 -1106 -577 378 782 -756 -991 -59 326 -342 -674 453 850 -141 -958
3189 -958 21 1340 947 -976 -1188 28 760 314 -391 90 962 -476 -965 -255 1195 462 -406 -343 989
3208 989 883 -546 -1309 56 1223 614 -263 91 982 -17 -1123 -330 890 838 -606 -628 936 1254
3226 1254 -176 -1166 -101 1550 861 -171 -725 532 436 -310 -162 1019 1042 -484 -1241 -175 1166
3243 1166 755 -756 -227 1026 741 -688 -887 211 567 313 -334 300 701 -21 -1146 -279 715 770
3261 770 -377 -513 726 527 -942 -1233 -359 958 556 -416 -99 423 51 -534 -98 604 339 -957
3279 -957 -731 687 1030 127 -666 -296 -5 -70 -260 -56 427 -523 -672 -432 585 340 -560 -915 -239 44
3299 44 -318 -376 -178 545 -77 -516 -268 -132 -357 -548 -78 888 570 -1018 -793 -148 269 -71 -193 564
3319 564 641 30 -534 115 804 -120 -957 -182 1196 860 -563 -865 197 826 -136 -721 383 686 -404
3338 -404 -1147 354 1496 930 -921 -945 511 709 -313 -561 752 1549 136 -1128 -225 1247 421
3355 421 -717 -585 1069 920 -675 -1154 638 1287 -47 -1236 -122 1709 748 -854 -788 876 1105
3372 1105 -974 -933 1069 1335 -427 -1360 -241 1783 709 -1416 -731 1198 977 -689 -887 508 1218
3389 1218 -636 -1386 393 1866 205 -1786 -629 1308 1184 -1355 -1581 66 967 -652 -1410 49
3405 49 1026 -197 -1349 -668 978 330 -1046 -1144 474 1380 -426 -1286 -205 919 387 -1194 -360 810
3423 810 259 -1020 -516 704 863 -722 -1360 -137 1250 184 -1157 -455 831 173 -957 -612 272
3440 272 92 -757 -772 741 1203 -371 -1373 -616 799 354 -151 -610 305 -105 -268 -77 427 479 -897
3459 -897 -857 433 1053 396 -597 -170 373 167 -366 -174 618 75 -260 -12 950 614 -513 -684 391
3478 391 659 -187 -584 311 799 -82 -485 140 546 4 -878 -146 983 881 57 -416 480 922 -341
3497 -341 -786 384 1242 238 -423 133 996 -64 -943 -251 1048 811 -823 -697 743 1329 282 -841
3515 -841 131 950 177 -1092 -465 1033 729 -907 -851 907 1294 -643 -1940 -340 1614 387 -1093
3532 -1093 -264 1221 207 -1797 -1260 887 1514 -533 -1561 212 1238 -95 -1504 -368 1032 388
3548 388 -1200 -759 1255 773 -1215 -1519 315 1919 162 -1532 -724 797 252 -1068 -610 814 654
3565 654 -1173 -1375 648 994 -554 -1486 -7 1922 572 -1541 -1079 792 802 -825 -876 844 910 -656
3583 -656 -1410 278 1356 137 -951 -273 1487 794 -1486 -1471 600 1242 111 -575 486 794 -515
3600 -515 -2092 -270 2046 1267 -711 -801 539 612 -743 -1131 539 1258 30 -1054 181 1201 -205
3617 -205 -1663 -708 1336 1300 -77 -853 -3 578 -213 -404 965 1361 -490 -1588 -461 1283 657 -564
3635 -564 -510 1139 1168 -117 -840 -181 192 -558 -381 884 1627 424 -1362 -1002 380 66 -538 -311 1012
3654 1012 799 -365 -969 -156 127 -502 -477 557 1452 52 -1411 -1186 601 616 -153 -237 634 307 -769
3673 -769 -1081 -208 1007 85 -472 -20 616 -277 -1442 -510 1058 1206 -174 -596 -207 -142 -728 -998 288
3692 288 1010 297 -894 -162 749 281 -1181 -1355 876 1452 -205 -592 164 77 -959 -947 683 1266 27
3711 27 -1440 -689 972 609 -725 -1060 674 1028 -19 -1049 161 583 -467 -1099 356 1793 546
3728 546 -1767 -1275 722 865 -187 -670 966 1299 -491 -1491 -241 1108 672 -622 -250 1203 497
3745 497 -1454 -754 1291 1401 -2 -1341 296 1409 -569 -1651 -539 1379 907 -529 -699 987
3761 987 631 -1264 -1394 1091 2328 434 -1600 -608 1093 806 -1156 -470 1461 1220 -525 -1221 484
3778 484 1183 -465 -1639 18 1944 1054 -1553 -1262 726 473 -676 -565 1231 1673 -538 -2150 -301
3795 -301 1489 229 -1084 -235 1448 871 -1226 -1829 145 1497 -64 -568 753 1104 -516 -2251
3811 -2251 -875 1320 961 -1026 -707 638 887 -1042 -1757 -359 1279 601 -721 -260 553 -314 -1442
3828 -1442 -618 1260 1122 -1009 -1429 -70 905 47 -886 -313 855 868 -764 -109 53 -75 -957 -294
3846 -294 1298 1480 -243 -1655 -754 645 91 -547 148 616 -235 -772 -276 314 -245 -754 -66 749 1260
3865 1260 -22 -838 -442 69 120 130 808 989 -270 -557 103 681 559 -611 -208 535 330 -561 -303
3884 -303 423 671 -96 -60 717 945 -664 -1395 -83 1350 1046 -598 -338 493 686 -579 -664 881 1061
3903 1061 -253 -715 859 1241 -522 -2063 -812 1288 1415 -406 -1007 236 765 -357 -1054 607
3919 607 1331 -342 -1431 -367 1816 961 -1449 -1480 955 1253 -222 -1371 -145 694 -557 -1246 170
3936 170 1718 390 -1683 -1286 957 1379 -597 -1611 227 1739 -158 -1417 -493 809 573 -1387
3952 -1387 -663 1488 1104 -1619 -1998 455 1844 67 -1504 -287 1241 591 -1176 -703 916 826 -996
3969 -996 -1063 1046 1236 -825 -1830 0 1619 1043 -1243 -1049 771 906 -506 -529 257 771 -892 -1357
3987 -1357 568 1853 274 -1725 -870 964 1363 -533 -1026 -114 812 -115 -725 548 1151 -570 -1360
4004 -1360 -201 1324 1070 -694 -1047 254 726 -270 -301 114 192 -155 -555 732 940 162 -1263 -664
4022 -664 652 704 -571 -494 87 265 307 264 460 566 -688 -686 319 1008 115 -505 -750 367 378 191 -339
4043 -339 124 133 -303 -62 522 209 -582 -715 251 584 112 -203 -168 481 171 -352 -232 540 151 -554 -591
4064 -591 595 617 -494 -901 276 579 201 -939 -354 503 -54 -845 -290 1118 593 -1120 -850 192
4082 192 485 -88 -891 -5 1185 379 -900 -665 494 107 -754 -517 1081 905 -593 -1295 -224 913
4100 913 286 -794 -646 729 314 -899 -703 734 1131 -608 -968 676 1180 -314 -1432 -377 1170
4117 1170 731 -618 -586 584 603 -1109 -1047 809 1474 117 -1504 -262 1079 364 -1301 -450 920
4134 920 1309 -420 -560 639 781 -438 -1013 506 1584 506 -1122 -636 896 631 -519 -800 788
4151 788 1120 -340 -1397 374 931 2 -919 -116 1438 511 -1270 -1144 725 1018 -214 -1103 568
4168 568 1359 91 -1367 -258 1202 664 -635 -592 1028 728 -572 -1112 485 1436 -19 -577 12
4185 12 898 -35 -960 -418 1006 1085 -456 -670 -79 755 -317 -1162 -71 1052 433 -803 -409 762
4203 762 0 -1000 -487 483 989 10 -673 -358 617 -149 -761 86 642 387 -806 -714 329 786 -311
4222 -311 -603 198 653 -63 -734 -718 233 72 -358 259 689 -7 -872 -453 197 455 -38 -188 83 346
4242 346 -33 -658 -566 199 480 -23 481 301 32 -729 -660 341 410 89 116 558 515 -241 -310 291 434 55
4264 55 -136 46 671 361 -416 -215 532 417 439 -194 246 -65 -587 -241 1079 801 34 -766 -317 396
4284 396 310 -319 -228 461 531 181 -302 423 25 -818 -777 739 1405 405 -1041 -715 446 303 -301 -358
4304 -358 821 562 -705 -1217 284 1161 -5 -1073 -174 949 453 -994 -845 622 765 -230 -589
4321 -589 690 632 -290 -1528 -308 1396 504 -389 -570 496 519 -1197 -1000 429 1283 -89 -820 120
4339 120 1043 23 -1688 -1034 1220 1100 -478 -905 -31 488 -574 -1577 -20 1061 371 -987 -720
4356 -720 550 761 -1045 -950 380 1436 -65 -1245 -671 555 91 -605 -474 1297 809 -988 -1035 102
4374 102 954 -140 -593 -8 712 296 -982 -782 995 1098 -301 -618 336 681 13 -1117 28 1023
4392 1023 661 -412 -413 719 506 -954 -597 596 826 674 -356 -420 334 -154 -200 -69 749 691 -399
4411 -399 -326 272 524 129 -492 -145 423 622 61 -314 331 -229 -387 -94 556 570 287 -566 -326 251 612
4432 612 331 181 -60 -49 177 21 -73 162 155 -361 57 -112 -160 -211 -521 -163 -381 335 352 -115 -427 -640
4454 -640 93 484 -121 302 241 22 -260 -409 45 236 -192 -395 -164 538 -75 -250 -384 122 276 -284
4474 -284 -143 396 507 -573 -931 192 895 287 -545 -500 452 443 -309 -500 293 992 -227 -696 -132 625
4494 625 302 -841 -273 970 342 -353 -875 57 410 -526 -711 308 1161 7 -1058 -547 461 843
4512 843 -445 -450 575 887 -138 -653 117 800 69 -998 -192 842 653 -227 -1203 281 946 225 -634
4531 -634 -94 761 505 -637 -531 797 587 -453 -622 394 1068 -62 -922 200 1218 548 -897
4548 -897 -427 959 741 -503 -895 371 968 237 -662 -76 376 107 -607 -381 1042 762 -508 -904
4566 -904 133 952 -230 -838 -85 680 334 -479 -534 246 209 -511 -847 -26 892 -119 -885 -329 555 360
4586 360 -404 -350 255 -25 -169 -445 201 468 -227 -664 -138 392 -19 -399 -389 364 541 -194 -567 -207 110
4607 110 -188 -168 -430 361 223 53 -577 -60 223 -223 34 8 220 42 -239 -264 300 264 43 -250 -83
4628 -83 -44 -150 -216 -42 396 28 -10 98 -53 210 336 124 -364 -202 270 66 19 -8 179 -21 -112 -97 249
4651 249 370 -294 -543 29 101 87 -211 -238 -61 484 -42 -267 -115 534 -10 -32 -148 395 220 -197 -412
4672 -412 12 341 202 -530 107 585 218 -430 79 406 332 -281 -399 338 378 61 -580 -100 533 252 -738
4693 -738 74 403 656 -340 -446 217 560 93 -371 -48 315 172 -282 -452 594 647 -178 -632 -140 437
4713 437 268 -397 -417 266 102 -523 -602 269 580 -362 -691 -194 778 27 -436 -524 423 306 -730 -463 543
4734 543 606 -242 -409 -7 555 -45 -725 -353 490 684 -329 -561 339 674 -226 -619 -33 405 306 -464
4754 -464 -326 392 254 -500 -751 466 518 -57 -980 -567 582 596 -231 -358 144 301 -365 -727 37 683
4774 683 -12 -519 171 594 125 -353 -223 349 349 31 -169 195 413 -79 -703 -175 414 478 -191 -269 314
4795 314 252 -18 -464 205 257 408 -285 -102 301 144 -303 -264 113 379 205 -429 -215 263 109 -195 51
4816 51 63 201 -10 -531 -68 202 265 -62 -107 406 318 -271 -303 18 476 55 224 179 -3 136 -383 -126
4838 -126 248 209 -196 -166 12 306 -36 -282 -83 341 393 -10 -101 9 -235 -326 -259 -80 187 129 31 -384 155
4861 155 -46 16 -281 142 443 87 -315 -58 40 160 -24 -244 370 255 -115 -274 26 -247 370 30 -11
4882 -11 41 78 -78 -487 -60 293 488 145 -92 7 -20 -209 -45 297 738 156 -257 127 -204 -375 -332 -142
4904 -142 30 436 129 -298 -340 79 175 -172 -132 374 256 179 -629 37 287 298 -287 60 337 191 -368 -392
4926 -392 109 196 65 -380 477 300 -265 -846 -237 5 335 -251 -109 254 190 -369 -542 112 547 92 -517
4947 -517 -56 174 332 -310 -747 104 698 142 -494 -182 118 -103 -740 -148 741 453 -436 -700 -95 583
4967 583 324 -436 -250 248 403 -522 -542 28 242 -195 -166 85 680 183 -865 -596 143 539 43 -461
4987 -461 279 209 -488 -770 227 774 451 -784 -388 523 51 -548 -530 329 617 -178 -356 52 407 -70
5007 -70 -535 125 927 601 -66 -250 -148 685 103 -538 49 610 292 -433 -317 -52 392 68 -296 495
5027 495 541 -43 -587 -92 642 598 -232 -470 624 482 -214 -923 -188 388 305 8 192 60 290 -425 -388
5048 -388 343 591 -162 -344 249 406 66 -436 -525 195 486 156 -119 56 143 129 -546 26 664 287 -208
5069 -208 -299 -198 224 157 -34 -42 258 65 -565 -154 181 213 162 -79 95 155 171 -411 -47 256 98 41 229
5092 229 -139 -84 -237 -535 34 -35 194 244 -395 -102 -83 -301 -417 76 401 232 -270 -312 -77 103 -123 -223
5114 -223 -266 435 -13 -361 -215 160 165 -319 -565 -322 558 -170 -429 -547 -5 398 109 -217 288 452 -212
5135 -212 -841 2 119 299 -199 -33 604 352 -518 -599 157 623 222 -254 160 585 400 -737 -445 377
5155 377 530 94 -426 -125 164 -61 -499 75 877 503 -449 -434 331 694 -13 -674 -65 381 233 -455
5175 -455 -181 571 582 -595 -701 319 761 -214 -869 -356 525 324 -619 -197 534 447 -114 -479 472 791
5195 791 -28 -541 -287 670 46 -800 -446 633 490 -165 -391 115 679 -109 -442 47 541 22 -858 -90
5215 -90 298 497 -297 -587 -64 492 28 -535 20 189 -45 -792 -444 392 659 -614 -746 168 569 243
5235 243 -447 -163 393 -111 -360 -393 280 196 -253 -245 155 560 86 -303 -364 274 172 -92 -205 76 316 24
5257 24 -107 18 152 190 -314 -199 51 78 -275 -79 49 183 6 -238 5 79 -101 196 -244 -159 -10 -126
5279 -126 187 122 -39 61 56 172 -107 41 289 236 87 93 54 79 -88 -191 -111 187 27 410 217 102 11
5302 11 -524 95 135 141 -174 -198 367 511 -231 -172 -47 289 100 0 -227 209 307 -367 -14 350 475 -370
5324 -370 -360 -116 377 331 -524 -45 499 27 -203 -360 31 250 -160 -146 72 679 166 -815 -389 339 340 -235
5346 -235 -322 633 416 -107 -625 -135 403 502 -470 -374 420 477 -540 -316 422 364 -34 -434 79 345 -284
5367 -284 -670 7 330 680 -369 -395 -152 683 -424 -518 482 536 277 -666 -614 477 423 -703 -519 607
5387 607 677 -335 -858 -296 420 -148 -570 51 586 420 -587 -282 326 672 -525 -598 304 513 138 -711
5407 -711 -498 225 360 -339 -327 492 316 -690 -632 111 817 125 -418 -37 486 -163 -521 -188 358 580
5427 580 -175 -144 215 586 -370 -547 144 670 456 -603 -288 73 209 -352 27 358 634 -254 -623 -137
5447 -137 329 327 -503 294 640 249 -479 -307 -73 114 -3 -49 253 292 -78 -348 -199 181 74 -410 20
5468 20 322 69 -587 -375 -221 53 -69 9 -83 111 -307 -369 -3 60 -139 -78 -23 30 -103 -404 -174 -64 282
5491 282 29 187 420 51 -593 -461 58 203 222 -239 109 102 -194 -467 -222 384 188 -353 14 528 98
5512 98 -267 -478 326 545 274 -234 -199 -157 175 -437 237 327 -88 -300 -474 434 383 -574 -487 313 720 -81
5534 -81 -216 -97 228 126 -470 -294 513 516 -575 -804 -83 623 56 -626 86 764 123 -457 -617 623
5554 623 531 -238 -317 413 696 -308 -784 -74 992 526 -500 -271 485 635 -593 -652 275 670 -272 -859
5574 -859 70 667 18 -898 -432 654 784 -318 -776 -63 553 -400 -585 -17 1049 357 -647 -391 386
5593 386 317 -731 -593 158 684 -179 -709 -142 737 357 -704 -248 557 550 -164 -595 454 695 -62 -730
5613 -730 71 672 215 -1146 -587 580 483 -212 -310 336 374 -175 -638 -364 218 247 -236 -457 479 135 -404
5634 -404 -555 -44 238 -100 -318 -91 482 -70 -292 -145 448 345 -405 -410 -104 -58 -254 -479 37 272 336
5655 336 -274 -109 0 -152 189 -355 529 60 143 -271 99 360 -165 246 91 -178 95 -240 151 26
5675 26 -390 -326 90 -130 -217 -391 21 191 25 -133 55 429 -35 -402 -25 322 69 -517 43 168 283
5696 283 -226 -564 14 390 15 -272 -109 237 86 12 -407 640 198 -205 -196 -104 320 101 -539 -354 269
5717 269 359 -383 59 398 390 -455 -662 420 659 -71 -470 -136 578 291 -488 -268 473 465 -203 -625 193
5738 193 618 -177 -933 -92 722 400 -687 -602 550 470 -365 -505 325 872 -149 -435 -256 585 147 -749
5758 -749 -361 631 533 -545 -732 85 685 139 -843 93 174 152 -851 -416 429 750 -490 -819 99 723
5778 723 -143 -660 -91 428 262 -502 -183 458 153 -534 -444 421 611 -213 -273 8 683 18 -260 -62 350
5799 350 358 -509 -269 377 154 -231 -251 165 648 -165 -464 -163 294 163 -288 -185 362 371 -328 -448 357 412
5821 412 -46 -348 -72 486 300 -298 -368 354 369 -523 -183 61 403 -24 -288 115 403 60 -367 26 415
5842 415 113 -292 -163 191 327 -57 -123 150 137 -76 -101 246 318 -33 -415 -56 450 194 -174 41 205
5863 205 79 -171 2 460 187 -304 -218 225 -52 -59 -197 41 202 33 -118 -145 55 -48 -14 -140 -7 81
5885 81 -308 -262 -56 181 -408 -404 -39 376 49 -169 -199 -59 219 -275 183 75 335 -487 -387 126 325 190
5907 190 -537 -104 338 -45 -534 -420 406 363 -352 -404 140 470 -31 -526 154 257 336 -447 -16 301 217
5928 217 -400 -228 453 222 -374 -554 69 461 -18 -629 -84 585 277 -191 -59 399 51 -622 -286 161
5948 161 478 -21 -358 70 691 420 -279 -216 309 255 -213 -642 362 363 -110 -446 1 556 10 -548 2
5969 2 672 433 -334 -709 270 287 -196 -684 53 847 185 -528 -233 551 182 -628 -706 231 551 -167 -453
5990 -453 -56 460 226 -828 -202 422 179 -474 -439 225 219 -334 -269 -38 422 15 -904 -377 272 208 45
6011 45 -352 323 446 -79 -579 -50 358 -79 -481 95 411 82 -219 -323 45 391 -178 -372 66 143 -357
6032 -357 -149 102 385 -12 -289 -231 114 283 40 -358 -43 263 117 -228 4 92 -80 -119 27 119 54 -63
6054 -63 -558 -280 177 254 -60 200 128 299 -83 -12 222 17 -86 196 147 30 -514 41 -20 -121 227 59
6076 59 12 -301 -416 39 147 178 -133 -8 223 295 -64 -224 339 -139 -93 -283 -236 566 -79 -399 -414 424
6098 424 298 -291 -149 287 277 -130 -349 63 384 367 -566 -391 192 102 -117 -480 432 592 83 -688 -2
6119 -2 387 111 -618 -240 418 630 -266 -528 455 598 -320 -637 -111 784 441 -309 -283 359 431 -419 -340 282
6141 282 461 -21 -517 13 657 -122 -560 -215 498 405 -194 -596 349 609 124 -285 136 447 339 -564
6161 -564 -358 291 517 -225 -281 414 163 -64 -453 -121 590 104 -203 -131 396 457 -140 -527 279 521 -89
6182 -89 -455 53 296 -198 -630 -273 474 609 -140 -591 363 -33 38 -476 -371 486 470 -282 -142 213 23
6203 23 -46 -214 415 344 -195 -470 51 211 245 -269 62 351 170 -526 -103 38 52 75 -98 95 84 51 -507
6226 -507 -273 -44 -133 -17 8 104 -38 15 32 94 -6 -10 -56 171 -108 156 -451 -49 -54 -23 90 168 92 -147 -245
6251 -245 176 302 -90 165 184 42 34 -252 -388 165 90 -232 -147 7 185 -170 -558 180 330 184 -429 -145
6273 -145 390 22 -126 -423 225 546 -455 -418 28 68 -90 -264 -52 426 41 -301 -329 143 224 -279 -461
6294 -461 -306 124 -106 -629 -199 543 -123 85 -124 470 89 -203 -266 210 319 -285 -166 161 538 438
6314 438 -440 -268 311 85 -194 -30 117 262 32 -386 184 248 222 -416 -302 400 190 -220 -336 210 577
6335 577 -162 -341 89 392 37 -267 -227 200 549 -548 -310 -162 210 -343 -403 147 206 42 -222 79 134
6356 134 196 -244 -17 355 583 51 -522 -74 362 178 -538 -108 227 504 -124 -70 144 201 136 10 -151
6377 -151 482 27 -91 -58 161 21 -142 84 214 139 -369 102 39 471 -62 -172 -328 150 -68 -237 -72
6398 -72 -18 1 114 126 156 -227 -248 -334 120 579 85 -56 -315 247 73 21 -188 -21 -51 -36 -318 30 47 -81
6422 -81 -18 -19 496 502 -261 -269 43 223 101 -8 22 -129 -32 -66 254 118 60 75 -267 -34 -13 174 135 257 -57
6447 -57 56 26 -170 -264 -94 -87 -236 -105 -138 134 -61 -156 103 234 95 -110 -346 -315 -217 174 -33 -106 42
6470 42 181 114 -188 205 254 59 -113 -37 270 302 -127 -30 351 491 146 -16 -84 237 59 -157 -191 185 158
6493 158 -222 -185 -19 161 -145 57 -281 185 387 74 -279 -235 236 -118 -34 -133 250 -101 -654 -158 415
6514 415 265 -206 -295 46 242 -47 -350 6 184 116 -311 -15 320 470 -511 -237 225 373 70 -184 49
6535 49 -34 -221 -241 -113 492 186 -487 -7 476 706 -175 -310 -108 507 310 -127 -291 243 95 -378 -43
6556 -43 396 199 -177 -440 89 174 236 -348 -138 182 89 -153 -454 220 170 185 -141 -89 308 561 -421 -104
6578 -104 -40 449 -274 -159 117 -1 185 -268 -11 138 -4 -115 -4 140 239 47 195 -292 49 360 -16
6599 -16 59 -6 73 -169 -89 123 9 304 -53 6 -73 -145 -263 -38 87 278 -197 -164 -150 372 69 52 144 216
6623 216 -60 -95 -136 -51 -4 -1 -86 -91 207 261 -108 -538 -63 201 214 174 44 105 88 60 -105 99 314 -151 111
6648 111 -115 274 -60 -141 -348 -106 77 145 -101 -255 61 -323 -446 46 159 507 126 -118 -29 279 220
6669 220 -276 79 398 114 -43 -95 -90 -73 63 16 133 407 -212 -167 -58 275 119 27 -12 238 139 -52 -139
6692 -139 -404 288 182 -65 -175 45 -11 -341 -392 43 370 -42 -68 -224 265 -209 29 -356 306 321 51
6713 51 -92 -262 -17 68 -67 2 289 120 91 -404 -110 205 135 -114 353 251 21 -212 -202 28 279 -151
6735 -151 -2 451 71 187 -119 24 203 208 -64 -31 245 -17 -100 -333 91 225 125 -218 -203 18 -110 -55
6757 -55 -267 89 98 26 -155 340 -2 126 -523 -234 173 65 65 -188 -292 -116 -99 -230 94 367 -11 -223
6779 -223 -423 -53 343 89 -265 180 186 -75 -115 -89 125 149 -90 -16 150 223 -240 -376 -47 -249 134 100 -121
6802 -121 144 74 -12 99 -71 -131 -362 96 114 246 191 -64 -422 174 425 36 -93 -62 316 -135 -37 -148
6824 -148 150 387 -38 -567 -58 -5 70 -17 27 93 185 -94 -330 325 7 -127 -7 138 229 214 -253 -165 124
6847 124 -79 -83 -131 -2 213 -303 -228 -182 -12 153 77 178 483 94 -36 -213 -65 39 179 20 226 -103
6869 -103 -249 414 90 -51 219 200 -97 -89 15 -125 4 164 58 94 -305 -153 -226 226 -7 -146 123 -73
6891 -73 184 271 -71 -160 -89 52 -33 26 207 67 105 121 -19 243 157 34 8 -8 -41 -303 170 86 -164 371
6915 371 -96 321 134 -49 -373 -118 235 104 97 -225 -86 -72 -95 -151 211 273 -34 -97 -219 -126 33 -124 -330
6938 -330 157 289 -172 -166 -322 119 114 -207 -146 205 62 -259 -65 79 29 -87 60 118 8 217 -216 -268 112
6961 112 442 -250 -37 -215 106 115 -105 26 117 -22 -320 9 -78 302 -21 -21 -31 -58 506 -240 -71 394 136
6984 136 -193 -210 -187 267 103 -350 -195 92 -140 -19 -78 330 288 -189 -78 -69 187 -35 -256 -48 329 29
7006 29 -216 39 309 307 -179 -108 278 167 166 -281 -289 515 201 13 -73 105 60 -70 -223 70 395 -60 12 137
7030 137 24 208 29 50 -21 414 -348 -358 -4 370 91 -284 71 109 -5 -106 -225 -96 146 105 80 218
7052 218 36 -21 -287 -149 170 162 -45 -4 288 209 244 -553 -215 -5 63 142 21 97 125 -14 42 159 -117 -64
7076 -64 -147 -64 376 -216 206 161 5 149 99 227 29 57 -164 -99 268 -65 7 360 -18 215 -189 -133 3
7099 3 -56 -104 168 -136 -89 -375 -13 -7 91 -261 -27 171 63 35 -101 -105 -215 138 -371 -107 -192 315 -3 -83
7123 -83 8 88 296 157 -151 191 -18 158 248 322 63 -307 -159 223 195 -198 -157 100 97 93 -136 -183 277 -7
7147 -7 -82 -219 63 -91 -215 82 125 258 48 -199 -291 183 38 -269 86 165 -30 -215 -231 147 261 -254
7169 -254 -430 -82 73 163 30 -11 337 161 70 -129 12 147 -174 -169 -117 402 250 -404 -24 97 98 -297 -338
7192 -338 83 458 -283 -308 57 320 133 63 -160 126 28 -165 -307 132 425 -275 -97 34 359 51 -211
7213 -211 -278 58 175 -138 -122 33 94 -290 -394 123 324 -200 -260 165 157 77 -389 -139 463 284 -430 -137
7235 -137 147 219 -117 -196 42 530 -381 -157 -47 310 180 -59 -335 -90 37 -13 -364 9 114 -215 -117
7256 -117 434 234 339 1 -222 -25 57 -67 -342 70 78 -115 -277 317 451 349 176 -128 -216 49 -102
7277 -102 -250 -22 -61 -138 -407 37 -214 -15 -146 -216 439 -84 -210 32 308 -165 -9 -204 76 188 -77
7298 -77 -243 110 40 64 -23 41 62 18 53 -274 -4 12 121 85 26 86 -215 35 105 138 20 -187 86 -66 -256
7323 -256 -95 35 76 -81 -64 -159 8 25 64 -362 49 245 39 -136 36 356 -205 -317 42 46 203 -26
7345 -26 -58 272 295 -159 -151 80 410 96 -305 11 165 -38 -100 -80 253 84 -318 -186 17 403 -68 -370
7367 -370 -189 129 327 -205 175 111 133 -179 -544 179 246 -122 -384 128 27 76 -220 -51 271 232 45 -266
7389 -266 -156 264 -34 -301 160 110 48 -319 15 217 192 35 -235 97 460 -101 -227 34 476 150 -80
7410 -80 -97 235 -203 -370 -146 258 149 270 -164 36 50 -13 -281 -141 339 73 30 -98 155 157 -272 -89
7432 -89 -33 297 167 -62 -363 368 121 -330 -45 -203 127 212 -357 -113 290 -337 -123 -16 -190 9 -209
7453 -209 -143 159 330 281 -15 125 -56 -90 -467 -344 193 -288 138 -26 79 -177 -70 -58 -84 287 54 196
7475 196 -81 -151 -95 -476 133 -90 -23 -141 73 66 -297 -294 -374 -340 -126 115 96 191 61 -236 -12 129 -3 -26
7499 -26 -240 244 1 -188 -282 -52 244 -42 3 -361 264 329 -395 -221 198 377 161 -138 -285 162 -211
7520 -211 54 54 388 313 -115 -2 91 54 -87 -171 139 -122 -211 -63 -254 99 265 21 -293 138 -10 -32 -88
7543 -88 99 74 108 -306 98 172 202 -248 -83 64 45 -264 -99 187 105 -236 -240 -289 327 277 -67 -114 65 445
7567 445 -290 -215 44 96 -44 -154 112 148 32 -398 -149 203 195 16 -386 15 96 -200 -371 -16 391 121
7589 121 34 -576 277 370 84 -289 188 217 -511 -324 -320 -11 -367 -183 -82 216 55 -249 -138 29 25 -205
7611 -205 -213 -5 250 -279 88 6 101 194 -156 -31 389 226 11 -287 81 284 49 331 198 97 203 -85
7633 -85 10 128 61 -4 146 28 50 -89 -147 -224 -14 -236 -181 4 203 -61 9 24 211 170 337 40 -162 127
7657 127 60 -274 196 293 -168 -125 224 -1 -95 1 5 148 15 -9 107 12 209 253 -370 351 65 60 -410 77
7681 77 239 125 -396 -153 340 35 -173 -199 65 191 -312 -100 25 75 -152 -134 10 195 69 -152 -268
7702 -268 -35 101 -125 11 -41 177 422 -42 -59 43 118 -205 -457 362 47 -197 -261 81 234 -24 -126
7723 -126 194 209 182 17 -149 166 124 -187 -227 260 -79 -133 -281 -22 403 51 -39 -62 62 259 -244 250
7745 250 79 161 -175 -434 280 93 135 -161 148 83 -6 -366 78 254 180 -146 29 128 494 67 -23 324
7767 324 372 223 -328 -254 897 379 -382 -49 187 146 -176 -146 54 515 -235 -241 250 465 156 -103 65 181
7789 181 176 -321 -129 196 306 -265 -243 -24 75 73 -62 87 438 -86 144 -370 152 102 20 -113 147 255 -29
7812 -29 -461 -87 71 -177 -199 -324 180 304 104 -419 249 189 89 84 69 563 100 -355 130 130 -192 -194 -112 71
7836 71 164 7 -215 -292 198 -51 -269 238 122 -19 -164 -135 163 128 190 -217 -222 86 -39 -166 -93 239 182
7859 182 -2 8 14 27 -152 -206 139 118 -45 -45 18 74 -110 -38 174 -33 317 -16 -200 247 33 -79 159 299
7883 299 254 -219 -49 186 156 -6 -297 -144 166 -145 -269 -16 87 -51 -438 49 109 207 -85 -153 243 98
7905 98 222 51 255 280 180 -308 -326 32 275 7 -252 -94 170 -73 -311 0 175 45 -203 -70 274
7926 274 348 -5 -167 294 352 -82 -150 -17 -45 -50 -39 -118 182 36 48 -104 178 283 -112 -49 9 280 90 -424
7950 -424 -151 255 122 -117 -8 215 120 -139 -314 275 12 -17 -75 -129 421 142 -246 -145 144 46 -117 -238
7972 -238 11 140 -228 -493 104 117 421 43 184 348 100 -129 -5 -9 157 49 -266 153 404 -253 -231
7993 -231 106 81 32 -270 -338 -133 330 4 -282 418 276 -47 -200 -65 332 113 -21 117 -45 147 -26
8014 -26 -151 -17 153 38 44 85 184 -259 -308 14 -266 172 15 224 243 421 -332 -52 -6 283 -271 0 156
8037 156 83 -153 -94 -157 298 144 -128 -68 267 21 -255 166 -39 -261 31 -230 17 117 -178 -210 67 255
8059 255 -226 149 -227 102 66 -244 -281 -267 180 -111 20 170 0 -60 -419 -20 282 57 -106 120 115 215
8081 215 -359 -438 29 358 20 -309 -35 173 250 85 41 223 131 27 -17 80 192 -10 -259 113 31 -21 -280
8104 -280 -76 57 112 -271 70 117 115 -77 17 189 -131 133 -172 -55 194 -290 -200 -74 68 93 -32 28 -28
8127 -28 -20 -66 -187 -28 293 60 -180 -84 180 279 -227 -229 -106 -11 -346 -197 402 -75 -120 -119 -50 -38 167 -149 -328
8152 -328 65 175 76 -331 102 549 81 -442 -213 211 150 -11 -215 197 11 -54 -195 32 68 -613 -197
8173 -197 -63 261 -118 -85 14 285 291 -181 -179 20 131 42 -194 276 257 89 -220 227
8191B27
##END NTUPLES=NMR FID
##END=
