##TITLE=1H_LR-628-CR6
 CDCl3, 8 sc, 
 5.7.2019
##JCAMPDX= 6.0         $$ Bruker NMR JCAMP-DX V2.0
##DATA TYPE= NMR FID
##DATA CLASS= NTUPLES
##ORIGIN= UXNMR, Bruker Analytische Messtechnik GmbH
##OWNER= root
$$ XWIN-NMR		Version 3.5
$$ Fri Jul  5 14:35:44 2019 Russian Standard Time (UT+4h)  she@DPX200
##.OBSERVE FREQUENCY= 200.13155
##.OBSERVE NUCLEUS= ^1H
##.DELAY= (6, 6)
##.ACQUISITION MODE= SIMULTANEOUS
##.ACQUISITION SCHEME= undefined
##.AVERAGES= 8
##.DIGITISER RES= 18
##SPECTROMETER/DATA SYSTEM= spect
##.PULSE SEQUENCE= zg30
##.SOLVENT NAME= CDCl3
##.SHIFT REFERENCE= (INTERNAL, CDCl3, 0, 15.7039)
##AUDIT TRAIL= $$ (NUMBER, WHEN, WHO, WHERE, WHAT)
$$ ##TITLE= Audit trail, XWIN-NMR		Version 3.5
$$ ##JCAMPDX= 5.01
$$ ##ORIGIN= Bruker BioSpin GmbH
$$ ##OWNER= she
$$ F:/spectra/data/she/nmr/H-F/1/audita.txt
$$ ##AUDIT TRAIL=  $$ (NUMBER, WHEN, WHO, WHERE, WHAT)
(   1,<2019-07-05 14:34:49.10 +0400>,<she>,<DPX200>,
      <created by zg, POWCHK disabled, PULCHK disabled
       configuration hash MD5:
       00 E9 B6 7A A2 85 ED C7 34 08 36 98 17 FE 4E 26
       data hash MD5: 16K
       9C 2D D4 7D 32 DE 89 9D 6B 6F 61 9C EE F9 C9 C4>)
$$ ##END=
$$ 
$$ hash MD5
$$ DD D4 05 E6 67 89 B6 E1 DB B9 12 C6 2B ED 48 B8
##$RELAX= 
##$RELAX= 
##$RELAX= 
##$RELAX= 
##$RELAX= 
##$RELAX= 
$$ Bruker specific parameters
$$ --------------------------
##$DU= <F:/spectra>
##$EXPNO= 1
##$NAME= <H-F>
##$PROCNO= 1
##$TYPE= <nmr>
##$USER= <she>
##$AMP= (0..31)
100 100 100 100 100 100 100 100 100 100 100 100 100 100 100 100 100 100 
100 100 100 100 100 100 100 100 100 100 100 100 100 100 
##$AQSEQ= 0
##$AQ_mod= 1
##$AUNM= <au_zg>
##$AUTOPOS= <>
##$BF1= 200.13
##$BF2= 200.13
##$BF3= 200.13
##$BF4= 200.13
##$BF5= 200.13
##$BF6= 200.13
##$BF7= 200.13
##$BF8= 200.13
##$BYTORDA= 1
##$CFDGTYP= 0
##$CFRGTYP= 5
##$CHEMSTR= <none>
##$CNST= (0..31)
1 1 145 1 1 1 1 1 1 1 1 1 1 1 1 1 1 1 1 1 1 1 1 1 1 1 1 1 1 1 1 1 
##$CPDPRG= <>
##$CPDPRG1= <>
##$CPDPRG2= <>
##$CPDPRG3= <>
##$CPDPRG4= <mlev>
##$CPDPRG5= <mlev>
##$CPDPRG6= <mlev>
##$CPDPRG7= <mlev>
##$CPDPRG8= <mlev>
##$CPDPRGB= <>
##$CPDPRGT= <>
##$D= (0..31)
0 1.2 0 0 0 0 0 0 0 0 0 0.03 0 0 0 0 0 0 0 0 0 0 0 0 0 0 0 0 0 0 0 0 
##$DATE= 1562322888
##$DBL= (0..7)
120 120 120 120 120 120 120 120 
##$DBP= (0..7)
150 150 150 150 150 150 150 150 
##$DBP07= 0
##$DBPNAM0= <>
##$DBPNAM1= <>
##$DBPNAM2= <>
##$DBPNAM3= <>
##$DBPNAM4= <>
##$DBPNAM5= <>
##$DBPNAM6= <>
##$DBPNAM7= <>
##$DBPOAL= (0..7)
0.5 0.5 0.5 0.5 0.5 0.5 0.5 0.5 
##$DBPOFFS= (0..7)
0 0 0 0 0 0 0 0 
##$DE= 6
##$DECBNUC= <off>
##$DECIM= 24
##$DECNUC= <off>
##$DECSTAT= 4
##$DIGMOD= 1
##$DIGTYP= 9
##$DL= (0..7)
0 120 120 120 120 120 120 120 
##$DP= (0..7)
150 150 150 150 150 150 150 150 
##$DP07= 0
##$DPNAME0= <>
##$DPNAME1= <>
##$DPNAME2= <>
##$DPNAME3= <>
##$DPNAME4= <>
##$DPNAME5= <>
##$DPNAME6= <>
##$DPNAME7= <>
##$DPOAL= (0..7)
0.5 0.5 0.5 0.5 0.5 0.5 0.5 0.5 
##$DPOFFS= (0..7)
0 0 0 0 0 0 0 0 
##$DQDMODE= 0
##$DR= 18
##$DS= 0
##$DSLIST= <SSSSSSSSSSSSSSS>
##$DSPFIRM= 0
$$ [...]
##$SUBNAM2= <"">
##$SUBNAM3= <"">
##$SUBNAM4= <"">
##$SUBNAM5= <"">
##$SUBNAM6= <"">
##$SUBNAM7= <"">
##$SUBNAM8= <"">
##$SUBNAM9= <"">
##$SW= 24.9336996594482
##$SWIBOX= (0..15)
0 0 2 0 0 0 0 0 0 0 0 0 0 0 0 0 
##$SW_h= 4990.01996007984
##$TD= 16384
##$TD0= 1
##$TE= 0
##$TE2= 300
##$TE3= 300
##$TEG= 300
##$TL= (0..7)
0 120 120 120 120 120 120 120 
##$TP= (0..7)
150 150 150 150 150 150 150 150 
##$TP07= 0
##$TPNAME0= <>
##$TPNAME1= <>
##$TPNAME2= <>
##$TPNAME3= <>
##$TPNAME4= <>
##$TPNAME5= <>
##$TPNAME6= <>
##$TPNAME7= <>
##$TPOAL= (0..7)
0.5 0.5 0.5 0.5 0.5 0.5 0.5 0.5 
##$TPOFFS= (0..7)
0 0 0 0 0 0 0 0 
##$TUNHIN= 0
##$TUNHOUT= 0
##$TUNXOUT= 0
##$USERA1= <user>
##$USERA2= <user>
##$USERA3= <user>
##$USERA4= <user>
##$USERA5= <user>
##$V9= 5
##$VALIST= <valist>
##$VCLIST= <CCCCCCCCCCCCCCC>
##$VD= 0
##$VDLIST= <DDDDDDDDDDDDDDD>
##$VPLIST= <PPPPPPPPPPPPPPP>
##$VTLIST= <TTTTTTTTTTTTTTT>
##$WBST= 1024
##$WBSW= 4
##$XGAIN= (0..3)
0 0 0 0 
##$XL= 0
##$YL= 0
##$YMAX_a= 65915
##$YMIN_a= -122221
##$ZGOPTNS= <>
##$ZL1= 120
##$ZL2= 120
##$ZL3= 120
##$ZL4= 120
##$ABSF1= 10
##$ABSF2= 0
##$ABSG= 5
##$ABSL= 3
##$ALPHA= 0
##$AQORDER= 0
##$ASSFAC= 0
##$ASSFACI= 0
##$ASSFACX= 0
##$ASSWID= 0
##$AUNMP= <proc_1d>
##$AZFE= 0.1
##$AZFW= 0.1
##$BCFW= 1
##$BC_mod= 2
##$BYTORDP= 1
##$COROFFS= 0
##$CY= 11.3945322036743
##$DATMOD= 1
##$DC= 2
##$DFILT= <>
##$DTYPP= 0
##$F1P= 18.9103706918063
##$F2P= -1.10871071338519
##$FCOR= 0.5
##$FTSIZE= 0
##$FT_mod= 4
##$GAMMA= 1
##$GB= 0.15
##$INTBC= 1
##$INTSCL= 1
##$ISEN= 128
##$LB= 0.24
##$LEV0= 0
##$LPBIN= 0
##$MAXI= 10000
##$MC2= 0
##$MEAN= 0
##$ME_mod= 0
##$MI= 1.114404
##$NCOEF= 0
##$NC_proc= 0
##$NLEV= 6
##$NOISF1= 3.799351
##$NOISF2= 2.8
##$NSP= 1
##$NTH_PI= 0
##$NZP= 0
##$OFFSET= 15.70392
##$PC= 1
##$PHC0= -8877.631
##$PHC1= 46.40096
##$PH_mod= 1
##$PKNL= yes
##$PPARMOD= 0
##$PSCAL= 0
##$PSIGN= 0
##$REVERSE= no
##$SF= 200.130013532006
##$SI= 16384
##$SIGF1= 3
##$SIGF2= 2
##$SINO= 400
##$SIOLD= 16384
##$SREGLST= <1H.CDCl3>
##$SSB= 0
##$STSI= 0
##$STSR= 0
##$SW_p= 3612.71676300578
##$SYMM= 0
##$S_DEV= 0
##$TDeff= 0
##$TDoff= 0
##$TI= <>
##$TILT= no
##$TM1= 0
##$TM2= 0
##$TOPLEV= 0
##$USERP1= <user>
##$USERP2= <user>
##$USERP3= <user>
##$USERP4= <user>
##$USERP5= <user>
##$WDW= 1
##$XDIM= 8192
##$YMAX_p= 0
##$YMIN_p= 0
$$ End of Bruker specific parameters
$$ ---------------------------------
##NTUPLES= NMR FID
##VAR_NAME=  TIME,          FID/REAL,        FID/IMAG
##SYMBOL=    X,             R,               I
##VAR_TYPE=  INDEPENDENT,   DEPENDENT,       DEPENDENT
##VAR_FORM=  AFFN,          ASDF,            ASDF
##VAR_DIM=   8192,          8192,            8192
##UNITS=     SECONDS,       ARBITRARY UNITS, ARBITRARY UNITS
##FACTOR=    0.0002004,     1,               1
##FIRST=     0,             0,               0
##LAST=      1.6414764,     0,               0
##MIN=       0,             -122221,         0
##MAX=       1.6414764,     65915,           0
$$ Real data points
##PAGE= N=1
##DATA TABLE= (X++(R..R)), XYDATA
0@%%%%%%%%Qj6J6j6J6k4L2l8M6n6O4p2Q8j04J20j36J60j84K08k40K72l06L46l91
$$ 0 0 0 0 0 0 0 0 0 8 -8 8 -8 8 -16 16 -22 24 -32 32 -40 48 -56 64 -72 88 -96 112 -128 144 -162 184 -207
32b07M38m89N48o12O79p53Q37r30J031j141J262j398J548j715J906k121K366k649
$$ -207 231 -258 290 -322 357 -396 441 -489 542 -599 663 -735 813 -902 1004 -1117 1249 -1400
50a400K980l373L848m439N197o208P637r830J3664k2337Q0176r75q2596O4228
$$ -1400 1580 -1793 2055 -2384 2813 -3395 4242 -5588 8076 -14261 65915 64940 -17656 46572
64D6572Q857m8513j5938O3471l585n9253j3295M9299k247l8521L428L7820j3878
$$ 46572 55429 6916 -9022 54449 50864 -8389 -21684 27615 25368 -13153 -9725 28095 14217
77A4217l4288Q554L2092j0590k7535J536J8741q699j5134R688J9436n226j5935
$$ 14217 -20071 -11517 20575 9985 -17550 -16014 2727 -5972 -21106 -11418 8018 2792 -13143
90a3143P36J2262k720q271P224J6082j624j0515M113J0758m935q103P985R513
$$ -13143 -12407 -145 -2865 -11136 -3912 12170 10546 31 4144 14902 9967 1864 9849 19362
104A9362o060k669J0285K292j1619j748R701k575q943O884R752r066r494R210
$$ 19362 13302 10633 20918 23210 11591 9843 19544 16969 8026 14910 24662 15596 6102 15312
118A5312M101j3558l401J3519j980j7255J303J5830n693j6781O177J3635j1846
$$ 15312 19413 5855 2454 15973 13993 -3262 -1959 13871 8178 -8603 -2426 11209 -637
131f37j5263J1244J2666j2288j0378J2209O589j5575o520J5328M953j3741k533
$$ -637 -15900 -4656 8010 -4278 -14656 -2447 4142 -11433 -17953 -2625 2328 -11413 -13946
144a3946J4386J661j3072n50J2666O17j1658J079J1905Q85q792L73J1120o4j0208
$$ -13946 440 2101 -10971 -11521 1145 1762 -9896 -8817 3088 3973 -4819 -4446 6674 6610 -3598
159c598j17J1465J154r958J447J1600l88j1289J197J0864l292j0196M522J1162
$$ -3598 -3715 7750 8904 -1054 393 11993 11605 316 1513 12377 9085 -1111 3411 14573
173A4573m740r945N542Q700q515r449P833Q102q575o412Q831L251j0694l703Q224
$$ 14573 9833 -112 5430 14130 5615 -3834 3999 12101 3526 -2886 5945 9196 -1498 -5201 3023
188C023n3q454J013Q073k590q162K492N016n386m845M776M641n120k231M995Q50
$$ 3023 2970 -5484 -4471 3602 1012 -7150 -4658 358 -5028 -9873 -5097 -456 -5576 -7807 -2812 -1962
204a962n548K7N286l62m042K187N315j552l506K766M445k899l498M927M483k443
$$ -1962 -7510 -7483 -2197 -2559 -6601 -4414 901 -651 -4157 -1391 3054 155 -3343 1584 6067 3624
220C624k993M529L101l790l316M133M284l692k548M756L159n868l321N596K231
$$ 3624 631 5160 8261 4471 1155 5288 9572 5880 3332 8088 11247 5379 2058 7654 9885
235I885o694j718O729N12q177j055O982q23q360L55P329k413q114K259O522l766
$$ 9885 3191 1473 8202 8714 537 -518 6464 5641 -2719 -2364 4965 2552 -5562 -3303 3219 -547
251e47o878L643N298n460m807N095M557n698l091N991K340n576j628O413J882
$$ -547 -7425 -3782 1516 -3944 -8751 -3656 901 -4797 -7888 -1897 443 -5133 -6761 -348 1534
266A534m928qN654K47m392Q60N110J92l766J669M141j112l262K207L838j985l524
$$ 1534 -3394 -3402 2252 2499 -1893 -1033 4077 4269 503 2172 6313 5201 1939 4146 7984 5999 2475
283B475K687K950l299k517L504K152m025k552L365N27l921j501L394M18m847p2
$$ 2475 5162 8112 4813 2296 5800 7952 3927 1375 4740 5267 1346 -155 3239 3657 -1190 -1262
299a262L123j403m988J012L537k116m254K304L253l053m037L319L723m189k554
$$ -1262 1861 458 -4530 -3518 19 -2097 -6351 -4047 -794 -3847 -7884 -4565 -842 -5031 -7585
314g585M505K239l932j450M863J426m363J84M822Q29m035O67N121m2m812J683
$$ -7585 -3080 -841 -4773 -6223 -1360 66 -4297 -4113 709 1538 -2497 -1830 3291 3249 -1563 120
330A20N312r87m622K398M835j866m296K463M029l376k896L066L029l652k883L088
$$ 120 5432 4445 -177 2221 7056 5190 894 3357 7386 4010 1114 4180 7209 3557 674 3762
346C762J632l865k368L669J325m601j579L661P01n078j176M028l17m292J32L744
$$ 3762 5394 1529 -839 2830 4155 -446 -2025 1636 2337 -2741 -3917 111 -206 -4498 -4366 -622
362f22o92m002R72L099j561k747J751K995k459j927K936K045k495j387L373J627
$$ -622 -1314 -5316 -4344 -1245 -2806 -5553 -3802 -807 -3266 -5193 -2257 -212 -2707 -4094 -721 906
378I06k649p15L360J558l066p2L603J91k749O98L215q24k653K008K558j898k471
$$ 906 -1743 -2458 902 2460 -606 -678 2925 3116 367 1065 4280 3456 803 2811 5369 3471 1000
395A000K158K412k575k247K605J771l177k179L183J077m045j145L103J99l685
$$ 1000 3158 5570 2995 748 3353 5124 1947 -232 2951 4028 -17 -1162 1941 2140 -1545
410a545n21L044l26l933L47L082j110l852J078L727k198l640K233K926k010k688
$$ -1545 -2066 978 652 -3281 -2934 148 -962 -4814 -3736 -9 -2207 -5847 -3614 -688 -2698 -5386
426e386K064K947k082k202K751K485k626j657L418J822k740q22L371J447l229
$$ -5386 -3322 -375 -2457 -4659 -1908 577 -2049 -3706 -288 1534 -1206 -2028 1343 2790 -439
441d39P8L429O65l616R02L410m60k783Q19K654q89k845J501K249j685k344J465
$$ -439 -361 3068 3733 117 1019 4429 3969 1186 2005 4659 3770 925 2426 4675 2990 646 2111
458B111K000k625j711K084J123l025j363K447O00l253j025K358j57l009M3K313
$$ 2111 4111 1486 -225 1859 2982 -43 -1406 1041 1641 -1612 -2637 -279 -436 -3445 -3402 -1089
474a089m54k991R25K485j524k325J290K355j674j543K000K019k026j385K719J659
$$ -1089 -1543 -4534 -3609 -1124 -2648 -4973 -3683 -1328 -3002 -4545 -2545 -526 -2552 -3937 -1218 441
490D41k391o91K956J194k107l62K602Q00k341N52K647R4k272P14K783j156k214
$$ 441 -1950 -2641 315 1509 -598 -960 1642 2442 101 653 3300 3394 1122 1836 4619 3463 1249
507A249J140K423j572k280J610J967k041k096J702J658k470k181J697J536k704
$$ 1249 2389 4812 3240 960 2570 4537 2496 400 2102 3760 1290 -891 806 2342 -362
522c62j486K145L01l367o4K503o33k535l43K925j018k708N04K636p08k757J150
$$ -362 -1848 297 598 -2769 -2833 -330 -963 -3498 -3841 -916 -1934 -4642 -4138 -1502 -2210 -4967 -3817
539c817K797j133j887J466K394j544j398K209J788j817n53K514P51j586l58K411
$$ -3817 -1020 -2153 -4040 -2574 -180 -1724 -3122 -913 875 -942 -1495 1019 1770 184 -174 2237
555B237Q05j900K13K324n9k124K00K350l68k087P58J904j111k179J435J140j486
$$ 2237 3042 1142 1355 3679 3620 1496 1696 4046 3678 1591 2349 4253 3142 963 2398 3538 2052
572B052j673J015J349k330j404J677O10k197j160J587K35k576o06K251j30k611
$$ 2052 379 1394 2743 413 -991 686 1296 -901 -2061 -474 -239 -2815 -3421 -1170 -1300 -3911
588c911O00K039p71k382Q82K271j125j792J502J842j258j486J997J634j584j070
$$ -3911 -3311 -1272 -2043 -4425 -3543 -1272 -2397 -4189 -2687 -845 -2103 -3589 -1592 42 -1542 -2612
604b612K311J568j798p32K615Q70k058n4K718K13j948L66K462o99j699O09K235
$$ -2612 -301 1267 -531 -1263 1352 2222 164 110 2828 3041 1093 1459 3921 3222 1523 2132 4367
621D367j115j958Q86J427r30k179J186J694j796j833J373J142k025j650J235J023
$$ 4367 3252 1294 2180 3607 2677 498 1684 3378 1582 -251 1122 2264 239 -1411 -176 847
637H47k074j064J475L12j853q34J710J5k049K30J917n25j879L22K348q91j708
$$ 847 -1227 -2291 -816 -504 -2357 -3191 -1481 -1466 -3515 -3285 -1368 -1893 -3772 -3450 -1102 -1993 -3701
654c701R94K205n34j530J122J643j221m20J327J535j265q26K375P94j769N7K291
$$ -3701 -2707 -502 -1036 -2566 -1444 199 -1022 -1442 -115 1420 155 -671 1704 2498 729 786 3077
671C077k78j559M17J974o17j306M66J614j131j344R83J266j654j379J194R19j552
$$ 3077 2799 1240 1657 3631 3014 1708 2174 3788 2657 1313 2296 3562 1908 529 1723 2642 1090
688A090j158Q97R57k341j023J679J35j878p59J651j7j902l71J607J20j872J6J588
$$ 1090 -68 829 1786 -555 -1578 101 236 -1642 -2401 -750 -767 -2669 -3040 -1433 -1313 -3185 -3169 -1581
706a581m50j502P28J761r16r55O12K046j029j030J322J502r97o58J344J365q20
$$ -1581 -2031 -3533 -2805 -1044 -1960 -2915 -2303 -257 -1286 -2316 -994 508 -489 -1147 197 1562 742
723G42j009J753J424j646m99J667P13j401m23K005P9j758J20J695r18j536O85
$$ 742 -267 1486 2910 1264 765 2432 3145 1744 1321 3326 3405 1647 1767 3462 2544 1008 1693
740A693J158j227j957J349J073j591j055Q07N63j621p60J187K7j651m18J526q14
$$ 1693 2851 1624 -333 1016 2089 498 -557 250 813 -808 -1568 -381 -354 -2005 -2423 -897 -1711
757a711j313M36J060o93j115Q25P05k88p00M34J164k42q20R02J004n83m00J034
$$ -1711 -3024 -2588 -1528 -2221 -3336 -2511 -1806 -2094 -2794 -2360 -1196 -1438 -2258 -1356 -352 -935 -1335 -301
775c01J019q19q5J517O39j187k26J418P74j416k58J888R9j626k1J774l31j933
$$ -301 718 -101 -186 1331 1970 783 557 1975 2749 1333 1075 2963 3062 1436 1415 3189 2858 925
793I25Q53J179q63j336O98J052j388j248Q90Q04j665j344J475M19j971o26J551
$$ 925 1778 2957 2094 758 1456 2508 1120 -128 762 1566 -99 -1443 32 451 -1520 -2146 -595
810e95j19j597k32J055R5j717M43J484q00j151O61J128n06j010J195R21n84q23
$$ -595 -714 -2311 -2543 -1488 -1393 -3110 -2667 -1183 -1983 -3134 -2473 -1345 -1851 -2861 -1666 -745 -1329 -2152
828b152J310J175q81m01J171Q93o73l17Q63Q33n87k69J133K67q56k17J376Q5j102
$$ -2152 -842 333 -548 -949 222 1115 442 125 988 1821 1234 965 2098 2365 1509 1292 2668 2753 1651
847A651k56J520k78j668N53Q57n58j399K57J649j633j415R19M01r29j292J196
$$ 1651 1395 2915 2637 969 1522 2379 1821 422 679 2328 695 -720 199 600 -329 -1621 -425
864d25K04j454o80J389R4j542O7J134m02j257K37J292l13j356N86J629n78j142
$$ -425 -221 -1675 -2355 -966 -872 -2414 -2347 -1213 -1615 -2872 -2635 -1343 -1656 -3012 -2426 -797 -1375 -2517
882b517J234Q24m58o01P27J131m59p26J645M80r00K9J212K56l72o21J328O73j177
$$ -2517 -1283 -459 -917 -1518 -791 340 -119 -845 800 1280 380 409 1621 1877 1505 884 2212 2885 1708
901A708k58J393k49r71k19J143r8j489M58R34q79r54n7N51l13j324M56Q92j387
$$ 1708 1450 2843 2594 1623 1404 2547 2449 960 1418 2352 1473 519 462 1013 700 -624 -168 724 -663
920f63r86Q61M64j370p57J020O02j625j95J340l17j152L39J301m26j040N96J398
$$ -663 -1649 -788 -324 -1694 -2451 -1431 -829 -2454 -2649 -1309 -1626 -2778 -2439 -1138 -1564 -2604 -2008 -610
938f10m79j158J452R73q41m18J047Q07m93o72J122N53l96M5O86J47n00L27N70
$$ -610 -1089 -2247 -795 178 -663 -1081 -34 773 280 -392 730 1283 887 932 1618 1765 1265 1592 2162
957B162r0l50J33M91J0j071M3P70j59j160K48O45m46j112K44L82o90r64K25Q37
$$ 2162 2072 1722 1855 2346 2356 1285 1328 2098 1939 779 1027 1672 1226 114 358 740 50 -914 -689 148
977A48r75o23M36N11j238n23P70K11r30k97J037M53j393L03J135k85q02M87J173
$$ 148 -827 -1450 -1014 -503 -1741 -2264 -1494 -1283 -2213 -2510 -1473 -1020 -2413 -2110 -975 -1260 -2062 -1575 -402
996d02m79q50R35J125q56m82J135R47q89J33J032L95r96J75J122o5o28L12P16
$$ -402 -881 -1731 -796 329 -527 -1009 126 1073 184 317 1349 1744 748 923 2045 1980 1352 1664 2380
1015B380j86n49N2M63k06o94m6L61l94n66L82q8m42p15L24L89q88r62P63K97q79
$$ 2380 2194 1645 1697 2160 1954 1260 1214 1575 1181 615 997 909 467 -248 76 465 -423 -1385 -622 -325 -1204
1036a204n08O97J07j041l88Q41L99r62m60J246J92p37k75J121j7o98P62N38m8
$$ -1204 -1712 -1015 -908 -1949 -2337 -1496 -1097 -2059 -2519 -1273 -1081 -1818 -2093 -972 -989 -1687 -925 -387 -435
1055d35j057P87J342o16n10J068R67r89r8J183J22n87L1O50K68q62L34O55n62
$$ -435 -1492 -705 637 21 -489 579 1546 557 459 1642 1764 1177 1208 1858 2126 1264 1598 2253 1691
1074A691m67L02M35j80q70O3N94m44r79M17J86o46o94K83J92o58o43M38L30o11
$$ 1691 1224 1526 1961 1781 911 974 1568 1124 145 562 748 102 -592 -309 -117 -775 -1418 -980 -650 -1261
1094a261n62N34Jo09k60Q36j59m30k40J031k62n61L62P41J52r60O64Q99m7l29
$$ -1261 -1823 -1289 -1288 -1897 -2157 -1321 -1480 -1910 -2150 -1119 -1381 -1942 -1580 -839 -687 -1647 -983 -84 -131 -460
1114d60K39R17k06l82O27N14k83j03M26N92m90n66Q27O59q87m00Q94m8n58k52
$$ -460 -221 696 490 108 735 1249 966 863 1289 1881 1391 825 1652 2311 1424 1024 1918 1870 1312 1060
1134A060O04j60p27o4N57l98j099N96K61n84q75J53O68q84p44Q32k05l94l62N68
$$ 1060 1664 1504 777 713 1270 872 -227 369 630 46 -829 -676 -8 -892 -1636 -804 -1009 -1403 -1765 -1197
1154a197J17p47j26O23j14l76K01M73R4k78nO42j37j11M60P57m07k43N18P18l55
$$ -1197 -1080 -1827 -1953 -1330 -1444 -1820 -1619 -1146 -1052 -1330 -1335 -693 -830 -941 -481 276 -131 -374 144 862 507
1175E07q6M88R72p48r6N64L38m85m99N58L41o55j52P36M9q66J14J78K2q13O9O37
$$ 507 421 909 1881 1133 1037 1601 1939 1454 955 1513 1854 1199 1047 1783 1832 966 1080 1258 1280 467 536 1173
1197A173n73q44K05K71o18o51M23L49p61l43J69K05n40m56Q27R3q05m2Q35K02
$$ 1173 600 -244 -39 232 -386 -1037 -614 -265 -1026 -1369 -1200 -995 -1535 -1991 -1164 -1071 -1876 -1918 -1083 -881
1217h81o74n5P07k0o19R22L36K10o00M51O05Kr5J73O20n52L9K31Q57m22k69O62
$$ -881 -1555 -1610 -903 -923 -1542 -620 -284 -74 -674 -223 382 384 289 462 1082 530 569 800 1657 1235 966 1628
1239A628J84p83M9M08K93q64j86P26k26m27j22M13m57o78M90j33k14n18K32K83
$$ 1628 1812 1029 1078 1486 1779 915 729 1455 1229 802 680 1093 636 -42 448 315 101 -417 -185 98
1259I8o39n21Q0L12n29m48M56L58n41k61P30j89n40%O76J09l72q7N14J00m37O61
$$ 98 -541 -1062 -982 -670 -1199 -1647 -1191 -833 -1374 -1635 -905 -1094 -1634 -1634 -958 -849 -1221 -1308 -794 -694 -1131 -470
1281d70N82k59k03L50Q89k33m10L50O89n26n2L93J49k19M9M81Q1n86l02P69k50
$$ -470 112 -147 -350 0 889 656 246 596 1285 759 707 1100 1249 1030 1079 1560 1641 1055 753 1522 1272
1302A272k68J33J17l69l60k1K52k04n03n2M38p66o05M58K61o51j78J83J42n89
$$ 1272 1004 1137 1254 885 525 504 756 552 49 -3 435 -331 -936 -478 -217 -868 -1046 -863 -721 -1310
1322a310q6L83j7r7p19Q00K85p60L13L50K58n87J16R11k32k33M22L00J05l40P36
$$ -1310 -1396 -1013 -1030 -1127 -1846 -1046 -761 -1521 -1208 -858 -600 -1187 -1071 -160 -392 -625 -203 97 202 -138 598
1343E98M80l87k15K85Q09q73j23R71K62p04j25O48M2n49J15P0j72j31m87M47j97
$$ 598 1078 691 476 761 1570 697 574 1545 1807 1103 978 1626 1668 1119 1234 1304 1132 1001 514 961 764
1364G64l52p8K75l05p09K62j81j00o15J05O40p35m62L52M43k93p69N00L66n69
$$ 764 412 334 609 304 -405 -143 -324 -424 -1039 -934 -294 -1029 -1491 -1139 -696 -989 -1758 -1258 -892 -1461
1384a461k97R44j18l69K99N16N2o39M21R82k96m95O16M59k68l83P54K00j28j13
$$ -1461 -1758 -814 -932 -1301 -1002 -486 -434 -1073 -652 330 34 -461 155 614 346 -37 717 917 789 676
1404F76O69O2l41k64R24Jp04M13N0n1m76j74M97l60m13j8K65n65k05j16M9J57
$$ 676 1345 1407 1066 802 1726 1727 1023 1436 1486 1435 959 785 1282 922 509 491 756 191 -14 -130 -81 76
1426G6m60p6J87n53k86K28k5o1m47L29n6l17M3K60L9k85J09M59j51j82L41L75
$$ 76 -384 -460 -273 -826 -1112 -884 -909 -970 -1417 -1088 -1144 -1461 -1418 -1158 -1119 -1404 -1295 -836 -987 -1169 -828 -453
1448d53J34j70Q0N16p6j58L70L68k7j91O16K48l97k51P34L4j03j64J77J96m63
$$ -453 -319 -489 -409 107 31 -127 243 611 584 393 1009 1257 860 609 1343 1377 1274 1110 1287 1483 1020
1469A020M3L72l20l10j1N21m79n83K24J58n60j69k62P12p96m69M62L2o68j48N18
$$ 1020 1063 1435 1115 805 794 1315 836 253 477 635 75 -94 -356 356 -440 -909 -447 -415 -1083 -1231 -713
1490g13k14n25O4K20K89q48M35L69J60n22J99N36j47l16M67O36j8k60k70O13K08
$$ -713 -927 -1452 -1388 -1168 -879 -1727 -1292 -923 -763 -1285 -1086 -550 -697 -1013 -546 90 72 -188 -458 155 363
1511C63j45j84Q96k96k72O16O0qp4J96J05j93o3O78k17p18L90Q4j23m33n84R95
$$ 363 218 34 930 634 362 978 1038 1030 956 1152 1257 1064 1001 1679 1462 744 1134 1218 1095 662 78 1073
1533A073m31m11r2L53m42n33L20jo60k06J19K92m45l14M42J12n34j18L08j0L9
$$ 1073 642 231 139 492 50 -483 -163 -164 -824 -1030 -911 -619 -1064 -1378 -936 -824 -1358 -1476 -1168 -1178 -1139
1554a139r7M43j73KL30L9R6j31K61N22k66J7M25K73Q7n47N91M7K08m96L87L08
$$ -1139 -1236 -793 -966 -964 -634 -595 -499 -630 -369 153 -113 -96 329 602 689 142 733 780 988 492 879 1187
1576A187k73m0J42K84o3k88L37j04m05j3j42M5j76j06Q1k43o94L41L27n47k38
$$ 1187 914 874 1016 1300 1237 949 1286 1182 777 764 622 667 491 385 466 223 -471 -130 197 -350 -588
1597e88j12N00n34l47M05N6k31k38O1j2l2k71L71kJ02k14N36l00J73j5J00L92
$$ -588 -700 -200 -734 -1081 -676 -620 -851 -1089 -1028 -1040 -1072 -1343 -972 -974 -872 -1086 -550 -850 -677 -692 -592 -200
1619b00k10J45O8L21l5N84kJ81m93L85J26K42j77n0M18k07k23L87j34k69J3K17
$$ -200 -410 -265 -197 124 89 673 671 852 359 744 870 1112 935 885 1303 1096 873 1260 1126 857 870 1087
1641A087no88l5M21j58m12k72K52j11M3o12L44j36k65j12k0j81k12K83J81p10
$$ 1087 1082 394 359 780 622 210 -62 190 79 122 -490 -146 -282 -547 -659 -679 -860 -1072 -789 -608 -1318
1662a318K70J89J05l74j80K31K30m8n4Q13m70Q7L4N78l28l4Q1O09pl29J65N41
$$ -1318 -1048 -859 -754 -1128 -1308 -1077 -847 -895 -949 -136 -606 -519 -485 93 -235 -269 -188 421 414 85 250 791
1684G91k48k56N31J32j25J68P6r3l7j13N1J6j64q3j29N31o92j02L76j54p01J58
$$ 791 543 287 818 950 825 993 1069 976 939 826 877 893 729 646 517 1048 356 254 630 476 -225 -67
1706f7K78m17l22N04l71l45j6q4r1J52m12L68K96n03R2L30k21m42L33M60J52j42
$$ -67 211 -206 -528 -24 -395 -740 -756 -840 -931 -779 -1191 -823 -527 -1030 -938 -608 -829 -1271 -938 -478 -326 -468
1728d68j95N80j78k60K86M55m11L37J74J97O7k61L48J84j10R3m5K41k7k15J52
$$ -468 -663 -83 -261 -521 -235 220 -191 146 320 517 584 323 671 855 745 838 793 1034 1007 792 944
1749I44J97n22r0L16K63l54l74L58k25k43j44K40N3p03j05N66n24J32j64m43J71
$$ 944 1141 619 529 845 1108 754 380 738 513 270 126 366 419 -284 -389 177 -347 -215 -379 -822 -651
1770f51o87M91k2J50k09M55j76k46q0O5K07J9j29J98J10j6K61J61Jk25K10L33
$$ -651 -1338 -847 -869 -719 -928 -473 -649 -895 -975 -910 -703 -684 -813 -615 -505 -521 -260 -99 -98 -323 -113 220
1792B20J22m67N14K87N6l30N60k13q8JL59J31m70K25j3M48n61k26K62p8k1m06
$$ 220 342 -125 389 676 732 402 962 749 661 662 1021 1152 682 907 894 1342 781 555 817 739 718 312
1814C12K72j29n9p56L33j4j73k47L13j76k58l06J55L6k38N0J7L1k50M69m4l23
$$ 312 584 455 396 -360 -27 -41 -214 -461 -148 -324 -582 -888 -733 -697 -935 -885 -868 -837 -1087 -618 -662 -985
1836i85L41k00K15jk93O25j32K01M4M73j76k70J26M02J93k89J04K06J03j02K21
$$ -985 -644 -844 -629 -630 -923 -298 -430 -229 -185 288 112 -158 -32 370 563 274 378 584 687 585 806
1857H06j34K33m57P41l05m10J5M8M79n94N3L73l17O4l51J29Qn23J65k31j26J01
$$ 806 672 905 448 1189 884 474 489 537 1016 422 475 848 531 595 244 373 381 -142 23 -208 -334 -233
1879b33l46L92k11m63M5j61K64k20K45q6m15K36l6M89k69m05O99J74j95k3O4M46
$$ -233 -579 -187 -398 -861 -816 -977 -713 -933 -688 -774 -1189 -953 -989 -500 -769 -1174 -475 -301 -496 -519 -455 -9
1901ij43J38q6K33j32KK64K58K7k08P15l37J1J4M14j95k75K35P4l36j08K51j09
$$ -9 -152 -14 -100 133 1 3 267 525 552 344 1059 722 733 747 1161 966 691 926 1000 664 556 807 698
1924F98j41j77pJ39l06M9j08m09J60pq6lm27Q6K37m69Q0J28k9l58L44j96K30k99
$$ 698 557 380 373 512 206 255 147 -262 -102 -109 -195 -198 -625 -539 -302 -771 -691 -563 -592 -950 -606 -802 -572 -871
1948h71J99k17N51k03k00J81J28j70M0M26K05j47K27P7Q2J4j48K35K39on6K91
$$ -871 -672 -889 -338 -541 -741 -560 -432 -602 -562 -136 69 -78 149 226 308 322 174 409 648 642 586 877
1970H77j85l44K91J07K7j39K56M4j6l02K65j62m70l8K73p5m53J7j92K33m23K00
$$ 877 692 348 639 746 773 634 890 934 918 616 881 719 249 211 484 409 -44 -27 -219 14 -409 -209
1992b09K07m49l88K60k1N4k33l6J14p5p7K11K32l29p6K30p1k08Q2L92K17o6j13
$$ -209 -2 -451 -839 -579 -600 -546 -779 -815 -701 -776 -853 -642 -410 -739 -815 -585 -656 -864 -782 -390 -173 -239 -352
2015c52N94l10J13J72m6q6J42O29q6l38K77n9J16k28J66K29Q3j73j73j52K82j13
$$ -352 242 -68 45 217 171 85 227 856 770 432 709 650 766 538 704 933 1016 843 670 518 800 687
2037F87l93L22j73J53m02N2N1m05q1j01O3k81N5L5j85r7L0K64k51l9k32K72j06
$$ 687 294 616 443 596 194 246 297 -108 -189 -290 -227 -508 -453 -418 -603 -700 -670 -406 -657 -696 -928 -656 -762
2060g62k51K29k4L33l69L86M06n13k7M63J0l4J04J51qJ23j38P7L09Q1k53L00J33
$$ -762 -1013 -784 -808 -475 -844 -458 -52 -565 -592 -129 -119 -153 -49 102 94 217 79 156 465 546 293 593 726
2083G26n0L18j89m5l09N81j70p0l09J38j28j62l23N34k68j62m5j2J5j78r0k38
$$ 726 676 994 805 760 451 1032 862 792 483 621 493 331 8 542 274 112 67 55 70 -108 -198 -436
2105d36P9m92J97R4m3j50J97k87J82QL2J32l03Q9K27R5l14K64K03j84j9J63K27
$$ -436 -357 -849 -652 -558 -601 -751 -554 -841 -659 -651 -619 -487 -790 -701 -474 -379 -693 -429 -226 -410 -429 -266 -39
2128c9m6j51K28L15K75k43j70N61l31p6K57%j12K68J6J63l65j38L36j72r0p4K1
$$ -39 -85 -236 -8 307 582 339 169 730 399 323 580 580 468 736 752 915 550 412 748 576 486 412 433
2151D33J24k23o2O4J07k30q4o3l13n93L62M57k58m64Q8m0J6J8J6L12l40n1j25
$$ 433 557 334 272 336 443 213 129 66 -247 -840 -478 -21 -279 -743 -655 -695 -679 -661 -645 -333 -673 -724 -849
2174h49L87k65j21L98j23qM00k24NJ70j4Q9k4L16K50J50N2n83M64K93j66m39L89
$$ -849 -462 -727 -848 -450 -573 -581 -181 -405 -400 -230 -244 -155 -179 137 387 537 589 6 470 763 597 158 547
2197E47K62k19q5j6K89j47l9P4M8l5j78j8j57k87K27N5j03l09N5R2n75J62M3P1
$$ 547 809 590 505 489 778 631 592 666 714 679 501 483 326 39 266 321 218 -91 -36 56 -519 -357 -314 -243
2221b43j43j70R1J54l03jJ9m08L57j65n6N18k8j07J87l1R9J72k26k2K15j92P49
$$ -243 -386 -556 -465 -311 -614 -615 -596 -1004 -647 -812 -868 -350 -378 -485 -298 -329 -230 -58 -284 -306 -91 -283 466
2244D66j28j66Q5j07L09k80K77L93l73R0R1J57j51j01j69J62j46L72o04N0n2j5
$$ 466 338 172 257 150 459 179 456 849 476 566 657 814 663 562 393 555 409 781 177 227 175 160
2266A60j27K77j29k72J9L0j6j01K25m52j15J07n7k02k02M46o2k08J65k12J64p7
$$ 160 33 310 181 -91 -72 -42 -58 -159 66 -386 -501 -394 -451 -653 -855 -409 -471 -679 -514 -726 -562 -639
2288f39Jm7J99j02J41M2J9j80N71j19J42O9l65M82P9J59j91J53N7l42L29K38k53
$$ -639 -638 -685 -486 -588 -447 -405 -386 -566 5 -114 28 97 -268 214 293 452 261 414 471 129 458 696 443
2311D43k84L37K82J27l56J32k43q2j82j55M94k05k62J64j85n4j39L7j51J38j62
$$ 443 159 496 778 905 549 681 438 356 174 19 513 308 46 210 25 -29 -168 -131 -282 -144 -306
2332c06J46k68j3L6P8O1k93K3J31ml96J55K15K76n69L39l1l9K24j3K65j06L13
$$ -306 -160 -428 -441 -405 -327 -266 -559 -536 -405 -409 -805 -650 -435 -159 -728 -389 -420 -459 -235 -248 17 -89 224
2355B24l28R9l6L39k65M66j1J27j91k6Q1K23m0k01r3M24p1j56lK55j83n06K18
$$ 224 -104 -5 -41 298 33 499 488 615 424 398 479 702 662 461 368 792 721 565 562 817 634 128 346
2378C46K5q6j61Q1j34j59r4J3R1j39k38P0Q0K23l88k16J27j81K80r1n4p4J4N17
$$ 346 371 285 124 205 71 -88 -182 -169 -78 -217 -455 -385 -305 -82 -470 -686 -559 -740 -460 -551 -605 -679 -665 -148
2402a48l69M8K65o0J36j72K03m11P42l96J12k6M20p6m12K45N14j91J2K16j45j30
$$ -148 -517 -469 -204 -264 -128 -300 -97 -508 234 -162 -50 -76 344 268 -144 101 615 424 436 652 507 377
2424C77J41j8J5k04K29Ko2r3m0k32%qr6K13l21L51n78J1Q9k69L54j55m25L52K1
$$ 377 518 500 515 311 540 542 480 387 347 115 115 107 11 224 -97 254 -324 -313 -224 -493 -139 -294 -719 -367 -346
2449c46k79J11L3M14n18j29l2J22L8K47q4j37Q0J27k07J98M8K32J64N6J37n7N8
$$ -346 -625 -514 -481 -67 -585 -714 -746 -624 -586 -339 -423 -560 -480 -353 -560 -362 -314 -82 82 138 275 218 276
2472B76j34j33O87k55j01K23m6l1r2J57j45Q4l0%R1l15L5J61N5l59p5k16R3j13
$$ 276 142 9 696 441 340 563 517 486 394 551 406 490 460 460 551 236 271 432 487 128 53 -163 -70 -183
2496a83J10j89K3m29L66q6K81r2k10l2j51R3M5K32j87k07L15j37m6J7J01R1O7
$$ -183 -73 -262 -239 -668 -302 -388 -107 -199 -409 -441 -592 -499 -454 -222 -409 -616 -301 -438 -484 -467 -366 -275 -208
2519b08Q0j7o3PJ88J18Q6K28k47m3J91R7j71J24J33K23j28m5k38O9N8J21K21m69
$$ -208 -128 -145 -208 -201 -13 105 191 419 172 129 320 417 246 370 503 726 598 553 315 384 442 563 784 315
2543C15J49N0n70K61K7j33R2Q1l25J07l08K22P8m94J08j20j31k2O3R7p2J51j21
$$ 315 464 514 -56 205 232 99 191 272 -53 54 -254 -32 46 -448 -340 -460 -591 -613 -550 -453 -525 -374 -495
2566d95k78M18o3l85N73j55L8J03k51L04P2Jm06M24J86q2N91k77j41P6K47K05
$$ -495 -773 -355 -418 -803 -230 -385 -347 -244 -495 -191 -119 -118 -524 -100 86 4 595 318 177 253 500 705
2588G05m37o7L32l2j26L84k30j49Q2k19J3L44k59k9k60L78j14j11j23p5Q3r9l99
$$ 705 268 201 533 501 375 759 529 380 462 243 256 600 341 312 52 430 316 205 82 7 90 -9 -408
2611d08J94j7J52j52K60l20k2P5p4j51oK0R9j59M12K8k31j59J94M3j32J18j68
$$ -408 -214 -231 -79 -231 29 -291 -313 -238 -312 -463 -469 -449 -350 -509 -97 -69 -300 -459 -265 -222 -354 -236 -404
2634d04J45J84J91JL8m21L81M01N9l26L05j85R0J19R0j42M6k69M5j66K43j78J76
$$ -404 -259 -75 116 117 155 -266 115 516 575 249 554 369 459 578 668 526 572 303 348 182 425 247 423
2657D23j43l52K62J8n7J12j77j95J25pm87L58j54j44L0J74Rp6J06l67nj67O4M47
$$ 423 280 -72 190 208 151 263 86 -109 16 9 -478 -120 -274 -418 -388 -214 -205 -281 -175 -542 -547 -714 -650 -203
2681b03k56k10J24m8J52K7n6M53k70J11l9L43M7j58L64j98J14p2K19j84J06j41
$$ -203 -459 -669 -545 -593 -441 -414 -470 -17 -287 -176 -215 128 175 17 381 183 297 225 444 260 366 225
2703B25L78l58J39n8L23j31k86M11l77J43k13j57K39J27j7m47J13n2n9K47k20
$$ 225 603 245 384 326 649 518 232 643 266 409 196 39 278 405 388 -59 54 2 -57 190 -30
2724c0j09l64R6l1l9J9K24j05l45L6L41m7j52k27Q7O5K42J98k24K66j99nj45L38
$$ -30 -139 -503 -407 -438 -477 -458 -234 -339 -684 -648 -307 -354 -506 -733 -646 -581 -339 -141 -365 -99 -298 -303 -448 -110
2748a10J37J99j08M9J59j88rL70j48J55j1k17M11k46k98J75J71k6m5j22j35L75
$$ -110 27 226 118 167 326 138 129 499 351 506 495 278 689 443 145 320 491 465 420 298 163 538
2770E38m77N6K18q6J8k15lj5k28J98o7k7n7j09J09m69J07l3lK12O0J45k86m09
$$ 538 61 117 335 249 267 52 49 34 -194 4 -63 -90 -147 -256 -147 -616 -509 -542 -545 -333 -273 -128 -414 -823
2794h23L83J38J10K15m18M6K01m12J52R7M25L1j35K7K93k14K67k4j70K88R1j57
$$ -823 -440 -302 -192 23 -395 -349 -148 -560 -408 -311 114 145 10 37 330 116 383 359 189 477 568 411
2816D11J30J43j31k57J0K39k71M51m71p9K59k83J6k0m0J77j42j39k5K9j97O0r8
$$ 411 541 684 553 296 306 545 274 725 254 175 434 151 167 147 107 284 142 3 -22 7 -190 -130 -228
2839b28k06J43j62m0RL06l50l7R4K01k17N6k6J61j46K12j1J51K9k2j79J41M9J43
$$ -228 -434 -291 -453 -493 -484 -178 -528 -565 -471 -270 -487 -431 -457 -296 -442 -230 -241 -90 -61 -83 -262 -121 -72 71
2863G1J3J39L28n40j04L36J74k17J71j27J23J74k79K32K4J55l61Pkj05r5J12q4
$$ 71 84 223 551 11 -93 243 417 200 371 244 367 541 262 494 518 673 312 319 317 212 117 229 145
2886A45j4Q5k86K65q7l48j75O8j55K61rN6l87L07K63m69o0O1R4j26K55k68J98
$$ 145 131 216 -70 195 108 -240 -415 -347 -502 -241 -250 -194 -581 -274 -11 -480 -540 -479 -385 -511 -256 -524 -326
2909c26LJ6J36J4l6L91m12M10k80J46J52q2j78R6K74k22K20M1K61j29l47J17J19
$$ -326 -323 -307 -171 -157 -193 198 -214 196 -84 62 214 132 -46 50 324 102 322 363 624 495 148 265 384
2932C84o0N2L2J75j66l30J03R7l29M38o5j77k47p4J93L5jm96N45j30l29o1N0K53
$$ 384 324 376 408 583 417 87 190 287 -42 396 331 154 -93 -167 26 61 60 -436 109 -21 -350 -411 -361 -108
2956a08p7k52J34J97j48j69L5K31k59J56J93j24k2J42j14L3l3K65Q0l78L22K09
$$ -108 -185 -437 -303 -106 -254 -423 -388 -157 -416 -260 -67 -191 -213 -71 -185 -152 -185 80 160 -218 104 313
2978C13l31M73n68M59K26k87k08M20k14J69M8k46N5j19K27m7l7R2K6l87K20j80
$$ 313 -18 455 -113 346 572 285 77 497 283 452 500 254 309 190 417 370 333 425 451 64 284 104
3000A04J8l09n6Q1k19L53j08k31K30l3k67K1J34Q2l97r8K36q7M79l42q7J30L5
$$ 104 122 -187 -243 -162 -381 -28 -136 -367 -137 -170 -437 -416 -282 -200 -597 -695 -459 -546 -67 -409 -496 -366 -331
3023c31k38L56K54k9l18L06j40O8j02J63J84J20j61OL41l10J61o5J65p5J6J92
$$ -331 -569 -213 41 12 -306 0 -140 -72 -174 -11 173 293 132 138 479 169 330 265 430 355 371 563
3045E63k23j74K37k50J48mo6q1Q8N1j6k93K9J66o1j48k4m1r6M4M1J46l13J27P0
$$ 563 340 166 403 153 301 297 231 150 238 289 273 -20 9 175 114 -34 -58 -99 -195 -151 -110 36 -277 -150 -80
3070h0m03K24j55J58j43o5J15K33l84L70k14J32R5j9M0K6P0J70l88K14Q4j0p6
$$ -80 -483 -259 -414 -256 -399 -464 -349 -116 -500 -130 -344 -212 -117 -136 -96 -70 0 170 -218 -4 80 70 -6
3093fJ35j77m4L99O3j33j51J14J4M7K27j39j52l0L19j4l28j2R4j31k0k78K71o8
$$ -6 129 -48 -92 307 370 237 86 200 214 261 488 349 197 167 486 472 144 132 226 95 75 -203 68 0
3117@j73O4l00L60M4k35J50l15K00J64k45p7o8J59j30K43l40R8J44J87l66M58
$$ 0 -173 -109 -409 -49 -5 -240 -90 -405 -205 -41 -286 -363 -431 -272 -402 -159 -499 -401 -257 -70 -436 22
3139B2pK02m04J24J9j24J40Q3J29j31o8M32j01k04J82K5m1k24K06K4j11L20j01
$$ 22 15 217 -187 -63 -44 -168 -28 55 184 53 -15 417 316 112 294 319 278 54 260 284 173 493 392
3162C92J2l83N9J93p2K1l22M34j92j33j83j9N8j10J0J12j32J66k79J99k65J53
$$ 392 404 21 80 273 201 222 -100 334 142 9 -174 -193 -135 -245 -235 -123 -255 -89 -368 -169 -434 -281
3184b81K41J17l69O1J0k47K87J73k54P0L2M69n61K49l44K33k2P1r3K72k2L10k42
$$ -281 -40 77 -292 -231 -221 -468 -181 -8 -262 -192 -160 309 -252 -3 -347 -114 -136 -65 -158 114 92 402 160
3207A60J55L82m47J0O6J35N1k82K0o6K56J6j12Ml60L50j19m15k96K36l9L67k46
$$ 160 315 697 250 260 326 461 512 230 250 184 440 456 344 348 -12 338 219 -196 -492 -256 -295 72 -174
3230a74J47J01m79L80j43J1L2M0k53K90l31L6l45K88K08Q5l03K81j83m0K22J12
$$ -174 -27 74 -405 -25 -168 -157 -125 -85 -338 -48 -379 -343 -688 -400 -192 -107 -410 -129 -312 -352 -130 -18
3252a8K51r6q7q4J48J21k14J77qj80J06J90r2j3R1K19P1o76L80K1k77Q4O5q7J19
$$ -18 233 137 50 -34 114 235 21 198 190 10 116 306 214 201 292 511 582 -94 286 307 30 114 179 92 211
3277B11l00N09l53Q8qj83R5k73J4m5K85K4n2j91L8O4N3l26J5j16J84j97Q2k3J67
$$ 211 -89 420 67 155 147 -36 59 -214 -200 -245 40 64 12 -179 -141 -77 -24 -350 -335 -451 -267 -464 -382 -405 -238
3302b38r4J96j18j23K95j55K9L53o9l42K52K2K33P1m41K14l8J59J71lk08M3J56
$$ -238 -332 -136 -254 -377 -82 -237 -208 145 76 -266 -14 8 241 312 -129 85 47 206 377 374 166 209 365
3325C65l15M57k13J80k16j85J5Q2j46J10J74n7l51P0K15l31J01p4k16J36n1J71
$$ 365 50 507 294 474 258 73 88 170 24 134 308 251 -100 -30 185 -146 -45 -119 -335 -199 -250 -79
3347g9j88K18j69J00j0K42m06j59n6L07j03n4K73k26N2J32j38J51mJ58j54L84
$$ -79 -267 -49 -218 -118 -128 114 -292 -451 -507 -200 -303 -357 -84 -310 -258 -126 -264 -113 -117 41 -113 271
3369B71k9j60j9L98k98r0L87n32K75n1J7J01m71N06J25n68M80k97M16j53m51M02
$$ 271 242 82 63 461 163 73 460 -72 203 152 169 270 -201 305 430 -138 342 45 461 308 -143 259
3391B59q2jJ04l30R8q5k91P9j8K31R4n56M02j0q3r5L76j36l62K79m13J77rK16
$$ 259 177 176 280 -50 48 -37 -328 -249 -267 -36 58 -498 -96 -106 -189 -284 92 -44 -406 -127 -540 -363 -372 -156
3415a56m6J51J61j02k00J83K06j61l08L28j16Q2l5O7K1q2L47j83K19j22j79M14
$$ -156 -202 -51 110 8 -192 -9 197 36 -272 56 -60 22 -13 54 75 -7 340 157 376 254 75 489
3437D89m14RJ04n2n1J30K2k0j32L21m8m64L40Ml04j63K24P7k91N57m61L09n72
$$ 489 75 84 188 136 85 215 237 217 85 406 358 -106 234 238 -66 -229 -5 72 -219 338 -123 186 -386
3460c86K29j24J0K30j35K38l02k27K34RP6P9n9k70K46M1r1J53L16m37K4j24M05
$$ -386 -157 -281 -271 -41 -176 62 -240 -467 -233 -224 -148 -69 -128 -398 -152 -111 -202 -49 267 -170 -146 -270 135
3483A35R5o17M33L07j82r9N06k4l04j06J00N3p3J30k01j41L18j36J06k47N7J8
$$ 135 230 -387 46 353 171 72 578 554 250 144 244 297 224 354 153 12 330 194 300 53 110 128
3505A28j18J10j97J16j51J46N5k07O4j61J98k42j57J47k24J50L44j34k15J42l05
$$ 128 10 120 -77 39 -112 34 89 -118 -54 -215 -17 -259 -416 -269 -493 -343 1 -133 -348 -206 -511
3526e11J01K16j3J43r1j0j30J02K32k5j35l4K85j27L11m23R3J25k32K97K63m92
$$ -511 -410 -194 -207 -64 -155 -165 -295 -193 39 14 -121 -155 130 3 314 -109 -16 109 -123 174 437 -55
3548e5K38K42k53P1K35l45K50k27J96P9j37j46j85K94k47K17M4k52j02p7o1K2
$$ -55 183 425 172 243 478 133 383 156 352 431 294 148 -37 257 10 227 271 19 -83 -160 -221 -199
3570a99J92j86K25l76K75j09k95N19l67jN8r6k1J86K89l88M0J17m8K08l1P2j63
$$ -199 -7 -193 32 -344 -69 -178 -473 46 -321 -322 -264 -360 -381 -195 94 -294 -254 -137 -185 23 -8 64 -99
3593i9J24j13J12Mj17Q3J60j51N5J55J05q1N3j30J37k3j92M68n36L54J1j40J9
$$ -99 25 -88 24 28 -89 -6 154 3 58 213 318 237 290 160 297 274 82 550 14 368 379 239 258
3616B58k89M51k24k66K46j70l35J41L41n7m06p1Q4N26o54M69m2j64j33k97L87
$$ 258 -31 420 196 -70 176 6 -329 -188 153 96 -310 -381 -297 229 -425 44 2 -162 -295 -592 -205
3637b05Q7Rr0K20k32Q3j54L61j96j3J49k16J78L22k62j37J85p1l10O8K87L2%K54
$$ -205 -118 -109 -199 21 -211 -128 -282 79 -117 -130 19 -197 -19 303 41 -96 89 18 -292 -224 63 95 95 349
3661C49j82n0N7P6j45r9K02r6Q6jN6J59j82m68L52jj68J51k77J89j28j39K84m00
$$ 349 167 117 174 250 105 6 208 112 198 197 253 412 230 -238 114 113 -55 96 -181 8 -120 -259 25 -375
3685c75J57J12j69K87j85o0O1q9K36j56J43k05K68J46k98Np5M22m10J27J72j53
$$ -375 -218 -106 -275 12 -173 -233 -172 -261 -25 -181 -38 -243 25 171 -127 -122 -197 225 -185 -58 114 -39
3707c9K09l99L74j64K32J4p4l26L24O1j79J50K33O8k7j2J44o5k56m50K79K0q0
$$ -39 170 -229 145 -19 213 227 153 -173 151 212 33 183 416 484 457 445 589 524 268 -182 97 117 37
3730C7M82m19J34k50O0l0p2k24K91j13j05J0K29J9k92K58j78j0j69L55J3j3j31
$$ 37 519 100 234 -16 44 14 -58 -282 9 -104 -209 -199 30 49 -243 15 -163 -173 -342 13 26 13 -118
3753a18M8k77L52J08j56j28l8O12n07j87J36K4J38K4j27J52L6j2k73K12M0L6K92
$$ -118 -70 -347 5 113 -43 -171 -209 403 -104 -291 -155 -131 7 31 -96 56 92 80 -193 19 59 95 387
3776C87m39K80L70m77R7j18j63J10J24k9j22L30k83P4j08K5K23m26N9J7k95L06
$$ 387 -52 228 598 121 218 100 -63 47 171 142 20 350 67 141 33 58 281 -145 -86 -69 -364 -58
3798e8L5j34l0o8K24k22M4M8j71M2m4J05K02j42M1k0M0P0J28m84M86j43O6J65
$$ -58 -23 -157 -187 -255 -31 -253 -209 -161 -332 -290 -334 -229 -27 -169 -128 -148 -108 -38 90 -394 92 -51 15 180
3822A80l07K82k53K67Q6j05k10J04K43k28K68o53O12j73r2k51K12J25k34K96k01
$$ 180 -127 155 -98 169 255 150 -60 44 287 59 327 -326 286 113 21 -230 -18 107 -127 169 -32
3843c2QL3J53k57J57L08l20j42K60l61J40j95J82q8o4o7J12J05k43M91j31k4k30
$$ -32 -24 9 162 -95 62 370 50 -92 168 -193 -53 -248 -66 -154 -218 -285 -173 -68 -311 180 49 25 -205
3866b05L11m68K11L02k80j18K98j22M71k00M5j42J13k04J9J59l9n9J29k72K39
$$ -205 106 -362 -151 151 -129 -247 51 -71 400 200 245 103 216 12 31 190 151 92 221 -51 188
3887A88j37p2M17o0k09K27J97k67j78K29j07k79J16j6J08r9K52k94K04n54J30
$$ 188 51 -21 396 336 127 354 551 284 106 335 228 -51 65 49 157 58 310 16 220 -334 -204
3908b04m8M64n10J82j8o7p5L7J06J15j21K2j28m8J28K06LM8J10N2k68o7O9M02
$$ -204 -252 212 -298 -116 -134 -201 -276 -239 -133 -18 -139 -117 -245 -293 -165 41 44 92 202 254 -14 -81 -12 390
3932C90n30K99k1j88J27J28k16oq6L42j39K73m38J60M71l64n0m3Q1J99k14qJ9
$$ 390 -140 159 138 -50 77 205 -11 -17 -103 239 100 373 -65 95 566 202 152 109 190 389 175 167 186
3955A86k08k00M62j47J12m5m9j57j52q5n0K66J81j42j75L7j00Lj8L97l68m3k4
$$ 186 -22 -222 240 93 205 160 111 -46 -198 -283 -333 -67 114 -28 -203 -166 -266 -263 -281 116 -252 -295 -319
3978c19j1O8J30R8k13j37P6J21K4J15p3N25l86Q2j05J11K21j93M5k14r8L21J7
$$ -319 -330 -262 -132 -34 -247 -384 -308 -187 -163 -48 -121 404 18 100 -5 106 327 134 179 -35 -133 188 205
4001B05o0j57p4N20r9m17K05J77k21Q4l3j26r7J61q9K74k27q4K38l37k89M74q7
$$ 205 145 -12 -86 434 335 -82 123 300 79 163 130 4 -93 68 -21 253 26 -58 180 -157 -446 28 -59
4024e9Q0q3Mq2l6J96j13j18j20Q0J57k5j66K61o4L0J13j58L07m09J75L3J69k43
$$ -59 21 -62 -58 -140 -176 20 -93 -211 -331 -251 -94 -119 -285 -24 -88 -58 55 -103 204 -205 -30 3 172 -71
4048g1J04L79k16j45k67J08j01L96k75J25N14n65J79P0O1j59Q6k9k55JN83m49
$$ -71 33 412 196 51 -216 -108 -209 187 -88 37 551 -14 165 235 296 137 223 194 -61 -60 523 74
4070G4l51M27N7k37k70N2J64j37q9L95o0lj05l33L99J1l11R9J3l3J43k34O7P0
$$ 74 -277 150 207 -30 -300 -248 -84 -221 -310 85 25 22 -83 -416 -17 -6 -317 -218 -205 -238 -95 -329 -262 -192
4094a92M1L29k57J59k65K00k58K51J48j20P2k66L25k05N3L5L32o53M11j18Q0R1
$$ -192 -151 178 -79 80 -185 15 -243 8 156 36 108 -158 167 -38 15 50 382 -271 140 22 102 193
4116A93l21M75j33k00J98j37n8q9J52j35j32L84j57l06K5K95P5k2j70R0l56K62
$$ 193 -128 347 214 14 212 75 17 -72 80 -55 -187 197 40 -266 -241 54 129 107 -63 27 -329 -67
4138f7J24l03p7L3J66J10l16N09j88j73J08K14k67j28K34k32K85M2q4j01L67k06
$$ -67 57 -246 -323 -290 -124 -14 -330 179 -9 -182 -74 140 -127 -255 -21 -253 32 74 -10 -111 256 50
4160E0J10k54J88K4p6m7K96k86M09l29k34K03k18K38j64p6K81j83J49j25J22j64
$$ 50 160 -94 94 118 42 -5 291 5 414 85 -149 54 -164 74 -90 -166 115 -68 81 -44 78 -86
4182h6J67r5J19j31J48Ko3k62J30R4j90J76j75K73k87J79n3J35j96O9l35J73k5
$$ -86 81 -14 105 -26 122 124 61 -201 -71 23 -167 9 -166 107 -180 -1 -54 81 -115 -46 -381 -208 -233
4205b33J06o5q0L0K93j92K41j48k28o7L81J6j7p0K68J64m43L7J2J82j90L57q0
$$ -233 -127 -192 -272 -242 51 -141 100 -48 -276 -343 38 54 37 -33 235 399 -44 -7 5 187 -3 354 274
4228B74k65J71J25q5P9l78L02k22j04J04k68K70lj79K02k08J90J61N2m74K01K20
$$ 274 9 180 305 220 299 -79 223 1 -103 1 -267 3 0 -179 23 -185 5 166 218 -256 -55 165
4250A65J2k21k69k56M99J0J76m12K44O3k93L62j33j48J28O0j32P4j27J35j20J40
$$ 165 177 -44 -313 -569 -70 -60 116 -296 -52 11 -282 80 -53 -201 -73 -13 -145 -71 -198 -63 -183 -43
4272d3K71l51K4P4J43K8r5n4M14k10l51L58k38PL61l51J32J8o8j65M05k98J15
$$ -43 228 -123 -99 -25 118 146 51 -3 411 201 -150 208 -30 -23 338 -13 119 137 69 -96 309 11 126
4295A26j66J17l17K06K75j50j91j6r0L04k42j9l75M39J65k81L22k78j76L23M5
$$ 126 -40 77 -240 -34 241 91 -100 -116 -206 98 -144 -163 -538 -99 66 -215 107 -171 -347 -24 21
4316B1M7n75J57K87J51k35L6q8N1K04p7Q9r3J85l6k93L29o6J42l80J77J68j98
$$ 21 68 -507 -350 -63 88 -147 -111 -199 -148 56 -21 68 -25 160 124 -169 160 94 236 -144 33 201 3
4339CN3j02K90K2k39J69n04M25p5j4O2J28j6j36k07q3L34k05J37j9l28J77N0o7
$$ 3 56 -46 244 266 27 196 -308 117 42 28 90 218 202 66 -141 -224 110 -95 42 23 -305 -128 -78 -145
4363a45K91r5k59j28L09l52J73R1L48l76R1L09l71j54K25J29o4j23j2J98k05L47
$$ -145 146 51 -208 -336 -27 -379 -206 -115 233 -143 -52 257 -114 -268 -43 86 22 -101 -113 85 -120 227
4385B27n1J28k26k11L13j84k54L42K13j14k13MJ29J00j50Nk33P1K32N6k45N4J64
$$ 227 176 304 78 -133 180 -4 -258 84 297 183 -30 -26 103 203 53 58 -175 -104 128 184 -61 -7 157
4408A57m05M51j95J07q7j68K66k69J54l28J22Q0k73J58K96n05K77K53l66J40p
$$ 157 -248 203 8 115 28 -140 126 -143 11 -317 -195 -115 -388 -230 66 -439 -162 91 -275 -135 -142
4429a42K00j30K3K55j64o1K41k87l6R1J57j29l6O4j20K30R4k00J75k14L00j60
$$ -142 58 -72 -49 206 42 -19 222 -65 -101 -10 147 18 -18 46 -74 156 250 50 225 11 311 151
4451A51q0j70L2m0L99j52l02M84l82R4j35J61k7R3j44j59J17J33J61k57K34k51
$$ 151 71 -99 -67 -107 292 140 -162 322 -60 34 -101 60 33 126 -18 -177 -60 73 234 -23 211 -40
4473d0J14j27R7O9l1j32m15O15J80k30m12J82J36n1l68J17K19k69K27J62p5n9
$$ -40 74 -53 44 113 82 -50 -465 150 330 100 -312 -130 6 -45 -413 -296 -77 -346 -119 43 -32 -91
4495i1J71j17K59k65J81Ll60k1M35l29J91O2j93O8J84K53k91m00M66l49M23k43
$$ -91 80 -37 222 -43 138 141 -219 -240 195 -134 57 119 -74 -6 178 431 140 -260 206 -143 280 37
4517C7k3Oj67K72j7M3o32M53j15l8R0M0l0nk2n7n6J89m7k06K59j32J0j01K04k89
$$ 37 14 20 -147 125 108 151 -481 -28 -143 -181 -91 -51 -81 -86 -108 -165 -221 -32 -79 -285 -26 -158 -148 -249 -45 -334
4543c34L48Ml3N2j78K65n9k23Rj28Q5L24M6j76J86l0M8m22J35J70l64M08P0l17
$$ -334 14 18 -15 37 -141 124 65 -158 -149 -277 -192 132 178 2 188 158 206 -216 -81 89 -275 133 203 -114
4567a14K02j27K32l19K85k9l27K55m4R0l04R4L97m79J53N2O5k71K23P1l26J56
$$ -114 88 -39 193 -126 159 130 -197 58 14 104 -200 -106 291 -188 -35 17 82 -189 34 105 -221 -65
4589f5j15J04PM14j68n34K42k1K60k69O1J74j0j58j9J85k13o0K93l14R4O54m66
$$ -65 -180 -76 -69 345 177 -357 -115 -136 124 -145 -84 90 80 -78 -97 88 -125 -185 108 -206 -112 542 76
4612G6J62j35L5L3n8k97N85l69k7R9o0K31p3k17Q1o5R6j46J45Q0k21r4P1L53l65
$$ 76 238 103 138 171 113 -184 401 32 5 104 44 275 202 -15 66 1 97 -49 96 176 -45 -139 -68 285 -80
4637h0j58K61J64k25K20m67K59r5j62L15l3Or5m0J51k7K07n5m95K76j87K99j2
$$ -80 -238 23 187 -38 182 -285 -26 -121 -283 32 -1 5 -90 -130 21 -6 201 146 -349 -73 -260 39 27
4660B7K5j96R3M29p28K71K82j20r7K23k08j94N8K20r7L17r8j64m9J67l2L5j5o5
$$ 27 52 -144 -51 378 -350 -79 203 83 -14 209 1 -193 -135 85 -12 305 207 43 -6 161 129 164 149 84
4684H4J20j33R8j60j47M47j92J46k27r3J78l69K2N26j91k14O3K86k60Q6j12pj41
$$ 84 204 71 169 9 -138 309 117 263 36 -57 121 -248 -226 300 109 -105 -42 244 -16 70 -42 -49 -190
4707a90j87K46m3L33m13J49L8L24j91l21l1K92M3L19k51j58rK42l65J57k05K86
$$ -190 -377 -131 -174 159 -254 -105 -67 257 66 -255 -286 6 49 368 117 -41 -50 192 -173 -16 -221 65
4729F5K03j59l4L86n19K29j69k50O40l95K4k52M57j09j28k18J44N2M6r8J21j70
$$ 65 268 109 75 461 -58 171 2 -248 392 -3 21 -231 226 117 -11 -229 -85 -33 13 -85 36 -134
4751a34J90j93n8R7l8j66M30l53J7J01l7k80M07j58q6M8K76l4r9M19l55M0l10
$$ -134 56 -137 -195 -98 -136 -302 128 -225 -208 -107 -144 -424 -17 -175 -261 -213 63 29 -70 349 -6 34 -276
4774b76M31JOk42J85q4N4j95Q8J69r2j51J77PJ58%k17j81J19K22k45J84J61j63
$$ -276 155 156 162 -80 105 21 75 -120 -32 137 45 -106 71 78 236 236 19 -162 -43 179 -66 118 279 116
4798A16J44j82r2k65K85j86%J21M8j54j76O41l46j2n2J30j69K6j3K52k00K25J8
$$ 116 260 78 -14 -279 6 -180 -180 -59 -11 -165 -341 300 -46 -58 -110 20 -149 -123 -136 116 -84 141 159
4821A59k15qK46k06K07Jk41J92j7k65K2k2j22J58J32P7J91k49K58l14Jj66K43
$$ 159 -56 -64 182 -24 183 184 -57 135 118 -147 -125 -147 -269 -111 21 98 289 40 298 -16 -15 -181 62
4844F2N3j83m3J14P8kj05K84l15M26l17K48j58j70K34l6k06k0R8j15M8m8n7K54
$$ 62 115 -68 -111 3 81 79 -26 258 -57 369 52 300 142 -28 206 170 -36 -56 42 -73 -25 -73 -130 124
4868A24l2J26n5m34K43j22J56j81L95r0j56j05L3J0J31R6j74j59J25J39K27m31
$$ 124 92 218 163 -271 -28 -150 6 -175 220 130 -26 -131 -98 -88 43 139 -35 -194 -69 70 297 -134
4890a34nL00N1p4k84K6k16L01K62m20N1J51J14L4kR8j06k35j28K39J69k69o4K17
$$ -134 -139 161 212 138 -146 -120 -336 -35 227 -193 -142 9 123 157 155 253 147 -88 -216 23 192 -77 -141 76
4914G6q5N9N9l83M29j23j42J73m50L01L14m06J41N1o4q2M49m83Q3l79K47K31j07
$$ 76 -9 50 109 -274 155 32 -110 63 -387 -86 228 -178 -37 14 -50 -132 317 -166 -83 -462 -215 16 -91
4937i1J06K32r1J62o31J20K34n7J79m54M69q6k71P8R6K4R6oJ18j61K28l01J32
$$ -91 15 247 156 318 -313 -193 41 -16 163 -291 178 92 -179 -101 -5 19 115 109 227 66 294 -7 125
4960A25k03K43k01%j92L86p4k02K93j51j14Q6J96j74J46L1k50r9K61l17M9J75
$$ 125 -78 165 -36 -36 -228 158 84 -118 175 24 -90 -4 192 18 164 195 -55 -154 107 -210 -161 14
4982A4Lj41J61j06J08k77J9J02k01K77o5L4l6k08M82J38j60k97J15J17p5k45J25
$$ 14 17 -124 37 -69 39 -238 -219 -117 -318 -41 -106 -72 -108 -316 166 304 144 -153 -38 79 4 -241 -116
5005a16N10n06J30k24L57k27m9M25j50J37j74J9j70j96J18N8j3p9R6K77m21J68
$$ -116 394 -112 18 -206 151 -76 -125 300 150 287 113 132 -38 -234 -116 -58 -71 -150 -54 223 -198 -30
5027c0L8J15l2l4r4P2J27j26L3Q4n35J01l6L73r5j71J85L9J82n35J52O0N6L40
$$ -30 8 123 91 57 -37 35 162 36 69 153 -382 -281 -317 56 -39 -210 -25 14 196 -339 -187 -127 -71 269
5051B69m59K77K51l93J05j14J34k15Q0J16k81J7J68J26n0N7K0o1m9J86j63K03
$$ 269 -190 87 338 -55 50 -64 70 -145 -65 51 -230 -213 -45 81 31 88 108 47 -2 184 21 224
5073B24M1j03o7J53j62Lj19R9L2j46K65j62j95P7Q8P8ql57K00K76J20k55J10l08
$$ 224 265 162 95 248 86 89 -30 69 101 -45 220 58 -137 -60 28 106 98 -259 -59 217 337 82 192 -116
5097a16KJ10q8K24j84j83M05n51rM41j8j77r0M77r4k15K50j47j47l2k8J51J9Q1
$$ -116 -114 -4 -92 132 -52 -235 170 -381 -390 51 33 -144 -234 243 149 -66 184 37 -110 -142 -170 -19 0 81
5121H1j19J76o4p8J8j80K64J59l13k06L12j79P5k62M80j06Q3k42J17q0J68K10
$$ 81 -38 138 74 -4 14 -166 98 257 -56 -262 50 -129 -54 -316 164 58 141 -101 16 -64 104 314
5143C14k61j8j09L23j36l2k69M19j9j62j50K62l55K78q7k81Q6N3K95l50L19l6
$$ 314 53 35 -74 249 113 81 -188 231 212 50 -100 162 -193 85 -2 -283 -197 -144 151 -199 120 84
5165H4p7j11J70k22L43l03J73k44J99j75J08J26m7J67p2k3l4K46m97O9j78K06
$$ 84 7 -104 66 -156 187 -116 57 -187 12 -163 -55 71 24 191 119 96 62 308 -189 -120 -298 -92
5187i2K58J28l85P7NL53k34Rj9k37n3K59r6l49J87O3J92m7l0k99L40r7Q1p4J31
$$ -92 166 294 -91 -14 -9 344 110 119 100 -137 -190 69 -27 -376 -189 -126 66 19 -11 -310 30 -67 14 -60 71
5212G1m8m4K17m24N2J11R7j40k8J56j38K92n45L15k0J47j74j42L68J67l66M57
$$ 71 23 -21 196 -228 -176 -65 32 -108 -136 20 -118 174 -371 -56 -76 71 -103 -245 123 290 -76 381
5234C81l35j11J01L98j57j76j77K17l41J73K16ol02k6M48l74J3K3J00k82K19K6
$$ 381 46 -65 36 434 277 101 -76 141 -200 -27 189 183 -119 -145 303 -71 -58 -35 65 -217 2 28
5256B8j00J3L13m23L39l05K85l37K1L16J59k32R9m07J00J62J67k50k21L44j88
$$ 28 -72 -59 254 -169 170 -135 150 -187 -166 150 309 77 176 -231 -131 31 198 -52 -273 71 -117
5277a17J3j79N63l29lJ02J46k84p0Q6R1L23m05J59k04M20k73q9j03K50r1M8N3
$$ -117 -104 -283 280 -49 -52 50 196 -88 -158 -72 19 342 -63 96 -108 312 39 -50 -153 97 6 54 107
5300A07L4q6j00K36k55L2K27l86M18l14j22L91j79q8n7L24n25M48k61O3r6j52
$$ 107 141 55 -45 191 -64 -32 195 -191 227 -87 -209 182 3 -85 -142 182 -343 105 -156 -93 -189 -341
5322c41J21M99r5l74M78k16J23j58j06R4O2j28R5j37l92M01n5J02j51J67k3O6
$$ -341 -220 279 184 -190 288 72 195 37 -69 25 87 -41 54 -83 -475 -74 -129 -27 -178 -11 -34 32
5344C2k44J93m1j52K25K5j66L98m38J93m6L95l72j41J67J02k0J06j95q6K35k41
$$ 32 -212 -19 -60 -212 13 38 -128 270 -168 25 -21 374 2 -139 28 130 110 216 21 -65 170 -71
5366g1K06j25J61k40p9P0J14m6m9J9N7j92k14L33J74k00J55K93l29l18M24k98
$$ -71 135 10 171 -69 -148 -78 36 -10 -59 -40 17 -175 -389 -56 118 -82 73 366 37 -281 143 -155
5388a55N1J94j18J62Q6l38J81q6q1J88K0j40j00L98k50q2L66n21L39j36j25MK91
$$ -155 -104 90 -28 134 220 -118 63 -23 -104 84 104 -36 -136 262 12 -70 296 -225 114 -22 -147 -143 148
5411A48K42l85j65K43L44k72k75L75l08Q9P7J5j38JmJ19m33L46N7l26L45J26k55
$$ 148 390 5 -160 83 427 155 -120 255 -53 36 113 128 -10 -9 -13 106 -327 19 76 -250 95 221 -34
5434c4J3Q8j37J07L7K34j73k28J3l21J58K45k17M4O2L37l50q1R9K43L0l88M4L26
$$ -34 -21 67 -70 37 74 308 135 -93 -80 -401 -243 2 -215 -171 -109 228 -122 -203 -104 139 169 -219 -175 151
5458A51K6l04J01R3J01j39L6j44r8R8l68M91J58l11J49k48L11L4m4k34K25J13
$$ 151 177 -127 -26 67 168 29 65 -79 -177 -79 -447 44 202 -109 40 -208 103 137 93 -141 84 197
5480A97qn14K85J05k06K36n25L09Q9Qk07K65j08K45m57J3J89K06O5k56o4j9K21
$$ 197 189 -325 -40 65 -141 95 -430 -121 -32 -24 -231 34 -74 171 -286 -273 -84 122 187 -69 -133 -152 69
5503F9k55J78K8q3l3R9l0l6K72j02j21J00j20m1M24l27J16j23j06n8K16o3L51
$$ 69 -186 -8 20 -63 -96 3 -27 -63 209 107 -14 86 -34 -75 349 22 138 15 -91 -149 67 4 355
5526C55l27M6l6J12k6J03j44j19J09k54K57K7j28M8p6J54l15J58J65j08o8J17
$$ 355 28 74 38 150 124 227 83 -36 73 -181 76 103 -25 23 -53 101 -214 -56 109 1 -67 50
5548E0J20l87J29k12K89j47L90k14J38l35j39L07o9J8P9K63k71q7N2j33N74n00
$$ 50 170 -217 -88 -300 -11 -158 232 18 156 -179 -318 -11 -80 -62 17 280 9 -78 -26 -159 415 -85
5570h5r7M84j00k41J36j15k02K2J13R5L3j16R2j54o3J12j62l8L97J66m05J67r3
$$ -85 -182 302 202 -39 97 -18 -220 -198 -85 10 43 -73 19 -135 -198 -86 -248 -286 111 277 -128 39 -54
5593e4O4P7k2J35m1n7l52K64k2jl8j62K40k88M17j68k48J55O3N9J8j82J70n4j78
$$ -54 10 87 65 200 159 102 -250 14 -8 -9 -47 -209 31 -257 160 -8 -256 -101 -38 21 39 -143 27 -27 -205
5618b05K95j69p9m3M35J17k88j31k13L89N3N2l40K89j21j02J11O7J11k10P8L8
$$ -205 90 -79 -158 -201 234 351 63 -68 -281 108 161 213 -127 162 41 -61 50 117 228 18 96 134
5640A34mk57n4K49j33nM7o9K57j11L9l06J07J38k48K76l65L10k4kJ11J92l97O8
$$ 134 130 -127 -181 68 -65 -70 -23 -92 165 54 93 -213 -106 32 -216 60 -305 5 -19 -21 90 282 -115 -47
5664d7l9J89pn4k73J32K72J3j59j95J37j44K86j84K90l27K18q5M6J16J4M9n92
$$ -47 -86 103 96 42 -231 -99 173 186 27 -168 -31 -175 111 -73 217 -110 108 23 69 185 199 248 -344
5687c44L71K64k45k06K39j81J64k8k13J93o9j9o5L80J12n60M7K10l15N33o51N20
$$ -344 27 291 46 -160 79 -102 62 34 -179 14 -55 -74 -139 241 353 -207 -160 50 -265 268 -383 137
5709A37j07k8N3k09J25k60pn0oK55N6k90M46m22P47l16k77M20m03J05P9j71N2
$$ 137 30 2 55 -154 -29 -289 -296 -346 -352 -97 -41 -331 115 -307 440 124 -153 267 -136 -31 48 -123 -71
5732g1J45r8J69j18k61J71L8J6N4K46k61K64j96r5k17L24K4j38N9J71K0m33J22
$$ -71 74 -24 145 27 -234 -63 -25 -9 45 291 30 294 98 3 -214 110 134 -4 55 226 246 -187 -65
5755f5K61k96J28K31n05K90J25j1M2p1m94M25K0m34M21r4Q4j02l1o2L06n84M30
$$ -65 196 -100 28 259 -246 44 169 158 200 129 -365 60 80 -354 67 -27 57 -45 -76 -138 168 -416 14
5778A4J58k20J92m4j98J61k91J42J20L1j51j12L50k96J80j06k4O8r2K36j66J92
$$ 14 172 -48 144 100 -98 63 -228 -86 34 65 -86 -198 152 -144 36 -70 -94 -26 -118 118 -48 144
5800A44Jj51R2l01K40q6R2J25K53l03k14Q8O8J02j53R6j91j53K16j98j29M32n9
$$ 144 145 -6 86 -215 25 -61 31 156 409 106 -108 -20 48 150 -3 93 -98 -251 -35 -233 -362 70 11
5823A1j1L2k8j21K85j22N2Ml1k84K63k05R5L04o4l61J14o2Q7q8J98k5k15J6M46
$$ 11 0 32 4 -117 168 46 98 102 71 -213 50 -155 -60 244 180 -181 -67 -129 -42 -130 68 43 -172 -156 290
5848B90l63J27j32J95j42k0l15L29J46m43M48j65j88J47O5K39l6m5%Q5j2k25K18
$$ 290 -73 54 -78 117 -25 -45 -360 -31 115 -328 120 -45 -233 -86 -21 218 182 137 137 222 210 -15 203
5871B03l02q1J3J0K1K5J68n1l9j88M51k72J40j6l35K88k66L73j58k13K27PJ5o6
$$ 203 -99 -180 -167 -157 -136 -111 57 6 -33 -221 230 -42 98 82 -253 35 -231 142 -16 -229 -2 5 20 -46
5895d6J2j13n2L37l13J11J74p7j5k49K02j4n4R2K60p2j66j18NK83j03O9r4n5j8
$$ -46 -34 -147 -199 138 -175 -64 110 33 18 -231 -29 -43 -97 -5 255 183 17 -101 -96 187 84 153 59 4 -14
5920a4J19k67K51K17m08L32l63J94Q5l34K02j54L61m62K16j17J46O3n1l14O5N0
$$ -14 105 -162 89 306 -102 230 -133 61 146 -188 14 -140 221 -241 -25 -142 4 67 16 -298 -233 -183
5942a83J58O1K17k39k32M5J97k76J88L2L55j04j53l59K14K0J48O0j31K22j40k60
$$ -183 -25 36 253 14 -218 -173 24 -252 -64 -32 323 219 66 -293 -79 -59 89 149 18 240 100 -160
5964a60J22J80k7r8R2K40m50J18o0k36K84j88J23K61k04k45L25o6k9n0M27l91
$$ -160 -38 142 115 17 109 349 -101 17 -43 -279 5 -183 -60 201 -3 -248 77 11 -18 -68 359 -32
5986c2j17K67P6o81M66j14Q7j2L12m48k2J15N66l97m6k0j17O6n2j68L81R4j4j44
$$ -32 -149 118 194 -487 -21 -135 -48 -60 252 -196 -218 -103 463 66 20 0 -117 -51 -103 -271 110 204 190 46
6010D6k25M3J77K43j76L7k6m1j66J72J0j33K39j01J4l29J27L36k51k1J72j56j20
$$ 46 -179 -136 41 284 108 145 119 78 -88 84 94 -39 200 99 113 -216 -89 247 -4 -25 147 -9 -129
6033a29L02j89O4K56k22P9o5k89J68k9M7M32n57k4K41J03j93K2J21k89R6j03J18
$$ -129 173 -16 48 304 82 161 96 -193 -25 -54 -7 425 -132 -156 85 188 -5 17 138 -151 -55 -158 -40
6056d0j39N21r5j64P7j30j10J61j84P4p8O3R3k98L96j90J22k11N1J17m1J1K00
$$ -40 -179 342 247 83 160 30 -80 81 -103 -29 -107 -44 49 -249 147 -43 79 -132 -81 36 -5 6 206
6079B06j43j25j8rN2k03N1K7j04K91j91J61K75k03J1K5j06j53K83j47k39M19l17
$$ 206 63 -62 -80 -89 -37 -240 -189 -162 -266 25 -166 -5 270 67 78 103 -3 -156 127 -20 -259 160 -157
6102a57R3J7P8j37PL31k11K35k7k54J20L3j34o3P9O1p0o6k75L66J4l35R9K10L0
$$ -157 -64 -47 31 -106 -99 232 21 256 229 -25 95 128 -6 -69 10 71 1 -65 -340 26 40 -295 -196 14 44
6127D4M0j08j0l18L95k8j90J42J31L8k25Q1k4K34m37L14Q2j03j7j21K1j32K88
$$ 44 84 -24 -34 -352 43 15 -175 -33 98 136 -89 -8 -32 202 -235 79 161 58 41 -80 -59 -191 97
6150I7kKl79L34P5r2L3J09n27N50P6l23L1l7o7K7J59L8k56o2K51j91P5m5K98j54
$$ 97 95 97 -282 52 127 35 68 177 -350 200 276 -47 -16 -53 -120 -93 66 104 -152 -214 37 -154 -79 -124 174 20
6176B0n0k45L20n9o6J54J88j07o3M5k00o3K80k6r2O1J06k86K32pk52L8Q6j22N4
$$ 20 -30 -275 45 -14 -80 74 262 155 92 137 -63 -126 154 128 36 97 203 -83 149 142 -110 -72 14 -108 -54
6201e4J44k47N15l29J69p6k84N9M18k25k88L43j30O4k57J05K32j73P2o9P4j1k69
$$ -54 90 -157 358 29 198 122 -162 -103 315 90 -198 145 15 79 -178 -73 159 -14 58 -11 63 52 -217
6224b17J26K01l64L88j31n5K43k85J85Ml4k1K95k43J30k08m9Q4p5j06Q3jl0j6
$$ -217 -91 110 -254 134 3 -52 191 -94 91 95 61 40 335 92 222 14 -35 49 -26 -132 -49 -50 -80 -96
6248i6J33j36l2r2J84j52K7K5m4J47%R7l5J13k41N35r9m37Q3l25J88R5l5N1j80
$$ -96 37 -99 -131 -223 -39 -191 -164 -139 -183 -36 -36 61 26 139 -102 433 334 -103 -20 -345 -157 -62 -97 -46 -226
6273b26J86K87k87J23o6P4j57j9J21M1k20J3r9J09K26l97K42J89l06k8r8K34L9
$$ -226 -40 247 -40 83 17 91 -66 -85 36 77 -143 -130 -229 -120 106 -291 -49 140 -166 -194 -292 -58 -19
6296a9K15M1l84J23m5q3K29j75J5J96k4N4k17k8K63k37L38j71j45kL9K15k22J16
$$ -19 196 237 -147 -24 -69 -152 77 -98 -83 113 89 143 -74 -102 161 -76 262 91 -54 -56 -17 198 -24 92
6320I2k69M08k22rj89K58l01K47k97M54J19m13%J2L15l36K2j81L47l0J63m35M86
$$ 92 -177 231 9 0 -189 69 -232 15 -282 172 291 -122 -122 -110 205 -131 -109 -290 57 27 190 -245 241
6343B41j06J30k61R0OL2l02j58M00j59J0J41l00K32K27j52j31j7k43M92j4j82
$$ 241 135 265 4 94 100 132 -170 -328 72 -87 -77 64 -236 -4 223 71 -60 -77 -320 172 158 -24
6365b4K02j35K82l13K05J80n96M00l47J1J80Q4K1j32N1j41Q6j21M2K12P7l26K5
$$ -24 178 43 325 12 217 397 -199 201 -146 -135 45 129 150 18 69 -72 14 -107 -65 147 224 -102 -77
6388g7J33k20J40oj10l2j13K40K06m02Q7J76J94j86j3R7qk21j18J12j11L63k61
$$ -77 56 -164 -24 -30 -140 -172 -285 -45 161 -241 -154 22 216 30 17 114 106 -115 -233 -121 -232 131 -130
6411a30j21P0L10k63J37m2J25K27j07j22l33L45j0k31m7M64j62Jk57j75M81q9
$$ -130 -251 -181 129 -134 3 -39 86 313 206 84 -249 96 86 -145 -192 272 110 111 -146 -321 160 71
6433G1q2j47J29J55k09J68j24Q4m8r9K29l55K83l4o8j54j12N31l12J53k09L49
$$ 71 -11 -158 -29 126 -83 85 -39 45 -3 -102 127 -228 55 21 -47 -201 -313 218 -94 59 -150 199
6455A99j97j12k24K73J54l33J08R7M6J84j71l42O59j83j25j28J92J09o5N7j2k61
$$ 199 2 -110 -334 -61 93 -240 -132 -35 11 195 24 -318 341 158 33 -95 97 206 141 198 186 -75
6477g5K6R7k48K17J14J49m76J97j26M74k6k73j90J76Q9k46q1L14k52L64nN0q0
$$ -75 -49 48 -200 17 131 280 -196 1 -125 349 323 50 -140 36 125 -121 -202 112 -140 224 219 269 189
6500A89j57L0j31J88j64J19j01L22m82K88n48P36k03j18mJ39k57J47l4PK38j73
$$ 189 32 62 -69 119 -45 74 -27 295 -187 101 -447 289 86 -32 -36 103 -154 -7 -41 -34 204 31
6522C1lN5q1j45O85k08k71k21K62r7j06K23%j29J09r0L40L9j87k48M05m55m6Q
$$ 31 28 83 2 -143 542 334 63 -158 104 7 -99 124 124 -5 104 14 354 393 206 -42 363 -92 -138 -130
6546a30j5L73k85R5j57PM73m44J22j4M3K1j84L21k25l90M19j53L09j89q1J70k60
$$ -130 -145 228 -57 38 -119 -112 361 -83 39 25 68 89 -95 226 1 -389 30 -123 186 -3 -84 86 -174
6569a74L19k84L22l34J06J9J95j27J53j95l4J45l08L4K3L13l33N64l44q5L16j40
$$ -174 145 -139 183 -151 -45 -26 169 42 195 0 -34 111 -197 -163 -140 173 -160 404 60 -25 291 151
6591A51J74l08k81L93k1R3m8j72j17n6J21L79n67M21j33K3l0K42n03J69l4K00
$$ 151 325 17 -264 129 108 201 153 -19 -136 -192 -71 308 -259 162 29 52 22 264 -239 -70 -104 96
6613I6j51P8J41k17K67l76K21N1j22J84rj09j20K10j13J35Q1k65J09P1l4N9j52
$$ 96 -55 23 164 -53 214 -162 59 110 -12 172 163 54 -66 144 31 166 247 -18 91 162 128 187 35
6636C5k35L02J45q3k05j79N6K77r3m1Q6KK8q6k64J21L27l64J72P1j30q7j49L09
$$ 35 -200 102 247 164 -41 -220 -164 113 20 -21 65 67 95 9 -255 -134 193 -171 1 72 -58 -145 -294 15
6660A5m0L0K2m04N57j15o2J6k26P6J43l8l3K16m20K43k58L95j60J34l99K67r2
$$ 15 -25 5 27 -377 180 65 3 19 -207 -131 12 -26 -59 157 -263 -20 -278 117 -43 91 -308 -41 -133
6683a33J11j10J86m5j77R2K92j03j32J21J3l72J46l8j42L55k33N8L85l61J84p8
$$ -133 -22 -132 54 9 -168 -76 216 113 -19 102 115 -257 -111 -149 -291 64 -169 -111 274 -87 97 19
6705A9J53m4j48J90m8j37k80K03L60m41Q6K01o4J98m17K23O6k45L38K13l47k5
$$ 19 172 128 -20 170 122 -15 -295 -92 268 -173 -87 114 50 248 -169 54 120 -125 213 426 79 54
6727E4k08K91K18n41J91J13Nk98L78k40j2j07k12M24M2mJ31j05O8j95q3n7J43
$$ 54 -154 137 355 -186 5 118 123 -175 203 -37 -49 -156 -368 56 98 94 225 120 188 -7 -90 -147 -4
6750dJ45j44K65l14K29k49K43j78n6J3k5N3q1RJ04k21J47j78J46J42m4p3J04L9
$$ -4 141 -3 262 -52 177 -72 171 -7 -63 -50 -75 -22 -103 -94 10 -211 -64 -242 -96 46 2 -71 33 72
6774G2o4J13n8n6J22rk23ML22j89k83K26K03M6j31ll78J70L0J89J82j31J00m07
$$ 72 8 121 63 7 129 120 -103 -99 223 34 -249 -23 180 226 95 92 -286 -116 -86 103 285 154 254 -153
6798a53J41Q4n1J27o4k52L65l19j41J38J92q9P4j4J42j07N8p8M2l14M70j2j86
$$ -153 -12 72 21 148 84 -168 197 -122 -263 -125 67 -22 52 38 180 73 131 53 95 -219 251 239 53
6821E3k7j87K36P9j76Q0m80M41j10K08M1k55nQ8k36K39Ok55J25J3P5j81K97J44
$$ 53 26 -161 75 154 -22 58 -422 19 -91 117 158 -97 -102 -14 -250 -11 -5 -260 -135 -122 -47 -228 69 213
6845B13k18K04o8l05k07K95R9K35j87J8P4N0n00O09j96L5k28J83j34K43j96K7
$$ 213 -5 199 131 -174 -381 -86 13 248 61 79 153 203 -297 312 116 151 -77 106 -28 215 19 46
6867D6p9J32N0j19M0L8r7K10k87L9l16N90l5k80J3O6j44j46K59J07k38R0K9r7
$$ 46 -33 99 149 30 70 108 11 221 -66 -27 -343 247 212 -68 -55 11 -133 -279 -20 87 -151 -61 -32 -129
6891a29K40k32O7J77j18J43l99K31J68Pj75RPN6r7Q7mj6L47j02j1k60j00J16k39
$$ -129 111 -121 -54 123 5 148 -251 -20 148 155 -20 -11 -4 52 -45 42 38 22 369 267 256 -4 -104 12 -227
6916b27M69j06N8m08j7L94o6k01J53n4L39l48J90k51K30l72M24j54k23k7K08Q0
$$ -227 242 136 194 -214 -231 163 97 -104 49 -5 334 -14 176 -75 155 -217 207 53 -170 -197 11 91
6938I1k16k7J03K02k12K7j80M4J54n8R3J74r8j77L37j59K4l2j12J24L5k29J67
$$ 91 -125 -152 -49 153 -59 -32 -212 -168 -14 -72 21 195 97 -80 257 98 122 90 -22 102 137 -92 75
6961G5n4L2j7k03l5K20j36J51k61J93J76k79J30k13J18j60L51m05J94j35L00j1
$$ 75 21 53 36 -167 -202 18 -118 33 -228 -35 141 -138 -8 -221 -103 -263 88 -317 -123 -258 42 31
6983C1J39l36M12m8m14N2P5k11N53l68L64j51j77Q4j31L63o7j85j50J82j83kJ06
$$ 31 170 -166 246 198 -216 -164 -89 -300 253 -115 249 98 -79 5 -126 237 170 -15 -165 17 -166 -168 -62
7006f2j51J16L1k00J56j57M2O9J51k22M49l02q4j52L21k45o1K77K67k45J88l20
$$ -62 -213 -97 -66 -266 -110 -267 -225 -156 -5 -227 222 -80 -164 -316 5 -240 -301 -24 243 -2 186 -134
7028a34Q5Ko8J11k13L22N6k84j28L01J54j74k94L54L5j13L42l07k3j32P3k92L42
$$ -134 -49 -47 -115 -4 -217 105 161 -123 -251 50 204 30 -264 90 125 12 354 47 24 -108 -35 -327 15
7051A5M70k46l76J06r9J26r5J54p8J31k23r3N9M5J38p6j96J52O7jk4RL33j88k41
$$ 15 485 239 -137 -31 -130 -4 -99 55 -23 108 -115 -208 -149 -104 34 -42 -238 -86 -19 -20 -44 -35 298 110 -131
7076a31JK44J25n8j52l46K22J9J1J40l72K28j15M93k83J48k37l2J63k0j74L7K05
$$ -131 -130 114 239 181 29 -317 -95 -76 -65 75 -297 -69 -184 309 26 174 -63 -95 68 48 -126 -89 116
7099A16j39J43l01K11R7n1j67J64K78l15rj42K72l28N08n27K10j63q5K98m7m0
$$ 116 -23 120 -181 30 127 76 -91 73 351 36 27 -115 157 -171 337 -190 20 -143 -228 70 23 -17
7121a7J06J13k10J27l8R7k3K41k32l70J67R0K2l1J56M2j41k38K89l44K62K09j06
$$ -17 89 202 -8 119 81 178 155 396 164 -206 -39 51 73 42 198 240 99 -139 150 -194 68 277 171
7144A71k01j62L26K3P3n61N98j77q3P7l59J49J41j66J73Q2j01k06K03j26No8L15
$$ 171 -30 -192 134 157 230 -331 267 90 7 84 -275 -126 15 -151 22 104 3 -203 0 -126 -121 -189 126
7167A26j14k24M64k21m5k9K3J35j65P0qJ33m01J00R8K01j75Rm0j9R3j01j48K87
$$ 126 12 -212 252 31 -14 -43 -20 115 -50 20 12 145 -256 -156 -58 143 -32 -23 -63 -82 11 -90 -238 49
7191D9j31j54K03j58K67j35K6J90n03K29k63M08l6k1K00j79o8J70k02MM7p4P3
$$ 49 -82 -236 -33 -191 76 -59 -33 157 -346 -117 -380 28 -8 -29 171 -8 -76 94 -108 -104 -57 -131 -58
7214e8j7K45l00J61J3n9P7J71l63K19n3j27K85j90L1k83K45N2n1Jr3l7P0Q6K31
$$ -58 -75 170 -130 31 44 -15 62 233 -130 89 36 -91 194 4 35 -248 -3 49 -2 -1 -94 -131 -61 25 256
7239B56k69J7l01K9L54K84l48L7k38K8L54k95p0J39q9p7K25k31L66q9L01l76l14
$$ 256 -13 4 -297 -268 86 370 22 59 -179 -151 203 -92 -162 -23 -112 -189 36 -195 171 82 383 7 -307
7262c07O20k89k52J4J56K5J43k54K76k37O9r3j9K46m4j98J33l88K35j7k35L18
$$ -307 313 24 -228 -214 -58 -33 110 -144 132 -105 -36 -129 -148 98 54 -144 -11 -399 -164 -181 -416 -98
7284i8l34N72j62N7j85L03l80L52O0j98j23m6R2J97j66J9l81M15K28l24J09r1
$$ -98 -432 140 -22 35 -150 153 -227 125 185 -13 -136 -182 -90 107 -59 -40 -421 -6 222 -102 7 -84
7306h4K07j95O8j93P9J26k05J02J44P7l93L29m8l1j11J41j69o6J76R3Q5p2m6j73
$$ -84 123 -72 -4 -197 -118 8 -197 -95 49 126 -267 62 14 -17 -128 13 -156 -222 -46 47 132 60 14 -159
7330a59L21j81K07l20K42k5l0N5j28j16O9o4J80m3r5L34k91K43j20l04K23q5J93
$$ -159 162 -19 188 -132 110 85 55 110 -18 -134 -65 -129 51 8 -87 247 -44 199 79 -225 -2 -87 106
7353A06k70K58L3j67k54K95Q6j72j45J37J04J07J28j56n1j78L74k26L40l69J33
$$ 106 -164 94 127 -40 -294 1 87 -85 -230 -93 11 118 246 90 39 -139 235 9 349 -20 113
7374A13k16K48l90K03K00j71P7oj29j47k8N13j75k06O19p03K25m9L37k29r5J63
$$ 113 -103 145 -245 -42 158 -13 64 58 -71 -218 -246 267 92 -114 505 -198 27 -22 315 86 -9 154
7396A54r5K8N1n6MQ2l43J53o1K02J72N5o70M45j14l3J36j75K34l70K90J94j15
$$ 154 59 87 138 82 86 168 -175 -22 -83 119 291 346 -324 121 7 -26 110 -65 169 -201 89 283 168
7419A68l12J97L8n32N49k08J08K53N8j18j92L68k13m11L32L00m34J31R9o2P6j62
$$ 168 -144 53 91 -441 108 -100 8 261 319 201 9 377 164 -247 85 385 -49 82 181 119 195 33
7441C3Om0l4Q7M8j9j71J65l0j83M4pK85J72k38n0p8j13K41k0Qk01K72j99L08j66
$$ 33 39 -1 -35 52 100 81 -90 75 45 -138 -94 -101 184 356 118 68 -10 -123 118 98 106 -95 177 -22 286 120
7467A20l95O9J17l37K05K73M2M1j23j12K14j77k35J85P1J07R4k50P7MJ0m7J68
$$ 120 -275 -206 -89 -426 -221 52 94 135 12 -100 114 -63 -298 -113 -42 65 159 -91 -14 -10 0 -47 121
7490A21l42K56l7J61K56o65N37j7k09k73L66k04n4p8L27l85P3N0J34j96L54q8
$$ 121 -221 35 -2 159 415 -250 287 270 61 -212 154 -50 -104 -182 145 -240 -167 -117 17 -179 175 87
7512H7j61L19j00l55L84j31n5l23M29r2M5K20l65P8J53q1N5o8J04k10O7j90j37
$$ 87 -74 245 145 -210 174 43 -12 -335 94 2 47 267 -98 -20 133 52 107 39 143 -67 0 -190 -327
7535c27M68k49K0j93L71r1K11n0p6Q2P5j61k83M72M0m25K27k09L0J49K8q5O6j03
$$ -327 141 -108 -88 -281 90 -1 210 160 84 166 241 80 -203 269 309 -116 111 -98 -68 81 109 24 90 -13
7559a3q7l23J52J54K39o9P8J24k50R1q7K94m15J61j55l5K36J1j90J1j71J69L00
$$ -13 -100 -423 -271 -117 122 53 131 255 5 96 9 303 -112 49 -106 -141 95 106 -84 -73 -244 -75 225
7582B25l34J9L32m22O2L9l31L48j50L2klK86M1k89J16J42j91J91o1r4J12J29l27
$$ 225 -109 -90 242 -180 -118 -79 -410 -62 -212 -180 -182 -185 101 142 -147 -31 111 -80 111 50 -44 68 197 -130
7606a30M05J07j94l29J04N1K15o3l86Q7K18o4j19K54j82Q1j27J66K0m09L49p1
$$ -130 275 382 188 -141 -37 14 229 166 -220 -133 85 21 -98 156 -26 55 -72 94 114 -295 54 -17
7628a7K21j30m7o8j9J71k99M1r0J02J09L2j7J1J7k22K07j50L0L65l65J21j55R6
$$ -17 204 74 27 -41 -60 111 -188 -147 -237 -135 -26 6 -11 0 17 -205 2 -148 -118 247 -118 3 -152 -56
7652e6K21l39j80L09j03j57K29K10P4r4k30J36J45m3j47K65n50K86pj78N7J12
$$ -56 165 -174 -354 -45 -148 -305 -76 134 208 114 -116 20 165 122 -25 240 -310 -24 -31 -209 -152 -40
7674d0q0J31M42k80j58nM8k03M01k05j89K99l05J21j34L11m71L6Q5K06J8j92L89
$$ -40 -120 11 453 173 15 10 58 -145 256 51 -138 161 -144 -23 -157 154 -317 -281 -196 10 28 -164 225
7697B25R3k21nj28J50j29M0p1J32k32J17l5K37l64J50lj20m1K65j88r3K0N29k95
$$ 225 318 97 92 -36 114 -15 25 -46 86 -146 -29 -64 173 -191 -41 -44 -164 -205 60 -128 -221 -201 328 33
7721C3J71k71j8J43j66O0J17k56L00J36k18K80m06L02k57K34k13K64k32j00P0
$$ 33 204 -67 -85 58 -108 -48 69 -187 113 249 31 311 -95 207 -50 184 -29 235 3 -97 -27
7742b7k90L55J40j2n7k07jK31N7j52l71K62J16k80l2L05P4j12j61%J75j11l7M5
$$ -27 -317 38 178 166 109 -98 -99 132 189 37 -334 -72 44 -236 -268 37 111 -1 -162 -162 13 -98 -135 -90
7766i0J11j89J49j67L22n8p6j55L71jk16j85K9K32kj12J55k52K11k09J34p6j5
$$ -90 21 -168 -19 -186 136 78 2 -153 218 217 1 -184 -155 77 75 -37 118 -134 77 -132 2 -74 -89
7789h9J24j88J54K38p2l81J04N2j51M33Q3l74L93k93N0j94L65k89L7J12k6O8J69
$$ -89 35 -153 1 239 167 -214 -110 -58 -209 224 307 -67 326 33 83 -111 254 -35 2 114 88 156 325
7812C25p02K50oJ40r3M9k05K02n1K31k8j1l5j39k1j8QJ16j77l6K42K16l57M4J09
$$ 325 -377 -127 -133 7 -86 -37 -242 -40 -91 140 112 101 66 -73 -94 -112 -104 12 -165 -201 41 257 -100 -56 53
7837E3J53l16r5q3R0M52l34k3J39m0q7m1J88P4M1Q1l78p9K1J99j4j48j27J68O0
$$ 53 206 -110 -205 -288 -198 254 -80 -103 36 -4 -91 -132 56 130 171 252 -126 -205 -184 15 1 -147 -274 -106 -46
7862d6K05%l88L08k51K8L04M5l3J6k10N0J66l05M4m1p6K08O8l15K73p3O6L42l37
$$ -46 159 159 -229 79 -172 -144 160 205 172 188 -22 28 194 -111 -67 -108 -184 24 92 -223 50 -23 43 385 48
7887D8Rl4K87j88q8o8r5J93j62N1K98m60L84M5k13p5j02L94k15j20J14J90m27
$$ 48 57 23 310 122 34 -34 -129 64 -98 -47 251 -209 175 220 7 -68 -170 224 9 -111 3 193 -234
7910b34N34j06k61J62j07J11j87j14K55mj05k14l4L74j78KJ40j45K71j2j73j12
$$ -234 300 194 -67 95 -12 99 -88 -202 53 49 -56 -270 -304 70 -108 -106 34 -111 160 148 -25 -137
7932a37L38j26j13m7K22k80L29k05q2j53J92J6K86j11K6k00p7K52j11P3k41q2
$$ -137 201 75 -38 -85 137 -143 186 -19 -101 -254 -62 -46 240 129 155 -45 -122 130 19 92 -149 -231
7954b31J39K39p0j21K91p2j32k19K81j22k06J24KJ12Nm1O7L6l6p4j57J37j75q9
$$ -231 -92 147 77 -44 247 175 43 -176 105 -17 -223 -99 -97 15 20 -21 46 82 46 -28 -185 -48 -223 -312
7978c12O16k70l1K52m09R8M0K91l71m1M01j81j90L5J68k32K21k36J13J47k77J03
$$ -312 304 34 3 255 -154 -56 -16 275 -96 -137 264 83 -107 -72 96 -136 85 -151 -38 109 -168 -65
8000f5lK49k57l5K04q4Q7j59L1J88n9k13K12k34K02On0j07R0J71k90q7J32K86
$$ -65 -68 181 -76 -111 93 9 96 -63 -32 156 97 -116 96 -138 64 70 20 -87 3 174 -116 -203 -71 215
8024B15l19MM38m52K84k15P0Ok36J81J27N4o9j83%j62K37J19l98K69q5J5K64K6
$$ 215 -104 -100 338 -114 170 -45 25 31 -205 -24 103 157 88 -95 -95 -257 -20 99 -299 -30 -115 -100 164 190
8048A90k39j38K15J60n21J75K60j30M4L7j10J82o7J14m01L75O7l26M2O2j14JJ86
$$ 190 -49 -187 28 188 -333 -158 102 -28 16 53 -57 125 58 172 -229 146 213 -113 -71 -9 -123 -122 64
8071F4k92Q2L36m70K05J33l27L46J15j82J91r2K2j7j13k44L97qj58k9K00k88j3
$$ 64 -228 -146 190 -280 -75 58 -269 77 192 10 201 109 131 114 1 -243 154 146 -12 -41 159 -129 -142
8094a42K31k81M49l15K55k50n7M60l60j2m3K98j41j98J41j67P5J04M6l66L07n0
$$ -142 89 -192 257 -58 197 -53 -110 350 -10 -22 -65 233 92 -106 35 -132 -57 47 93 -273 34 -16
8116a6K7m8M2j14nK16j98M39j34%l26q2M07j20l19L24j9J10j84L3L7j69k08L00
$$ -16 11 -37 5 -109 -114 102 -96 343 209 209 -117 -199 208 88 -231 93 74 184 0 33 70 -99 -307 -7
8140gk2J07j17M5p1J40l0L7j50m9K20j04j01o8J86J08l65L04J30k08p4M4j2K4
$$ -7 -29 78 -39 6 -65 75 45 82 -68 -117 103 -1 -102 -170 16 124 -241 63 193 -15 -89 -45 -57 -33
8164c3J5m47M50K08k0J02n23K16n9P2R6j17J16k25J56lk71L81k47RL45l56J45
$$ -33 -18 -465 -15 193 173 275 -248 -32 -91 -19 77 -40 76 -149 7 4 -267 114 -133 -124 221 -135 10
8187A0L03m16j7l1
$$ 10 313 -103 -120 -151
8191a51
$$ Imaginary data points
##PAGE= N=2
##DATA TABLE= (X++(I..I)), XYDATA
0@%%%%%%%%%%%Qj6J6j6J6k4L2l2M0m8N5o3P2q5R3j04J20j37J57j79K00k24K51
$$ 0 0 0 0 0 0 0 0 0 0 0 0 8 -8 8 -8 8 -16 16 -16 24 -24 31 -32 40 -45 48 -56 64 -73 84 -95 105 -119 132
34A32k80L12l46L85m29M76n26N80o42P12p88Q75r72J081j208J357j531J736j988
$$ 132 -148 164 -182 203 -226 250 -276 304 -338 374 -414 461 -511 570 -638 719 -812 924 -1064
53a064K308k723L286m103N399p781J3578n3008p8113Q1108L3117m4939j4423O0919
$$ -1064 1244 -1479 1807 -2296 3103 -4678 8900 -44108 -122221 -41113 -7996 -52935 -67358 -6439
67f439K367n9448p294N9511O137l9900L828M0397q856l3446J1325L5495r400k8371
$$ -6439 -4072 -63520 -70814 -11303 -5166 -45066 -41238 -841 -9697 -43143 -31818 3677 -5723 -34094
81c4094O489K5550l176j3035J1524J9997o557j6605L528J5646P80p653O745J3198
$$ -34094 -27605 -2055 -5231 -18266 -6742 13255 6698 -9907 -6379 9267 10047 2394 9139 22337
95B2337m315j3277K426J0014m361r395O083R037p597o585O522Q60j2584l333R743
$$ 22337 18022 4745 7171 17185 12824 3429 9512 18549 10952 4367 10889 11749 -835 -4168 5575
110E575o37r581L539Q511r736j0532P616O224j2120m324J2932K86j6033J953J6457
$$ 5575 4938 -4643 -1104 7407 -2329 -12861 -5245 979 -11141 -15465 -2533 -2247 -18280 -16327 130
125A30l357j6452O035J5204q785j3810J2328J5096j1423j1102J2705R069j3599
$$ 130 -3227 -19679 -13644 1560 -7225 -21035 -8707 6389 -5034 -16136 -3431 5638 -7961
138g961m983J6264O668j3724k843J4938K308j3411n61J3525N82j1207L34J2451
$$ -7961 -12944 3320 9988 -3736 -6579 8359 10667 -2744 -3305 10220 10802 -405 -71 12380
152A2380Q26j0553r13J0367L3j1257l80J0762N73j0445r92J0617j614j2295P92
$$ 12380 13206 2653 1740 12107 12140 883 503 11265 11838 1393 401 11018 9404 -2891 -2099
167b099R816k373j1171L494J0289n288j1484M392Q753p963r338P863Q673q518
$$ -2099 7717 5344 -5827 -2333 7956 2668 -8816 -4424 4329 -3634 -12972 -5109 3564 -4954
181d954p417Q108M126r870l767R473K227q522J000Q314j638q205K786O973l357
$$ -4954 -12371 -4263 -137 -10007 -13774 -4301 -2074 -10596 -9596 -1282 -2920 -11125 -8339 -1366 -4723
196d723m279N723N408l978k929N127K124m653K32N802P21m081J628N376j430m691
$$ -4723 -9002 -3279 2129 -1849 -4778 349 2473 -2180 -1948 3854 4575 494 2122 7498 6068 1377
212A377K785L907l035l093L656M169l662l761K952K383m073l884L972M015m396
$$ 1377 4162 8069 5034 1941 5597 9766 6104 2343 5295 7678 3605 -279 3693 7708 3312
227C312m307L767J857n745l737N099K699o562k361N958R62q289r35P485K29q512
$$ 3312 -995 2772 4629 -1116 -4853 246 2945 -3617 -5978 -20 942 -7347 -8282 -797 -568 -9080
243i080J068Q050j532p638K225Q027k993o220L701O764l985m827N993N135m752
$$ -9080 -8012 38 -1494 -9132 -6907 1120 -1873 -8093 -4392 2372 -1613 -6440 -447 4688 -64
258f4l174O120L143n449j406O452K453n795l17N137L00n139L36N140q21m429M85
$$ -64 -3238 2882 6025 576 -830 5622 8075 2280 1963 7100 7400 2261 2597 7737 6916 2487 2972
275B972L772j593m155J722L084k806m185K015K552l195l183K795J626m296l061
$$ 2972 6744 5151 996 2718 5802 2996 -1189 826 3378 183 -3000 -205 1421 -2875 -5936
290e936L467J546m097j280L613O16m364m7L752m16l567R99M478j211l632K785
$$ -5936 -2469 -923 -5020 -6300 -2687 -2071 -6435 -6482 -2730 -3146 -6713 -5714 -1236 -2447 -6079 -3294
306c294L948k510l018L508M320k953k916M871K822l933j410M448J885m060o05
$$ -3294 654 -1856 -4874 -1366 2954 1 -2915 1956 4778 845 -565 3883 5768 1708 1103
321A103N012J65l996j15M556p39m752Q13M441j450n076J726M333k905m895J880
$$ 1103 6115 6280 2284 2169 6725 5986 1234 2047 6488 5038 -38 1688 6021 3116 -1779 101
337A01L496k977m375L287K899m112l432L115K276m092k292M042J310m386j559
$$ 101 3597 620 -3755 -468 2431 -1681 -5113 -1998 278 -3814 -6106 -2064 -754 -5140 -6699
352f699M295J270m634n68M736P21m328N96M555j74m232J692M121q77k824J711
$$ -6699 -2404 -1134 -5768 -6336 -1600 -879 -5207 -4611 -56 -230 -4462 -2770 1351 474 -2350 -639
368f39L333j587k357L122K657k632j656L183J676k861j058L154R82l396k54L002
$$ -639 2694 1107 -1250 1872 4529 1897 241 3424 5100 2239 1181 4335 5317 1921 1667 4669
384D669k22l476O41K891j539l037R44K574k032l239J828K295k744l021K506J606
$$ 4669 4447 971 1612 4503 2964 -73 871 3445 1413 -1826 2 2297 -447 -3468 -962 644
400F44l183j864K689J195l116j214K716P81l203n93L883J62l336L79L545m16l549
$$ 644 -2539 -4403 -1714 -519 -3635 -4849 -2133 -1352 -4555 -5148 -1265 -1103 -4439 -4060 -515 -931 -4480
417d480J538L923j290l064K063L990k109k971L076K843k019k476K632K614k063
$$ -4480 -2942 981 -309 -3373 -1310 2680 571 -2400 676 3519 1500 -976 1656 4270 2207
432B207k035L364J489k782j065K917J228l653m20K851L25l453k91K919k04l772
$$ 2207 172 3536 5025 2243 1178 4095 5323 1670 1250 4101 4426 973 682 3601 3397 -375
448c75L71K516j250l019O64K155j304k616Q98K015k401j813K069J132k323j287
$$ -375 -4 2512 1262 -1757 -1093 1062 -242 -2858 -1960 55 -2346 -4159 -2090 -958 -3281 -4568
464d568K418J207l025n89L057k6k438K62L176l66k253P53K738j08k324J492K537
$$ -4568 -2150 -943 -3968 -4557 -1500 -1526 -3964 -3702 -526 -892 -3145 -2392 346 238 -2086 -594 1943
481A943r11j788K207J936j690j471K791J635k414j194K852J156k735o60K369M52
$$ 1943 1032 -756 1451 3387 1697 226 3017 4652 2238 1044 3896 5052 2317 1657 4026 4478
497D478l093p4K476p42k557L69K255j230l056J004J929j197l072J433J738k043
$$ 4478 1385 1311 3787 3045 488 857 3112 1882 -1174 -170 1759 562 -2510 -1077 661 -1382
513a382k448J744J640k358j963K358J433k802j022K273J131k552l87K972K75k775
$$ -1382 -3830 -2086 -446 -2804 -4767 -2409 -976 -3778 -4800 -2527 -1396 -3948 -4335 -1363 -1088 -3863
529c863P54K882k5k562J033L061m29k360J385K888j044j827J819J962j076j708
$$ -3863 -3109 -227 -252 -2814 -1781 1280 851 -1509 -124 2764 1720 -107 1712 3674 2598 890
545H90J680K078k267o59K214M71k028p40J797k0j743p24K007l50k610K32J903
$$ 890 2570 4648 2381 1722 3936 4407 2379 1639 3436 3416 1673 949 2956 2606 -4 228 2131
562B131p74k313J78J677j654j870R87J523k119j310R53J198j642j096J468P19
$$ 2131 1357 -956 -778 899 -755 -2625 -1638 -115 -2234 -3544 -2591 -1393 -3035 -4131 -2663 -1944
578a944j648p39J904J204k545N35K192o4j628P3K856l9k081R77K166l99j509J457
$$ -1944 -3592 -4331 -2427 -1223 -3768 -3233 -1041 -1105 -2733 -2660 196 157 -1924 -947 1219 820 -689 768
596G68K211j348j586J797K063j907j263K422J315k226n89J592P57k318l80K139
$$ 768 2979 1631 45 1842 3905 1998 735 3157 4472 2246 1657 3249 4006 1688 1308 3447
612C447j29k307k95J819n43k124L00J696j187k361O67J850j717j768O42J748j867
$$ 3447 3318 1011 716 2535 1992 -132 168 1864 677 -1684 -1017 833 -884 -2652 -2010 -262 -2129
629b129j613J401J282j518j266J361Q53j463p53J869R77j855j36K378J84j506
$$ -2129 -3742 -2341 -1059 -2577 -3843 -2482 -1629 -3092 -3845 -1976 -999 -2854 -2990 -612 -428 -1934
645a934L25J749m3j270J90K284J73j850R23K410o33j774J187J975j272j231J690
$$ -1934 -1609 140 97 -1173 -983 1301 1474 -376 547 2957 2324 550 1737 3712 2440 1209 2899
662B899R92j947o27J753O54k131m53J917k89j980k71J664p29k163M83J080q28
$$ 2899 3891 1944 1317 3070 3724 1593 1140 3057 2768 788 517 2181 1452 -711 -228 852 24
679B4j762N29J157j497j280J103P56j376j029J344R08j725p87J871N23j816K3
$$ 24 -1738 -1209 -52 -1549 -2829 -1726 -970 -2346 -3375 -2031 -1123 -2848 -3635 -1764 -1241 -3057 -3034
696c034J384O01r94m40J925L23j527L59J962K42j715O24K102m43j187Q66J999
$$ -3034 -1650 -1049 -2043 -2483 -558 -235 -1762 -1403 559 801 -914 -290 1812 1369 182 1048 3047
713C047j053j320J388J415j251j205J453J272j651j219J760O99j902n38J361q6
$$ 3047 1994 674 2062 3477 2226 1021 2474 3746 2095 876 2636 3335 1433 895 2256 2170
729B170j695m65J372k00k221Q6J669j042j771P68J305j366j764R83J264j297j074
$$ 2170 475 10 1382 1182 -1039 -953 716 -326 -2097 -1329 -24 -1390 -3154 -2171 -907 -2204 -3278
746c278J214Q22j356p53J472K79j065j25J398K97q47L29J544j43p40O61J241p83
$$ -3278 -2064 -1242 -2598 -3351 -1879 -1600 -2665 -2790 -1392 -1095 -1942 -1613 -69 -212 -952 -291 950 167
764A67j74Q66J332p20o85J063P02m77o58J029P54r05n77Q32N57j310n13R81M12
$$ 167 -7 859 2191 1471 786 1849 2551 2074 1416 2445 3199 2294 1717 2549 3106 1796 1283 2264 2676
783B676j689l11J242j05k312J8J224l58j431k23J205o49j699N85J453j303j249
$$ 2676 987 676 1918 1813 -499 -481 743 385 -1046 -1269 -64 -713 -2412 -1827 -374 -1677 -2926
800b926R50R71j287j226J747N81j208q54J763O96j643K94J525J49j268Q20J485
$$ -2926 -1976 -1005 -2292 -3518 -1771 -1190 -2398 -3252 -1489 -793 -2436 -2142 -617 -468 -1736 -916 569
817E69j74j290R66J418n40o59J176Q28l35q25R44O24o03n08P22N79q55o78Q97
$$ 569 395 -895 71 1489 949 290 1466 2294 1959 1134 2078 2702 2099 1591 2313 2892 2037 1359 2256
836B256K63q46n78P17L37j434n54Q21J89j785J57R98q02j473J05J320n21j574
$$ 2256 2519 1673 1095 1812 2149 715 161 982 1171 -614 -457 541 -261 -1734 -1629 -309 -830 -2404
854b404K21J352p86j502O11J391j017j317J713P86j418l10J415R10j831J80J992
$$ -2404 -2183 -831 -1617 -3119 -2508 -1117 -2134 -3451 -1738 -952 -2370 -2680 -1265 -355 -2186 -2006 -14
871a4j29j055L40J593l1p18M17J448p69o24P39J590q24p46R09O67r78m18P89M70
$$ -14 -143 -1198 -858 735 704 -14 403 1851 1082 458 1197 2787 1963 1217 2126 2793 1815 1397 2186 2656
891B656r48l23Q72k72q56o53R29J20r79n23O30q0j210n60J087K0j446q6R81m85
$$ 2656 1708 1385 2257 1985 1129 476 1405 1525 546 23 653 573 -637 -1197 -110 -90 -1536 -1622 -641 -1126
911a126j569N67J128r06j262P83J206j007q34J118J157j161o02J491O84r33l06
$$ -1126 -2695 -2128 -1000 -1906 -3168 -2385 -1179 -2186 -3020 -1902 -745 -1906 -2508 -1017 -333 -1266 -1572
928a572J770Q8j194J15J674j40q62P56R75j82r47P46J236p71o52J080M00q12m81
$$ -1572 198 286 -908 -793 881 741 -121 635 1610 1428 481 1227 2463 1692 1040 2120 2520 1708 1227
947A227J286j02p16p63J030k13j031kL49J04j082m4M15k81j072j51M81k86p90
$$ 1227 2513 2411 1695 932 1962 1749 718 716 1065 1169 87 43 458 177 -895 -1046 -565 -851 -1641
966a641j17R03m27j054K27O83l05q47Q54L08n78n81J202O03q27j68R42P12p83
$$ -1641 -1758 -855 -1282 -2336 -2109 -1426 -1731 -2578 -1724 -1416 -1994 -2575 -1373 -770 -1597 -1765 -823 -111 -894
985h94k34J369L93j123K68J273m0p27M51J307k52j271Q84J144p63n21N94O48j004
$$ -894 -1128 241 634 -489 -221 1052 1012 285 736 2043 1791 520 1404 2548 1785 1264 1858 2506 1502
1004A502j64P40m6q94k21N61J07j176k20L12k3o92q7P40m13j191j31N29j58o84
$$ 1502 1338 2078 2032 1138 917 1478 1585 409 189 501 478 -214 -301 439 26 -1165 -1296 -767 -925 -1609
1024a609k2M62n63o15M94O49n63n82O29O50m87m51Q92M43o70j03R59Q54r07j75
$$ -1609 -1631 -1169 -1732 -2347 -1853 -1204 -1767 -2349 -1720 -1070 -1557 -2008 -1116 -673 -1343 -1446 -487 367 -540 -715
1044g15J278M72q23J40J183l08p47O17Q81r5r97Q89O82p69n79Q71O36j153n49
$$ -715 563 1035 212 352 1535 1227 480 1097 1978 1883 886 1775 2457 1688 1109 1980 2616 1463 914
1063I14O46O9p62k67P67p1j240k02O77m14q71J59K79l67p08K56K58k69q21J41
$$ 914 1560 1629 867 600 1367 1296 56 -146 531 117 -754 -595 -316 -683 -1391 -1135 -877 -1146 -1967 -1826
1083a826Q72r41J4L0L38o9o96O49O48l52n26R25L00k78q1R52N18q18PJ091L70
$$ -1826 -954 -1895 -1881 -1851 -1513 -1582 -2278 -1629 -981 -1333 -1859 -934 -634 -912 -993 -41 477 -341 -334 757 1127
1104A127p30K43R14R4o60j57J052J38j211Q48N60l72o03O07L03o16n91K51L79
$$ 1127 397 640 1554 1648 988 831 1883 2021 810 1658 2218 1846 1243 1850 2153 1537 946 1197 1576
1123A576q23n43O01r6q39l67N70K81j155m71Q04j8r68L46N4j39q25O83L71o23
$$ 1576 753 210 811 715 -124 -491 79 360 -795 -1266 -462 -480 -1448 -1102 -1048 -1187 -2012 -1329 -958 -1581
1143a581m94N68J89O5p62Q95K2R5q07J033N63m47J0P73J75l91L79O71k60k61K43
$$ -1581 -2075 -1507 -1318 -1253 -2015 -1120 -1098 -1003 -1810 -777 -214 -661 -651 122 297 -94 285 956 696 435 678
1164F78J157k40o06J59Q82k16p10M69M48m91l08L2L32k68m07O1O8n26o70P44k85
$$ 678 1835 1595 989 1148 2030 1814 1104 1573 2021 1530 1222 1254 1586 1318 911 972 1040 514 -156 588 303
1185C03m53k27P3k9r47M20K65n27o89J01R87o84o61K54P74o03l28P04M58m61o35
$$ 303 -150 -377 -304 -333 -1280 -860 -595 -1122 -1811 -1710 -723 -1407 -2068 -1814 -1040 -1643 -1971 -1267 -809 -1270 -1905
1206a905J097L94o42P8O97L39o98L90R27l1k69K4M32K72m41MJ130m60j78L23K00
$$ -1905 -808 -414 -1056 -978 -281 58 -640 -250 677 646 377 401 833 1105 664 668 1798 1338 1160 1483 1683
1227A683k74j37j7M22n09m47N84Q2m90p02N92J93q69l00M11L1r00q7N45m77n31
$$ 1683 1409 1272 1255 1677 1168 721 1305 1387 897 195 787 980 111 -189 222 253 -647 -734 -189 -666 -1197
1248a197k41P58k21o91J97N16n65l51J19N55J21q94P16M27j43l74R29M2l85L9
$$ -1197 -1438 -680 -901 -1592 -1395 -879 -1444 -1795 -1676 -1121 -1000 -1894 -1178 -751 -894 -1268 -339 -297 -682 -643
1268f43O61K49j87j28N93N85q02J63N48L02l11J00M48q2n26K51M61r3q71M44M18
$$ -643 18 267 80 -48 545 1130 328 491 1039 1341 1030 1130 1578 1496 970 1221 1682 1589 718 1162 1580
1289A580o42k67L52L8p27Q3L22m57q7l50L15m36p39k4P48k25n74m17N17J07q36
$$ 1580 938 671 1023 1061 334 417 739 282 195 -155 160 -276 -1015 -1039 -291 -516 -1090 -1507 -990 -883 -1719
1310a719K85M87k35m97N34k76M75o46M38M94k10k42P11R15q60J69O09r7kj70M20
$$ -1719 -1434 -947 -1182 -1679 -1145 -1421 -946 -1592 -1154 -660 -870 -1112 -401 514 -346 -177 432 335 333 163 583
1331E83M40j79N1P34l25p6j66P32l15k71K79J87m38m03K69J33k59p31M65j37k59
$$ 583 1023 844 895 1629 1304 1228 1062 1794 1479 1208 1487 1674 1236 833 1102 1235 976 245 710 573 314
1352C14k24K42j81m42k20J97k27o30K33L68l66m20o1M96k33n86K54L37l66LK56
$$ 314 90 332 151 -291 -511 -314 -541 -1171 -938 -570 -936 -1356 -1417 -921 -1154 -1740 -1486 -1149 -1515 -1512 -1256
1373a256O94n51K3N44K82k99n1N65K68j36j73N55K5l2J51J36L58q5l2O51k09o97
$$ -1256 -562 -1113 -1090 -546 -264 -563 -614 -49 219 83 -90 465 490 458 609 745 1103 1018 986 1637 1428 731
1395G31L85N00m04j37k21O80n70m65K38L72n67l24M05o7p18j29K70k08o50n2K73
$$ 731 1116 1616 1212 1075 854 1534 964 499 737 1109 542 218 623 556 -162 -291 -21 -229 -879 -931 -658
1416f58k63k66J08K52n59Q1R6L72k40k86j59P17l50J01K52K48m64L18J37K84k16
$$ -658 -921 -1187 -1079 -827 -1386 -1305 -1209 -837 -1077 -1363 -1522 -805 -1155 -1054 -802 -554 -1018 -700 -563 -279 -495
1437d95K00N59p3oj99P62Q5l09K02N47m3j76J27L96m0p04L10L84l21q9j70L26
$$ -495 -295 264 191 185 -14 748 833 524 726 1273 1230 1054 1181 1577 1537 833 1143 1527 1206 1117 947 1273
1459A273l25m65N95m57l43l69K87l7n45K2K74j56p44q1K09J75m89J01R2k92l44
$$ 1273 948 483 1078 621 278 -91 196 159 -386 -364 -90 -246 -990 -1071 -862 -687 -1176 -1075 -983 -1275 -1619
1480a619M41mR0k71L42K34j35l47L42L52K35k52L11K33O5m5L18J10J32j7P31l37
$$ -1619 -1178 -1182 -1092 -1363 -1021 -787 -922 -1269 -927 -575 -340 -592 -281 -48 17 -28 290 400 532 515 1246 909
1502I09k72K53M04j5j95p7L58l48j49K32J82j67k90n0L13k87o74L88O8m93j21
$$ 909 637 890 1294 1279 1084 1007 1365 1017 868 1100 1282 1115 825 775 1088 801 127 515 583 90 -31
1523c1oL1l26l86M32j92j98n02K97P1m41J8K59l9n21K40J19j69K34J98o5J20p0
$$ -31 -37 -6 -332 -718 -286 -478 -676 -1178 -881 -810 -1251 -1233 -974 -1013 -1534 -1294 -1175 -1344 -1110 -912 -977 -857 -927
1546i27M20J23l18K87Q16p6Jk77O40J72m02J78K62K44l46K64O0j45j78M6N86l20
$$ -927 -507 -384 -702 -415 401 325 326 49 689 861 459 637 899 1143 797 1061 1121 976 798 844 1430 1110
1568A110j45P3L48n65j13j53L42o00j93K32J48n55m99N40j67o42l09N26o4l86
$$ 1110 965 1038 1386 821 708 555 897 297 104 336 484 -71 -570 -30 -197 -839 -1148 -622 -686 -1072
1588a072j70M34M1m68J53P4j10j35q9Q91m77l96M58J62J39j08M27m8J18%M70J08
$$ -1072 -1242 -808 -767 -1235 -1082 -1008 -1118 -1253 -1342 -451 -928 -1324 -866 -704 -565 -673 -246 -294 -176 -176 294 402
1610D02j05r3O74k35j86K46L20J03o4K0J0J66l15l7L83m59k00K20j2J3l07j2k30
$$ 402 297 204 878 643 457 703 1023 1126 1062 1082 1092 1258 943 906 1289 830 630 850 838 851 544 532 302
1633C02J3p00O33l13j0j65N5j54m44j90K68r5l39r0L28J80o22l4N03n4l04L82
$$ 302 315 -385 248 -65 -75 -240 -185 -339 -783 -973 -705 -800 -1139 -1229 -901 -721 -1343 -1377 -874 -928 -1232 -850
1655h50n8K28k8J75M37k61K4K38K02l71J58N54L67m58k4M53j35l0K50K35m52K17
$$ -850 -908 -680 -708 -533 -96 -357 -333 -95 107 -264 -106 448 815 357 333 786 651 621 871 1106 654 871
1677H71p7N62r2n11O4J30k44mn4J37l86m76L47J02k38j29j16k25j43l19L21J1
$$ 871 794 1356 1264 753 817 947 703 699 645 782 396 -80 267 369 131 2 -114 -339 -482 -801 -480 -469
1699d69k93j21J65k53j88j02L60k48J28J31p4qK30j13K49J68k51O11j87k25N53
$$ -469 -762 -883 -718 -971 -1159 -1261 -901 -1149 -1021 -890 -964 -972 -742 -855 -606 -438 -689 -78 -265 -490 63
1720F3J66O2J36j47L67Q4j56j9K32l7k92J24M42r7l07N17k3k67m26M6K82j03k65
$$ 63 229 291 427 280 647 731 575 556 788 751 459 583 1025 928 621 1138 1115 848 422 468 750 647 382
1743C82k4M94o74J0l2p2k64m3J36L5n56k03M92r9n53k26M77n2j44k81O55j95m64
$$ 382 358 852 178 188 156 84 -180 -223 -87 -52 -608 -811 -319 -418 -971 -1197 -720 -772 -916 -1197 -542 -737 -1201
1766a201N69nl60RM41J14k25L94j36J86P5k84P41K16p7j89J30K74k91N3M32o5
$$ -1201 -632 -637 -997 -988 -547 -433 -658 -264 -400 -214 -139 -423 318 534 457 268 398 672 381 434 866 801
1788H01j66J47M50l24mj26J08l74r8L72J07n12l37J08K28m41J27K78m52j36j19
$$ 801 635 782 1232 908 904 778 886 512 414 786 893 381 44 152 380 -61 66 344 -108 -244 -363
1809c63j52K5K8l72K93k63k31M74m9K1l60J99M6j67j36N21J8N9j99K09J58L0j89
$$ -363 -515 -490 -462 -834 -541 -804 -1035 -561 -610 -589 -949 -750 -704 -871 -1007 -486 -468 -409 -608 -399 -241 -211 -400
1832d00M47O5q7L9K01L74j83L01k4p7j01J78Q9M01j50j28j50N5n40J79L69j37
$$ -400 47 112 25 64 265 639 456 757 733 656 555 733 822 1223 1073 945 795 850 310 489 858 721
1854G21M9J79l20l15l72J46j6l49j0K66j07j89j84Q6j20l15k16J48R7J91k35R
$$ 721 770 949 629 314 -58 88 72 -277 -287 -21 -128 -317 -501 -415 -535 -850 -1066 -918 -821 -630 -865 -856
1876h56j79Q7J40J74J98j52K86n1J48l62O79j47l22L05K49K39j36o8N48n86L84
$$ -856 -1035 -948 -808 -634 -436 -588 -302 -353 -205 -567 112 -35 -357 -52 197 436 300 232 780 194 578
1897E78J19L2l23K74O3J11K87n24J07J42N8l52j16N58m00l46k61N64l22p1l58
$$ 578 697 729 406 680 743 854 1141 617 724 866 924 572 456 1014 614 268 7 571 249 178 -180
1918a80L88m89L2k93J49l87p5N15k29k90J41J87n29M04j37P9k79qL56J92j02K
$$ -180 208 -281 -249 -542 -393 -780 -855 -340 -569 -859 -718 -531 -1060 -656 -793 -714 -993 -1001 -645 -453 -555 -553
1940e53j65N42P4k80M76K9k74K96j5L85l34J17L69J26k81N72q0M2j22k10J45P
$$ -553 -718 -176 -102 -382 94 123 -151 145 130 515 181 298 667 793 512 1084 1004 1046 924 714 859 866
1962H66k58J92J36k59k62j06N69n49j22J48k04L3k28k27K14k07k11n5J85j28n86
$$ 866 608 800 936 677 415 309 878 329 207 355 151 184 -44 -271 -57 -264 -475 -530 -345 -473 -1059
1983a059L28J43m09K67Q5r7j75J06L20j58j60M4N08r9j59K59K52k78m5N38J91
$$ -1059 -731 -588 -997 -730 -645 -742 -917 -811 -491 -649 -809 -765 -257 -356 -515 -256 -4 -282 -327 211 402
2004D02o06K76K16K26J03q6L75k65J01j78K5O2J70J9k2k08N2m2K08j16k61MR7
$$ 402 -204 72 288 514 617 531 906 641 742 564 589 651 821 840 818 610 662 620 828 712 451 455 552
2027E52n15l78M16Rk16j31o5j1J2j07L6R1n12K38j71L6Nj98L32O4k41j99L67J15
$$ 552 37 -341 75 84 -132 -263 -328 -339 -327 -434 -398 -307 -819 -581 -752 -716 -711 -909 -577 -513 -754 -953 -586 -471
2051d71J47l0kK23o3OJ9K68J69j61k11P04l28L04J42r1k19L25O3N5R8k15L3n2
$$ -471 -324 -354 -356 -133 -196 -190 -171 97 266 105 -106 598 270 574 716 625 406 731 794 849 947 732 765 713
2075G13O7K65j11n70K11k0j86j78N3K08m98n4K1k3j0p6R3n19MK48k02P6l72K45
$$ 713 780 1045 934 364 575 555 369 191 244 452 -46 -100 -79 -102 -112 -188 -95 -614 -610 -362 -564 -488 -860 -615
2099f15n0j1J04J88n7L4j13j7j4j02M7J48M15l2l94M31J27K44k27J76M08l40M63
$$ -615 -665 -676 -572 -384 -441 -407 -520 -537 -551 -653 -606 -458 -43 -75 -469 -38 89 333 106 282 690 350 813
2122H13k05K0k39M19j73J97j29P8Q6p7L7q2K12j11p97M15K02k87m68J40N1n75
$$ 813 608 628 389 808 635 832 703 781 867 790 827 745 957 846 49 464 666 379 -89 51 102 -473
2144d73J62K97q7p47L46o8K77j1k64j87L1l92K86P3J6P4l1j7J38l5M9J55l5M52
$$ -473 -311 -14 -101 -848 -502 -570 -293 -304 -568 -755 -724 -1116 -830 -757 -741 -667 -698 -715 -577 -612 -563 -408 -443 9
2168Ij41j4k14L73j23L63n2k2J82J46k44R1J44K03p6l18M96N8n22L79R1J11m32
$$ 9 -132 -146 -360 13 -110 253 201 179 361 507 263 354 498 701 625 307 803 861 339 718 809 920 488
2191D88p6Q6k08l18J18k0N1J14k1k83k21K11K3j65l76l7L12m27J71k04J09K69
$$ 488 412 498 290 -28 90 70 121 235 214 -69 -290 -79 -56 -221 -597 -634 -322 -749 -578 -782 -673 -404
2213d04n69L97O2j4k58K82J83j46k08N08n0j64J46P7M63j17n19N02J90j35L9M4
$$ -404 -973 -576 -514 -528 -786 -504 -321 -467 -675 -167 -217 -381 -235 -158 305 188 -331 171 361 226 265 309
2235C09M06j94Q3l4j1K05l14j10M88l75K13K2k77m5J84j2l83P8k44M36l82k55
$$ 309 715 521 604 570 559 764 450 340 828 453 666 688 411 366 550 538 155 233 -11 425 43 -212
2257b12j5K69l65J35r5j6l92J34J61k14j08r5K83j7o9J13M3q2J88n06N34J6j9
$$ -212 -227 42 -323 -188 -283 -299 -691 -557 -396 -610 -718 -813 -530 -547 -616 -503 -460 -542 -354 -860 -326 -310 -329
2280c29jR2J97l3P3M92k54J21o0Q1o0K69k58L83j57l67O16r3L4j44l6r6l6p6j05
$$ -329 -330 -238 -41 -74 -1 491 237 358 298 379 319 588 330 713 556 189 805 712 746 602 566 470 434 358 253
2305B53K86q3j06o4K9r9k06K49m63n6L33k98Oj93Mk14K52k14J54l08K33k20j14
$$ 253 539 456 350 286 315 216 10 259 -204 -260 73 -225 -219 -412 -408 -622 -370 -584 -430 -738 -505 -725 -839
2328h39L53l8j26J76K5J06l14K46K4n3K10J68J6mL30k26K95M3J54j11K52n4j68
$$ -839 -486 -524 -650 -474 -449 -343 -657 -411 -387 -440 -230 -62 -46 -50 280 54 349 392 546 435 687 633 465
2351D65J30l24L16J59j45nk44J69M6K87n35J97l37j51k82L32J16j81j70Q7M9k17
$$ 465 595 271 587 746 601 596 352 521 567 854 319 516 179 28 -254 78 194 13 -157 -70 -21 -238
2373b38k94J70Q1O4n97L17o7J68q2q5k9k87J02N12n04O53j68M8J47j73N04l78
$$ -238 -532 -362 -281 -217 -814 -497 -564 -396 -478 -563 -592 -879 -777 -265 -769 -116 -284 -236 -89 -262 242 -136
2395a36L00j32O9j08k39L63M86l74l14O08j18L9J30N5J18j42L5J9l55K14l4l07
$$ -136 164 32 101 -7 -246 117 603 229 -85 523 405 444 574 629 747 605 640 659 304 518 484 177
2417A77K01k79L18l61M78q89L41J82Rj97j36J08n19K55J07ml41o9N06l57j99r6
$$ 177 378 99 417 56 534 -355 -14 168 177 -20 -156 -48 -567 -312 -205 -209 -550 -619 -113 -470 -669 -765
2439g65M11k00j3R0j09K11L23n04K60%LJ29r0L19m0J69L50n30P5J82j61K26P7
$$ -765 -354 -554 -567 -477 -586 -375 -52 -556 -296 -296 -293 -164 -254 65 25 194 544 14 89 271 110 336 413
2462D13M6K66j70o9K56j79k29o9J65K74j61j66MK37m79J04j89J40j89J30j15k3
$$ 413 459 725 555 486 742 563 334 265 430 704 543 377 381 618 139 243 54 194 5 135 20 -3
2484cl83P0K1J16j96L51n44K00m11K07l11N49l22K75j49o8p4K67J73q6J31j4q0
$$ -3 -386 -316 -295 -179 -375 -24 -568 -368 -779 -572 -883 -334 -656 -381 -530 -598 -672 -405 -232 -318 -187 -201 -281
2507b81K13q9J13K41j86J70j09R9J9K3J16J47m6M1k8k7M9L03m98J78J15k65r5
$$ -281 -68 -157 -44 197 11 181 72 171 190 213 329 476 430 471 443 416 465 768 270 448 563 298 203
2530B03J70jk85k25K36J26Qm94m2J98J08k45j64J62j28j87J15j26L02l94K48J73
$$ 203 373 372 87 -138 98 224 232 -262 -304 -106 2 -243 -407 -245 -373 -560 -445 -571 -269 -663 -415 -242
2552b42n1JQ0j73m9n3j05M79o21K81J00L99n8j14J72k52M13j83L66j19K57k85
$$ -242 -293 -292 -212 -385 -434 -487 -592 -113 -734 -453 -353 46 -12 -126 46 -206 207 24 390 271 528 243
2574B43J80K39k14k50J19K36j30P7j89L16O3k61L06O7q01Q4K08l24J74J59m76
$$ 243 423 662 448 198 317 553 423 500 311 627 690 429 735 802 1 85 293 -31 143 302 -174
2595a74j40J32j6j48L2N2j23N9j07q0n6J89m04M7K02J92k77J05M05l77M5J92j64
$$ -174 -314 -182 -198 -346 -314 -262 -385 -326 -433 -513 -569 -380 -784 -737 -535 -343 -620 -515 -110 -487 -442 -250 -414
2618d14K81r6QJ05K45j67K81p6l9j43N73l79K04j52PM21k47j3nJ78j90k08J56
$$ -414 -133 -229 -221 -116 129 -38 243 167 128 -15 558 179 383 231 238 659 412 399 394 572 382 174 330
2641C30KJ20%j17Rj07m11L23j49L8%k89p6J47K03l9k43q9rp7j42OL09k88q5L37
$$ 330 332 452 452 335 344 237 -174 149 0 38 38 -251 -327 -180 23 -16 -259 -348 -357 -434 -576 -570 -261 -549 -634 -297
2667b97k44l61N52R4M02m62J86J25r3P6J93l01J97l5QL83N5j87K74k74J05L7l1
$$ -297 -541 -902 -350 -256 146 -316 -130 -5 -98 -22 171 -130 67 32 40 423 478 291 565 291 396 433 402
2690D02L22j55J8j69j14J97k41J71K56m58L7j15l6J12l52L75j83j36k52M3K06
$$ 402 724 569 587 418 304 501 260 431 687 229 266 151 115 227 -125 250 67 -69 -321 -278 -72
2711g2K1rl68K49N3k51L2j48J68j74K05l6l24N24l5k26P6J78j3j10m87N84K12
$$ -72 -51 -60 -428 -179 -126 -377 -345 -493 -325 -499 -294 -330 -654 -130 -165 -391 -315 -137 -150 -260 -747 -163 49
2734D9J47l13L37r9p3J40P5J48k20J37j48L17j73n2J73k05J2q2L35j86L08l88
$$ 49 196 -117 220 121 48 188 263 411 191 328 180 497 324 272 445 240 252 170 505 319 627 239
2756B39J26j26J24k33K24k20n8K12j95j2j11k56P3j84K52k95J15K7P3k73M2n1
$$ 239 365 239 363 130 354 134 76 288 93 81 -30 -286 -213 -397 -145 -440 -325 -298 -225 -498 -456 -507
2778e07k26N68o38L17jJ22J2L61l4l05L47k07M73r9P8l47P3M92j93m6K63j76J69
$$ -507 -733 -165 -803 -486 -487 -365 -353 8 -26 -331 16 -191 282 183 261 -86 -13 479 286 240 503 327 496
2801D96m4q9K84k22j78J39j50P3j59L19j45L3k19l49N55k94J47l50K3L75j56k52
$$ 496 452 363 647 425 247 386 236 309 150 469 324 357 138 -211 344 50 197 -153 -130 245 89 -163
2823a63k08NJ8oJ20m37K29J46j12j17K97k52J52O0J70j39M7N7j92K15k43L13J2
$$ -163 -371 -366 -348 -354 -234 -671 -442 -296 -408 -525 -228 -480 -328 -268 -98 -237 -190 -133 -325 -110 -353 -40 -28
2846b8k9J1N2K56P8j82q2K50l9j22l3J73J1nJ24J41q3j96K71l37K59k05o1j33
$$ -28 -57 -46 6 262 340 158 76 326 287 165 132 305 316 311 435 576 493 297 568 231 490 285 224 91
2870I1K59mo5l78l4L60n18K81j71j3P9j8n4j14K65k83k59L42J59l12k25J07K09
$$ 91 350 346 281 -97 -131 229 -289 -8 -179 -192 -113 -131 -185 -299 -34 -317 -576 -234 -75 -387 -612 -505 -296
2893b96K1K23k30k29K71j12L63j52j4o1K35Q6k87K35J22J27j74p7J53L90j91j24
$$ -296 -275 -52 -282 -511 -240 -352 11 -141 -155 -216 19 105 -182 53 175 302 128 51 204 594 403 279
2915B79k04J46K70j32o7o9p8K32J51l17M2J27j07j13j08J83j48J14l51M6o6J9
$$ 279 75 221 491 359 292 223 145 377 528 211 253 380 273 160 52 235 87 201 -150 -104 -170 -151
2937a51N2j26o1l5J8J0k6J33n09M59m79L40J35M2J8J09J0j59j31K28K06k10k03
$$ -151 -99 -225 -286 -321 -303 -293 -319 -186 -695 -236 -715 -375 -240 -198 -180 -71 -61 -220 -351 -123 83 -127 -330
2960c30P41P2n07J83r4l2L37l68J29N06j23P3j39P8j55J83k87J84k34kL26m67
$$ -330 411 483 -24 159 65 33 370 2 131 637 514 587 448 526 371 554 267 451 217 215 541 74
2982G4K16nk14j2K32k61L28l87K14j39j4l9k20J20j11r8J81j47K01k69j01j6L48
$$ 74 290 285 71 59 291 30 358 -29 185 46 32 -7 -227 -107 -218 -316 -135 -282 -81 -350 -451 -467 -119
3005a19j6k97J58j3k50K06J84j82K89J35rj44J10K43k3j37P0P4j17J73j44j04
$$ -119 -135 -432 -274 -287 -537 -331 -147 -329 -40 95 86 -58 52 295 272 135 205 279 162 335 191 87
3027H7M65p1k70P0Qj81N6J2K51k83Q1j15L8k4p7j14j20L08k31j40M7P2k33J57
$$ 87 552 481 211 281 289 108 164 176 427 144 225 110 148 124 47 -67 -187 121 -110 -250 -203 -131 -364 -207
3051b07j47l18L75MK4k37J54M01m60K15l3K0j41J09j17K01q8L6M22k81l8j24K25
$$ -207 -354 -672 -297 -293 -269 -506 -352 49 -411 -196 -229 -209 -350 -241 -358 -157 -245 -209 213 -68 -106 -230 -5
3074eK4p8L45j09m39M74k8J50k05J58J12N7k38L00l20j80K71L48m15J90m81P7
$$ -5 19 -59 286 177 -262 212 184 334 129 287 399 456 218 518 198 18 289 637 222 412 -69 8
3096HP4L72l37L4L8k5q1rk75j07L37R8m36L21l27O2q4oJ11q9K57m17K05l5l39
$$ 8 82 454 117 151 189 164 83 74 -201 -308 29 127 -309 12 -315 -253 -337 -343 -232 -321 -64 -481 -276 -311 -650
3121f50L91J62j26k33K45K63k25K79k40M49n35R9R3K62k5M5j12L22j56pR6k07
$$ -650 -259 -97 -223 -456 -211 52 -173 106 -134 315 -220 -121 -28 234 209 254 142 464 308 301 397 190
3143A90j9K94j57j77K21k22J76j50o3jj65L21k01k36J10J02j8r7m6j23L67k70
$$ 190 171 465 308 131 352 130 306 156 93 92 -73 248 47 -189 -79 23 5 -92 -138 -261 106 -164
3165a64k17J27l18K16J44J13l4l98O1K31k4M5j6j07M4L7N3K75j00m7p5L85l48
$$ -164 -381 -254 -572 -356 -212 -99 -133 -531 -470 -239 -263 -218 -234 -341 -297 -260 -207 68 -32 -79 -154 231 -117
3188a17K85k43P9K36k17M71m06L19k93K21m42M04J13J24m24O6L49l20j47Q0J97
$$ -117 168 -75 4 240 23 494 88 407 114 335 -107 297 410 534 110 176 525 205 58 138 335
3209C35j39l30K14n5J87k23P7l93N6J18j94P4kO1j09J23L22k02j01k31r5r0N02
$$ 335 196 -134 80 25 212 -11 66 -327 -271 -153 -347 -273 -275 -214 -323 -200 122 -80 -181 -412 -507 -597 -95
3232i5q6j90N42j91j04K01k06k88M04k76J09K45k51J51r9K81L3N5R6j01J40k45
$$ -95 -181 -371 171 -20 -124 77 -129 -417 -13 -289 -180 65 -186 -35 -134 147 180 235 331 230 370 125
3254A25L44j03j45Q1Jk54K81m44J43L16m20p6K55k56J31J53j70lm6J2J24M9m22
$$ 125 469 366 221 302 303 49 330 -114 29 345 -75 -151 104 -152 -21 132 -38 -41 -87 -75 49 98 -324
3277c24J91K9L4k12j18M47m10K42j28J47L69n27PJ18K18m15J25L9L48j66o1J42
$$ -324 -133 -104 -70 -282 -400 47 -363 -121 -249 -102 267 -260 -253 -135 83 -332 -207 -168 180 14 -47 95
3299I5k62K15J80j56J07R9j60N3K34j73K78p06N16O0k47K36j81L47j51j71J95
$$ 95 -167 48 228 72 179 278 118 171 405 232 510 -196 320 380 133 369 188 535 384 213 408
3320D08j30k44J64J14k20J84j21j37q1j99J7L3P2j48o2K44j6p0J53l01Q0j89j05
$$ 408 278 34 198 312 92 276 155 18 -63 -262 -245 -212 -140 -288 -350 -106 -122 -192 -39 -340 -260 -449 -554
3343e54J67P8Jk12L98m1q2Q0K27k3l66M78Rj20K19J58l47J63j03N04m39K4K58
$$ -554 -387 -309 -308 -520 -122 -163 -245 -165 62 39 -327 151 160 40 259 417 70 233 130 634 195 219 477
3366D77j02k76J32K6jJ84k62J85K1j73n2j41J87l90J19P7K3j80R4j13J73k6j6
$$ 477 375 99 231 257 256 440 178 363 384 211 159 18 205 -185 -66 11 34 -146 -52 -165 8 -18 -34
3389c4k16j18L53j18l77L12rj51N9j6l48L78J44k81QL83o5q7q7J57J8J06Km7M
$$ -34 -250 -368 -15 -133 -510 -198 -207 -358 -299 -315 -663 -285 -141 -422 -414 -31 -96 -183 -270 -113 -95 11 13 -34 -30
3414c0K65o0k32J15J82j99K46n2K13k78K06m04K92J90n15K76O8l33J79J89k76
$$ -30 235 175 -57 58 240 41 287 235 448 170 376 -28 264 454 -61 215 283 -50 129 318 42
3435D2K56l33j41M49l25O1l66K30j12K49l18O5j92J94J5NK2j07Q5j44J29j70K33
$$ 42 298 -35 -176 273 -52 9 -357 -127 -239 10 -308 -243 -435 -241 -226 -221 -199 -306 -221 -365 -236 -406 -173
3458a73k01j5rL86J28p7R4j85J1j59j35K25K9K65k61J69j05L02l1j06J22j65K11
$$ -173 -374 -389 -398 -12 116 39 133 -52 -41 -200 -335 -110 -81 184 -77 92 -13 289 258 152 274 109 320
$$ [...]
8191D4
##END NTUPLES=NMR FID
##END=
