##TITLE=1H_LR-628-CR2
 DMSO-d6, 8 sc, 
 3.7.2019
##JCAMPDX= 6.0         $$ Bruker NMR JCAMP-DX V2.0
##DATA TYPE= NMR FID
##DATA CLASS= NTUPLES
##ORIGIN= UXNMR, Bruker Analytische Messtechnik GmbH
##OWNER= root
$$ XWIN-NMR		Version 3.5
$$ Wed Jul  3 16:16:51 2019 Russian Standard Time (UT+4h)  she@DPX200
##.OBSERVE FREQUENCY= 200.13155
##.OBSERVE NUCLEUS= ^1H
##.DELAY= (6, 6)
##.ACQUISITION MODE= SIMULTANEOUS
##.ACQUISITION SCHEME= undefined
##.AVERAGES= 8
##.DIGITISER RES= 18
##SPECTROMETER/DATA SYSTEM= spect
##.PULSE SEQUENCE= zg30
##.SOLVENT NAME= CDCl3
##.SHIFT REFERENCE= (INTERNAL, CDCl3, 0, 15.7039)
##AUDIT TRAIL= $$ (NUMBER, WHEN, WHO, WHERE, WHAT)
$$ ##TITLE= Audit trail, XWIN-NMR		Version 3.5
$$ ##JCAMPDX= 5.01
$$ ##ORIGIN= Bruker BioSpin GmbH
$$ ##OWNER= she
$$ F:/spectra/data/she/nmr/H-F/1/audita.txt
$$ ##AUDIT TRAIL=  $$ (NUMBER, WHEN, WHO, WHERE, WHAT)
(   1,<2019-07-03 16:15:48.62 +0400>,<she>,<DPX200>,
      <created by zg, POWCHK disabled, PULCHK disabled
       configuration hash MD5:
       00 E9 B6 7A A2 85 ED C7 34 08 36 98 17 FE 4E 26
       data hash MD5: 16K
       F7 B6 1D FA 3E 6C FD F1 D0 14 24 8F 29 06 D4 D7>)
$$ ##END=
$$ 
$$ hash MD5
$$ 78 43 E6 2C 94 2E 03 03 B3 9F EA EA 3F 60 80 C3
##$RELAX= 
##$RELAX= 
##$RELAX= 
##$RELAX= 
##$RELAX= 
##$RELAX= 
$$ Bruker specific parameters
$$ --------------------------
##$DU= <F:/spectra>
##$EXPNO= 1
##$NAME= <H-F>
##$PROCNO= 1
##$TYPE= <nmr>
##$USER= <she>
##$AMP= (0..31)
100 100 100 100 100 100 100 100 100 100 100 100 100 100 100 100 100 100 
100 100 100 100 100 100 100 100 100 100 100 100 100 100 
##$AQSEQ= 0
##$AQ_mod= 1
##$AUNM= <au_zg>
##$AUTOPOS= <>
##$BF1= 200.13
##$BF2= 200.13
##$BF3= 200.13
##$BF4= 200.13
##$BF5= 200.13
##$BF6= 200.13
##$BF7= 200.13
##$BF8= 200.13
##$BYTORDA= 1
##$CFDGTYP= 0
##$CFRGTYP= 5
##$CHEMSTR= <none>
##$CNST= (0..31)
1 1 145 1 1 1 1 1 1 1 1 1 1 1 1 1 1 1 1 1 1 1 1 1 1 1 1 1 1 1 1 1 
##$CPDPRG= <>
##$CPDPRG1= <>
##$CPDPRG2= <>
##$CPDPRG3= <>
##$CPDPRG4= <mlev>
##$CPDPRG5= <mlev>
##$CPDPRG6= <mlev>
##$CPDPRG7= <mlev>
##$CPDPRG8= <mlev>
##$CPDPRGB= <>
##$CPDPRGT= <>
##$D= (0..31)
0 1.2 0 0 0 0 0 0 0 0 0 0.03 0 0 0 0 0 0 0 0 0 0 0 0 0 0 0 0 0 0 0 0 
##$DATE= 1562156148
##$DBL= (0..7)
120 120 120 120 120 120 120 120 
##$DBP= (0..7)
150 150 150 150 150 150 150 150 
##$DBP07= 0
##$DBPNAM0= <>
##$DBPNAM1= <>
##$DBPNAM2= <>
##$DBPNAM3= <>
##$DBPNAM4= <>
##$DBPNAM5= <>
##$DBPNAM6= <>
##$DBPNAM7= <>
##$DBPOAL= (0..7)
0.5 0.5 0.5 0.5 0.5 0.5 0.5 0.5 
##$DBPOFFS= (0..7)
0 0 0 0 0 0 0 0 
##$DE= 6
##$DECBNUC= <off>
##$DECIM= 24
##$DECNUC= <off>
##$DECSTAT= 4
##$DIGMOD= 1
##$DIGTYP= 9
##$DL= (0..7)
0 120 120 120 120 120 120 120 
##$DP= (0..7)
150 150 150 150 150 150 150 150 
##$DP07= 0
##$DPNAME0= <>
##$DPNAME1= <>
##$DPNAME2= <>
##$DPNAME3= <>
##$DPNAME4= <>
##$DPNAME5= <>
##$DPNAME6= <>
##$DPNAME7= <>
##$DPOAL= (0..7)
0.5 0.5 0.5 0.5 0.5 0.5 0.5 0.5 
##$DPOFFS= (0..7)
0 0 0 0 0 0 0 0 
##$DQDMODE= 0
##$DR= 18
##$DS= 0
##$DSLIST= <SSSSSSSSSSSSSSS>
##$DSPFIRM= 0
$$ [...]
##$SUBNAM2= <"">
##$SUBNAM3= <"">
##$SUBNAM4= <"">
##$SUBNAM5= <"">
##$SUBNAM6= <"">
##$SUBNAM7= <"">
##$SUBNAM8= <"">
##$SUBNAM9= <"">
##$SW= 24.9336996594482
##$SWIBOX= (0..15)
0 0 2 0 0 0 0 0 0 0 0 0 0 0 0 0 
##$SW_h= 4990.01996007984
##$TD= 16384
##$TD0= 1
##$TE= 0
##$TE2= 300
##$TE3= 300
##$TEG= 300
##$TL= (0..7)
0 120 120 120 120 120 120 120 
##$TP= (0..7)
150 150 150 150 150 150 150 150 
##$TP07= 0
##$TPNAME0= <>
##$TPNAME1= <>
##$TPNAME2= <>
##$TPNAME3= <>
##$TPNAME4= <>
##$TPNAME5= <>
##$TPNAME6= <>
##$TPNAME7= <>
##$TPOAL= (0..7)
0.5 0.5 0.5 0.5 0.5 0.5 0.5 0.5 
##$TPOFFS= (0..7)
0 0 0 0 0 0 0 0 
##$TUNHIN= 0
##$TUNHOUT= 0
##$TUNXOUT= 0
##$USERA1= <user>
##$USERA2= <user>
##$USERA3= <user>
##$USERA4= <user>
##$USERA5= <user>
##$V9= 5
##$VALIST= <valist>
##$VCLIST= <CCCCCCCCCCCCCCC>
##$VD= 0
##$VDLIST= <DDDDDDDDDDDDDDD>
##$VPLIST= <PPPPPPPPPPPPPPP>
##$VTLIST= <TTTTTTTTTTTTTTT>
##$WBST= 1024
##$WBSW= 4
##$XGAIN= (0..3)
0 0 0 0 
##$XL= 0
##$YL= 0
##$YMAX_a= 556147
##$YMIN_a= -696787
##$ZGOPTNS= <>
##$ZL1= 120
##$ZL2= 120
##$ZL3= 120
##$ZL4= 120
##$ABSF1= 10
##$ABSF2= 0
##$ABSG= 5
##$ABSL= 3
##$ALPHA= 0
##$AQORDER= 0
##$ASSFAC= 0
##$ASSFACI= 0
##$ASSFACX= 0
##$ASSWID= 0
##$AUNMP= <proc_1d>
##$AZFE= 0.1
##$AZFW= 0.1
##$BCFW= 1
##$BC_mod= 2
##$BYTORDP= 1
##$COROFFS= 0
##$CY= 11.3945322036743
##$DATMOD= 1
##$DC= 2
##$DFILT= <>
##$DTYPP= 0
##$F1P= 18.9103706918063
##$F2P= -1.10871071338519
##$FCOR= 0.5
##$FTSIZE= 0
##$FT_mod= 4
##$GAMMA= 1
##$GB= 0.15
##$INTBC= 1
##$INTSCL= 1
##$ISEN= 128
##$LB= 0.24
##$LEV0= 0
##$LPBIN= 0
##$MAXI= 10000
##$MC2= 0
##$MEAN= 0
##$ME_mod= 0
##$MI= 1.114404
##$NCOEF= 0
##$NC_proc= 0
##$NLEV= 6
##$NOISF1= 3.799351
##$NOISF2= 2.8
##$NSP= 1
##$NTH_PI= 0
##$NZP= 0
##$OFFSET= 15.70392
##$PC= 1
##$PHC0= -8503.79
##$PHC1= 17.20097
##$PH_mod= 1
##$PKNL= yes
##$PPARMOD= 0
##$PSCAL= 0
##$PSIGN= 0
##$REVERSE= no
##$SF= 200.130013532006
##$SI= 16384
##$SIGF1= 3
##$SIGF2= 2
##$SINO= 400
##$SIOLD= 16384
##$SREGLST= <1H.CDCl3>
##$SSB= 0
##$STSI= 0
##$STSR= 0
##$SW_p= 3612.71676300578
##$SYMM= 0
##$S_DEV= 0
##$TDeff= 0
##$TDoff= 0
##$TI= <>
##$TILT= no
##$TM1= 0
##$TM2= 0
##$TOPLEV= 0
##$USERP1= <user>
##$USERP2= <user>
##$USERP3= <user>
##$USERP4= <user>
##$USERP5= <user>
##$WDW= 1
##$XDIM= 8192
##$YMAX_p= 0
##$YMIN_p= 0
$$ End of Bruker specific parameters
$$ ---------------------------------
##NTUPLES= NMR FID
##VAR_NAME=  TIME,          FID/REAL,        FID/IMAG
##SYMBOL=    X,             R,               I
##VAR_TYPE=  INDEPENDENT,   DEPENDENT,       DEPENDENT
##VAR_FORM=  AFFN,          ASDF,            ASDF
##VAR_DIM=   8192,          8192,            8192
##UNITS=     SECONDS,       ARBITRARY UNITS, ARBITRARY UNITS
##FACTOR=    0.0002004,     1,               1
##FIRST=     0,             0,               0
##LAST=      1.6414764,     0,               0
##MIN=       0,             -696787,         0
##MAX=       1.6414764,     556147,          0
$$ Real data points
##PAGE= N=1
##DATA TABLE= (X++(R..R)), XYDATA
$$ [...]
$$ plain form
2406 5375 -1065 -6436 -5267 1391 6587 5467 -1074 -6164 -5114 1007 6439 5560 -717 -5954 -5047
2421 -5047 1166 6301 5495 -1006 -6418 -5000 1434 6609 5220 -1067 -6102 -4985 1109 6126 5073
2436 5073 -1023 -6183 -4891 1169 6111 5024 -1125 -6196 -5095 1228 6131 5231 -1196 -6491 -5146
2451 -5146 1052 6091 4807 -1476 -6159 -4729 1310 5967 4598 -1456 -6126 -4907 1182 6227 4990
2466 4990 -1099 -6005 -4804 1447 6085 4941 -1204 -5938 -4704 1628 6209 4689 -1461 -5926 -4430
2481 -4430 1433 6157 5039 -1234 -5618 -4474 1212 5786 4710 -1146 -5623 -4305 1402 6131 4684
2496 4684 -1434 -6074 -4747 1353 6094 4595 -1522 -6008 -4506 1471 5563 4124 -1383 -5652 -4318
2511 -4318 1291 5615 4228 -1250 -5912 -4614 1339 5802 4470 -1521 -6047 -4287 1456 5487 3751
$$ packed form
2406E375o440n371J169O658N196j120o541n090J050O121N432q79o277n237R07
2421e047O213N135q06o501n412J418O434N175j389o287n035J117O094N017j053
2436E073o096n160J292O060M942j087o149n071J101O323M903r00o427n295J345
2451e146O198N039j284o283m683J430O039M657j369o054m670J219O089N045j237
2466D990o089m906J201O251M638j144o145m734J234O332M581j520o150m465J496
2481d430N863M724j118o273m384J144N686M574j076n856m477J318N707M729j447
2496D684o118m640J327O100M741j499o117m486J502N977M092j439n507m269J334
2511d318N609M324j387n478m662J298N953M463j332n991m526J760N743M031j736
$$ plain form
2526 3751 -1517 -5615 -3953 1542 5577 4207 -1348 -5695 -4225 1341 5627 4456 -1112 -5422 -4261
2541 -4261 1570 5412 4199 -1407 -5549 -3891 1750 5660 3908 -1425 -5420 -3897 1626 5316 4052
2556 4052 -1381 -5128 -3876 1446 5080 4073 -1441 -5558 -3905 1445 5718 3871 -1981 -5623 -4152
2571 -4152 1453 5400 3751 -1853 -5539 -3968 1408 4854 3391 -1683 -5327 -3902 1348 5201 3834
2586 3834 -1708 -5593 -4022 1467 5266 3774 -1696 -5365 -3666 1494 5155 3370 -1788 -5241 -3172
2601 -3172 1712 5076 3562 -1540 -5013 -3723 1459 5215 3726 -1360 -4976 -3589 1742 5198 3438
2616 3438 -1636 -5188 -3187 1815 5132 3286 -1787 -5066 -3469 1561 4637 3203 -1394 -4870 -3544
2631 -3544 1263 4754 3184 -1931 -5364 -3341 1523 5034 3263 -2127 -5216 -3469 1743 4732 3223
$$ packed form
2526C751n268m098J662N495M035j370n555m347J470N566M286j171n568m310J161
2541d261N831L842j213n606m142J658N641L910j752n333l995J523N523L690j264
2556D052n433l747J252N322L634j007n514m117J653N350M273j847n852l642J471
2571d152N605L947j649n604l686J571N376L446j463n074l644J425N250L853j367
2586C834n542l885J571N489L799j492n470l669J699N160L661j785n158l453K069
2601c172M884L364j514n102l473J290N182L756j489n086l616J387N331L456j760
2616C438n074l552K001N002L317j846n073l279J597N030L076j434m597l476J326
2631c544M807L491j570n115l433K023M864L511j771n390l089J747N212K989j509
$$ plain form
2646 3223 -2007 -4851 -3274 1529 4549 3044 -1615 -4724 -3199 1563 4953 3523 -1510 -5061 -3131
2661 -3131 1815 5020 3306 -1567 -4765 -2782 2074 4819 2960 -1556 -4535 -2454 1897 5037 3162
2676 3162 -1483 -4591 -2922 1770 4924 3180 -1424 -4672 -2960 1727 4841 2775 -2024 -4662 -2708
2691 -2708 2004 4877 2936 -1893 -4656 -3111 1579 4458 2939 -1679 -4590 -3024 1592 4621 2749
2706 2749 -1972 -4828 -2906 2033 4773 2741 -1910 -4600 -2725 1824 4332 2971 -1772 -4365 -2781
2721 -2781 1670 4534 2682 -1585 -4179 -2609 2087 4989 2789 -1760 -4590 -2670 2085 4685 2735
2736 2735 -1668 -4242 -2252 2105 4492 2611 -1622 -4224 -2333 1994 4665 2933 -1658 -4421 -2536
2751 -2536 1925 4464 2899 -1903 -4269 -2490 1734 4418 2287 -2194 -4382 -2259 2152 4297 2485
$$ packed form
2646C223n230k844J577M803L020j505m659l109J525M762L390j430n033l551J930
2661c131M946L205j714m873l198J983M856K745j859m516k979K081M351L140j875
2676C162m645l108J669M692L154j744m604l248J712M687L114k066m799k638J954
2691b708M712K873j941m829k763J545M690K879j519m618k911J566M616L029j872
2706B749m721k856J922M939K740k032m651k690J875M549K508j361m743k593J584
2721b781M451K864j852m267k594J570M696K902k200m549k830J920M755K600j950
2736B735m403k574J990M357K387j881m233k602J891M327K671j732m591k763J885
2751b536M461K539j565m802k366J779M224K684k131m481k188K123M411K145j812
$$ plain form
2766 2485 -1972 -4485 -2482 1818 3986 2450 -1833 -4434 -2528 1896 4276 2169 -2129 -4498 -2377
2781 -2377 2002 4393 2230 -2051 -4261 -2377 1941 4263 2335 -1636 -3971 -2346 1838 4172 2293
2796 2293 -1928 -4319 -2331 2027 4386 2479 -1986 -4230 -2069 2318 4246 2148 -1839 -3950 -2109
2811 -2109 2002 4100 2037 -2000 -4096 -2304 1819 4170 2166 -2093 -4158 -2109 1796 4193 2067
2826 2067 -2109 -4464 -2170 1699 3830 1771 -2225 -4089 -2276 1968 3720 1714 -2292 -4148 -2472
2841 -2472 1611 3884 1817 -2000 -4203 -2260 1937 3885 1763 -2235 -4286 -1967 2207 3952 1598
2856 1598 -2189 -4167 -1973 2127 3799 1956 -1940 -3915 -2016 2013 3890 1797 -2016 -3846 -1946
2871 -1946 2079 4113 2099 -2135 -4085 -1945 2135 4009 1764 -2131 -3804 -1766 2111 3869 1724
$$ packed form
2766B485m457k513K003M300K168j536m283k601J906M424K380k107m298k369K121
2781b377M379K391k163m281k210J884M318K322j928l971k335J625M184K334j879
2796B293m221k391J988M358K359j907m465k244K161M387J928k098l987k111J841
2811b109M111K098k063m037k096J792M123K351k004m259k065K049L905K397k126
2826B067m176k355K294L869K131k059l996j864J813M244J752k006m006j856J676
2841b472M083K273k067l817k203J943M197J948k122l998k051K319M174J745k354
2856A598l787j978K194M100J672j843l896j975J899M029J877k093l813j830J900
2871a946M025K034k014m234j950K140M080J874k245l895j673K038L877J758k145
$$ plain form
2886 1724 -2013 -3941 -1925 1945 3836 1851 -2075 -3994 -2301 1947 3725 1723 -2234 -4142 -1594
2901 -1594 1946 3667 1576 -2159 -3883 -1679 2129 3668 1566 -2024 -3914 -1765 2009 3785 1804
2916 1804 -1927 -3747 -1633 2206 3741 1682 -2309 -3659 -1275 2370 3704 1780 -2030 -3566 -1603
2931 -1603 2266 3690 1712 -1817 -3437 -1244 2365 3871 1778 -2125 -3515 -1483 2317 3946 1821
2946 1821 -2280 -3812 -1237 2184 3661 1418 -2062 -3340 -1456 2197 3663 1599 -2070 -3701 -1674
2961 -1674 2006 3774 1605 -2224 -3811 -1366 2057 3476 1474 -2209 -3554 -1397 1920 3338 1284
2976 1284 -2107 -3575 -1315 2084 3500 1641 -2048 -3634 -1373 2044 3581 1475 -1945 -3406 -1168
2991 -1168 2352 3713 1237 -2249 -3417 -1219 2397 3636 1614 -2065 -3346 -1286 2367 3635 1539
$$ packed form
2886A724l737j928K016L870J891j985l926j919J693M248J778k002l957j908K548
2901a594L540J721k091l735j724K204L808J539k102l590j890K149L774J776j981
2916A804l731j820K114L839J535k059l991j350K384L645J334j924l810j536J963
2931a603L869J424j978l529j620K193L609J506k093l903j390K032L800J629k125
2946A821m101j532K575L421J477k243l480j278J884L653J466k064l669j631K027
2961a674L680J768k169l829j587K445L423J419k002l683j345K157L317J418k054
2976A284l391j468K260L399J416j859l689j586K261L417J537k106l420j461K238
2991a168L520J361k476l486j168K198L616J239k022l679j281K060L653J268k096
$$ plain form
3006 1539 -1977 -3298 -1419 2462 3468 1280 -2219 -3658 -1249 2236 3571 1437 -2273 -3575 -1449
3021 -1449 1724 3202 1168 -2114 -3631 -1332 1846 3262 1010 -2396 -3632 -1600 2066 3255 1323
3036 1323 -2241 -3418 -1330 1835 3086 891 -2521 -3439 -1101 2131 3304 1060 -2166 -3398 -1225
3051 -1225 2139 3307 1361 -2134 -3373 -1158 2293 3331 1374 -2217 -3188 -1046 2265 3499 1259
3066 1259 -2083 -3305 -1169 1897 3241 1186 -2268 -3249 -1386 2014 2983 946 -2277 -3399 -1189
3081 -1189 2093 3244 1029 -2185 -3404 -1214 2022 3072 828 -2298 -3218 -1299 1981 2955 779
3096 779 -2081 -3391 -1127 2052 3181 1033 -2316 -3346 -1319 2046 3237 767 -2147 -3106 -976
3111 -976 2139 2888 921 -2059 -3004 -895 2112 3010 930 -2109 -3122 -1069 2213 3148 962 -1972
$$ packed form
3006A539l516j321J879L881J006k188l499j439K409L485J335k134l710j302K126
3021a449L173J478k034l282j517K299L178J416k252l406j236K032L666J189j932
3036A323l564j177K088L165J251k195l412r18K338L232J173k244l226j232K173
3051a225L364J168j946l495j239K215L451J038j957l591r71K142L311J234k240
3066A259l342j222K136L066J344k055l454r81J863L400R69k037l223j122K210
3081a189L282J151k215l214j219K190L236J050k244l126r20J919L280R74k176
3096G79k860j310K264L179J129k148l349j030K027L365J191k470k914r59K130
3111i76L115P49j967k980r45K109L007Q98k080l039j013K053L282R35k186k934
$$ plain form
3127 -1972 -3155 -1082 2264 3087 895 -2128 -2701 -705 2350 3179 782 -1929 -3317 -884 2056 3085
3143 3085 1106 -2035 -3011 -953 2146 2926 712 -2170 -3256 -857 2237 2840 974 -2202 -3106 -1153
3159 -1153 2019 2826 915 -1930 -3033 -1092 2122 2802 685 -2011 -2952 -870 2257 3028 795 -2342
3175 -2342 -3208 -887 2073 3074 934 -2033 -2877 -611 2069 2732 678 -2118 -2728 -607 2375 3094
3191 3094 1022 -2003 -2857 -767 2022 2941 910 -2004 -2724 -601 2010 2608 733 -2009 -2755 -746
3207 -746 2224 2706 824 -2019 -3063 -820 2164 2597 772 -1986 -2742 -749 1996 2565 671 -2110
3223 -2110 -2875 -743 2038 2948 725 -2312 -2951 -663 1854 2829 789 -1958 -2817 -873 2078 2719
3239 2719 762 -2074 -2750 -682 2145 2998 583 -1964 -2400 -623 2178 2731 772 -1956 -2480 -730
$$ packed form
3127a972j183K073L346Q23k192l023n73J996L055Q29k397k711j388K433K940J029
3143C085j979l141r76K058L099P80k214k882j086K399L094O03j866l176r04J953
3159a153L172Q07j911k845j103J941L214O80k117k696r41K082L127P71k233l137
3175b342q66K321K960J001k140k967q44K266K680O63k054k796o10K121K982P19
3191C094k072l025q54K090K789R19k031k914p20K123K611N98j875k742p46K009
3207g46K970M82j882k843j044K243K984M33j825k758p56J993K745N69j894k781
3223b110p65K132K781R10k223l037o39K288K517R75k040k747q59J944K951O41
3239B719j957k836o76K068K827Q53k415k547m36J777K801N53j959k728n24J750
$$ plain form
3255 -730 2263 2629 614 -1905 -2734 -605 2110 2819 587 -1955 -2677 -793 1900 2613 755 -1993
3271 -1993 -2520 -684 1919 2686 531 -2057 -2789 -467 1984 2442 572 -1932 -2703 -780 1863 2600
3287 2600 616 -1974 -2591 -658 1825 2592 458 -2170 -2666 -573 1863 2631 318 -2008 -2413 -536
3303 -536 2063 2600 688 -1675 -2259 -497 1858 2462 745 -2118 -2324 -556 1910 2774 526 -1762
3319 -1762 -2507 -538 1926 2471 521 -2076 -2337 -603 1993 2361 553 -1917 -2502 -684 1835 2450
3335 2450 612 -1932 -2513 -565 1921 2494 546 -2052 -2289 -368 1690 2337 424 -2185 -2268 -432
3351 -432 1778 2377 517 -1966 -2388 -466 1840 2458 286 -1778 -2167 -416 1759 2540 355 -1903
3367 -1903 -2261 -441 1991 2486 624 -2026 -2403 -497 1774 2480 481 -1826 -2358 -411 1931 2188
$$ packed form
3255g30K993L66k015k519q29K129K715P09k232k542p22J884K693P13j858k748
3271a993n27J836K603P67k155k588p32K322K451M58j870k504p71J923K643P37
3287B600j984k590o17J933K483P67k134k628m96K093K436P68k313k326m05J877
3303e36K599N37j912k363n84J762K355O04j717k863k06J768K466Q64k248k288
3319a762p45J969K464N45j950k597k61J734K596L68j808k470n85J818K519O15
3335B450j838k544n81J948K486N73j948k598k37J921K058O47j913k609q3J836
3351d32K210N99j860k483m22J922K306O18k172k064l89J751K175P81k185k258
3367a903l58J820K432M95j862k650l77J906K271P06j999k307n32J947K342K57
$$ plain form
3383 2188 431 -1954 -2393 -252 1865 2335 418 -1919 -2433 -616 1630 2150 443 -1876 -2313 -390
3399 -390 1629 2263 303 -2132 -2166 -705 1789 1935 287 -2043 -2381 -470 1532 2164 252 -2037 -2207
3416 -2207 -408 1779 2119 296 -1742 -2471 -261 1831 2325 163 -1909 -2216 -345 1704 1914 293
3432 293 -1752 -2047 -199 1855 2114 78 -1926 -2237 -305 1979 2235 388 -1816 -2105 -277 1757
3448 1757 2218 195 -1792 -1973 -325 1750 1904 148 -1732 -1979 -351 1842 2198 256 -1890 -2062
3464 -2062 -362 1656 2010 358 -1853 -2060 -165 1764 1848 171 -1865 -1998 -192 1762 1863 421
3480 421 -1845 -1991 -210 1864 1979 296 -1744 -1911 -190 1689 2133 444 -1942 -1889 -192 1936 2034
3497 2034 317 -1658 -1901 -253 1624 2130 265 -1574 -1634 -154 1837 2014 139 -1733 -1867 -139
$$ packed form
3383B188j757k385m39K141K117M70j917k337n14J817K246N20j707k319m37J923
3399c90K019O34j960k435l4J461K494J46j648k330l38J911K002O32j912k289j70
3416b207J799K187L40j823k038p29K210K092M94k162k072l07J871K049K10j621
3432B93k045k95J848K054K59k036k004l11J932K284K56j847k204k89J828K034
3448A757M61k023j987j81J648K075J54j756j880k47J628K193L56j942k146j72
3464b062J700K018L54j652k211k07J895J929Q4j677k036j33J806J954J01j442
3480D21k266j46J781K074J15j683k040j67J721J879M44j689k386N3J697K128R8
3497B034j717j975k43J648J877N06j865j839o0J480J991J77j875j872j34J728
$$ plain form
3513 -139 1940 2147 61 -1573 -1760 -307 1898 2037 192 -1690 -1839 -180 1873 1890 138 -1674 -1776
3530 -1776 -253 1761 1966 156 -1626 -1828 -310 1684 1702 233 -1652 -2023 76 1809 1848 205 -1686
3547 -1686 -1865 -175 1689 2078 114 -1623 -1838 -267 1831 1878 276 -1597 -1674 61 1708 1809 227
3564 227 -1598 -1779 -143 1538 1867 244 -1648 -1844 -86 1620 1690 275 -1730 -1744 -133 1677 1621
3581 1621 150 -1684 -1621 -32 1700 1637 -56 -1549 -1837 -65 1618 1753 -59 -1616 -1802 54 1498
3598 1498 1607 -42 -1682 -1880 -214 1570 1723 -89 -1735 -1770 -297 1443 1739 -46 -1791 -1662 -94
3615 -94 1552 1504 -200 -1903 -1721 -157 1632 1666 91 -1878 -1533 -164 1583 1563 -122 -1630 -1838 -155
3633 -155 1482 1424 -6 -1590 -1734 15 1787 1747 -9 -1614 -1627 125 1837 1503 30 -1553 -1610 -40
$$ packed form
3513a39K079K07k086j634j87J453K205J39j845j882j49J659K053J7j752j812j02
3530a776J523K014K05j810j782k02J518J994J8j469j885l71K099J733L9j643j891
3547a686j79J690J864L89j964j737k15J571K098M7j602j873p7J735J647J01j582
3564B27j825j81J636J681L29j623j892j96J758J706P0j415k005j4J611J810n6
3581A621j471j834O3J589J732o3j693j493k88J772J683J35j812j557j86J856J444
3598A498J09j649j640j98J666J784J53j812j646l5J473J740K96j785j745J29J568
3615i4J646m8j704j703J82J564J789L4j575j969L45J369J747k0j685j508k08J683
3633a55J637n8j430j584j44J749J772m0j756j605j3J752J712l34j473j583n7J570
$$ plain form
3651 -40 1572 1579 -215 -1679 -1585 94 1384 1522 -68 -1675 -1673 -6 1368 1536 -226 -1715 -1672 -27
3669 -27 1603 1415 -155 -1691 -1712 -54 1540 1474 -20 -1732 -1542 50 1567 1349 -177 -1487 -1487 76
3687 76 1580 1557 -212 -1713 -1609 61 1560 1405 -46 -1450 -1387 55 1518 1391 -114 -1553 -1519 151
3705 151 1487 1503 136 -1504 -1500 113 1522 1442 -179 -1568 -1335 127 1536 1594 -246 -1566 -1287 342
3723 342 1550 1330 -165 -1498 -1289 -24 1645 1397 -27 -1374 -1403 173 1430 1407 4 -1659 -1322
3740 -1322 295 1539 1449 -82 -1730 -1417 165 1443 1661 -13 -1317 -1286 169 1518 1422 -99 -1343
3757 -1343 -1106 177 1400 1400 -3 -1447 -1372 350 1600 1516 -63 -1361 -1211 2 1361 1342 -40 -1182
3775 -1182 -1200 346 1528 1556 -147 -1300 -1270 125 1556 1231 -138 -1273 -1306 4 1539 1360 -192
$$ packed form
3651d0J612Pj794j464R4J679J290J38j590j607KJ667J374J68j762j489M3J645
3669b7J630j88j570j536k1J658J594o6j494j712J90J592J517k18j526j310%J563
3687G6J504k3j769j501J04J670J499j55j451j404O3J442J463j27j505j439L4J670
3705A51J336J6j367j640MJ613J409q0j621j389K33J462J409N8j840j320K79J629
3723C42J208k20j495j333K09J265J669k48j424j347k9J576J257k3j403j663L37
3740a322J617J244r0j531j648L13J582J278K18j674j304L1J455J349r6j521j244
3757a343K37J283J223%j403j444P5J722J250q4j579j298J50J213J359j9j382j142
3775a182j8J546J182K8j703j153L0J395J431l25j369j135l3J310J535j79j552
$$ plain form
3792 -192 -1357 -1446 110 1521 1295 -109 -1469 -1441 76 1485 1372 -125 -1389 -1195 311 1525 1114
3809 1114 -325 -1363 -1159 110 1312 1153 -250 -1460 -1246 315 1363 1332 31 -1338 -1155 175
3825 175 1398 1159 -120 -1340 -1327 116 1394 1246 -228 -1351 -1151 129 1447 1107 -73 -1377 -1103
3842 -1103 301 1486 1033 -287 -1515 -1246 276 1234 1316 -214 -1514 -1091 268 1143 1073 -374 -1532
3859 -1532 -1060 354 1279 984 -379 -1423 -1284 161 1190 1067 -261 -1349 -1179 109 1302 1156 -143
3876 -143 -1295 -927 377 1212 1111 -267 -1303 -1235 174 1314 1112 -342 -1340 -1326 134 1163 1104 -413
3894 -413 -1284 -1020 169 1299 933 -315 -1176 -1043 333 1380 1131 -297 -1184 -1063 117 1363 1063
3911 1063 -197 -1423 -1179 210 1448 1078 -191 -1296 -1189 287 1391 975 -382 -1391 -1085 190
$$ packed form
3792a92j165q9J556J411k26j404j360K8J517J409j13j497j264J94J506J214m11
3809A114j439j038K04J269J202j59j403j210K14J561J048l1j301j369J83J330
3825A75J223k39j279j220J3J443J278j48j474j123K00J280J318l40j180j304K74
3842a103J404J185m53j320j228K69J522R58Q2j530j300M23J359Q75p0j447j158
3859a532M72J414R25k95j363j044J39J445J029j23j328j088J70J288J193j46j299
3876a43j152L68J304Q35j01j378j036O8J409J140k02j454r98J4J460J029n9j517
3894d13q71K64J189J130l66j248q61J33J376J047k49j428q87J21J180J246l00
3911A063j260j226K44J389J238l70j269j105J07J476J104m16j357j009L06J275
$$ plain form
3927 190 1162 912 -345 -1303 -988 209 1354 1031 -463 -1434 -1028 255 1153 798 -301 -1109 -972 359
3945 359 1317 1093 -267 -1156 -955 389 1133 1061 -307 -1228 -878 129 1133 927 -259 -1186 -794 235
3963 235 1232 1116 -258 -1215 -866 604 1364 973 -279 -1196 -871 387 1520 1002 -160 -1101 -985 308
3981 308 1298 857 -386 -1096 -835 366 997 692 -437 -1209 -861 279 1225 922 -192 -1053 -963 386
3999 386 1030 682 -384 -1252 -915 350 1355 772 -322 -1167 -770 346 1207 1009 -325 -1016 -739 441
4017 441 1182 931 -235 -1343 -727 282 969 814 -295 -1111 -713 399 1297 845 -313 -971 -593 264
4035 264 1173 607 -339 -1014 -724 423 1089 934 -165 -1170 -897 288 1121 808 -369 -1047 -857 168
4053 168 881 882 -283 -860 -673 95 1120 852 -335 -1485 -651 362 1122 734 -590 -1149 -717 243 1217
$$ packed form
3927A90R72k50j257r58L15J197J145l23j494r71M06J283Q98l55j099q08J37J331
3945C59R58k24j360q89K01J344P44p2j368r21L50J007J004k06j186r27L92J029
3963B35R97j16j374r57L49J470P60l91j252r17L25J258J133n18j162r41J16J293
3981C08R90m41j243p10K61J201O31l05j129p72L48J140R46l03j114q61R0J349
3999C86O44l48j066q68L37J265J005n83j094q45L97J116Q61j98j334o91K77J180
4017D41P41k51j166j108O16J009O87j55j109q16L98J112Q98m52j158o58L78Q57
4035B64R09n66r46o75K90J147O66j55j099j005K73J185Q33l13j177o78J90J025
4053A68P13Jj165n77J87P68J025k68j187j150Q34J013P60l88j324n59M32R60R74
$$ plain form
4072 1217 682 -123 -983 -578 577 941 873 -404 -1068 -699 541 1074 676 -219 -1114 -718 176 999 679
4091 679 -296 -857 -607 517 1256 579 -146 -827 -541 311 1213 924 -277 -1144 -798 428 992 790 -443
4110 -443 -1013 -674 546 830 706 -639 -1123 -624 463 960 561 -430 -966 -733 291 888 565 -430 -1071
4129 -1071 -708 409 1067 761 -325 -1083 -667 355 1211 542 -196 -1101 -709 410 981 791 -293 -826
4147 -826 -569 381 982 627 -378 -922 -686 438 1045 649 -200 -1052 -521 295 765 568 -99 -837 -470
4166 -470 426 872 647 -360 -978 -670 157 964 593 -289 -901 -645 156 1024 597 -403 -946 -713 434
4185 434 819 448 -181 -1004 -580 479 897 560 -436 -1056 -555 343 968 597 -452 -865 -493 466 1017
4204 1017 538 -286 -1026 -554 488 924 462 -253 -899 -643 497 1076 866 -296 -965 -614 581 1151
$$ packed form
4072A217n35q05q60M05J155L64o8j277o64L69J240N33l98q95q95L96Q94Q23l20
4091F79r75n61K50J124P39o77p25o81K86Q52R02k89j201q67L46J226N64k02j233
4110d43n70L39J220K84j24j345m84M99J087M97l99r91n36K33J024N97l23r95o41
4129a071L63J117O58l06j086p58M16J022Q56o69p38r05L92J119N71j90j084n33
4147h26K57R50O01l55j005n44K36J124O07l96q49q52N31Q16M70j97o67p38L67
4166d70Q96M46k25j007o18L08Q27Q07l71q82o12K56Q01Q68m27j000n43K33J147
4185D34L85l71o29q23M24J059M18l37r96o20N01Q98O25l71j049m13L72R59N51
4204A017m79q24p40M72J042M36m62p15o46K56J140N79k10j162o69L51J195N70
$$ plain form
4222 1151 349 -304 -995 -535 300 957 485 -411 -890 -561 233 1061 654 -394 -983 -550 467 1068 422
4241 422 -596 -988 -575 429 992 475 -372 -634 -601 311 857 584 -273 -932 -462 414 760 397 -344 -811
4261 -811 -592 526 733 549 -641 -1053 -644 488 1006 534 -321 -796 -499 554 972 537 -206 -775 -577
4280 -577 228 885 597 -265 -701 -457 485 1133 482 -417 -768 -443 249 946 503 -210 -870 -531 617 729
4300 729 614 -437 -725 -555 477 724 458 -194 -839 -308 373 921 502 -405 -800 -257 484 708 441
4319 441 -509 -876 -467 393 759 451 -384 -1020 -457 593 846 611 -368 -850 -494 339 818 517 -272 -874
4339 -874 -254 402 1020 631 -363 -802 -393 246 739 300 -172 -887 -186 213 713 431 -373 -783 -447 468
4359 468 657 525 -410 -511 -411 236 841 393 -248 -955 -440 481 942 293 -320 -675 -466 466 729 401
$$ packed form
4222A151q02o53o91M60Q35O57m72q96m79L29P94Q28m07j048n89M33J017O01o46
4241D22j018l92M13J004N63n17q47k62L3R12N46k73q57o59M70Q76L46l63p41m67
4261h11K19J118K07j84j190m12M09J132N18m72q55m75K97J053M18m35p43n69J98
4280e77Q05O57k88q62m36K44R42O48o51q99l51L25O92O97m43p13o60L39J148J12
4300G29j15j051k88J70J032K47k66o52o45N31O81N48m19r07l95N43P41K24k67
4319D41r50l67M09Q60L66l08q35o36N63J050K53k35r79m82L56Q33M79l01p89o02
4339h74O20O56O18l89r94m39M09O39M93m39m72p15P01L99N00k82q04m10L36R15
4359D68J89j32r35j01J00O47O05m48o41p07N15R21M61o49o13l55K09R32K63l28
$$ plain form
4379 401 -444 -729 -344 285 864 338 -410 -814 -432 150 668 390 -346 -579 -469 349 537 436 -404 -818
4399 -818 -312 159 580 299 -278 -822 -429 334 762 449 -341 -731 -588 321 726 465 -209 -662 -484 415
4419 415 878 457 -98 -765 -280 370 588 340 -457 -537 -241 494 678 325 -414 -568 -588 500 613 241
4439 241 -399 -772 -412 298 760 271 -384 -815 -391 285 729 334 -323 -861 -567 318 758 373 -499 -758
4459 -758 -355 321 634 321 -312 -533 -251 344 549 327 -362 -613 -179 373 589 328 -207 -555 84 417
4479 417 915 400 -278 -675 -340 500 582 425 -349 -598 -375 253 760 312 -429 -676 -436 394 629 140
4499 140 -351 -651 -233 372 801 128 -429 -673 -384 301 669 213 -406 -488 -445 319 696 505 -428 -700 -392
4520 -392 292 790 120 -425 -474 -238 304 487 133 -145 -608 -256 536 747 230 -137 -473 -395 580 510 219
$$ packed form
4379D01q45k85L85O29N79n26p48m04L82N82N18k78p36k33J10Q18J88j01q40m14
4399h18N06M71M21k81n77n44L93P63M28l13p90l90J43R09M05k61o74m53J78Q99
4419D15M63m21n55o67M85O50K18k48p97q0K96P35J84l53p39j54k0J088J13l72
4439B41o40l73L60P10M62m89o55m31M24O76M44l95o57n38K94Q85M40l85q72k59
4459g58M03O76L13l13o33k21K82N95K05k22o89k51M34N52K16k61n35l48O39L33
4479D17M98n15o78l97L35Q40Q2j57p74k49K23O28N07m48p41k47K40Q30K35m89
4499A40m91l00M18O05M29o73n57k44K89O85L68m56o19q2M3P64L77j91r33k72L08
4520c92O84M98o70n45m9K36N42J83l54k78m63L52P92K11n17l67l36P8R75p0k91
$$ plain form
4541 219 -361 -492 -217 267 526 462 -319 -443 -330 409 515 183 -120 -487 -32 280 526 234 -328 -380 -185
4562 -185 62 606 168 -392 -580 -117 368 407 395 -279 -477 -253 327 403 63 -445 -455 -179 367 520 253
4583 253 -293 -531 -59 459 453 187 -334 -534 -177 232 604 401 -447 -597 -72 468 859 145 -297 -332 -173
4604 -173 367 581 216 -316 -634 -258 242 550 90 -122 -457 -321 458 708 3 -241 -471 -172 297 494
4624 494 135 -357 -446 -328 371 552 93 -323 -654 -147 169 447 195 -317 -581 -160 260 510 216 -392
4644 -392 -446 -264 398 485 -90 -387 -585 17 357 618 165 -394 -321 -305 494 393 160 -176 -486 -127 320
4665 320 465 38 -184 -325 19 295 554 173 -454 -469 -261 391 225 105 -203 -494 135 339 409 176 -436
4686 -436 -493 -101 371 415 58 -390 -528 -221 251 319 209 -334 -402 -96 424 599 37 -263 -338 -269 203 255
$$ packed form
4541B19n80j31K75M84K59o4p81j24J13P39J06l32l03l67M55L12K46k92n62n2J95
4562a85K47N44m38n60j88M63M85L9j2o74j98K24N80P6l40n08j0K76N46J53k67
4583B53n46k38M72N18ok66n21k00L57M09L72k03q48j50N25N40L91p14m42l5J59
4604a73N40K14l65n32l18L76N00L08m60k12l35J36P79K50p05k44k30K99M69J97
4624D94l59m92q9J18O99J81m59m16l31N07L16K78k52n12k64M21M20K50k94o08
4644c92n4J82O62Q7n75k97j98O02L40K61m53n59P3J6P99j01k33l36l10L59M47
4665C20J45m27k22j41L44K76K59l81o27j5K08O52j66j20l08k91O29K04P0k33o12
4686d36n7L92M72M4l57m48j38L07M72O8j10n43o8L06N20J75n62l00p5O9M72N2
$$ plain form
4708 255 223 -317 -432 -83 307 205 58 -386 -277 -103 347 364 172 -193 -419 -312 229 501 60 -346 -478
4729 -478 -84 235 561 43 -196 -474 -23 83 308 249 -110 -412 6 223 265 310 -320 -481 -28 192 300
4750 300 171 -306 -279 -171 304 393 -65 -500 -342 160 71 449 118 -115 -334 -177 228 257 36 -312 -440
4771 -440 -155 83 334 41 -292 -503 -38 331 291 269 -250 -476 -308 261 389 -13 -244 -307 72 114 439
4792 439 31 -201 -466 -4 356 405 160 -135 -292 -89 289 356 351 -283 -185 -177 256 260 239 -210 -197 -189 75 287
4816 287 10 -184 -262 -105 222 316 95 -206 -228 -110 493 284 22 -346 -356 -19 288 484 215 -278 -357 -267
4838 -267 192 204 -5 -186 -300 24 186 351 30 -144 -322 96 212 334 -81 -170 -281 -133 272 251 -15
4859 -15 -158 -339 -119 406 214 87 41 -301 35 212 296 80 -181 -193 -102 202 284 91 -170 -239 -74 163
$$ packed form
4708B55l2n40j15L49L90j02j47m44J09J74M50J7j92l65k26J07N41K72m41m06j32
4729d78L94L19L26n18k39k78M51J06K25n9l59l02M18K17M2M5o30j61M53K20J08
4750C00j29m77K7J08M75Q9m58m35J58N02q9L78l31k33k19J57M05K9k21l48j28
4771d40K85K38K51k93l33k11M65L69m0k2n19k26J68N69J28m02k31o3L79M2L25
4792D39m08k32k65M62L60M9k45k95j57K03L78O7no34R8QM33Mk1m49J3QK64K12
4816B87k77j94p8J57L27R4k21l01k2J18O03k09k62l68j0L37L07J96k69m93p9R0
4838b67M59J2k09j81j14L24J62J65l21j74j78M18J16J22m15q9j11J48M05k1k66
4859a5j43j81K20N25j92j27m6l42L36J77Q4k16k61j2R1L04Q2j93k61o9J65K37
$$ plain form
4881 163 420 9 -282 -477 -180 239 81 59 -234 -286 -6 91 235 26 -331 -415 97 174 178 10 -276 -103
4903 -103 82 317 214 116 -100 -220 -76 178 183 39 -178 -288 55 226 154 -3 -161 -268 -143 72 -3 -29
4925 -29 -308 -422 139 227 151 -42 -192 -372 208 328 205 76 -245 -134 -254 354 296 -205 -146 -188 -133 274
4947 274 231 -145 -318 -182 -41 256 246 -19 -379 -306 44 38 216 -205 -182 -249 -105 187 75 100 -223 -197 241
4970 241 216 223 67 -208 -286 -77 255 167 148 -174 -231 -141 48 468 54 -261 -216 35 165 362 -26 -113 -189 -25
4994 -25 74 238 -91 -271 -174 77 193 312 38 -261 -199 59 474 385 -82 -193 -91 -113 215 221 -72 -234 -258
5017 -258 -126 73 130 99 -469 -322 -171 250 392 24 -212 -232 16 268 172 -82 -314 -290 -144 340 245 156
5039 156 -121 -121 -66 243 153 13 -274 -204 -113 244 26 -128 -72 -131 -73 163 334 -18 30 -170 116 72 -5 -54
$$ packed form
4881A63K57m11k91j95K97M19j58k2k93n2K80R7J44k09l57q4N12P7Mj68k86J73
4903a03J85K35j03r8k16j20J44K54Nj44k17j10L43J71p2j57j58j07J25K15p5k6
4925b9k79j14N61Q8p6j93j50j80N80J20j23j29l21J11j20O08n8n01N9m2N5M07
4947B74m3l76j73J36J41K97j0k65l60P3L50oJ78m21K3o7J44K92j12K5l23K6M38
4970B41k5Pj56k75p8K09L32q8j9l22n7R0J89M20m14l15M5K51J30J97l88q7p6J64
4994b5R9J64l29j80R7K51J16J19k74k99O2K58M15q9m67j11J02k2L28Ok93j62k4
5017b58J32J99N7l1n68J47J51M21J42l68k36k0K48K52r6k54k32K4J46M84r5q9
5039A56k77%N5L09r0j40k87P0R1L57k18j54N6n9N8K36J71l52M8k00K86m4p7m9
$$ plain form
5063 -54 -166 -249 -72 159 174 124 -133 -303 59 176 233 -15 -164 -161 8 179 109 -27 -36 -337 -70 158 187 -1
5087 -1 -72 -138 49 224 323 9 -55 -81 125 135 142 -58 -229 -304 126 248 222 -65 -165 -136 57 47 132 -65 -185
5112 -185 -115 75 141 333 -80 -283 -127 -22 219 227 50 -130 -169 131 340 246 -89 -115 -41 136 201 114 -197
5135 -197 -221 -305 26 311 185 -48 -106 -99 76 314 79 -75 -268 -120 195 288 218 -55 -232 -201 -91 143 255
5158 255 58 -263 -52 -40 281 148 -9 -197 -217 -88 210 97 -28 -87 -229 121 165 132 -121 -221 123 -124
5180 -124 126 166 -36 -48 -293 31 304 264 -30 -281 -292 -218 212 315 29 -216 -182 -40 277 198 90 -41
5202 -41 -150 150 335 74 96 -188 -124 82 105 89 -154 -375 -154 119 291 111 41 -223 -219 -163 132 73 -151
5225 -151 -201 -114 -250 147 286 -185 -120 -77 31 84 107 -169 -156 -120 126 212 268 -85 -64 -79 10 186 23 24 -199
$$ packed form
5063e4j12q3J77K31J5n0k57j70L62J17N7k48j49LJ69J71p0j36rl01K67K28K9j88
5087ap1o6J87J75R9l14o4k6K06J0Pk00j71p5M30J22k6k87j00K9J93j0Q5j97j20
5112a85P0J90O6J92m13k03J56J05K41Qj77j80l9L00K09r4l35k6P4J77O5q7l11
5135a97k4q4L31K85j26k33n8PJ75K38k35j54j93J48L15R3p0k73j77L1J10K34J12
5158B55j97l21K11J2L21j33j57j88k0J29K98j13j25n9j42L50M4l3k53j00L44k47
5180a24K50M0k02j2k45L24K73m0k94k51j1P4M30J03k86k45L4J42L17p9j08j31
5202d1j09L00J85k61K2k84O4K06K3j6k43k21K21K73J72j80p0k64MN6K95n9k24
5225a51n0Q7j36L97J39m71O5M3J08N3K3k76J3L6K46Q6N6l53K1j5Q9J76j63Jk23
$$ plain form
5250 -199 -13 -14 200 391 85 -79 -62 -31 152 273 2 -111 -87 152 105 -104 -33 -134 -158 54 136 87 111 -34
5274 -34 -75 187 418 31 -6 -26 -52 38 234 46 -135 -343 49 43 40 149 -226 -312 -95 170 137 90 -49 -57 -310
5299 -310 62 289 68 -44 -159 -198 53 68 -54 17 -71 -238 84 244 156 95 -198 85 -47 36 34 -124 -8
5322 -8 -196 1 27 237 -30 -158 -9 -51 140 304 -238 -191 -158 33 122 -12 -192 52 99 67 294 -30 -69
5345 -69 -154 -229 230 136 239 3 -66 -119 -53 186 20 -55 -260 -196 61 246 226 -106 -11 -149 12 147 -8 -64
5369 -64 -249 156 67 174 207 1 -102 5 132 55 263 -123 -127 98 48 224 172 15 -96 -43 46 -130 107
5392 107 -17 -6 -61 -52 150 77 -162 -103 -179 -55 -17 99 40 -26 -123 -16 127 172 9 -186 -107 -18 220 29 -86
5417 -86 38 -211 36 146 30 10 -31 -159 75 184 -78 46 -128 -193 -57 160 86 -36 -245 -20 93 186
$$ packed form
5250a99J86jK14J91l06j64J7L1J83J21k71j13K4K39m7k09P1j01k4K12Q2m9K4j45
5274c4m1K62K31l87l7k0k6R0J96j88j81k08L92olJ09l75q6K17K65l3m7j39qk53
5299c10L72K27k21j12j15l9K51J5j22P1q8j67L22J60q8o1k93K83j32Q3kj58J16
5322hj88J97K6K10k67j28J49m2J91J64n42M7L3J91Q9j34j80K44M7l2K27l24l9
5345f9q5p5M59r4J03k36o9n3O6K39j66p5k05O4K57J85k0l32R5j38J61J35j55n6
5369f4j85M05q9J07L3k06j03J07J27p7K08l86mK25n0J76n2j57j11N3Q9j76K37
5392A07j24J1n5RK02p3k39N9p6J24L8J16n9o6r7J07J43M5j63j95P9Q9K38j91j15
5417h6J24k49K47J10j16k0m1j28K34J09k62J24j74o5J36K17p4j22k09K25J13R3
$$ plain form
5439 186 117 -33 -204 -227 -123 145 251 -223 -81 -197 -1 334 13 -39 89 23 229 71 -51 -69 -177 -76
5461 -76 -26 54 -25 -94 91 38 -110 21 67 -6 -16 -127 71 64 149 116 -260 -187 8 72 122 -50 -220 -97 254
5486 254 298 208 -11 -220 -30 -51 264 1 -151 -172 -192 192 143 -17 49 73 -191 205 167 34 11 -118 -287
5509 -287 37 232 91 -203 60 -204 -138 70 66 -39 -221 -208 -210 49 73 56 -7 -165 118 162 77 3 31 -128
5533 -128 157 54 -127 -13 -74 -130 123 36 31 -28 -47 -119 136 148 37 26 -142 -158 11 128 -24 115 -28 -281
5557 -281 126 241 111 -13 -7 -42 147 218 20 30 -212 -133 91 -35 258 -32 -191 -181 49 21 68 23 -98
5580 -98 -37 207 151 219 -143 -120 -152 76 64 23 -384 -60 -82 -86 -10 102 5 -113 58 -193 152 265 44 -92
5604 -92 159 10 82 -77 -85 -40 14 22 139 170 -115 -156 -260 110 242 15 33 -107 -38 122 107 90 27 -63 86
$$ packed form
5439A86o9j50j71k3J04K68J06m74J42j16J96L35l21n2J28o6K06j58j22j8j08J01
5461g6N0Q0p9o9J85n3j48J31M6p3j0j11J98pQ5l3l76P3J95O4N0j72j70J23L51
5486B54M4r0k19k09J90k1L15k63j52k1k0L84m9j60O6K4k64L96l8j33k3j29j69
5509b87L24J95j41k94K63k64O6K08mj05j82J3kK59K4j7o3j58K83M4q5p4K8j59
5533a28K85j03j81J14o1n6K53q7nn9j9p2K55J2j11j1j68j6J69J17j52J39j43k53
5557b81M07J15j30j24Ol5J89P1j98J0k42P9K24j26K93k90j59J0K30k8M7m5j21
5580i8O1K44n6O8l62K3l2K28j2m1m07L24k2mP6J12r7j18J71k51L45J13k21j36
5604i2K51j49P2j59qM5N4QJ17L1k85m1j04L70J32k27J8j40O9J60j5j7o3r0J49
$$ plain form
5629 86 46 8 59 -85 -87 -231 132 130 9 21 -54 -92 20 126 110 49 98 90 -9 225 224 85 -173 -132 24 180 -106
5656 -106 -119 46 -87 46 34 122 -114 -193 -89 106 157 -32 28 -200 -151 -37 224 -52 -126 96 -263 75 205
5679 205 89 -167 -252 -51 41 114 -70 -72 0 -67 129 -176 86 -222 28 47 -42 307 40 -215 -137 -111 38 99
5703 99 215 -46 -104 -29 119 128 -93 78 -102 -106 102 -24 274 -121 128 47 4 109 -9 114 -175 -97 148
5726 148 -118 61 131 -14 -88 -113 -123 -34 -76 52 -110 -25 198 151 59 -19 76 -8 -4 222 143 -146 -250 149 -23
5751 -23 -121 58 -101 79 -59 187 117 104 -93 26 130 -58 226 -206 -101 19 230 42 141 -124 25 216
5773 216 66 26 26 78 -49 131 4 -22 296 -44 -126 13 82 -50 89 -156 -181 -11 20 78 157 -99 -123 -7
5797 -7 44 212 -31 -60 -118 -51 247 157 56 -264 -177 32 -126 78 -18 -158 -131 147 83 94 -23 -67 45 36 -3
$$ packed form
5629H6m0l8N1j44kj44L63kj21J2p5l8J12J06j6o1M9qr9K34jj39k58M1J56J56k86
5656a06j3J65j33J33j2Q8k36p9J04J95N1j89O0k28M9J14K61k76p4K22l59L38J30
5679B05j16k56q5K01R2P3j84kP2o7J96l05K62l08K50J9q9L49k67k55P8K6J49O1
5703I9J16k61n8P5J48Rk21J71j80mK08j26K98l95K49q1m3J05j18J23k89P8K45
5726A48k66J79P0j45p4k5j0Q9m2J28j62Q5K23m7r2p8R5q4MK26p9k89j04L99j72
5751b3r8J79j59J80j38K46p0j3j97J19J04j88K84m32J05J20K11j88R9k65J49J91
5773B16j50m0%N2j27J80j27k6L18l40q2J39O9j32J39k45k5J70L1N8P9k56k4J16
5797gN1J68k43k9n8O7K98r0j01l20Q7K09j58K04r6j40K7K78o4J1j17m4J12rl9
$$ plain form
5822 -3 22 -46 159 23 -146 55 13 -23 -1 -151 52 -22 54 103 -284 -17 -119 170 71 7 -168 -177 69 144 189
5847 189 38 -69 -86 -133 84 102 -77 -102 -101 34 134 -14 73 8 -196 23 47 101 123 166 27 104 212 97
5871 97 22 90 -224 110 196 164 -117 93 -93 27 166 77 -36 -77 -19 -26 -18 -63 101 -114 2 3 -150 216 103
5896 103 2 105 -157 127 -30 141 -151 10 -104 54 174 62 34 -219 36 -53 -58 -4 -103 -81 8 117 150
5919 150 149 137 -223 -250 66 55 223 -31 50 194 -17 136 2 17 52 -111 76 93 -31 68 39 108 163 69 -7
5944 -7 44 -69 119 86 -10 -35 138 14 -90 111 63 -30 125 -101 88 122 49 59 144 -142 -106 67 225 98
5968 98 14 -18 -68 284 77 86 5 -18 -47 144 225 -100 40 -114 23 252 -5 20 -57 7 -108 -52 145 25 -67
5993 -67 136 -36 -129 180 -22 -131 -130 -91 101 104 62 -45 -44 122 -104 24 6 193 -63 98 8 36 185 9
$$ packed form
5822cK5o8K05j36j69K01m2l6K2j50K03p4P6M9l87K67j02K89r9o4j75rK46P5M5
5847A89j51j07j7m7K17J8j79k5JJ35J00j48Q7o5k04K19K4N4K2M3j39P7J08j15
5871I7p5O8l14L34Q6l2k81K10j86J20J39q9j13m1N8pQm5J64k15J16Jj53L66j13
5896A03j01J03k62K84j57J71k92J61j14J58J20j12k8k53K55q9nN4r9K2Q9J09L3
5919A50jj2l60k7L16j1J68k54Q1J44k11J53j34J5L5j63J87J7j24R9k9O9N5r4p6
5944gN1j13J88l3r6k5J73j24j04K01m8r3J55k26J89L4p3J0Q5k86L6J73J58j27
5968I8q4l2n0L52k07Rq1k3k9J91Q1l25J40j54J37K29k57K5p7O4j15N6J97j20r2
5993f7K03j72r3L09k02j09JL9J92Lm2j07JJ66k26J28j8J87k56J61r0K8J49j76
$$ plain form
6017 9 -141 113 54 -122 -102 -99 133 -114 -12 -29 20 -178 -333 -50 151 55 81 -82 -15 0 -8 14 125 17 128
6042 128 -76 -167 21 141 -83 27 -12 62 209 -38 -12 17 116 -30 200 305 144 -94 -256 -76 -1 -81 -202
6065 -202 -78 142 26 115 142 88 -9 -118 97 117 72 -46 -21 59 171 86 -77 144 28 91 72 12 34 120 66
6090 66 -9 96 36 -33 176 171 10 -14 -33 -127 27 -48 17 -155 145 -22 69 -48 99 177 122 94 -9 29 18 -54
6116 -54 45 -63 -16 103 -22 28 179 89 -200 -44 53 116 -62 21 65 -197 -208 -33 117 40 149 104 76 36 192
6141 192 173 -212 -75 -120 11 -1 -31 -68 61 -178 -89 4 -203 -34 35 22 129 94 52 -211 23 -54 134 -22
6165 -22 76 102 -3 63 159 206 -4 -45 -166 51 44 -9 60 -117 -194 80 119 -37 -30 -94 -67 -121 205 49 -33 -2 -127
6192 -127 -90 -169 -158 -72 -341 153 130 -52 33 -38 21 35 10 130 -9 -30 52 -124 68 3 166 141 -90 10 0
$$ packed form
6017Ij50K54n9j76K0LK32k47J02j7M9j98j55K83K01r6K6j63O7J5qK2J11j08J11
6042A28k04r1J88J20k24J10l9P4J47k47K6K9R9j46K30J05j61k38j62J80P5q0j21
6065b02J24K20j16Q9K7n4r7j09K15K0m5j18K5Q0J12q5j63K21j16O3j9o0K2Q6n4
6090F6p5J05o0o9K09nj61k4j9r4J54p5O5j72L00j67R1j17J47P8n5k8j03L8j1p2
6116e4R9j08M7J19j25N0J51r0k89J56R7O3j78Q3M4k62j1J75J50p7J09m5k8m0J56
6141A92j9l85J37m5J31j2l0l7J29k39Q9R3k07J69O9j3J07l5m2k63K34p7J88j56
6165b2R8K6j05O6R6M7k10m1j21K17pn3O9j77p7K74L9j56Po4K7n4L26j56q2L1j25
6192a27L7p9J1Q6k69M94k3j82Q5p1N9J4k5J20j39k1Q2j76J92o5J63k5k31J00j0
$$ plain form
6217 0 -65 -3 -109 144 34 188 -73 81 -172 2 -131 185 58 -52 -18 -185 -20 -100 145 -41 -99 -4 -2
6240 -2 -130 146 -22 132 -262 -200 -38 138 -32 58 -127 73 11 -22 103 -137 -9 36 -72 28 -139 49
6262 49 132 -99 15 47 -137 -59 -72 -42 25 -37 251 -155 37 -90 25 173 -72 14 -201 -102 -110 -55 -26 -70 -176
6287 -176 -213 100 -91 91 85 -93 -119 106 -15 153 68 -153 38 42 79 -35 164 -40 -58 11 63 -31 -53 -119 -50
6312 -50 -37 199 -23 -12 10 -174 -126 5 -23 36 -65 -57 38 124 -51 126 65 -98 -108 58 43 -72 -217 -112 -29
6337 -29 48 -90 -241 6 -24 -18 38 206 141 36 -216 50 -84 128 2 -185 -12 -163 28 -80 -19 -7 -35
6360 -35 225 66 91 -45 -200 -26 169 83 -64 40 -39 30 -108 202 113 16 116 -162 53 -181 99 -11
6382 -11 110 -44 -169 188 135 20 -100 -116 -10 108 -109 -61 32 -89 131 23 46 57 -118 -97 40 127 -94
$$ packed form
6217@o5O2j06K53j10J54k61J54k53J74j33L16j27j10L4j67J65q0K45j86n8R5K
6240bj28K76j68J54l94O2J62J76j70R0j85K00o2l3J25k40J28M5j08J00j67J88
6262D9Q3k31J14L2j84P8j3L0O7o2K88m06J92j27J15J48k45Q6k15R9qN5K9m4j06
6287a76l7L13j91J82oj78k6K25j21J68q5k21J91ML7j14J99k04j8O9N2r4k2o6O9
6312e0J3K36k22J1K2j84M8J31k8N9j01QR5Q6j75J77o1j63j0J66j5j15j45J05Q3
6337b9P7j38j51K47l0ON6J68o5j05k52K66j34K12j26j87J73j51J91j08O1J2k8
6360c5K60j59K5j36j55J74J95q6j47J04p9O9j38L10q9r7J00k78K15k34K80j10
6382a1J21j54j25L57n3j15j20j6J06J18k17M8R3j21K20j08K3J1j75K1J37Q7k21
$$ plain form
6405 -94 -19 -155 -114 -259 196 83 -215 -39 -33 22 -76 85 23 -120 0 -157 119 26 15 1 41 195 124 90 16
6430 16 -62 32 100 -44 259 -118 -23 -32 -106 13 66 255 -282 91 130 138 29 -150 -75 7 106 275 50 -178 56
6455 56 -23 177 94 -51 -70 -194 -86 -70 34 -198 64 -48 -79 -174 1 -3 -93 -104 48 126 -9 121 15 -104
6479 -104 -144 59 -172 28 -171 91 -52 35 14 57 -22 -267 -9 -114 94 32 66 76 -42 85 295 103 47
6502 47 -23 -129 9 -25 -49 -45 -241 201 237 61 52 -5 5 -100 13 50 40 98 -237 -1 21 99 -61 -81 113 39
6528 39 -130 -108 82 -72 -129 -48 -190 77 -60 -98 -18 -125 38 73 14 43 -128 -67 -162 73 -29 22 -180 -84
6552 -84 132 -12 -64 45 21 4 -13 -46 164 -125 31 -143 81 87 23 -115 -39 98 191 -59 -98 13 -53 -11 60
6577 60 125 -13 -186 -29 118 136 -39 91 -74 4 136 -58 153 -62 80 -93 54 32 -12 -131 -133 10 -189
$$ packed form
6405i4P5j36M1j45M55j13k98J76ON5r8J61o2j43J20j57K76r3j1j4M0J54p1l4p4
6430A6p8R4O8j44L03l77R5rp4J19N3J89n37L73L9Qj09j79P5Q2R9J69k25k28K34
6455E6p9K00q3j45j9j24J08J6J04k32K62j12l1r5J75mr0j1J52P8j35J30j06j19
6479a04m0K03k31K00j99K62j43Q7k1M3p9k45K58j05K08o2L4J0j18J27K10j92n6
6502D7p0j06J38l4k4Mj96M42L6j76rn7J0j05J13L7j0N8l35K36K2P8j60k0J94p4
6528C9j69K2J90j54n7Q1j42K67j37l8Q0j07J63L5n9K9j71O1r5K35j02N1k02R6
6552h4K16j44n2J09k4j7j7l3K10k89J56j74K24Oo4j38P6J37R3k50l9J11o6M2P1
6577F0O5j38j73J57J47J8j75J30j65P8J32j94K11k15J42j73J47k2m4j19kJ43j99
$$ plain form
6600 -189 -58 -11 22 2 90 99 41 46 -40 23 -29 -25 -29 -137 -136 -30 -99 -69 -84 113 105 -135 -34 179 44 195 23 -44
6628 -44 39 159 117 15 -91 74 14 -79 131 -173 -110 -86 -31 -188 52 125 153 -29 42 157 -43 66 -38 135
6652 135 -138 -75 144 130 247 -38 -103 4 41 127 30 -71 -32 24 -5 107 -22 -27 -166 -63 23 -108 -104 94 -194
6677 -194 59 78 121 -1 122 -60 -98 -64 10 176 164 33 -134 -41 54 -122 -190 -53 27 -75 9 135 -140 280
6701 280 -45 205 155 -91 -174 -147 -71 127 102 178 -30 -140 -25 177 88 168 -65 67 -43 -19 -45 -71 -160 -79
6725 -79 98 40 184 -119 -6 77 -90 -24 242 147 -70 -96 -2 132 165 -177 53 -37 80 -87 -4 -102 -69 -61 -120
6750 -120 -21 180 52 -228 -213 12 62 29 19 2 -36 7 -63 66 163 111 -40 -96 267 77 180 39 -77 30
6774 30 116 1 -100 -47 -213 -167 0 176 24 -137 -102 126 30 119 -152 42 59 -53 62 -51 -122 -123 14 165
$$ packed form
6600a89J31M7L3k0Q8Rn8Nq6O3n2Mmj08JJ06o9L0j5J97qk40J01K13j35J51j72o7
6628d4Q3J20m2j02j06J65o0r3K10l04O3K4N5j57K40P3K8j82P1J15k00J09j04J73
6652A35k73O3K19j4J17k85o5J07L7Q6r7j01L9N6k9J12j29nj39J03Q6j31MJ98k88
6677a94K53J9M3j22J23j82l8L4P4J66j2j31j67R3R5j76o8J37Q0j02Q4J26k75M20
6701B80l25K50n0k46q3K7P6J98k5P6k08j10J15K02q9Q0k33J32j10K4k6k6q9Q1
6725g9J77n8J44l03J13Q3j67O6K66r5k17k6R4J34L3l42K30r0J17j67Q3r8L3Qn9
6750a20R9K01j28k80J5K25N0l3j0j7l8M3p0J29R7n2j51n6L63j90J03j41j16J07
6774C0Q6j15j01N3j66M6J67J76j52j61L5K28r6Q9k71J94J7j12J15j13p1jJ37J51
$$ plain form
6798 165 94 24 99 76 -124 -146 180 24 18 11 65 64 -75 179 122 -86 60 45 53 30 -98 -22 -228 53 5 10 54
6825 54 -97 -154 53 -46 126 63 65 -187 -127 159 102 26 -101 41 79 -153 12 16 33 37 31 96 4 -50 -132 -43 181
6852 181 230 18 44 -56 64 79 -70 -89 -4 -157 -178 -155 122 -8 -100 -118 61 21 19 -83 -157 -36 31 -110 -62
6877 -62 30 69 -56 46 136 34 -47 62 147 -58 132 56 85 -129 -106 -116 120 123 52 1 43 -25 -63 -141 96 81
6903 81 141 97 -1 176 21 62 -239 10 -187 -153 -33 167 -16 -75 -11 33 -25 108 14 -93 195 74 88 7
6927 7 -13 -11 20 45 63 -135 89 111 -134 -186 73 -16 -101 -123 -93 257 192 14 -50 -31 150 34 49 -155 -46 -27
6953 -27 20 115 78 -46 -233 -6 -83 -41 8 -81 4 -70 -235 -146 28 -48 10 -14 110 122 -26 -105 76 127 81 112
6979 112 -58 -165 -35 -30 -67 -35 -78 222 -104 50 190 -39 190 -71 -93 -43 -142 20 -23 124 64 -177 -40
$$ packed form
6798A65p1p0P5k3k00k2L26j56opN4jj39K54n7k08J46j5Qk3j28P6k06K81m8NM4
6825E4j51n7K07r9J72o3Kk52O0K86n7p6j27J42L8k32J65MJ7MoO5r2n4q2Q9K24
6852A81M9k12K6j00J20J5j49j9Q5j53k1K3K77j30r2j8J79m0kj02p4J21O7j41M8
6877f2R2L9j25J02R0j02q1J09Q5k05J90p6K9k14K3j0K36Lp1n1M2o8l8p8K37j5
6903H1O0m4r8J77j55M1l01K49j97L4J20K00j83n9O4M4n8J33r4j07K88j21J4q1
6927Gk0KL1K5J8j98K24K2k45n2K59q9q5k2L0L50o5j78o4J9J81j16J5k04J09J9
6953b7M7R5l7j24j87K27p7M2M9q9Q5p4j65Q9J74p6N8k4J24J2j48p9J81N1m6L1
6979A12j70j07J30Nl7L2m3L00l26J54J40k29K29k61k2N0r9J62m3J47o0k41J37
$$ plain form
7002 -40 -30 -147 -77 100 -69 -25 38 -1 86 -89 -199 -8 -78 87 -99 -33 -250 -115 51 125 -28 -206 -14
7025 -14 120 15 -18 -65 48 -3 -65 167 -27 -48 -74 -77 125 203 243 -108 57 -31 146 91 78 -2 -4 -25 -168 -102
7051 -102 78 -76 -45 -7 -55 9 -49 76 -278 159 -5 -16 63 85 7 142 29 251 221 -68 -119 -88 52 -12
7075 -12 90 121 14 -146 -176 226 79 128 -51 78 45 115 60 -75 -119 67 -56 34 245 129 56 -144 162
7098 162 65 -51 -63 -38 -49 -18 17 146 14 13 -59 95 36 16 -10 -71 -63 8 13 -132 80 0 -3 -192 82 -17 -163
7125 -163 -38 -92 153 7 70 13 193 73 104 171 178 -87 97 -61 59 -67 -35 -97 9 -205 -49 -8 53 68
7149 68 -27 9 -78 -11 24 127 91 158 -169 -75 212 -34 -98 43 64 158 234 44 37 12 -164 36 81 -102 -66 16
7175 16 -56 -83 -84 245 -230 -125 148 219 131 68 -49 -117 -30 151 170 115 -50 42 -166 28 129 -62 54 2 14
$$ packed form
7002d0J0j17P0J77j69M4O3l9Q7j75j10J91p0J65j86O6k17J35J66P4j53j78J92
7025a4J34j05l3m7J13n1o2K32j94k1k6lK02P8M0l51J65q8J77n5j3q0kk1j43O6
7051a02J80j54L1L8m8O4n8J25l54M37j64j1P9K2p8J35j13K22l0k89n1L1J40o4
7075a2J02L1j07j60l0M02j47M9j79J29l3P0n5j35m4J86j23R0K11j16p3k00L06
7098A62r7j16j2K5j1L1L5J29j32jp2J54n9k0k6o1QP1Nj45K12q0lj89K74r9j46
7125a63J25n4K45j46O3n7J80j20L1O7Pk65J84j58J20j26L2o2J06k14J56M1O1J5
7149F8r5L6q7O7L5J03l6O7l27R4K87k46o4J41K1R4P6j90pk5j76K00M5j83L6Q2
7175A6p2k7jL29m75J05K73P1q8o3j17o8Q7J81J9n5j65R2k08J94J01j91J16n2J2
$$ plain form
7200 14 185 173 42 33 -59 106 155 113 -110 96 10 -157 -74 -55 -126 62 -129 -93 -28 50 -96 -67 -75 -39 -20 -20 24
7227 24 -188 -48 -119 31 51 -52 -49 -54 -36 1 -96 -100 39 -29 84 52 -97 16 -6 103 -18 -139 80 -31 -30 17
7253 17 -225 9 -3 2 -124 -214 229 162 -54 -16 -38 122 89 -10 7 118 48 -14 -176 63 31 7 -186 -51 23
7278 23 20 -124 -120 -77 -69 58 207 90 -95 -158 -102 -201 110 258 59 94 47 -92 -29 -51 59 40 -134 59 59 89
7304 89 -32 70 98 -1 97 88 43 -60 0 45 35 -11 51 -78 -106 188 -15 17 -45 207 25 121 -12 -111 -15 59
7330 59 184 -25 100 32 130 -48 -7 76 116 -157 25 -102 54 -3 75 -24 -99 -41 -117 70 -64 4 149 -64
7354 -64 36 94 2 -101 -28 43 7 11 -27 123 -196 26 156 144 -23 133 14 -47 -32 -67 -24 -90 1 27 -145 -64
7380 -64 7 63 40 -33 67 101 117 78 -66 -112 144 -80 -68 225 -136 23 133 -32 163 50 71 -24 -14 78 27
$$ packed form
7200A4J71j2j31rr2J65M9m2k23K06q6j67Q3J9p1J88j91L6O5P8j46K9qL6J9%M4
7227B4k12J40p1J50K0j03LnJ8L7r7mJ39o8J13l2j49J13k2J09j21j21K19j11JM7
7253A7k42K34j2Nj26r0M43o7k16L8k2J60l3r9J7J11p0o2j62K39l2k4j93J35P4
7278B3lj44MM3QJ27J49j17j85o3N6r9L11J48j99L5m7j39O3k2J10j9j74J93%L0
7304H9j21J02K8r9R8rm5j03O0M5j0m6O2j29k8K94k03L2o2K52j82R6j33r9R6P4
7330E9J25k09J25o8R8j78M1Q3M0k73J82j27J56n7P8r9p5N8p6J87j34O8J45k13
7354f4J00N8r2j03P3P1l6Ml8J50l19K22J30j2j67J56j19o1J5l5M3o6R1K6j72Q1
7380f4P1N6k3p3J00L4J6l9j44m6K56k24J2K93l61J59J10j65J95j13K1r5J0R2n1
$$ plain form
7405 27 183 -83 73 -69 -55 35 72 86 68 -89 -23 105 31 -28 -36 -54 -122 68 -229 -68 -121 -60 -176 -86 -43 -161
7431 -161 -354 23 67 5 154 99 -50 112 173 179 80 -180 -64 -192 -16 -49 -131 80 7 30 -209 100 50 -17
7455 -17 -36 -77 95 84 -3 -10 -231 58 30 29 -1 -73 43 72 -121 -61 -134 -12 15 36 78 47 -49 17 -3 10 58 96
7483 96 -85 -77 -134 -238 58 61 -14 -28 -26 56 -107 -12 14 28 99 -97 12 -96 63 17 18 12 148 -67 -47 1 -2 88
7511 88 -13 1 85 -88 122 8 -39 -27 -103 -121 -16 5 26 53 -189 248 110 -209 -62 -57 -176 100 -111 -36
7535 -36 -68 180 145 103 32 170 173 148 -170 -143 -34 -99 233 -46 -49 40 115 20 -37 -70 -23 12 92 55 110 5 63 122
7563 122 7 -127 101 9 37 19 -30 -83 297 -43 -43 110 -32 121 103 -52 -17 26 -80 89 104 -59 30 -73
7587 -73 -67 16 33 -67 86 85 291 -120 -133 6 81 105 -21 -51 -54 51 35 150 -269 -111 29 84 139 -25 2 -192
$$ packed form
7405B7J56k66J56j42J4R0L7J4j8j57O6J28p4n9qj8o8J90k97J61n3O1j16R0M3j18
7431a61j93L77M4o2J49n5j49J62O1Or9k60J16j28J76l3q2K11p3K3k39L09n0o7
7455a7j9m1J72j1q7pk21K89k8jl0p2J16K9j93O0p3J22K7K1M2l1r6O6k0J3M8L8
7483I6j81Qn7j04K96Lp5j4KQ2j63R5K6J4P1j96J09j08J59m6JoJ36k15K0M8lR0
7511H8j01J4Q4j73K10j14m7J2p6j8J05K1K1K7k42M37j38l19J47Nj19K76k11P5
7535c6l2K48l5m2p1J38Lk5l18K7J09o5L32k79lQ9P5r5n7l3M7L5Q0l7N5j05N8N9
7563A22j15j34K28r2K8j8m9n3L80l40%J53j42J53j8j55L5M3j06J69J5j63Q9j03
7587g3OQ3J7j00J53jK06m11j3J39P5K4j26l0lJ05j6J15m19J58J40N5N5j64K7j94
$$ plain form
7613 -192 21 169 -22 54 35 -44 53 -60 26 207 -76 -212 88 53 54 -41 38 28 115 -28 108 -78 5 -23 103
7638 103 180 -95 95 -150 239 -22 39 -83 -73 15 -67 -60 153 80 -189 -30 -70 -69 -41 154 150 -54 -27 -62 53
7663 53 40 -31 35 -134 194 29 5 23 -95 -62 6 -110 -250 -81 -116 -55 18 32 298 -77 -57 41 -62 62 59
7688 59 99 116 -106 68 125 -118 99 -68 -127 -64 84 194 -29 32 -99 35 -24 -38 67 -270 81 118 27 118
7712 118 -59 -128 -26 -79 -26 133 149 27 89 15 1 54 126 21 -50 132 35 2 -80 63 -43 -17 -105 -115 -41 -133
7738 -133 19 -36 181 47 -162 -37 -76 -3 19 -43 23 -90 -21 84 255 -34 211 39 16 -23 125 1 -142
7761 -142 38 -1 58 -140 40 -12 103 0 -94 90 142 -39 32 -84 -204 -78 -1 70 -43 4 56 -100 -225
7784 -225 96 -6 8 -66 48 -124 177 -71 -124 40 73 59 -214 -221 42 -75 -183 -9 -40 -142 141 40 51
$$ packed form
7613a92K13J48j91P6j9p9R7j13Q6J81k83j36L00l5Jr5P9j0Q7j43J36j86Q3k8J26
7638A03P7k75J90k45L89k61O1j22J0Q8q2PK13p3k69J59m0JK8J95mk04K7l5J15
7663E3j3p1O6j69L28j65k4J8j18L3O8j16j40J69l5O1P3J4K66l75K0R8j03J24l
7688E9M0J7k22J74N7k43K17j67n9O3J48J10k23O1j31J34n9j4J05l37L51L7r1R1
7712A18j77o9J02n3N3J59J6j22O2p4j4N3P2j05p1J82r7l3q2J43j06K6q8j0P4r2
7738a33J52n5K17j34k09J25l9P3K2o2O6j13O9J05J71k89K45j72k3l9J48j24j43
7761a42J80l9N9j98J80n2J15j03r4J84N2j81P1j16j20J26P7P1j13M7N2j56j25
7784b25L21j02J4p4J14j72L01k48n3J64L3j4k73pK63j17j08J74l1j02K83j01J1
$$ plain form
7807 51 -54 -36 -73 102 44 174 16 46 -37 41 6 -48 86 -8 3 -118 -124 118 -80 -163 58 -228 -80 -6 -61
7832 -61 84 -71 -141 43 98 61 -172 11 11 293 -13 -46 -26 -61 5 59 -50 160 -72 -216 -87 -94 -81 -302 -55
7857 -55 106 -55 -277 128 52 -96 -6 -34 69 13 11 34 -97 -134 69 -25 81 -59 -44 5 67 49 102 -188 -189 30
7883 30 2 9 -123 -54 -91 3 56 9 53 -54 -25 -160 -132 89 -76 -15 88 108 -186 9 49 53 -107 -190 39 4
7909 4 15 39 -153 116 -134 42 17 97 12 -238 16 -12 -23 -93 100 89 11 211 -169 -79 111 -88 46 18 -84
7934 -84 -142 -145 11 20 38 66 -245 -55 52 141 -81 7 -246 81 18 -72 79 101 79 58 33 -74 110 -89 -83 -62
7960 -62 -23 -63 -113 3 -31 -47 -78 -110 -54 58 -85 78 -86 -98 209 17 -77 96 33 -25 -90 234 107 86 20
7985 20 143 20 24 14 95 -22 16 30 187 53 -141 88 140 59 244 11 -8 64 -10 45 69 -26 78 82 -98 -181
$$ packed form
7807E1j05J8l7J75n8J30j58L0q3P8l5n4J34r4J1j21oK42j98q3K21k86J48P4n5
7832f1J45j55p0J84N5l7k33J83%K82l06l3K0l5O6N4j09K10k32j44J29pJ3k21K47
7857e5J61j61k22M05p6j48R0k8J03n6kK3j31l7K03r4J06j40J5M9O2j8N3k90jK19
7883C0k8Pj32O9l7R4N3m7M4j07K9j35K8K21j65O1J03K0k94J95M0Mj60q3K29l5
7909DJ1K4j92K69k50J76k5Q0q5k50K54k8j1p0J93j1p8K00l80R0J90j99J34k8j02
7934h4n8lJ56RJ8K8l11J90J07Q9k22Q8k53L27o3r0J51K2k2k1k5j07J84j99OK1
7960f2L9m0n0J16l4j6l1l2N6J12j43J63j64j2L07j92r4J73o3n8o5L24j27k1o6
7985B0J23j23Mj0Q1j17L8J4J57j34j94K29N2q1J85k33j9P2p4N5K4r5J04Mj80q3
$$ plain form
8011 -181 38 89 -87 -74 25 42 -63 -128 191 -79 162 -163 68 -210 79 222 -42 -114 104 -20 55 63 -32
8034 -32 45 -42 181 -3 46 28 16 184 111 60 -53 4 -184 57 105 -24 26 76 11 -87 -66 20 81 -20 -169 69
8060 69 17 -151 82 7 108 247 -6 -145 40 8 133 -19 107 -72 21 -93 -41 -91 12 -125 -177 79 -27
8083 -27 56 -16 -35 -6 -216 -24 21 -144 5 -37 87 5 -47 -65 -111 47 26 16 -150 131 34 -233 -101 -46 -141
8108 -141 25 -250 -17 37 -8 76 -16 -155 78 89 -15 40 196 97 -31 17 33 70 -103 -109 63 -19 -123 116
8132 116 -158 95 -206 -73 -142 98 -5 4 -9 15 117 44 -39 5 58 10 56 -45 83 -79 -40 -118 111 -23
8156 -23 109 -151 -56 81 -121 119 118 32 201 -41 -81 17 -71 -111 15 -122 213 61 165 140 119 -8 43 61
8180 61 46 76 -225 -72 54 18 -128 121 -51 -26 -17
$$ packed form
8011a81K19N1j76J3R9J7j05o5L19k70K41l25K31k78K89J43k64p2K18j24P5Qr5
8034c2P7q7K23j84M9j8j2J68p3n1j13N7j88K41M8j29N0N0o5r8K1Q6O1j01j49K38
8060F9n2j68K33p5J01J39k53j39J85l2J25j52J26j79R3j14N2n0J03j37n2K56j06
8083b7Q3p2j9K9k10J92M5j65J49m2J24q2n2j8m6J58k1j0j66K81r7k67J32N5r5
8108a41J66k75K33N4m5Q4r2j39K33J1j04N5J56r9j28M8J6L7j73oJ72q2j04K39
8132A16k74K53l01J33o9K40j03Rj3K4J02p3q3M4N3m8M6j01J28j62L9p8K29j34
8156b3J32k60R5J37k02K40jq6J69k42m0R8q8m0J26j37L35j52J04k5k1j27N1J8
8180F1j5L0l01J53J26l6j46K49j72K5R
8191a7
$$ Imaginary data points
##PAGE= N=2
##DATA TABLE= (X++(I..I)), XYDATA
$$ plain form
0 0 0 0 0 8 0 0 -8 8 -8 16 -16 16 -32 32 -40 48 -56 64 -80 94 -107 128 -147 166 -197 222 -250 289 -327
29 -327 366 -415 464 -518 582 -648 719 -804 892 -984 1096 -1213 1340 -1487 1645 -1821 2026
46 2026 -2251 2509 -2809 3157 -3567 4071 -4690 5477 -6526 7985 -10164 13792 -20917 40368
60 40368 -205561 -696787 -399088 118939 426068 183152 -299300 -585257 -367795 102334
70 102334 368556 135110 -338480 -583339 -331690 167532 452213 236871 -265933 -571128
80 -571128 -357608 164408 482097 286239 -194425 -463025 -245918 227968 487308 278771
90 278771 -171239 -399281 -162134 310001 556147 336429 -128867 -388790 -193048 267213
100 267213 547184 372745 -82289 -363157 -192884 239080 473978 262205 -181962 -406755
$$ packed form
0@%%%Qq%qJ6j6K4l2L2m8O4p2Q8j04J20j44J74k01K35k75L13l63M19m72N39o16
29c27O93p81Q79r82J100j230J367j523J696j876K080k309K553k827L132l466L847
46B026m277M760n318N966o724P638q761J0167j2003J4511j8149K3956l4709O1285
60D0368k45929m91226K97699N18027L07129k42916m82452k85957K17462M70129
70A02334K66222k33446m73590k44859K51649M99222K84681k15342n02804l05195
80e71128K13520N22016L17689j95858m80664k68600K17107M73886K59340k08537
90B78771m50010k28042K37147M72135K46146k19718m65296k59923J95742M60261
100B67213K79971j74439m55034k80868J70273M31964K34898k11773m44167k24793
$$ plain form
110 -406755 -184932 259374 474111 235300 -228040 -467407 -264107 165830 398940 217947
120 217947 -191460 -426865 -259545 136709 353195 159728 -253202 -464681 -249737 186891
130 186891 410237 194083 -245632 -465695 -246369 189246 411211 217660 -179058 -375525
140 -375525 -179014 212350 410310 221496 -161032 -349121 -145625 258366 465800 263942
150 263942 -154912 -375348 -174051 249613 470851 273436 -136020 -344160 -152835 230927
160 230927 413222 209158 -175158 -354916 -152659 228808 409539 205978 -191154 -403044
170 -403044 -227436 160665 377043 204703 -184553 -399685 -226675 151465 342462 150438
180 150438 -227894 -408936 -209727 170617 353885 160169 -215035 -402121 -222260 142334
$$ packed form
110d06755K21823M44306K14737k38811m63340k39367K03300M29937K33110j80993
120B17947m09407k35405J67320L96254K16486j93467m12930k11479K14944M36628
130A86891K23346k16154m39715k20063K19326M35615K21965j93551l96718j96467
140c75525J96511L91364J97960j88814l82528j88089K03496M03991K07434k01858
150B63942m18854k20436K01297M23664K21238j97415m09456k08140J91325L83762
160B30927J82295k04064l84316j79758K02257L81467J80731k03561l97132k11890
170d03044J75608L88101K16378j72340l89256k15132J73010L78140J90997j92024
180A50438l78332j81042J99209L80344J83268j93716l75204j87086J79861L64594
$$ plain form
190 142334 338238 182023 -167249 -362759 -208202 144913 340020 176882 -177926 -360021
200 -360021 -180612 181846 363341 182566 -178726 -360423 -184413 168091 345924 180956
210 180956 -152550 -323819 -172241 144593 309770 156895 -165409 -335064 -176855 154284
220 154284 324866 158833 -182209 -359685 -198790 136454 309024 148640 -176086 -336108
230 -336108 -175890 133918 278938 117415 -184587 -326099 -166124 140006 291293 137116
240 137116 -173447 -332934 -180894 133173 296760 148229 -159803 -313948 -158899 146552
250 146552 290570 128179 -172196 -304178 -135735 162675 294494 132044 -163200 -302172
260 -302172 -150764 141902 288104 144878 -145079 -292193 -149173 139169 280533 129309
$$ packed form
190A42334J95904j56215l49272j95510J54557L53115J95107j63138l54808j82095
200c60021J79409L62458J81495j80775l61292j81697J76010L52504J77833j64968
210A80956l33506j71269J51578L16834J65177j52875l22304j69655J58209L31139
220A54284J70582j66033l41042j77476J60895L35244J72570j60384l24726j60022
230c36108J60218L09808J45020j61523l02002j41512J59975L06130J51287j54177
240A37116l10563j59487J52040L14067J63587j48531l08032j54145J55049L05451
250A46552J44018j62391l00375j31982J68443K98410J31819j62450k95244j38972
260c02172J51408K92666J46202j43226k89957j47114J43020K88342J41364j51224
$$ plain form
270 129309 -162946 -298977 -138492 157082 289962 126479 -167336 -299050 -142629 142833
280 142833 276124 131412 -142482 -274753 -135712 135430 268440 129881 -142315 -273511
290 -273511 -127775 153268 288846 141766 -141235 -275682 -126595 155449 288034 143768
300 143768 -125780 -249330 -107968 151866 271346 134194 -121175 -240274 -103552 154889
310 154889 279000 143520 -120244 -251035 -118095 146297 277250 143529 -118537 -244112
320 -244112 -109780 143958 258041 119399 -129187 -238445 -101498 142786 252048 118054
330 118054 -127035 -242913 -115782 128079 247723 124433 -117931 -236835 -112369 129357
340 129357 243185 113269 -127412 -233581 -97413 143586 246538 111100 -124711 -226757
$$ packed form
270A29309k92255j36031J60485K95574J32880j63483k93815j31714J56421K85462
280A42833J33291j44712k73894j32271J39041K71142J33010j38559k72196j31196
290b73511J45736K81043J35578j47080k83001j34447J49087K82044J32585j44266
300A43768k69548j23550J41362K59834J19480j37152k55369j19099J36722K58441
310A54889J24111j35480k63764j30791J32940K64392J30953j33721k62066j25575
320b44112J34332K53738J14083j38642k48586j09258J36947K44284J09262j33994
330A18054k45089j15878J27131K43861J19644j23290k42364j18904J24466K41726
340A29357J13828j29916k40681j06169J36168K40999J02952j35438k35811j02046
$$ plain form
350 -226757 -96021 136397 241457 118740 -107839 -212381 -92103 133082 238375 117479
360 117479 -109929 -214255 -88158 143016 246066 116085 -116437 -217948 -88664 137985
370 137985 235385 108332 -112983 -209153 -87571 127000 219446 97973 -117450 -213829 -95508
381 -95508 120247 217832 97319 -123827 -225458 -105988 113368 210735 87846 -129800
391 -129800 -222856 -100492 111100 198415 75985 -132960 -219942 -100280 106608 196260 80921
402 80921 -124391 -217055 -104280 101948 196617 84636 -121182 -212084 -95103 111903 200656
413 200656 82005 -122815 -207453 -88062 115531 200529 85311 -112884 -196310 -84749
423 -84749 108781 192498 84299 -107663 -191810 -82986 110851 195398 83423 -114903 -200789
$$ packed form
350b26757J30736K32418J05060j22717k26579j04542J20278K25185J05293j20896
360A17479k27408j04326J26097K31174J03050j29981k32522j01511J29284K26649
370A37985R7400j27053k21315r6170J21582K14571R2446j21473k15423r6379J18321
381i5508K15755R7585j20513k21146j01631J19470K19356R7367j22889k17646
391a29800r3056J22364K11592Q7315j22430k08945q6982J19662K06888Q9652j15339
402H0921k05312r2664J12775K06228R4669j11981k05818r0902J16981K07006Q8753
413B00656j18651k04820q4638J19391K03593Q4998j15218j98195q3426J11561
423h4749J93530Q3717j08199j91962q4147J08824J93837Q4547j11975j98326q5886
$$ plain form
434 -200789 -88003 109534 193068 79774 -115101 -196807 -86784 100423 176342 66256
444 66256 -117997 -192697 -84343 98145 173520 65236 -121422 -201960 -95283 93519 175944
455 175944 70900 -116006 -196681 -91348 91990 168090 61740 -117575 -186813 -76263
465 -76263 103441 173044 64230 -113783 -185109 -79214 100242 178470 80051 -95656 -172919
476 -172919 -74911 99820 175257 76174 -96150 -165940 -60446 114985 183557 76014 -99776
487 -99776 -168799 -64209 109812 181451 83069 -85344 -157774 -64712 98248 167800 73619
498 73619 -89208 -156571 -59251 106331 172809 71134 -100034 -169707 -69329 100650 170740
509 170740 73558 -91199 -159333 -67054 89725 153069 60876 -92334 -152709 -57965 97951
$$ packed form
434b00789J12786J97537Q3534j13294j94875q1706J10023J87207P5919j10086
444F6256j84253p4700J08354J82488P5375j08284j86658q0538J06677J88802Q2425
455A75944j05044j86906q0675J05333J83338P6100j06350j79315o9238J10550
465g6263J79704O9603j08814j78013p1326J05895J79456P8228r8419j75707p7263
476a72919R8008J74731P5437r9083j72324o9790J05494J75431O8572j07543j75790
487i9776o9023J04590J74021P1639r8382j68413p2430R3062J62960O9552r4181
498G3619j62827o7363R7320J65582O6478j01675j71168o9673J00378J69979P0090
509A70740r7182j64757o8134R2279J56779O3344r2193j53210o0375R4744J55916
$$ plain form
520 97951 159938 63779 -96857 -162537 -67414 95791 165596 74122 -84597 -151051 -60409
531 -60409 93305 153947 63209 -85220 -139770 -44904 104960 160394 65128 -87095 -146049
542 -146049 -53232 100822 164602 77031 -73860 -138110 -53081 93983 153517 65033 -80349
553 -80349 -134637 -41721 104342 155766 59512 -89992 -145007 -52858 94658 152573 65090
564 65090 -79612 -139443 -57781 81704 137334 53106 -86513 -140163 -52117 89791 141488
575 141488 48829 -97215 -151728 -61005 84289 139744 53310 -86831 -141942 -60260 74936
586 74936 126995 45399 -87242 -136441 -51827 83143 133717 47621 -90997 -144378 -58169
597 -58169 82594 138461 56016 -80865 -135022 -54042 77297 127407 47214 -80876 -127126
$$ packed form
520I7951O1987r6159j60636o5680R5123J63205O9805r1474j58719o6454R0642
531f0409J53714O0642r0738j48429n4550R4866J49864N5434r5266j52223n8954
542a46049R2817J54054O3780q7571j50891o4250Q5029J47064N9534q8484j45382
553h0349n4288R2916J46063N1424r6254j49504n5015R2149J47516N7915q7483
564F5090j44702n9831Q1662J39485N5630q4228j39619n3650Q8046J41908N1697
575A41488r2659j46044n4513R0723J45294N5455q6434j40141n5111Q1682J35196
586G4936N2059q1596j32641m9199Q4614J34970N0574q6096j38618n3381Q6209
597e8169J40763N5867q2445j36881n4157Q0980J31339N0110q0193j28090m6250
$$ plain form
608 -127126 -44716 84033 130237 46870 -84729 -134470 -53875 78314 131396 53653 -76884
619 -76884 -130614 -54808 71246 119755 41479 -82824 -127803 -47726 76390 119369 37566
630 37566 -88427 -134218 -55365 69333 116901 41705 -80433 -128777 -56211 63183 109553
641 109553 35773 -83302 -126246 -48660 71857 113514 34497 -86625 -128532 -49724 71347
652 71347 115484 40796 -76641 -119778 -46657 67733 109483 37727 -74273 -113515 -39048
663 -39048 75755 115380 38912 -78076 -118500 -41343 76263 118372 44220 -70692 -111801
674 -111801 -39376 72061 110350 37384 -72099 -107564 -33446 76444 112385 38062 -74258
685 -74258 -113350 -39821 73451 114074 42464 -69615 -109508 -39045 70366 108162 36934
$$ packed form
608a27126Q2410J28749M6204q3367j31599m9741Q0595J32189N3082p7743j30537
619g6884n3730P5806J26054M8509p8276j24303m4979Q0077J24116M2979q1803
630C7566j25993m5791P8853J24698M7568p5196j22138m8344P2566J19394M6370
641A09553p3780j19075m2944P7586J20517M1657p9017j21122m1907P8808J21071
652G1347M4137p4688j17437m3137P3121J14390M1750p1756j12000l9242P4467
663c9048J14803L9625p6468j16988m0424P7157J17606M2109p4152j14912m1109
674a11801P2425J11437L8289p2966j09483l5465P4118J09890L5941p4323j12320
685g4258l9092P3529J13272M0623p1610j12079l9893P0463J09411L7796p1228
$$ plain form
696 36934 -70966 -105969 -32845 74449 109174 35675 -72455 -107954 -36044 72410 110736
707 110736 41520 -65416 -104582 -36731 68679 106095 38411 -65378 -100072 -30161 74030
718 74030 107702 36507 -68599 -102753 -32080 72659 108622 41102 -61525 -97454 -32484
729 -32484 67436 102184 37671 -60902 -93832 -27227 72133 104079 36260 -64497 -97084 -29305
741 -29305 71183 105271 39451 -60204 -93351 -29260 67120 98655 35100 -58872 -88997 -24972
753 -24972 68792 97953 32710 -62452 -92637 -26990 68480 99588 35367 -60451 -92384 -29879
765 -29879 63440 93176 30266 -61165 -88661 -25600 64307 89761 25542 -65730 -93011 -28779
777 -28779 63169 91763 28101 -63681 -93304 -31839 57839 86140 25337 -62962 -89635 -27242
$$ packed form
696C6934j07900l5003P3124J07294L4725p3499j08130l5499P1910J08454L8326
707A10736o9216j06936l9166O7851J05410L7416o7684j03789l4694O9911J04191
718G4030L3672p1195j05106l4154P0673J04739L5963o7520j02627l5929O4970
729c2484R9920L4748o4513r8573l2930O6605R9360L1946o7819j00757l2587O7779
741b9305J00488L4088o5820r9655l3147O4091R6380L1535o3555r3972l0125O4025
753b4972R3764K9161o5243r5162l0185O5647R5470L1108o4221r5818l1933O2505
765b9879R3319K9736o2910r1431k7496O3061Q9907K5454o4219r1272k7281O4232
777b8779R1948K8594o3662r1782k9623O1465Q9678K8301o0803q8299k6673O2393
$$ plain form
789 -27242 60643 85607 21844 -66580 -91382 -27498 61972 88300 25852 -63066 -89993 -29202
801 -29202 58538 85589 25856 -59584 -84879 -24966 60311 85012 23555 -62557 -86968 -24490
813 -24490 62570 87621 26078 -61002 -87184 -27786 57231 83280 24836 -58639 -83945 -25801
825 -25801 56186 79303 19997 -62931 -86838 -27636 56142 80698 21179 -63007 -88799 -31472
837 -31472 51391 76339 19927 -61033 -85045 -28841 50693 73581 16676 -62765 -85153 -27530
849 -27530 52586 75991 19473 -60393 -84234 -28482 51383 75889 21572 -56115 -78737 -24077
861 -24077 52903 74840 20536 -55177 -76077 -20451 56654 77934 22910 -53485 -75157 -20697
873 -20697 55200 77540 24674 -49940 -71910 -18906 54594 75453 21849 -51691 -71336 -17730
$$ packed form
789b7242Q7885K4964o3763q8424k4802O3884Q9470K6328o2448q8918k6927O0791
801b9202Q7740K7051n9733q5440k5295N9913Q5277K4701o1457q6112k4411O2478
813b4490Q7060K5051o1543q7080k6182N9398Q5017K6049n8444q3475k5306N8144
825b5801Q1987K3117n9306q2928k3907N9202Q3778K4556n9519q4186k5792N7327
837c1472Q2863K4948n6412q0960k4012N6204P9534K2888n6905p9441k2388N7623
849b7530Q0116K3405n6518p9866k3841N5752P9865K4506n4317p7687k2622N4660
861b4077P6980K1937n4304p5713k0900N5626P7105K1280n5024p6395k1672N4460
873b0697P5897K2340n2866p4614k1970N3004P3500K0859n3604p3540j9645N3606
$$ plain form
885 -17730 55642 75233 20779 -53221 -73430 -19818 53342 73101 20000 -52410 -72111 -20532
897 -20532 50861 69749 17490 -53510 -72092 -19350 51833 69690 16979 -54153 -72326 -19584
909 -19584 51558 70699 18990 -51505 -70137 -18480 51697 70302 19338 -49110 -66372 -14980
921 -14980 54034 71694 20448 -48118 -65139 -13388 55672 74093 23307 -45117 -63486 -13337
933 -13337 54818 73020 23174 -44188 -61441 -11730 54734 71168 21272 -45367 -62175 -12568
945 -12568 53749 70510 20677 -46101 -63898 -15460 49794 67045 18929 -46125 -63324 -16061
957 -16061 48004 63636 15483 -48772 -64493 -16423 47543 63303 15192 -48810 -65230 -18019
969 -18019 45556 62180 15510 -46605 -62568 -16135 45560 60590 14392 -46460 -60834 -13754
$$ packed form
885a7730P3372J9591n4454p4000k0209N3612P3160J9759n3101p2410j9701N1579
897b0532P1393J8888n2259p1000j8582N2742P1183J7857n2711p1132j8173N2742
909a9584P1142J9141n1709p0495j8632N1657P0177J8605n0964o8448j7262N1392
921a4980O9014J7660n1246o8566j7021N1751O9060J8421n0786o8424j8369N0149
933a3337O8155J8202m9846o7362j7253M9711O6464J6434m9896o6639j6808M9607
945a2568O6317J6761m9833o6778j7797M8438O5254J7251m8116o5054j7199M7263
957a6061O4065J5632m8153o4255j5721M8070O3966J5760m8111o4002j6420M7211
969a8019O3575J6624m6670o2115j5963M6433O1695J5030m6198o0852j4374M7080
$$ plain form
981 -13754 48003 62517 15763 -45609 -60343 -14225 46857 62263 17152 -42775 -57567 -12366
993 -12366 46739 60051 14706 -43898 -56982 -11399 47363 60700 14771 -45033 -59405 -14206
1005 -14206 44680 58570 13953 -44278 -58114 -14222 42407 54532 9954 -46772 -58893 -14086
1017 -14086 42577 54655 9476 -48009 -61156 -16960 40065 53291 10001 -46054 -58934 -16119
1029 -16119 39122 50878 7532 -47134 -58250 -14270 41389 53284 9186 -46559 -58433 -15114
1041 -15114 40305 52823 11077 -42604 -54754 -13013 40175 51345 9489 -43488 -54004 -11048
1053 -11048 42585 53600 10899 -43192 -54889 -12757 40716 52714 11929 -40668 -51801 -11376
1065 -11376 39883 50007 8893 -42130 -51866 -10322 41540 51519 9924 -42367 -53587 -12974
$$ packed form
981a3754O1757J4514m6754o1372j4734M6118O1082J5406m5111n9927j4792M5201
993a2366N9105J3312m5345n8604j3084M5583N8762J3337m5929n9804j4372M5199
1005a4206N8886J3890m4617n8231j3836M3892N6629J2125m4578n6726j2121M4807
1017a4086N6663J2078m5179n7485j3147M4196N7025J3226m3290n6055j2880M2815
1029a6119N5241J1756m3346n4666j1116M3980N5659J1895m4098n5745j1874M3319
1041a5114N5419J2518m1746n3681j2150M1741N3188J1170m1856n2977j0516M2956
1053a1048N3633J1015m2701n4091j1697M2132N3473J1998m0785n2597j1133M0425
1065a1376N1259J0124m1114n1023r736M1544N1862R979m1595n2291j1220M0613
$$ plain form
1077 -12974 38893 50206 10541 -39868 -50604 -11194 38120 47400 7542 -41709 -50380 -9872
1089 -9872 40093 49389 8969 -41132 -51436 -11681 37787 48481 10148 -37910 -47719 -9627
1101 -9627 37771 46906 7865 -39608 -47538 -7563 40810 49378 9473 -38887 -48009 -9311 38779
1114 38779 48455 10787 -35562 -44398 -6824 38563 46572 8859 -36951 -44194 -5239 41264 49419
1127 49419 10502 -36536 -45094 -6982 39074 47945 11332 -33434 -41921 -5452 38459 45519 8222
1140 8222 -35737 -42113 -4333 40149 47092 9428 -36033 -44168 -7438 37306 45521 9462 -34092
1153 -34092 -41928 -6607 36007 42496 6146 -36518 -42625 -5742 37405 43883 6851 -36718 -43824
1166 -43824 -7879 35063 42652 7758 -34183 -41366 -6423 34636 40839 5564 -35338 -40695 -4477
$$ packed form
1077a2974N1867J1313l9665n0409j0736L9410M9314R280l9858m9251q671M0508
1089i872M9965R296m0420n0101j0304L9755M9468J0694l8333m8058r809L8092
1101i627M7398R135l9041m7473p930L9975M8373Q568l9905m8360r122L8698M8090
1114C8779R676l7668m6349q836L7574M5387Q009l7713m5810p243L8955M6503Q155
1127D9419l8917m7038q558L8112M6056Q871l6613m4766q487L6469M3911P060l7297
1140H222m3959o376L7780M4482O943l7664m5461q135L6730M4744Q215l6059m3554
1153c4092p836L5321M2614O489l6350m2664o107L6883M3147O478l7032m3569p106
1166d3824L5945M2942P589l4894m1941p183L4943M1059O203l5275m0902n357L6218
$$ plain form
1179 -4477 37091 42860 7236 -34962 -41484 -6020 35662 42619 8448 -31934 -38206 -4420 35239
1192 35239 40870 6452 -32968 -38086 -3433 36706 42065 7033 -33815 -39918 -5865 34291 40665
1205 40665 6866 -32615 -38499 -5761 32824 37574 3672 -34758 -39106 -5562 33009 37623 3288
1218 3288 -35616 -41096 -7902 30734 36545 3915 -34183 -39710 -7353 30010 34598 1933 -35080
1231 -35080 -39179 -5557 31862 36093 2999 -34560 -38838 -6213 31121 36373 4469 -31720 -36861
1244 -36861 -4850 31480 35900 4031 -31940 -35849 -3392 32703 36818 4680 -31741 -35843 -3979
1257 -3979 31935 36198 4676 -30798 -34811 -3686 31065 34476 3473 -31501 -34920 -3778 30701
1270 30701 34110 2901 -31913 -35734 -4834 29709 33236 2402 -31698 -35373 -4690 28751 31941
$$ packed form
1179d477M1568N769l5624m2198o522L5464M1682O957l4171m0382o272L3786L9659
1192C5239N631l4418l9420n118L4653M0139N359l5032m0848o103L4053M0156O374
1205D0665l3799l9481n884L2738L8585M750l3902l8430m348L3544L8571M614l4335
1218C288l8904n480L3194L8636N811l2630l8098n527L2357L7363M588l2665l7013
1231c5080m099L3622L7419M231l3094l7559m278L2625L7334N252l1904l6189n141
1244c6861L2011L6330M420l1869l5971l909L2457L6095M115l2138l6421m102L1864
1257c979L5914M263l1522l5474m013L1125L4751L411l1003l4974l419L1142L4479
1270C0701L409l1209l4814l821L0900L4543L527l0834l4100l675L0683L3441L190
$$ plain form
1283 31941 1464 -32022 -34637 -4389 29294 32017 1743 -31255 -34271 -4314 28952 32219 2536
1296 2536 -30436 -32978 -3158 29711 32412 2539 -29576 -32357 -2247 30270 32873 3360 -28685
1309 -28685 -31275 -1643 30133 32379 3497 -27996 -30344 -1270 30168 32706 3486 -28071 -30473
1322 -30473 -1557 29919 32399 3438 -27818 -30417 -1357 29318 31509 2401 -27996 -29874 -1334
1335 -1334 28874 30992 2462 -28139 -30207 -1906 28362 30350 2306 -27800 -29935 -2300 27524
1348 27524 29704 1748 -28215 -29764 -1242 27948 29338 1516 -27814 -29472 -1630 27511 29309
1361 29309 1987 -27174 -28772 -1540 27122 28276 1491 -26955 -28114 -591 27602 28943 1307
1374 1307 -26793 -28114 -919 27598 28921 2230 -25766 -27003 -498 26845 27869 1519 -25493
$$ packed form
1283C1941l0477l3486k615L0248L3683K723l0274l2998l016K9957L3266L267k9683
1296B536l2972k542K9820L2869K701k9873l2115k781L0110L2517K603k9513l2045
1309b8685k590K9632L1776K246k8882l1493k348K9074L1438K538k9220l1557k402
1322c0473K8916L1476K480k8961l1256k599K9060L0675K191k9108l0397j878K8540
1335a334L0208K118k8530l0601k068K8301L0268J988k8044l0106k135K7635K9824
1348B7524K180k7956k9963j549K8522K9190J390k7822k9330j658K7842K9141J798
1361B9309k7322k9161j598K7232K8662J154k6785k8446j159K7523K8193J341k7636
1374A307k8100j321K7195K8517J323k6691k7996j237K6505K7343J024k6350k7012
$$ plain form
1387 -25493 -26405 72 27450 28319 1768 -25986 -27051 -280 26820 28050 1992 -25267 -26346
1400 -26346 -724 25836 26350 716 -25617 -25956 -68 25660 25769 -90 -26492 -27320 -1351
1413 -1351 24962 25649 137 -25911 -26609 -1979 23751 24068 -814 -26286 -26172 -677 24611 24384
1427 24384 -1258 -26614 -26648 -1310 24352 24664 -104 -25020 -25157 -893 23842 24115 -121 -24532
1441 -24532 -24279 789 25470 25038 -151 -24761 -24337 395 25128 25438 1110 -23249 -23103 462
1455 462 24329 23987 78 -23239 -22809 1270 24689 24110 -217 -24551 -24390 -53 23837 23784
1469 23784 2 -23562 -23910 -658 22432 21752 -1686 -24293 -23210 356 22807 22003 -1867
1482 -1867 -24919 -24368 -774 22513 22603 -584 -23392 -22936 -309 21674 21216 -1669 -23335 -21817
$$ packed form
1387b5493r12K6477K7378Q69k6551k7754j065K6771K7100J230k6058k7259j079
1400b6346K5622K6560N14k5634k6333l39K5888K5728J09k5859k6402q28K5969
1413a351K6313O87k5512k6048o98K4630K5730L17k4882k5472J14K5495K5288k27
1427B4384k5642k5356l4K5338K5662L12k4768k4916j37K4264K4735K73k4236k4411
1441b4532K53K5068K4681m32k5189k4610M24K4732K4733L10k4328k4359J46K3565
1455D62K3867l42k3909k3317M30K4079K3419n79k4327k4334J61K4337K3890n3
1469B3784k3782k3564l48K3252K3090o80k3438k2607J083K3566K2451q04k3870
1482a867k3052N51K3594K3287R0k3187k2808M56K2627K1983m58k2885k1666J518
$$ plain form
1496 -21817 1567 23434 22207 -1024 -23047 -21900 1045 23050 22998 530 -21068 -20393 1656
1509 1656 22483 21404 -446 -21036 -19493 2939 24097 22232 -667 -21998 -20659 1985 23142
1522 23142 21835 207 -20479 -19727 1500 21557 19852 -1646 -21450 -19335 2516 22558 20374
1535 20374 -2100 -22625 -20981 1037 21469 20228 -1329 -21421 -19841 1247 20416 18271 -2699
1548 -2699 -21596 -19083 2490 21754 19482 -2496 -22140 -20157 1259 21201 19956 -933 -20090
1561 -20090 -18501 1885 20411 18298 -2315 -20485 -17710 3711 22514 19546 -1798 -20904 -19023
1574 -19023 2298 21373 19782 -530 -19074 -17335 2543 20194 17869 -2470 -19904 -17143 3778
1587 3778 21711 18364 -2352 -20969 -18650 1843 20324 18484 -1534 -19451 -17568 1680 18732
$$ packed form
1496b1817K3384K1867j227k3231k2023J147K2945K2005n2k2468k1598O75K2049
1509A656K0827j079k1850k0590J543K2432K1158j865k2899k1331J339K2644K1157
1522B3142j307k1628k0686P52K1227K0057j705k1498j9804K115K1851K0042k184
1535B0374k2474k0525J644K2018K0432j241k1557k0092J580K1088J9169k145k0970
1548b699j8897K513K1573J9264k272k1978j9644J983K1416J9942j245k0889j9157
1561b0090J589K0386J8526k113k0613j8170K775K1421J8803k968k1344j9106J881
1574a9023K1321J9075j591k0312j8544J739J9878J7651k325k0339j7434K761K0921
1587C778J7933l347k0716j8617K319K0493J8481j840k0018j7917J883J9248J7052
$$ plain form
1600 18732 16036 -3523 -20500 -17293 2789 19859 16873 -3739 -21463 -18900 975 18993 16958
1613 16958 -2470 -19829 -17554 1215 17717 14919 -4166 -19877 -16676 3185 19497 16254 -3784
1626 -3784 -20611 -17854 1719 19026 16772 -1841 -18474 -16077 2446 18213 15154 -3293 -18540
1639 -18540 -14913 4106 20114 16545 -2997 -19494 -16534 2864 19232 16807 -1752 -17647 -15325
1652 -15325 2767 17739 14754 -3673 -18502 -14837 3721 18945 15117 -3970 -19922 -16792 2346
1665 2346 17949 14713 -3167 -18678 -15519 2077 16455 13165 -4568 -18940 -15157 3536 17961
1678 17961 13956 -4528 -19624 -16216 2434 17621 14646 -3006 -17549 -14621 2924 17084 13707
1691 13707 -3634 -17317 -13246 4777 18923 14979 -3304 -17844 -14035 4027 18694 15304 -1979
$$ packed form
1600A8732k696j9559j6977L207K0082J7070k986k0612j7724K563J9875J8018k035
1613A6958j9428j7359K275J8769J6502k798j9085j5711L201J9861J6312l243k0038
1626c784j6827K757J9573J7307k254j8613j6633K397J8523J5767l059j8447j5247
1639a8540L627J9019J6008l569j9542j6497K960J9398J6368k425j8559j5895K322
1652a5325J8092J4972k985j8427j4829L665J8558J5224l828j9087j5952L130J9138
1665B346J5603l236j7880j5511L159J7596J4378l290j7733j4372L783J8693J4425
1678A7961m005j8484j5096L408J8650J5187k975j7652j4543K928J7545J4160l377
1691A3707j7341j3683M071J8023J4146l944j8283j4540L809J8062J4667l390j7283
$$ plain form
1704 -1979 -16071 -12951 4038 17545 13998 -3162 -16709 -12411 5213 18438 14346 -3466 -17616
1717 -17616 -13893 3696 17457 14239 -3132 -16605 -13337 3285 16329 12417 -4153 -16939 -13127
1730 -13127 3929 16970 13024 -4276 -17841 -14045 3413 16707 13330 -3171 -16553 -12955 3529
1743 3529 16533 12479 -4056 -16363 -11932 4904 17423 13237 -3639 -16534 -12558 4197 17560
1756 17560 13759 -2764 -15225 -11463 4605 16823 12802 -3501 -15482 -11294 5432 17427 12846
1769 12846 -3678 -16100 -12109 4519 16798 12818 -3006 -15445 -11794 3998 15594 11505 -4632
1782 -4632 -15967 -11622 4333 16224 11482 -4590 -16673 -12426 3723 15648 11627 -4155 -15819
1795 -15819 -11839 3700 15112 10820 -4963 -15812 -11194 4627 15781 11272 -4577 -16128 -11876
$$ packed form
1704a979j4092L120J6989J3507l547j7160j3547M298J7624J3225m092j7812j4150
1717a7616L723J7589J3761l218j7371j3473L268J6622J3044l912j6570j2786L812
1730a3127J7056J3041l946j7300j3565L796J7458J3294l377j6501j3382L598J6484
1743C529J3004m054j6535j2307M431J6836J2519m186j6876j2895L976J6755J3363
1756A7560l801j6523j2461L762J6068J2218m021j6303j1981M188J6726J1995m581
1769A2846j6524j2422L991J6628J2279l980j5824j2439L651J5792J1596m089j6137
1782d632j1335M345J5955J1891m742j6072j2083M247J6149J1925m021j5782j1664
1795a5819L980J5539J1412m292j5783j0849M618J5821J1154m509j5849j1551M252
$$ plain form
1808 -11876 3885 15510 11265 -3859 -15153 -11068 4168 15022 10685 -4663 -15345 -10608 4828
1821 4828 15770 11158 -4509 -15224 -11280 4017 15339 11190 -4017 -14833 -10810 4088 14784
1834 14784 10204 -4617 -15202 -10582 4633 15142 10391 -4799 -15656 -11166 3921 14625 10335
1847 10335 -4389 -15010 -10893 3703 14003 9568 -5075 -15201 -10720 4254 14543 10130 -5094
1860 -5094 -15306 -11059 3569 14137 9685 -4638 -14566 -10463 3985 13863 9054 -5202 -14735
1873 -14735 -9982 4363 14295 9813 -4696 -14776 -10576 3887 14167 9814 -4209 -13876 -9682
1886 -9682 4349 13645 9278 -4849 -14114 -9371 4813 14270 9744 -4425 -14096 -9896 4277 13931
1900 13931 9614 -4077 -13650 -9200 4373 13577 8943 -4581 -13718 -8970 4743 14078 9439 -4544
$$ packed form
1808a1876J5761J1625m245j5124j1294M085J5236J0854m337j5348j0682M737J5436
1821D828J0942m612j5667j0715L944J5297J1322m149j5207j0816M023J4898J0696
1834A4784m580j4821j0585M620J5215J0509m751j5190j0857M490J5087J0704m290
1847A0335j4724j0621M117J4596J0300m435j4643j0126M481J4974J0289m413j5224
1860e094j0212M247J4628J0568m452j4323r928M103J4448R878m809j4256r533
1873a4735M753J4345R932m482j4509j0080M200J4463J0280m353j4023r667M194
1886i682J4031R296m367j4127r265M743J4184R457m526j4169r671M200J4173R654
1900A3931m317j3691r573M450J3573R204m634j3524r137M748J3713R335m639j3983
$$ plain form
1914 -4544 -13802 -9361 4260 13583 9001 -4165 -12917 -8802 4299 13355 8694 -4824 -13498 -8827
1928 -8827 4904 13510 9136 -4622 -13573 -9237 4080 13289 8620 -4247 -12929 -8513 4290 12877
1942 12877 8319 -4802 -13155 -8437 4589 13487 8803 -4108 -13048 -8506 4313 13139 8933 -3765
1956 -3765 -12369 -7985 4973 13146 8862 -4162 -12397 -7922 5165 13481 8692 -3888 -12224 -7910
1970 -7910 4694 12825 8484 -3923 -11907 -7521 4997 12831 8156 -4403 -12445 -7944 4678 12748
1984 12748 8399 -4473 -12339 -8156 3933 12086 7626 -4531 -12201 -7594 4493 11965 7250 -4935
1998 -4935 -12399 -8039 4304 12207 7930 -4568 -12141 -7924 4104 11705 7361 -4424 -11788 -6839
2012 -6839 4928 12112 7399 -4645 -11961 -7241 5109 12429 8064 -3763 -11250 -6992 4533 11844
$$ packed form
1914d544r258M441J3621R323m582j3166q752M115J3101R056m661j3518q674M671
1928h827J3731Q606m374j3758q951M336J3317R209m669j2867q682M416J2803Q587
1942A2877m558j3121q353M718J3026Q898m684j2911q940M542J2819Q826m206j2698
1956c765q604M384J2958Q173m284j3024q235M475J3087Q316m789j2580q336M314
1970g910J2604Q131m341j2407p984M386J2518P834m675j2559q042M501J2622Q070
1984A2748m349j2872p866M183J2089Q153m460j2157p670M607J2087P472m715j2185
1998d935p464M360J2343P903m277j2498p573M217J2028P601m344j1785p364M949
2012f839J1767P184m713j2044p316M720J2350P320m365j1827p487M258J1525P311
$$ plain form
2026 11844 7491 -4010 -11077 -6295 5119 12122 7211 -4395 -11545 -7071 4849 11876 7221 -4349
2040 -4349 -11438 -7108 4198 10800 6412 -4498 -11332 -6876 4673 10887 6173 -5271 -12124 -7506
2054 -7506 4054 10938 6499 -4822 -11646 -7253 3629 10115 5874 -4792 -10945 -6317 4471 10710
2068 10710 6096 -5177 -11776 -6611 4480 11308 6930 -4044 -10749 -6513 4267 10677 6210 -4274
2082 -4274 -10257 -5541 5153 10981 6011 -4847 -10815 -6100 4839 11080 6688 -4045 -10576 -6202
2096 -6202 4231 10264 6023 -4662 -10506 -5668 4797 10401 5404 -5220 -11254 -6211 4194 10170
2110 10170 5904 -4682 -10837 -6391 3609 9409 5270 -4653 -10383 -5873 4269 10140 5148 -5296
2124 -5296 -11075 -6281 4440 10479 5692 -4486 -10126 -5789 4295 9780 5184 -4429 -9570 -5087
$$ packed form
2026A1844m353j1501p067M782J1414P003m911j1606p150M474J1920P027m655j1570
2040d349p089M330J1306O602m388j0910o834M456J1549O214m714j1444o853M618
2054g506J1560O884m439j1321o824M393J0882O486m241j0666o153M628J0788O239
2068A0710m614j1273o599N165J1091O828m378j0974o705M236J0780O410m467j0484
2082d274n983M716J0694N828m970j0858n968M715J0939O241m392j0733o531M374
2096f202J0433O033m241j0685n844M838J0465N604m997j0624o034N043J0405N976
2110A0170m266j0586o155M446J0000N800m139r923n730M510J0142N871m992j0444
2124e296n779M794J0721O039m787j0178n640M337J0084N485m596r613n141M483
$$ plain form
2138 -5087 4955 10282 5512 -4698 -10175 -5466 4814 10491 6135 -4042 -9691 -5231 4379 9741
2152 9741 5229 -4432 -9325 -4584 5049 9795 5123 -4865 -9857 -5395 4781 9899 5497 -4270 -9740
2167 -9740 -5323 4123 9179 4627 -4818 -9386 -4564 4660 9506 4539 -5303 -9986 -5131 4529 9426
2182 9426 5058 -4474 -9322 -5070 4191 9017 4638 -4536 -9139 -4407 4854 9548 4677 -4856 -9429
2197 -9429 -4588 4746 9438 5176 -4290 -8948 -4489 4525 9021 4608 -4203 -8538 -3850 5206 9617
2212 9617 4758 -4534 -9138 -4463 4868 9502 4923 -4130 -8918 -4287 4558 8861 4256 -4469 -8707
2227 -8707 -3862 4788 8966 4142 -4839 -9126 -4432 4698 9058 4502 -4405 -8860 -4462 4280 8349
2242 8349 3862 -4760 -8669 -3926 4674 8686 3809 -4735 -8869 -4155 4571 8900 4235 -4346 -8369
$$ packed form
2138e087J0042N327m770j0210n477M709J0280N677m356j0177n649M460R610N362
2152I741m512r661m893M741R633M746m672r988m992M462J0176N118m402r767n470
2167i740M417R446N056m552r445m568M822R224M846m967r842m683M855R660M897
2182I426m368r532m848M252R261M826m379r174m603M732R261M694m871r533m573
2197i429M841R334M692m262r466m658M459R014M496m413q811m335M688R056M411
2212I617m859r292m604M675R331M634m579r053m788M631Q845M303m605q725m238
2227h707M845Q650M178m824q981m287M694R130M360m556q907m455M398Q742M069
2242H349m487q622l909M743Q600M012m877q544m134M714Q726M329m665q581m023
$$ plain form
2257 -8369 -4060 4280 8346 3903 -4406 -8536 -3613 4762 8882 3924 -4930 -8613 -4015 4695 8702
2272 8702 4265 -4031 -8043 -3750 4444 8071 3688 -4431 -7898 -3339 4640 8353 3625 -4570 -8462
2287 -8462 -3676 4473 8451 3649 -4501 -8050 -3612 4231 7594 3281 -4518 -7928 -3576 4430 7919
2302 7919 3347 -4659 -8251 -4062 4370 7977 3522 -4481 -7974 -3471 4132 7695 3369 -4510 -7678
2317 -7678 -3153 4356 7661 3258 -4678 -8022 -3533 4348 7873 3557 -4355 -7688 -3495 4374 7578
2332 7578 3370 -4255 -7519 -2974 4612 7652 3248 -4615 -7646 -3118 4237 7567 3370 -4024 -7437
2347 -7437 -3161 4166 6952 2964 -4305 -7324 -2968 4513 7800 3084 -4544 -7553 -3112 4180 7491
2362 7491 2830 -4341 -7205 -3005 4063 6799 2507 -4512 -7154 -3025 4220 7120 2521 -4553 -7374
$$ packed form
2257h369M309Q340M066m443q309m130M923Q375M120m958q854l683M598Q710M007
2272H702m437q296m012M293Q194L627m383q119l467M559P979L713m728q195l892
2287h462M786Q149L978m802q150l549M438P843L363m313p799l410M352Q006L489
2302G919m572q006l592M189Q432L607m455q003l493M503P603L563m326p879l168
2317g678M525P509L305m403p936l344M489P881L525m316p912l333M193P869L204
2332G578m208p625l264M545P586L040m404p863l031M528P355L330m197p394l413
2347g437M276P327K786l988p269l019M356P481L287m716p628l009M441P292L311
2362G491m661p171k864M200P068K736m292p019k642M129P245K900m599p074k821
$$ plain form
2377 -7374 -3128 4380 7315 2834 -4223 -7295 -2977 4118 6965 2356 -4431 -7000 -2665 4306 6992
2392 6992 2721 -4369 -7152 -2853 4142 7105 2950 -4334 -6936 -2638 4368 6951 2584 -4154 -6798
2407 -6798 -2254 4592 6924 2434 -4183 -6687 -2528 4201 6765 2572 -4099 -6595 -2367 4164 6573
2422 6573 2376 -4648 -6830 -2430 4273 6644 2080 -4571 -7020 -2414 4273 6356 2147 -4238 -6438
2437 -6438 -2419 3949 6140 2069 -4183 -6475 -2490 4233 6483 2242 -4458 -6644 -2279 4334 6216
2452 6216 2211 -4290 -6096 -1958 4178 6219 2079 -4149 -6163 -1845 4178 6500 2237 -4006 -6096
2467 -6096 -1883 4051 6561 2340 -4192 -6101 -1891 4254 6246 1811 -4528 -6258 -1814 4405 6062
2482 6062 2009 -3962 -5950 -1903 4090 5912 1954 -4070 -6087 -2046 4088 6054 1747 -4383 -5987
$$ packed form
2377g374M246P508K935m481p057l072M318P095K847m609o787k569M335O971K686
2392F992m271p090k783M299O995K963m155p284k602M298P006K583m367o738k644
2407f798M544O846K332m490o617k504M159O729K564m193o671k496M228O531K409
2422F573m197p024k182M400O703K371m564o651k449M606O687K083m209o385k200
2437f438M019O368K191m071o252k292L985O723K250m241o700k186M365O613J882
2452F216m005o501j806M138O136K041m140o228k014M318O023K322m263o243k090
2467f096M213N934K510m221o532j909M210O145J992m435o339j730M444O219J657
2482F062m053n971j988M047N993J822l958o024k017M041O134J966m307o130j604
$$ plain form
2497 -5987 -1777 4298 6160 1650 -4163 -5851 -1711 3929 5781 1616 -4011 -5677 -1726 4083 5790
2512 5790 1691 -4227 -5965 -1894 4249 6081 1952 -3878 -5752 -1476 4410 6111 1743 -3892 -5411
2527 -5411 -1187 4303 5771 1598 -4094 -5474 -1410 4137 5843 1801 -3925 -5594 -1563 4097 5829
2542 5829 1694 -4069 -5651 -1245 4258 5494 1202 -4334 -5461 -1255 4250 5394 1373 -3957 -5554
2557 -5554 -1692 3564 5226 1321 -4015 -5437 -1508 4170 5327 1346 -4276 -5712 -1421 4143 5359
2572 5359 1287 -4075 -5483 -1222 3869 5097 1156 -3575 -5092 -1377 4027 5180 1393 -3755 -5377
2587 -5377 -1139 4177 5595 1345 -3966 -4978 -942 4173 5057 1020 -3911 -4817 -1078 4164 4936 1081
2603 1081 -3817 -4921 -1108 3935 5073 1602 -3894 -5193 -1266 3760 4972 997 -3893 -4860 -1082
$$ packed form
2497e987M210O075J862m510n813j688M140N640J852m165n627j666L951N809J707
2512E790m099n918j738M071O143J832m129n830j874M276N886J701m368n635j519
2527e411M224N490J468m173n692j380M064N547J706m042n726j669M031N660J732
2542E829m135n763j582M406N503J236m292n536j127M206N505J144m021n330j597
2557e554L862N256J662l905n336j422L929N678J157l981n622j436M291N564J216
2572E359m072n362j408M261N091J228l941m731j517L715N404J153l787n148j622
2587e377M238N316J418m250n311j012M036N115Q84m037m931r06L739N242P72l855
2603A081m898j104L813N043J138l471n496j299L927N026J212l975m890r67L778
$$ plain form
2618 -1082 3946 4688 555 -4219 -5054 -1178 3599 4620 759 -4045 -5126 -1314 3411 4414 944
2633 944 -4032 -4929 -883 3902 4739 860 -4242 -5037 -992 4056 4698 858 -3712 -4455 -857 3573
2649 3573 4462 861 -3617 -4637 -854 3920 4733 917 -3907 -4710 -1063 3998 4996 779 -3796 -4828
2665 -4828 -561 3907 4322 635 -3779 -4342 -752 3508 4218 595 -3875 -4847 -1098 3400 4524 891
2681 891 -3672 -4776 -932 3602 4181 533 -3855 -4335 -611 3577 4056 117 -3890 -4635 -738 3613
2697 3613 4250 776 -3713 -4433 -973 3481 4284 645 -3750 -4418 -385 3961 4328 513 -3972 -4050 -277
2714 -277 3655 4352 550 -3536 -3731 -543 3527 4209 878 -3487 -3937 -518 3754 4336 556 -3764
2730 -3764 -4299 -424 3959 4336 462 -3628 -3830 -289 3502 3753 378 -3466 -3802 -324 3597 4012
$$ packed form
2618a082N028P42m133m774q35L876M777J021l861m804j081L812M725J003l470
2633I44m976q97M046M785Q37l879n102p95M045N048O42l840m570p43L598M430
2649C573Q89l601m478j020L783M774Q13l816m824q03L647N061R98m217m575j032
2665d828M267M468M15l687m414n63L590M260P10l623m470r72L749M498J124l633
2681H91m563j104L844M534N79l648m388m80L724M188M79l939m007p45L897M351
2697C613O37l474m489p20L460M454Q03l639m395o68M033M346L67l815m485p8L773
2714b77L932O97l802m086j95L188M070O82l331m365m50L419M272N82l780m320
2730c764n35L875M383L77l874m090k02L541L791K51l375l844l36L478L921M15
$$ plain form
2746 4012 358 -3458 -4116 -597 3793 4166 506 -3633 -4096 -442 3623 3628 73 -3701 -3846 -53 3866
2763 3866 3888 136 -3411 -3730 -204 3567 3863 574 -3466 -3667 -273 3831 4100 405 -3663 -3702 -121
2780 -121 4045 4092 327 -3820 -3724 107 3803 3928 363 -3221 -3485 -70 3567 3686 424 -3425 -3560
2797 -3560 -266 3691 3951 188 -3620 -3782 -106 3732 4038 200 -3449 -3685 -57 3476 3511 189
2813 189 -3537 -3511 41 3356 3499 147 -3461 -3838 -63 3409 3667 222 -3538 -3870 -72 3451 3681
2830 3681 15 -3580 -3570 133 3569 3446 -73 -3477 -3520 -111 3675 3743 204 -3547 -3466 74 3486
2847 3486 3604 -18 -3517 -3371 270 3511 3422 -108 -3462 -3206 79 3539 3410 128 -3212 -3319 41
2864 41 3413 3366 -33 -3495 -3430 154 3584 3409 -385 -3981 -3519 -12 3361 3239 -243 -3661 -3404
$$ packed form
2746D012l654l816o58L519M390L73l660m139m63L654M065Nl555l774j45L793L919
2763C866K2l752l547l19L526L771K96l289m040k01L394M104K69l695m068l9L581
2780a21M166M7l765m147R6L831L696J25l565l584k64L415L637J19l262l849j35
2797c560L294L957K60l763l808j62L676L838L06l838l649k36L628L533L5l322
2813A89l726K6L552L315J43l352l608l77L775L472K58l445l760l32L798L523K30
2830C681l666l595J0L703L436j23l519l404m3L409L786O8l539l751Q1L540L412
2847C486J18l622l499J46L641L241q9l530l354K56L285L460j29l282l340j07L360
2864D1L372m7l399l462O5L584L430j75l794l596M62L507L373j22l482l418K57
$$ plain form
2881 -3404 -51 3204 2901 -415 -3627 -3399 -16 3252 3042 -348 -3605 -3461 54 3404 3221 -383
2897 -383 -3717 -3532 165 3449 3123 -380 -3610 -3115 176 3277 3123 -144 -3499 -3397 388 3458
2913 3458 3189 -204 -3413 -3197 321 3491 3172 -195 -3311 -2976 535 3466 3136 -420 -3393 -2960
2929 -2960 140 3132 3116 -34 -3207 -2965 420 3227 2864 -378 -3486 -3301 253 3330 3248 -514 -3638
2946 -3638 -3122 335 3076 2906 -461 -3387 -2774 134 3007 2789 -627 -3470 -3002 306 3187 3114 -306
2963 -306 -3416 -3050 187 3358 2907 -448 -3137 -2801 556 3596 2977 -375 -3394 -2648 494 3457
2979 3457 3060 -205 -3080 -2607 420 3561 2982 -353 -3149 -2777 863 3383 2993 -518 -3274 -2571
2995 -2571 561 3335 2973 -396 -3229 -2809 315 3264 2673 -476 -3176 -2831 511 3453 2779 -727
$$ packed form
2881c404L353L255l03l316l212K28L383L268k10l390l257J44L515L350j83l604
2897c83l334J85L697L284l26l503l230M95L291L101j54l267l355J02L785L070
2913C458k69l393l209K16L518L170l19l367l116L35L511K931l30l556k973M33
2929b960L100K992j6l150l173K42L385K807l63l242l108J85L554L077q2l762l124
2946c638N16L457K741j70l367k926O13K908K873k18l416k843M68L308K881p3l420
2963c06l110L66L237L171m51l355k689L36L357L040o19l352l019P46L142K963
2979C457l97l265k875M73L027L141n79l335k796L72L640K520l90l511k756P03
2995b571L132K774l62l369k833M20L124K949n91l149k700L45L342K942o74l506
$$ plain form
3011 -727 -3421 -2792 576 3271 2647 -525 -3203 -2744 479 3227 2824 -403 -3025 -2557 412 3057
3027 3057 2666 -591 -3230 -2659 657 3395 2738 -395 -3104 -2438 691 3306 2796 -519 -3049 -2266
3043 -2266 645 3391 2796 -426 -2929 -2648 703 3237 2799 -359 -3213 -2692 738 3032 2617 -390
3059 -390 -3106 -2643 863 3250 2589 -693 -3386 -2440 877 3163 2361 -602 -3170 -2706 377 2959
3075 2959 2583 -845 -3255 -2557 501 3043 2523 -883 -3339 -2684 511 3102 2307 -797 -3144 -2340
3091 -2340 242 2966 2418 -639 -3111 -2387 687 3070 2476 -660 -3179 -2618 685 3302 2761 -570
3107 -570 -3033 -2308 842 3181 2313 -714 -2773 -2257 822 3155 2090 -559 -3210 -2361 775 2939
3123 2939 2448 -568 -3037 -2332 398 3036 2308 -772 -3081 -2219 623 2885 2176 -798 -3170 -2325
$$ packed form
3011g27k694O29L368K695o24l172k678M59L223K748m03l227k622M68K969K645
3027C057l91l257k639N71L316K738o57l133k709O66L129K615n10l315k530P83
3043b266K911K746n95l222k503K81L351K534m38l158k854N21L430K294m15l007
3059c90k716M63L506K387o61l282k693R46L317K286q02k963k568M64L083K582
3075B959l76l428k410O98L058K542n20l406k456O55L195K591p95l104k347Q04
3091b340K582K724n48l057k472P24L074K383n94l136k519N61L303K617n41l331
3107e70k463P25L150K339q68l027k059N16L079K333j065k649k651Q49L136K164
3123B939m91l016k469P05K730K638p28l080k309Q62K842K262p09k974k372Q45
$$ plain form
3139 -2325 656 2933 2279 -692 -3030 -2405 490 2821 2263 -833 -2995 -2314 589 3005 2303 -824
3155 -824 -3180 -2406 799 3059 2135 -923 -2954 -2207 636 2835 2179 -639 -2927 -1968 799 2995
3171 2995 2488 -627 -2950 -2190 812 3103 2402 -785 -2953 -2136 710 2881 2144 -656 -2772 -1952
3187 -1952 763 3059 2046 -967 -3190 -2133 684 2790 2400 -702 -2801 -2235 572 2922 2259 -967
3203 -967 -2757 -2085 744 2770 1759 -1068 -2899 -2353 546 2839 2102 -721 -2830 -2348 624 2670
3219 2670 2196 -709 -2976 -1963 807 2854 2112 -740 -2765 -2101 795 2915 2195 -546 -2558 -1868
3235 -1868 728 2799 2124 -702 -2573 -2029 795 2988 2191 -743 -2741 -1867 801 2680 2206 -578
3251 -578 -2666 -2040 787 2618 1863 -816 -2449 -1806 673 2446 1864 -958 -2845 -1939 575 2751
$$ packed form
3139b325K981K277o54k971k338O25K895K331n58l096k162O81K903K416p02l127
3155h24k356P74L205K260r24l058k031P47K843K199o56k818k288R59K767K196
3171B995n07l115k323P60L002K291p01l187k168Q17K846K171p37k800k116Q20
3187a952K715K296j013l013k223J057K817K106l90l102k099N66K807K350o63l226
3203i67j790O72K829K026j011k827j831N46K899K293p37k823k109M82K972K046
3219B670m74k905k267J013K770K047p42k852k025O64K896K120p20k741k012O90
3235a868K596K071o75k826j871N44K824K193p97k934j998Q74K668J879m74k784
3251e78k088O26K827J831p55k679j633O43K479J773n82k822j887R06K514K176
$$ plain form
3267 2751 1875 -1075 -2898 -2070 721 2584 1934 -913 -2714 -1621 884 2680 1940 -763 -2743 -1972
3283 -1972 887 2798 1962 -419 -2556 -1795 813 2680 1767 -767 -2468 -1647 958 2741 1788 -915
3299 -915 -2602 -1693 901 2528 2009 -488 -2579 -1789 838 2581 1908 -760 -2663 -1752 830 2567
3315 2567 1664 -860 -2710 -1766 785 2544 1614 -1062 -2546 -1826 863 2509 1708 -873 -2472 -1473
3331 -1473 661 2577 1730 -950 -2558 -1794 788 2659 1685 -867 -2579 -1654 836 2546 1700 -826
3347 -826 -2544 -1524 868 2440 1605 -835 -2481 -1662 924 2549 1833 -669 -2493 -1541 990 2380
3363 2380 1613 -790 -2219 -1349 1088 2620 1575 -818 -2299 -1671 962 2320 1717 -760 -2370 -1540
3379 -1540 954 2501 1577 -854 -2494 -1596 794 2686 1559 -887 -2423 -1629 798 2201 1739 -717
$$ packed form
3267B751q76k950j823Q28K791J863o50k847j801J093K505J796p40k703j980P71
3283a972K859J911q36k381k137P61K608J867r13k534j701Q21K605J783r53k703
3299i15j687R09K594J627n19k497k091P90K627J743o73k668j903R11K582J737
3315B567r03k524j850R44K551J759r30k676j484P20K689J646q01k581j599R99
3331a473K134J916q47k680j608P64K582J871r74k552j712R25K490J710q46k526
3347h26j718J020K392J572q35k440j646Q19K586J625p16k502j824R52K531J390
3363B380p67k403j429Q70K437J532j045k393j481O28K633J358o03k477j610Q30
3379a540K494J547r24k431j640Q98K390J892j127k446j536P94K427J403m62k456
$$ plain form
3395 -717 -2378 -1665 738 2448 1343 -913 -2458 -1609 978 2310 1574 -825 -2396 -1496 857 2378
3411 2378 1347 -960 -2303 -1395 847 2382 1406 -673 -2465 -1460 957 2405 1575 -796 -2327 -1654
3427 -1654 878 2444 1461 -1009 -2164 -1364 896 2242 1523 -718 -2290 -1424 842 2148 1371 -1142
3443 -1142 -2419 -1392 612 2452 1526 -861 -2505 -1553 778 2148 1349 -958 -2152 -1310 878 2170
3459 2170 1356 -1079 -2414 -1251 979 2111 1137 -939 -2328 -1539 920 2133 1115 -998 -2189 -1294
3475 -1294 881 2204 1358 -825 -2272 -1595 873 2140 1591 -813 -2311 -1378 867 2131 1307 -753
3491 -753 -2258 -1157 945 1944 1176 -916 -2152 -1400 691 2405 1352 -842 -2166 -1385 932 2126
3507 2126 1057 -984 -2120 -1348 1124 2104 1045 -929 -2142 -1372 839 2115 1068 -844 -2206 -1235
$$ packed form
3395g17j661P13K403J710j105k256j545Q49K587J332p36k399j571R00K353J521
3411B378j031k307j343R08K242J535r76k079j792J005K417J448q30k371j531O73
3427a654K532J566r83k470j155Q00K260J346p19k241j572Q66K266J306p77k513
3443a142j277J027K004J840r26k387j644R52K331J370p99k307j194Q42K188J292
3459B170q14k435j335J163K230J132r74k076j389P89K459J213j018k113j191Q95
3475a294K175J323q46k183j447O77K468J267n49k404j498R33K245J264q24k060
3491g53j505J101K102R99p68k092j236P52K091J714j053k194j324P81K317J194
3507B126j069k041j136P72K472R80j059j974j213P70K211J276j047j912j362R71
$$ plain form
3523 -1235 690 1989 1212 -935 -2290 -1193 809 2162 1245 -884 -2165 -1128 827 2051 1061 -933
3539 -933 -1903 -1037 915 2125 1250 -905 -2109 -1037 1030 2083 1278 -858 -1965 -1149 1052 2185
3555 2185 1279 -826 -1852 -1199 989 2135 1242 -807 -1895 -871 1093 2091 1040 -962 -1715 -893
3571 -893 906 1930 1050 -903 -1855 -1001 912 1957 1025 -1116 -2012 -1059 948 1898 1226 -803 -2013
3588 -2013 -1171 820 2055 1144 -913 -1687 -1149 1089 2056 780 -692 -1912 -1062 936 2064 933
3604 933 -918 -1882 -910 930 1882 1047 -845 -2004 -821 1075 1981 1031 -1118 -1991 -920 1017 2008
3621 2008 1242 -708 -1713 -1024 869 1881 1016 -856 -1788 -918 927 2118 682 -966 -1809 -976 928
3638 928 1863 911 -893 -1955 -943 974 1663 847 -1127 -1802 -904 904 1716 834 -1023 -1760 -931 932
$$ packed form
3523a235J925J299p77k147j355J097K002J353r17k129j281J037J955J224r90j994
3539i33r70Q66J952J210q75k155j204J072K067J053q05k136j107Q16K201J133
3555B185r06k105j026O53K188J146q93k049j088J024J964R98j051k002p53Q22
3571h93J799J024q80j953r52Q54J913J045r32k141q96R53K007R50o72k029j210
3588b013Q42J991J235r11k057p74N38K238R67j276j472j220Q50J998J128j131
3604I33j851r64R72J840R52q35j892j159J183J896R06r50k149q73J071J937R91
3621B008p66j950j005O89J893J012q65j872r32Q70J845J191j436j648q43Q33J904
3638I28R35r52j804j062J012J917O89q16j974o75Q98J808Q12q82j857p37Q29J863
$$ plain form
3656 932 1749 813 -1025 -1786 -795 792 1708 634 -1247 -1874 -922 767 1950 846 -1115 -1988 -704
3673 -704 665 1855 981 -713 -1937 -964 786 1683 790 -938 -1588 -876 795 1628 792 -969 -1831
3690 -1831 -978 864 1735 745 -1090 -1593 -897 765 1678 738 -1024 -1743 -618 778 1729 976 -915
3707 -915 -1777 -532 832 1590 691 -751 -1892 -649 904 1524 641 -921 -1571 -713 916 1485 423
3724 423 -1108 -1750 -730 852 1648 702 -898 -1763 -691 840 1595 725 -991 -1616 -671 1022 1733
3741 1733 784 -988 -1765 -621 964 1591 740 -824 -1461 -751 884 1682 729 -892 -1403 -455 862
3758 862 1715 679 -920 -1428 -668 907 1375 609 -915 -1608 -758 738 1454 560 -807 -1627 -744 978
3776 978 1780 619 -1029 -1693 -577 967 1496 616 -1115 -1452 -829 1011 1406 479 -1090 -1348 -512 955
$$ packed form
3656I32Q17r36j838p61R91J587R16j074j881o27R52J689J183j104j961q73J284
3673g04J369J190q74j694j224R73J750Q97q93j728o50P12J671Q33q36j761q62
3690a831Q53J842Q71r90j835n03O96J662R13r40j762p19J125J396R51p53j891
3707i15q62J245J364P58q99j442j141J243J553O20q83j562o50Q58J629N69j062
3724D23j531o42J020J582P96r46j600q65J072J531P55q70j716o25R45J693P11
3741A733r49j772p77J144J585O27q51j564o37P10J635P98r53j621n11R48J317
3758H62Q53j036j599n08P60J575M68p66j524o93Q50J496P16q94j367q20Q83J722
3776I78Q02j161j648o64J116J544N29q80j731l37O23J840L95r27j569k58Q36J467
$$ plain form
3794 955 1573 703 -1092 -1731 -605 921 1625 734 -767 -1416 -571 905 1472 568 -1003 -1497 -504 902
3812 902 1512 703 -877 -1330 -424 908 1655 645 -856 -1469 -371 957 1293 456 -880 -1496 -475
3829 -475 991 1528 720 -1019 -1588 -738 819 1496 519 -902 -1496 -588 921 1268 615 -1014 -1422 -473
3847 -473 973 1465 690 -1033 -1465 -405 889 1599 522 -785 -1384 -410 850 1366 506 -739 -1331
3864 -1331 -522 982 1572 650 -867 -1590 -547 999 1499 596 -984 -1324 -511 900 1311 530 -794
3881 -794 -1469 -575 991 1516 429 -898 -1355 -545 1018 1380 512 -868 -1397 -526 873 1226 350 -1027
3899 -1027 -1338 -644 939 1493 580 -1026 -1406 -451 954 1284 432 -995 -1531 -450 730 1238 285 -735
3917 -735 -1286 -356 850 1253 272 -990 -1293 -261 815 1241 404 -913 -1360 -565 917 1313 422 -928
$$ packed form
3794I55O18q70j795o39J126J526P04q91j501o49Q45J476N67r04j571m94R93J406
3812I02O10q09j580m53R06J332P47j010j501o13J098J328L36q37j336o16J021
3829d75J466N37q08j739n69Q50J557O77r77j421n94R08J509L47o53j629m08R49
3847d73J446M92p75j723m32J060J294P10j077j307n99R74J260N16q60j245n92
3864a331Q09J504N90r22j517p23J043J546N00r03j580l40Q13J411M11p81j324
3881g94o75Q94J566N25j087j327m57Q10J563L62q68j380n29Q71J399L53q76j377
3899a027l11O94J583N54r13j606l80R55J405L30q52j427n36J081J180N08r53j020
3917g35n51R30J206M03r81j262l03J032J076M26q37j317m47P95J482L96q91j350
$$ plain form
3935 -928 -1244 -517 834 1427 382 -778 -1343 -456 822 1045 213 -967 -1253 -354 779 1216 367 -903
3953 -903 -1254 -398 819 1302 408 -888 -1348 -531 916 1157 287 -802 -1322 -288 939 983 404 -932
3971 -932 -1588 -345 883 1331 276 -1046 -1306 -503 916 1202 417 -884 -1103 -494 899 1222 269 -733
3989 -733 -1255 -207 840 979 357 -854 -1077 -433 1056 1215 337 -956 -1146 -397 738 1060 248 -951
4007 -951 -1033 -139 789 1206 197 -956 -1115 -415 850 1092 90 -721 -993 -251 967 1182 299 -739
4025 -739 -1207 -209 831 1137 286 -698 -1117 -424 685 1135 154 -848 -1012 -411 994 1051 244 -852 -1062
4044 -1062 -255 838 1216 300 -818 -1071 -346 731 1013 330 -872 -1052 -16 829 797 247 -881 -1175
4062 -1175 -236 967 1292 251 -677 -1066 -119 795 1192 290 -782 -986 -247 627 1028 331 -712 -1135
$$ packed form
3935i28l16P27J351N93j045j160n65Q87J278K23q32j180k86Q99J133M37q49j270
3953i03l51Q56J217M83q94j296m60Q17J447K41q70j089n20J034J227M4n79j336
3971i32o56J243J228M48j055j322k60Q03J419K86p85j301k19O09J393L23r53j002
3989g33n22J048J047J39o22j211k23O44J489J59q78j293j90P49J135L22q12j199
4007i51q2Q94R28M17j009j153j59P00J265K42j002q11k72P42J218K15q83j038
4025g39m68R98J040L06q51r84m19O93J109M50r81j002j64O01J405N7q07j096k10
4044a062Q07J093L78r16j118k53P25J077K82o83j202j80J036Q45l2n50j128k94
4062a175R39J203L25j041r28l89R47R14L97r02j072k04P39Q74M01o97j043m23
$$ [...]
8191e2
##END NTUPLES=NMR FID
##END=
