##TITLE=1H_LR-628-C2-M2
 CDCl3, 8 sc, 
 5.7.2019
##JCAMPDX= 6.0         $$ Bruker NMR JCAMP-DX V2.0
##DATA TYPE= NMR FID
##DATA CLASS= NTUPLES
##ORIGIN= UXNMR, Bruker Analytische Messtechnik GmbH
##OWNER= root
$$ XWIN-NMR		Version 3.5
$$ Fri Jul  5 14:50:31 2019 Russian Standard Time (UT+4h)  she@DPX200
##.OBSERVE FREQUENCY= 200.13155
##.OBSERVE NUCLEUS= ^1H
##.DELAY= (6, 6)
##.ACQUISITION MODE= SIMULTANEOUS
##.ACQUISITION SCHEME= undefined
##.AVERAGES= 8
##.DIGITISER RES= 18
##SPECTROMETER/DATA SYSTEM= spect
##.PULSE SEQUENCE= zg30
##.SOLVENT NAME= CDCl3
##.SHIFT REFERENCE= (INTERNAL, CDCl3, 0, 15.7039)
##AUDIT TRAIL= $$ (NUMBER, WHEN, WHO, WHERE, WHAT)
$$ ##TITLE= Audit trail, XWIN-NMR		Version 3.5
$$ ##JCAMPDX= 5.01
$$ ##ORIGIN= Bruker BioSpin GmbH
$$ ##OWNER= she
$$ F:/spectra/data/she/nmr/H-F/1/audita.txt
$$ ##AUDIT TRAIL=  $$ (NUMBER, WHEN, WHO, WHERE, WHAT)
(   1,<2019-07-05 14:49:16.82 +0400>,<she>,<DPX200>,
      <created by zg, POWCHK disabled, PULCHK disabled
       configuration hash MD5:
       00 E9 B6 7A A2 85 ED C7 34 08 36 98 17 FE 4E 26
       data hash MD5: 16K
       13 D5 A5 CD 9A 84 8F A4 49 B6 F2 A3 93 5D FF 45>)
$$ ##END=
$$ 
$$ hash MD5
$$ 74 8E 02 31 C4 62 7F 08 92 CE A6 00 4F 02 DC 0C
##$RELAX= 
##$RELAX= 
##$RELAX= 
##$RELAX= 
##$RELAX= 
##$RELAX= 
$$ Bruker specific parameters
$$ --------------------------
##$DU= <F:/spectra>
##$EXPNO= 1
##$NAME= <H-F>
##$PROCNO= 1
##$TYPE= <nmr>
##$USER= <she>
##$AMP= (0..31)
100 100 100 100 100 100 100 100 100 100 100 100 100 100 100 100 100 100 
100 100 100 100 100 100 100 100 100 100 100 100 100 100 
##$AQSEQ= 0
##$AQ_mod= 1
##$AUNM= <au_zg>
##$AUTOPOS= <>
##$BF1= 200.13
##$BF2= 200.13
##$BF3= 200.13
##$BF4= 200.13
##$BF5= 200.13
##$BF6= 200.13
##$BF7= 200.13
##$BF8= 200.13
##$BYTORDA= 1
##$CFDGTYP= 0
##$CFRGTYP= 5
##$CHEMSTR= <none>
##$CNST= (0..31)
1 1 145 1 1 1 1 1 1 1 1 1 1 1 1 1 1 1 1 1 1 1 1 1 1 1 1 1 1 1 1 1 
##$CPDPRG= <>
##$CPDPRG1= <>
##$CPDPRG2= <>
##$CPDPRG3= <>
##$CPDPRG4= <mlev>
##$CPDPRG5= <mlev>
##$CPDPRG6= <mlev>
##$CPDPRG7= <mlev>
##$CPDPRG8= <mlev>
##$CPDPRGB= <>
##$CPDPRGT= <>
##$D= (0..31)
0 1.2 0 0 0 0 0 0 0 0 0 0.03 0 0 0 0 0 0 0 0 0 0 0 0 0 0 0 0 0 0 0 0 
##$DATE= 1562323756
##$DBL= (0..7)
120 120 120 120 120 120 120 120 
##$DBP= (0..7)
150 150 150 150 150 150 150 150 
##$DBP07= 0
##$DBPNAM0= <>
##$DBPNAM1= <>
##$DBPNAM2= <>
##$DBPNAM3= <>
##$DBPNAM4= <>
##$DBPNAM5= <>
##$DBPNAM6= <>
##$DBPNAM7= <>
##$DBPOAL= (0..7)
0.5 0.5 0.5 0.5 0.5 0.5 0.5 0.5 
##$DBPOFFS= (0..7)
0 0 0 0 0 0 0 0 
##$DE= 6
##$DECBNUC= <off>
##$DECIM= 24
##$DECNUC= <off>
##$DECSTAT= 4
##$DIGMOD= 1
##$DIGTYP= 9
##$DL= (0..7)
0 120 120 120 120 120 120 120 
##$DP= (0..7)
150 150 150 150 150 150 150 150 
##$DP07= 0
##$DPNAME0= <>
##$DPNAME1= <>
##$DPNAME2= <>
##$DPNAME3= <>
##$DPNAME4= <>
##$DPNAME5= <>
##$DPNAME6= <>
##$DPNAME7= <>
##$DPOAL= (0..7)
0.5 0.5 0.5 0.5 0.5 0.5 0.5 0.5 
##$DPOFFS= (0..7)
0 0 0 0 0 0 0 0 
##$DQDMODE= 0
##$DR= 18
##$DS= 0
##$DSLIST= <SSSSSSSSSSSSSSS>
##$DSPFIRM= 0
$$ [...]
##$SUBNAM2= <"">
##$SUBNAM3= <"">
##$SUBNAM4= <"">
##$SUBNAM5= <"">
##$SUBNAM6= <"">
##$SUBNAM7= <"">
##$SUBNAM8= <"">
##$SUBNAM9= <"">
##$SW= 24.9336996594482
##$SWIBOX= (0..15)
0 0 2 0 0 0 0 0 0 0 0 0 0 0 0 0 
##$SW_h= 4990.01996007984
##$TD= 16384
##$TD0= 1
##$TE= 0
##$TE2= 300
##$TE3= 300
##$TEG= 300
##$TL= (0..7)
0 120 120 120 120 120 120 120 
##$TP= (0..7)
150 150 150 150 150 150 150 150 
##$TP07= 0
##$TPNAME0= <>
##$TPNAME1= <>
##$TPNAME2= <>
##$TPNAME3= <>
##$TPNAME4= <>
##$TPNAME5= <>
##$TPNAME6= <>
##$TPNAME7= <>
##$TPOAL= (0..7)
0.5 0.5 0.5 0.5 0.5 0.5 0.5 0.5 
##$TPOFFS= (0..7)
0 0 0 0 0 0 0 0 
##$TUNHIN= 0
##$TUNHOUT= 0
##$TUNXOUT= 0
##$USERA1= <user>
##$USERA2= <user>
##$USERA3= <user>
##$USERA4= <user>
##$USERA5= <user>
##$V9= 5
##$VALIST= <valist>
##$VCLIST= <CCCCCCCCCCCCCCC>
##$VD= 0
##$VDLIST= <DDDDDDDDDDDDDDD>
##$VPLIST= <PPPPPPPPPPPPPPP>
##$VTLIST= <TTTTTTTTTTTTTTT>
##$WBST= 1024
##$WBSW= 4
##$XGAIN= (0..3)
0 0 0 0 
##$XL= 0
##$YL= 0
##$YMAX_a= 102532
##$YMIN_a= -152134
##$ZGOPTNS= <>
##$ZL1= 120
##$ZL2= 120
##$ZL3= 120
##$ZL4= 120
##$ABSF1= 10
##$ABSF2= 0
##$ABSG= 5
##$ABSL= 3
##$ALPHA= 0
##$AQORDER= 0
##$ASSFAC= 0
##$ASSFACI= 0
##$ASSFACX= 0
##$ASSWID= 0
##$AUNMP= <proc_1d>
##$AZFE= 0.1
##$AZFW= 0.1
##$BCFW= 1
##$BC_mod= 2
##$BYTORDP= 1
##$COROFFS= 0
##$CY= 11.3945322036743
##$DATMOD= 1
##$DC= 2
##$DFILT= <>
##$DTYPP= 0
##$F1P= 18.9103706918063
##$F2P= -1.10871071338519
##$FCOR= 0.5
##$FTSIZE= 0
##$FT_mod= 4
##$GAMMA= 1
##$GB= 0.15
##$INTBC= 1
##$INTSCL= 1
##$ISEN= 128
##$LB= 0.24
##$LEV0= 0
##$LPBIN= 0
##$MAXI= 10000
##$MC2= 0
##$MEAN= 0
##$ME_mod= 0
##$MI= 1.114404
##$NCOEF= 0
##$NC_proc= 0
##$NLEV= 6
##$NOISF1= 3.799351
##$NOISF2= 2.8
##$NSP= 1
##$NTH_PI= 0
##$NZP= 0
##$OFFSET= 15.70392
##$PC= 1
##$PHC0= -8864.736
##$PHC1= 26.20095
##$PH_mod= 1
##$PKNL= yes
##$PPARMOD= 0
##$PSCAL= 0
##$PSIGN= 0
##$REVERSE= no
##$SF= 200.130013532006
##$SI= 16384
##$SIGF1= 3
##$SIGF2= 2
##$SINO= 400
##$SIOLD= 16384
##$SREGLST= <1H.CDCl3>
##$SSB= 0
##$STSI= 0
##$STSR= 0
##$SW_p= 3612.71676300578
##$SYMM= 0
##$S_DEV= 0
##$TDeff= 0
##$TDoff= 0
##$TI= <>
##$TILT= no
##$TM1= 0
##$TM2= 0
##$TOPLEV= 0
##$USERP1= <user>
##$USERP2= <user>
##$USERP3= <user>
##$USERP4= <user>
##$USERP5= <user>
##$WDW= 1
##$XDIM= 8192
##$YMAX_p= 0
##$YMIN_p= 0
$$ End of Bruker specific parameters
$$ ---------------------------------
##NTUPLES= NMR FID
##VAR_NAME=  TIME,          FID/REAL,        FID/IMAG
##SYMBOL=    X,             R,               I
##VAR_TYPE=  INDEPENDENT,   DEPENDENT,       DEPENDENT
##VAR_FORM=  AFFN,          ASDF,            ASDF
##VAR_DIM=   8192,          8192,            8192
##UNITS=     SECONDS,       ARBITRARY UNITS, ARBITRARY UNITS
##FACTOR=    0.0002004,     1,               1
##FIRST=     0,             0,               0
##LAST=      1.6414764,     0,               0
##MIN=       0,             -152134,         0
##MAX=       1.6414764,     102532,          0
$$ Real data points
##PAGE= N=1
##DATA TABLE= (X++(R..R)), XYDATA
$$ [...]
2027gL95OM01L17J30K05n54K13k79n47N36L75r8l2J59j20j40l86l33k50%L46M22
2050G59L12j80l06l31k42K8j04j0l2K47L13J64m78l95J97L81k28p3o7K19N4J95
2072D23k7l33J01m48L70K66l80K00K29R5J05m08P3k95j08L78K76k26k73j07J80
2093I1n0J32Q5n81L43l8N07k80l22J3L69Q4k20k7J32m30l6M92q4k33j5J85M24
2116E41k52k92M80j91k42j14K95L81o36J43P43J26p78n69N18K64k74k2P41L4n48
2137C48L05K3m46p14N00N21j21j14L42l86m44l64K67k11j75j04R95L49l96m06
2157b31J0l80k64K8M6M13m31Q75J66k86o64j85J14J91J47J4M87J76J77n3l32m21
2179d03k45M59N83J83K72q7J85m36l40J43j22Q6k5O40J43m16K52j12q0m64k29
$$ y = [-7, 388, 394, 795, 1112, 1242, 1447, 893, 1106, 827, 280, 816, 1191, 1093, 1061, 1220, 1100, 960, 574, 241, -9, -9, 337, 759, 1071, 891, 585, 254, 12, 40, -64, -74, -106, 141, 454, 618, 140, -255, -58, 323, 95, 22, -45, 174, 228, 423, 396, 63, 164, -284, 86, 352, -28, 172, 401, 496, 601, 193, 266, -29, -137, 241, 517, 291, 18, -89, 91, 41, 173, 258, -323, 20, -18, 489, 209, -113, -100, 269, 353, 133, 106, 238, -192, -228, 264, 180, -53, -68, 117, 541, 289, -3, 477, 286, 44, -70, 225, 606, -30, 113, 856, 982, 204, -365, 153, 417, 143, 121, 862, 896, 348, 653, 676, 230, -484, 16, 537, 416, 302, 644, 258, -186, -550, -283, -494, -669, -773, 222, 571, 175, -231, -221, -601, -865, -837, -791, -378, -809, 66, 232, -54, -718, -903, -789, -598, -451, -437, 50, 226, 403, 350, 18, -403, -648, -189, 394, 577, 849, 762, 947, 511, 171, 314, 192, 278, 253, 893, 1036, 620, 872, 760, 680, 216, -13]
2200a3J60mJ28O5M82l9j015j58mL48o6l46N37J03n20r1P9m78j86K67L72k99m2
2223g20K02r5q9p9k00L50m39L25N01N9m8j33J99L56j33m31J12N5L44N19m94M57
2245F18l25Qq1L22P2k78K51O8K36l79l72lJ17L81J9l28J93k40l21J49J13l91K56
2268H5l43N11o22J82l21K95k25J25K10l64j13k16L98j03k3k27L46l79K88O16n32
2289d12J0m7L68k70l02k34L90P06L98o1j00l82j91l1K79J84J28r8J81J32j09l56
2311A83l3J14K12l9p5K02j05R4j55l9p08J58k30P9O9Q30J94m47q41K26m33k20
2333i64M5L83N10PJ1l35K61n75K81N2m3l36K52K29N23j11n60J73J06m35M19N21
2355D14k09r5P27M70j030j59J02J96j64M04K28o7j39m01M38m51k48J0N12J34k32
$$ y = [-13, 147, 143, 271, 336, 818, 779, -236, -394, -398, -50, -116, -462, 75, 178, -342, -433, -354, -832, -1018, -751, -379, -678, -720, -518, -613, -702, -781, -981, -631, -1070, -745, -244, -185, -233, -366, -167, 189, 56, -375, -263, -208, 136, 655, 161, 618, 293, 301, 220, 542, 614, 336, 587, 655, 891, 512, 140, 137, 254, 635, 654, 326, 519, 279, -42, 107, 220, -171, 85, -258, 253, -369, -187, -508, -213, -438, -313, -103, -467, -580, -796, -398, -501, -524, -751, -405, -784, -496, 120, -412, -402, -449, -81, -351, -653, -887, -497, 209, 607, 546, 446, 64, -127, -158, 121, 305, 433, 335, 516, 648, 539, 183, 150, 264, 476, 437, 362, 564, 459, 553, 398, 359, -349, -191, -421, -342, -273, 557, 751, 304, -537, -311, -744, -964, -919, -536, -26, -19, -8, -343, -82, -657, -376, -324, -367, -703, -451, -222, 301, 190, -370, -197, -91, -526, -107, 414, 205, 110, 837, 1307, 277, 118, 220, 416, 252, 656, 884, 817, 678, 277, 715, 264, 16, 26, 538, 672, 440]
2376D40k04R9N9k96l73q5J90j66k38N88q4J5j23j48l68j79K64K5M19n20M95M6
2398a44k83m07J75R6L17K9M26k69j55lK49M09m51J04J03J80j50j38J61M86m73
2419B62J08J41j13Q4k3j42m9J14q3K24Ok77l3J59j85j1j22k82k50J80k16N99P5
2442A66m26j33qk68M0L00j80j76J57O8l32j43K17m63P05k89N91jj59J62J44k08
2464b36k44k91N16K31RL34J06j24J09P1k15j96k21M91NM31J18q4m53k4R2k65K88
2487D48j06L15M1j09m64k22j16J68k4N5M1Q2j49p4K33j87o89J20K06j12l32R09
2509C4j75k65j56K97l51m91K46K37K34L27Q5l21R7k59R8J35j63Q5K08M86R9m43
2531D4l33L07J29k81O46j61j1J28K54l46K28k6q16O84k57Q0J87k73j09K55j88
$$ y = [440, 236, 335, 394, 98, -275, -360, -170, -336, -574, 14, -70, -55, -178, -326, -694, -873, -609, -584, -165, -685, -190, -144, -427, -834, -659, -563, -246, -217, 209, -60, -215, -218, 31, 440, -11, 93, 196, 376, 226, 88, 249, 735, 262, 370, 511, 398, 482, 459, 317, 268, 382, 299, 523, 529, 252, 219, 378, 193, 182, 60, -222, -472, -292, -508, 91, 166, -260, -393, -401, -669, -629, -329, -509, -685, -528, -460, -792, -935, -718, -1181, -476, -765, -174, -175, -334, -172, -28, -236, -480, -771, -255, -24, -15, 319, 425, 301, 410, 481, 266, 70, -151, 340, 345, 776, 894, 810, 357, 333, 425, 160, 448, 342, 657, 698, 589, 125, -97, -213, -45, -69, -14, 27, 109, -40, -114, 119, -68, -757, -637, -431, -543, -875, 34, -141, -406, -562, -265, -616, -1107, -861, -624, -390, -63, 22, -299, -202, -461, -363, -228, -391, -306, -98, 388, 487, 44, -289, 18, 147, -134, 512, 351, 340, 468, 722, 376, 604, 578, -238, 446, 189, 269, 456, 183, 74, 329, 141]
2552A41J31k63n1OR7j7Q3q0k20K55k32j05l13L38j08K37k47M2k5k5J02j41K05
2575a90j44p5QN70k45m05p8Q2N12J7J21k17k32J38K22J6J28n43M48J20m91K02
2597c6k7j46l3J00M34j15L4lK61l85k43J9j05P3R3K38j4j90l32J57L20j18n38
2620e56L93J44K94m26K36j82mr1MJ80k61N52J45j59L78k19p48L65l09K44P1M87
2642E38Ol10L58j56o42k2L2L68N8L85j95m2k37J05j33j02k85J04P9L50l3Kj22
2665A06m09o0L15l00K2L13J59L10K1m57k61J99j44J78J07J30LR2O7O6j96k25P0
2688A06N00j20Q7k05M28j40J53l05m90L23j09J69K57Q1K69l85j86J0l23K9r5N17
2710E71k20j02K51l71J90l96q1K26l98j7L40Q3Q5l71j34j04M1J27j56L32m35J08
$$ y = [141, 272, 9, -42, -36, 61, 44, 127, 47, -173, 82, -150, -255, -568, -230, -338, -101, -348, -306, -331, -356, -254, -395, -190, -334, -409, -401, 169, -76, -481, -559, -477, 35, 52, 173, -44, -276, -138, 84, 100, 228, -315, 133, 253, -238, -36, -63, -209, -242, -142, 292, 177, 211, 208, 469, 84, -159, -140, -245, -172, -79, 159, 145, -45, -377, -220, 100, -18, -556, -163, -19, 275, -151, 85, -97, -101, -192, -188, -8, -269, 283, 428, 269, 647, 428, -320, 45, -264, -20, 51, 538, 544, 234, 592, 436, -206, -228, -196, 172, 230, 615, 420, 378, 141, 246, 113, 11, -274, -170, -91, 259, 226, 228, 106, -303, -363, -48, -348, -326, -13, 146, 456, 477, 20, -241, -42, -186, -8, 99, 229, 232, 324, 391, 457, 261, 36, 106, 606, 486, 573, 368, 796, 656, 809, 504, 14, 337, 228, 397, 654, 735, 1004, 619, 433, 443, 120, 149, 54, 571, 351, 249, 500, 129, 319, -77, -158, 68, -330, -347, -7, 76, 161, -210, -344, -448, -407, -280, -436, -104, -539, -431]
2732d31L04l55L00K45k75k90M52M9J75m66J85N39l78K2K8O1%O2K02j05n6j88K54
2755C34j52M49m14j12M19k60j4Q0j19K10l32N6K31k49j13J58N4k79K03j51J34
2776A33k72J75j56L1q15L65K62Ln10L24K89J45l85m10O0K01k68K63N00K7l00K7
2798c11j98J92j70L91k00K95K75O9m1j29k13J90M3n7k46L60J97L11j60m8M2l15
2820B77j79Q2J22O9J98J16n0m32qo30L38J60M3K01j31j08k0o2j6k60k55K85J79
2843h1K14p8k37q5k03K62Rj42l33N33M9K76m69K43N6n15J10r6N62Qj73P11k50
2866C71l49j18j56K34k44L08M09m68L6L33J40o15Q8j26K17K23m0j05q2J16j14
2887E8K06n15j52L05m11M84J01n92K63Q3k42K76j53k58J41j42N0K63j23r4J08
$$ y = [-431, -127, -482, -182, 63, -212, -502, -50, -1, 174, -292, -107, 432, 54, 76, 104, 165, 165, 227, 429, 324, 268, 80, 334, 182, 631, 217, 105, 524, 264, 250, 330, 211, 421, 89, 145, 376, 127, 14, 172, 226, -53, 150, -1, 133, -139, 36, -120, -89, -904, -539, -277, -274, -784, -460, -171, -26, -411, -821, -761, -560, -828, -565, -65, -38, -338, -311, -509, -317, -487, -96, -296, -1, 274, 343, 302, 173, -40, 150, 193, 136, -110, 250, 447, 758, 598, 550, 592, 277, 98, 180, 302, 371, 569, 685, 635, 203, 195, -435, -97, 63, 106, 307, 176, 68, 48, -14, -30, -290, -545, -260, -81, 133, 55, -182, -267, -470, -208, -199, -341, -674, -141, -92, 184, -285, -42, 14, -501, -391, -487, 75, 83, -90, 621, 371, 22, -96, -252, -18, -262, 46, 455, -13, 23, 356, 496, -119, -31, -157, 60, 283, 243, 138, 56, 172, 58, 264, -251, -403, -98, -509, -25, 76, -516, -253, -170, -412, -136, -289, -547, -406, -548, -498, -235, -358, -452, -344]
2908c44L2J10k66J58J5j32K2K17p8K71n6j34J64o1j25j32K27j05L86o7r1j67K21
2931F5K5l4l04JJ20J32k91J14O8k10L8M7k40O1k10K07J13J01nJ33k13k36K6J04
2955c88K31j1J14n4k83L0K2m07M9P30n11K5M54P8K78k26r2k13j24L10M71p7k4
2978C82p6M8k31l2j72K82k01L31K81L5j57j62m51N73k45l56K46K7K93j00L54o02
3000F7k02r8j11Ol4K26j05L00n35K26k11o7J8r3L36J01k57M05k60K37l39j71M97
3023f4m2L71l03K08K41l59R8R9j30j97K80k4M03P1l23M20m36j78J1M55j20k90
3045A91K25K09J47k28k34L01m68N4J78j46j64L5r8mQ2k36q7J22m3N2J35n84L71
3068a90l20M15O0j63j5k11K41j76k65K38j67L25L3N3p9NK56Rp9J13j81J50N8K60
$$ y = [-344, -312, -202, -468, -310, -295, -427, -405, -188, -266, 5, -51, -185, -21, -82, -207, -339, -112, -217, 169, 102, 11, -156, 65, 90, 56, -248, -247, -127, 5, -286, -172, -104, -314, -276, -229, -469, -408, -618, -411, -298, -197, -202, -69, -282, -518, -492, -388, -157, -168, -54, -108, -391, -361, -339, -746, -697, 33, -478, -453, 1, 79, 357, 131, 39, -174, -298, 12, 483, 406, 382, 306, 354, 123, 91, -81, 201, 0, 331, 612, 647, 490, 328, -123, 450, 205, -151, 95, 122, 415, 315, 669, 67, -135, -233, -344, -338, -372, -146, -251, 49, -486, -260, -471, -538, -520, -613, -277, -176, -433, -28, -288, -51, -390, -561, -64, -106, 265, -38, 170, 411, 52, 150, 249, 119, -78, 202, 178, 581, 652, 329, 749, 313, 135, 146, 601, 481, 191, 416, 625, 772, 544, 310, 611, 143, 197, 375, 229, 65, 100, 2, -2, 80, -156, -243, -121, -164, -112, 23, -561, -190, -510, -95, -35, -198, -213, -424, -183, -359, -624, -386, -553, -228, -195, -142, -221, -216, 40, 49, -30, 83, -98, 52, 110, 370]
3092C70K08o77L19j01M68j96j28L43j91K1K52L5n22l23M0L87K23l40j45J07L34
3113D84M7m64J80l55J63j0L0J32k40P2m9l26M4P8m1J1J82M1j17k1L71n26Km6j27
3138d85M49o9O1o2J67k08j72L71j49R5N8q2J93J08l1k55k6K35M6K57l06l9Q4P5
3162C15J28j82l87P8K52R7J68m03K58p4l66J19J11k18k86L82l33L60j33L91k92
3183a5k12K45l39J02J04q1K31K37o7j79j90o7J17J22o9K47q4K5j28N3M0r6N2r7
3207d9J44M89m32k38K73K88o68K60l05M40m29K16J63j81p9J61l19L70j31k27K81
3228B7o1Q9k07J25l30L30n6p2j88K86j9J6j31L7p8M0P6j0J47L6k03J58J57j38
3252C1K60l5j92J52J10q7m8m02L04L79k12K50n52K94j94J53j15m6M7k5L21J32
$$ y = [370, 578, -99, 220, 119, 587, 391, 263, 606, 415, 436, 688, 723, 201, -122, -82, 305, 528, 188, 43, 150, 484, 531, 67, 247, -108, 55, 45, 75, 207, -33, 39, -10, -336, -292, -214, -255, -244, -62, -21, -138, -159, 212, -314, -312, -358, -485, -36, -105, -44, -106, 61, -147, -319, 52, -97, -2, 56, -26, 167, 275, 244, -11, -37, 198, 244, 501, 195, 156, 240, 315, 443, 261, -126, -48, 204, 301, 469, 66, 324, 250, -116, 3, 114, -104, -390, -8, -341, 19, -114, 277, -15, -227, 18, -321, -219, -115, -196, 35, 272, 205, 26, -164, -231, -114, 8, -61, 186, 102, 127, -1, 52, 92, -4, 48, -49, 95, 584, 152, -86, 187, 475, -193, 67, -238, 202, -227, -11, 152, -29, -108, 53, -266, 104, -27, -254, 27, -34, 55, -152, -27, -357, -27, -83, -155, -343, -57, -76, -60, -191, -154, -232, -192, -116, -126, 21, 57, -146, 12, 169, 31, 291, 256, 64, 216, 326, 239, 191, -211, 93, 472, 260, 510, -42, 252, 58, 211, 96, 50, 97, 72, 393, 525]
3274E25l51o9l0j27j36r5J61K24j13KJ78r3l13l24L36j9J00p4j29J52l0L08p00
3297f17L02K17l6J9K76M8m28K97k7Q5k08k15L43j28L23J21J24L4l5k7j50l46j21
3320a49L95L32p7j0J31qo59J02J72J64p6q6J75j75J06k27l22Q6J5J1P1j47L88
3343B12j82k98K3k53r3q3K60k5L13Mj99j2j45M50n89K70n0j29L99J47j50l6Q7
3366g9j56MJ01J71Q3o5L96j04j22j24l7K52j28J29j22j97J65K34k62L18j56j46
3388A55j32J77m3K00j09N0n1m9O7m34Q1r5L88j61l05j23O51l49o0K87m23K97k49
3411b30L08l47q0N14n99N11K09n76M4L08j07j62J18M9L96Oj95j6M6j40J75J63
3433C95Qk81R2L89k01o4j65J31K36m47K11J93l59J95J36m4l63k23n9n8J39J12
$$ y = [525, 174, 105, 75, -52, -188, -283, -122, 102, -11, -9, 169, 76, -237, -561, -225, -244, -144, -218, -347, -195, -225, 83, -617, -315, -98, -134, -115, 161, 209, -219, 78, 51, 136, -72, -287, 56, -72, 251, 372, 496, 530, 495, 468, 318, -28, -149, 246, 578, 501, 491, 622, 614, -45, 57, 229, 393, 317, 231, 406, 231, 337, 110, -212, -126, -111, -100, -29, -176, 212, 30, -268, -245, -498, -591, -674, -414, -439, -126, -122, -321, -333, -478, -28, -617, -347, -397, -526, -127, 20, -130, -166, -79, -235, -231, -130, 41, 124, 59, 455, 351, 229, 105, 68, 320, 192, 321, 199, 2, 167, 401, 139, 457, 301, 155, 23, 200, 157, 357, 248, 298, 247, 198, 265, -169, -88, -183, 205, 44, -261, -384, 267, -82, -142, 145, -278, 19, -230, 78, -269, -349, 165, -434, 77, 286, -290, -246, 62, -45, -207, -89, -40, 356, 362, 167, 151, 197, 57, 232, 395, 403, 122, 214, 603, 402, 338, 173, 304, 540, 93, 304, 497, 138, 333, 469, 425, 62, -161, -220, -278, -139, -27]
3455b7K9J60m7j81k3L1l60K81Q7K60J37k27l41P5k8J35p0JJ36J72j31j06J7J19
3479I9l11j01J29J39L12J53j21P8j95J01l53O5K2J19r6J32J89k55j72M66j44l27
3501g1k42N5J68K67J60n73Q6J00k71Q3J83k17K46k71K92k9l5l73o4K32L3Q4l26
3524d83M77q0m9L09k66j15P4J85K11k18r6m2j50L51M04m67K29l42N01m20N09l6
3546D86l7k68J18m5j3k75M95O9k85L24k52q5j09J02j38j75j0K08m87L56j72J33
3568f0J40RK17m31m07J94L03j88K87j44l38M79o2L4o9K3k3k01L98K28m19K85O6
3591C21j56M2k07J42J4k01N04K31l30j41J77P6l80L62k36J31J53m84L95Rpm23
3613hL14j56j81N2J30K4j57N57n13j35j75K08j78K04m8k37M16J1n12M5j11J37
$$ y = [-27, 2, 162, 115, -66, -89, -58, -418, -137, -50, 210, 347, 120, -221, -146, -174, -39, -109, -108, 28, 200, 69, -37, -20, 99, -212, -313, -184, -45, 267, 420, 299, 377, 182, 283, -70, -5, 17, 136, 40, 172, 361, 106, -66, 400, 256, -71, -313, -258, -90, 177, 337, -236, -150, -50, -321, -238, -55, -272, -26, -297, -5, -34, -69, -442, -506, -274, -241, -157, -483, -6, -86, -135, 174, -92, -207, -133, 52, 263, 45, -51, -93, -243, 108, 512, 45, 274, -68, 433, 13, 522, 486, 449, 181, 299, 254, 241, -34, 461, 530, 245, 569, 317, 232, 123, 225, 87, -88, -98, 110, -377, -21, -193, -60, 80, 89, 306, -125, -532, -338, -35, -223, 64, -80, -418, 61, -1, 33, -36, -13, -36, -237, 161, 389, -30, 255, 321, 165, 207, 0, 142, 156, -45, 459, 690, 360, 219, 396, 472, 92, 454, 218, 349, 502, 18, 413, 422, 415, -8, 306, 150, -31, 21, 151, 175, 18, 575, 62, -73, -248, -40, -218, -14, -62, -299, 117, 128, -384, -339, -450, -313]
3635c13J21K4o9J66j46m2O7j4j77j25Q8L11K27k66J26l4k66o7M02J46n19M96j57
3658b1J40NJ5J02k20R3J57j34P9P0l35K48L1r6k31R8j09l2N00n23J06k7K82n17
3682c19J38J6o5J38Q7J98m07J38k88L22m6n53L58l2M7L63k76P1J54k46k06L97
3704a1j89K66k8q1L12p7k61j76J66M9m4L24k18j08l3L76j99K65o70K98J60J97
3726C18k61k1k73L42J09J9J62l61j09J64j21j48J6R8K36l51J24J31l02L10J24
3747B06k37k03K60K7k72k8N33l30j8J49n6K24k50L07l74K23l06O2K76k43J3L52
3769C15l16k12J17J18R7L50l72j9J68k56K41m1q5j22K03k0j04k36O7Q2l0K40K9
3792B14l50L36n42K94k77J61L7K12k47j51l8L40j19j93K50LJ15k46M37k03pj49
$$ y = [-313, -192, -168, -237, -71, -217, -259, -192, -206, -383, -508, -420, -109, 118, -148, -22, -56, -322, -389, 13, 159, -360, 136, -21, 119, 124, 139, 241, 21, 114, 271, 137, 216, 286, -49, 199, 230, 134, -97, 1, -108, -140, 360, -163, -57, -84, 198, -319, -181, -165, -230, -92, -5, 193, -214, -76, -364, -42, -88, -641, -283, -315, -268, 95, -181, -110, 44, -202, -408, -11, -200, 66, 38, -43, 269, 192, -69, -245, -79, -30, -74, 250, 32, -76, -109, 267, 68, 333, -337, -39, 121, 318, 57, 36, -237, 105, 214, 233, 395, 34, -75, 89, -32, -180, -164, -66, 170, -181, -57, 74, -228, 82, 206, -31, -234, 26, 53, -219, -247, 286, -44, -62, 87, 31, 255, 5, 312, -62, 161, -145, -83, 193, -50, -37, 315, -1, -213, -96, 22, 119, 469, 97, 78, 246, -10, 231, 190, 105, -17, 186, 166, 62, -174, -107, -25, -55, 185, 214, -136, 200, -342, -48, -325, -164, -127, 85, -162, -313, -351, -11, -130, -323, -73, -70, 45, -201, 236, 33, 26, -123]
3814a23J18K29k7l1O3J39j62K2mJ14l53N1j72J39M4P0O47m72k46L10o9m00K96
3837A83k13P81n83m1J63k90r4J38j11L3N8K2j67j14M75m56PJ46m21L83R9n7l28
3860c87K24L48n00K55o1m7k74M15J80k65m7M5K86k32K49Mm19K05p0L72P7j67j30
3883F1K81J88m18j25O0M36l00m7O4m88N14j84O9j53R9j41P6q8K14J38l38N3R5
3906F6k29J92l66J76j54K27K59j57n8j26R6J19k30R0J05j71J22j36n2L5K50q4
3928b6R4j87k39L75m2L68m26K25J16j28J29P2j03k95K79R5j71K3O3k34K34q4l10
3951a72L04Nj80J86l6n4j46j6J95K27k32m9J24j33n5j12Rj45J59l84J11N41j98
3974e1l4J8m04L54j6j76J04J29j45J96R7O2J48n10RK21J5k5q7M45k41o2J27nl17
$$ y = [-123, -5, 224, 197, 166, 229, 368, 206, 228, 224, 338, -15, 36, -136, 3, 47, 117, 764, 292, 46, 356, 287, -113, 183, -30, 751, 168, 127, 290, 0, -94, 44, -67, -34, 24, 46, -121, -235, 240, -216, -209, -63, -484, -101, -2, -59, -387, -163, 185, -315, -60, -121, -168, -442, -27, 153, -112, -159, -114, 172, -60, 189, 193, -226, -21, -91, 281, 358, 191, 61, 342, 530, 112, -13, 47, 483, 183, 136, 200, -288, 226, 42, 111, -42, 57, -84, -8, -96, 118, 256, -82, -29, 66, -163, 29, -337, -161, -315, -88, 171, 14, -44, -170, -74, 45, -185, -95, 10, -161, -39, -175, -227, -192, 58, -26, 68, -119, -358, 17, -25, 343, -83, 142, 258, 130, 259, 331, 228, -67, 212, 307, 136, 159, 222, -12, 222, 138, -172, 132, 137, -43, 143, 107, 53, -93, -109, 86, 313, 81, 32, 156, 23, -32, -144, -135, -280, -121, -505, -394, 147, -51, -85, -67, -471, -117, -133, -309, -205, -76, -221, -25, 72, 134, 282, -228, -219, 2, 17, -8, -95, 350, 109, 47, 174, 169, -148]
3999a48j33M20k09m4J09M9Q2J94l10j17k34K31O06n03O9q8l3j45K84j36k25J72
4021a09j33J26j87L94j60k4prr8n4n4O2L67j99J9r8J83j18J75j39K7J93P2j81
4045D8J82l14J10J4j78M72l34J84k27N09r2l12l8O2j92J06j21J11j10j8J70N8
4067I0J61j66m82K14L29l18K08P9l31J11J99l18j06L43nl95J12L22n8k04K93p0
4089HJ22l19j37K39O7k0j20R0K5K20k13o4K03j72K45m1o6L61l83%K58J22l74L0
4113H1j43Q9L65l17k83L94k51L17m31L79l43M43n76K88M6J16l30J03p5Q5j43L9
4135a47l0j87K02nQ9j18n5J69q2M9J8M2o7j03K01j51R9r0q1O8N9K98j96j27J99
4160E4j16J76R3J7J40l90l5K39K2k86n8L11J59k67K01%J38m10j42L43m15K34K18
$$ y = [-148, -281, 139, -70, -114, -5, 44, 126, 320, 10, -107, -341, -110, 496, -7, 62, -26, -59, -204, 80, -56, -281, -109, -242, -116, -303, 91, -69, -93, -100, -109, -207, -261, -315, -253, 114, -85, -66, -164, 19, -99, 76, -63, -36, 157, 229, 48, 230, -84, 26, 40, -138, 334, 0, 184, -43, 466, 374, 62, 24, 86, -106, 0, -121, -10, -120, -138, 32, 90, 251, 85, -397, -183, 146, -172, 36, 115, -216, -105, 94, -224, -330, 13, 8, -387, -275, 47, -11, -215, 78, 8, 130, -189, -326, -87, -20, -40, -160, -70, -45, 175, -38, -102, 101, -71, 174, 133, 67, 428, 45, 45, 303, 425, 51, 81, -62, 27, 392, 75, -208, 186, -65, 252, -179, 200, -143, 300, -276, 12, 58, 174, -156, -53, -128, -43, -186, -147, -177, -364, -162, -167, -78, -196, -251, -82, -164, -115, -97, -55, -122, -225, -24, -175, -76, -166, -247, -179, -120, 178, -18, -145, 54, -62, 114, 207, 224, 364, -26, -61, 178, 200, -86, -144, 167, 326, 59, 260, 260, 398, -12, -154, 189, -226, 8, 226]
4183B26q6j1N0n2j44L55o09K26P7Q0l4J4k14j6q9N28k97k60K10n1Q2J07p3Q4k64
4208a61J24N1l1l32J6M9K44K28k47QN76m61L37k8k96j06K37O6j67Q9j14J2R7k25
4232c4L12l28j8K35J9k16J04j85K63l89J85l8o9p8l3J52J15rk64M31l68J20j77
4255b70J99j42p6K25R7nk09M15l81m0r6J26r0J40L68l63L14j63m40K71J04J21
4277A05K2L7o5q3M07k19k46J05k40M6L08R5Qj02n3K04k53j89j0Q5K37J3m79J05
4301a62J52j55M91l84n76M80J46j9K31k25n4J59m23k5L43J0k13O1K58j80M47k61
4323A01l74K35M9Q1n9JJ18L10l68K5j96L08J1J24k66J90J5q6j89j6M43l21r5J43
4347A84k22K01q1Q1J18k33j71P2p5P9L9j93M09n67O5M82l39L2K27m55L72r3K84
$$ y = [226, 140, 129, 179, 127, -17, 338, -271, -45, 32, 112, 78, 92, -122, -138, -227, 301, 4, -256, -46, -97, -15, 92, 19, 103, -161, -37, 14, -17, -349, -333, -284, -40, 188, -59, -51, 525, 64, 401, 373, 77, -29, 208, 274, 107, 196, 82, 94, 191, -34, 278, -50, -68, 167, 186, -30, 74, -111, 152, -237, -52, -90, -159, -237, -270, -118, -3, -12, -276, 155, -213, -93, -270, -71, -213, -289, -64, 33, 28, -181, 234, -147, -187, -283, -157, -247, -107, 261, -102, 212, 49, -391, -120, -16, 105, 127, 164, 99, 16, 423, 204, -42, 63, -177, -131, 177, 272, 280, 178, 125, 329, 76, -113, -123, -38, 199, 212, -267, -162, -10, -165, 326, -58, -634, -154, -8, -27, 204, -21, -75, 84, -339, -364, -21, -11, -224, -163, 95, -85, 362, 101, -273, -38, 11, 92, 33, 34, 152, 462, 94, 119, -77, 231, 242, 366, 100, 290, 305, 219, 30, 14, 457, 136, 41, 184, -38, 163, 82, 163, 281, 48, -123, -51, -126, -47, -8, -201, 208, -359, -294, 188, -151, -119, 108, -347, 25, -68, 216]
4370B16l48o4J0m3R8K41K29m79J14r1K35J24l09k0J84MJ44k87J4n7J25J47J94
4393C81J3k10l1K82j15k44o1j19J98M5Jn0k62L06l89J37j08L1J10j24J15j87k6
4416c07O0K57n4J00r3r3j30K45k10R0j78M3k14L15M7L16r3k9k82J70J66l06k70
4439d50M16p7K94k45K40q3j07k21M69j27n2l3N8J16k72K00l3l2k4j34n4K56m24
4462c19L37K40j11r7l68K21L41k15r6K97m68O8Qn9j06Q0Q1K59k9j42j8l10K37
4485a69J5J16J74l49j9J10L73j41lj94P5J02M8q7J50j12M2p4R2n9l8RN0j47k0
4510e6J19J08m6j20K07j00M8q3j82L44m48M47k29L0k96L32j47N2k9K4j3O3j47
4533a22J00O5j42K11l72L56l75j0N01l93P1J88n0J44k19n7N36m47K28N7k61R1
$$ y = [216, -132, -196, -186, -229, -131, 110, 339, -140, -26, -117, 118, 242, -67, -87, 97, 101, 245, -42, -28, -85, 40, 187, 381, 394, 184, 153, 435, 320, 76, 15, -104, 94, 139, 140, 90, -172, 134, -255, -118, -226, -195, -85, -209, -94, -281, -307, -247, 10, -44, 56, -37, -130, -260, -15, -225, -135, -313, -270, -484, -169, -122, 194, 101, 72, -210, -40, 126, -180, -450, -34, -111, 183, -62, 178, 95, -12, -233, 236, 109, 57, 24, 82, 198, -74, 126, 93, 61, 37, -97, -151, 105, -319, 18, 258, 147, 50, -318, -97, 244, 29, -67, 230, -238, -170, -162, -221, -327, -247, -166, 93, 64, -78, -96, -406, -169, -154, -38, 136, -213, -232, -122, 251, 110, 107, -87, -12, 90, 138, 51, 201, 89, 131, 57, 149, 90, 52, 61, 111, -36, -56, 63, 171, 125, 5, 212, 112, 160, 77, -105, 239, -209, 238, 9, 39, -257, 75, -72, -20, -49, -25, -38, 25, -122, -22, 43, -99, 112, -260, 96, -279, -289, 212, -181, -110, 78, 28, 172, -47, -104, 432, -15, 213, 270, 9, 100]
4555A00n8J52q5J61J10l20j18J48j26K66k55j12O39j33m66J0J36J05N2l66J12
4576d8J49R1j61k42L55k95j65J36K64Q9j76n00J34L50MJl61O4N13l79KK14o3J29
4600A05j83J76q7j80J78K15J81l10k12M4J81q2j10J90K4K07j32k27kL32k36q6
4622a4L22k79j68N04n1m25L31j63j95J44L5N9J61j21k41k2NJM2J18J65l02k09
4645c03L04j73J5O1j77L43j32O5k81K99K6j75J75k41J63k18l2M74j81J22J28j42
4667A20K2k09Q2L74n62P17j91m4l55L68k7j02j91J02m1m2K46j06p6j05K07K7k84
4690g0j8J17k9K3l8j57L57l51N2J43k19L04m01R6J19P2m1L1l18K38r0J84J26j89
4714e9j49K53k6j15M36m11J90o2O2k35L20l00L59j11J25k05j62L15j92o8R4l2
$$ y = [100, 42, 194, 109, 270, 380, 60, -58, 90, -36, 230, -25, -137, 502, 369, -97, -87, 49, 154, 206, -160, -48, 101, 192, 31, -211, 144, -151, -316, -180, 84, 173, -3, -503, -369, -19, -15, -14, -375, -311, 202, -177, -175, 39, -24, 105, -78, 98, 11, -169, 9, 224, 405, 95, -117, -73, 108, 26, -84, 106, 130, 337, 205, -22, -24, 308, 72, -14, 308, 29, -139, 365, 314, -111, 220, 57, -138, 6, 41, 100, 261, 140, -101, -123, -118, -117, -75, 43, 208, -94, -303, 1, -172, -157, -96, -273, 70, -62, 3, -278, 21, 47, -128, 47, -194, -31, -249, -281, 193, 12, 134, 262, 120, 142, -67, 15, 389, -173, 544, 353, 309, -46, 322, 295, 193, 2, 104, 63, 21, 267, 161, 85, -20, 187, 214, -70, -88, 29, 0, 23, -15, -172, 185, -166, -114, 29, -190, 114, -287, -191, -72, 0, -41, -10, -328, -90, -180, 4, 130, -59, -208, 45, 19, -96, 340, -71, 119, 57, 119, -116, 204, -96, 263, 152, 277, 72, -90, 225, 33, -35, 59, 27]
4736B7n9K82j82N1k13K55kJ1j90l0j8K55m2n5k44l06P61J3m18p7L64k06K08j38
4760D7l41K58k1j66M7P9J8j35j43M28o1j28K46n76N93K4k48J85k94N70l43k30
4782a91j91O24m36l5j11M27oK02Rk68K30k30L61l93J85q3N7j74O0p3rN1l42O34
4806B98k28n3o6k59M68l28J32K9m7K02j71r0j00K31j19nL1J11m72L07J14k25M56
4829B16l21n0K89m2Q2J15m26N78k56k31J9P1Q8k6kk7J08j96j99K50P8j95J19K46
4853B88r6j98j15J01p5Q1j76L36l48J38k77k4Q2K10J90m4l91M52m27O06k49j46
4875h2n7J97k24k23L20l24L30q9J95j43j49L0Q9Q2K02j01o6K11q9L2k78P7K51
4898A91k2q8k0Lj67K05k52l3J46J77k10K02k08K48l86R8l8N0K32n78M47k15J88
$$ y = [27, -32, 250, 68, 119, -94, 161, 159, 170, -20, -50, -68, 187, 145, 90, -154, -460, 301, 314, -104, -181, 183, -23, 185, 47, -294, -36, -57, -223, -176, -97, -79, -214, -357, 71, 10, -118, 128, -448, 145, 169, -79, 106, -188, 382, 39, -191, -382, 242, -194, -229, -340, 87, 81, 283, 292, 24, 254, 24, 385, -8, 177, 94, 151, -23, 37, -36, -45, 6, -336, 298, 70, 17, -49, -308, 160, -168, -36, -7, -54, 148, -23, -113, -213, 18, -101, -106, -75, 36, -436, -129, -15, -240, 216, -105, -155, 134, 92, 174, 289, -137, 441, 185, -46, -27, 44, 132, 106, 104, 77, 185, -11, -210, 40, 118, -77, 42, 288, 192, -6, -121, -20, -95, -14, -190, 146, -202, -64, -341, -365, -283, -73, 117, 73, -318, 134, -293, 313, 64, -82, -139, 58, -166, -389, -69, -393, -63, -152, 43, -100, -249, -219, -130, -48, 154, 53, -13, 198, 109, 141, -137, -60, 191, 169, 81, 61, 64, -103, 102, -150, -183, -37, 140, -70, 132, -76, 172, -214, -116, -154, -104, 128, -450, -3, -218, -30]
4921c0N9P8l00R4P3o6J0L10l24k38L07Q0k24J88J43k24M8n0k1J05K28j25k03j3
4945i5k7L81n03K31K4M5l5m5J15J94K9kk53P1L5K3k05J93k23K18j05L3M7k06q6
4970a46M3L08l45JM3L02Mj96j18J04J91r2p9j87op0J73j7K08j5k61K70l26K39
4994B8l6m8N3m03K24Q6J73l01J58kK27k92O3p3N9M96o53K48M9j52n8L48l50k69
5018d25M54L1j16M6Q2L5r6j42j00J0j61L43o6j9L43j91k42K56j97l0J81o7k1j66
5042b58K41l18L29p9K3N9J30m11K83K60j80n5J49l78M7R2J46J65n28J24J83K54
5064B78j64jk53J55J17rM28n17L4j61o5J66j45r2nL06J15j01o1n8j12L94j41l05
5088a97K0P7J76m68M74J81l90L63m01K66k66K03P8j98Q0l05L39J17k18Q5J44N0
$$ y = [-30, 29, 107, -193, -99, -26, -92, -82, 228, -96, -334, -27, 53, -171, 17, 160, -64, -16, -66, -87, 18, 246, 121, -82, -95, -122, 259, -244, -13, 11, 56, 21, -24, 91, 285, 314, 312, 59, 130, 165, 188, -17, 176, -47, 171, 66, 99, 146, -60, -146, -103, 205, -140, -139, -96, 206, 210, 14, -104, 0, 191, 99, 20, -167, -173, -243, -70, -87, 121, 106, -155, 115, -211, 28, -8, -56, -3, -406, -182, -96, 77, -224, -66, -68, 159, -133, -70, -143, -84, 412, -241, 7, 56, -96, -154, 194, -156, -425, 29, 60, -56, -10, 72, 107, 11, -131, -231, -221, -382, -39, -105, -124, 219, 28, -214, 42, -155, -185, -4, -71, -92, -258, -17, -335, -6, -85, -62, -3, 127, -284, -1, 259, 79, 24, 173, -205, -158, -66, 80, 245, -283, -159, 24, 278, 114, 113, -140, 15, 132, 123, 551, 34, 68, -93, -158, 8, -137, -229, -234, 72, 187, 86, 25, -33, -145, 249, 108, -197, -177, -100, 76, -392, 82, 263, -127, 236, -165, 101, -165, 38, 116, -82, -2, -307, 32, 149, -69, 16, 160, 210]
5110B10m82Q8K24m6K59p4k37K88j03K4l80K61J52k00K64k69j20L14m00Q8K98j92
5132c3l5q1P3O0N7Oj45Qp9K62k28J62L4k25J56M5j51O4r2J41j44K1l43M31L5J27
5158A26J0j69pN4J57o84O39k02j1K41k62J72k62J72M1k2J43m8ll38M72m35L93
5181A77k44J29Qj43J19o5r8P9kN1j94Q2j5Q2l5J42P0j72k97K3M27q6j20J3p6k85
5207d30K27J89J36k95K65J72l81PJ8R8j29J1l1L8K30l86O55n41L82l8k00j29J34
5230Bl1j9L19m04L09l61J58L04k39K09k40k52J87K17j74J32J2j20j22J66P2j51
5252b6J97k59k7m6J12J35k41j1J64l25J18L35k16L56l49J58q3Q8j31m2N0J46j44
5275d1J34m5j22J0K32Lj23j69K73N6j95N4J38j12J29j54L0j02K68O1p7L6l5j74
$$ y = [210, -272, -184, 40, -6, 253, 179, -58, 230, 127, 151, -229, 32, 184, -16, 248, -21, -141, 173, -227, -139, 159, -33, -68, -149, -76, -16, 41, 47, -98, -90, -169, 93, -135, 27, 61, -164, -8, 37, -114, -50, -142, -1, -145, -124, -467, -36, -1, 126, 136, -33, -40, 14, 171, -513, 126, -76, -87, 154, -108, 64, -198, -26, 15, -7, 136, 88, 85, -253, 219, -216, 177, -67, 62, 70, -73, 46, -19, -117, -38, -40, 11, -183, -101, -116, -34, -69, 73, 143, -29, -326, -303, 124, 38, -82, -69, -145, -430, -203, -14, 122, -173, 92, 264, -117, -110, -92, 6, -123, -112, -143, -105, 125, -261, 394, -147, 235, 197, -3, -132, 2, -29, -48, 271, -133, 176, -185, -27, 277, 38, 247, 7, -245, -58, 159, -15, 117, 129, 9, -113, 53, 125, -26, 171, -88, -115, -161, -49, 86, -155, -166, -2, -327, -209, 126, -90, 266, -83, 75, -8, 80, -51, -93, -43, 103, -41, 93, 48, -74, -64, 168, 171, 48, -121, 152, 208, 13, 67, 205, 93, 222, 68, 98, -4, 264, 325, 248, 284, 249, 75]
5299G5jj04j31P1K61l59nJ17J68m60L90p7k1P8k85K79PN6k99J01j43j48Q76l05
5323A41L0m90Q7J1J83p4J6n2J96m5O1j56K0J2r3L6j27L82l11L68j62K22k07L7
5347H5R7l54M26k08l5j00L9Rpj07K19j58J98K02j83j91m9O20p14rL58k14J12K01
5371B37j51m2k35J11j9k6j86K05J8j07J15R3p2j02J76K8J38r9R9k60k7J43J20
5394A57k02J24j05N6M7k06q0K97j13rP1J53k59J35j90K47j21J25l38M72O8j24
5416B05R7l98R5j36L74k88K12N3l13K20N2k41J09L5m36M71j88j53K71Pj79N4K94
5439B17l3j03m57J61j52J93J35P3j1R9j59N8N9p5o8J37lp6J75q5l75P1M99r8k57
5464g5R1O7j91Q1l0J0J37L4L9l71K3J40j7K39J1j63j39N2l16J85M77k11j38j00
$$ y = [75, 74, -30, -161, -90, 171, -188, -193, -76, 92, -368, 22, -55, -76, 2, -283, -4, 3, 59, -240, -139, -282, -430, 446, 141, 171, -319, -232, -221, -38, -112, -96, -148, 48, 3, 64, -92, -72, -60, -153, -117, -244, 138, -173, 195, 33, 255, 48, 85, 182, -172, 254, 46, 11, -89, -50, -41, -48, -155, 64, -94, 104, 306, 123, -68, -117, 503, -211, -220, 138, -76, 36, 237, 86, 44, -191, -80, -99, -125, -311, -106, -88, -195, -80, 13, -59, -161, 15, 43, 181, 82, 181, -79, -106, 37, 157, -45, 79, -26, 30, 77, -129, -209, 88, -25, -34, 37, 190, -69, 66, -124, 123, 2, 127, -211, 261, 329, 205, 302, -96, -1, -137, 237, -51, 161, 214, -99, 121, 173, -68, 41, 76, -360, 111, -77, -230, 41, 48, -131, -77, 217, 184, 81, -376, -215, -367, -174, -39, 34, 23, 122, -37, 21, 80, 5, -63, 74, 71, -5, 170, 85, -290, -219, 280, 182, -75, 16, 83, -108, -27, -57, -47, 90, 124, 163, -208, -185, -45, -62, 177, 188, 25, -114, -62, -378, -193, 284, 73, -65, -165]
5488a65J30r0J91k52J85J03n19j28O56J9l51L30k76K09R5m22K17P2q0K06o6j30
5510f6J13J06j08k08K37J70l14M91m30M8PJ10K9j90K9M13l12j23J31l07K93J16
5532B35k31M0j54N8j24l3N9L2O1R3K98k63r9n6j99K80%p5O4l63J38j15MM60P3
5557A83j07J2j0k12J85k07J39P3k33L00q3M7n5K8k12K05K5j0l37J09J17k2J63
5580I8J12k25K17r5J03jj94Q0j59J09j73o1J13L27l50J29q8m2J37J75j32k05J75
5603E0k76K83j30L14l34R2L31n59J1J12k01P5l8LK44k2K12J52m55J44n5j20n2
5626b19L01J49k89j14J32O4J16k69l3K94P6J31l16j5P8j34j08M4j29O1o6L18k80
5649b08M54k61J62j27o2K1J00P1j15l95M73j49q4K3k52J94M9N85p75N5L45k65
$$ y = [-165, -35, -125, 66, -186, -1, 102, -417, -545, 111, 130, -221, 109, -167, 42, 137, -285, -68, 4, -76, 130, 64, -66, 47, 153, 45, -163, 74, 244, -70, 421, -9, 39, 46, 156, 185, -5, 24, 437, 125, 2, 133, -174, 119, 235, 4, 44, -110, -52, -176, -209, -150, -118, -57, 36, 334, 71, -28, -84, -283, -3, -3, -78, -14, -377, -239, -354, -350, 110, 183, 76, 88, 78, -134, 51, -156, -17, 56, -177, 123, 40, 87, 32, 60, -152, 53, 78, 68, -269, -160, -43, -65, 98, 210, -15, 202, 107, 210, 209, 15, 95, -64, 45, -128, -189, -76, 251, -99, 30, -58, -100, 37, 212, 80, -125, 50, -226, 57, -73, 241, -93, -1, 330, -229, -218, -106, -307, -232, -270, -267, -23, -45, 167, 319, -136, 8, -47, -167, -219, 82, 231, -58, -172, -40, 24, 140, -129, -162, 132, 208, 339, 23, 8, 86, -48, -156, -112, -241, -180, -246, 72, -208, 246, -15, 147, 20, -42, -21, 79, 150, 35, -360, 113, -36, -120, -97, -349, -155, -106, 479, -296, -241, 104, -161]
5671a61L48o06M63l9O7k3j55M57j38m6k97J31J74k48l7N15l20j09K67k16J00p5
5693E2j40J32k9M3j27q1J62J0M1k6J91k50J56R6m23J93j0k72M30j75J84l40j39
5716c22K40R5J66j16k98J08J27j00J97j87J55m1k43N18k18q5k0j10o6N56l60k29
5738b33N1J30M9M56l54m3J73q2l29L09L00n02N2nK13l75J10J53J64m56p6L50k01
5761a46L70m42J47N5J6K9J64m06K46O6j51J51n1k75L67k12k58K97k83M86r4j71
5783i5LK2q5K95j26l69L25M9R9o9J65l61K15k46j5M08q6P3J7m63K22j15J60K2
5807D5k64K28J69j80k1K50Q3J00m68m4m7m9L70k86k5M24Q8k66L1j72R4J09j58
5830A1J79m5p5p4j34K28j83J54m6N3k4J14l71Q9J56q2N1J49j24Q2j18K7L95l02
$$ y = [-161, 187, -419, 44, 5, 72, 49, -106, 351, 213, 167, -130, 1, 175, -73, -110, 405, 85, -24, 243, 27, 127, 52, -88, 44, 15, 58, -69, -150, 12, 22, 63, 37, 228, -22, 134, 230, -193, 0, -10, -282, 148, -27, 157, -183, -322, -82, 13, 179, 63, -235, -127, 0, -100, 97, -90, 65, 24, -219, 299, 81, -4, -24, -134, -200, 356, -4, -233, -182, -52, -3, 453, 99, 56, 229, 147, -182, 127, 427, -75, -23, -28, 185, -190, -80, 73, 237, -219, -295, 55, -146, 224, -218, -71, -16, 0, 29, 193, -213, 33, 99, -52, 99, 48, -227, 140, -72, -330, -33, -316, 170, 76, -95, -92, -70, -155, 140, 14, -355, -30, 19, 118, 49, 214, -147, 68, -178, -193, 215, 129, 202, 219, -244, -22, -137, 23, 45, -219, 9, 178, -2, -23, 227, 310, 410, -58, -102, -149, -198, 172, -114, -139, 285, 373, 107, 138, -34, 60, 169, 11, 190, 145, 70, -4, -138, 90, -93, 61, 15, 68, 44, 158, -213, -124, 32, -50, 1, 150, 26, 108, -10, 17, 412, 110]
5854A10K8l17L47j64J17m31J25L76P9j36O9j59L61o76L59j51O9k24J21j43K05
5875c5j83kK80r9J55j85o3J02P3k07L19J09m06L89k86J7k34L08k96L23K09m71
5897a83L8K7l1k0N08o67L26Qj14k3J13L8P4O3Rj57lO4o0l4n7J62o6j52K89p6n
5924G1J07j68r3L7k20K42J68q6j86L97l45K9l4Pl2L2L4J20l66K67R0j22K47k8
5948A68j18l22L19m7j95J02m9M41m3k99K11l24p4R3L03k46k0J42J67m5n3K06j39
5971A78j32J61l0l43J39K60m55L88k19R9l15M59m5j25K26l78K20j56k09OK43Q9
5993F1m8k44O19j64k55J82j74K42m0m00r4M98j96k52J37L63j78k94J63J05Qj0
6015B9M6Q1q7jq9M76m00n3J12R5k39K55n01K99J50j73K56k45J17l07K80m0O2l89
$$ y = [110, 138, -179, 168, 4, 121, -310, -185, 191, 270, 134, 203, 44, 405, -271, 88, -63, 6, -218, -97, -240, -35, -218, -220, 60, -39, 116, -69, -132, -30, 43, -164, 155, 264, -142, 247, -39, -22, -256, 52, -244, 79, 288, -183, -145, -118, -149, -169, 339, -328, -2, 6, -108, -131, -18, 20, 94, 157, 166, 9, 6, 70, 10, -24, -81, 81, 15, -137, 152, 76, 71, 178, 10, -83, -46, -266, -24, 144, 58, -128, 269, -76, -47, -81, -74, -106, -74, -40, 80, -286, -19, 71, -51, 196, 168, 50, -272, 47, 0, -195, -93, -142, 299, 256, -43, 168, -156, -230, -137, 166, -80, -100, 42, 209, 164, 111, 317, 178, 46, 207, 177, -166, -27, 233, -222, 166, -53, 46, -269, 190, 145, 20, 246, -132, 88, -68, -277, -271, -28, 61, 13, -231, 388, 224, -31, 151, -23, 219, 179, -221, -315, 183, -13, -265, -128, 235, 57, -237, -74, 31, 39, 29, 75, 156, 69, 68, -21, 455, 55, 2, 114, 209, -30, 225, -276, 23, 173, 0, 256, 11, 128, -179, 101, 61, 123, -266]
6039b66N5J41j29j59L94J6J8n8JM5k96J19N8P4j4p7j69L56R8J8l09L26j42O4m25
6064b61J81n8J62r3J53k30J70k34J45k4O2J49k74M6O1J8P9j5k66L35j87M61j28
6087B52o4j24K2m24K75K38m49J89J23n5j16J61J54p1j57K87j51r5m9J20q6k15
6109b35J22P7r0j06J75k3L86o57O58J26m49k04K11J28k81K32J96k35O5M2j27p
6131Dp1K03K4l66N9P3L01m48M56l64O4o7K11K28n58M9J48K17k67k7O48l77o10
6154d70O84l73J78j2mk60K99K6J4k02J6J94K04N6k68j3r8N8K43l65Q9j1J2J75
6178A72k97p4M29pj19j06j53J05Q0M3j11N0j24K49L3pk31K34k06l17K13l5M42
6201B63m17kM5K72j29K3pj53j49K46j68K36om4RJ58l42J84m0K2Q2j05n1N2l3J72
$$ y = [-266, -211, -70, -199, -358, 36, 52, 70, 12, 13, 58, -238, -119, -61, 13, -1, -78, -247, 109, 207, 225, -84, 242, 100, 164, -261, -80, -138, 24, -69, 84, -146, 24, -210, -65, -89, -27, 122, -152, -106, -45, -27, 52, 37, -229, 106, -81, 380, 252, 188, 64, 86, -338, -63, 175, -274, -85, 38, -17, -133, 28, 182, 111, -46, 241, 90, -5, -54, 66, -20, -235, -113, -36, -126, -232, -57, -80, 306, -351, 307, 433, -16, -220, -9, 119, -162, 70, 266, 31, 96, 138, 11, 4, -67, 136, 160, -206, -147, -74, 227, -221, 235, -129, -65, -132, 79, 307, -251, -202, -54, 163, -104, -131, 517, 140, -470, 214, -159, 19, 7, 3, -257, 42, 68, 82, -120, -104, 90, 294, 350, 82, 69, -29, 29, 272, -93, -4, -15, -3, 172, -125, -199, 230, 223, 104, -2, -155, -50, 30, 73, -38, 12, -112, 137, 170, 163, -68, 166, -40, -357, -144, -179, 263, -154, -156, -111, 161, 32, 55, 48, -105, -254, -8, -176, 60, 54, 10, 19, 177, -165, 19, -21, 1, 83, -22, -73, -21, -54, 118]
6227A18j3l34L31n21K81Q1K57k44K29j28r3L41k53J23k87L02j64R9j82P3K24l65
6249a25J44K24p9k17K00j13q4K38M7l25r6L01l1l5n1k23L19k55J89K5j20j7K65
6272A81J04l81J63r7j16R3P4k40oK95Q1l70K8o6J66LK06n05J80N55o49M4M23k26
6296f0j52L07l06N08k97mP8o2J4q5K15k35J46p1J8L19j81K16o55r2N03k78K29
6319G5J93l79K43k38m3K2L66l1k02k66N6J25j72J75N4R2j0R1o4J42k29oQ7K57
6343C38j56p9K9k50K9O7k57J07O9R5j48r5O52j61l23J27J16J23p6p1k43J37l29
6366b99N58k43O6J40j78j07O7K91l17j12lL80j65l22K4L47Q8l98n9M86l20J23
6388D7R2k20O7m1Q0l12Q9j38O67m43K96k98K42PJ78j40k07L67k97j02P8L23N2
$$ y = [118, 105, -229, 102, -419, -138, -57, 200, -44, 185, 57, -36, 305, 52, 175, -112, 190, 26, 125, -57, 16, 240, -125, 19, 243, 164, -53, 147, 34, -50, 188, 235, -90, -186, 115, 84, 49, -2, -225, 94, -161, 28, 53, -67, -84, 181, 285, -96, 67, -30, -146, -53, 21, -219, -225, 70, 151, -219, -191, -257, -91, -88, 118, -387, -207, 348, -301, -257, 166, -60, -212, 95, -211, 297, 0, -4, 74, 12, 26, -59, 156, -79, 67, -4, 14, 333, 152, 368, -287, -379, 124, -154, 75, 268, -111, 132, -106, -149, -127, 239, 208, 6, -260, -204, -79, -251, -76, -22, 70, 60, 151, 87, 229, 0, -6, 81, 338, 182, 103, 132, -118, -89, -22, -279, -172, -103, -8, -156, -251, 401, 240, -83, 44, 160, 283, 207, 136, -107, 30, -299, 259, 16, 82, 222, 44, -63, 4, 295, -22, -134, -137, 243, 78, -244, -220, 127, 215, -183, -242, 244, -76, 47, 139, -81, -14, -55, 25, -287, -198, -336, 331, -112, 184, -114, 128, 135, 313, 173, -34, 333, 36, -66, 12, 335, 387]
6411C87k79j05j31j85K44k2J20L7k37L67J7k38j18J08Q3k49K61l5n1K34o98K23
6433b67J97K75l8j57j95K01j58J59l1L6J27l75M02l93J45J25j56J46J5J9Pj69
6455h5R1n1MO3o9J55J42j59j84O8k03L54P4j63k1J76q7l8R3n3j65K11K23o36L98
6480A38l52J3J9M29l65Q8K0K17k06k5J57n71O49k38o2j2K26j60Q2R4qj66K96m77
6504b14N6J15j32K57j69K72j73N8j60p4J90J3L29k79k88K74j35J06N6k3j41k73
6526c35M04p5J01p5l9K01j67p2J02M7l03K38k58L47mn2J77L1m08J00l6K11Ml68
6550b29j3K36J33J26k54P9R4j77J95r0k87N0L11K4j08n5J52k90j12K70J92k44
6572Co1n2J00pL9J04j56o6M79k95j6j24K50j97j35R0J98Q9j04k66J13L34p46P36
$$ y = [387, 108, 3, -128, -313, -69, -91, 29, 66, -171, 196, 213, -25, -143, -35, 48, -201, 60, 25, -26, 208, -490, -267, -70, 205, 167, 10, -185, 16, -142, 17, -14, 22, 149, -226, 176, -217, -72, 53, -103, 43, 58, 77, 84, -85, 6, -45, -41, 22, -47, 108, 250, 91, -93, -25, -228, 126, 200, 37, 16, 192, 105, 67, 160, 107, -58, 153, 376, -260, 138, -214, -201, -182, 247, -118, -30, -10, 207, 1, -24, 133, -438, 211, -27, -89, -101, 125, -35, 47, 141, 133, -33, 263, -214, -158, -43, -175, 82, -87, 185, 12, 70, -90, -164, 26, 39, 368, 89, -199, 75, -60, 46, 102, 79, -62, -335, 69, -6, 95, 20, -19, 182, 15, -57, 45, 92, -211, 27, -231, 116, 112, 60, 237, 268, -140, -40, -76, 135, 139, -229, -242, -6, 127, 253, -1, 78, 172, -5, 190, 100, -187, -137, 174, 198, 90, 35, 187, -103, -215, 55, 247, 3, -58, -110, -10, -17, 22, 126, -30, -96, 383, 88, 72, -52, 198, 1, -134, -44, 154, 243, 139, -127, -14, 320, -426, 310]
6596C10k93K66k45j95J50Q5Lj11k6j35J96N5J05o6k20J16K7J27J19l25J8LL2j23
6620a27J20k31R3L41k69M31o24L21j22L05K3j01k77J4L43k95K97j65j41P1m6k55
6642b94L15k5K3R6j68K97J4l36K83k41K19j41j73O98n46j53J32P6l09K62k69K47
6664GL72j48l53LlL0j09J8J36J18j00J23J56r7j61p2J45Kj85J22J90l18L64l82
6688a42m8M31l27L40m28L81J02k3m02O8K5L34l36j38O2NJ32j83L2J06K40j31o58
6711e58P29J0k68K32p4l75L56Oj8j29K81Mj34j55k2j71M49k48j07K32m51N60k80
6734a31p8J60j06M5K32p3j11l2k0J70L61k90q2J05l9q0J40L5o1l44R5O0K21J56
6758C33k20j20L6j39J97k8q2K90n07L11k07j93J71Q6j75K25M6j60K38J41n05L55
$$ y = [310, 17, 283, 38, -157, -7, 78, 81, -30, -56, -191, 5, 60, 165, 99, -121, -5, 22, 149, 268, -57, -39, -36, -4, -127, -7, -238, -145, 196, -73, 358, -266, 55, -67, 238, 261, 160, -117, -103, 240, -55, 242, 77, -64, 7, -39, -294, 21, -4, 19, 115, -53, 244, 258, -78, 205, -36, 183, 42, -131, 567, 21, -132, 0, 76, -233, 29, -240, 7, 379, 231, -122, -119, -122, -92, -201, -183, -47, 71, -29, 94, 250, 153, -8, -80, 65, 67, -118, 4, 194, -124, 240, -142, -190, 241, -86, 254, -174, 207, 309, 286, -116, -48, -23, 311, -25, -163, -101, -96, 36, -147, -115, -9, 231, 100, -558, 171, 181, -87, 145, 71, -304, 52, 58, 40, -89, 192, 196, 62, -93, -115, -286, 163, -85, -192, 40, -411, 149, -131, -209, -49, -155, -110, 122, 49, -62, -94, -114, 56, 417, 127, 45, 150, 111, 31, 171, 206, 145, -199, -104, -44, 177, 333, 113, -7, 29, -110, 87, 59, -23, 267, -240, 71, -136, -329, -158, -72, -247, -22, 24, -136, 102, 243, -262, 93]
6780I3j29K3Q8o0Q2k14j29N89j67l2j44j2N3O7pp5L03k96M6k26l0r8R2K07m42
6805d18J04L24K98m62K13K6q6J95m4l87M36k41J69j80O5M6P5j23j5k24O3J24K0
6828b2L41m85L21%J48j41l03M3j55M72j64J50k3j27J61k26J16K3j42J02k04L39
6850B24k84k15M03l06O3L72j07l8p6o5k32R3K15k9q8L2J15j43J16j4j36K88j95
6873gJ86j05k09K08l28L61m38N43k12J73j21j43J52j24j1qK26k49M1J03J49k84
6895i7K73k62k4OJ15J8l84M59o9r4l1j67P5J20L83m10L42j23n1m9k79L4L98k56
6919g3K01j3J10l19K13NJ00m90K00P4k74K42p6J43k19J30j14L44j64K60j36l80
6941b36M20k5j04j79J37n4K07%JM4J42k56J87q7m04L1L6J63l6Q0j2K98m57K9p7
$$ y = [93, -36, -13, 75, 15, 97, -117, -246, 343, 176, 144, 0, -12, 41, 108, 101, 26, 329, 33, 79, -147, -177, -275, -183, 24, -418, -314, 10, 308, -154, 59, 85, -1, 194, 150, -237, 199, -42, 127, -53, 12, 58, 133, 10, -5, -229, -166, -42, -22, 319, -166, 155, 155, 303, 162, -141, -98, -253, 219, 55, 205, 182, 55, 216, -10, 106, 129, -13, 89, -115, 224, -60, -275, 128, -178, -115, 257, 150, 112, 36, -29, -261, -168, 47, 18, -70, -38, 77, -66, 50, 36, -100, 188, -7, 179, 74, -135, 73, -255, 106, -332, 211, -1, 172, 51, -92, 60, -64, -75, -83, 143, -106, -65, 38, 187, -97, 176, -86, -110, -104, 11, 29, -355, 104, 35, -59, -90, -257, -182, -62, 321, -89, 253, 130, 79, 30, -249, -215, 183, -73, 128, 115, 225, -94, 119, 124, 224, -266, -66, 8, -266, -24, -100, 43, -176, -46, -160, 184, 20, 280, 144, -236, 184, 159, 55, -124, 13, -41, 166, 166, 167, 211, 353, 97, 284, 197, -207, -176, -140, 23, -13, 67, 55, 353, -104, -75, -152]
6966a52K7K14O4j79J66j12J09q3k21L57j95L83l84j18P6K51l59J29J00R8j78j36
6988a43rQ4P4j78K94k17O5J06O5k88K76k15L81n74L22j23J86j35j3N9L01k77p3
7011c2rj0q8j47L37J37k47J67j21J56l59M38k50k49M67r2r4J94j35j74l8L1J99
7034H1j0l38L50k35L17m26M2M86j93K6l12J83K02L00m18j54K55j7j6l78J51Q5
7056a9l06N19j77J3K30l90N7J64L0j19k0J82j48Q3M2K00m29K81k28J94l0L0k58
7079i9J43r2r7L09j90l5K98j14p6J13j66J98k42j20L40m03J77m8J69m5m8j3p0
7102a11N9L42k54j18N04k67k91j28L80k40M42l82j14J60O8R8k44K48j19j65K17
7123H5m2j69P0N5j03J39N2M8l50J57J47N3j50oJ67m79L96J08J83k94k1j37J49
$$ y = [-152, -125, 89, 153, -26, 140, 28, 137, 54, -167, 190, -5, 378, -6, -124, -48, 203, -156, -27, 73, 171, -7, -143, -152, -68, 6, -172, 122, -95, -30, 76, 141, -147, 129, -86, 295, -279, 43, -80, 106, -29, -42, 17, 318, 41, -32, -41, -51, -139, -286, 51, 188, -59, 108, -13, 143, -216, 222, -28, -277, 190, 98, 4, 198, 63, -111, -149, -118, 81, 71, -267, 83, -152, 165, -261, -219, 267, 74, 100, -212, -29, 173, 473, 55, -99, 156, 139, 123, -255, -104, -19, -325, 194, 17, 30, 260, -130, -73, 91, 121, 2, -18, 164, 16, 99, 141, 341, -88, 193, -35, 159, 129, 159, -99, 44, -48, -145, 164, -26, -61, 237, 123, 47, 160, -6, 192, -50, -170, 170, -233, -56, -104, 65, 20, -28, -41, -111, -52, 290, 36, -82, 422, 155, -136, -264, 116, -124, 318, -64, -178, -18, 50, 148, -96, 152, 33, -132, 85, 43, -126, -56, -1, -104, 35, 87, 135, -215, -58, 89, 142, -8, -14, 153, -326, 70, 178, 361, 67, 46, -91, 58]
7146E8J29K11k84J91l16J2J68j37J32m19M27k00L60m68O4n6J84k53M84m04J97
7167H0j16m7K03p5k49KM97k85K00m48K52j68j23N70k32n8K13l61L2O3P9J1Q1n0
7191G1p7R3j40j9L39k21j03N5k13m1K28Lo5Qj50N6K7L67o6J82n29J32P4k00m7
7216b36K97K47k56J23j66q0J44k10K45p4J8l6J61l62N2L07j85L9R2l39J42P1R6
7239I0k38k3O9J35R1k31k5J15J49j51K69j05j83J09k26N6J86k22qJ07k3j59K47
7262B9j5K77j93L3k79J17o6K06k21L18j73N1J90n4n6M5l12J12j88K63j5O9j50
7285a2m3J84l47K1O2J89J99l42J07k74K49j01O7p3J71j53L81k13N6l09q1M91m4
7308A85l12K36k94J65R3P8Q5l92K20k60M68l00L52j62l67K23M4p8J96k10k37K67
$$ y = [58, 187, 398, 114, 305, -11, 1, 169, 32, 164, -255, 172, -28, 332, -136, -72, -128, 56, -197, 287, -117, 80, -36, -83, 120, 45, -204, -202, 295, 10, 210, -238, 14, -154, -277, 293, 61, 3, 216, -145, -113, -50, 29, 40, 121, 71, -6, 87, -53, -72, 267, 46, -57, -2, -215, -256, -28, -25, -90, -82, -232, -176, -149, 218, 152, 334, -195, -63, 11, -189, -236, 61, 308, 52, 175, 9, -71, 73, -137, 108, 34, 52, 16, 177, -185, -133, 174, -11, 28, 120, -219, -77, -6, 90, -148, -171, -102, 33, 124, -107, -132, -17, 132, -19, 250, 145, -38, 71, -155, -99, 87, -135, -143, -36, -59, -218, 29, 14, 291, 98, 131, -148, -31, -97, 109, -112, 206, 33, 84, 274, 220, 164, 209, -103, 9, -179, 84, 69, 138, -12, -55, 129, -218, -197, -135, 54, 253, -89, 18, -256, -7, -108, -41, -114, 57, -96, 285, 72, 128, -181, -262, 229, 185, -127, 109, -185, -20, 73, 151, 236, -156, 64, -196, 272, -28, 324, 162, -205, 18, 62, -16, 180, -30, -267, 0]
7330@R6J57j21j79m6P4J10j44J35J08q4O1j16O4j51k4o6lJ00m2K78m46L10o6k99
7355b94O28k11n07J64J7K61j98K37j37P2k53P4J54k19M13m91J72l6L9L4j07O7
7377a21L95k15j22K3J63j68n8k54J77L99j34m69M47j55K00K3j16J56k50J34l59
7398c04M37l4pj84J46J70l70J78j55j45M87k35l5J30Q8l81k8M04j62k00L35J02
7420B37j24P5o2K01k56l1j90M8q0P0L70l16N8j8K63k27l36N24r5j69o5J27K85
7443B89k36j49M01l96R1j6J18j90K08k47L47k05k5m00L42n6J25J05k79l8j08N06
7465A87o18M37J28P4p2P1k77K2o3j85L46J73n9k5k47L18j41M8j49M9k04K94j83
7488g6nnj07K68O6J3k40Q4L1Q6o0j97L3p8J99j7R7k05L21l90L82q4j95L69l27
$$ y = [0, 96, 253, 132, -47, -93, -19, 91, -53, 82, 190, 106, 167, 51, 115, -36, -60, -126, -129, -29, -71, 207, -239, 71, 5, -294, 334, 123, -384, -220, -203, 58, -140, 97, -40, 32, -221, -147, 7, -212, 201, -290, -118, -154, -115, -81, -188, -121, 274, 59, -63, -40, 123, -45, -103, -357, -180, 219, 85, -384, 63, -92, 108, 131, 15, 171, -79, 55, -304, 133, 99, 92, -92, 54, 224, -146, 32, -123, -268, 219, -16, -51, 79, 167, -214, -242, 162, 0, -200, 135, 237, 113, 188, 126, 327, 71, 40, -150, -102, -182, -112, 258, -58, 0, -18, 245, 18, -318, 206, 111, -58, -123, 4, 289, 53, -96, 305, -91, 0, -16, 102, -88, 120, -127, 220, 15, -10, -410, -68, -124, 1, 106, -173, -211, -319, 187, -431, 6, 134, 208, 136, 207, -70, -48, -111, -296, 50, 223, 164, 139, -108, 210, 69, 117, -32, 17, -187, 107, -76, -81, -86, -193, 75, 141, 154, -86, -2, 29, 115, 55, -142, -109, -187, 12, -5, 92, -113, 208, -182, 200, 116, -79, 290, -37]
7513c7M8M5o3l39N61k15J16j10n4j31N0M98l69j69K59r0M4K4j55O3N5J23j84M9
7537A9k42M08j76J89K9j49J59p9j08p0L54m27J09J19l40L96k36m2J70k0m21M88
7559A30j97j89K21K1J57Ql66K90j41K25j85j82K18n1o4L4l65L65R9P1j65J38q9
7582a7J45q5M6l40K18MQ5k2q7O1L2P2j08J53j2J57l97q9J2L85J25o2k60K09k49
7607b4J91m68M52l10J53J36j33j06J61k05L76l42m6J93j97L40m27K45K1L0m4J09
7629A05l22J14M52k23k52J31q4K30o8q2j05J90m6q9N5m8J20k44J46p0J34N13n31
7652B6L7j95J17k49K72k06Q4J84m4N0o1M3k64K98j79J11o1J20J63k34j20J23J6
7675C1R7Ol92J81O4j35K37o5l80L46p2K91n36N88m45K26j20J81k91K00J0P7j80
$$ y = [-37, 11, 56, -7, -346, 215, 0, 116, 6, -48, -179, -129, 369, 0, -169, 90, 0, 44, 68, -87, -24, 31, 154, -30, 19, -223, 185, 9, 198, 227, 78, 237, 158, 50, -20, 334, -93, 16, 135, -205, 191, -45, -87, 83, 63, -358, 130, -67, -256, -35, -14, 143, 151, -215, 75, -66, 159, -26, -208, 10, -41, -105, -71, -436, -71, 28, 99, -66, 72, -17, 128, 43, 89, -251, -33, -29, 56, 34, -53, 8, 40, 112, 4, 157, 145, 302, -95, -184, -172, 213, 338, 276, 16, 225, -24, 167, -301, 151, -159, -6, 130, -3, -109, 52, -153, 223, -119, -165, 28, -169, 171, -256, -11, 10, 40, -4, 105, -217, -103, 349, 126, -126, 5, -79, 151, 83, 1, -104, 86, 40, -49, 6, -42, 78, -166, -20, -90, 44, 557, 26, 63, -132, -15, -264, 8, -198, -114, 70, 26, 76, 15, 58, -206, 92, -87, 24, -37, 83, 246, 12, -108, 15, 31, 128, 134, -258, -77, -13, -148, 89, 24, -356, -10, -82, 209, -327, 261, -184, 42, -78, 103, -188, 12, 22, 99, -81]
7698h1J62L08k97l22K27k4N0L39k70K03m03K03J5M5p9K1m2j19j93N2j15L57r5
7721e8L81k12j3J52q8n7K4l15K35O3N7k72M7K48l32L39j75K6n4R7k0p2k30J06
7745a23K11K9QM7m28J87k97J54L9J66M0j30N8K71j30N1k3k61j0K43P8k29J74l61
7769b36K47j56L15P4j57m8J22k23O5j07j54o8J46L01j76j6L26k46J81k86K21j51
7791b6q1K76l44K54l68K76R4j22j68J70K17k41l1K63j6l38k2J71K5O4m6K01n2
7814A56j96L68l17M5K39k44k63K61P2k20N5J24l13K29J06N9l54K76k39J73k31
7835b14K99m0J65j72k42J55j72K89j49j19J8K43j18K5j54K72j94n0j71L21Q8J46
7857B26l98K54P5l74J98J92l79J44J45j61j23L18l05L93M2j95j62O1P9r3K86l62
$$ y = [-81, 81, 389, 92, -230, -3, -27, 23, 362, 92, 295, -108, 95, 110, 155, 76, 97, 55, -64, -257, -205, -320, 37, -58, 323, 111, 98, 250, 162, 105, 129, -186, 49, 112, 169, -103, -56, 192, -140, 199, 24, 50, -4, 93, 73, 1, -229, -123, 88, 117, 125, 172, -256, -69, -366, -212, -173, -7, 33, -97, -39, 232, 102, 153, 130, -131, -141, 102, 180, -49, 125, -236, 11, -145, 170, 244, 87, 39, 161, -62, 3, -104, -258, -326, -180, 121, -55, -71, 255, 9, 190, -96, 125, -26, -107, 169, -175, 79, -289, -13, 81, -41, -209, -39, 178, -63, -94, 169, 153, -185, -207, -36, -11, 53, 7, 208, 156, -40, 328, 11, 56, 295, 51, -212, 49, 121, -99, -44, 80, -233, -4, 102, 161, -193, 83, -156, 17, -214, 85, 45, 210, 38, -204, -49, -221, 68, -81, -200, -182, 61, -57, -32, -186, 86, -108, -158, -329, -8, 80, 226, -172, 82, 157, -217, -19, 173, -206, -62, 83, -78, -201, 117, -188, 205, 247, 52, -110, -49, 30, -63, 223, -139]
7879a39n9J5Q6Q9j14J38k42K57k36K10o2L10k03M9KJ00k30M0J53n6l2j55Lj9J80
7904H5k81J65K10k52J69k29L25j83ol4L8q0K4m5j45K97l21L27j47k07L45L2k42
7927a55M17m53K55l03J95j89L67k71J11j64L13k38qN0r8J17J59r2J65j71r5k50
7949c38L10K83k80j73J68j60L53l09N1J66k33J13p1M30j95N8l89L19O2j09j37
7970h1L37l13O7L8j68K10k45L16l74L68J6J23j70j9r1J18j31J00n5L2J27n07K28
7993g4L28m36J7L31J50n30J72j09K46q2k20L21j66J9J58k96R7N0j16J40l75N77
8015B02l52N2J91p4l04RK87k80K37J60k29j50K21R4p0k83N69m34J09J16J6o6o3
8038d2q7L07k45L4o9J13o8l6J13j01J84O9k9l00K14k3r1L67k91p8Q8K47K36o50
$$ y = [-139, -198, -183, -97, -8, -122, 16, -226, 31, -205, 5, -57, 253, 50, 99, 101, 201, -29, 11, 164, 108, 76, -79, -76, -95, 85, -196, -31, 179, -73, 96, -133, 192, 9, 3, -31, 7, -73, -49, -94, -239, 58, -263, 64, -83, -290, 55, 87, -155, 262, -191, 64, -239, -44, -233, 134, -137, -26, -190, 123, -115, -123, -73, -171, -54, 105, 13, 178, 7, -88, -338, -28, 255, -25, -198, -30, -190, 163, -146, -95, 71, -162, -49, -120, 310, 115, 173, -216, 103, 165, 56, -81, 256, -57, 10, 48, -120, 90, -155, 161, -213, 155, 171, 294, 124, 105, 14, 132, 1, 101, 46, 78, 205, -302, -74, 254, -182, -165, 166, 316, -214, -42, -151, 95, 13, -207, 114, -52, -33, 125, -171, -74, -24, -140, 0, -375, 202, -150, -98, 93, 19, -285, -276, 11, -269, -32, 128, -101, -251, -30, 64, -6, -289, 280, -154, -45, 71, 87, 21, -42, -129, 178, -67, -33, -102, 11, -57, -93, 20, -81, 103, 172, 143, -157, 57, 34, -57, 310, 19, -59, 29, 276, 512, -138]
8062a38J28O5l7m5j60J79K69m63P4K52L6j5K4k15p2j8j3O4M43jl12k21K99l17
8086a94J26j91L45J13p2k76K47j14K3O1j52N6K48m87K33K69j14j45K48k33J11
8107A02r0J75k03k3M10p47L16N2n7L13o26L78j63Q6M6k02L71n9O5m7m0J92m32
8130a83L3n0K30J10p2k69N2K0J59r1PJ3m56M51m0L02j12k39J49q1K10k2k68m8
8154a95M0J86j02n1N4KK43l06J49J67j12q3nl7k1j59L47J22p1j90J73m65L59l56
8178c11K64J02p4J76r8Jp6p3j17K42j76K3J31
$$ y = [-138, -10, 55, 18, -27, -187, -8, 261, -202, -128, 124, 160, 145, 169, -46, -118, -136, -149, -85, 358, 357, 45, -176, 123, -194, -68, -259, 86, 199, 127, -149, 98, -16, 7, 68, -84, -28, 220, -267, -34, 235, 121, -24, 224, -9, 102, 12, 187, -16, -39, 371, -376, -60, -8, -65, 248, -378, 0, -163, -77, -31, -233, 138, 79, 144, 97, 57, 249, -183, -150, -200, 30, 140, 68, -201, -149, -129, 30, -61, -54, -41, -497, -46, -86, 216, 104, -135, 14, -67, 143, 121, -147, -195, -155, 31, -71, -122, -68, -66, 177, -129, 20, 187, 75, -8, -13, -50, -71, -230, 117, 239, 168, -22, 151, -314, 45, -311, -47, 55, -19, 157, 59, 60, -16, -89, -206, 36, -140, -117, 14]
8191A4
$$ Imaginary data points
##PAGE= N=2
##DATA TABLE= (X++(I..I)), XYDATA
0@%%%%%%%%%%qJ6j6J6j6K4l2L2m0M8n6O6p4Q8j02J16j32J50j71J93k16K43k73
33a44L06l42L81m24M71n23N80o41P11p87Q71r67J071j188J322j476J656j867K120
52A130k429K814l317M003m992O556r425J6397o4870r8001P0082L6161j2434J0179
66d8146O4887j15o0657k4748L0729q478l9022K374M6845J4801j1640J0106K7107
79D043j0026l6730j4229J6530J1746O737K1561L0630M282k1158j6549J959P85
92d19m295O406J9859J4397J772M71M477p19j0809q482J83L719J102K131N380L804
108C8977k276o220n480m39L335k231q972o033K909m11o978J533R997n692j8746
123f727j941J2661m635j7741M716J7325o191j5557R912J4908j2901j8902O224
$$ y = [0, 0, 0, 0, 0, 0, 0, 0, 0, 0, 0, -8, 8, -8, 8, -8, 16, -16, 16, -24, 24, -32, 34, -40, 48, -54, 62, -70, 80, -91, 102, -114, 129, -144, 162, -180, 201, -223, 248, -275, 305, -336, 375, -412, 459, -508, 563, -625, 697, -779, 877, -990, 1130, -1299, 1515, -1802, 2201, -2791, 3765, -5660, 10737, -54133, -152134, -82052, -45891, -58325, -48146, 16741, 16626, -44031, -68779, -38050, -46528, -85550, -83176, -36331, -21530, -33170, -23064, 4043, -5983, -42713, -56942, -40412, -28666, -21929, -368, 30262, 34544, 13386, -3163, -1204, -419, -4714, 1692, 21551, 35948, 37720, 38191, 42668, 41949, 31140, 22658, 22841, 26560, 27662, 29793, 35173, 38977, 36701, 30481, 25001, 24562, 27897, 25666, 16694, 10661, 13570, 13159, 6181, 7714, 17711, 12019, -6727, -8668, 3993, -642, -18383, -13667, 3658, -2533, -18090, -8178, 6730, -6171, -25073, -18849]
136a8849R214j1841n203K2229J8523p936j0441N392L99j3796n405J3976J1727
149G989j824K114J3146M646j2896r466L893K375m015L927J4309P339l695j794
163B6048P71p723j2621k795O804N760M400N623L174m482q648o268o272n531O33
178a127O233N659R08j310l072p320p667l406P24j121J988P582M201n545p951k457
194a3681l789o337J96Q468N069j254L399N612m764j1001k717N064O38n40O890
209h747P840j432n164J960K492m239l349O292Q718R60k690J473J202n536l982
224d202N110N537o14R66O342J839p550n203K465O74l325K341O315k07m874l65
240E249L274m558p450J912O060K9l188L138J467o487o235J770J254l022j03Q270
$$ y = [-18849, -9635, -21476, -26679, -4450, 14073, 6137, -4304, 1088, 1487, -12309, -17714, -3738, 7989, 6165, 8279, 21425, 26071, 13175, 3709, 7602, 9977, 5962, 9889, 24198, 31537, 27842, 26048, 26819, 19096, 6475, 3680, 10484, 16244, 20644, 26267, 29441, 24959, 16311, 10043, 3771, -1760, -1127, 5106, 10765, 11673, 10363, 7291, -29, -7696, -11102, -10378, -11499, -9511, -1929, 2272, -3273, -11224, -13681, -17470, -23807, -23611, -15143, -10074, -11328, -7929, -2317, -7081, -18082, -20799, -15735, -15097, -15637, -8747, -907, -2339, -7503, -5543, -3051, -7290, -10639, -4347, 4371, 5331, 2641, 4114, 5316, -220, -4202, 908, 6445, 5831, 6797, 13139, 14978, 7428, 2225, 4690, 5364, 2039, 4380, 10695, 10488, 5614, 5249, 8523, 3965, -3485, -1573, 4487, 4516, 1328, 4466, 5933, -554, -6789, -5019, -3765, -6787, -6890, 1380]
256A380M272n156m633O17k027n094J562O822J919k986J523M414l026o517R20M873
272a137K08j419M525M097k134m158K537J729l891k697M898N894n80j590K029O66
288H977n321k049L575J459k547P65N208M08n641k020K084j934k745K921M509j386
304F263l837J418J405m862m623L128L834j727j011K814j15m832j408L651P6m686
320d512Q3N174J519l070j41K082l264l705J922M408o03m45M042K714m127m552
336b475J145J524j746O98N491K074l692j079L086j089n458j158N117J909k839
351A508J835M085k641n980j58M010k256l999L431N840j511m811J466J714n150
366b617m367L620L889k706j278N084K509n850m917J833J439k376O75N334J774
$$ y = [1380, 5652, 496, -4137, -3520, -5547, -10641, -9079, -2257, -338, -3324, -1801, 2613, -413, -6930, -6010, -1137, -929, -2348, 2177, 6274, 4140, -18, 2519, 4248, 357, -2340, 2558, 8452, 7872, 6282, 8311, 8977, 3656, 1607, 5182, 6641, 4094, 4859, 10067, 10475, 4834, 2814, 4898, 2964, 219, 3140, 7649, 6263, 2426, 3844, 5249, 387, -4236, -1108, 2726, 999, -12, 2802, 2687, -2145, -3553, 98, 174, -4512, -4429, 745, 2264, -806, -947, 1135, -2129, -5834, -3912, 496, -107, -552, 3490, 6204, 2077, -2475, -1330, 194, -1552, -854, 4637, 6711, 3019, 1940, 5026, 3937, -1521, -2679, 2438, 4347, 1508, 3343, 7428, 4787, -1193, -1351, 2659, 403, -3596, -165, 5675, 4164, -647, 819, 2533, -2617, -6984, -3364, 525, -2181, -3459, 1625, 4134, -1716, -6633, -4800, -3361, -5737, -5062, 272, 2046]
381B046m525j438L306l05m729l08M269J881k078R76K587r87k729J013K167j825
397f79j501K511K983r80j131J421L65k202k10K021nj906J727K814r82k719K07
414A734J995j627q87J842R15k845k235K923J379k301r86K463l46l786j235K684
430c13q2l020Q43L993n55n201r69L183n68l134J034K889p76k525J502K719k980
447c960l557K105L469j489k352K939L218j897k316K251R33k902r20M279K720j957
463E64o34L548O52k991r52K559K69j006J966L025p80l487J189K379j314j528J329
480D788J514k546p11K521O67l214j043K390j40l464q44J749k63k196N96J676k129
497f49l539N22J857j991k602J462K116j789j479R03P89k461r12K170R99k702j064
$$ y = [2046, -2479, -3917, -611, -916, -5645, -5953, -1684, 197, -1881, -905, 1682, 695, -2034, -1021, 1146, -679, -2180, 331, 3314, 2334, 1203, 2624, 2989, 787, 577, 2598, 2593, 687, 2414, 5228, 4246, 1527, 1734, 3729, 2102, 1215, 3057, 3972, 1127, -1108, 1815, 3194, 893, -93, 2370, 2024, -1762, -2997, -313, -395, -3415, -2572, 1421, 866, -4335, -5304, -2121, -2689, -5823, -4789, -1900, -2676, -5201, -3699, -980, -3960, -7517, -5412, -1943, -3432, -5784, -2845, 373, -1524, -3840, -1589, -656, -3558, -4478, -199, 2521, 564, -70, 3478, 4130, 1139, 187, 2746, 3015, 2009, 3975, 7000, 6220, 2733, 3922, 6301, 4987, 3459, 4788, 6302, 3756, 3045, 5566, 6233, 3019, 1976, 4366, 4226, 762, -82, 1667, 1404, -792, -196, 1480, -649, -4188, -3666, -1809, -3800, -6402, -4940, -2824, -4613, -6092, -5189, -4400, -6861, -7773, -5603, -4604, -7306, -8370]
514h370L818K114j874p56J831K50k120L35L783J030j273J533L741N4l810K76L014
531C576M17j064K042K924j119j912J786J892k145k451J988K100j277j203K369
546G923O29k756j878J435q18l971O4L124J53k017j17K39l047k966N08N40j854
563d809j249K440J604k343k169J81L4k019l14K493lj171J000K697l50k794m70
580g242J780L27k17K600K955J25o16J125N59k394q15K749K834P68O04J542N47
597G231j576p67J059m3p61P96K689O59j679j260J31m36k121J06J329l09j902P67
615C913J573k318l405o67O11j476p48J935N42k662j140J204j241l250r35K950
631e114J032j917j04Q84k74k354Q80J779j39r88J891K196j022j920O67K615j96
$$ y = [-8370, -4552, -2438, -4312, -5068, -3237, -2987, -5107, -4772, -989, 41, -1232, 301, 4042, 4096, 286, 562, 3576, 3993, 2929, 4971, 7895, 6776, 4864, 6650, 8542, 6397, 3946, 5934, 8034, 6757, 5554, 7923, 8552, 5796, 3918, 5353, 4535, 564, 628, 3752, 3905, 1888, 1771, 2010, -1037, -4003, -3495, -2955, -4809, -6058, -3618, -2014, -4357, -6526, -6345, -6311, -8330, -8644, -6151, -6154, -7325, -6325, -3628, -3978, -6772, -7242, -5462, -5135, -5352, -2752, 203, 328, -288, 837, 1396, -998, -1813, 936, 3770, 4538, 5142, 6684, 7231, 5655, 4888, 5947, 5904, 5143, 5939, 8628, 9287, 7608, 6348, 6479, 6043, 3922, 4028, 5357, 5048, 3146, 3913, 5486, 3168, -237, -904, -293, -1769, -2517, -582, -40, -2702, -3842, -2638, -3879, -7129, -8064, -5114, -4082, -5999, -6103, -5219, -5493, -7847, -6967, -5188, -5327, -6315, -4424, -2228, -3250, -5170, -4503, -1888, -2084]
648b084n01K311J366q76n4J891L30j610NK431J511o9L84P76q12j133L19Q50n37
667D498j104J136K158k07j875j202k44j504j175J589J647j130j206N97m35l248
683a705k294Q17J393o38L59J836q63k784j065J016q93k709M65L406R39p80K85
700c215R13j731j840K92K445p94m88K896L075r76k138k9O79j892N85L126K311
717C219p22M62J048p48k814j254J534J273M76J644J214k41j777o00l66j540r75
734a67O08J928L11l10L5n68j153j484r44rk84M07K043O62j135j858j314p76j252
753e260J226J637Q68K12N08J62j856k303m12J994R61P48J009O45j043j056J136
770h24Q95j770o69J946J879r48k56J591P87k344p06K041l70j619J723L202m57
$$ y = [-2084, -2585, -274, 1092, 216, 162, 2053, 2383, 773, 778, 3209, 4720, 4651, 5035, 5811, 4999, 3866, 4185, 5035, 4498, 3394, 4530, 6688, 6481, 4606, 3404, 3160, 1656, 481, 2070, 3717, 2587, 1381, 1978, 1543, -1705, -3999, -3182, -1789, -2427, -2068, -232, -1095, -3879, -4944, -3928, -4821, -7530, -7065, -3659, -2720, -3500, -3215, -2302, -4033, -5873, -5581, -3136, -3930, -4418, -1522, 1553, 577, -1561, -1590, -911, -2803, -2218, 908, 3219, 2497, 2959, 4007, 3259, 445, -809, 725, 1998, 2474, 4118, 5332, 5091, 3314, 2714, 2348, 808, -167, 441, 2369, 2680, 2370, 2405, 1837, 684, -800, -1744, -1753, -2037, -1630, 413, 1075, -60, -1918, -3232, -4008, -5260, -4034, -2397, -1529, -1317, -809, -647, -2503, -4806, -5218, -3224, -2263, -1515, -506, 139, -904, -1960, -824, 71, -1699, -2368, -422, 1457, 509, 253, 1844, 2631, 287, -419, 1622, 1252, -367, 1356, 4558, 4101]
787D101l294o95P11j081q54L232J976k004j561J82j40k215p39K540J505j469q77
804f82Q80j386j458J024J691n89j922N46J266k92r69R08j03j720k26J493Q79l95
822a055Q87J945n03k516j418M41L99J046K399J718m78j920j080M14m43q35J289
839B90J981O65j142k49N69j332j602J143J270o27j371J923K002j480k045r6k25
856c26k191l35K250K444j018k21J300j244m017q46J499Q27m5K274J366j286k557
873b126L05J109j617j422J989J918j95l22J329k75k528m10J838j55q11J353K401
890B381L78j664k18j76j680j412K126K312n06J04J420L12j897k489N19J038r54
907d06O85K230O58j984j214J036n86k142j56K590P62j351jR51r01k037o0J610
$$ y = [4101, 807, 112, 823, -258, -1112, 2120, 4096, 2092, 531, 713, 573, -1642, -2381, 159, 1664, 195, -682, 198, -1188, -2646, -1622, 69, -520, -2442, -1896, -630, -922, -1891, -983, -1086, -2806, -3032, -1539, -660, -1055, -168, 1777, 1274, -1242, -2660, -2219, -1820, -774, 1625, 3343, 2865, 945, -135, 279, -164, -999, 290, 2271, 2936, 1794, 1545, 2114, 782, -820, 323, 1593, 966, -405, 1518, 3520, 2040, -5, -101, -326, -2517, -2852, -602, 1842, 824, 603, 1903, 659, -3358, -4204, -2705, -1878, -1923, 351, 1717, 431, -2126, -1821, -712, -2329, -3751, -1762, 156, -39, -361, 968, 693, -1835, -2245, -407, -562, -1373, -20, 2381, 2759, 1095, 877, 701, -979, -2391, -265, 2047, 1541, 1645, 3065, 3377, 1480, -1009, -490, 548, -406, 279, 2509, 3167, 1183, -31, 1005, 419, -1723, -1879, 711, 1473, 122, 121, 1072, 171, -1866, -1926, -316]
925c16l10j261J266J898n65k042j67J55r22n83J579J600j191l38J255j8j601j124
943b685J036J179m34N91R06m37j623K31P53O0n36P66J284O9j185m27K7n90L15
962g00J078Q58l25n11Q37K50p63j122J86L33j90R76J174J42j563m36P03o57r26
981f56P12J463K22m99J26k89j573r84M45R62k13J45J154L65j054j762j31m63o36
1000b666R78J584n5m11j75N04j149j257L00k54J47N16J247R72j007q89P9J0j407
1019b933j93J524J176P41J48O35j247j876J90J612P16m18M87J406K53q57o90P72
1037A446q55r58J290J099K62j41Q94Q28j493j947J98L55j15l36K219M23j380j007
1055G82K55l76j794k38J304P56p64q0K1n19j703l8O93m25p87O32R91k99o30Rm35
$$ y = [-316, -626, -1887, -621, 1277, 712, -1330, -1497, -1342, -2264, -2847, -1268, 332, -859, -1197, 58, 40, -1561, -2685, -1649, -470, -904, -313, 593, 156, -1467, -1236, -483, -423, -959, -193, 1091, 1160, -25, -452, -425, -1015, -700, 378, 1236, 911, 400, 1237, 1487, 724, -398, -212, 121, -69, 907, 2081, 2223, 660, 224, 927, 270, -656, 56, 1519, 1741, 1242, 1368, 1079, -494, -1478, -1033, -71, -284, -139, 1015, 1380, 326, -1436, -1567, -2030, -2666, -1688, -104, -159, -570, -745, -241, -1390, -2647, -2347, -2601, -2454, -1938, -691, 281, -726, -1615, -1536, -1526, -2933, -3126, -1602, -426, 315, 463, 1098, -149, -2025, -1835, -223, 493, 75, 562, 1968, 2221, 1364, 674, 1446, 591, -367, 923, 2022, 2284, 2143, 3037, 3865, 2372, 425, 623, 978, 863, 527, 2746, 3169, 1789, 782, 1037, 661, -1133, -1371, -67, 689, -75, -155, -134, -653, -2356, -2394, -1701, -2126, -2913, -2281, -1290, -1589, -2219, -2210, -2645]
1076b645o13m23J031L70L9Q4J158R2q31l06J75O30j24Q32J498q3j029N97Q21q60
1096D13j33O84J007L39o7J50N62j029n88J362O14j042n53R06P13j150p90P55j73
1115A980q14K69O97o77j539J6P26k48j576J91N96o23m69K90J55j651o93P75M25
1134b170l77n82R14P35o84q34Kk55n55M85J801M11l34m7O05m72j46n6J071K67
1154b21M05J027O02q19l01N84N40m27k64Q64P98J46R7N70k82j016p00N76L76o07
1174A948L96J081L4j268k48q45o44q24P60Q22j40q69L61J50n83j308l40J65o51
1193b003J48J077M12p89r53R67l98j062q3N87O18L9J165M90m43j294O8P39j2j31
1213h58Q76J220M75m31L57q22p22N00Q88O63l83L26R04k92l75j45j92m07j83K66
$$ y = [-2645, -3258, -3681, -2650, -2280, -2241, -2157, -999, -907, -1738, -2044, -1869, -1239, -1363, -531, 967, 884, -145, 452, 1273, 413, 280, 964, 1971, 2310, 2243, 2393, 2955, 1926, 1338, 2700, 3314, 2272, 1719, 2625, 3338, 2188, 1398, 2153, 1980, 1166, 1435, 2132, 1455, -84, -68, 658, 410, -1166, -975, -379, -1002, -1471, -1181, -1026, -2677, -3370, -2595, -2170, -2547, -3129, -2215, -1480, -2164, -2998, -2996, -3251, -3806, -3321, -1520, -1109, -1443, -1490, -885, -1357, -1503, -1559, -488, -221, 184, 1211, 1813, 994, 693, 1277, 1817, 1390, 1126, 1990, 2788, 2934, 3031, 3601, 3319, 2303, 1603, 2179, 2555, 1948, 2344, 3425, 3459, 2191, 1943, 1098, 454, -370, 390, 1212, 1072, 203, 564, 714, 131, -1177, -1517, -1352, -2003, -1855, -778, -366, -1155, -2108, -1141, -1539, -2601, -2684, -2097, -1479, -1440, -275, 215, -228, -1522, -1454, -715, -727, -858, 18, 1238, 1713, 1282, 1639, 817, 95, 595, 1483, 2146, 1763, 2089, 2993, 2701, 2326, 2181, 1989, 1582, 1399, 1665]
1233A665J216m37m20J05L14j072p97k90K00J85J34M16j8r83m52J06j9p62j06O94
1253c21K17k53K28k92l43m18J95P22j19r96K63J024J14o45K82M21j35j58O22L16
1273G24p79K66R85Q12j170l71O65M49l54K10N83l72r55L27R59j99r27M25N97q75
1293A000l99J91M93p67l37J041L85j387n44N39N35r17l57Q10J37q70k0J048o40
1312e9j412N47J358o97p83O57R93k85j42N63Rj017r39J185Q45Oj83J109M39j006
1332A188r46O62J26q54Q26J501K60j259o7Q56n25j448k35Q52K63m63J079P90q46
1351A760j680L9N36p23r66J196O55j01l06o9l61j242o78P43M86m7PR43M69j210
1371e49o51qm06j05M81J705J54m88j42L93j52j052J24L02P90P12O28J35o66l69
$$ y = [1665, 2881, 2444, 2024, 2129, 2443, 1371, 574, 284, 484, 669, 803, 1219, 1201, 218, -234, -128, -147, -909, -1015, -321, -104, -357, -129, -421, -764, -1182, -987, -265, -384, -1380, -1117, -93, 21, -624, -342, 79, -56, -214, 408, 724, -55, 211, 1196, 2008, 838, 467, 1132, 1581, 1227, 1437, 2020, 1648, 693, 1020, 1979, 1780, 853, 1278, 1875, 1000, 601, 792, 1285, 518, 181, 1222, 1607, 220, -324, 215, 750, -167, -524, 286, 423, -447, -467, 581, -59, -1471, -924, 434, -263, -1046, -389, 604, 319, 177, 740, 749, -268, -1207, -22, 823, 829, 646, 1755, 2194, 1188, 242, 904, 1030, 176, 1002, 2503, 2763, 1504, 1437, 2293, 1768, 320, 85, 937, 1200, 737, 1816, 2606, 1760, 80, 119, 655, -68, -1034, 162, 817, 716, 410, 341, -20, -1262, -1940, -1197, -711, -758, -751, 192, 661, -549, -1200, -1208, -1614, -1719, -1238, 467, 621, 133, -9, 384, 232, -820, -696, -394, 396, 1108, 1736, 1871, 1205, 836]
1391H36J19J36n60k45P86R64k05j28L89n60o98n2M69j35o75L96Q13j16r07k13
1411D14n18l05j42N03O50p96m04M64j28o52m77K03o8l28M74K55j49o09L03K95
1431a015n83J06k55M61M02N53k73k13k04K06K12K03Q5K60K15l28P83q1m24O8O89
1452H67M26k2n59K10mj25k84L53L0j29J16P72k55q49l24K69K6k97Q7k23K09n01
1474b07Q1L04j97q72n58N99Q48k32j21jN8j130m00M7J2p0J050K01M06o02p51K33
1496a302j21k81j09J233m0l2M33K15l11j174k39J238K21n29K37R18N26p86j52
1515e5R2j021n65Q86J149O23l70J98J3j391q95N46M42J34Q00R95j08j390l32K66
1535A7j51p01M13P16j54M3M26L18o53j048o0Q58q03M45M54L09N12o09m21m16p91
$$ y = [836, 955, 1091, 531, 286, 1072, 2036, 1831, 1703, 2092, 1532, 834, 782, 1251, 1116, 441, 837, 1650, 1534, 627, 414, -104, -409, -551, -48, 602, -194, -598, -134, -262, -914, -1391, -1188, -1256, -1584, -1110, -855, -1004, -1613, -1310, -1015, -1598, -1492, -1747, -1286, -884, -331, -604, -817, -1021, -815, -603, -400, -315, -55, 160, -168, 615, 534, 110, 178, 867, 1293, 1271, 712, 922, 918, 793, 509, 862, 892, 763, 879, 1651, 1396, 547, 223, 492, 518, 221, 308, 85, 294, -207, -126, 178, -19, -891, -1449, -850, -2, -234, -355, -356, -298, -1428, -1828, -1781, -1769, -1839, -789, -588, -182, -784, -1535, -1302, -1423, -1704, -1813, -580, -620, -652, -219, -4, -315, -1489, -1728, -490, -269, -798, -561, 357, 883, 97, -55, 37, -984, -1549, -663, 486, 1109, 739, 937, 950, -441, -1336, -790, -348, -214, 586, 1581, 1473, 83, -249, 17, -134, -835, -422, 294, 140, 183, 609, 927, 274, -774, -834, 24, -779, -334, 120, 429, 941, 332, -89, -505, -1296]
1556a296l17J363P49p7o5l63j69n42p70J85M95N13j67R84P4j235k99O66J24p87
1576i34l24O31J17j17K53Q38n41m95M4M59j87k46M62J051Qn67o51L95J0K1J088
1597A315K82q45n3N36K66m70k71N84J87k32L47N22m07j025O85N39p9q61K45K80
1617A545j09l70m7Q2p35r4O39J66m14l87p9K09p35l62Q1K59j41N94N21o63o20
1638f60j54l7j62J97K95N16p9l1O3p9m44k31Q33l9r7P21J63M95m85k31j05q7l60
1661BJ116J084k03j5O9q3l20q52l4K42J63L81M85M59n02o89M6l06q30N07lM42
1683A159l41j04n8n88q05l55P03n27K7J18O45l26k47n86m62l41l3M87O92r6J90
1704h48m1l46k27l63j54j13L51L85J103k85k41J06N29n06k56N44K56K96M5R01
$$ y = [-1296, -1613, -250, 499, 422, 357, -6, -175, -717, -1487, -1302, -807, -294, -461, 523, 597, -638, -937, -271, -147, -934, -1258, -627, -510, -627, -374, 464, -77, -572, -528, -69, -256, -502, -40, 1011, 1019, 452, -199, 196, 206, 227, 1315, 1597, 752, 699, 1235, 1501, 1031, 760, 1344, 1531, 1299, 1646, 2168, 1761, 736, 1421, 1960, 1881, 1020, 1265, 1545, 1436, 1066, 1019, 1101, 366, 272, 911, 1077, 663, 276, 197, 406, -329, -691, -610, -351, -492, 102, 623, -40, -660, -814, -851, -1013, -816, -521, -5, -84, -115, -52, -131, -575, -806, 27, -12, -109, 612, 775, 1270, 785, 554, 449, 362, 2, 1118, 2202, 1999, 1984, 2053, 1970, 1650, 798, 764, 1006, 1169, 1550, 2035, 2494, 1992, 1303, 1349, 1043, 213, 720, 717, 1159, 818, 714, 656, 68, -737, -1092, -389, -916, -889, -771, -126, -452, -699, -1285, -1747, -2088, -2121, -1634, -942, -1038, -848, -889, -1235, -1462, -1825, -1979, -2092, -1741, -1356, -253, -538, -779, -673, -144, -650, -906, -362, -106, 190, 235, 1136]
1724A136l06p26k01P58K81n73K39L11m5j20M78J85q28m95J85P08m75j88M37K71
1744A032p51l83J02j02n29J96M24L78n46o20K53K2l5j71K38m54K41k8J44k34m11
1765a234j39J280j44j70l12L48K14r2K01R1k36l03R90J51k84N2K24l41L23j97
1785D22J98K95JM17K4K03j084k59M82L02J97K22q8p0n77j23J91p30M17L2M20o71
1807B21J23N3O2o85k44N7L23m92l2R65L3l74k94k93j78k54J33P86R6k7J69J62
1829C10n11r73J96M14K95K2L62O75l12l86N7K8n60n47Q25Q79l59j36Lj45j0o69
1851e42J01k33J50mO28J5m42k39r7j55n61L23M2j93L98M32k11m81n61l83O74m84
1873a823N33L22K01j50K07l19m16j76K22L25j07M44j3Q1J48M1L15r4o60J39Q19
$$ y = [1136, 830, 104, -97, 661, 942, 369, 608, 919, 874, 754, 1232, 1417, 589, 94, 279, 987, 512, 324, 761, 1032, 281, -102, 0, -102, -631, -435, -11, 367, -179, -799, -546, -524, -559, -730, -492, -946, -705, -733, -589, -823, -1234, -1373, -93, -237, -407, -719, -371, -157, -249, -48, 43, -193, -496, 494, 645, 361, 413, 637, 296, 619, 422, 620, 915, 916, 1333, 1357, 1560, 476, 217, 699, 1001, 1198, 1420, 1332, 1262, 685, 562, 753, 23, 440, 472, 892, 221, 344, 397, 459, -226, -470, -413, -90, -582, -614, 351, 384, 10, -284, -577, -755, -1009, -876, -90, 6, -21, 148, 310, -201, -1174, -978, -564, -269, -247, 115, 790, 478, 92, 149, 177, -383, -930, -105, 774, 415, 279, 282, 137, 127, -542, -441, -674, -524, -528, 100, 115, -327, -566, -663, -818, -1379, -1056, -1014, -1207, -809, -377, -588, -1069, -1630, -2013, -1339, -1823, -1290, -968, -767, -917, -710, -1029, -1445, -1621, -1399, -1074, -1181, -737, -750, -669, -521, -480, -165, -259, -919, -780, 39]
1894C9L72k99J23k8L57o69l40O64r8j9K83K34j2p56jJ79m6l05n2K71r6j78p4r7
1918e48p3m59L51l9l49p5J02L08rm51L18l02k32K89K01L8k19OK86J45m72M65J57
1941e62l1l33P55q6j89k54N13J85J33K77K15m21j80J89J31N6j29K17N11k08j04
1962F85J4k25j88J8j29K82j56l2M60J03m70m44k69l88K14k0K22P3j57j09J02o64
1984a078l32j88L50L52N24m08O2j00l65j61K25k82K70J93O20K40n23j40K3J54
2004e64m62J61J37L22L63L95K84l97o77j34M51q7K20K48P51j98K00m97k74l93
2024a51j63N00N03q6j87K10j72k97r3l20J6J89L21L84k15k27O7M9l96l96k1K8
2046d57J26O55l44J23j77k46j71k30J57K83J88L06k2K28l65n08m9M08L47n1p00
$$ y = [39, 411, 112, 235, 207, 564, -105, -445, 219, 121, 102, 385, 619, 607, -149, -150, 29, -17, -322, -374, -103, -199, -377, -451, -548, -621, -1080, -729, -768, -1117, -1192, -1090, -782, -791, -1242, -924, -1226, -1458, -1169, -968, -930, -1149, -1143, -857, -712, -1184, -719, -562, -593, -926, -171, -257, -446, -700, -187, -2, 131, 408, 623, 202, 22, 211, 342, 398, 269, 486, 997, 789, 685, 699, 474, 286, 304, 175, 457, 301, 269, 729, 832, 362, -82, -351, -739, -525, -545, -323, -250, -407, -516, -414, -1078, -1410, -1598, -1248, -896, -372, -780, -718, -818, -1183, -1344, -1119, -1401, -1131, -938, -318, -78, -601, -741, -718, -564, -1026, -865, -728, -406, -43, 352, 636, 239, -438, -572, -121, -208, 12, 260, 1011, 813, 1013, 516, 242, -151, -314, 186, 689, 603, 416, 626, 454, 157, 64, -256, -240, -51, 270, 654, 439, 212, 279, 328, -68, -464, -485, -457, -331, 324, -20, 103, -74, -320, -491, -721, -564, -281, -93, 213, 191, 419, 54, -454, -503, -95, 252, 201, -499]
2067d99O89k19J46J73j47j7k00L11J72lk66K56j31jj53l33j04O68j72L72r2j56
2089B94m01p5J53K31k7l1R4l81M68K23n73j32K65j0L39k78j4j12J00l06K38J22
2111A87n4j25P02k0k82l26j6J68j97j27L57J54l39M61K3l18m19l32N88p9j52M46
2133C00L00o83k3j0j68n23J23L89O78k43j96l54M39q32J68J76j41K55%O27J40
2154D22p04Q1j18N0n70P42K96p6K42N9M27o04l64j10P67n3J7N17L04k87n07J00
2176F31l89l26M27O64K37l29k12O6n82Oj94m9M87P0J05k12K46o42j27p9j69l12
2198f83J43L08O0R6K46k9m72q30k9L42K59j62Q00L0l58o9m31K92k64o3K84R53
2220D23p10J91K33q3k77J56K4K91k1L75lM90k59j88M1l01N02l89j2L19J84q2j21
$$ y = [-499, 190, -29, 117, 290, 143, 126, -74, 237, 409, 406, 140, 396, 265, 264, 111, -222, -326, 342, 170, 542, 450, 294, -107, -182, -29, 202, 175, 144, 238, -143, 325, 548, -25, -157, 108, 98, 437, 159, 145, 33, 133, -173, 65, 187, 133, 8, 710, 690, 408, 82, 66, 234, 37, -90, 267, 421, 82, 543, 566, 248, -171, -503, 85, 6, -146, 300, 600, -83, -106, -116, -284, -807, -684, -295, 383, 140, -56, -410, 29, -803, -635, -459, -600, -345, -345, 282, 422, -282, -201, -319, -269, -839, -97, 199, 123, 365, 424, 851, 247, -117, -227, 540, 487, 504, 1021, 1325, 1038, 531, 631, 242, -84, 343, 1007, 1244, 915, 703, 769, 187, 193, -1, -50, 437, 507, 612, 400, 646, 4, -123, -202, -371, -683, -540, -232, -172, -76, 170, 141, -331, -1161, -1190, -848, -589, -751, 49, 79, -279, -348, -779, -487, -751, -814, -530, 423, -287, -96, 137, 54, -223, -67, -43, 248, 227, 602, 599, 1089, 830, 642, 683, 382, 884, 495, 483, 802, 986, 904, 783]
2243G83l59k17J68J09K05l33l00J35p9j67J82p30K12N95j45j75k86Kk63j88K31
2264f20M68k02j99J01O2k90l02N31j38L08k27K70r6k87O94l18K61n36P7L76J51
2285H4L93K2K27l38l96j09M53j25K9N61M74n24j6k02l68k34M28J57k0Jk01J27
2307D23Pl39j72j96L68k4p7p9J15k20n1J72k82m07n7N58L80m4k64J6k22n76J60
2330h11K95k7J63K48M32p2o2J09p86K77j35N26J03k65K98M02J05p16r6K90l7P5
2352C16J19L67J4k59r7l33j89k30J72L52K21l9Q3o7o14m31K32k6o6L07J72J54
2374A58j57k43NJ28m43K80l85Q6K11M71l44l9j8n7Q7J32p6J6M64J4j85J07q7j17
2398Hl62L05P61j74j61m2N20k98j61K23k60O6j46R2M04j50m46p7O36l96j05J4
$$ y = [783, 424, 207, 375, 484, 689, 356, 56, 191, 112, -55, 127, -603, -391, 204, 59, -116, -402, -400, -663, -851, -620, -152, -354, -553, -452, -390, -680, -982, -451, -589, -281, -508, -238, -334, -621, 73, -245, 16, -520, -443, -67, 84, 477, 499, 726, 388, -8, -117, 336, 211, 240, 801, 1275, 751, 735, 533, 165, -69, 359, 516, 496, 497, 296, 423, 430, 91, -81, -277, 91, 67, -10, -89, 26, -194, -245, -73, -355, -762, -819, -261, 119, 75, -189, -173, -395, -971, -811, -516, -543, -380, -132, 300, 228, 166, 275, -511, -234, -369, 157, 260, -5, 293, 695, 800, 84, -12, 278, 241, 316, 435, 802, 816, 557, 460, 127, -62, -292, -120, 232, 453, 414, 497, 430, -184, -615, -383, -409, -475, -168, 4, 158, 1, -242, -237, -109, -552, -272, -657, -571, -360, 111, -233, -272, -290, -347, -260, -128, -204, -188, 276, 290, 105, 212, 125, 8, -354, -49, 712, 538, 377, 335, 855, 557, 396, 619, 359, 425, 279, 371, 775, 625, 179, 102, 738, 342, 237, 251]
2420B51j50j24k58N59n85Jn08N47J68k76J90j99J9l64Q3j47M16j52K04Mj23P9
2442c65j37j81M17m34O61k06J89N1J40j94m82L45J95K01j09L14L58k43q6K4K3
2463D81m28P0N43J83j8l5k63j69J37k14J19j48k57M00L68k97l41j61j29k72j13
2484e44K96J26l52K78K84m06j87k27l43J73M65q7M88k09q2j44J22j34m02J79J0
2505f96M97P8L10L5k43j69j01j27J06L76K04L69J7N9m17r1l56N80K3M2j01j9M13
2528G89l93j58J38j7n6m2j65K75q1k1o2j79J3n12k60L13K87J55j85J6k80p7J97
2551c05m61K32k76N45P2j43k74N09k39R4K7k03J28m3j37M27p9j76j72L68K9l1
2573a08N7j71J62n9N82l66j17o4j26K26l48N25J04l82J07J87o6l79p8M11j71k10
$$ y = [251, 101, -23, -281, 278, -307, -306, -814, -267, -99, -375, -185, -384, -365, -729, -646, -793, -377, -529, -325, -321, -444, -365, -502, -683, -266, -700, -39, -245, -56, -5, 135, -59, -541, -196, -1, 200, 91, 405, 763, 520, 434, 458, 481, 53, 123, 666, 849, 831, 796, 533, 364, 501, 287, 406, 258, 1, 401, 769, 472, 131, -30, -159, -431, -544, -248, -122, -474, -196, 88, -318, -505, -732, -1075, -902, -437, -524, -36, -245, -327, -471, -349, -483, -885, -706, -696, -199, -121, 189, 224, -19, -188, -289, -416, -310, 66, 270, 639, 656, 715, 298, 207, -149, 431, 454, 496, 395, 376, 789, 396, 238, 376, 359, 303, 261, 96, 371, 290, 269, 207, 28, 41, -471, -731, -418, -131, 24, -161, -145, -425, -502, -305, -766, -534, -810, -265, -193, -336, -610, -101, -340, -246, -219, -422, -294, -337, -474, -47, -126, -302, -474, -106, -77, -108, -51, -222, -60, -119, 463, 97, -20, -84, -210, 16, -332, 193, 297, -85, 22, 209, 143, -236, -314, 97, -74, -284]
2595b84%J82J97l78K85J84P5l44n18N35j64k48J7J37K38r2L19j84m5P6l6q4l34
2618d66K03L75L5j51k51R9O1K7P9n7J26l60L39J95Oj57n66N3Q2O4L53J35j81J95
2642B38m36K48m45j51J98p3N76j96L9J30m76j26R7L78p46M20O8L81J6l23J74l78
2664c87o1J56N2R0J81L16j25J08m02j35K7M6J78J5L32K82k16k24K81n50n8k3L97
2687B80L98l81J0J07j24j6k37P8m31K98L8L43k75L10j82l03m72J21J07j10J29
2708c12PK3L45k54l18o0k03M54Q4J89L5l50M84r5k70l9j8L46OL7J98j45K29k9
2732C44J40k44j20M23N0r3J61k4j75l32N84j34K50k31j6K76l10J78j81j21J2j50
2754B87P45m97k83K9M7j21j74r2K99k68n3l64L00l37j40L54K28J95p98N36N8m77
$$ y = [-284, -284, -102, 95, -283, 2, 186, 261, -83, -601, -66, -230, -478, -461, -324, -86, -178, 141, -43, -88, -12, -48, -132, -466, -263, 112, 147, -4, -255, -156, -95, -68, 11, -46, 80, -280, 59, 254, 260, 103, -463, -410, -328, -264, 89, 224, 43, 238, -198, 50, -395, -546, -348, -421, 155, -41, -2, 128, -348, -474, -377, 1, -745, -325, -257, 124, 140, -183, -9, -387, -448, -292, -240, -150, 31, 347, 222, 330, -72, -207, -180, -134, 44, 59, 391, 673, 457, 233, 514, -36, -94, -117, 280, 678, 297, 307, 414, 290, 274, 37, 115, -316, -18, 20, 363, 88, 398, 216, -87, -559, -438, -331, -441, -312, -305, -282, 63, -191, -509, -569, -772, -318, -234, -45, -10, -360, 124, 29, -241, -280, -298, 48, 54, 91, 289, 144, 373, 344, 484, 240, 120, 543, 593, 500, 661, 637, 462, 130, 714, 580, 830, 599, 583, 859, 549, 727, 546, 425, 437, 287, 1032, 535, 252, 281, 328, 207, 33, -59, 240, -28, -81, -445, -145, -482, -622, -268, -40, 155, -643, -107, -49, -526]
2776e26M93m39L22k67j42N81j2l5j40K19ko1m21L18K86Q6J83K17m45J71l3k3l6
2799B94k9K97L99k65kj4R2m53l8j1Ll9j1K36K12j02q2m94l25N3j8J79J68R7l97
2824b50L11n1n95l9O4o6M02L50l17J69j19j50k40J66j16R7L51N7jJ47m45M03l67
2847b39K32L28m69J98K71J96L92n83j77J40j56k06P16J39n40L25L11l40l4l49
2867A55k36N19j91K88l0J28n38J53J51r8o74K95M85k52R8R1k57O2l31J01l81M06
2889e6K72M3j85K22l04k29K60q0L8K72j35J77j97j86K35j15M5l1K73R3l20J51
2911B43m0p1J03K12o0l30p6K57j62J1j62N7o8L44k36j81J15j81N14k06l90K88
2933a9l36O4J60O5k00k27L02j36q0j25j01J91K25J97j49O3j26Q2k03K60J91k66
$$ y = [-526, -33, -472, -150, -417, -559, 22, 10, -25, -165, 54, 52, -9, -430, -112, 174, 260, 443, 660, 215, 386, 353, 330, 294, 265, 562, 961, 696, 694, 680, 772, 319, 281, 270, 273, 234, 223, 459, 671, 569, 487, -7, -332, -279, -297, -118, 50, 147, -250, 61, 10, -585, -624, -560, -626, -224, 126, -191, -22, -141, -291, -531, -365, -481, -384, -33, 24, 23, 170, -275, 128, -239, -7, 321, -148, 50, 321, 517, 909, 326, 149, 289, 133, -73, 643, 782, 242, 567, 878, 538, 504, 155, -81, 438, 247, 535, 505, 633, 95, 248, 399, 301, -373, -78, 407, 155, 253, 344, 87, 149, -182, -81, -462, -56, 216, 259, 74, 296, -8, -237, 23, -57, -19, 253, 118, 295, 98, -88, 147, 32, 77, 46, 319, 412, 92, 243, 203, 132, 235, 447, 387, 57, -19, 238, 76, 87, -75, -18, -86, 258, 22, -159, -44, -225, 289, 83, -307, -19, -355, -291, -131, -66, -266, -493, -191, -327, -407, -532, -633, -442, -217, -20, -169, -106, -232, -150, -353, -93, 98, -168]
2955a68J7K38qP1j00Mk18J93j38L16J01k57J85J08k05l45K60L32j90j16N3L74
2977E07m39k92K57l01j63L47J13l96N39k97k19q5p6k30L68j31J00J51J68k48J94
2998a33m83l5j03K90L31m27N3J73L17m5j78l25L07k74L80J40L82k28k22K63j09
3019G4l0rrJ89K12j22J86j55J00J81m79J78M5j28q3L74k37k4j33j20K11m21M5
3042a55L00l77P9M84o45j13J96n1j71K99l5L0m93L51j48k64M34j32l7r8M46l77
3064d77r7L98J62O3k89K62k36j86M03k88M28J94k60r0K05K56l48J35J49J40k28
3085B96j03O9l1K88pl97J13k4k40L80k65j78N12l15n2J41k71K7k78p5J38L65j35
3108d2n12N13j40J1j91N8l68L63J07O8N5l36L12m27J95r7J43j13M22q6K29q9j80
$$ y = [-168, -151, 87, 79, 150, 50, 54, -164, 29, -109, 207, 308, 51, 236, 344, 139, -206, 54, 386, 196, 80, 133, 507, 68, -224, 33, -268, -431, -84, 29, -367, 172, -125, -344, -429, -505, -735, -367, -498, -398, -247, -79, -327, -133, -616, -651, -754, -464, -133, -560, -507, -334, -17, -62, -240, -565, -258, -532, -152, -12, 370, 142, -80, 183, 74, 44, 35, 26, 215, 427, 305, 491, 336, 436, 617, 138, 316, 361, 233, 150, 524, 287, 263, 130, 10, 221, -200, -155, 145, -232, -153, 331, -314, -427, -231, -282, -453, -154, -189, -159, -652, -301, -449, -713, -279, -411, -448, -546, -100, -477, -574, -176, -14, 49, -240, 22, -214, -400, 3, -285, 143, 337, 77, -13, 192, 448, 100, 235, 384, 524, 296, 193, 262, 231, 519, 512, 115, 228, 204, -36, 344, 79, -99, 413, 98, 46, 187, -84, -57, -335, -410, -272, 93, -42, -554, -41, -181, -170, -361, -303, -671, -308, -201, -133, -78, -414, -102, -529, -334, -431, -288, -401, 21, -65, 164, 75, -105]
3131a05j9k52nK28J56P7q4K12P6n13N36l06o5O7N11l80K13lL13l74l11J06k16
3154a38K47K0L7J30j00m24M63k93k58J17M6j6K01J55N8n58j8K10p4k62L98k62
3176c21P9J30J56J1k51J13r9K69k78P1l8M78l24K14o3j11p9J24j73L23k5k01j3
3199hJ03J49r5k70j84K27L09o4K0O0m66l9K60L6j97L22j37k22L26l14L2O0j80
3222b72K60k99j36J86L93J86o89L83j38K55K03l74l21N23j50k6J34P1q3J16k97
3243g5L02K21l31n7j07L96k07j58L21p5k2l86l7k48M78O0pO3j46N7l96Q0O4K1
3267a89j30j29K47J40j01O7k69k04J50j54K62P0p9J03j8K99l24J72m7k96J91N19
3289B80m06K09o6q2m0j42J78k4K9K97J47m0m24L35O6K36l41k58K8k26P41n1M4
$$ y = [-105, -124, -376, -381, -153, 3, 80, -4, 208, 284, -229, 307, 1, -64, 3, 514, 134, 347, 344, 657, 283, -28, 78, -138, 109, 129, 166, 296, 196, -228, 235, -58, -316, -199, -153, -169, 32, 187, 245, -313, -331, -121, -195, -457, -59, -321, -242, -112, 44, 55, -196, -83, -182, 87, -191, -120, -158, 320, -4, 210, 147, 36, -43, 81, -92, 231, 206, 5, -8, 95, 244, 149, -121, -305, -78, 231, 167, 187, 247, -219, -258, 2, 38, -159, 163, 26, -196, 130, -184, -152, -92, -272, -12, -311, -447, -261, 132, 318, -371, 12, -126, 129, 332, -42, -363, 160, 10, -16, 118, 189, 106, 222, -75, 227, 448, 117, 60, -47, 349, 142, -16, 305, 230, 208, -178, -215, -463, 15, 75, 68, 131, -15, 42, -354, -274, -210, -189, -319, -448, -201, -61, -162, -95, -364, -568, -418, -572, -310, -240, -319, -216, -234, 65, -259, -87, -134, -430, -239, 280, -126, 83, 17, -65, -105, -247, -69, -93, -64, 233, 380, 340, -84, 251, 317, 553, 212, -46, -18, -244, 497, 446, 490]
3312D90k10j66j06R7j17L1k97L95k04J88r2l11j17K59k99J05K64k69K28m8j37
3333c16L1p5r8M1J33j13J82q6L1O7j6j09j59RM3L30J98O8m7k87k07K74o5K22L59
3358D10l15J31K86k92j57q5N4J98j17j84k7N93k00L7l77J22k47L7o8M15j54oj5
3381C9Q7p3m0j01m22J06J07L60j48k9j72J5oJ58q5j03J14j41j4K76m52M23l39
3404d40N76m13j63J78L58m8k49K16j50k4J6j25K89J18q7r9J26p1j03K68Q3J59
3426D15k88k55L7j36K05kKr1k3N24l05j01k66J57j12K7j13M93j30l08J97k50O4
3449b59j67J37N77k42o8K41l12J40l3j88J72Q6l92L46K43l47J4k8j88l2M83j41
3471D2K27q4k63M97k0n35l2J75j26K13K8j12J88O3k00j6m0j36k56M64K2m3L14
$$ y = [490, 280, 114, 8, 105, -12, 19, -278, 117, -87, 101, 9, -302, -419, -160, -459, -354, -90, -359, -131, -179, -316, -285, -360, -458, -417, -284, -397, -215, -301, -270, -203, -219, -328, -487, -478, -435, -105, 93, 161, 114, -173, -380, -106, -171, 51, 410, 95, 226, 512, 220, 63, -22, 32, 230, 113, -71, -98, 495, 295, 332, -45, 77, -170, -133, -201, 214, 60, 54, 39, 126, 53, 13, -88, -510, -404, -297, 63, -85, -114, -286, -271, -277, -119, -204, -307, -193, -334, -348, -72, -524, -101, -440, 136, -277, -440, -262, 96, 48, -201, 15, -135, -159, -143, -268, 21, 139, 52, -47, 79, 8, -95, 173, 256, 415, 127, -128, -91, -227, -22, -24, -22, -113, -136, 388, 83, -18, -284, -127, -239, -212, -325, 168, 38, -270, -73, -323, -259, -426, -289, 288, 46, -22, 219, -93, 47, 14, -174, -2, 84, -308, 38, 281, -66, -52, -80, -268, -300, 183, 42, 269, 185, -78, 419, 399, -136, -168, 7, -119, 94, 122, 10, 198, 261, 61, 45, 5, -131, -387, 77, 99, 56, 370]
3494C70k10l27j62M03j93k63L92n15K64M56k12j69l99L40m8L38l54P0J84oK29
3515A88j81l50J7j0K10J87K65J6j83O7l08J30L3j55J84J38J7k3l69K96K2q7p5
3538B9K42N6k85J09j28K06r6k72J09k7q3o8n0q3P1M56k11l36l9NJ86j85o2LK5
3563d28J32k07K47j95k03M46J82j32j69Q0m8J83J26j25p3K38J61j47K26m56K82
3584A20l5r6L62l5J2J73k55L8J88k24l7R8K07J83l84J22m96K59o3j62L07m6j4
3607B22j81o6J3l02j20N57R1l68n0K29k7L8k48R2r5Q9q8LJ36m8K09n4k66k15J53
3632b96R1J63L6K66J79k83l1k32L08k90M44J82l70J47k71L69j60J58m03J76J94
3653C77k61K12k0p9N8j80K78o09K02K77o8j90o6L4M6o2j8q0M7m51P0L64l3M5p6
$$ y = [370, 160, -167, -329, 74, -119, -382, 10, -505, -241, 215, 3, -166, -565, -225, -273, 65, -289, -219, -35, -41, 188, 7, -343, -326, -336, -126, 61, 326, 342, 159, 226, -82, 48, 81, -74, 110, 248, 265, 242, -127, 169, 191, 104, 29, 271, 327, 42, 151, 23, 229, 133, -139, -30, -57, -140, -208, -258, -341, -270, 186, -25, -361, -400, -395, -209, -394, -456, -453, -428, -296, -503, -256, -451, -654, -208, -26, -158, -327, -247, -295, -112, 14, -111, -184, 54, 215, 68, 294, -162, 120, 85, -11, 351, 316, 328, 501, 246, 284, 472, 248, 211, 309, 516, 699, 315, 437, -59, 200, 137, -25, 282, 236, 222, 41, -25, -12, -314, -434, 123, 214, -154, -204, 25, -2, 36, -212, -120, -215, -126, -214, -211, -75, -123, 86, 32, -234, -449, -296, -205, -42, -6, 260, 439, 156, 125, -107, 201, -89, 355, 537, 167, 314, 43, 412, 252, 410, 7, 183, 377, 116, 328, 308, 229, 287, 107, 385, -224, -22, 255, 187, -3, -69, -35, 11, -51, -69, -149, -102, -553, -483, -119, -152, -107, -183]
3678a83j6Q6j04j25K42N8o1k28jJ02K36p13L99J09R1j85M4M43k98K90l01p5l9
3701b29p9N12o0k28K29l07M41n7k90j51K52J37M6p9m20L30m6nq1K01k29R3Nj00
3725a15m9R2L8Lm6j91L28p51N16j52N3n3n1O54n5p4j32m1k22O4J50k73J07M09
3749B09k15R0K10k19j51J26k8j91K38O7j29J32j27J04P1j45k67M44j13j28J66
3770A44L5j30p6m0K44l35K07j38J54l0k39J31p3q5JK7Q9o9M20n27j4K92k17L3
3794a96N7M64l57r5R5L22j99J32l36L4m1j74N85j37R0P1l53K25Q4q3p8L2j73M16
3818C85J1l69K0J8J43l14k51L1K82L33m8o4k55k80J60K37k25N5p2j48R2K33l27
3841c53PL65m7m3l27K10j74K63Q8K5L4N5k24J17k50K58j20K0K9L27k44J87l20
$$ y = [-183, -199, -113, -217, -342, -100, -42, -103, -331, -332, -230, 6, -707, -308, -199, -108, -293, -249, 194, -104, 186, -115, -190, -229, -308, 204, 144, -84, 145, -162, 279, 222, -68, -219, 33, 170, 216, 137, -283, 47, 1, -4, -85, 116, -113, -20, -15, -115, -164, -72, -34, -31, -77, -268, 60, -691, -175, -327, -274, -327, -378, 276, 221, 147, 15, -26, -248, -184, -34, -307, -200, 209, -6, 84, 294, 75, -76, 50, 22, -169, 69, 136, 7, 139, 12, 116, 187, 42, -225, 219, 106, -22, 144, 179, 49, -27, -67, 177, -158, 49, -89, 65, 35, -204, -73, -146, -231, -230, -203, -114, -183, 237, -290, -304, -12, -229, -196, -139, 325, -32, -127, -32, 290, 91, 223, -113, -79, -120, -294, 291, 154, 244, 315, -38, 187, 271, 188, 110, 142, -31, 385, 396, 27, 47, 65, 208, -106, -357, -326, -44, 289, 241, 177, -78, -358, -198, 39, -186, -131, -203, -351, -259, -26, -353, -346, 19, -28, -71, -398, -188, -362, -99, -11, 14, 48, 103, -121, -4, -254, 4, -116, -96, -67, 260, 16, 203, -117]
3864a17J65K48k33o2M67o13q1L12M8L6K28l72j26K87l1L63n75j18L23j84Rp6J67
3887F5j5j01K6l03N70m09l05M19l59K04j74jm5M22j48j05K83j49k08L73k15K95
3909A20k80J33K42l28m5k11K49K16m6j52M65l83K38K93k20j54rj49J42l3n2J83
3931B19O5L4Qj20K34o68M58j65M9Nj34l4J94l43R6O5j67P9J35L4k48J22M3RJ67
3956A37k62j60J18K10k74N2J71J17m01J91J00l72K72P0k6K24qj34J67q0j08k59
3978b55J74L08j68K0QJ66k32r3k06M03K0n1k36K64p9J44K67n30L36k09J88k34
4000El6K53j83m9J00m00Q5K91j54k2L52k31k4j83J31j62R3J81j4Rj51P5J50R5
4024B11l73M46k08r0j61L15n3j11K02K38n68O2N9J66R3j87J04p7J17k38l6J45
$$ y = [-117, 48, 296, 63, 1, 468, -145, -226, 86, 134, 170, 398, 26, -100, 187, 156, 519, -56, -174, 149, -35, -26, -102, 65, 50, -51, -25, -328, 242, -167, -472, -53, -412, -208, -382, -383, -428, -6, -154, -259, 24, -125, -333, 40, -175, 120, -160, -27, 215, -113, -158, -369, -120, 96, 50, -102, 363, -20, 218, 511, 291, 137, 128, -21, 121, 88, 36, 219, 284, 318, 326, 206, 440, -228, 230, 65, 114, 119, -15, -49, 145, -198, -102, -37, -204, -125, 10, 44, -204, -82, -39, -30, 137, -125, -285, -167, 43, -231, -179, -8, 109, -292, -101, -1, -373, -101, -31, -57, 167, 159, 25, 192, 112, 4, -255, -81, 227, 59, 79, 87, 253, 21, -72, -278, 125, 145, 94, -142, 122, 43, 187, 454, -76, 260, 51, 239, 5, -31, 222, 39, -10, 90, -310, -225, 66, -88, -110, 242, 11, -13, -196, -65, -227, -134, 47, 33, 42, -109, -34, 116, 211, -162, 284, 76, -14, -175, 140, 87, -24, 178, 416, -152, -90, -31, 135, 228, 41, 145, 68, 185, -53, -89, 56]
4046E6j22N02k38qN6l63M1J67o0l7j5L4j05k07K27K62n65M62k69Q3O5j75j84M36
4070D3m48P3p5K69N9m0L44l67j01m3M22l07L14m5j29m9J62j89J78K0l95M91o9
4093A18O7K06K19k99k51q6M32j47j74k9k03L18J40m7l81K09j95k52K47M27n18
4114a99j11M50Mk34k51j32K52J24r5q8j20J94J15l02P2L43q2k86K27m8qL9J7J59
4138D0k54j03L27j27j16K10J19n7j52l0J12j0K26k93L57j70J48l8J3o5k44M25
4160C18o5j75R2Q7nr7l57J85K1j58J67k11K8R4K0j56j30K48o1r6J09K42m17Pk5
4185c35J3k5O3k96N72m4k1J06K24k40l14M4J76j29L42j31k52L91j97J43j14J81
4207A57J78l58L31l60L66l12L40p5j31M4k14N00j55q2rk13P9M3JQk45P0L4j66
$$ y = [56, -66, 436, 198, 190, 246, -117, -76, 91, 31, -6, -21, 13, -92, -299, -72, 190, -375, 87, -182, -99, -34, -209, -393, 43, -405, -332, -407, -138, -79, -119, 225, -142, -243, -286, 136, -171, 143, 98, -31, -80, 82, -107, 71, 91, -304, 187, 118, 185, 391, 610, 311, 60, -26, 406, 259, 85, 56, -147, 171, 311, 264, -117, 92, -103, -355, -108, 319, -199, -310, 140, 144, -90, -341, -473, -221, -97, -192, -280, -400, -206, -91, -393, -321, 22, -60, -346, -119, -167, -175, -136, -119, 40, -214, -317, 10, -117, -233, -23, 96, 39, -113, -143, -31, -41, 185, -108, 249, 79, 227, 189, 202, 137, -107, 318, 253, 78, 170, 257, 252, 155, -202, -17, 4, -154, 13, -198, -170, -76, -56, -212, -342, -94, -155, -251, -142, 100, -317, -310, -335, -322, -347, -284, -580, -8, -52, -73, 33, 257, 17, -297, -253, -77, -206, 136, 5, -247, 144, -53, 90, -24, 157, 335, -23, 308, -52, 314, 2, 342, 267, 136, 180, -34, 466, 311, 229, 220, 7, 86, 129, 130, 138, -107, -37, -3, -169]
4231a69K67l26J94J61j67K70l17K0q5L16m33K46l53L06l74N08k74J29O9K26n30
4252c16J32K39k33L68k35L62m24K45k32K17r8j89K6K36j62L87k70N19n11J5q9
4273a3L29J51n28R1K86j31J71l69j46J22k46K84q0K29k41J33k06K70j70J64r5
4294Ek4ml0qK5j69j78L16l58R3J57J67N3J52m2k56m5L34p2q0J91l0P5n7j93j07
4320h5N8K70k96p1O96k50k07q3J18o3L0j23r8K02q6J21j68K3J16k47q6o2J61K16
4344H6j51Q6K47p74J78j4K94j81J58j29k8L94j36r8M54k53l22J95J24J27k88p3
4366a04l41N96r3L64o10J44L55j34k30O8K23J7j16j42J05r8L9M6L65l56Q3k89
4388a08M52j43m0L6k90Jrq3J06n3M1m8M8N6m14K79k19r8L25J53j48K34l54P0K71
$$ y = [-169, 98, -228, -34, 127, -40, 230, -87, -67, -152, 164, -269, -23, -376, -70, -444, 64, -210, -81, -12, 214, -316, -184, 55, -178, 190, -45, 317, -107, 138, -94, 123, 25, -164, -138, 98, -64, 323, 53, 572, 61, 76, -13, 316, 467, -61, 30, 316, 185, 356, -13, -159, -37, -283, 1, -79, 150, -91, 42, -164, 106, -64, 100, 5, -19, -23, -53, -61, -36, -205, -383, -67, -425, -332, -175, -8, 45, 197, 155, -101, -146, 188, 116, 36, 227, 197, 272, 215, 22, -85, -27, 243, -53, -124, 572, 322, 115, 32, 150, 87, 117, -6, -104, 98, 12, 133, -35, -12, 104, -143, -229, -291, -130, 86, -65, 21, 268, -506, -328, -342, -48, -229, -71, -200, -228, 166, 30, -68, 386, 133, -189, 6, 130, 257, -31, -104, -445, 151, 58, 422, -188, -44, 311, 177, -53, 15, 238, 255, 139, -3, 102, 4, 43, 89, 454, 98, 181, -108, 344, 201, 161, 197, -93, -92, -101, -184, -78, -131, -90, -138, -90, -34, -448, -169, -388, -486, -161, -8, -156, 78, -276, -206, 65]
4413F5K02l59mj2q0P9N7o6K75q2m8MJ24l70l4L40J52M2k92k11J98J13j45r1J19
4438b4J98j9k8O7K21k47k05n3M3K86k42J14J66l85L6j99L01o5L9j61Q3J68j8l06
4462b30J45j6J48k67K73l56M56n6j94k22K88o6j05J63O7j47K96j08jl22kK01L08
4485B53j75J42m95M0n0M21R8o01N49j67J12j68k36J85K35R4k52j24P7J39k6O5
4507A16r2j33K0k55J46j72Q5J57n4J79r3J36n32L64k4M1j90r8K37K08j48J66P2
4530A36j08l49L56q6j8K41N6m08L88l19k4L26j64J32j44K02k78K21k60j16J94
4551b2J60q3J64r9M7l02j29J10J48k92N11r9j18l08n7L68O9pk57L41l26P6j0K4
4575i1l34L72M52k30j76j37J08L7J71j56J03j39J24m97L48J01k8J32R2J64n07
$$ y = [65, 267, -92, -96, -108, -188, -109, -52, -118, 157, 75, 27, 31, 155, -215, -249, 91, 243, 285, -7, -218, -20, 93, -52, -143, -24, 174, 155, 127, 194, 415, 168, -37, -90, -47, 239, -3, 111, 277, -108, -72, -271, 30, -35, 4, -157, -74, 94, 76, -230, -85, -101, 47, -220, 53, -303, 153, 97, -97, -319, -31, -97, -202, -39, 28, -119, 177, 69, 68, -254, -256, -55, 253, 78, 220, -275, -235, -285, 136, 234, -367, 182, 15, 127, -41, -277, -92, 143, 237, -15, -139, -62, 77, 51, 116, 24, -109, -89, -344, -198, -370, -285, -128, -182, -3, -96, 40, -492, -128, -152, -111, -301, -399, -162, 46, -102, 64, 136, 28, -321, 35, -51, -69, 172, 228, -180, 208, -111, -135, 191, 27, 159, 15, 217, -61, 160, -100, -216, -22, 138, 55, 219, 120, 167, -135, -264, -154, -6, -298, 213, 114, -4, -312, -369, -1, 68, 61, -196, 145, -181, -105, -115, -91, -425, -53, 399, 169, -7, -144, -36, 1, 172, 16, 119, -20, 104, -393, -45, 56, 28, 160, 252, 416, -91]
4596i1j03J38K2L35j33k26J20J41j80l8K27l05O7K10q5p0K71l36l6n2N5l6l1j
4620a37o3K83k2k45J40k03l8K29j59K59l62J79j7K65l03L8j79K62Q4l20K55K98
4642B44l71l9L10j31J9J55k79m1K4n3L07k25R4K22j54k07J53j82M55m28K00MN1
4665A28k58rK66j87K92q5J7l4k12L62k49p6J65l27K02k88L75k9j87j18O2J27N9
4688dk5M8k58L25o13J01M21m4j85J71K8L9k07p7K71k19J41J0oK06j33J74J63j41
4712A86j72qk5K62k79M6p9K43k83N39n18L41K05o52P54k54k69K85j24j93K88l09
4734a6K72m47J73N8o7j93J76K49n11L09J40k38J70k87p0K77k76K05k18J18J96
4755B0Lk50r2L52k97L04K26L1k77j63J43p2K38r2j29pj27K68o4J00k6M62l54J9
$$ y = [-91, -194, -56, -34, 301, 168, -58, 62, 203, 23, -15, 212, -93, -26, 184, 99, 29, 300, -36, -72, -124, -69, -105, -136, -137, -200, 83, 61, -184, -44, -247, -285, -56, -215, 44, -318, -139, -156, 109, -194, -156, -335, -73, 11, -309, -54, 244, -127, -166, 144, 13, 32, 187, -92, -133, -109, -162, 145, -80, 14, 236, 82, -125, 28, -154, 301, -127, 73, 77, 128, -130, -139, 127, -60, 232, 147, 164, 130, -82, 280, 31, -45, 120, -207, -5, -293, 82, 53, -134, -252, -190, -63, -4, -29, 19, -239, 86, -527, -426, -5, -49, -234, -63, -35, 4, -203, -280, -9, -228, -87, -77, -83, 123, -10, 164, 327, 186, 14, 6, -19, 243, -36, 10, -69, 174, -109, 430, -88, 253, 458, -194, 560, 306, 37, 322, 198, 5, 293, -16, 256, -191, -18, 40, -27, -220, -44, 205, -306, 3, 143, -95, 75, -212, -282, -5, -281, -76, -294, -176, 20, 23, -227, -319, 33, -264, 40, 266, 297, 20, -143, 0, -72, 166, 74, -55, -62, -189, 79, 15, 115, 89, 551, 197, 216]
4779B16l29N7J73L5l13J20M19l56K7l63O91m25K91m8M0k26P1J01l07K6o1MR1r9
4803a65j87L99j28r0k23M85j6l16L28j64j89M58j78k3m3n8k5LO22n39K31j66P7
4826I3p8j07J55n2J72r9J02k98J77L14m88K65r4K63m17K48k40m9K1K61j55J58
4848A52k78j35m0J50K73j90K72k33M8m3k58M00l24kN0L07M3j75q8J52j37L3J5
4871hL9L6j0j66J04K68l77j3K9J71K40l64L3L82k47p1o0J44j08K70p5l5j56QL41
4896C75j70j85L3k01K94k39LL33m64K2j7L44j25j40M07l71q3J58j02J35k10J33
4918g0j45J67L6m3k98K92O0m2l0J5J20K32L4l66N4J30j74K34l66M86l36R0L81
4941D61l89K43k33q6P0m9R9q4k1o2q3K23J2K51k42k71N9L06l27qJ02j23K7J18
$$ y = [216, -113, -56, 117, 152, -161, -41, 378, 22, 49, -314, 377, -48, 243, 195, 235, 9, 80, 181, -126, -100, -161, -157, -66, -165, -352, 47, -81, -171, -394, 91, 75, -241, 87, -77, -266, 192, 14, -9, -52, -110, -135, -132, 490, -49, 182, 16, 93, 15, -92, 63, 11, 183, 84, 186, -112, 65, 379, -109, 156, 62, 325, -92, 156, -84, -133, -112, 149, -6, 152, -126, -261, -301, -151, 122, -68, 204, -29, 19, -24, -282, 118, -206, -208, -158, 149, 192, 17, -71, 81, -56, -23, -8, 31, 67, 57, -109, -5, 263, -114, -127, -98, 73, 313, -51, -18, 364, 117, 46, -14, 130, 22, 292, 217, 182, 26, 34, 375, 205, 20, 53, -148, 146, -93, -90, 243, -221, -199, -216, 128, 3, -137, 270, -101, -184, -26, -128, 7, -203, -70, -215, -48, -12, -55, -353, -61, -1, -43, -73, -58, 62, 294, 328, -38, 16, 146, -28, 206, -160, 326, -10, 80, 461, 72, 315, 82, -4, 66, 17, 116, 32, 11, -51, -134, 89, 101, 352, 110, -161, -102, 204, -123, -131, -29, -152, -125, -7]
4965gK22l64k0j25L21Mk22k8L8j9J45M6j68K53j42j21K95k03jO1K64j37j22J21
4989I1K55k85j20Q5M2N7k26N5J81R9j62J01Q5k27m8j44J45J01k81J53N1J05k04
5012i1Kk9k8J61L8J15j4r8k94L44j21k26J45M7J07J9j28k96K21p6J85n0Q4k8r3
5037a04p0OL8K23L64j41r5k76L78O5l40j07K12j04p9J85P2j91J84j13J04j10J65
5060B66k77L62l76N0k2J22l53N58k40l06K54O2k05L1K32m27J18K8L2j45J86j59
5082b09l6J91M32m77K21q1J19j63J03L9j88J39k96M25m03L22k22L2l09M68J84
5103B91nj57j02J8K12K9k51N5l37K60j03L42k06k87P3K78k51K82j10j44K13J18
5125B18l60J55j95M6L22k87R7J17j59j75K77j81K70m4j65L02l65L74l78j0K95
$$ y = [-7, 215, -149, -169, -294, 27, 31, -191, -219, -181, -200, -55, -9, -177, 76, -66, -187, 108, -95, -96, -35, 229, 92, -30, 91, 346, 61, -59, 26, 68, 125, -101, -46, 135, 234, 72, 173, 258, 31, -17, -161, -16, 85, -196, -43, 8, 113, -91, -89, -118, -146, 15, 53, 168, 154, 56, -238, 106, -15, -241, -96, -49, 58, 77, -51, -347, -126, -202, -17, -67, 17, -11, -104, -174, -168, -130, 93, 457, 316, 221, -55, 323, 388, 48, -59, 153, 49, -30, 155, 227, 36, 220, 107, 211, 101, 266, -11, 351, -25, 25, 3, 125, -228, 330, 90, -216, 38, 100, -105, -74, 158, -269, -151, -123, -91, -236, -50, -209, -245, -54, 378, -99, 122, 41, 160, -3, 100, 139, -49, 90, -206, 219, -184, 138, -84, -52, -361, 107, 291, 286, 129, 27, 45, 257, 286, 35, 90, -247, 13, -90, 252, 46, -241, -168, 110, -141, 141, 31, -113, 100, 218, -142, 13, -182, -136, 186, -101, -4, 113, -46, -221, 56, -125, 145, 101, -64, 238, -127, 247, -131, -141, 154]
5146A54k30J01k2r8J09p0O0L69k67J09l31Q5J02K7J11j60j16L00J56j64j89M8
5168H4n2K18k79Q8K65j82j47n0L26l39K5k53J65j08K76k09J22K02l73J62n5J24
5190A0K09m6k64j94J21j55N0P6K14k57K29k8L2J36k46L07n3k5j83J90o5J14m21
5213b49P4p2J12N6O8L9P2j85K9K59j5m1k41j67O9P0K13M8l29K5M72l47J42m24
5237c22K10j72J08K79%k65K0j50M38l45L98l20J36k9kk85J52pk3JJ03l1j53K69
5261A0j42r8K73j48l9K09l60K65k44N55j16Qj0j1j42Rj92J18M2j84L30j41N1L15
5285C58l02J1k09K50j10Q2p9L3J85k55k86R6J33J46K55j79m80K47J22J97L3k88
5307d0J25l00n8L79n9k54j73LL59k69K36j44j47K21O9j45Q9K11l25N60k45NR0
$$ y = [154, -76, 25, 3, -95, 14, -56, 4, 373, 106, 215, -116, -31, 71, 98, 209, 49, -67, 233, 389, 225, 36, 84, 32, 250, -29, 59, 324, 142, -5, -55, 271, -68, -43, -296, -131, -239, 37, -172, -50, 152, -221, -59, -114, 10, 219, 173, -91, -285, -164, -319, -269, -193, 21, -236, -7, -35, -3, 133, -113, 194, 141, 116, -67, 123, 58, 172, -249, -175, -247, -135, -79, -11, 28, 100, -85, -56, 203, 188, 147, -94, -261, -192, -122, 91, 139, -190, -165, 307, -40, 102, -322, -112, -284, -176, 103, 103, -162, -142, -292, 146, -199, 199, -121, 15, -14, -16, -301, -149, -156, -179, -178, -75, -106, -259, 10, -132, -230, 43, -105, -144, 65, -295, -30, -274, 281, 165, 173, 163, 152, 10, 19, -173, -55, -13, -197, 133, -8, 43, 358, 56, 67, -142, 108, -2, 80, 1, 34, 219, -36, -322, -226, -93, 53, 308, 129, -351, -104, 18, 215, 248, -40, 85, -215, -273, 106, 47, -207, -380, -377, -18, -287, -51, -195, -342, -121, -52, -197, -108, 103, -222, 338, 93, 98, 188]
5330A88m36L55K63k57k28L25k19J34M7r1K33l37%J12P3J13j46j51J1P2p3j02K09
5353I5m7q2j28J40RN7M6k91K30j12k90K45J8j01M42m49M0j41J39K02l3M6l2j9
5377a6m9L2K77l2j55m1q1K17k11j40J1J97j2J15j73L40k03K42j99l19L20k45j64
5400b89N03l14q0L33m1J78l79kR8p1r1K37l86L54k30K79M1k29q6J57R6j96j23
5423b41J39N9J43j32n7J71k16J09l3L14k14K67k6l46P8MK1m8k61J97j63O4L16
5446A45K54j31k25j39M34k58J83l2l03l1J36j81K58j86L6K87m80L28m1O9j8k45
5468a40RL39n41J90L52l22K69N9l0l17k7L23k15r8K20lk81R4J5K12j21Q5j90j6
5492a34K1J57r4K0L78j11p9J26j32q1J66j07j19m6J90n9o9R5r2O0k74M16m41L31
$$ y = [188, -248, 107, 370, 113, -115, 210, -9, 125, 172, 81, 314, -23, -23, 89, 162, 275, 129, -22, -11, 61, -12, -114, 95, 48, -34, -162, -22, -13, 44, 90, -201, 29, -83, -373, -128, -110, -211, 231, -218, -178, -319, -180, 22, -11, 35, 3, -16, -65, -33, 244, 212, 57, 16, -65, 152, -59, -199, -188, 9, -3, 112, -61, 279, 76, 318, 119, -200, 120, -125, -289, 214, -100, -180, 153, 112, 290, -89, -91, 7, -64, -155, 82, -304, 50, -180, 99, 140, -89, -175, -18, 78, -118, -241, -102, -43, 100, -32, -89, 82, -134, -25, -58, 256, 42, 309, 283, -63, 15, 19, 40, -8, -269, -72, -235, -171, 145, 399, 268, 43, -96, 338, 80, 263, 231, -72, -103, 33, -148, 110, -76, -40, 247, -233, 95, 54, 123, 105, -140, -131, 208, -333, -143, 209, -113, 156, 215, 185, -132, -159, 164, -51, -149, 71, 68, -213, -119, -104, 108, -13, 72, -118, -134, -113, 44, -50, -30, 348, 237, 158, 284, 152, 71, 237, 130, 11, -35, 155, 96, 27, 122, 30, 90, -184, 232, -209, 122]
5516A22M6j66l1J36j59Jl03L59j79J89jj82O1j42PJ46O5k15J05k01N42l44o2M19
5540B13m02N0J22K11k69Q9n7j55J70J24r3Q8J18M5n7m57L53J1Jj92O3o3J73j27
5564d1Q2J5l28J15j63N87k69Q3P7l03L87l57j99P6J30M4J18m0R1j17j5L94k18
5587A49J01k92J64n45O14o56L62K67l06M8J34k17J21j60J10J34K4j17j7R6l1J26
5609A09j37N1j71j00L83k39K82j35l01M14k12J85J30m25L96m7j68J4q6K46q7j26
5631b4OJ49r0m40N89l4j68o7j76Q0L87k61q3L03m63L55J4k77J13j28K38j71K32
5654H4P1K40j54j11k8J51k62J82l11M42m60O91l08l55J0J30j05J20l69K12J49
5675A9R7r5J91q6r5K21j95jj00L17n11j3l4K91l14K75K69k31j98J16K26kk17j1
$$ y = [122, 168, 2, -29, 107, -52, -51, -354, 5, -174, 15, 14, -168, -107, -249, -242, -96, -31, -246, -141, -342, 200, -144, -206, 213, -189, -139, -17, 194, -75, 14, -43, -198, -28, 96, 3, 91, 209, 254, 197, -260, 93, 104, 105, -87, -24, -87, 86, -41, 41, 56, -272, -157, -320, 267, -2, 81, 158, -145, 242, -115, -314, -238, -108, -64, 54, 14, 105, -12, -27, 367, 149, 250, -42, 122, -423, 191, -465, -103, 164, -142, -94, 40, -177, -56, -216, -106, 28, 52, -65, -82, 14, -17, 109, -28, 23, -148, -248, 135, -104, 178, 43, -258, 156, -56, 129, 259, -166, 230, 183, 15, 29, -57, 189, 102, -24, -18, 131, 41, -399, 190, 156, -12, -79, -255, -175, 212, -49, -132, 171, -292, 63, 77, -200, -87, -215, 23, -148, 84, 155, 395, 241, 130, 102, 253, -9, 173, -138, 304, -156, 535, 227, -128, -118, 12, -93, 27, -342, -130, 19, 116, 21, 212, 126, 31, 252, 57, 56, -44, 273, -238, -251, -285, 6, -308, -33, 236, 5, -193, -77, 149, 147, -70, -81]
5699h1L04j59J02l25o6P8K86l45N2Q3j45K08L4P7k27L76N5m20J14Q5k42M4Q3Q5
5723E6L52q02O41j74n8q9N5j39K40j1q6j08k01L19l5J45k21K10J54l0j90j16P8
5746a0j31M5k59M17k47J77k74Q6j82R7j03M23L33m21o2M26j22j66j31J65Q1K7
5768A69k74K06J5j54K20l36L81j73k90K87j60NJ58M7J56l39j78J94J04j8k3J75
5790A72K1J66k29k70j53P0P13l85lj75k99K80Q3M9j54J84j33r9J11kj34J19k53
5813c21L17m26M46k32K35k27K10M6l20L95j70J11o4j06K75j63K46j97R8j33L8
5834E8l0JK60k06j02r9K49M2Qj10j24J21j20k01K18L97j70l26L96l06K91k95q9
5857a37K17L8J08j71j8K0k7J01l67J65Q8J26j19JN7j45j1Q6K6k3M4n4k19N30j43
$$ y = [-81, 223, 64, 166, -159, -225, -147, 139, -206, -154, -71, -216, -8, 26, 103, -124, 252, 307, -113, 1, 86, -156, -112, -29, 56, 408, -394, 247, 73, 15, -74, -19, -158, 82, 71, -15, -123, -324, -5, -40, 105, -116, 94, 248, 218, 28, -88, -10, -141, -96, -355, 62, -185, -8, -282, -196, -378, -281, -384, 39, 372, -49, -111, 315, 193, 27, -104, 61, 142, 169, -105, 101, 116, -38, 182, -154, 227, 54, -236, 51, -109, -104, 54, 101, 257, -82, -260, -66, 38, 20, -3, 172, 193, 359, 130, -140, -293, -223, 490, 105, 102, -73, -372, -92, -9, 40, -114, 70, -63, -162, -51, -53, -187, -68, -321, -4, -430, 16, -216, 19, -208, 2, 48, -272, 123, -47, 64, 0, -106, 169, 6, 252, 55, 153, 20, 58, 28, 29, 289, 83, -19, -118, 131, 173, 181, 71, -53, 68, -52, -253, -35, 362, 192, -134, 262, -44, 247, -48, -137, 80, 118, 226, 55, 37, 57, 30, 131, -236, -71, 17, 143, 24, 25, 82, -63, -74, 12, 38, 15, 59, 5, -214, 316, 173]
5882A73k21L27l80K85j56r8o4K03n9J43J08j89p4qL0p6K71l78J72rK63m6p9J03
5906B41j93J31j00l6J72l89L04j07N2k60J12K29l89K70l1n7Q8K66l02l12L38J28
$$ y = [173, -48, 279, -101, 184, 28, -70, -134, 69, 10, 153, 261, 72, -2, -10, 20, -56, 215, -163, 9, 0, 263, 217, 138, 241, 48, 179, 79, 43, 215, -174, 130, 23, 75, -185, -73, 156, -233, 37, 6, -51, 37, 303, 1, -311, 27, 155]
$$ [...]
8191b08
##END NTUPLES=NMR FID
##END=
