##TITLE=1H_LR-621-C2
 CDCl3, 8 sc, 
 25.9.2019
##JCAMPDX= 6.0         $$ Bruker NMR JCAMP-DX V2.0
##DATA TYPE= NMR FID
##DATA CLASS= NTUPLES
##ORIGIN= UXNMR, Bruker Analytische Messtechnik GmbH
##OWNER= root
$$ XWIN-NMR		Version 3.5
$$ Wed Sep 25 14:26:34 2019 Russian Standard Time (UT+4h)  she@DPX200
##.OBSERVE FREQUENCY= 200.1315
##.OBSERVE NUCLEUS= ^1H
##.DELAY= (6, 6)
##.ACQUISITION MODE= SIMULTANEOUS
##.ACQUISITION SCHEME= undefined
##.AVERAGES= 8
##.DIGITISER RES= 18
##SPECTROMETER/DATA SYSTEM= spect
##.PULSE SEQUENCE= zg30
##.SOLVENT NAME= CDCl3
##.SHIFT REFERENCE= (INTERNAL, CDCl3, 0, 15.7039)
##AUDIT TRAIL= $$ (NUMBER, WHEN, WHO, WHERE, WHAT)
$$ ##TITLE= Audit trail, XWIN-NMR		Version 3.5
$$ ##JCAMPDX= 5.01
$$ ##ORIGIN= Bruker BioSpin GmbH
$$ ##OWNER= she
$$ F:/spectra/data/she/nmr/H-F/1/audita.txt
$$ ##AUDIT TRAIL=  $$ (NUMBER, WHEN, WHO, WHERE, WHAT)
(   1,<2019-09-25 14:25:37.98 +0400>,<she>,<DPX200>,
      <created by zg, POWCHK disabled, PULCHK disabled
       configuration hash MD5:
       00 E9 B6 7A A2 85 ED C7 34 08 36 98 17 FE 4E 26
       data hash MD5: 16K
       E7 F0 B7 17 9D D8 51 EC 44 80 59 54 7A 8A AB E4>)
$$ ##END=
$$ 
$$ hash MD5
$$ D3 13 D9 D4 D8 88 BA 37 45 70 37 2E 40 BF 2B 9A
##$RELAX= 
##$RELAX= 
##$RELAX= 
##$RELAX= 
##$RELAX= 
##$RELAX= 
$$ Bruker specific parameters
$$ --------------------------
##$DU= <F:/spectra>
##$EXPNO= 1
##$NAME= <H-F>
##$PROCNO= 1
##$TYPE= <nmr>
##$USER= <she>
##$AMP= (0..31)
100 100 100 100 100 100 100 100 100 100 100 100 100 100 100 100 100 100 
100 100 100 100 100 100 100 100 100 100 100 100 100 100 
##$AQSEQ= 0
##$AQ_mod= 1
##$AUNM= <au_zg>
##$AUTOPOS= <>
##$BF1= 200.13
##$BF2= 200.13
##$BF3= 200.13
##$BF4= 200.13
##$BF5= 200.13
##$BF6= 200.13
##$BF7= 200.13
##$BF8= 200.13
##$BYTORDA= 1
##$CFDGTYP= 0
##$CFRGTYP= 5
##$CHEMSTR= <none>
##$CNST= (0..31)
1 1 145 1 1 1 1 1 1 1 1 1 1 1 1 1 1 1 1 1 1 1 1 1 1 1 1 1 1 1 1 1 
##$CPDPRG= <>
##$CPDPRG1= <>
##$CPDPRG2= <>
##$CPDPRG3= <>
##$CPDPRG4= <mlev>
##$CPDPRG5= <mlev>
##$CPDPRG6= <mlev>
##$CPDPRG7= <mlev>
##$CPDPRG8= <mlev>
##$CPDPRGB= <>
##$CPDPRGT= <>
##$D= (0..31)
0 1.2 0 0 0 0 0 0 0 0.06 0 0.03 0 0 0 0 0.0002 0 0 0 0 0 0 0 0 0 0 0 0 
0 0 0 
##$DATE= 1569407137
##$DBL= (0..7)
120 120 120 120 120 120 120 120 
##$DBP= (0..7)
150 150 150 150 150 150 150 150 
##$DBP07= 0
##$DBPNAM0= <>
##$DBPNAM1= <>
##$DBPNAM2= <>
##$DBPNAM3= <>
##$DBPNAM4= <>
##$DBPNAM5= <>
##$DBPNAM6= <>
##$DBPNAM7= <>
##$DBPOAL= (0..7)
0.5 0.5 0.5 0.5 0.5 0.5 0.5 0.5 
##$DBPOFFS= (0..7)
0 0 0 0 0 0 0 0 
##$DE= 6
##$DECBNUC= <off>
##$DECIM= 24
##$DECNUC= <off>
##$DECSTAT= 4
##$DIGMOD= 1
##$DIGTYP= 9
##$DL= (0..7)
0 120 120 120 120 120 120 120 
##$DP= (0..7)
150 150 150 150 150 150 150 150 
##$DP07= 0
##$DPNAME0= <>
##$DPNAME1= <>
##$DPNAME2= <>
##$DPNAME3= <>
##$DPNAME4= <>
##$DPNAME5= <>
##$DPNAME6= <>
##$DPNAME7= <>
##$DPOAL= (0..7)
0.5 0.5 0.5 0.5 0.5 0.5 0.5 0.5 
##$DPOFFS= (0..7)
0 0 0 0 0 0 0 0 
##$DQDMODE= 0
##$DR= 18
##$DS= 0
##$DSLIST= <SSSSSSSSSSSSSSS>
$$ [...]
##$SUBNAM2= <"">
##$SUBNAM3= <"">
##$SUBNAM4= <"">
##$SUBNAM5= <"">
##$SUBNAM6= <"">
##$SUBNAM7= <"">
##$SUBNAM8= <"">
##$SUBNAM9= <"">
##$SW= 24.0689530833862
##$SWIBOX= (0..15)
0 0 2 0 0 0 0 0 0 0 0 0 0 0 0 0 
##$SW_h= 4816.95568400771
##$TD= 16384
##$TD0= 1
##$TE= 0
##$TE2= 300
##$TE3= 300
##$TEG= 300
##$TL= (0..7)
0 120 120 120 120 120 120 120 
##$TP= (0..7)
150 150 150 150 150 150 150 150 
##$TP07= 0
##$TPNAME0= <>
##$TPNAME1= <>
##$TPNAME2= <>
##$TPNAME3= <>
##$TPNAME4= <>
##$TPNAME5= <>
##$TPNAME6= <>
##$TPNAME7= <>
##$TPOAL= (0..7)
0.5 0.5 0.5 0.5 0.5 0.5 0.5 0.5 
##$TPOFFS= (0..7)
0 0 0 0 0 0 0 0 
##$TUNHIN= 0
##$TUNHOUT= 0
##$TUNXOUT= 0
##$USERA1= <user>
##$USERA2= <user>
##$USERA3= <user>
##$USERA4= <user>
##$USERA5= <user>
##$V9= 5
##$VALIST= <valist>
##$VCLIST= <CCCCCCCCCCCCCCC>
##$VD= 0
##$VDLIST= <DDDDDDDDDDDDDDD>
##$VPLIST= <PPPPPPPPPPPPPPP>
##$VTLIST= <TTTTTTTTTTTTTTT>
##$WBST= 1024
##$WBSW= 4
##$XGAIN= (0..3)
0 0 0 0 
##$XL= 0
##$YL= 0
##$YMAX_a= 221194
##$YMIN_a= -311779
##$ZGOPTNS= <>
##$ZL1= 120
##$ZL2= 120
##$ZL3= 120
##$ZL4= 120
##$ABSF1= 10
##$ABSF2= 0
##$ABSG= 5
##$ABSL= 3
##$ALPHA= 0
##$AQORDER= 0
##$ASSFAC= 0
##$ASSFACI= 0
##$ASSFACX= 0
##$ASSWID= 0
##$AUNMP= <proc_1d>
##$AZFE= 0.1
##$AZFW= 0.1
##$BCFW= 1
##$BC_mod= 2
##$BYTORDP= 1
##$COROFFS= 0
##$CY= 11.3945322036743
##$DATMOD= 1
##$DC= 2
##$DFILT= <>
##$DTYPP= 0
##$F1P= 20.1720416913024
##$F2P= 0.152960286110954
##$FCOR= 0.5
##$FTSIZE= 0
##$FT_mod= 4
##$GAMMA= 1
##$GB= 0.15
##$INTBC= 1
##$INTSCL= 1
##$ISEN= 128
##$LB= 0.24
##$LEV0= 0
##$LPBIN= 0
##$MAXI= 10000
##$MC2= 0
##$MEAN= 0
##$ME_mod= 0
##$MI= 1.114404
##$NCOEF= 0
##$NC_proc= 0
##$NLEV= 6
##$NOISF1= 3.799351
##$NOISF2= 2.8
##$NSP= 1
##$NTH_PI= 0
##$NZP= 0
##$OFFSET= 15.70392
##$PC= 1
##$PHC0= -9580.724
##$PHC1= 29.20095
##$PH_mod= 1
##$PKNL= yes
##$PPARMOD= 0
##$PSCAL= 0
##$PSIGN= 0
##$REVERSE= no
##$SF= 200.130013532006
##$SI= 16384
##$SIGF1= 3
##$SIGF2= 2
##$SINO= 400
##$SIOLD= 16384
##$SREGLST= <1H.CDCl3>
##$SSB= 0
##$STSI= 0
##$STSR= 0
##$SW_p= 3612.71676300578
##$SYMM= 0
##$S_DEV= 0
##$TDeff= 0
##$TDoff= 0
##$TI= <>
##$TILT= no
##$TM1= 0
##$TM2= 0
##$TOPLEV= 0
##$USERP1= <user>
##$USERP2= <user>
##$USERP3= <user>
##$USERP4= <user>
##$USERP5= <user>
##$WDW= 1
##$XDIM= 8192
##$YMAX_p= 0
##$YMIN_p= 0
$$ End of Bruker specific parameters
$$ ---------------------------------
##NTUPLES= NMR FID
##VAR_NAME=  TIME,          FID/REAL,        FID/IMAG
##SYMBOL=    X,             R,               I
##VAR_TYPE=  INDEPENDENT,   DEPENDENT,       DEPENDENT
##VAR_FORM=  AFFN,          ASDF,            ASDF
##VAR_DIM=   8192,          8192,            8192
##UNITS=     SECONDS,       ARBITRARY UNITS, ARBITRARY UNITS
##FACTOR=    0.0002076,     1,               1
##FIRST=     0,             0,               0
##LAST=      1.7004516,     0,               0
##MIN=       0,             -311779,         0
##MAX=       1.7004516,     221194,          0
$$ Real data points
##PAGE= N=1
##DATA TABLE= (X++(R..R)), XYDATA
0@%%%%Qj6J6j6J6k4L2m0M8n6P2q8J04j22J46j76K08k40K78l23L73m26M84n53O30
29C35p13Q04r06J016j136J271j418J579j756J949k162K396k652K935l250L600
45A892l991M432m930N497o152O920p832Q936j0309J2067j4409J7707k2743L1462
59A8547n0729J65716r5818k97398K75128K05748j62564k23766J47859J80256q6576
70G6403j89734M7854J42442K011j08209j657N9177j412n0184R661K8598L013j1560
83F403r65j4228o532J0461J3669j596k607o702k305M184m863j8599Q281L5921
97B0522P652m1195l2258K4347M5733r637n3869M672P3842J480j00719k1760J16159
110C4969M7847j13981o4486J05824P1578j03877q3635J02323J02880q8005j15042
$$ y = [0, 0, 0, 0, 0, 8, -8, 8, -8, 8, -16, 16, -24, 24, -32, 40, -48, 56, -66, 80, -96, 112, -128, 150, -173, 200, -226, 258, -295, 335, -378, 426, -480, 536, -600, 671, -747, 832, -924, 1025, -1137, 1259, -1393, 1542, -1708, 1892, -2099, 2333, -2597, 2900, -3252, 3668, -4164, 4772, -5537, 6530, -7879, 9828, -12915, 18547, -32182, 133534, 37716, -259682, 15446, 221194, 58630, -165136, -17277, 162979, 76403, -113331, -65477, 76965, 78976, -29233, -30890, 28287, 26875, -23309, -13648, 14950, 17963, 6403, 5438, -8790, -15322, -4861, 8808, 7212, 4605, -2097, -4402, -218, -5081, -23680, -15399, 20522, 28174, -13021, -45279, -20932, 24801, 15164, -38705, -34033, 39809, 41289, -59430, -81190, 34969, 82816, -31165, -95651, 10173, 81751, -22126, -105761, -3438, 99442, 11437, -103605]
121a03605O7080J09818n2145r5032M7514Q4075m0907p2575K8157N4635j7792l2191
133b2968J9602J7352k3476j2770K4701R929k4692l747L0900K720l6897p241L7292
146A0705J3047l0381j4689K2141J5297j4481j6684O515K1288N792j9494j6096
158a7040J1162K0205j08j8581o324J9491J3868k2205k4626K3009L4503j8761l7243
171b2650J5125L5070j3013l1571J2090K9219r530k5907N812K1595n625j5893Q965
184C687J2565j4837j0430J9719P686k5375k771L1045q08l5726J380L5763k312
197A9586l4218J681L2239J62l1258m191K8662O912k7717o458K6284L679k7148
210a1785j878K7398n12k6017J998K3232m566k2294M088K1633j283k2078l097K0926
$$ y = [-103605, -36525, 73293, 21148, -73884, -26370, 57705, 16798, -55777, -27620, 27015, 9223, -22968, -3366, 13986, -9490, -22260, 2441, 12370, -12322, -16069, 14831, 17551, -19346, -26587, 10705, 23752, -6629, -21318, 823, 16120, 1639, -15045, -8530, 12758, 18550, -944, -17040, -5878, 14327, 14219, -4362, -10686, 8805, 22673, 468, -24158, -1149, 33354, 14593, -22650, -7525, 27545, 14532, -17039, -4949, 24270, 14740, -11167, -5355, 16240, 10615, -5278, 3687, 16252, 1415, -9015, 10704, 18390, -6985, -9756, 21289, 20481, -15245, -13865, 21898, 19586, -14632, -12951, 19288, 19450, -11808, -15999, 12663, 19575, -8142, -14600, 11684, 15363, -11785, -13663, 13735, 13223, -12794, -10796, 12436, 7870, -14424, -10336, 11297, 10014, -12064, -15161, 5765]
224E765O587k0466q902J9737R852j9005j1403J4594J2211q329j2136Q96J2508
237A909N617j3433j2285J4128J7283j4472k1063J3737K3072j2075k4381R310K5713
250A3060n969k7569L973K9078k427l0250K092L2394l125l3565L967L4771m313
263A2117l3675L901L3915j954l4360k83L5141N400l5908q857L6325J3293l5454
276a0399j5668L4004J8519l0544k0513K6424K3295j9722k4226J3129K5952o970
288A3281k5729J792K5136L421k3254o306K0013J0571j6174j3728J2705J6441r029
301I140j8863P114K0846o178k1738N269K3076n012k3877M302K4020l291k4288
314i480J710K5504j85k7987j814K9518L290l0894n366L1348O415l0776r141K9133
$$ y = [5765, 12352, -8114, -17016, 2721, 12573, -6432, -17835, -3241, 8970, 641, -11495, -10599, 1909, 7526, -5907, -18192, -4064, 13219, -1253, -22316, -8579, 14493, 2418, -21963, -12653, 13060, 7091, -20478, -16505, 12573, 10146, -20104, -18012, 14382, 11257, -22308, -18341, 16430, 12117, -21558, -17657, 16258, 14304, -20056, -20339, 14802, 20202, -15706, -24563, 11762, 25055, -10399, -26067, 7937, 26456, -4088, -24601, 1823, 25118, 5396, -18830, -5701, 20251, 13281, -12448, -10656, 14480, 17901, -5353, -11659, 8354, 18925, 2751, -10977, 1728, 18169, 9140, -9723, -2609, 18237, 12059, -9679, -4410, 18666, 13654, -10223, -5921, 18099, 14808, -9480, -7770, 17734, 17549, -10438, -12252, 17266, 20556, -10338, -15704, 15644, 22059, -8717, -17858, 11275]
328A1275J1019k6280j4769K2722J7097j9700j9008J6142J9561j3310k0463J0083
340e631J8720o978j7207L187J4425L07j2032m177R662O129p907q289N997R137
354E343n119r596L326Q961j611q803o19Q640J927r738k860J0877L701j2560l678
369a1809J2669M017j3533l704J3244L842j2429m917J2043O369j1660p675J1286
382b257R089j0376j0101J0082J0533r276q866P866P491n432o139M055M773j480
396c8l627N82K596K91l40o18m1p3K521J056m224j160O212K265p346j895P978K014
414F153p300j748P297K636o744k431O261K560n537k375N424K929n721k622N920
429D702K695n798k142N123J846m057j400K764J660j993j673Q45J918l04j688j122
$$ y = [11275, 22294, -3986, -18755, 3967, 21064, 1364, -17644, -1502, 18059, 4749, -15714, -5631, 13089, 6111, -11096, -7909, 6516, 6823, -5209, -9386, 276, 6405, -1502, -9791, -3794, 5343, 224, -9372, -6046, 2915, 1304, -7499, -8118, 522, 2449, -7289, -10149, 728, 4429, -8131, -11809, 860, 4877, -8656, -12360, 884, 4726, -7703, -12620, -577, 5792, -5868, -13543, -2257, 6832, -3544, -13645, -3563, 6970, -2306, -11172, -3306, 4185, -1247, -7386, -3331, 1442, -38, -3665, -3083, -487, -196, -536, -1154, -1195, -1268, 1253, 2309, -1915, -3075, 3137, 5402, -1944, -3839, 4139, 6153, -1147, -2895, 4402, 7038, 294, -2137, 4124, 6684, 1147, -1228, 4196, 7125, 1404, -1218, 4702, 7397, 1599, -543, 4580, 6426, 2369, 969, 3733, 5393, 3400, 1727, 2572, 4490, 4186, 2498, 1376]
445A376J465K105r15l621J75M143P98n529k053O170K967p382m381Q256M950r174
461f50o388R568O235q998q080R224P899q386r232P593R298p034j0397O592R810
476G054n681j0196M972R468m293r540L766Q574l048q608J696Q047p81p500k40
491f310P207M57o346j365N202K329m376l319L268L890j814m631L61N545Q11n870
507d961k273O542L818o391n623O745P100o643p420N590R213n027r807M771J0782
522F416m631j0349M162J0526k812j0729K986J0331k289r566K018R493q56r109
536d409M95Q812K30q222k77Q194M65o620j118N874J307m077j873L640K255k313
552B363k915K024K782n36k805j13K438J276j769k503J686L428r97m714N05N422
$$ y = [1376, 2841, 4946, 4031, 410, 585, 4728, 5526, -3, -2056, 4114, 7081, -301, -4682, 3574, 8524, -650, -7038, 2530, 8765, -233, -8313, 911, 8810, 424, -8808, -1215, 8083, 1049, -9348, -2756, 7054, 1373, -8823, -3851, 5617, 1324, -8216, -4450, 4124, 1076, -7532, -5836, 2211, 1430, -6070, -6310, 897, 1354, -4992, -6357, -1155, 1174, -3202, -6521, -3253, 637, -1177, -5808, -5447, 98, 909, -4961, -7234, -692, 3126, -3265, -8888, -2143, 4957, -1686, -9106, -3516, 5697, 670, -9137, -4366, 6416, 1785, -8564, -4402, 6124, 3312, -7417, -4431, 5900, 3611, -5955, -3937, 5556, 4700, -4409, -3914, 4898, 5128, -3094, -3371, 4823, 5288, -1332, -2450, 3424, 4731, 654, -1219, 2421, 4676, 2363, -552, 1472, 4254, 3718, 913, 800, 3238, 4514, 2745, 242, 1928, 5356, 4359, -355, 150, 5572]
568E572k82o218r7O889o4p397l91P426J203p625k368P670K408p764l077P968K763
585F616p568l276P183K205o422j913N653J164m708j661L741J405l550r62K128
600C5J186k689o36J830K5j598L26P90r74l01P71l00j014R07J251k163j403K231
618a726J722k831j617K122K786k658l071K824L676k862m117K974M065l082m192
633e987L100M854l322m584L087L773k169l729K705L362j619l580J807L137j663
648h28k272K221J616k156p00J637N86r27M22J263j250r93K019J427k358o44K909
665A972P74l405m01L558P26l428o00L745L35l480j28M353N2m170k1M096k50l582
683A46J45L761N4l918Q9L837J63l605J0L169J01l392k92K990M43k344l14K015
$$ y = [5572, 5290, -928, -1025, 5864, 5800, -1597, -1988, 5438, 6641, -984, -3352, 4318, 6726, -1038, -4115, 3853, 6616, -952, -4228, 2955, 5160, -1262, -3175, 2478, 3642, -1066, -2727, 1014, 2419, -1131, -2093, 35, 1221, -1468, -2104, -274, -249, -1847, -1521, -731, -1705, -2006, -1235, -1535, -2549, -1642, -391, -2554, -3957, -1726, -4, -2835, -4452, -2330, 456, -2202, -5273, -2449, 1227, -1635, -5752, -2778, 1287, -1795, -5987, -2887, 1967, -1355, -5939, -2852, 921, -1248, -4977, -2272, 1090, -529, -4109, -2302, 835, -828, -3100, -879, 737, -1419, -2119, -482, 104, -823, -401, 862, -388, -1381, 638, 2065, -293, -937, 1972, 2746, -659, -1060, 2498, 3224, -204, -804, 2941, 3276, -204, -332, 4021, 4073, -97, -118, 3978, 3728, 146, 291, 4052, 4106, 188, 277, 4114, 4277, 672, 682, 3851, 3952, 560, 268, 3258, 3701, 1357, 1043, 3058]
701C058n11j632J00J302l06r35N07r0m77k15P36k63j602J276J150j883j710J772
719B77K241k258k669K368K389k689k559K481K638k908k822K556K585k671k430
734c471K512K759k836l031K288K504k426j966K194J490k132j610K128R37j498
749b158r08J770K64j532o21J791N09j552l76J440R4j437L21J538o87q44Q97P53
767g38j366l9J723L10k032M19K239j009k252J073K603l55k965N35L029n59k388
784a772L67L400p44k920P76K999r77k366R11K292m26k227Q34K044n59j421L32
801E43J326p4j738J221J570j126j265J485P94j574n54J389M50j303l18J635n54
818A907j230O40J555p95j656N75K076j249k029J545J685j810j550K074R95k193
$$ y = [3058, 2547, 915, 1015, 2317, 2011, 1076, 1583, 1493, 1016, 801, 1537, 1274, -328, 948, 2098, 215, -1495, 277, 2518, 260, -2409, -41, 2348, -341, -2900, -419, 2219, -689, -3511, -955, 1630, -1041, -3471, -959, 1800, -1036, -4067, -1779, 725, -1701, -3667, -1473, 17, -2115, -3725, -1597, -660, -2158, -3066, -1296, -1032, -2564, -3185, -1394, -885, -2437, -2813, -1373, -1279, -2716, -2395, -857, -1544, -2388, -1491, -738, -2104, -2143, -420, -110, -2142, -1723, 516, -493, -2745, -1672, 931, 576, -2389, -1854, 1175, 616, -1772, -1405, 1995, 1251, -1669, -893, 2106, 1129, -1237, -326, 1966, 1540, -687, 147, 2191, 1632, 211, 543, 1869, 1795, 57, 1278, 2848, 1722, 457, 1942, 2736, 1162, 608, 1997, 2447, 1144, 826, 2461, 1907, 677, 1317, 2872, 2077, 421, 996, 3072, 1823, -206, 1339, 3024, 1214, -336, 1738, 2733, 540]
834E40p62K316q8k336l21K467q8j849l22J960K74k685j28K396j15k151J34J603
852H45l71j463J62J477j064o65P04K5j38o84M42M02q59m35P49N04j057n84J213
871g97K22j103p29J582K25j587J8J159K41j301j27J247J07j474M40J091j03j569
889b458P53J738j214j262J184R74j080j057J737P38j778QJ618jj553K71J517J55
907B90j717N32J452k33j753P38J261k90j271J123P39p08l35O84M86o59j08P87
925A018J12m51k54P84M35q72k84Q60N59j009m69J414J50r97j18J013j3r50K41
944A169Q31l34o89L55M16m88o52O77O22q07p81Q35R98j417l69J594k07j598J48
963C03J200L2j519L93J151n6j629j01J525j95j554L70P02j28j066J13J032m27
$$ y = [540, -222, 2094, 2006, -330, -651, 1816, 1728, -121, -443, 1517, 1791, -894, -1022, 1374, 1259, -892, -758, 845, 474, -989, -827, 650, -414, -1079, -375, -350, -488, -1172, -730, -328, -1187, -1622, -873, -369, -1426, -2010, -797, -575, -1678, -2407, -825, -600, -2187, -2169, -1010, -769, -2070, -2197, -950, -843, -2317, -1877, -786, -889, -2458, -1705, 33, -1181, -2443, -1259, -285, -1365, -2422, -685, 53, -1725, -1717, -99, -100, -1653, -1382, 135, 290, -1427, -895, 557, 324, -1429, -691, 570, 280, -991, 132, 871, 163, -172, 512, 998, 339, 231, 1018, 1130, 679, 425, 1209, 1644, 772, 488, 1348, 1907, 898, 429, 1843, 1993, 996, 878, 1891, 1878, 928, 1169, 2000, 1666, 977, 1332, 1748, 1260, 608, 1285, 1907, 1100, 319, 1154, 2152, 735, 366, 1960, 1753, 155, 303, 1503, 1535, 16, 409, 1560, 1504, -125, -226, 1299, 1104, -450, -80, 622, 494, -572, -459, 573, 146]
981A46q21L54O6j3q30O82K88p15k09L47K43o87q0M47K42r49j5Q09m3p14p5Q05
1003g22j43p62L24N26k43j096P25P72j007n34J098N34j136n08J161Q39j142r85
1021b299J718O59j090j010J371P75j244k65P89R60j339O1N44O41q73k22P65K3
1039c6p8r2O98k67j28P0K43O8k69N32o1p52O00M44K17j055K31Q71m34l14m1J471
1061A918p24o69K09Q24k36r22J46J309k82j299N00J130o00r84Q12Q32n70q13L42
1080I23J274j328o07L79P07n41n41N33N27n68m95J27R35n62l48R6j59k76L90q4
1100C82j05l86J95N0n19O9N77q4p25j06P45J19j200k22R52o8q52k98J312K17j069
1121a016o49J496j13j259l73J534N19j423m29R94j92o89J3Q80K22j085K03N93
$$ y = [146, -675, -321, -255, -268, -1098, -416, -128, -843, -1052, -705, -462, -1149, -1229, -782, -540, -1489, -1504, -695, -738, -1452, -1527, -722, -865, -1627, -1303, -777, -1020, -2116, -1391, -619, -1626, -2160, -1062, -528, -1664, -2172, -1011, -172, -1314, -2299, -581, 78, -1012, -2022, -651, 124, -1120, -1385, -596, 364, -975, -914, -370, 271, -602, -824, -59, -36, -114, -206, 492, 225, 97, 167, 410, 478, 209, 741, 680, -72, 528, 972, 1189, 134, 365, 1236, 802, 488, 447, 1918, 1194, 525, 734, 1558, 1322, 400, 546, 1855, 1573, 274, 774, 1904, 1304, 320, 1132, 1964, 1394, 581, 923, 2197, 869, 262, 641, 1348, 807, 266, 799, 1326, 758, 263, 390, 1325, 763, 415, 511, 352, 76, 466, 382, 277, -109, 86, 136, -383, -314, 263, 179, -546, -652, 93, 212, -988, -1210, -258, -326, -1178, -1476, -164, 53, -1016, -1665, -169, -282, -1541, -1914, -380, 139, -1284, -1713, -719, -911, -1600, -1587, -707, -485, -1570, -1367, -774]
1139g74R2o16J72N13m92J63M9K92m58l13Q87J6k77Q8L46p0k80r5O51m76j26O88
1161b0K00n21j64N72M23n50p14Q88Q80q41n85Q55Q42q38q53J114O70p73o26O41
1181F00Q00o01n33L30P40k42o21L30J64l7k50K09K82K7l38K02l0l73O89m44j47
1202G57j3N49l58n04L24Q8K49p76L3J046m85p22O20N03n49q73J10O20o9p19k0
1223a89J220m12j373N50J022n10j041P87P10m05j129L6J165m62j079L18R11J38
1241B57q80l89P07Km67k60J76L94k35j97r8L33j05J9o10M36J69R5j97r6J64L32
1263d50p05k26Q14O5q46r8R86J17r67K13P35L48j103j56J024K97q28l64J043O5
1283c6o92k56J197L9n95k65O83J52n74k71Q58L66o00nN30N3l21j80K61J52N6j15
$$ y = [-774, -682, -1298, -1126, -613, -1105, -942, -893, -601, -1059, -1372, -485, -469, -746, -658, -312, -382, -662, -757, -106, -582, -708, -20, 180, -341, -505, 67, 490, -60, -774, 114, 994, 153, -432, 423, 1265, 427, -426, 688, 1358, 585, -41, 600, 1400, 799, 266, 596, 1336, 1094, 473, 803, 967, 930, 680, 889, 1171, 1198, 860, 1062, 1032, 659, 1348, 904, 757, 744, 1293, 935, 431, 755, 843, 1092, 316, 349, 1395, 910, 188, 808, 1311, 762, -111, -1, 619, 550, -169, -189, 1031, 619, -754, -204, 818, 308, -733, 54, 764, 359, -770, -734, 431, -31, -1110, -792, 119, 257, -623, -1012, -305, -303, -770, -1030, -854, -460, -695, -892, -990, -657, -762, -743, -1353, -917, -748, -653, -850, -946, -782, -450, -1155, -1381, -567, -502, -1348, -1446, -460, -343, -1310, -1097, -362, -14, -1117, -1273, -249, 48, -780, -1144, -101, -36, -728, -984, 213, 252, -343, -608, 75, 227, -347, -618, 240, 606, 6, 1, 531, 584, 263, 83, 344, 496, 552, 437]
1305D37j82L85Rj36L5L18K94m43j78j05M00N71r11L0M57J10n00o5O09J62m39n53
1327C05O05N15m10p32M32M15r5q23O5J034l54j006L92M21j23m37M00K03l90j82
1347B35K37J3k42j87K91j91j28M9k83L38l39N50k16m54k6M95j64o44R0L10m3o31
1369i40M04J90j64l83J66M16k32l37K34L26m1o85J29P59j70q42o5P90L1p75l7
1390a226P01L5k29n17N38J56J05o13M51M28k58k20r2O29k83p4j39K44m2K03k92
1411d95K0M01R0l96k84M71M33o77l3O09M0k56l67O15O14j032OO88N1m53q8P07
1433F64k0n93J17O19k2k68n25O90L21m75J13N8K25j12l11J57M06q8o74K84J48
1454G14O1j5j94r8L85j65l17J59L92%q66J29N25K53n18r1M28m4n60k29J88N19
$$ y = [437, 255, 640, 649, 513, 548, 866, 1160, 717, 539, 434, 834, 1405, 494, 524, 981, 1091, 591, 526, 1135, 1297, 858, 305, 910, 1425, 1015, 283, 715, 1130, 1035, 212, 277, 1311, 957, -49, 343, 764, 641, 204, 604, 807, 417, 235, 472, 485, 243, 56, 347, 156, 28, 77, -206, 132, -207, 343, 127, -327, -353, 142, -22, -666, -576, -266, -309, -940, -536, -346, -510, -893, -727, -311, -543, -880, -646, -320, -361, -1046, -917, -158, -328, -1170, -1235, -445, -414, -1189, -1226, -525, -490, -719, -1236, -698, -542, -437, -1050, -599, -171, -429, -649, -741, -112, -395, -469, -608, -364, -406, -203, -495, -475, -74, 16, -380, -664, -193, 240, -437, -470, 139, 179, -77, -444, 171, 785, -247, -241, 447, 498, 45, -43, 664, 644, 51, 168, 787, 765, 497, -28, 662, 983, 508, 621, 679, 904, 792, 481, 638, 1044, 956, 282, 566, 714, 775, 760, 566, 468, 853, 688, 371, 530, 922, 922, 56, 185, 710, 963, 445, 354, 782, 738, 178, -51, 137, 656]
1476F56o15l70N17K66p26k60R00J06l94o33L02N16l06l81K62M89l41m23K02M50
1496B17l44o43M76m2J37m32J77rk16j5M7J98J50k44j75K39L84k36l04p7Q4K28
1518d00m85K80K11O8l49l17M04M08m05k64M76jk06l15J63P09j55m66m4N61N0m95
1540e72N57lM85q05k3K23M25m75J59K82j22mQ8P6r5L18k23K37m00L62j22Q5j88
1563B65J76lJ84j36j89K15m6L25m15K71J3n72L37N44m15p1L90j6m86j14L98K17
1585H72m28l03K76q7K24j18j22L80N5n84J37q7l3k53N16j24j86k27J70J30k38
1606c0K77m19J42R5Rj69jo1J60m33J90J64k06j09j67J76K40J06n44J01M26l71
1628d24l54N9L74j95Q8l3K79m3j20n3O9l4k32j77L47n2j83J04L39j31m99M82J8
$$ y = [656, 41, -329, 188, 454, -272, -532, 368, 474, 80, -553, -251, 265, -41, -422, -160, 329, -12, -435, -233, 217, -127, -770, -294, -336, -199, -631, -454, -463, -679, -694, -647, -449, -299, -543, -718, -479, -95, -331, -635, -712, -628, -400, -885, -605, -394, -326, -675, -992, -588, -180, -585, -849, -373, -374, -580, -895, -732, -23, -178, -644, -688, -127, -77, -572, -15, -18, 467, -338, -361, -138, 287, -188, -29, 253, 131, 127, 215, 291, 196, 514, 291, 528, 128, 490, 368, 453, 265, 441, 438, 622, 486, 297, 512, 466, 791, 376, 647, 660, 88, 425, 969, 554, 483, 873, 857, 371, 257, 655, 872, 444, 141, 417, 330, 554, 436, 314, 694, 749, 165, 302, 215, 182, -71, 445, 321, 135, -92, 78, 208, -30, 247, -172, -30, 65, 74, -95, -96, -157, 3, -430, -240, -76, -282, -391, -558, -382, -142, -36, -580, -479, -53, -424, -778, -719, -345, -540, -452, -485, -206, -249, -369, -422, -353, -387, -619, -796, -449, -501, -684, -580, -241, -372, -871, -389, -371]
1651c71j58j40J0K93Q8k88J92K02K8l13Q1K01o0q3K5M10l14MJ63k50J1J70J99
1674A00k13J45J76k67J0J14M13j22l91M1M83M3k64k4L72M7m16j58O69k47j75j15
1696B21J42K64n29j05P29N1nj68j54K2r4k9K48O5k07J44L5r5k76K40j37J47j14
1719C95p9p0K98Q5k44o1K5k84L38l44k24K93K80m99J80J10j68k01k25M45k7k83
1741b60j54N67K74o10l70L81R8r7m10K69n5j83j20R6M87m46k44J15K28J38q1J65
1763b12j75j75K05j14j52K65k60J82l28K36K32M6j42k4O9K39o41M76J3L16n62
1784e06J3L65o1l64J83L78l75j18K48K24K39n16M30k8j43j88J51L81l26j71K46
1805F2L09m78n8J66K77J37l01K47N9N7k1m4jJ69k47j5j08J12K27l5l31J96l4J07
$$ y = [-371, -529, -669, -659, -366, -278, -566, -374, -172, -144, -457, -376, -175, -235, -318, -293, 117, -197, -193, -30, -280, -269, -99, 100, -113, 32, 208, -59, -49, 65, 478, 356, -35, 6, 489, 532, 268, 244, 616, 663, 247, 89, 758, 511, 336, 221, 363, 627, 98, -7, 722, 773, 768, 600, 446, 468, 374, 345, 593, 658, 451, 595, 630, 535, 259, 499, 362, 509, 395, 316, 246, 544, 629, 385, 324, 349, 65, 403, 59, -165, 128, 408, -91, 89, 199, 31, -170, -395, 50, 23, -260, -414, 153, 427, -183, -553, -172, -74, -171, -581, -312, -367, -550, -670, -574, -87, -533, -777, -662, -434, -296, -377, -212, -387, -562, -357, -471, -623, -358, -618, -436, -764, -528, -296, -250, -392, -416, -347, -108, -749, -273, -260, 56, -506, -493, -128, -189, -553, -370, 8, -367, -485, -237, -13, 226, -290, 140, 112, -31, -219, -68, 313, -13, -184, 62, 371, -107, -165, 1, 278, 415, 114, 361, 420, 477, 456, 412, 411, 580, 333, 318, 210, 322, 549, 514, 183, 379, 345, 452]
1829D52k41k5K61K54j97j51J16O4r3p3J81K99o43k80P55n52K96l82M06j51J56
1850D52l13J05K1r7j3J9N9k48J61J20j19m2j72K27j50l44M56m59K69l0L3k9nk32
1874c31j2J86l42j2N2L72k59q3K36m88L34K43k34J48j91j89L71n28L06R6j70P6
1896d19J15m59N05q0k21R5J26k88L1M05l45J89K68m60J79K43q6j4P7k90K04J56
1918f9l53K98L5M2k2N3J14k9M4k25j25N24q7j32L69K9j64k14n9K6J87k60Q03o41
1942A44K21k86N95k53k6M6l48K54l79M40J9J06l78M7N90m30j41K05J41k19J9P8
1964D45J78m20K68j82k91L52k58O6K2k15J03J96J16l22J17J64m62K39q1J23j85
1985b7J22j8l0j24j73L93k9j97j01J12pJ41l98K52J75n07j26M95j48j37J20K23
$$ y = [452, 211, 186, 447, 701, 504, 353, 469, 533, 440, 367, 548, 847, 204, -76, 679, 127, 423, 41, 447, 296, 452, 139, 244, 265, 168, 155, 174, 233, -15, 146, 266, 147, 105, -67, 160, 10, -334, 122, -337, -68, -98, -65, -94, -99, -331, -343, -157, -499, -511, -459, -87, -346, -429, -193, -681, -347, -104, -338, -190, -381, -570, -199, -727, -421, -325, -495, -419, -304, -763, -258, -338, -559, -464, -338, -626, -595, -190, -535, -346, -78, -538, -359, -116, -202, -216, -139, -429, -225, -69, -422, -124, -89, -47, -69, -16, 98, 69, 113, -112, -237, 287, 200, 68, 437, 466, 302, 88, 29, 55, 242, -18, 785, 144, 365, 79, 674, 421, 395, 441, 93, 347, -32, 408, 427, 533, 155, 202, 792, 362, 221, 426, 567, 348, 367, 445, 623, 203, 471, 289, -2, 350, 92, 158, 180, -35, 68, 264, 380, 58, 175, 339, -123, 116, 35, 158, -27, 95, 77, 47, -77, -250, 143, 114, -83, -184, -72, -79, 62, -336, -84, 91, -416, -542, -47, -195, -332, -212, 11]
2007A1j97k98K25L0j9Q2l27M49K1m00K79k96K13j74K24k79j81M58j82K58K9m2
2029a16k12o9N5j11M38k25k49K70n5k19J87J83J87m54%J22K69j42k25K36J81k50
2051a99L63l91K79o9mJ3J76m2O6n1K53j41j7j71L79m36J46r7K41j26j0L51j01
2074D12R4j80K48l57j32K71K88k21Qk89M16m77N08q7k86J90M7k38r3R8jJ80m02
2097cJ32K92l36j13L73j74nL6n5J84m0l21k7K24K56m55J47j20q7k58K47K4k68
2120c47q0K09Q4j5o3K68j89k30K99k41J10J43k63P0J96k18R0J34j72M1j03rL35
2143D9m90J13j75N16j93k87K28P5p8R7n7j08o9L39m29M23m3k14M3K7J9k30K55
2166a89m8J23m0J32M5r3M6P8l56K23M5K00j44j32M51l01j44K42O7j60j60K28j15
$$ y = [11, -186, -484, -259, -229, -248, -166, -493, -44, -23, -423, -144, -440, -227, -401, -177, -456, -637, -179, -361, -103, -74, -116, -328, -397, -342, -453, -15, -240, -489, -219, -274, -493, -306, -123, 64, -390, -390, -268, 1, -141, -366, -130, 51, -199, 164, -227, 52, -17, -21, -8, 168, 126, 192, 141, 394, 253, 236, 65, 444, 8, 154, 57, 298, 172, 162, 513, 412, 506, 326, 574, 217, 85, 356, 644, 423, 431, 142, 558, 81, 589, 502, 216, 406, 453, 215, 122, 220, 219, 399, -3, 129, 421, 85, -28, 345, 171, 166, 202, 147, 331, 291, -30, -57, 167, 423, -32, 115, -5, -92, -350, -103, -79, -347, -427, -218, -134, -149, -212, 56, -133, -363, -64, -305, -195, -52, -315, -245, -49, -267, -177, -43, -215, -174, -277, -286, 49, -441, -328, -503, 13, -180, -467, -239, -164, -242, -145, -202, -310, -379, -40, -469, -46, -89, -303, -260, -233, -214, -444, -189, -237, -114, -154, -22, 23, -70, -24, 54, -302, -79, -34, 166, 22, -110, 341, 40, -104, 138, 205, 45, -115, 113, -2]
2189bO69o32J7J92j6j5l9j57K33l17L11O9k37J04M5J44J4q1L20k69J50k71j18
2212A14K60q8L1J90m14j83M21k37J57k17N2N7K02k92J83k45N7m3J99k02K10j11
2234A01Q2j30J22l24M56j61m1N6j00k22m8L99k55J14mk18J70J21n8m0j22j59J60
2257a01n18M69N6k6j09K4K04m15J61j01Q0q0L65l6l47L72l45nk57L03J56K20q1
2280a1q7k19K71n32K38o9K48P9N6k54J18nj08K08N3N8k98J22l8J94m86M39j31
2303a54J06J18K0J97j98J36p7j59r3M72l08J37L4j64J1J33l58J22K40R1m8j98
2325F0K70k08n4K00K33m63K73J76j39r4k41M22nl07Q0K22p5k80M2p1M33m86J32
2348A20L24k48n2J44l13K57j07K8M6m8L5k72J61j55P0J38P2k14Q9k41k8L87j40
$$ y = [-2, 667, 35, 52, 244, 228, 213, 174, 17, 250, -67, 244, 313, 76, 180, 225, 369, 383, 302, 622, 353, 503, 232, 114, 374, 286, 317, 507, 93, -90, 331, 94, 251, 34, 86, 143, 345, 53, 236, -9, 48, 5, 204, 2, 212, 101, 183, 53, 175, -149, 307, 146, 105, 161, 61, -161, -209, 190, -65, 49, 45, -173, -3, 118, 60, 20, -102, -261, -101, -619, -150, -94, -120, -229, -205, -1, -416, -255, -356, -276, -356, 9, -27, -374, -2, -347, -352, -609, -306, -150, 70, -11, -98, -317, -46, -578, -340, -409, -161, -82, -26, -280, -162, -167, -275, -67, -14, 44, -254, -132, -170, 24, -462, -23, -154, -48, 70, 90, 287, 89, 225, 148, -11, -104, 368, 60, 197, 231, 67, 78, 211, -147, -25, 215, 306, 258, 60, 330, 122, 68, 268, 501, 38, 311, 487, 348, 254, 13, 435, 430, 123, 203, 425, 350, 70, 112, 41, 474, -12, 120, 444, 196, 144, 288, -25, 232, 125, 153, 199, 151, 186, -86, 75, -80, -10, 128, 200, -14, 75, -166, -194, 193, 53]
2371E3k04j4L2J85k11J61Q3k19L1j01J7L58n06K00K44j91j83O1o5r3m6j40L34
2394b14K90j20k58K43j03j09J35J47m41N4L16J27j77N4k00m2L6K17j04j78J19
2415b08O9L2j92P0J45q1J5j29J53J40j64j36K12O1R1%n33O65j86M8J29J6pj42
2439F8k39J56L64m47j19M17k20K98j68j49K34l4k96J47J16J96J88m11O7L66q6
2460D48k41R9l47J61J82j18K20m04K52n2P2j55n3j87K95l41O4O20m67J93k12o3
2482c4J49k20N27o37J85r5L7J73r2N8k23J11RJ92k97Q9l3J66l8l14o3L40J7j49
2506a42K89k48K36l48J36K4n8j18K2K01k94Q6K0J80q7j5l03kK32k77K75K36l38
2529b93j72J80J96m27L57J80p8l38L25m4K12l39K24j1j54P0L29m31K34R3l33L70
$$ y = [53, -151, -165, -133, 52, -159, 2, 85, -134, -103, -204, -187, 171, -335, -135, 109, -82, -265, -204, -269, -362, -408, -548, -214, 76, -44, -302, -59, -162, -271, -136, 11, -430, -376, -60, 67, -110, -56, -256, -298, -262, -45, -149, -327, -208, -139, -107, -299, -229, -84, -165, -150, -279, -126, 14, -150, -286, -74, -13, 78, 78, -455, 210, 24, 72, 201, 217, 210, 68, -171, -15, 349, -98, -217, 200, -20, 278, 110, -39, 195, 161, -135, 12, 128, 324, 512, 101, 168, 534, 448, 207, 306, -41, 120, 302, 184, 404, 0, 252, 200, 272, 117, 64, -123, 172, -169, -105, 515, 48, 241, 29, -34, 115, -105, 422, -215, -30, -125, -88, 85, -7, 51, -172, -61, -52, 140, -157, -68, -101, 65, 27, -287, -350, -10, 7, -142, 147, -101, 135, -213, -77, -53, -111, -229, -207, -6, -300, -214, -194, -14, -101, -116, -419, -421, -189, -466, -191, 45, -293, -465, -285, -89, -516, -159, 21, -57, -395, -70, -114, 98, -241, -17, -28, -182, -112, 217, -214, 20, 113, -220, 150]
2551A50m08J53L49j50n8j06k35M00l23L44n4L8k79J48L5r0M12k53OJ07l5j14M15
2574D52l47O5L45k20l13K61j64j0J17J92j13J3l77L27J4j35p0L34j87K30k18j43
2596E3K98l27K32q9R9m29M60l18K25R2m75K33m1J96m9j84M5L56o3l58r9K13o4
2619FR7k19o1K33j78J51R6k0j3j54j12L11j84Q0k00O0j90O3L08j11k64J2L42o6
2643a3j75K03k88J46N9J09o7k17p0J92k2j91L90k07r8o0P7K03k66J19K56m35P8
2666b77J66j13n3K76k9k30O42n23j82j45J4L43m1j71N35m54J2J9M46l32K07o5
2688D5J63k67J86qR9L9m19l7K14O2j86M06q0J29l06J79k41J24J22l44J32J81j97
2711do9K16K50l45K41ol42J99j09P6J46J7j55K5J18k25n7J36L0Oq0L7j19j02M58
$$ y = [150, -258, -105, 244, 94, 36, -70, -305, 95, -228, 116, 62, 100, -179, -31, 4, -86, 326, 73, 79, 186, 151, 37, 452, 105, 170, 515, 295, -18, 243, 79, 69, 186, 378, 265, 278, -99, 228, 242, 107, 37, 371, 184, 414, 196, 53, 351, 24, 256, 167, 266, -163, 297, -21, 204, 296, -179, 54, 13, 209, 160, -24, 21, 377, 314, -44, -143, 70, 6, 103, -116, -177, 56, -122, 29, 125, 105, 92, -62, -174, 137, -47, 33, -167, -107, -297, -234, 74, -37, -301, -289, 53, -13, -188, 15, -273, -127, -68, 41, -26, -243, -313, -121, -143, -334, 56, -151, -249, -309, -232, -29, -295, -176, 80, -355, -277, -111, -224, -277, -1, -30, -260, 382, -141, -323, -468, -454, -111, -152, -323, 212, -242, -230, -211, 235, -97, 110, 45, 208, -59, 127, 119, 218, 257, -162, -199, 15, 77, -109, 297, 217, 346, 40, 219, -22, 102, 224, -120, 12, 193, -4, -73, 143, 393, 48, 289, 283, -59, 140, 31, 107, 253, 270, 115, 140, 258, 33, -24, 112, 142, 148, 68, 105, -14, -116, 342]
2736C42l07j18O8J02J20k18r9K04k02K55k98K3J30k22L06l91M94m28J84o8L0k
2758i5j51K17j15N7J13P3k40P7o6J99l60O1J73Q9j56j60O8k2K46j68J29p6k1p
2782a35j81J43K26l87J6K58J8r6k6L6k37L05p0L7j29J7k3J47J73J8k51r9J14J94
2806F8j6q4L1j53K11l21N40k62k41K42j72J78n4J25j67j62K21jJ6k3J06j28K54
2829B08M8O4n34M44N6J88k75j42R9r9J30Jq2l79N91j47k7k35K50O6k92K40m3K63
2853C93k06j59J5l7J14l36M31N7j59l28N97nl84R3k15K26j29J14k47N2r9J76j66
2876b02M35j99N0j36k67K23K05j31J23k25K30k4m01K54p3m3M4M8O7p4l3N0l3j58
2900b70j93O55l98P8j97P5K97O1k85n9N4J02J38m1n8l0J17k27J19j50L84k70R1
$$ y = [342, 35, -83, -15, 87, 207, -11, -110, 94, -108, 147, -151, -128, 2, -220, 86, -305, 189, -239, -55, -123, -93, -95, -246, -29, -144, -87, 26, 99, -141, -64, -130, 69, -291, -230, -57, 32, -124, -284, -216, -238, 8, -160, -31, -107, -128, -135, -316, -173, 53, -334, -318, -60, -42, -138, -164, -128, -365, -60, -130, -93, -222, -205, -228, -81, 92, 110, -141, -240, -126, 68, 52, -32, -1, -154, 57, -264, 276, 14, -227, 15, -157, 21, -33, 92, -75, -237, -16, -17, -1, -24, 82, -46, 208, 256, 320, -214, 230, 286, 474, 199, 57, 156, 57, 187, 188, 106, -273, 318, 171, 144, -91, 159, 225, -67, 173, 130, 393, 187, 28, 43, 6, 120, -216, 215, 272, 113, -215, 382, 377, -7, 86, -129, 97, -32, 82, -165, -113, -212, -36, -202, 233, 34, 84, -52, -319, -96, 109, -22, 101, -124, 106, 82, -319, -65, -138, -181, -137, -89, -22, -96, -129, -79, -112, -270, -463, 192, -206, -128, -325, -250, 47, 108, -177, -236, -182, -80, 58, 17, -41, -71, 46, -181, -62, -212, 172, -98, -7]
2923gp0j88M09k61K19j44J77l13j3J08L31j40J13p8p7q0r6L70k69M9m6N2N0m1
2947E5p4J80k27j56J52J82n5n0j17J65K3N9j70K82k64L64m9K16n72M76l99p9K24
2970A66l00K28J55j54o6M7J75l38K15l8j28M77m77K01rr5j6P5j5k5p1n0J54j72
2994f1p3K39j37K5k26M40j27j65J31k4k10L46m68N48m71L17p2m2Q6j57K82p8o81
3017e78N21N8J60k82J7L2j12R1K26k57K21l72m8L76k99J56p7L54l19r0Q2J61L2
3040E3Q3j94l02N96l17k22K59j0L3O7l12K67k38K81m58M49k07K96m21K89R1J3
3062I6l72q2O50j02q0O1k67P5K66m51J8J33O8k87L79R3K13j41k88J59Kj73L7J87
3086A94k2j93J9K88j9k99n3M2J72q2J53l00K99k36J23M3j07R8J76k89K00j37J23
$$ y = [-7, -77, -265, 144, -117, 102, -42, 135, -178, -191, -83, 248, 108, 221, 143, 66, -14, -110, 260, -9, 40, -6, 46, 96, 55, -19, 161, -66, -222, -70, 112, 57, 7, -110, 55, 78, 137, -33, 249, -15, 349, 300, 516, -56, 420, 21, -58, 166, -134, 94, 249, 95, 29, 76, 251, -87, 128, 90, -38, 439, -38, 163, 154, 59, 43, 118, 103, 78, 7, -43, 111, -61, -134, 105, -32, -7, -233, 207, 80, -85, 46, 22, -188, 158, -310, 238, -233, 84, 12, -30, 56, -101, 181, 103, -578, -57, 1, 161, -121, -104, -72, -184, -93, 133, -124, 97, -275, -323, 53, -246, -90, -167, 187, -132, -222, -140, 21, 53, 136, -58, -360, 236, -81, -303, -44, -54, -21, 46, -266, 1, -237, 44, -414, 35, -172, 124, -297, -8, 83, 96, -276, -358, 292, 190, 110, 171, -96, -21, 245, -206, -188, -55, 13, -274, 105, 198, 411, 270, -18, 141, 143, -30, 7, 194, 172, -21, -2, 286, 267, -32, -85, -43, 129, 47, 200, -100, 199, -37, 86, 129, 22, 120, 296, 7, 207, 70, 193]
3109A93j02J31k8l54L32P3k33j1K50m24O37m41k73L9K74j07n5K28j77J7j74M04
3131A99j7Q9m11K08J60m18J96n0M74n70l95P57j55N0j53jJ83l19K65r7n84L84
3153b05j0p6n1O25m47Q6m3j12M2j00L31k40L04k42J02K45m37J01K26j47P5M7j12
3176c8j87J00L9l3p1J59P1K29l36J52l36O79o53k02M41k65L23L39m36J30J52P5
3198C32J03J83k51m58M11j82o1j64M72l08k20k8K8K94j43K89l67J63K0j94J42
3219F1N7L7n3kl7oK3N0l51M84o01M38K2o0J7j32j98n4L59nOq0j06K15K29k33l6
3246D4r3L26l68k45K25J22J0l6k02J57J49p3j05J23J26l37j01M17j38j17J19j01
3268i8PL28m75P5N1J99l69K24q8R5k00M6M77m32J5j86K28J47j01P1j58M9J82n5
$$ y = [193, 91, 222, 194, -160, 172, 245, 12, 1, 251, -173, 464, 23, -250, -211, 63, -44, -99, 129, -48, -31, -205, 199, 182, 271, -140, 68, 228, -190, 6, -44, 430, -140, -535, 222, 67, 117, -36, -37, 146, -173, 92, -5, -589, -205, -215, -291, -342, 283, -164, -78, -121, -233, -191, -291, 40, -200, 104, -138, -36, 209, -228, -127, 99, -48, 27, 74, -38, -225, -125, -86, -119, -190, -31, 40, 269, -67, 85, -251, 428, -225, -427, 14, -251, 72, 411, -25, 105, 257, 332, 435, 618, 367, -91, 320, 138, 77, -87, 385, 77, -143, -171, -143, 151, 8, 297, -70, 93, 113, -81, 61, 118, 155, 102, 100, 63, 57, 80, 130, -221, 263, -338, 100, 122, 62, 79, -53, -251, -305, 54, 49, 55, -25, -131, 84, 313, 80, 44, -49, 277, -91, -336, -111, 11, 21, -15, -217, -60, 89, 16, -89, 34, 160, -177, -278, 139, 1, -116, 3, -98, -91, 237, -238, -163, -112, 87, -282, -58, -146, -51, -251, -205, 272, -160, -145, -331, -103, 44, -57, 14, -144, -95, 87, 32]
3292C2j03K73m10J20j47J81n7j35L03q5m0PJ3j8J85j03K1l99P7L41j30J85m09
3315b98K2L15NM4m5k75J48J84J69J08k78Mk22J75l1j81R0K95j63j87L42k65l1
3338g5j60L72k74L81o5m2J1Jl6Q4p3q0NJ95k02k56L85k70J78r9o0L35j65n7j4
3363A9k4j73L94p4k06K82k12J77l23M57l12L1K75j87J4k22J26j01k33M20j38R
3385aj30p7oK71P9k57K48l21K37M6k80L65o8j14Jk44L6J02J99l17j20K84J59o6
3409B6J91m76L61J20j25n0q6L4j23J35J16l41N9J30k36k0K66j71N12n82K51Ol6
3432c9K46j53k39J56L3K29m14j17J02K67K14m85M55l63L61m12L47k87m6r7L01
3453E9k0J07j47K3N1lj3J87l9j75k49K51j76J91L6j73R6P2J03j29M3p0J2Jj84
$$ y = [32, -71, 202, -208, -88, -235, -54, -111, -246, 57, -28, -68, -61, -48, -66, 119, 16, 37, -362, -285, 56, -74, 111, -298, -276, 39, 44, 88, 43, -232, -84, 100, 269, 377, 99, 103, -119, 56, 25, -156, -66, 229, 66, -121, 221, -44, -75, -235, 137, -137, 244, 179, 137, 148, 149, 113, 197, 124, 44, 49, 244, 42, -214, 171, -99, 79, -20, -80, 255, 90, 33, 19, -5, -178, 216, 142, -64, 218, 6, 183, -140, 317, 5, 36, 311, 124, 138, -84, 42, -59, -292, 128, -10, -1, -131, -208, -214, 57, 136, -121, 127, -194, 43, 89, -191, 174, 106, -8, -7, -251, -215, -113, 86, -231, -351, -67, 92, 26, 217, -259, 102, 222, 97, 47, -39, -5, -128, 7, 123, -218, -159, -29, -265, -285, -19, -190, 322, -260, -9, -3, -39, 207, 54, -185, -29, 4, 233, -181, -298, -196, 71, 285, -200, 255, -108, 253, -159, 188, -99, -145, -242, 59, 39, 146, -1, 22, 73, 70, 57, 244, 205, 30, -219, 32, -144, 47, 83, -90, 6, 78, 181, 52, 95, 25, 37, 38, -146]
3478a46L54j99j07J90j61K63K0j9o9m7K8j33J62k54K38J06n4q7K59m94L7O3K20
3501A70O8k70L59n95L27j50J95L3j50N5n5k09P4K20k04K63J09J5j48m09L81Q9
3523A68k25J94K22m87P5k20L04j53J07j74M95l17l01L53l9l13K70l1K04j91K18
3544A59l23K93o4LK41p13L30J28k43L44k35J78j04Jj4J21k04j6N26m60j64L25
3566A09j54N1O0r1K37l6l09P1K00k42m8N2Q1M5N3j58j1J52rl15M17k67K62K40
3590C90m35N4%P8j6K8K40m67M69l21J82j95J3j41QK76n6j24J76J24m27J63JK0
3614D0J94n06J84K11n9j78J94l32L40r6O8K42k65K5J36j5k71N6j14K39m7J1K64
3637C21m96m1M45k41k8J06m5L4m8P3j59k55L23L24m64K06J7l62J32J82q7J0j36
$$ y = [-146, 208, 9, -98, 92, -69, 194, 214, 195, 126, 79, 107, -26, 136, -118, 120, 226, 172, 85, 344, -150, -113, -50, 170, 238, -32, 327, -268, 59, -91, 104, 137, -13, 42, -13, -222, -148, 72, -132, 131, 240, 255, 107, -302, 79, 168, -57, 137, 359, -128, -53, -273, 31, -122, -15, -189, 306, -11, -312, 41, 2, -311, -41, -72, 132, -59, 159, -164, 129, 65, 68, 309, -404, -74, 54, -189, 155, -80, 98, -6, -5, -19, 102, -102, -118, 408, -52, -216, 109, -45, 6, 66, -25, 212, 176, -133, -62, 138, -104, -152, -100, -19, 26, 79, -79, -90, 62, 53, -262, 155, -112, 150, 390, -45, 9, 9, 87, 71, 99, 339, -128, 341, 20, 202, 7, 20, -121, -113, 163, 107, -17, 159, 283, -144, 19, 20, 40, 234, -272, -88, 123, 64, -114, 80, -252, 88, -8, 60, 302, 37, 62, 198, 183, -88, -32, -146, 93, 46, 57, 321, -175, -216, 229, -12, -40, 66, 21, 55, 7, 80, -79, -334, -11, 313, -151, 55, 72, -290, -158, 24, -63, -53, -189]
3660a89O02m29n9J61k53n3J58K14l35K87k0k2j12j02j3J88j39n2L7J70l52Q5Q1
3683a47M9j31K07mj01L06k01j73J07J70j10J53k07K25m33L10k0L7j30l1kM4J2
3706g0J07K27k44K96k76k35L06k07K39l56L65q4j82K12p5lMk9j80L43K5O2p5j12
3730E8j97k01M61r6l46K94Kj28l5M24k44q8L10k51r9J97k20K3M19j52j88p1J18
3753a0K12J7k16r4j17J20K40j96j48K76k40J31j02K6%J57k09L76l05l04M79j28
3775c5p4J83J57j17m09K8K91J45k33j0K22j31k63K86l08J77R7k66K18o2j27K46
3797A5l6J42k06j85%M01m9j92M19k58j15Pj86J58L56k86J60o24M45J24j41J45
3819I4l30J17k8MO0J57J90m95L53Q2k45J39j33J55o1M6J37l19p9K71j79j17R6
$$ y = [-189, 413, -16, -75, 86, -167, -220, -62, 152, -183, 104, 84, 62, -50, -152, -165, 23, -116, -168, -131, 39, -313, -228, -147, -98, -229, -22, -26, -127, 179, -22, -195, -88, 82, -28, 125, -82, 143, -290, 20, 0, 37, -93, -124, -126, -82, -70, 37, 264, 20, 316, 40, -195, 111, -96, 143, -213, 152, 68, -114, 98, 23, 20, 24, -5, -185, 158, 183, 245, 170, 58, -139, -340, 121, 25, -321, -27, -25, -153, -188, 236, -8, -96, 214, -37, -136, 61, -159, -136, 283, 131, -57, -128, -10, 202, 219, 3, -91, -208, -88, 152, -44, -192, 84, -156, -25, -127, -101, -101, 56, -153, 223, -82, -386, 93, -35, -109, 74, 231, 114, -295, -267, 24, 169, -64, -74, 148, 17, -246, 40, -268, -91, 6, -260, -42, -104, -231, 15, -21, 121, -85, -270, -270, 131, 82, -110, 309, 51, -64, -57, -243, -85, 271, -15, 145, -479, -34, 90, -51, 94, -236, -119, -147, -143, -83, 74, 264, -231, 122, 204, -41, 98, -35, 120, 59, 105, 242, -77, -156, 115, -64, -181, -85]
3842h5l3M03l19J28K10l00K9P4k19M33l06j6K33p0j98k9J34j15k4R9J31K10l20
3865E0L3j70L1N64l16k89j4M5l1K85j85J26jl71ML12j79J29M25l95P1r0j95K81
3889A20Oj9j3K05l55K7j92J95P1L63o57k5L55K0M3j96J76j64j71J93q1L36j33
3912A04n7n6l60L79M2q6K7j13N0J13j51N2J73q4j63J79l43M83l50K87j44Q8M3
3935A13R9l24j73O5N11m55n9K36n8K56m24R4K22N4m03M40l79M00j84j34j3K18
3957A02J84j86R2Nj48J29j99l9J37k10L36j05lLP9J70k46l52N16o4j93K2r4j76
3981b40J46J08K49k72J77k12j08K25Q4j34j55J71j87L62p7j5m36K60K75l08j43
4002b30K54l05L40k80K00L2J76k30M0k22K30J93l08j54M02P1j98j42oL59N4n19
$$ y = [-85, -118, 285, -34, 94, 304, 4, 33, 107, -112, 321, 15, -1, 232, 162, -36, -65, 69, -46, -70, 29, 160, 370, 50, 83, -87, -56, 508, 192, -97, -111, -66, -97, 188, 3, 129, 128, -243, -239, 73, -106, 23, 448, 53, 124, 34, -161, 120, 126, 107, 94, 299, -56, -29, -221, -26, 45, 408, -249, -274, 81, 101, 144, -52, 124, -40, -211, -18, -99, 237, 104, 47, -9, -369, 10, 52, -34, -7, -120, -70, 43, -108, -56, 117, 33, -130, 49, -294, 189, -161, 126, -18, 70, 113, 212, -112, -285, -220, 291, -164, -223, 13, -45, 211, -213, -119, 103, 157, -246, 194, -185, 215, 31, -103, -116, 102, 286, 100, 192, 197, 49, 178, -21, -60, 77, -133, 203, 98, 95, 98, 177, 347, 101, -251, 265, 201, 8, 30, -64, -240, -94, 14, 263, -9, 168, -44, -152, 73, 157, 23, -132, 39, -148, 214, 137, 122, -314, -54, 221, -87, -230, 24, -281, 59, -221, -21, 11, 187, -43, -3, -225, 5, 198, -110, -264, 138, 209, 11, -131, -137, 222, 276, -243]
4024b43rJ09j80L43j7k5j5J99M9k65K38j12j83J48n6O8q1Q0q9K01j78p9J62k9
4048C6l6K9p6k55M22J08o47L52J32n8K28k50qL12k15k2l5K9K4j34j18J62J25l13
4072b08M65k10r7l3K85j91l6K38j34j06qj26K20N9p0j65L22l27jk5Q0r3M2n7Q0
4097i6L30j96J82k79O6R2m9j86K43J20j48P7o4J47k88M0K18J60m03j77N20J3n59
4120b37L10K7k9k8N4r1M8J69j15j95l7J09j03J27J0J96l11M8J85r0J56j77O3J5
4144A04Ll64L85k21l32M12r8J4k6K08R2O5j45p3k88J47L1K34l91K12J95j89J06
4167H1P6K8k45r6J11m5L43l66L9m36O28l09J18K45k10J65m18L90k79k0kK5J49
4190b8k9K23j84m96M88m7K28k89r3M55k16L14j37n3P1j48j77K6k72L75p2J67o2
$$ y = [-243, -252, -143, -323, 20, 3, -22, -37, 162, 211, -54, 184, 72, -111, 37, -19, 49, -32, 48, -41, 160, -18, -97, 65, 36, 0, 29, -47, -302, 120, 228, -419, -67, 65, 7, 235, -15, -23, 289, 74, 52, 17, 46, 70, -64, -182, -20, 105, -208, 257, 47, -50, -83, 202, 11, -25, 213, 79, -27, -35, -161, 59, 118, 48, -117, 205, -122, -123, -148, -68, -161, -119, -176, -96, 234, 38, 220, -59, 7, 99, 50, -136, 107, 227, 79, 156, 92, 239, -49, -9, 209, 369, -34, -211, 309, 322, -237, 73, 100, 71, 43, 97, 6, 54, 223, 108, -87, -124, -15, -118, 9, 19, 215, -96, -48, 137, 47, 203, 26, 89, 104, 107, -257, 128, -93, -425, -13, -111, -97, -123, 85, 177, 242, 97, 24, -264, -117, -86, 148, -243, -31, 164, -25, 81, 157, 185, -60, -156, -45, -90, 253, -113, -74, -510, 118, -191, -73, 172, -38, 127, -291, 99, -180, -200, -202, -177, -28, -57, 166, -18, -514, -26, -73, 155, -134, -227, 228, 12, 326, 189, 136, 207, 59, -118, -92, -364, 11, -61, 106, 44]
4213D4m8Q8k2j35m7L27j88q5K93l46Q8J65j46p9L6j76K34R4K07k70m07M78l9p9
4237a3k3p9j37M24j57k0K00l06M4K0k41L56N7r2MK41m42K03j14R3o7M0o1K08J24
4262B62l9m14Q0K68M%l03K73K9J81k51j22J39N1k18j27j77J70K82j75K75l83J78
4285a7k6m9N2K94l22J22R2k63j40J27j48L73l9p1K9j40m6J91J76k17r9k6M17k0
4309B50j72j02J6K16l02R0o1J29k40L96k25k13L53J21q13N38L13n10J89k64L08
4330A7j25K74k34K90q7kq7Q3k53K23k70J16OJ65N6r3Q2J42l14j77J48J56j45N9
4354C0j28K72L04m32Q2p5j9k03K43m36M57J56l43J99l2r0Kr3o6O61l11J18k67
4377B9p3J05O4k0K14l12j85j0L62j43O9r6l23J25K21J84j48j45Q3k18J01J20l15
$$ y = [44, -4, 84, 62, -73, -120, 207, 19, -66, 227, -119, -31, 134, -12, -91, -55, -231, 3, 97, 304, 34, -373, 105, 66, -13, -36, -115, -252, 172, 15, -5, 195, -111, -67, -47, -288, 68, 125, 33, 37, 278, -164, 39, -75, 18, -49, -9, -70, 138, 262, 223, -191, -111, 157, 161, 161, -142, 131, 160, 341, 90, -32, 107, 158, -60, -187, -364, -194, 88, -87, 188, -195, -17, -43, -92, -40, 254, -68, 54, 146, -117, -257, -130, -278, 95, 56, -15, 14, -126, -172, 19, 195, -22, -121, -147, 270, 250, 78, -24, -8, 208, -94, -4, -65, 64, -176, 220, -5, -218, 135, 256, -557, -19, 294, -216, -27, -291, 17, -108, 166, -68, 222, 135, 133, 46, 129, -124, 99, -171, -55, -49, 116, 172, 79, 161, 303, -11, -188, -40, 116, -29, 30, -98, 174, 478, 46, 128, 53, 34, -169, 74, -362, 95, 251, -92, 107, 75, -15, -13, -106, -172, 489, 178, 296, 29, -44, 61, 125, 105, 319, 7, -178, -188, 174, 31, 100, 4, -319, -194, 27, 211, 63, -82, 1, -217, -116, 4, -311]
4400c11K44K1l56O56j47l10N02m13K57l27K83j14O5k17L9L77r5K39l02j04J02
4421H9j98K61K93l74J58k31j52O2n8K85J10m52J68k25J57O1j9J20j97J89l0J94
4443B11m90K48L10m12l1Q7J42p0j13K83j00m45M65r7j3jj21K72m45K47J31j51
4465i3j6J36R0m2j69J87k55P9K81k29K33r4nj42n8Q5J50K70l08m28N24J60m66
4488a10J79L85m02r8j1J86j17k45M29k37J39J09l54J92r7L20k11j5r9J86P6%j38
4511F7l9j6rk07K96J56n37L20j25J30k27J73K64l49N0K13m33K60K30k87J20j41
4533i1o1M19j62k46j79M56m4k44j5J29J94j61N3j32J70j86J71o3K13l48k6L27
4555A74l79L49J2m79K66L94l64j05J94l59N33n60K73j2M3j58j47K48L08k02l48
$$ y = [-311, -67, -46, -402, 254, 107, -203, 299, -114, 143, -184, 99, -15, 50, -167, -128, 249, 154, 393, 91, -13, 89, -109, 152, 445, 71, 229, -2, -154, -92, -150, 135, 245, -207, -39, -264, -107, -46, -65, 55, -142, 47, 17, 211, -279, -31, 279, -133, -164, -77, 65, -5, -118, 165, 65, -380, 85, -12, -25, -26, -147, 125, -320, -73, 58, -93, -109, 27, 117, 75, -94, 93, -162, -83, 198, -31, 202, 108, 103, -39, -97, -12, 138, 408, 100, -328, 196, 356, -110, 69, 454, 52, -46, -57, 129, 12, -233, 196, -41, 98, 207, -147, 45, -52, 268, 57, 42, -57, 129, 205, 205, 67, 28, 12, 3, -204, 92, 248, -289, 31, -94, 36, -191, -18, 246, -103, -53, 160, -273, -13, 217, -70, 50, -91, -152, 267, 105, -141, -320, 136, 92, -152, -167, -38, 156, -5, 48, -84, 86, -100, 71, 8, 221, -127, -153, 174, -205, 144, 156, -323, -57, 337, -27, -132, 62, -297, 236, -324, -51, -63, -20, -178, -325, -77, 231, 29, -319]
4576c19L12l34L21J98l92L15k17J93k6n2J44j84J99j65J41n7k45K59M2k01R5j25
4598i8O3j35J66J86j30j75K5K46j23j11J27n6K26j4j62j34M6j27O3R9p4J44j03
4621e1L43l72K34k18j35K85k40J96n8J17L9j4j05J60k38K3j52K44j03J55m63J48
4643b05J66j4K53l24r0L07Q5m10M11J37l35pL13o22J73M11l85K02nk62M0L87M5
4666B71k06k76J64J71j46m22M32k39N16n27j08N72j69k34j88J32L24l6j60K13
4686H4j94RK9J58q9l24L22J02M3K04j92l01K79O1L0j45m69N91j16R2m31K69J69
4709A81m4l57J0L70j77K63j62l4P0l12P0p1R4Q6J9j05J2K90J21l76k3J57j55j06
4733a79J80n2O8K71k82R9J22j70j90K62o5J8k44n2L69l64J94Q7k10M3L30m39J71
$$ y = [-319, -7, -341, -20, 178, -214, 101, -116, 77, 51, -1, 143, -41, 158, -7, 134, 77, -168, 91, 133, -68, 27, -98, -35, -170, -4, 182, 52, -123, -98, 148, 25, -86, 41, -15, 211, 197, 35, -99, -53, -180, -117, -18, -92, 52, -51, 292, -80, 154, -64, -199, 86, -154, 42, -16, 101, 140, 126, 21, 181, -57, -34, -186, 58, -45, 110, -353, -205, -39, -53, 200, -124, -214, 93, 178, -232, 179, 316, -19, -26, 287, -335, -162, 249, -136, 66, 61, -201, -161, 226, 271, 65, -211, -47, 124, -22, -444, -12, -251, 265, -262, -370, 202, 33, -201, -389, -257, 67, 31, -129, 84, -110, -101, -72, 86, -3, -327, -5, 97, 140, 344, 152, -149, 130, 191, 221, 76, -393, 198, 82, 174, -257, 12, 181, 137, -220, -210, 160, -17, 246, 84, 50, 120, -192, -122, -193, -99, -13, 6, -99, -87, 203, 324, -52, -75, 82, -73, -179, 1, -51, 17, 288, 6, 105, 227, 57, -133, 129, 64, 82, -162, -214, 155, -209, -15, 72, -138, -95, 235, -204, -33]
4756c3R5l10M40j07k54K67k08L67m07K47j96J53J3k34o1K12J23o4N9k58l1K30
4778D3J28j71nM5l09R5k5N74n2k09k5k32J2j87M44j89M58n22J97l05M18k38J53
4801I8J13Kk05j39K0J33p2L16n50R5J92j01J47l13M21l01K66j22M7o9L09m16R5
4824c4K56l34O4P6j14N9j55L60l74J2K99k05J67k00k6n2K17p0Pq8m0J60J63j3
4848A35n9J21q6O2j2j96j29J78mr1m7L2J17Q4m1p4J91M5j48j96j43nJ84J27J2
4873E7pj11j62M01l15K53l91L11k19n1N59j41L2j42r3J64k89L17L3o2k08l8L04
4896B02p9l09l7K37o3O9J38k62j24R2j1L68k13o9J44j21J63k9P2k57k38O86m30
4919g1O8mk14K01k21K11K06k54L3O1O1j87j37J29J36L3m7k06O35l10j74J00k63
$$ y = [-33, 62, -248, 192, 85, -169, 98, -110, 257, -150, 97, -99, 54, 67, -167, -228, -16, 107, 43, 102, -156, -187, 43, 171, 0, -5, 40, -269, -174, -199, 375, 323, 114, 89, -143, -131, -318, 126, -63, 395, -127, 70, -235, 183, -55, 98, 211, 213, 8, -131, -111, 22, -50, 266, -284, -189, 3, -98, 49, -264, 157, -144, 122, 0, 47, -22, 287, -129, -34, 222, -112, -48, 28, -86, -27, -182, 178, -196, -184, 115, -90, 77, -123, -149, -201, 16, -54, -47, -135, -175, -15, 148, 135, 76, 197, 111, 173, 161, -35, -164, 14, 10, -81, -128, -96, 21, 105, 64, -10, 181, 226, 78, -118, -261, -266, -82, 45, 57, 50, -61, -223, 178, -137, 116, -275, 36, -183, -234, 325, 184, 216, 74, -19, 145, -144, 173, 206, 144, -64, -102, 202, 123, -186, -223, 14, -49, 20, 158, -104, -228, -136, -147, 221, 8, -61, 83, -38, 125, 96, 168, -89, -327, 359, -71, -3, -7, -221, -20, -241, -30, 176, -78, -45, 16, 77, -110, -247, -118, 18, 51, 4, -202, 433, 123, -51, 49, -214]
4942b14L30j27R9j14K30p4l6l3J82j61j36p8J36M3l2J17l02L5K31r3J73j17j55
4965i6K18n5J79j82j22Q4j75K70p9J29k04Rj97J7L61l8j77L41m64J18k36L6K51
4988a2J54k50L13n8N8Ro9l91K35L2j46J51J32k35k1O7o5J74r4j82K00k5j48R0
5012h1m0J88r3R7j97K41p5Q9q1l7M6m10K10K18j73M8K16m03K59K59k36j90L92
5035B47j17m46J90J10n5j44L26k49K81j91J18j21j11O4M9J95j50J88j15j93k3
5056a47L18m76J09k38M31M1j74J05J44k84K02k52K16j67P1K01j00n3L6N1k60L75
5078A49k67K51J86K6n39m4K00o0P5O9j33N0J99J46m00R3Q4P3l17J53j22M14l50
5101f4L5jq8L61j70j63J12k7OR2n9j14M0j4J99mk10K77p2J38q3j68k14k3M64k11
$$ y = [-214, 116, -11, 88, -26, 204, 130, 94, 61, 243, 82, -54, -132, 4, 47, 15, 132, -170, -135, 96, 3, 176, 59, -96, 122, 67, 246, 64, -58, 26, -149, 121, 42, 171, -33, -24, -221, -204, 157, 119, -58, 283, -181, -63, -299, -263, -12, 142, -108, 205, 147, 205, 214, 145, -246, -11, 21, -125, 26, 158, -77, -98, -31, -96, 78, -16, -198, 2, -23, -171, -81, -121, 67, -26, 71, -126, 115, 40, 129, 48, 11, 57, -353, -143, 75, -98, -50, 166, -237, 22, 281, 45, -145, 247, 130, -316, -126, -16, -71, -215, 111, -138, 143, -48, 70, -51, -162, -98, -49, 146, -4, 184, 69, -124, -147, 171, -305, -196, -434, -3, 38, -136, -31, 113, -171, 31, -221, -5, -172, -101, 100, 0, -53, -17, 34, -226, 149, -118, 133, 319, 345, -194, -238, -38, -98, -23, 46, -87, -37, 162, 308, -92, 1, 85, 158, -159, -6, -128, 286, -64, -29, -30, -118, 243, 73, -90, 22, -5, 1, 93, 34, -80, -40, -54, 145, 141, -69, 208, 136, 274, 191, 23, -191, -214, 250, 39]
5127C9Nj00k12N81J4j80q4P2m54L3J31L6J80m67L19Q9J39ql02N71n03L1J30O2
5151A22J45k79J67m50K50Q2j57J32N1n44L93L62l68J77q3O3K4J58l28J43O4R2
5173B16l00J78K34j79j55o4j27L58k44J38K91l99PK31j74q8m0R2q5L1Q8P6Q7k85
5197a13Nj1J35j46r8K76k5K19p9j25J04j29J00l91L02m9J5p0k32N22j18p1L3k39
5221a85K61n1J83k32L4p5j21J92J6r8j65M15j06o8J13j89N2O0J90k10J73j93l2
5244c6J84j55j08O8P6j82J41n9K0J58j71j10L14k07n9K97j11k97K36K55l40J52
5266F6k04L7M7K4J2J29M5n3j43RK03j81Mj88J26J01j11J74j01j74M2l5L06j47
5290a2k59M90k84J64j13j1q8J95k38K7J93j66n3j3J30o3J96k31J86j71mK31J85
$$ y = [39, 44, -56, -268, 313, 327, 147, 63, 135, -319, -286, -155, -119, 61, -406, -87, 2, 141, 133, -169, 402, -101, -70, 60, 122, 267, -12, 155, -295, -45, 37, -120, 12, 63, -481, -88, 274, -94, 83, 0, 63, 87, 245, -83, 60, 124, 216, -84, 94, 328, 149, -6, -70, -197, 161, -83, 55, 346, -53, -46, 185, 11, -77, -117, -25, -110, -79, 9, 85, 172, -113, -108, -119, 16, -130, -228, 48, 23, 242, 163, 38, 142, 13, 113, -278, 24, -25, -10, -80, -312, 210, 92, 21, 54, -185, 76, 25, 208, -24, 10, -65, -186, 6, 22, -76, -241, 174, 68, 0, 113, -76, -24, 36, 226, 16, 189, -4, -36, 148, -7, -115, -47, 29, -153, -12, -71, -51, 107, -64, -174, 140, -67, -126, 171, 60, -237, -1, 254, -86, 66, -138, -101, -54, -30, -18, 111, 156, 103, -40, -31, 172, -9, -5, -193, -67, 34, -77, 97, -4, -178, -136, -171, 135, -12, -271, 219, -65, 99, -14, -25, -113, 82, -156, -129, 64, -102, -155, -168, -38, -101, 95, -136, 50, -121, -125, 106, 291]
5313B91m79K15M3j57K74j11M1k91L53j74n5J70N3k56K72l25p9J36K23j51k38P8
5335a67L24k19j0Mk25L60jQp9L23n02L77k20j60K50k05J65j38J02j08M07m62K28
5358E2J12j58j8K23r7p2j3j82L62k52j68J77MK46m8j12J18j01k35N04m91K5J38
5381A4J10J0P3K2m09L41m05O5L10M9j03j73O8J34j62K44o9k81K72k39K0j09N7
5404a61K90m61M64m18L87l0rn0o8J0L11l07j45L62k48J45l1J06j43j22M47l99
5426g0J61o9p7J27j11K27j03J17k14j72Q6J11L2R3j18K8J5k06J79K12l74L30k34
5449c0M6j31JQ0p8K76n0k20J24j84oJ64l2K5j39P5M06k86l66L03l5j40L8M2K11
5474I4m18K09K03n8J59j35J82m04L55m27L34j53l5k8J89j24p0J5J36l15J05K87
$$ y = [291, -188, 27, 70, -87, 187, 76, 117, -174, 179, 5, -50, 120, 173, -83, 189, -136, -215, -79, 144, -7, -245, -167, 157, -62, -72, -68, -293, 67, 66, 74, -5, 318, -184, 193, -27, -187, 63, -142, 23, -115, -13, -121, 286, -176, 52, 164, 6, -12, 211, 114, 42, 29, -153, 209, -43, -211, -34, -30, 216, 168, 56, 174, 73, -162, 342, -149, -124, 14, 124, 134, 207, 229, -180, 161, -244, -179, 131, 180, 77, -96, -28, 106, -56, 188, 119, -162, 110, -129, -109, -218, -161, 129, -332, 132, -286, 101, 71, 62, 12, -56, -46, 265, -42, -187, 175, -73, 72, 41, 147, 4, -118, 329, -70, 91, 22, -55, 72, -39, 188, 85, 202, -12, -184, -98, 13, 45, 138, 20, 48, 63, -143, 36, 248, -126, 204, -30, 16, -115, -114, -34, -112, 164, 114, -106, 18, -166, -172, -8, -40, -15, -154, -79, 327, 41, -325, -22, -57, -197, -159, -117, 94, -324, -115, 88, 30, 189, 54, 236, -168, 187, -240, 94, -59, -94, -122, 67, -57, -127, -112, 24, -291, -186, 101]
5496A01j46Lj36L81k84K27k14J16m6m4P5j21J30j75L22m84K65Jn4P5J06QJ12j53
5520F5j89O8L7Jn2K30k60pj65M71k77J19m0L51k34k95L00n62N55k63J24O1J0J03
5544A51n19M23L38j95k08q0J01J46k19L8K0l9NoJ38j19p5N36m88j6K34p9l70K38
5568d5n6L9k03J18J59J07j92K65J0k60K1Q8N3l25J52K80j75m21L73j6J32k69J77
5591A2J52k2j90k55K39J31J1j72J34L1J03j37n4Q7j41k12O02k34j37k72P7L50
5613A03k97Q8J7L60m83K88N6j12j00J26n6J97L3k56o5J65o1o3k3O7j40K33j19
5636d2K19l36k6J10K08O6n9K41l80q3M9J90m6k35j04J44M17l90M5k6J39J8p0P6
5660A25j92R0l6n9J40lL3k56M01j37j98M8o4J24J24k76J63J15J64k39k45K29l6
$$ y = [101, -45, -42, -178, 203, -81, 146, -68, 48, 2, -42, 33, -88, 42, -133, 189, -295, -30, -29, -83, -8, 98, 106, 218, 65, -124, -56, -19, -18, -70, 160, -100, -107, -272, 199, -78, 41, 1, 352, 118, -177, 123, -439, 116, -147, -23, 38, 48, 151, -368, 55, 393, 198, -10, -90, 11, 157, -62, -24, -4, -43, -38, -44, 94, -25, -100, 436, -52, -68, 166, 87, -283, -45, -101, -62, -265, -147, 12, 119, -73, 192, 202, -58, -37, 51, 104, -221, -69, 211, 36, -385, -12, -28, 104, -165, 12, 164, 142, -48, -303, -64, 67, 78, -94, 40, 71, 174, 37, -17, 70, -71, -283, 319, 85, -52, -324, -247, 103, -194, -106, -89, 271, -212, 76, 132, 20, -80, 46, -10, 187, 220, -36, -101, 64, 3, -60, -83, -16, -156, 77, -42, 177, -159, -185, -75, 133, 199, 140, 381, 1, -82, -33, 157, 111, -124, -228, -84, 333, -57, -12, -38, 101, 119, 49, 125, -67, 23, -13, -72, 68, 65, 98, -158, 243, 106, -92, -44, -108, 16, 140, -136, 27, 142, 306, 67, -178, 51, 15]
5683A5q5R4j57K95o8r8j21J70l5K71l44J99O8l65L57j62M0Lj59K21l48J92J10
5706I3J31j69L3k16J8K96j24l8j01L34K56n23o0K71j28j64n3K44J25n2k30J21
5728F4j2j7rJ27k14Q7Ko5J40j5l19L47l78K74o8M5J59j08K09l0n07K31N6J09N1
5753A59j63l2K35p5o5j51M25o24M96j42j67J93L0J81m59J91o4p9L03p2j91n7M40
5776C12m47J54j52J28Q0L4J45j55k16o8L54k12k14q9J58J2K0O2J74l5J47j73J13
5799A32nQ7j00j72q5M6L10m71J58k9J04K41m79K04k3J54J40P5j31q5M0k23J41
5822B9j10K29k49R7K02K3l70J90l02J36J91K04l00j35O2M96n09M4J39j59n8M53
5844C03k26j33J32Qk96K37L01o00L07j45J85oJJ22n29MN78j34j70K15N3l95J59
$$ y = [15, -70, 24, -133, 162, 94, -4, -125, 45, 10, 281, -63, 136, 204, -161, 196, 34, 74, 77, -82, 139, -209, -17, 93, 224, 55, 88, -128, -110, 186, 62, 24, -77, 257, 513, -10, -70, 201, 73, -91, -144, 100, 225, 173, -57, 64, 52, 35, 26, 153, -61, 26, 28, -37, 103, 88, -231, 116, -262, 12, -56, -11, 148, 40, 249, 219, -288, -57, -1, 108, 159, -4, -36, 199, 124, 59, -92, 333, -291, 205, 63, -104, 89, 119, 300, -159, 32, -32, -111, 192, 120, -71, -128, 312, -135, 19, -133, -5, 75, 109, 254, 99, -117, -185, 169, -43, -257, -346, -188, -176, -156, -94, 80, 45, 192, 19, 132, 127, 214, 114, -58, -143, -97, 213, -258, -100, -129, -25, 216, -263, -59, -82, 72, 212, 287, 156, 71, 111, -112, 29, -81, 148, -101, -4, 198, 221, -149, 41, -261, -125, 66, 270, -30, -165, -103, 393, -116, -72, 67, -92, -150, 303, 77, -56, 76, 84, -212, 25, 326, -274, 33, -112, 73, 67, 68, 190, -339, -335, 243, 109, -61, 154, 207, -188, -29]
5867b9K26L2j27j39k36J21r4J84J7M33n37M27k65L9O2o0k61L18N8l4l64K56k00
5890a73L40k44P3j82L58m31L19O1k88o8L50K8n2k42K43l39J04M46P9p08M8K98
5912B0j1l14K93q1j71K97J50R3k74J8l3p6ML23k69J20Q7q9O3j43M4k10m0J27m52
5937e24M13J97p4p3j98K63k04k2L65m64K81j38J12J26J35k58J32n6r2j9J73Lj3
5960F5R2%l22M55l50N0J04r2j49K73k86M49l53l82M82J33J71m71K32n3j14M2k05
5983b29K93qQ1l06Q4R9Q4k57N1K22j75M4J54l24m8J53K4K42n0k95K6j19M11K7
6007A84mk08J75j69J08l9l56N20j11n0l5L61m27k03K91K59k04j04PL5q6j81Q5
6030a52rJ82k59K28k28P5R4q4Q4O7l22L98j08O5J69m07K92n1j91K59K94n45j91
$$ y = [-29, 197, 229, 102, -37, -273, -152, -246, -62, -45, 388, -149, 278, 13, 52, 114, 54, -207, 111, 169, 135, -229, 27, -173, 167, -77, -4, -186, 172, -259, 60, 121, -167, -235, 115, 143, 91, -151, 92, -247, -143, 303, 382, -326, -278, 20, 9, -305, -12, -93, -264, 33, 183, 276, 2, 20, -13, -89, -85, 238, -31, 89, 176, 87, 150, 7, 51, -159, -199, -72, -524, -111, 86, 12, -61, -259, 4, -200, -222, 143, -321, -40, -178, -66, 60, 195, -63, 69, 13, -79, -98, 75, 78, 65, 157, 157, -165, 290, -60, -10, 94, 2, -147, 126, -160, 289, -64, -446, 36, 169, 340, -131, 101, 48, -66, -24, -229, 64, 56, 137, -169, -85, 14, 98, -159, -108, 114, -61, -17, 137, -187, -235, -82, -58, 184, 134, -161, -135, -254, 157, 184, 180, -28, 147, -22, 86, 47, -309, 211, 100, 50, 15, 376, -51, -254, 37, 296, 92, -12, -5, 30, -56, -237, -152, -161, 21, -238, -10, -238, -163, -69, -153, -69, -2, -324, 74, -34, 31, 200, -207, 85, 34, -157, 102, 396, -149, -340]
6053c40M87j79j7k88M85k28R7j48j87L84Jj22K20k78P1oO8j08J05j0J12p5j28
6076h4k3L39k54J98J85m10l9K49r8k1p7k5L33k21l33M23J17Rl60K3n1J51M3j97
6100a23K65j69pj62J46J6R5j32j0L9K86j11l8k02J68p4J33p9j74K06m3j36O5K74
6124B33j03j22j33J95M4k05n9L50k1p6J07k12k4k87M20k37J04Q8M0p5j44L10j44
6147D9K0j26M34k86M1j28K6J65m2j80j08K63j52K8j78N7m0K67k09J6O2J9k27K63
6171C4j58K0P6l2K20k44J22j82K45K58k87j14j06p2j4J68K17j46N6n6J22m12N70
6194B85j46m24K26q4MKL9L85l72M2K44k39K58k39j49l9J07n3J44L78n61N37j55
6217A90J9O0l3k33N9m12L80J99j84J13r0j32J74j30j70L00j64J60j94K65r3l60
$$ y = [-340, 147, -32, -49, -337, 148, -80, 17, -131, -318, 66, 67, -55, 165, -113, -42, -48, 20, -88, 17, 7, 119, 44, -84, -107, 232, -22, 176, 361, -49, -88, 161, 63, 42, -35, -60, 273, 52, -281, 142, 259, 268, -92, -69, -120, 31, 74, -123, 142, -27, -34, -196, -50, -34, 61, -71, -81, -42, 244, 133, 95, -107, 61, -13, 120, 41, -133, 73, 30, -106, -41, 233, 130, 8, -125, 70, 114, -91, -150, 200, 179, 103, 210, -2, -26, -313, 107, -130, -26, 62, 102, 27, -117, 193, 49, 69, -57, 377, 91, 132, 4, 30, 195, 153, -27, -135, 128, -24, 4, -174, -117, -157, 110, -99, -83, -21, -2, -229, 34, -124, -104, -28, -60, 160, -84, 38, -144, 101, 359, 72, -42, -148, -220, -234, -66, 151, 5, 61, 5, 127, -285, 285, 139, -285, -59, -143, -139, -137, -98, 287, -85, -43, 201, -38, 220, -19, -168, -207, -100, -153, -9, 369, -192, 345, 190, 209, 269, 236, 3, 62, -350, 30, 229, 45, 158, 68, -64, 110, -20, -190, 110, -54, 106, -88, 177, 84, -276]
6239b76N0L54j53K76j47n0m12K80o1k7J71J73j51Q0l0J48%j35k02K00K36m17M4
6262d9k39L93r9k64K24j81l27O24j00J60k7j41K85j74O4q3p4K52K9j75LJ22j40
6285H3O0l12j23L10l5J7J61L1m78M28k39m7K08k85L30k10N9k63L41j91K93R9m26
6308a89K1L10l82N48k70R8j07K18j37r8j1J56M1j50o8J03j15P7j08O4M7l0j01
6331h3j2j28l7M54k96J96j90J65k83M68k58l0j50oJ59J5N8p5j21J93K9j88K16
6354I6j05nJ51l13O9L1K19j16N7k91K71J19j84j45K1j62L65q0m2j92J34m2p9M86
6378B63l39K83k18K8j44L49l01J26j34K64k63K0J21k38p3K27J32j34OJ32j04R3
6400I6k7k45J89N7j9k6J38l09M0j9R7P3J06m26K85J31l77K76j01L28m34J91m1
$$ y = [-276, -226, 128, -25, 251, 104, 54, -358, -78, -139, -166, 5, 178, 27, 107, 77, 225, 225, 90, -112, 88, 324, -93, -49, -288, 105, 6, -258, -34, -215, -542, 82, -18, 142, 115, -26, 259, 85, 149, 66, -8, 244, 273, 98, 101, 223, 83, 143, -169, -292, 18, -17, 0, 161, 192, -286, 142, -97, -144, 64, -221, 109, -101, -42, -305, 36, -155, 138, 237, -189, -168, 142, -240, 308, 38, 136, 29, 247, 110, 12, 1, 157, 198, 48, -20, 83, -32, 45, -63, 1, 48, 18, -83, -95, -223, -260, 194, -102, 94, -96, 69, -214, 254, -4, -34, -184, -190, -31, -16, 42, -33, -154, 39, 68, -120, 96, -9, -14, 137, -176, -107, -76, 143, 27, 84, -207, 64, 183, -1, -146, -125, -287, 78, -2, -44, -236, -102, -144, -223, 263, -76, 207, -11, 17, -127, 222, -79, 47, -87, 177, -86, -66, 55, -183, -256, -29, 103, -31, -25, 107, 3, 96, 69, -176, 13, 70, 51, 25, 163, -146, -106, -125, -28, 45, 151, -275, 10, 141, -236, 40, -61, 267, -167, 24, -17]
6423a7jM33o63J09L18j76n8r9Q5J74k04L98n05J98n8j62L78k14m4j04K19K5K3
6446E5k94J78p5J85j39j36J33K45k74P8L27j28k85j25J78R8j11K82l39j61J64
6467a44J78J44k14J91j59q3j21M1L0K5j22M04l48J29j22J49K51l70qN5J5K97k30
6490a2l16M50K14l30j68L08j39l7J64k16j71J34K30l88K35J18l0n1l77M70l3l78
6512c23L72K72l05N3j36p4J48j60K67j86j90K0J15J07J9rl30O43m50K81j80q8
6534a34j05J66j92L55m0J67k15J77k97M67l47K44m2k24j20K46j21K37k2j73l77
6555c50K98j91O02l32m7l0J43Q1l27O4K86l55Q6j09K83l2j85L24n86M59K7j51
6577d2j92K54K58l94l70M79K7q2L7J98j75J59q0o0k8k9J44K71k92j45%J40q2J70
$$ y = [-17, -18, 415, -248, -139, 179, 3, -55, -154, -69, 105, -99, 299, -206, -8, -66, -228, 150, -64, -108, -212, 7, 32, 55, -239, -61, -136, 49, -90, -226, -93, 152, -122, -44, 283, 155, -130, -255, -77, 21, -90, 192, -147, -308, -144, 34, 178, -36, 155, -4, -87, -208, -167, -137, -112, -234, 170, -178, -49, -171, -22, 229, -141, -149, -94, -79, 218, -12, -328, 122, 336, 6, -162, 146, 7, -30, 134, -82, -253, -119, 111, -277, -42, 76, 46, -5, -382, 88, 55, -323, 49, 321, 16, 69, -67, -141, 7, -153, 114, -72, -262, -242, -127, -20, -1, -10, -340, 303, -147, 134, -46, -134, -239, -73, -265, 90, 50, 217, 2, 179, -118, 349, 2, 246, 204, -20, -140, 106, -15, 222, 200, 27, -350, -52, -243, 359, 27, -20, -50, 93, 174, -153, -89, 197, -158, -72, -181, 102, 70, -115, 209, -377, 82, 109, -42, -234, 20, 278, -116, -486, -7, 20, -62, -25, 173, -2, 157, 77, 17, -11, -40, 104, 375, 83, -62, -62, 78, -4, 166]
6601A66j52k5J33O4r9k44M33m30M16k44k28j23K98n8R9K59m66J65K97j11j47K51
6623B54k06J52l5l12Q5RK4M8K53k73N2M4J1o1P1j68j8Q9N3J6m8N1j58j57K05j80
6649a99K59n5L16k52l53L20K9k3j11j86L8p4M77l91L44m11L84k31l6K06j05J51
6671I7k20K42j35K21k21P1k29J65J0o7R6K2k87L94k1l70j53K19Q7j32K20j12J75
6694G2j16J11J21l19M0k05K10N3J18l08J65r8K16j80K94j53q5K58j64n3J04o7
6716A4m2N1k2k13K55rm8K0Q6o2n6j58J03q1K74k45n9M35j16j10J05n3j10q2M35
6741C12K7m40m8K03r4P2M96n32o8j61K93k1L6j0K29l45L6K6M8k23K96j31j69K50
6765H2p0j53L6P9O7k00J33L13m28L11n3k02K31l2l40N40j83l14J60k34J20M22
$$ y = [166, 14, -11, 122, 186, 87, -157, 276, -154, 262, 18, -210, -333, -35, -93, 6, 265, -201, -36, 261, 150, 3, 254, 48, 200, 165, -147, -62, -53, -29, 19, 272, -1, 51, 95, 106, 45, 116, -52, -70, 19, 72, 88, 40, 91, -67, -224, -19, -199, 60, 5, 321, 69, -284, 36, 65, 42, -69, -255, -217, -291, 186, -205, 139, -272, 112, -119, -155, 51, -54, 97, -123, 119, -16, 205, -16, 55, -174, -9, 1, -66, 30, 52, -235, 159, 138, -232, -385, -166, -79, -211, 9, -103, 72, -44, 67, 188, -131, -91, -296, -86, -33, 85, -223, -58, -156, 60, -120, 174, 21, -64, 194, 30, -23, 81, 14, -28, 23, 1, -212, 43, 34, -14, 6, 92, 30, -26, -184, -81, -162, 112, -133, -192, 243, 127, 17, 122, 69, -41, -123, 312, 339, -101, -149, 54, -40, 32, 528, -4, -72, -233, 60, 39, 75, 65, 294, -51, -15, 11, 59, -164, 132, 1, -168, 82, 12, -141, -105, -26, 41, -159, -26, 287, -141, 170, 117, -85, 146, 114, -226, 314, 131, -183, -23, -257, -137, 285]
6787B85l56P7K26j30j99K72r3J38pk52N4jr8M6LK55l08J08N6k24l7J6qL27j13
6812C7m1O0j28K08j97r6J38J02o2j42P2N1J41m15L61N6j46J76P9l48J31J84j56
6835F5j5L7N9l40L57k58j37P6J78j32J06m7K85l73K09o9l1K43nk58N1K47j02n5
6859I1p7NJ0J60k71l5J36j73p1K65RJ29k59Q0J07m4j80J13J38P1j85Q6j48J9k
6884b6k24J92J89k34K39J7k23L45r0m12L64j57q8Q7r9L04n31L24J13%l8j73J16
6907eN3l1p3K95k02j35j67M64j44K02p8l41K96j67p2N4K03l88L16j96J24j32K7
6930i7J63k90K26K87j97k67M33l10J55j4k13k2K02j79N6K76m50K28j38M53l58
6951e6J69P6j51J51l99K96Pk13N7p5m2j83J60N4K60J72j75J9q5j17L11k43K9j0
$$ y = [285, -71, 6, 232, 102, -97, 175, 82, 220, 213, -39, 15, 14, -84, -38, -35, 220, -88, 20, 76, -148, -185, -169, -177, 150, 37, -4, 56, -72, 136, -61, -157, -19, 83, 21, -121, -49, 2, 143, -272, 89, 145, -1, 175, 254, -94, 37, 221, 65, 50, 87, 146, -194, 163, -95, -232, -156, 22, -110, -4, -51, 234, -139, 70, 1, -30, 213, 208, -50, 1, 248, 146, 91, 14, 19, 29, 189, -82, -117, 19, -154, -225, 40, 49, 178, -81, -1, 106, 62, -118, -5, 133, 204, 19, 105, -43, -24, -26, -250, -58, 131, -103, 136, 153, -70, 275, 185, -227, 137, -20, -108, -21, -120, 184, -347, -23, 90, 90, 52, -121, -5, 48, 17, -56, 239, 37, -98, -265, 199, 55, 257, 179, -162, 134, -33, -105, -51, 152, -236, 80, -116, 8, -124, -97, 66, -224, 2, 289, 92, -175, 258, -52, 103, 89, -124, -146, 56, -123, -67, 209, -241, -13, -151, 302, -56, 113, 189, 38, 189, -210, 86, 93, -120, -63, -138, -180, -363, -203, -149, 111, 283, 108, 127, 42, -75, 236, -7, 22, 12]
6975A2Q5l67J64k98O27n6m64L62j63O5r6p8K42P4l94K75J09j09j08k07K69K14
6997A58k90R9k52L43J46k79J65l02L48l4j61J99m05J58J71k12J45L54l37L2p6
7018c0j07L29k87P5jM2K1%N4J08k95j46K66k49K55o1p0N6m1n3K71j4l86M20j67
7043a0n2J85J2j26j9l83M93m29L46l40J91M3J58N2l68K93j44N3M37k40k57o9N9
7066a15J73l37K15J46j09K2L3m9l34M82l2K94k5n20L69n3l18L18k77L7p0K21r1
7089b0j9O7Q9j60J38r7m05J85K59j29J57K15k33jp4j55k9M94l54P6k20N37k71
7112E0qJ78n01J90j04K00J20K6j09o3N2j33lK7o3J41K41r2o7k36K66k33J71M5
7136I5K38m31K5KK19k72P0M5j57K74N3K26k97J05k07J62K1k19j58K58k0J42J19
$$ y = [12, 97, -270, -106, -404, 223, 167, -297, 65, -98, -33, -129, -207, 35, 109, -285, -10, 99, -10, -118, -325, -56, 158, -132, -33, -285, 58, 204, -75, 90, -212, 136, 102, -59, 140, -265, -107, 64, -148, -3, 351, 14, 46, -30, -137, 192, -95, -20, -21, 21, 42, 42, 96, 204, -91, -237, 29, -220, 35, -26, -96, -40, -81, -134, 137, 123, -263, 157, -10, -62, 123, 135, 9, -10, -393, 100, -329, 17, -323, -132, -89, 69, 121, -247, 46, -98, -45, 392, 152, -105, -174, -115, 58, -279, -64, 82, -27, -5, 28, -21, -355, 127, 95, 389, 364, -156, 213, 160, -158, 160, -117, -80, -150, 71, -20, -39, 28, 117, -43, 95, -2, -407, -222, 37, -92, 65, 280, 47, 46, -28, -183, -212, 282, -72, 4, -216, 321, 50, 42, 220, -281, -91, -195, 5, 125, 151, 42, -21, 31, -102, -105, -78, -141, 0, 241, 149, 82, -154, 112, -121, 50, 95, 333, -98, -73, -71, 148, -124, -54, -9, -166, 108, 161, 387, 90, 195, -12, 150, 171, -48, -206, 52, 32, 174, 293]
7159B93r4k5m69L25k01P2J62J31j69J07j81R7k30K83k04P1pJ22j52r2K81q1N0
7182H9%q6j23K29j73L68m63R6J20l25M97n27N29j22k53j52J86J49O8l00J71k51
7204b73M22J58m33Lq9l5L51j03Rq8K67j7J8k72K17J5m35L38k29J10j52K87kp6
7228iK14l47r4k8J82L05m7m40L56jM2N7l02N3L4j13M94o27J58K94m10K65J03k94
7252a55O9K26l05j01L01m7J19K7k36K25N2j98O2k9j44j51J00N9L19k04M45m02
7274C2P1k68K75m0O8j61N2P9l49K34k4J08l9k41N9q2J99J83ql97K54j2J8k37K53
7299B7Qj14J52j12j9j51M03j38j4P6K12l22J15K3l02j14L89l4k89j00L35j77J19
7322b7j5J43kl22M88j34l25J42q9J55PJ99l29J27k1L2M0L21o38J34k0J90j36N4
$$ y = [293, 199, 174, -295, 30, -171, -99, 63, 194, 25, 132, -49, 48, -182, 101, -103, -32, -39, 83, -69, -161, 120, 39, 89, 89, 3, -120, 109, -64, 304, -159, -63, 57, -268, 229, -298, 231, 109, -144, -296, -110, 39, 107, -193, -22, -273, 149, 307, -126, -123, -212, -247, 104, 1, 10, -78, 189, 172, 190, -82, 135, 150, -285, 53, -176, -66, -218, 69, 67, -9, 205, -142, -236, -264, -82, 223, 176, -264, 92, 91, 133, 190, -112, -59, -25, -138, 356, -271, -113, 181, -229, 36, 139, -155, -86, 140, -165, -266, 35, -12, 107, 134, -102, 123, 175, -23, 39, 10, -134, -285, -185, -126, 193, -11, 434, 32, 103, -165, 110, 70, 138, -23, 29, 108, -241, -7, -31, 77, 38, -203, -144, -226, -27, 156, 148, -249, 5, -7, 11, -226, 27, 35, -79, 73, -39, -58, -209, 194, 56, 42, 118, 330, 8, 123, 146, -156, -270, 119, 85, -204, -304, 31, -146, -27, -42, 101, 99, -223, 265, 131, -194, -52, -141, 14, 21, 220, -109, 18, -3, 29, 69, 390, -248, -114, -134, 56, -80, -26]
7346b6J55j70j06k9K77k71J91l44M96j08k6K32J68p81L22Pn6k45J72K43N7j28
7368C0o1l2l4J86k76J06n9R4K62l08p7L00m51J81K88l7ql1J82n56O0L17K16k02
7392I0j2K2j50j03K31K47j95J39m32L11k5k83J0L19p3q4J02j10PL1K5j07j7p2
7416a29J88J7M3n6J77l05J58j55J96L06k91j27j02r9J67j31K22R0L3k93M21k85
7438D5k79M11lj74J19j91K63r8J68m52L02j19P3k05K49j48n8K70k93J88k49J26
7460e5J20L6l5j79%O6j18M40l07K13j41QK1j93JK84k79K6J05P5J54j14J7k68j3
7485a36J86J18j01N4j63K66l96K71J92o09K51r4J87L30m24m1J87o6J65l02J60
7506C5P6N4l43L77k37j38N4l8K26j0k5R9j53n4J57l91L91J47m6j72o2k28K12L03
$$ y = [-26, 129, -41, -147, -176, 101, -170, 21, -323, 173, 65, 39, 271, 439, -342, -20, -13, -69, -314, -142, 101, 158, 30, -31, -63, -97, 89, -187, -81, -140, -46, 216, -92, -169, 131, -320, -139, 149, 112, 104, 73, 255, -301, -241, 76, 292, 90, 78, 100, -50, -153, 78, 325, 130, 269, -163, 148, 123, -160, -150, 169, 96, 12, 114, 4, 11, 42, 67, -40, -57, -129, 59, 76, 119, 63, 240, -65, 93, -62, 134, 440, 149, 22, -80, -179, -12, -143, 79, 169, 202, -91, 330, 45, -234, 177, 174, 0, 119, -72, 191, 93, 261, -191, 111, -8, 65, -140, 109, -39, -97, 173, -120, 68, -181, -55, 65, 101, 66, -113, -113, -47, -165, 275, -32, 181, 40, 48, 69, -124, -123, 161, -118, -92, 13, 88, 242, 128, 145, -123, -136, 50, 168, 67, 121, -42, 224, -172, 99, 291, -318, -67, -161, 26, 356, -68, -109, 78, 12, 177, -125, 35, 111, 165, -178, 199, -38, -176, -122, -160, 66, 56, 31, 130, -23, -77, 80, -311, 80, 227, 181, 9, -53, -281, -69, 234]
7530B34l26J10K9j01J0M26l05k93L11j99K05l0j86l6O5L34j92j19Q9j76O2q5J5
7553a58N20r0j85O1l80K11k40J01J55Q5p8M81o59M75m47L49j21o4J76m87K87J54
7575A46j78J55l29J26K54l69M18l24J49m4j05P2k90K40kK06q2n2j86K95l34L12
7597G8j50J88j02K16j10k11j42K52j07J14M7R5M1m97J69K45o6R8l18r5J08M6J39
7620C8n2k34K49k75K05O6L07j93qj71l4L13n11N36m11J05r3J18K63mk28JJ88k63
7644h8MK49k43Q1P6j08j56K34j96JJ54l4K05j69k22M58k41j09J84q8m7R5m8q0
7668h8P9R8k27L03J8j71M4j01L03Jm12N31n26J02k4q7L23p6k39K08J68k01J2j50
7692a12K20k70J57j12K02l69J87k6J92j50L32l35J6j05L7J37j5L2m3J83m15J22
$$ y = [234, -92, 18, 47, -54, -44, 382, 77, -216, 95, -104, 101, 71, -115, -151, -86, 248, 56, -63, 26, -150, -88, -173, -158, 362, 272, 87, 148, -232, -21, -261, -160, -5, 80, 2, 483, -176, 299, -148, 201, 80, 16, 192, -295, -8, 146, -32, 123, -206, -80, 174, -195, 223, -101, 48, 4, -101, -29, -319, -79, -81, 125, 43, -9, -195, 100, -234, 78, -72, 116, 14, 230, 120, -91, -233, 19, -88, 26, 73, 168, 209, -288, -119, 126, 60, 158, -160, -255, -147, -101, 38, -14, -248, 1, -274, -69, -3, 304, 111, 103, -68, -102, 211, -300, 236, -175, -70, -163, -45, 218, 214, -14, -13, 175, -88, -84, 165, -78, 3, 79, -29, -185, 49, -147, -146, 8, -26, 179, 10, -212, 246, 5, -104, 80, -8, -55, 40, -8, -88, -9, 89, -138, 165, 183, 12, 56, -45, 258, 259, -153, 378, -148, -46, -70, -157, 166, 90, -149, 59, 227, 26, 38, -112, 108, -162, -5, -117, 85, -284, -97, -123, 69, -81, 251, -84, -68, -173, -136, 1, -14, 18, -25, 158, -257, -135]
7714a35K37L0O7l92K63R8J59n5k46k17kJ52qk50M61j91P4l04J25J66m2K11m53
7737b52P6J57o8P1J41j27j8J63NM4r4l31J65Oj86K20L72m44K74k45K82j73j39
7760a01J62J28j67K7j18K46k47k32L63j45M6Q0j37K28j87M1j76J52j76L86q6L07
7782C94k53j23m9k16J76J57r0Q4j32j57K42o0j83L15R6j61K8L06k67j35K32r4
7804A10k60R4lJ25N5j01j23P8j21L65k26mK37k91J0J7q9J20j67N48n82n1L59m9
7828E1k13J55j41Q1m8m3P7j27N2O3J8Rj2L55j53j9k48J3o5P4J92q6Q2j31O0J7
7854A3j11J16K1j1K49r1j80R2J42j37j05K1O1k38K22K9pk79J69k30L37q0K91l18
7878b4k09K5J43P4M65k91k54Q7m16K11L90l11N3j5P2r5J31L85j21m47K3K65N5
$$ y = [-135, 102, 132, 199, -193, 70, 168, 327, 272, 26, -191, -193, -41, -49, -299, 162, -29, 45, -259, -134, 32, -10, 201, -252, -176, -19, -87, -16, 125, -2, -20, 143, 148, 192, 98, -233, -68, -62, -248, -28, 344, -100, 174, -71, 211, 38, -101, 61, 189, 22, 49, -69, 177, -70, -302, 61, -84, -38, 42, -95, 133, -54, -13, -189, -37, -213, 173, 87, 394, 141, 18, -31, -247, -71, 86, -4, 80, -52, -209, 33, -27, -210, 105, 201, 40, 68, 374, 107, -28, 204, 110, -150, -56, -59, 66, 121, 20, -103, -25, -146, 219, -7, -11, 226, -65, -55, -38, -127, -7, -174, 374, -208, -259, 100, 51, -162, -7, -148, -67, -115, -158, -81, -208, -156, -93, -75, -66, -78, 277, 124, 105, -143, -130, -195, -121, 71, -15, 67, -64, -4, 13, -98, 18, 39, 28, 277, 186, 6, 98, 240, 103, -2, 19, 80, -158, 64, 93, 86, -193, -24, -254, 83, 3, 294, -24, -233, -208, -65, 9, 474, 183, -71, 16, -400, -189, 201, -110, -57, -72, 0, -95, 36, 421, 300, -147, -124, 141, 196]
7901A96j31l07M14p4j99J85j77k8Q2m00O16l3J40k24RL42k67j63q2J3J26L6MO2
7925A40r9J43j22p2r2j1q1K64q8n5O6j4o4J22k7k11J78m1r8J80Q7k77K61n42L09
7950a44j06J53J56r3j4J80j51J73l29M58m06K75k80J38j34j83M47k18O0J10n33
7971d41M46l8Pk55N1K84R5k69j08%J63J32r2J69k75P0J65l3k58K05j90M04P0k47
7995E5k11J82m5j63j10J94K88k37K3K25j95J58j66J02k21K58k76J17L38l92L0
8016d6m3Q7J55Lk05J19j42r7j08N47j63k28j5L48k72k96L85K44l37j08J17O5K5
8039C5R7j84M57l28Q2j81J05l79L77k10J24MJ02j46R0n3j1K31k08j33N57o58K73
8062D3q7j09J02K59n24L53K01O6k65J14J6j65l8j09J17m15J96L48q0J89j91j70
$$ y = [196, 65, -242, 172, 98, -101, 84, -93, -121, -39, -439, 177, 144, 284, 60, 69, 411, 144, -19, -101, -88, 38, 74, 78, 140, 41, 184, 62, -10, -102, -113, -194, 70, -18, -73, -7, -21, -85, 37, 10, -201, -23, -64, -162, 18, 105, -172, 89, -453, -144, -250, -97, 59, -34, -48, 132, -19, 154, -175, 283, -123, 152, -128, 10, -124, -307, 140, -78, -18, 92, -441, 5, -33, -26, -281, -230, 54, 149, -120, -228, -228, -65, 67, -25, 144, -131, -61, 104, 71, -187, 18, -172, 232, 302, 55, -156, 26, -19, -182, -292, -98, 190, -47, -24, 201, 6, 164, -2, 100, -121, 137, -139, -22, 316, -76, -46, -89, -2, 153, 156, -49, 70, -72, -169, -277, 270, 107, -121, -136, 212, -60, -356, 29, 273, -64, -172, -55, 10, 35, 132, -52, 405, 77, 159, -22, 83, -296, 81, -129, -5, -1, 101, -45, 45, -8, -19, 212, 4, -129, 428, -230, 43, -44, -153, -51, 208, -316, 37, 238, 304, 39, 153, 169, 4, -34, -143, -26, -441, -245, 103, 23, 212, 21, -149]
8084a49K93k80M3J99j33J41o7j3j15k20K18k1K9k0P7K4Q4k84J47p1p5L74M5j89
8108C7K59m53J55L55n25K37k7N1mk7Q9mO8j06j01Q2l39J98L20n97L01J31j11l8
8132d9j5k8j39J36m4J84r5L31l08j47O3jK10j11j41L24r0k42J08q9J00J55p1j4
8156B7J31j09K13l34j06K57j8j87J42q1J70k93J10L22l33J03p9J09k91n8L00n2
8178e7q4J62N8k45K23k83J76J35j69J19N5j31O9
$$ y = [-149, 144, -136, -93, 106, -27, 114, 47, 34, -81, -301, -83, -104, -75, -95, -18, 6, 90, -194, -47, -118, -193, 181, 226, 37, 296, -157, -2, 353, -172, 65, 38, 89, 85, 58, 147, 143, 211, 105, 4, 86, -253, -55, 265, -332, -31, 100, -11, -49, -64, -92, -231, -95, -139, 45, -50, 281, -27, -174, -111, -112, 98, -13, -154, 170, 80, -162, -54, -143, -43, 112, 41, 27, 158, 49, 262, -72, -178, 79, 61, -126, 16, -65, 105, -188, -78, 244, -89, 14, -65, 44, -247, -305, -5, -57, -141, 21, 79, -166, 57, -226, -50, 85, -84, 35, 90, -41, 28]
8191B8
$$ Imaginary data points
##PAGE= N=2
##DATA TABLE= (X++(I..I)), XYDATA
0@%%%%%%%Qj0Mj0J6j6J6k4L2l5M3n4O2p2Q5r6J10j26J46j68J88k12K41k72L05
32A61l41L81m24M70n23N82o47P17p93Q76r70J076j192J323j472J643j839K068
50A096k339K665l071L590m276N228o640Q953j3373K4662j00851k27423K96856
63a4923K35472k01999k22363J60620J95758j13898j89373P1231J66709j7411j27449
74e7626l410P9607J748n3726Q291L8797j948k2041k955m056k114J5056J2655o811
88A467q902m639j585M634P7r768Q891K7645k387m1495j9954L4886M1209j5680
102A4399m9198O724O2359l289q7236r213J10805L5447j16850n7412J09676O8715
114H4927j03633p6033J04460R3805r6824j10947P8109J14872n7932j02373M9763
$$ y = [0, 0, 0, 0, 0, 0, 0, 0, 8, -2, 2, -8, 8, -8, 8, -16, 16, -19, 24, -30, 32, -40, 45, -51, 59, -67, 79, -89, 99, -113, 128, -144, 161, -180, 201, -223, 247, -276, 306, -341, 376, -417, 459, -511, 565, -627, 696, -776, 867, -972, 1096, -1243, 1422, -1649, 1941, -2335, 2893, -3747, 5206, -8167, 16495, -84356, -311779, -14923, 220549, 18550, -203813, -43193, 152565, 38667, -150706, -79475, 87234, 69823, -57626, -61036, 18571, 20319, -33407, -25116, 13681, 11733, -10308, -13263, -17319, -19433, -4377, 8278, 1467, -7435, -12074, -13659, -9025, -8948, -18716, -9825, 17820, 15433, -26062, -46016, -11130, 30079, 14399, -34799, -28075, 34284, 30995, -56241, -65454, 45351, 80798, -36052, -93464, 16212, 84927, -18706, -94739, 9721, 103526, 6702, -104245, -26136, 88736, 30804, -71569, -21806]
125b1806Q9027m4705p8878L5646O4995k1855m2643J8044K3191k0972j4244K4846
137A0646J1961k3984p106K7352L193l4608m566L8486J0068l4476j3741K5934J4658
150B3817j7848j5398J0471J9235q65k1659j1481J5539J8865n163j9975l481J8310
163A0367R693k0992j9113K2954L0126k1576l7452J6820L6747j4244l3540J2760
175g450L0354j1755k7724P265K3514n098j8543O403J3363j2045j1347J7103R221
188A3261k3086n202K7946L10l3953R21L6139j830l5389J825L3079j002l2154k460
202b1595L0483N302k8383o581K6029N416k6877k570K7631L51k7120J333K4700
215H119l455k2249M367K2137l223k1461q98K1798M773k0562p604K0225R875j9908
$$ y = [-21806, 67221, 22516, -56362, -20716, 44279, 22424, -20219, -2175, 21016, 44, -14200, 10646, 22607, -1377, -8483, 18869, 22062, -12546, -17112, 21374, 31442, -3034, -16775, 9159, 23817, 5969, -9429, 1042, 20277, 19412, -2247, -13728, 1811, 20676, 15513, -4462, -7943, 10367, 20060, -932, -20045, 2909, 33035, 11459, -25993, -9173, 27574, 13330, -20210, -7450, 22904, 11149, -16575, -9310, 14204, 9106, -9437, -3034, 10329, -1716, -13063, 4040, 13261, -9825, -15027, 12919, 13229, -20724, -19803, 16336, 14506, -20883, -19058, 14021, 13019, -19135, -21595, 8888, 14190, -14193, -20774, 5255, 10671, -16206, -18776, 8855, 9206, -17914, -16581, 8119, 4664, -17585, -13218, 8919, 5696, -15765, -16663, 5135, 9908, -10654, -18258, 1967, 11842, -8066]
229h066j0429J7362J2294j1347j2386N250J2127K701j2742q756J3764J5740j4021
242A491j9438J4420K2778j3241k3481J0639K5996p715k6921N588K8088k832k9771
255a4399K519L1974k753l3215M132L4212m240l3991M187L3671l167l3823J204
268a3689L4634K812l5248p246L6059J1129l6126j4555L5200J7314l2591j9756
280b2063K8511K1730k2817k3914J6223K5357j0206k6297M111K5995N44k4535m978
293a2339K1690Q332j8876j1693J4280J4996j0805j7940P331K0222o376k2201N523
306g856K2464n071k3850M617K3595l944k4496K793K4413j436k6475o18K8172K249
320A4557l0486m338L1167N562l1295q115L0006J0014k7753j3111K4307J5942k1460
$$ y = [-8066, -18495, -1133, 11161, -186, -12572, -7322, 4805, 7506, -5236, -13992, -228, 15512, 1491, -17947, -3527, 19251, 6010, -17471, -6832, 19164, 11449, -15472, -9884, 18204, 15372, -14399, -11880, 20094, 17341, -15874, -11742, 22470, 18230, -15761, -11574, 22097, 18930, -14893, -13689, 20945, 23757, -11491, -18737, 17322, 28451, -7675, -22230, 12970, 30284, -2307, -22063, 6448, 28178, 5361, -18553, -2330, 23027, 12821, -13476, -9365, 16630, 17174, -7361, -12339, 9351, 17683, -1193, -12886, 1394, 16390, 5585, -12355, -5024, 15198, 8822, -13379, -7856, 14608, 9537, -14313, -9696, 13899, 9955, -14541, -11748, 12665, 11229, -15246, -15864, 12308, 14557, -15929, -20267, 10900, 16462, -14833, -22948, 7058, 17072, -10681, -23792, 515, 16457, -5003]
333e003j7952J7899J9451j4846k0493J1879J9463q936j7425N321J5602j489j3282
346i811j952J0859N142q326p625P175Q977n577q770L961R273k212q799J045Q713
361B073J420r051k182J0254L744j1430l463J2502L908j2871l648J3801M004j2917
375c856m220J2605N081j0912p081J1520Q653j0898r201J0639J0123r795r296Q516
389A878Q685o934o923N539N183l013l946J415K972K23j802l46p9K33J755K11l428
406A623j280N382J545o719k005P782J541p811j947P227K129p218j931O139K004
421F461o257j864M924K608n534k701N262K525n989k671N453K006n029j854L701
436A041J232k947j504J261K002o50k395n81K022J479j833l012R33L405Qm550k094
$$ y = [-5003, -22955, -5056, 14395, -451, -20944, -9065, 10398, 1462, -15963, -10642, 4960, 3471, -9811, -11763, -904, 4238, -4088, -11713, -4538, 4439, -1138, -9908, -5947, 3326, 1114, -7685, -6640, 2073, 3493, -5558, -7740, 2514, 6258, -5172, -8635, 3867, 7775, -5096, -8744, 5057, 9061, -3856, -8076, 4529, 9610, -1302, -8383, 3137, 11790, 892, -8309, 2330, 12453, 2658, -6638, 1878, 10563, 3629, -3294, 2245, 7428, 4415, 469, 1884, 4856, 5079, 3277, 2931, 2852, 3085, 4840, 5051, 1623, 343, 5725, 7270, 551, -1454, 6328, 7869, 58, -1889, 5338, 7467, 249, -1682, 4457, 6461, 204, -1660, 3264, 5872, 338, -2363, 2899, 5424, -565, -3236, 2217, 4223, -806, -2660, 1041, 2273, -674, -2178, -917, 1085, 435, -1960, -2541, -519, 960, -873, -3885, -2952, 453, 461, -4089, -6183]
453f183O321K359p143l598P814M582r243n196R197O198r237p149Q928P648q067
468b769q877P731R416p221r795O872R943n896j0309N703J0074m878r182L831R360
483D003l282q461K380Q470j178p536N25O998O06o396p58O042J542m837k361L981
499b62L774k543m056J161N113N73n649j597O310L567o725m445O635O460o698o944
515e326N911R173n378r927N313J0041m335j0734M467J0441l563j0562L244J0415
529I180k695r710J687R651j175r332M49Q751k7q577kP464M81p263q01O491J136
546E708n127k244M344K064l471k774K348K839j521k735k72K628L36j805j923J669
562F4K541j146m055K12M873l64o128J93O603np365m55P538O32p856j212P111K216
$$ y = [-6183, 138, 2497, -4646, -8244, -430, 4152, -5091, -10287, -1090, 5108, -4129, -11278, -2350, 5298, -2769, -11646, -3915, 5501, -1720, -11515, -4643, 5300, -596, -10905, -5202, 4872, -6, -9188, -5357, 4003, 721, -7740, -5360, 3110, 1932, -5604, -5079, 1919, 2525, -3871, -4629, 1413, 2955, -1882, -4243, -262, 3512, 969, -3087, -1926, 3187, 3760, -1889, -3486, 2824, 6391, -334, -4779, 1856, 8316, 1618, -5326, 585, 9758, 4380, -5547, -234, 9807, 5472, -5262, -795, 9646, 6083, -4479, -1235, 9180, 6485, -3225, -1538, 8113, 6938, -2394, -1945, 6806, 6779, -1798, -1800, 5664, 6145, -1118, -1919, 4572, 5708, 581, -1663, 2681, 4745, 1274, -1500, 848, 3687, 2166, -569, -841, 1787, 2123, 318, -1605, 64, 2605, 1459, -2596, -2384, 2489, 2125, -4003, -3810, 2793, 2788, -4577, -5032, 2506, 3138, -4718, -5930, 1181, 3397]
580C397q057k157P452K801p719l044P117K672o567k306N995J945n515j642M285
595a343J372l092j347K732P99k178m00J949M05j625K63P55k55p57R70K11r79R86
613a534J155j412j020J906J971k284j946K591K249k551k425K728L587k989l756
628c730L383M316l084m481L678M470l210m436L215M282k447m133L030L568k150
643B271l397K167L149j807k521J681K542k527j200K157Q38j560L61J245j328j172
659H99J739J129j931q75K277O11l062o32L282R75m045q22L999K41l825m64M147
676C643N3m622K5M253k36m324L35L952l82l964l97L847K33l867l63L481L8l469
694a764k89L196k43k897J42J838k56j785J72J269j65j003k16O52p17K17M97j69
$$ y = [3397, -4660, -6817, 635, 3436, -4283, -7327, -210, 2462, -4105, -6411, -416, 1529, -3986, -5628, -1343, 29, -3063, -4410, -1678, -879, -3057, -3457, -1508, -1103, -2728, -2465, -1710, -1965, -2722, -1752, -1541, -2520, -1534, -379, -1791, -2811, -905, 1066, -1218, -3164, -573, 1676, -875, -3300, -572, 3015, 26, -3730, -347, 3969, 885, -3596, 82, 4552, 1342, -3094, 121, 4403, 1956, -2177, 853, 4421, 2271, -1126, 1041, 4190, 2383, -138, 1543, 4085, 1558, 358, 2515, 3353, 1793, 2154, 3399, 2071, 899, 2638, 3767, 1836, 961, 3238, 3849, 787, 155, 3437, 4412, 367, -455, 3544, 3785, -40, -504, 3643, 3696, -926, -901, 3352, 3116, -1208, -873, 3079, 2697, -1267, -1664, 2183, 2416, -1451, -1814, 1667, 1705, -1764, -2053, 1143, 900, -1997, -1855, -17, -273, -2058, -1886, -617, -782, -1785, -2001, -1349, -2066, -1849, -1352, -1521]
712a521j244P29J534j735j571J868J884j969k619K497K353k462k325K600K656
727F75k709k779K512K946k332k545K474K694k961k307K605K816j999k227J970
742a167K232k536j173K199J803k088r78J510Q73j588k75J694M36j360n10J500
758E72K57p38Q9J499j58j621O34J164j056m33J896n8j693N2K349m01k277O71K618
777C366r56k305O95K614n51k878O29L128p40l498J135K986q26k882R54K278q16
794B333j955N55J909r47j223M78J015m48j531N17J427q48j461J177Q03j198q04
811b01J454J1j577r3J032J45j422m6J638l71j975M66J902q95j947J031J817k094
829a125j279K085P82k131p13K073O81k634q00K932Qk451j39K266M0k485K19K288
$$ y = [-1521, -2765, -2036, -502, -2237, -3808, -1940, -56, -2025, -4644, -2147, 206, -2256, -4581, -1981, 675, -2034, -4813, -2301, 645, -1687, -4232, -1758, 936, -2025, -4332, -1727, 1089, -910, -3137, -1167, 1065, -1471, -2644, -445, 1358, -730, -1708, -198, 675, -913, -1188, 506, 942, -418, -928, 572, 829, 91, 180, 1679, 1521, -100, 534, 1698, 642, 209, 2105, 2047, 354, 406, 2755, 2354, 77, 748, 3366, 2410, 105, 800, 3414, 2863, -15, 614, 3742, 3002, -496, 639, 3625, 2799, -83, 871, 3149, 2333, 378, 933, 2842, 1895, 672, 1150, 2165, 1717, 186, 703, 2130, 1282, -179, 998, 1801, 603, -201, 1253, 1264, -313, -406, 626, 771, -651, -697, 941, 570, -1405, -939, 963, 68, -1879, -848, 969, -1125, -2404, -319, 463, -1668, -2381, -308, 373, -2261, -3061, -129, -121, -2572, -2711, -445, -405, -2890, -2671, -383]
847c83L7k489J26K110k40j737P94J222q38r14Q58K11m34kN26N19j063PQ98N25
867b67j213m57J609N09j386n26K131j66j378j10J848m1j672M74J405M2j536K92
885d42J562k65j645N10J897p30j158R40J482j641p72J829L28j315l02J507J30
902A915j573J75J537j27j404K69J720n63j620O48J463m67j577Q47R98n26j053
919F62N22Q47q56k66Q73M0o99r93J132P34j350m52J057M42j159o66Q87P78j366
938A67n75J400m9q46m05R77k31p50k87R96m07r60P11M51m13j026R17L04q74m95
958a395J130L80j492o43J727Jj469o09K000L14j963j77J584L6j637L50J294n49
976a118j252O64Q80j74q07L33O22p25k7M15N63l27l21K92M48o47k55L30P17p05
$$ y = [-383, -346, -2835, -2709, -599, -839, -2576, -1782, -560, -1398, -2312, -1454, -1243, -1677, -1679, -1153, -634, -1697, -1690, -792, -267, -1480, -1937, -328, 181, -1205, -1731, 400, 234, -1144, -1254, 594, 553, -1119, -645, 760, 802, -734, -442, 1120, 855, -790, -280, 1617, 887, -271, 669, 2151, 510, -262, 1567, 1895, 580, 278, 1785, 1915, 342, 517, 2054, 1927, 523, 792, 2512, 1949, 329, 977, 2440, 1973, 396, 1243, 2241, 1715, 662, 1184, 2031, 1175, 909, 1782, 1822, 1123, 130, 1262, 1996, 646, 194, 1251, 1693, 534, -132, 755, 1533, 167, -408, 992, 943, 97, -308, 669, 438, -312, -599, 397, -10, -970, -259, 192, -221, -1247, -330, -26, -900, -1395, -265, 115, -1377, -2020, -293, -292, -1761, -2370, -370, -56, -2019, -2196, -612, -576, -2213, -1863, -569, -1118, -2370, -1706, -826, -1000, -1807, -1474, -852, -1577, -1604, -1189, -626, -953, -1274, -982, -534, -1181, -1436, -1106, -389, -1094]
996a094k84R73J04n44Q3N01P7o85L82Q57k41l47K15Q34r04o32J094P94j101o69
1016e87R92J207j569l12J306O69j273q13J683O75j411l31Q86Q67j279j77Q40j4
1034A359l19m14Q51J58m07J03P7o2m74N01k96J79k86K18mm45K36M05j93p85M31
1055H33M51j61j088M02R24k48j196L90R70n06q78N0J199r40o96K14J175p26r34
1074g65M09R39n22j230P24P63q87r39Q25Q94p93r11N56O78l68p62K16O24k69n75
1094a393M71K9K17l01p3m43O5P93j14m43r9N80k6o56p5Q14j17r67r0J140N31j134
1116a291l36J527J43j275j89J504k88q97KJ188j47r10n0Q97L68r86L70O73m6q66
1136f09P5J004j9m46J72J05K12l11K58K24l32k2K35M41l22j41L24O7j93k70N34
$$ y = [-1094, -1378, -405, -301, -845, -762, -261, -184, -869, -487, 370, 129, -218, -3, 831, -73, -705, 389, 1183, 82, -587, 405, 1612, 43, -269, 1037, 1706, 433, -380, 1303, 1978, 567, 236, 1122, 1989, 710, 533, 1373, 1359, 1040, 626, 1477, 1635, 1228, 1331, 1408, 1346, 872, 1373, 1077, 1256, 970, 1188, 1184, 739, 975, 1380, 1187, 402, 833, 1284, 1123, 35, 437, 1361, 1113, -83, 307, 1277, 771, -107, -57, 1142, 202, -494, -280, 895, 169, -765, -356, 583, 61, -1169, -445, 318, -569, -1508, -683, 211, -582, -1493, -937, -259, -627, -1389, -1173, -549, -818, -1393, -922, -893, -676, -977, -1050, -1493, -1428, -635, -749, -1192, -1291, -711, -737, -1393, -1468, -654, -771, -1738, -1828, -688, -157, -1291, -1627, -100, 43, -1232, -1421, 83, -205, -1102, -1100, 88, -59, -969, -1019, -122, 246, -740, -370, 303, 257, -609, -534, 470, 451, 5, 177, 282, 494, 183, 441, 665, 333, 311, 546, 987, 665, 524, 848, 915, 722, 452, 986]
1157I86m9k50K79Q46q84m48R46J65o35o92J012P06j140o20R69M38q20n50Q41P86
1177A886r05p95O92N26m66j123R31O69p76m11K34M35l78l62P2K37l0l96J90l9
1197A91m1P4j9m70Q3j81N57q94M78L4j33o59L77Q09n27j290N08Q19j57r28J46
1218a223J101o85o53L58Q84m11j023O37Q65q41l07J09Q93l29j227J76J359M0r60
1237a237k12J071J2q49j41Q23M48p12n49P18N02n95l06N46R6K5j16j51P54j55
1257b8k81j09R6O16k83o22L73P63J07n75o1M78J2m41j16J204k64q53P0P82M94
1278A362j136k0R29K59q11m22R75J40p33J06N52pm79m37N42M43p34j3O71l1k43
1299I13o8j32K95k09k27K18rL56l94k47K5J43l39j58M93J13o6q70j85Q01J62n55
$$ y = [986, 937, 687, 966, 1812, 928, 480, 1426, 1591, 956, 264, 1276, 1982, 842, 222, 1191, 1629, 809, 259, 1100, 1886, 981, 186, 878, 1404, 938, -185, 746, 1415, 639, 228, 462, 897, 519, 157, 229, 466, 436, 40, 230, 191, 150, 224, 205, -265, -182, -363, 194, -700, -222, -188, -321, -980, -603, 206, -321, -1611, -1103, -284, -441, -1369, -1223, -122, -807, -1460, -1102, -218, -629, -1652, -1015, -150, -991, -1298, -1189, -296, -625, -1852, -1676, -317, -277, -1237, -1449, -378, -366, -1215, -1356, -533, -85, -797, -1346, -628, -126, -721, -1027, -481, -385, -360, -476, -627, 127, -28, -309, -418, -322, 294, 11, -611, -238, 525, 632, 57, -4, 474, 486, 45, -71, 1133, 869, 16, 86, 868, 1362, 226, 206, 1135, 1394, 583, 161, 1136, 1276, 543, 649, 1201, 1194, 715, 278, 820, 1263, 529, 516, 1187, 1156, 913, 845, 713, 1008, 799, 572, 790, 781, 1137, 743, 496, 521, 664, 325, 167, 660, 773, 707, -163, -348, 453, 615, 60]
1321F0l39P50k8l46r67Q52L25k81l70K59R0K35r12j3P31j87q40K43M54k45j98
1342g27J93K69n01j00L52M6m53O2m0M69j47m72K96Q0m48N26Q3n95J19M83j19k33
1364h57K1M29j75o29J71Q56k27m85L34K08K88p19J23P92m14m13M3Q60l03n06L08
1385b95Q75l06q22n0P15k1l04j3M66O31q36k29M85L33k33k25L21j93K57N4j02
1406E08j30K21K93n34oO52j37j51j27J34K51m58K47p3J60l85j00O34l1m42n50
1427b4J147p8o29k54Q21M5r08j50N61K64o32j24N36P0n68k73O90K25l53k61K50
1448C55j7k29j81J56k38L90n44K30j88M09n07n5R9J67L21p50k52N79K58p96Q7
1469g06M23K03r30j06P83l1k24o10O67M60l85o73M13L23m63N7N4M03k98l17J82
$$ y = [60, -279, 471, 443, 97, -870, -18, 307, 26, -344, -85, 5, 240, -672, -685, 46, -141, -981, -738, -284, -529, -727, -534, -265, -766, -866, -514, -468, -921, -859, -899, -430, -577, -1049, -753, -673, -1121, -595, -512, -1107, -988, -505, -624, -857, -836, -407, -582, -1211, -1040, -184, -411, -896, -562, -354, -66, -785, -662, 130, -284, -697, -654, 206, -97, -603, -295, 580, 274, -548, -598, 117, 96, -208, -221, 245, 876, 40, -189, 296, 629, 396, 171, 492, 299, 556, 610, 508, 378, 599, 892, 358, 352, 1004, 867, 716, 589, 723, 974, 516, 763, 690, 850, 465, 365, 999, 968, 526, -24, 1123, 1045, 416, 162, 983, 1028, 120, -30, 531, 795, 163, 39, 575, 645, 77, -196, 494, 719, 366, 105, 355, 338, 109, -72, 84, -154, 236, -308, -78, -266, 143, -364, -419, -320, -153, 168, -582, -834, -255, 3, -793, -706, -283, -80, -1010, -1116, -333, -364, -588, -1198, -531, -71, -456, -1129, -716, -393, -856, -799, -745, -342, -640, -957, -775]
1490g75P26n27n8j91M14j44k75J38J71R2j04K84q8M4l08R6J73K26p2q4j86N61
1512A13k28J25k71j9O08j43N7K6M0j23j9J46M08k74k68k2O71k73j66K80M7R0p46
1535E9L96N08k05m41Q3L68M41q31k52Q91j36l72J24j10M77n84J31OJ20j14m36
1556A23N39k67J66m31K74K4N0J35j21l46M13l00j64P2K13q3l25Q5J06M10m94j37
1578e8j14J69l50k83O63n7j15l59N53k01k38L0L11K27p80j20L05J93k25j63K0
1599e92K76j59K1O4K20n13J10J12J56j99R9k70N5M88m87j23L37k65K23j26j73
1620g46l0N88k78l58N56J51k08k03RM43Qm02R0N73l27j47n6M52P8j14l6K25k84
1643a6l53M88K88l22q1K61K01k62r6K9L20J68o78M00K62n1l08J46P1l45K53J94
$$ y = [-775, -49, -576, -634, -825, -411, -555, -830, -692, -521, -429, -533, -249, -337, -293, -601, -505, -332, -106, -178, -262, -448, 113, -115, 10, -261, -280, 328, 185, 242, 268, 308, 185, 166, 312, 720, 446, 178, 156, 827, 554, 388, 668, 715, 805, 59, 455, 963, 758, 317, 400, 768, 1209, 378, 126, 1017, 881, 509, 633, 523, 1000, 416, 547, 553, 673, 559, 123, 662, 395, 561, 130, 404, 428, 478, 613, 492, 146, 559, 259, 95, 167, 380, 297, -28, 57, 163, 573, 79, -58, -172, -3, -353, -636, 27, -30, -145, -504, 49, -152, -390, -360, -49, 178, -602, -722, -417, -224, -449, -612, -592, -316, -475, -454, -390, -170, -683, -573, -461, -305, -504, -405, -675, -620, -132, -619, -742, -405, -670, -447, -573, -746, -776, -188, -466, -824, -268, -117, -325, -528, -519, -76, -68, -470, -380, 193, -134, -281, -337, 115, 193, 79, 43, 268, -16, -369, 119, 407, 85, 4, 265, 466, 204, 108, 137, 457, 625, -53, 347, 609, 558, 250, 396, 467, 122, 375, 569]
1665E69J79k50j06R3l6k06L55k01k1O0K88k38n35O79q7M7k51q7M76j78k76k36
1687C8N23P2m38k02M06J73k23k13K35L79r86L71p7J71l7j81L91j32l04j93L79
1708A52k45R9k13O3p7j5l82K42J70j32K82j65k74J41J15k79J04N0qj13k26Q6N49
1731g6o30j56N33K3k32k65M85J35l68j00J79J84l25m6J87L27m97LK4K75J16r7
1753c21j9k4j7L2J1J75L34m35j93M46K98n5m14J60K38j62j10K44m58N78N4n00
1775a38K86L93j50Nl76R4L73m50J69L4J21j13j66N63l78J10P1j8j5j40o2O82m97
1798C98j74K02K00m21R4P6L0J78l28O58p47M92k80P1Q6j79m7J39q3j70k61K27
1820A61J47j00J13J06k10n0k7p1L3l34J36L82m01J05r4J31j80j47J92K66j80m23
$$ y = [569, 748, 498, 392, 485, 449, 243, 598, 397, 376, 436, 724, 486, -49, 630, 543, 590, 339, 252, 728, 550, 274, 38, 561, 633, 195, -7, 399, 572, 349, 136, 371, 750, -236, 135, 58, 229, 192, 11, 402, 270, -34, -227, 152, -93, 6, -207, -144, -221, -236, -618, -376, -206, -338, -56, -221, -495, -354, -239, -518, -414, -364, -372, -485, -711, -625, -76, -706, -862, -329, -306, -538, -803, -318, -183, -551, -651, -472, -288, -613, -659, -472, -145, -642, -639, -615, -340, -224, -321, -340, -364, -381, -349, -338, -163, 171, -264, -457, -11, 287, 232, -182, -22, 216, 54, -56, 188, -270, 308, 362, -138, 148, 541, 391, 396, 20, 114, 487, 37, 206, 240, 361, 248, 82, 645, 267, 377, 448, 430, 415, 275, 213, 895, 398, 224, 426, 626, 205, 299, 375, 405, 583, 255, 913, 166, 658, 378, 449, 535, 356, 309, 448, 365, 195, -66, 161, 308, 208, 321, 427, 217, 167, 140, 69, 102, -232, -96, 286, -115, -10, -104, 27, -153, -300, -108, 158, -22, -445]
1842d45M92L5l88j92K16J4j2k64K15l5j4j48K22j77K62k17K63j31k28J66l0N0
1864c46j48K23Nr6m2M8J85j63m60N89J00j47k71n0M32j86o4J42J68p7J71J98m72
1887b61n7J28J6R5n8j3Q8o0j27K88k16M85j21j23J43k48p7J35K05j27N6m4J04
1910B11J65k96j53K81P6l3m5L17k76Q5J78j39J12j28J08k22K11l0J88n09J34L39
1932E74j36k35R7j19L22jJ02j63j9j42l56L36%l34K63L09l18j68M04k42j15k92
1954b33J25J03N7j29r6m8K34l87Q3L08j85k10L77k32j6k05J16L51n07N3J28K51
1976f2m24N98l84r1N9j97J46j42n5K61j54k1J82j99J55m47L79P2P9k92K00r5K29
1999b03k34QK80o8J7m10P02l42k1j48L04j43Q4m7J10k5PJ06q5q2K45l62L28M04
$$ y = [-445, 47, 82, -306, -498, -282, -268, -280, -544, -329, -364, -378, -526, -304, -481, -219, -436, -173, -304, -532, -366, -396, -346, -494, -271, -266, -362, -404, -356, -171, -334, -794, -205, -105, -252, -523, -573, -141, -327, -391, -249, -81, -158, 13, 211, -261, -318, -190, -174, -79, -137, -150, -62, -122, -249, 39, -177, 308, 187, 64, 207, -41, -118, 17, 222, 95, 151, 107, 211, 376, 80, -73, 208, 284, 251, 206, 523, 247, 332, 510, 371, 483, 355, 463, 241, 452, 422, 610, 101, 235, 574, 438, 203, 300, 181, 503, 502, 604, 441, 422, 280, -76, 260, 260, -74, 189, 498, 180, 12, 416, 174, 59, -233, -108, -5, 52, -77, -173, -221, 13, -374, -291, 17, -168, -378, -1, -233, -249, -454, -338, 13, -494, -441, -313, -62, -486, 112, -272, -363, -304, -501, -355, -497, -552, -291, -445, -466, -284, -483, -328, -775, -396, -324, -245, -537, -337, -432, -203, -437, -429, -149, -217, -200, -610, 92, -250, -271, -419, -115, -258, -174, -221, -111, -136, -129, -23, -108, -190, 55, -307, 21, 425]
2023D25n08L31J08m32O9K19j21p1R5L26n25nM24R0Q1l20L84j94r9k86L91R2m34
2046D0L28o9l3O9N2j18L86n79J70K87j41r7k66K16J43J06j86R8j44j23RJ55j14
2069A89r3J11R6k56R5o6J98L8j81O6k59M67n16m1K27j57M4j75L8J01m5J44r1j36
2093b02J19j8l3j07j18K69k82K34j61k6K63k32jK3j52J94k95M99j69j50Pj17j5
2116d70J67r6K44p4l19J21M53k62Kk57K84M8l36M47k1j65K62K3j24q3o8J53k40
2139c11l2J67J53M2l20K71K7j69Q6k21K68O0J97l17J24Q4L4m4n3k82L11l0K16
2162B61m36O81j05m87K54rq9L64l40J29jP0o6Q7N35m31p6R0J28m37K64k35K27
2185C78n9j42J12j10j56M98m05K38j08j35M3O2j74J80q2j75K28k61J59K7k16L2
$$ y = [425, -83, 248, 356, -76, -7, 212, 91, 20, 115, 441, -84, -89, 335, 425, 506, 186, 570, 376, 277, -9, 382, 474, 40, 368, 299, 266, 335, 387, 269, 655, 76, 246, 533, 392, 295, 29, 245, 388, 494, 308, 406, 262, 139, 148, 303, 189, 96, 207, 303, 47, 142, 76, 274, 312, 131, 197, -62, 405, -111, -152, 75, -82, -38, -213, -175, -74, -119, 25, -66, -202, -83, -101, -134, -241, -359, -90, -372, -138, -299, -325, -62, -294, -295, -272, -424, -230, -525, -26, -195, -345, -338, -455, -470, -303, -399, -155, -229, -548, -427, 26, -236, -234, -491, -207, -159, -495, -48, -69, -234, 28, 51, -73, -156, -224, -71, -311, -343, -176, -23, 19, -301, -30, -3, -172, -86, -307, -39, 21, 218, -99, 25, 109, 143, 99, 46, -236, 75, 45, 261, -175, 506, 401, -86, 168, 159, 70, 434, 94, 223, 222, 292, 226, 313, 848, 417, 341, 431, 559, 122, 386, 151, 378, 319, 177, 289, 179, 23, 521, 116, 354, 246, 111, 154, 216, 42, 222, 140, -35, 193, -68, 91, 118, -98, -66]
2207f6K57j61r8k9j37L26k4J74l12q4Q8L0q1j57K97j13r5M9l1l28M67k12L67m45
2231c18J72j87p1L26l8K0j32K04l93K04j77J65L5k62M45m04J18O6L13j67l64K43
2253b02N2k6Ol00J72J77J25k31p5M16Q0n88J74K26j57K47k33L12l05j31L80k31
2275a12K69k1k22K18M4p6j15K20p6K96j39k92k26M55j44oJ30J80m8o0r8Q4K29
2298D90j15k47M71l98k6j04PN27k47k55J38R0l00J30j50J02k01J41j19j27K05
2319A2M00l08nLK31N4l37j66K49n0l89O25l46lK37l21l5J03j13jJ56J29j65j43
2343a83q6M88k85l2N15o60J53M2k95K58L20l33k84K02j26r1J19R3l2r5k7l47N08
2366a78Q2j37r9K65n9l6r5J81j59j94L11O5k20r1j16K59Q2q2R3m2K07J02j85m19
$$ y = [-66, 191, 30, -68, -97, -234, 92, 68, 242, -70, -154, -66, -36, -117, -274, 23, -90, -185, -136, -167, -495, -28, -240, 127, -318, -146, -333, -404, -78, -116, -96, -228, -24, -417, -213, -390, -225, -190, -452, -7, -411, -293, -227, 86, -81, -445, -202, -150, -176, -170, -470, -298, -121, 4, -227, -302, 114, 194, -394, -220, 6, -151, 96, -137, 175, -130, -261, 119, -112, 157, 136, -86, 132, 176, 100, -15, 205, 129, 425, 286, -6, -232, 223, 79, 73, 203, 383, 335, 275, 177, 261, 490, 375, 128, 599, 201, 175, 71, 78, 605, 358, 103, 241, 331, 31, 161, 11, 113, -88, 53, -66, -193, 12, 412, 104, 99, 102, 333, 387, 50, -116, 133, 83, -306, 319, -27, -30, 207, -114, -149, -46, -159, -160, -4, 125, -40, -183, -269, 219, -66, -98, 417, -243, -90, -48, -343, -85, 235, -98, -382, -180, -306, -397, -278, -185, -217, -312, -339, -686, -178, -96, -233, -332, -67, -126, -162, -257, -76, -235, -429, -118, -53, -273, -364, -480, -221, -139, -221, -128, -170, 37, 139, -46, -465]
2390d65M01LJ14j35NK7k81K60n0K47N5l27J8R8L01j52k29R6R1m5m7m5J93J05j14
2415A24l88R1K46J07n0j23R2J54lP9m06L03J11k34n5M94l20J1r2J20kR1l60O7
2439E7K25J59n28L86r3K46k60k59J44K22J63n44J64j13L60o09N77n63K83J50k66
2460i9J00J00K7j97k49N08l52N6lk10Q4K3J99Mk09O33m82k23Q1J41j23K92j22
2483b1k77J42m9k1J14k15K8K98n6l37j04M59l7j36k4N83p57M28l08K5l1J22K28
2506E4j94n7j35L13j90o4q1K11J05J9j19L43k88j14K03k00K14L9j58Q7o8K67j22
2529F5L10k14k99J67Q5n1q0k24O25k03j40J49O1m9N1j87K32j59J65n6j94r7K30
2552A87J0N9K2k61L77k37k86L86J30j73k76K70k11M3J01Q1q4j6J89l17kO5j9K13
$$ y = [-465, -64, -61, 53, -82, -77, -50, -331, -71, -121, 126, 181, -146, -128, -30, 271, 119, -110, -14, 77, 32, -15, -60, 133, 238, 124, -264, -173, 73, 180, 130, 7, 99, 253, 250, 329, -77, 226, 337, 103, 48, 542, 222, 233, 141, 261, 259, 350, -10, 57, 282, 441, -87, 299, 206, 452, 192, -67, 77, 299, 462, -82, 82, -31, 329, -280, 297, -266, 17, 167, -99, 1, 101, 128, -69, -318, 190, -162, -106, -109, -319, -235, -212, -13, -9, -218, 415, -67, -290, -209, -68, -191, 101, -21, -298, -156, -205, -226, -112, -327, -299, -1, -57, -394, -498, -39, -76, -212, -236, 347, -410, 18, -290, -265, -296, -174, 54, -140, -197, -332, -19, -209, -273, -354, -143, -38, -19, -138, 205, -83, -197, 6, -194, 20, 59, -99, -12, -80, 187, 65, 375, 161, -138, 29, 114, 63, -17, -241, 384, 181, 41, 190, 251, 202, 253, 66, 298, 139, 304, 248, 54, -43, 187, 197, 256, 278, 17, 394, 157, -129, 257, 387, 214, -62, 208, -3, 40, 141, 222, 138, 122, 311, -6, -8, 57, 38, 251]
2576B51k87RK61K30m84N3J60J2j82L18j89M5k89O4k15Jq3K1K97Q5r8J28M6m34
2600b80J24J1P1j51oQ4j99N3J23R5j67L9K41q3m30K04j1J63R6j12n8j9J18K2j15
2625a87J27R3k57M7J51l15K21o6l3K75p7j75K78k2l35K97l66L14o8P7J52j78k9
2648g6Q7L5J71k77L3k9j82L54k47K21L1l9J71Qk5ok6j20j30J14o6R7P4l77N54
2673C50j39l86M11l47K40K97k98J67j67o9M09j64o1j37j33J94k65L9L44J6l74
2694g3N6J26J06l71L38J50l5k31M4J34r9k01R9J69n3J12j87J28j17R9L8o6j55
2717A1J93k61l33r0M93ok73K45K1J52k36k83K1M54j14Q4p2K4J7j98m1J25o7J98
2741F4j13j50P0j06K6J10k31K43j25M99m60k43J83J83o1k55L5K39K4o1J91j90
$$ y = [251, -36, -27, 234, 464, -20, 33, 193, 205, 23, 341, 152, 197, -92, -28, -243, -242, -325, -304, -7, 78, -20, 108, 154, -280, -156, -145, -74, -225, -231, -147, -346, -293, -170, -75, -242, -203, 38, -45, -475, -271, -282, -119, -23, -135, -193, -212, -94, -72, -187, -60, 33, -224, -177, -26, -341, -120, -186, -219, 56, -21, -196, 82, 60, -275, 22, -344, -30, -98, -21, 131, -47, -76, 11, 46, 217, -60, -27, -56, -238, 116, -131, 90, 121, 82, 253, 261, 236, 230, 204, 84, -46, 68, 2, 99, 173, -204, 350, 211, -175, 236, -111, 129, 426, 128, 295, 128, 59, 468, 304, 243, 106, -27, 167, -98, -59, 285, 301, -73, -17, 109, 215, -156, 182, 332, 297, 66, 110, 244, 145, -56, 43, 212, 159, 271, 84, 212, 95, 194, 232, 166, 11, 204, -57, -390, -480, 13, 7, -266, -21, 0, 152, -84, -367, -346, 108, -6, 78, 6, 30, 47, -151, -192, -67, -134, 64, -49, -199, -129, -235, -209, -99, -330, -87, -212, 287, -173, -416, -233, -50, -111, -366, -331, -92, -68, -129, 62, -128]
2763a28N3j41K24r6j52O8R8J4J26k16O8J88J31k73q7R7m6m3K72j96m0l2k19L67
2787C7J02rj68K48k87L56j30m5R3N4l67J40l38N27l3jj11j42L4J64J48r7j30J0
2811E5j44M29j03k08R1K4j93o3M70l4l31m2L37Q1l04q6M05m42m5Q9K72j96j27
2834f5j09K44j60L14J19l33j09J15J46j41P5n0o0j0k19J89j61K43m6L1k94K07
2856g4R2j00j51O6J15p2K7M5l90p6K60J41r6M6J49k31K45L2j77J58j16N4r0o1
2880b04K72k24J35Q7l45K9J59j8j9L82o07K57m0J94L5k61K9J63Q4n4r4K4J26k60
2904a50M87m45j35J99q9P4k10L81K1j25P6J6K41l2l37K27l83M20k87J51K4j05
2926A9K14j49q3L2J56k79K93k52J38kj20K32L4R8o9J38k46m18M15j81m1l2L23
$$ y = [-128, -75, -216, 8, -88, -240, -172, -74, -60, 66, -150, -82, 106, 237, -36, -123, -26, -72, -115, 157, -39, -79, -111, -330, 37, 139, 130, -38, 210, -77, 279, 149, 104, 197, 251, -116, 24, -314, 213, 180, 179, 68, -74, -40, 124, 272, 175, 45, 55, -89, 340, 237, 29, 120, 144, -49, -112, 358, 324, -7, -49, 288, 369, 65, -21, 384, -58, -103, -14, 258, 62, -65, -174, 70, -90, 224, 343, 10, -99, 16, 162, 21, 96, 46, -14, -24, -243, -54, -215, 28, -18, 13, -281, -74, 18, -82, -233, -167, -52, -124, -97, -52, -442, -518, -258, -117, -213, -167, -18, -249, -4, 28, -149, 9, -107, -53, -143, -204, 68, -156, -21, 66, -279, -250, -91, -109, -128, 254, -353, -96, -136, 58, 93, -168, -139, 24, 108, 54, -40, -16, 110, -150, 337, -108, -243, -44, -133, -59, -269, 112, 133, 8, 84, 100, 341, 309, -28, 199, -184, 236, -51, 100, 124, 19, 233, 84, 1, 33, 189, -90, 203, -49, 89, 87, -33, 199, 233, 331, 262, 400, 154, -264, 151, -30, -71, -103, 220]
2949B20k48PP9J42n0j3o1k09L35k34K71j17j5O6j51l0L78m16j34p4L50k31K25
2972I0j72K41n5k72j2N3J95j54p3J82J52l01j57k26L09J85O1p5j9j13J59N5k36
2995a83P5R3m4R5k06L88j73j57r4j15K27J29j03k85K28K15o6j51j26K52j38r7
3017b36J38j92J37k09K64J3j21j45N73k98M14m11j18K46j84L2k11K02K09l2q4
3038a3j5N3j1J53J5kr4J07k02n3J22K06n6j61J08k89L64m73L54L00k89K91r8J
3062C18k64L3J34j12k03J01O1k7j2L3K1j38J24o8J6l4RK15p9k1J46j74J09L5k35
3087a2J74m88L66l07O89l31j26j79L83j68q0k47L69k57L5L74k09K9j77Q1j38L94
3109A75m38K83l19L15J9l78L49n2Q5L3l41M24k99k5J30P6k47J85k69RK95j31J46
$$ y = [220, -28, -21, 58, 200, 150, 137, 76, -133, 202, -32, 239, 122, 107, 173, 22, -8, 370, -46, -180, -254, 96, -135, 90, -82, 159, 104, -168, -180, -127, 68, -86, -159, 23, 175, -126, -283, -509, -200, -15, 46, -29, -48, -161, -2, 53, -183, -108, -15, -59, 36, -170, 218, 45, -112, -206, -321, -94, 35, -68, -353, -125, 90, 24, -127, -253, -1, -139, -236, -98, -290, -153, -362, -98, -85, -206, -351, 222, -76, 338, -73, -191, 55, -129, -97, -308, -106, 103, 71, -13, -28, 25, 14, 167, 182, 180, 86, 193, -9, -62, 60, 266, 210, 49, 157, -132, 232, -241, 113, 413, 124, 415, 317, 318, 54, 87, 221, 109, -94, 7, 68, 41, 29, 62, 83, -55, 69, 1, 17, -17, -8, 207, 128, 107, 253, 79, 188, 223, -12, 162, -326, 40, -267, 422, 91, -35, -214, 169, 1, -79, -326, 43, -214, -179, 195, -14, 15, -162, -81, -219, 175, -263, 20, -299, 16, 35, -343, 6, -46, 39, 72, -269, 155, -144, -169, -39, 37, -210, -25, -294, -285, 10, -121, 25]
3132B5n7J3j10m7K39J42k31K0j51J02k58N34k72l38K36J72j28j23L8O6P0J95k11
3155g4j26K6J28J00l6K31l0j17q2N9k67J72oJ96j15p6J26j14L54j75l15J85O7
3178A11k98M33l5J47k2m08K85j60r5L42l55K93j65J55j79k11M17m09L56l93M47
3199B56j24K79j05k48j63L94l4j27q8J13q7r4J75j03j24K02j32P4j01M2k3J96
3221A78j97L1k82J51M53m02L5j30R0J29j6J24k85j04J14K08k92L34Nl13J15J04
3243E0J15l89J51k26N1J12M37n83M4J82Qk94Q8j87L15RJ35O1j39J60n7j55JR8
3267a3j60n2j27L34K3k82L02J39j75J30J25k09k79L56l80K77O1l0j47k66M88j08
3289GJ09L3N8j65l3J23l05M55Jk85j31k10N19r2m8l4j01J54K13M6l07k7L9r7K04
$$ y = [25, -32, -19, -129, -176, 63, 205, -26, -6, -157, -55, -313, 221, -51, -389, -153, 19, -109, -232, -194, -128, -58, 137, -74, -200, -174, -46, 54, 18, 249, 219, 102, 20, 79, -188, -16, -22, 174, 59, -17, 109, -5, 349, 174, -141, 44, 111, -187, 246, 211, 358, 336, -72, 213, 53, -42, 300, -55, 238, 73, 228, 49, -162, 255, -154, 202, -191, 256, 132, 411, 306, 58, -105, 289, 255, 128, 40, 153, 66, -28, 147, 44, -80, 122, -10, 64, -37, 5, -18, 178, -19, 12, -270, -119, 334, -68, -33, -163, -73, 56, 40, 164, -121, -225, -111, 97, -195, 139, 144, -169, -54, 50, 165, -224, -73, -299, -248, -136, 301, -282, -238, -56, -48, -342, -254, -441, -126, -117, 18, 79, -60, 100, 43, -112, -111, -13, -173, -225, -352, -18, 5, -277, 25, 164, -11, 119, 244, 35, -244, 112, -268, 9, 70, 40, -107, -373, 115, 7, 116, 149, 207, 42, 9, 132, -173, 282, 283, -2, -133, -343, 176, 84, 36, 2, -99, 55, 268, 314, 7, -20, 19, -78, 126]
3314A26N4K49j60k34L4N6k08M9J22O2J24j75j18K3r4n8L29n7j92l3Q7j28L82j47
3338I3q2J58J0Loj09n8N2k0K4K28k19M7o7k31R3J17q1J8k1J95k70L1K73J3l66
3364a75J12K17k44PJ1o1J20J26l18J48m4k19K44O6o1J22M6j80K2J71k99k86L35
3387a40jJ67J52l70L3l1J67k01J63p1J60r5M20m76J94j19J05O5j90J54J9n5J29
3410A79o1l55M57l93K59q9o0j3l0K21j7m7j3j98M8L16J4j41l8k4J48o9k2j79j50
3435b57M32j53J44q1J77l20J99J26k41l3K16j88m1J74O8j29l1j04J89k5l58M75
3457B39j45J43l54J80J3M96k87j14m5j30J79l98J92o5J75k5L5j03r8k9K02L5K0
3480A16k9j43L02N5l27J83K44j14l37j45N8K8J05R9K7k27R1k57J06N18l63l10
$$ y = [126, 180, 429, 269, 35, 69, 125, -83, -34, 88, 150, 274, 99, -19, 4, -90, -148, 181, 124, -68, -101, -14, -142, 240, 93, 11, 169, 179, 182, 176, 67, 9, 61, 41, 65, 293, 74, 121, 54, -177, -84, 33, -48, -30, -51, 144, -126, -95, 178, 191, -175, -63, 154, -90, -83, -72, -133, -13, 113, -205, -57, -101, -320, -76, -10, -71, 51, 97, -83, -61, 110, -189, -475, -140, -141, 26, 178, -192, -159, -190, -23, -224, -61, -132, 28, -67, 353, -123, 71, -48, 57, 122, -68, 86, 105, 50, 179, 118, -237, 220, -173, 86, -3, -63, -76, -106, 115, 98, 51, 38, -160, -112, 204, 218, 77, 39, 15, 163, 94, 72, -107, -257, 175, 22, 166, 85, 262, -58, 141, 267, 26, -7, 209, 21, -20, 154, 222, 93, 62, -42, 147, 122, -236, 239, 94, 237, -117, 63, 76, 572, 285, 171, 126, -4, 175, -223, -31, -96, 79, 54, 89, -14, -112, -141, 61, 96, 116, 87, -56, 246, 301, -26, 157, 401, 287, -50, -195, -137, -109, -4, 95, 122, -105, -14, -271, -165, 353, -10, -320]
3502c20J05Q7J03K27j72q7j66m6M3N1K04j96J30k17M02k32j49J80R1o0j10K20
3524H8q4j41L38j18K0J95k77j07k22M23q0L40l38k77L36pq2J00J57k6j68n3j01
$$ y = [-320, -215, -128, -25, 202, 30, -57, -223, -269, -226, -175, 29, -167, -37, -254, 148, -84, -233, -53, 38, -22, -132, 88, 4, -137, 201, 83, 103, 298, 21, -86, -308, 115, 35, 375, 37, -240, 96, 89, 7, 107, 264, 238, 70, 17, -84]
$$ [...]
8191A23
##END NTUPLES=NMR FID
##END=
