##TITLE=1H_LR-618-R4-C1LC
 CDCl3, 8 sc, 
 7.07.2021
##JCAMPDX= 6.0         $$ Bruker NMR JCAMP-DX V2.0
##DATA TYPE= NMR FID
##DATA CLASS= NTUPLES
##ORIGIN= UXNMR, Bruker Analytische Messtechnik GmbH
##OWNER= root
$$ XWIN-NMR		Version 3.5
$$ Wed Jul  7 13:27:02 2021 Russian Standard Time (UT+4h)  she@DPX200
##.OBSERVE FREQUENCY= 200.131506
##.OBSERVE NUCLEUS= ^1H
##.DELAY= (6, 6)
##.ACQUISITION MODE= SIMULTANEOUS
##.ACQUISITION SCHEME= undefined
##.AVERAGES= 8
##.DIGITISER RES= 18
##SPECTROMETER/DATA SYSTEM= spect
##.PULSE SEQUENCE= zg30
##.SOLVENT NAME= CDCl3
##.SHIFT REFERENCE= (INTERNAL, CDCl3, 0, 15.7039)
##AUDIT TRAIL= $$ (NUMBER, WHEN, WHO, WHERE, WHAT)
$$ ##TITLE= Audit trail, XWIN-NMR		Version 3.5
$$ ##JCAMPDX= 5.01
$$ ##ORIGIN= Bruker BioSpin GmbH
$$ ##OWNER= she
$$ F:/spectra/data/she/nmr/H-F/1/audita.txt
$$ ##AUDIT TRAIL=  $$ (NUMBER, WHEN, WHO, WHERE, WHAT)
(   1,<2021-07-07 13:26:02.34 +0400>,<she>,<DPX200>,
      <created by zg, POWCHK disabled, PULCHK disabled
       configuration hash MD5:
       00 E9 B6 7A A2 85 ED C7 34 08 36 98 17 FE 4E 26
       data hash MD5: 16K
       A7 31 6E 41 C1 97 BC 07 10 86 73 DC DC 82 A0 EA>)
$$ ##END=
$$ 
$$ hash MD5
$$ AC C2 C7 98 A3 D4 BE 15 81 8E 9D F2 17 96 06 97
##$RELAX= 
##$RELAX= 
##$RELAX= 
##$RELAX= 
##$RELAX= 
##$RELAX= 
$$ Bruker specific parameters
$$ --------------------------
##$DU= <F:/spectra>
##$EXPNO= 1
##$NAME= <H-F>
##$PROCNO= 1
##$TYPE= <nmr>
##$USER= <she>
##$AMP= (0..31)
100 100 100 100 100 100 100 100 100 100 100 100 100 100 100 100 100 100 
100 100 100 100 100 100 100 100 100 100 100 100 100 100 
##$AQSEQ= 0
##$AQ_mod= 1
##$AUNM= <au_zg>
##$AUTOPOS= <>
##$BF1= 200.13
##$BF2= 200.13
##$BF3= 200.13
##$BF4= 200.13
##$BF5= 200.13
##$BF6= 200.13
##$BF7= 200.13
##$BF8= 200.13
##$BYTORDA= 1
##$CFDGTYP= 0
##$CFRGTYP= 5
##$CHEMSTR= <none>
##$CNST= (0..31)
1 1 145 1 1 1 1 1 1 1 1 1 1 1 1 1 1 1 1 1 1 1 1 1 1 1 1 1 1 1 1 1 
##$CPDPRG= <>
##$CPDPRG1= <>
##$CPDPRG2= <>
##$CPDPRG3= <>
##$CPDPRG4= <mlev>
##$CPDPRG5= <mlev>
##$CPDPRG6= <mlev>
##$CPDPRG7= <mlev>
##$CPDPRG8= <mlev>
##$CPDPRGB= <>
##$CPDPRGT= <>
##$D= (0..31)
0 1.2 0 0 0 0 0 0 0 0.06 0 0.03 0 0 0 0 0.0002 0 0 0 0 0 0 0 0 0 0 0 0 
0 0 0 
##$DATE= 1625649961
##$DBL= (0..7)
120 120 120 120 120 120 120 120 
##$DBP= (0..7)
150 150 150 150 150 150 150 150 
##$DBP07= 0
##$DBPNAM0= <>
##$DBPNAM1= <>
##$DBPNAM2= <>
##$DBPNAM3= <>
##$DBPNAM4= <>
##$DBPNAM5= <>
##$DBPNAM6= <>
##$DBPNAM7= <>
##$DBPOAL= (0..7)
0.5 0.5 0.5 0.5 0.5 0.5 0.5 0.5 
##$DBPOFFS= (0..7)
0 0 0 0 0 0 0 0 
##$DE= 6
##$DECBNUC= <off>
##$DECIM= 32
##$DECNUC= <off>
##$DECSTAT= 4
##$DIGMOD= 1
##$DIGTYP= 9
##$DL= (0..7)
0 120 120 120 120 120 120 120 
##$DP= (0..7)
150 150 150 150 150 150 150 150 
##$DP07= 0
##$DPNAME0= <>
##$DPNAME1= <>
##$DPNAME2= <>
##$DPNAME3= <>
##$DPNAME4= <>
##$DPNAME5= <>
##$DPNAME6= <>
##$DPNAME7= <>
##$DPOAL= (0..7)
0.5 0.5 0.5 0.5 0.5 0.5 0.5 0.5 
##$DPOFFS= (0..7)
0 0 0 0 0 0 0 0 
##$DQDMODE= 0
##$DR= 18
##$DS= 0
##$DSLIST= <SSSSSSSSSSSSSSS>
$$ [...]
##$SUBNAM2= <"">
##$SUBNAM3= <"">
##$SUBNAM4= <"">
##$SUBNAM5= <"">
##$SUBNAM6= <"">
##$SUBNAM7= <"">
##$SUBNAM8= <"">
##$SUBNAM9= <"">
##$SW= 20.0188882624521
##$SWIBOX= (0..15)
0 0 2 0 0 0 0 0 0 0 0 0 0 0 0 0 
##$SW_h= 4006.41025641026
##$TD= 16384
##$TD0= 1
##$TE= 0
##$TE2= 300
##$TE3= 300
##$TEG= 300
##$TL= (0..7)
0 120 120 120 120 120 120 120 
##$TP= (0..7)
150 150 150 150 150 150 150 150 
##$TP07= 0
##$TPNAME0= <>
##$TPNAME1= <>
##$TPNAME2= <>
##$TPNAME3= <>
##$TPNAME4= <>
##$TPNAME5= <>
##$TPNAME6= <>
##$TPNAME7= <>
##$TPOAL= (0..7)
0.5 0.5 0.5 0.5 0.5 0.5 0.5 0.5 
##$TPOFFS= (0..7)
0 0 0 0 0 0 0 0 
##$TUNHIN= 0
##$TUNHOUT= 0
##$TUNXOUT= 0
##$USERA1= <user>
##$USERA2= <user>
##$USERA3= <user>
##$USERA4= <user>
##$USERA5= <user>
##$V9= 5
##$VALIST= <valist>
##$VCLIST= <CCCCCCCCCCCCCCC>
##$VD= 0
##$VDLIST= <DDDDDDDDDDDDDDD>
##$VPLIST= <PPPPPPPPPPPPPPP>
##$VTLIST= <TTTTTTTTTTTTTTT>
##$WBST= 1024
##$WBSW= 4
##$XGAIN= (0..3)
0 0 0 0 
##$XL= 0
##$YL= 0
##$YMAX_a= 104584
##$YMIN_a= -231214
##$ZGOPTNS= <>
##$ZL1= 120
##$ZL2= 120
##$ZL3= 120
##$ZL4= 120
##$ABSF1= 10
##$ABSF2= 0
##$ABSG= 5
##$ABSL= 3
##$ALPHA= 0
##$AQORDER= 0
##$ASSFAC= 0
##$ASSFACI= 0
##$ASSFACX= 0
##$ASSWID= 0
##$AUNMP= <proc_1d>
##$AZFE= 0.1
##$AZFW= 0.1
##$BCFW= 1
##$BC_mod= 2
##$BYTORDP= 1
##$COROFFS= 0
##$CY= 11.3945322036743
##$DATMOD= 1
##$DC= 2
##$DFILT= <>
##$DTYPP= 0
##$F1P= 15.9154993809931
##$F2P= -4.1035820241983
##$FCOR= 0.5
##$FTSIZE= 0
##$FT_mod= 4
##$GAMMA= 1
##$GB= 0.15
##$INTBC= 1
##$INTSCL= 1
##$ISEN= 128
##$LB= 0.24
##$LEV0= 0
##$LPBIN= 0
##$MAXI= 10000
##$MC2= 0
##$MEAN= 0
##$ME_mod= 0
##$MI= 1.114404
##$NCOEF= 0
##$NC_proc= 0
##$NLEV= 6
##$NOISF1= 3.799351
##$NOISF2= 2.8
##$NSP= 1
##$NTH_PI= 0
##$NZP= 0
##$OFFSET= 15.70392
##$PC= 1
##$PHC0= -12286.68
##$PHC1= 25.601
##$PH_mod= 1
##$PKNL= yes
##$PPARMOD= 0
##$PSCAL= 0
##$PSIGN= 0
##$REVERSE= no
##$SF= 200.130013532006
##$SI= 16384
##$SIGF1= 3
##$SIGF2= 2
##$SINO= 400
##$SIOLD= 16384
##$SREGLST= <1H.CDCl3>
##$SSB= 0
##$STSI= 0
##$STSR= 0
##$SW_p= 3612.71676300578
##$SYMM= 0
##$S_DEV= 0
##$TDeff= 0
##$TDoff= 0
##$TI= <>
##$TILT= no
##$TM1= 0
##$TM2= 0
##$TOPLEV= 0
##$USERP1= <user>
##$USERP2= <user>
##$USERP3= <user>
##$USERP4= <user>
##$USERP5= <user>
##$WDW= 1
##$XDIM= 8192
##$YMAX_p= 0
##$YMIN_p= 0
$$ End of Bruker specific parameters
$$ ---------------------------------
##NTUPLES= NMR FID
##VAR_NAME=  TIME,          FID/REAL,        FID/IMAG
##SYMBOL=    X,             R,               I
##VAR_TYPE=  INDEPENDENT,   DEPENDENT,       DEPENDENT
##VAR_FORM=  AFFN,          ASDF,            ASDF
##VAR_DIM=   8192,          8192,            8192
##UNITS=     SECONDS,       ARBITRARY UNITS, ARBITRARY UNITS
##FACTOR=    0.0002496,     1,               1
##FIRST=     0,             0,               0
##LAST=      2.0444736,     0,               0
##MIN=       0,             -231214,         0
##MAX=       2.0444736,     104584,          0
$$ Real data points
##PAGE= N=1
##DATA TABLE= (X++(R..R)), XYDATA
$$ [...]
1299a51J5J02k6R5r0l4J10K2RPq9P9kJ26j72K0N4k17J88l7Km1J06j05k7J57k01
1326a00NJ96j57q6J56k1j51J46J01p7j6j02K23j68M0P4Jq9r6P5lJ22j16n5j30
1351b28L47r2J76k13j14P6L1R2m1l8n4k9J15o0M7j6%K53k08m7o8Q7j33OJ96j61
1377g6J7J54Oj44pJ51j83J3j3M9J22k37J99o1M6K4Pl0Mj02J41Rk4k15J34J14o0
1404C8O7o3o6jM2J5j48J27j06O8K9J76q3j38m5K9j9r0K30j37J66n9P9r6nJl1J17
1432I7j85K11j71J80j64n4J05K9J63l13K13k74J12J39j20r6L4K38k68R3j8J04
1454E5l7N4k10J64j25J30j42K61k56P0P2K5P0l43J56J76r0L4k34J20M1j16P1J56
1478A02n7J0r3J61j19q3J25J16Q0k33k08J85J3K7m1o3L2J10j16J05p0j6N2j25
$$ y = [-151, -136, -34, -60, 35, -55, -89, 21, 43, 52, 59, -30, 49, 47, 173, 1, 21, 75, -142, 46, 9, 11, -30, 76, -29, -56, 101, -100, -95, 101, -56, -142, 14, -7, -158, -12, 89, 12, -4, -106, 117, -51, -11, 63, 64, -25, -121, -46, -49, 73, -43, -98, -228, 119, 27, 203, -10, -124, -48, -17, 75, 34, -4, -58, -87, 28, -32, 15, -1, -1, 252, 44, -3, -71, 16, -117, -111, 85, -76, -59, 95, 101, -43, -50, 101, -82, -69, -82, -33, 89, -148, 51, -10, 36, 60, 67, 37, 41, -61, 80, 89, 65, -150, -16, 98, 38, 105, 42, -24, -25, 17, 32, -116, 11, -95, -27, 2, 178, 95, -43, -88, -59, -78, -168, 62, -75, 91, 32, 111, 15, 10, 11, -20, 97, -88, 123, -48, 132, -32, -86, 19, 48, 211, -102, 111, -163, -51, 88, -32, -128, -94, 144, -124, -31, -49, 55, 18, 72, -138, 26, -99, 31, -111, 150, -106, -36, 36, 61, 131, -212, -56, 120, 30, 64, -170, -50, -9, -125, -54, 102, 45, 55, -38, 123, 4, -79, 46, 162, 242, 9, -199, -14, -1, 26, -15, -78, -46, 64, -52, 53, -17, -33, 19, -106]
1502a06K7J46j02J5K42l91J5l3K61n4l2j16K34Q3k42J21p7pJ13n2n4q8Q2Q6r1
1527b0P3j61J12j91K41r2J1r0M6J91p9m6j63J95j91L4P4J28n5L5J07k79K34r9
1551A5nj18P9j6M8n3R1p6J35j42J20r0N2j14K8J51k08K16l8j65qn3K27j69J23
1576C0j21K6PJ6N3J45k31O0P8n0n6J10l3k9rp4J53j51K89k85j20J45J36k40j32
1601b83J87R1k8J7K4j6j0l5M7J3q5j3J77r0P4L2j64K3K2j28K5P5J74j40n3J70
1627A06j73L3j98J61K78j38j49L7J54Mo1j17J02j14J19Ll3O9p5p2R3N8Q0k41J8
1652e6J03j41J28O1n5p9k2o9J09p3J54N3l0K2m5j46J30l6P4n4j04M0n8J56j53
1677i1R3J09j27o1J03m1ON7j23J39n3j24K16j24L3j2O1K3p7q5Q8nj0q2jNJ59O4
$$ y = [-106, -79, 67, -35, -20, 222, -169, -154, -187, 74, 20, -12, -128, 106, 189, -53, 68, -9, -16, 97, 45, -9, -97, -15, 71, -20, 53, -108, 4, -187, 54, -38, -27, -117, -71, 120, 41, -5, -168, 27, -164, -130, -56, 72, 17, 52, 159, -120, 114, 15, 10, -108, -29, -45, 3, -50, 41, -35, 100, -42, 78, -12, 40, -74, -46, 105, -103, 113, 75, -90, -98, -151, 76, -93, 30, -91, -65, -58, -42, 11, 156, -75, -15, 63, 13, -43, 67, 34, 5, -4, -78, 75, -76, 213, -72, -192, -47, 89, -151, -283, -96, -5, -33, -16, 8, -8, -18, -53, -6, 7, -78, -91, 86, -4, 70, 102, -62, -39, -17, -145, -120, -45, 129, -11, -64, 106, -67, -34, -232, -71, 207, 69, -80, -43, 111, 115, 54, -63, 39, -75, 44, 47, 14, 83, 8, -64, 29, 87, 167, -74, -56, 47, -94, 34, 95, 40, -39, -61, -130, -21, -94, 60, 113, 83, 105, 60, -86, 44, 8, 82, 28, -76, -36, -94, 62, -91, 2, 111, -16, -77, 26, -15, -9, 48, -75, 64, 11, -113, 103, -21, 12, 0, 61, 84, 7, -78, 10, 5, -5, -87, -88, -83, 76, 140]
1705A40k41K13j54K08j62l1q9J33M2p3j9J00o7J1L7K05k37j09J15n2J07k2j33
1728g8M6P0Q4j57J4J8J39q6P5M9k36j7l6J46m4J48o1k2k22J27p8J91j10n8J06
1753Hj5l5J07L9Mj12l0m4PJ28j15J08J1p6J16j35N7N6m4J6r6P9N8p6Q6j56K5L0
1781AmJ65Nk82K5Q0n7J11q3j05J63m7Q5m8K6kj91QJ3J22n5K9N1q5J67k81J32P1
1809A4O4P8l78J68LJ52j29l3M0m0L8j39K44j62r9J07Q2Q1J37j39n5j69J34J61
1833A60j87J17Q4j63jM5O4k6o0o3M2J80r1P3j16J29o1j01j62J47J2J7m0L8N6n4
1859C9k4j11K8K17m4p5k5M5m6n6K1j45K70o4M3k00K60kJ15j46O9k01o7J92P6j23
1885D6J04q9n7OK5L9nr0O3J1n8J9q7J73j77J41lp6KL3p7K7j68J97o9J64j02J18
$$ y = [140, -101, 112, -42, 166, 4, -27, -116, 17, 59, -14, -33, 67, 0, 11, 48, 253, 16, -93, 22, -30, 77, 55, -78, -32, 38, 122, -35, -21, -3, 136, 50, 125, 174, -62, -79, -115, 31, -13, 135, 74, 52, -170, -43, -121, 70, -40, -98, 8, -7, -42, 65, 104, 108, -4, -34, -78, -71, 57, -58, 50, 61, -15, 101, -34, 23, 79, 35, 51, -45, 34, 92, 16, 102, -54, -29, 1, -3, 162, 167, -115, -90, -10, -67, 44, -39, -144, 19, -28, 57, 9, 35, 33, -158, -150, -137, -15, -70, -41, 10, -75, 92, -189, -57, 14, 78, 156, -222, -54, -51, 101, -28, -61, -21, -61, -23, -162, 82, -80, -179, -72, 10, 91, 228, 89, 34, -135, -1, 160, -27, 90, 174, 11, 10, 55, 119, 93, 33, -30, 12, 192, 101, 174, 58, 187, 126, 25, -137, 10, 22, 39, -1, 37, 93, 39, 15, -96, -68, 149, 105, 30, 5, 50, 4, -52, -31, -176, 94, 30, 73, -127, 133, 131, 246, 100, 169, -32, -99, 93, 169, 46, 150, 61, 4, 10, 35, 74, 69, -21, 42, 53, -5, 14, -73, 100, -77, 64, 61, -15, -13, 20, -57, -30, -198, -1, -70, 94, -8, 110]
1913A10l9m4K5k2J10J07q3j65M6J38l43J24J07l4j47J67q4J98k58o4Q9k0J12j25
1937i5J96j24j56K66j24L4J71k45J81r5jl4oo4J73Ol2j84J76Oq5p2J08J52j16
1962C6p8M3O4j00j5N9L8o9O8j3Oq1J03r9r2J26l6k2J21M0p8p3l9J04M3j52j26
1989b22J32J89m5q%k2P4O0k76K9q0pJ54n6J00j18P1L1J9j75K67N3l58K34k4j6
2015FKl2rN7m2L8j35m2J51lq2M4o9%J3J31j37RJ51N9k33p9L84o2l7j39R7j41P1
2044b9K45r3k64O4K27j14noL4k04J14M8N2p1pm2J29o6O2r9j25K03j49K01rm4k2
2071C0K4P6q5Ol7q7J04J30k91O5M3k10J76J36j52m3P2r5R7K3J9p2j4J66j69J00
2097A2lm0J48j88j6M5J37l5Nj18O4p5k6K59n1O2r8j41J19j23J31j7j68K43k32
$$ y = [110, 71, 27, 52, 30, 140, 247, 164, -1, 45, 183, -160, -36, 71, 37, -110, 57, -27, 171, -87, -151, -62, -82, 30, -95, 101, -23, -179, 87, -37, -3, 168, -77, 104, 9, 8, -26, -32, -96, 77, 83, 51, -133, 43, 49, -36, -108, 0, 152, 36, -42, 1, 65, -35, -50, 9, 47, -22, 46, 33, 39, -42, 61, -38, -130, -4, -40, -62, 59, 99, 21, -52, -91, 13, 56, -96, -222, -90, 99, 54, 46, 46, 24, 98, 158, -118, -89, -169, -176, -22, -78, 22, -96, -25, 6, 25, -150, 117, 170, -188, 46, 22, 6, 8, -24, -33, 24, -18, 20, -115, -157, -6, -9, -91, -47, -116, -116, -103, 28, -109, -100, 51, 110, -123, -202, 182, 120, 83, -56, 41, -100, -29, 216, 123, -141, -77, 150, 36, 31, 25, 59, -145, -31, 17, 69, -2, -9, -51, 78, 12, 74, -25, -150, 53, -96, 105, 96, 52, 30, 54, 130, 45, 51, 14, -73, 31, 161, -130, -65, -22, -232, -56, 80, -72, -115, -43, -138, -41, -18, 1, -71, -85, 81, -88, 12, 9, -31, 117, -71, -87, -42, 95, 60, 65, -53, 11, -64, -90, 169, 118, 180, 82, -59, 60, -63, 68, 51, -117, 126, -106]
2122a06K05J54k92Q7j22Q0j11O2o4P4o8j45L07j72J87o5o1j42K49j62J50N9j06
2145bo4J60O1k28Q0j33R6o5K12r5j89L29j33O9j57l6R2O3n3L4K2k22Q8N8P3o3
2171cj01nJ53k1m8n1N8J75j27k26K70m6K9j9O7j35KP7o5o6J61P3r4K9p0J27j75
2198c1J06n8J18k00K29j38R4k27L1O1P3m3l9l9M8J03K4r1P0j12k5Lk5k5J81n9
2224B9K6n3l7r2J17J1q7q6O5J71j2j96J47r9j40K23M0l0j52P4O4p7Q1J54k40K95
2250A96k62M7J46k54K49J04q2j77r6J89j31K5Np4K6J15o2o6P6j48K86j64J47n3
2274D2q0m2K4J70r3j48R3J34N4j28r2J30j87K07j38j8Q8o8J00J04j29lj2k21K57
2299D4n0J54j51L5j29J46N2j30Q4pK7o2J4o7j9jJ12rk86J76l3O9J22K4p3O9m2
$$ y = [-106, 99, 253, -39, 48, -74, 6, -105, -43, -107, -33, -101, -246, 61, -111, 76, 11, -50, -192, 57, -105, 45, 104, -2, -66, 94, 155, -73, 7, -126, -30, -95, 117, 22, -167, 162, 29, 98, -59, -95, -3, 60, 7, 41, 63, -159, -71, -13, 60, -3, -104, -109, 44, 23, -25, -76, -18, 157, 30, -196, 74, 28, 57, 38, 105, -30, -28, 49, -16, -82, 79, 152, 58, 87, 17, 144, -31, 75, 17, 135, -65, 164, 26, 120, -107, -76, -15, 58, 15, -24, -63, -15, 88, 112, 21, 91, -21, -46, -43, -68, -93, 88, 29, 55, 2, -35, -127, -10, 1, -86, -172, -107, 64, 52, -144, 3, -96, -236, -13, 27, -3, -155, -81, -17, -94, -13, 141, -99, 196, -66, -19, 127, -127, 122, 226, 144, -33, -129, 60, -71, -46, -41, -115, -89, 26, -36, -102, -26, -174, 112, -52, 95, 42, -38, -80, -56, 114, 21, -127, -34, 100, 154, 26, -66, 64, -123, 84, -54, -72, 16, -52, 48, 152, 23, 20, 8, -213, 44, -6, 148, -3, 32, -97, 49, 101, -29, 55, 48, 75, 13, 27, -40, -59, -60, 52, 43, -243, -67, -100, -31, 91, 115, 42, 111, 69]
2326F9k88K64J17j48R4n9j66J67J0j57J75j42J49j29K1K9k5k2l6K7M7L7k0nj7
2351hP5j00k12J08J9N2k7m0K45j9l3p1o2J48n3O0q9lO5j27l8J2J98l8J21o4j15
2378DP0k9oj59K08j06l3K7Q9r9Q9p7J61q8j28M4K6m6N2j3J02q3RQ3j19J10Q3m4
2406A27j66m0l2P7p9J26k8M6j33J01k4n7P6Lk07K22Q6K9j20j29K76j63j8J81j45
2431In5J06Q0j20k67N1K29Pk8K14j03m0j66J03j07R4j8Qmq3J59j29J44M0L6j41
2457A9L5l6j68J51j4n7J60k38K76j79J61p7p0m8J94m3L4k71K55n7k3k0j09J1N4
2482f0J03J09q9M8r4j87L88k12K0l4J06j22p4RK14k79K98j06j16p4J51L9n8jJ96
2507A75k16P4j0k29L6J15J36l9J5L9L4r9O1j22oO4J25j11J82j67O2n9J35l17R0
$$ y = [69, -219, 45, 162, 14, 108, 49, -117, 50, 60, -97, 78, -64, 85, -44, -23, 6, -19, -41, -77, -50, -3, 34, 14, 9, -8, 67, -33, -245, -137, -118, -66, -93, -133, 112, 93, 60, -11, -73, 75, 22, 82, -7, -10, 55, -72, -110, -98, 100, 62, 183, 119, 4, 74, 45, 39, -120, 88, -18, -51, -24, 65, -34, 55, -22, 139, 51, -77, -33, -7, -53, -1, -14, 88, 5, 14, 97, -22, 88, 171, 127, -39, -79, -111, -34, -113, 13, -15, 31, -102, -1, -25, -82, -6, -3, -210, 12, 98, 127, 7, -122, 154, -9, -27, 154, 9, -46, 60, 140, 20, -247, -196, 33, 40, 12, 226, 123, 83, -83, 20, -87, 7, -11, -3, -7, -90, 69, -60, 84, 124, 160, 19, 54, 18, -150, 1, -13, -70, 90, -148, 128, -51, 110, 33, -37, -85, 109, 66, 100, -171, 84, 27, 4, -16, -125, -114, -60, 43, 152, 63, 111, 17, -170, 218, 6, 26, -8, 98, -24, -98, -89, 125, -154, 144, 38, -78, -152, -1, 38, -20, -21, 175, -41, 33, 23, -206, -170, -55, 81, 42, 57, 96, 130, 31, 92, -30, -36, 28, 153, 42, 224, 57, 119, 60, 195, -122, -32]
2532c2J56n4l7J0j56J18J09p1J4p0K7J8m8m1K63r2k37J03K0M6lO4n1o1m7J21n5
2559A4p5n6J85k53O6J92Q6o4j20oM2M3M8k81J95K0J4o8q7K09j11M5p3R9N9j15
2585Hj4l9K4O4n9k2M6j75K38rj61P2J6j02L08k89O1J40j62J86k34J25L1j66K23
2610A10k70Q6O6J7K8J4o6k1J54k18P3J58j74n0O7k23J25L44k17O0l3K16j43j03
2634@O2j41l8J68q4N2kp8J28j16L8J10j11J35l7mj14M4M0J8q5J59j86Q1J6J08
2660A63q1r3R9J33k07l8o1M8J29j56J34r9J81l3j00n0l9RM6L4j2L0N5j62J41j25
2686e4l6J11P8k26J66M5pL4j13m0P5j53J14O5O0%Ok41J29R6k5l01L13r2J90r3
2712A01o1q1j4MJ58l6l5O1j38J29j79P6P6L4j38K7J4J14j11O9j05m5q4K45l8j01
$$ y = [-32, 124, 70, 33, 43, -113, 5, 114, 43, 57, -13, 14, 32, -16, -57, 206, 114, -123, -20, 0, 46, 43, 107, 56, -5, -52, 69, 14, -61, -117, 68, -185, -119, 73, 159, 95, -25, -31, 11, 54, 102, -179, 16, 36, 50, -18, -105, 104, -7, 38, -35, 64, 123, 8, -6, -45, -21, 43, -16, -38, 8, -167, 71, 62, -99, -27, -11, -113, 195, -94, -33, 107, -55, 131, -103, 22, 53, -113, 110, -160, -74, -8, 9, 37, 51, -15, -36, 118, -100, -27, 131, -43, -93, -26, -249, -124, 220, 3, 63, 30, 246, 103, 0, 62, -79, -117, 51, -33, 19, 17, -61, 67, -49, -11, 99, -12, 123, 86, 82, -32, 12, 52, 70, -15, 144, -42, 39, 55, 163, 82, -11, 88, 221, 14, -24, -85, -37, 92, -64, 70, -29, 152, 119, 19, -31, -70, -61, -15, 19, 7, 37, 92, -70, 71, -54, -90, 21, 99, -127, 39, 84, 77, 111, -2, -42, 33, -120, -6, 59, 119, 119, 125, -116, 13, 109, 84, -217, 96, 4, 194, 101, 40, -41, -55, -51, 107, 71, 36, 97, -41, 88, -91, -15, 61, 95, -43, -16, -2, 112, 1, 70, -35, -80, -164, 81, 43, -58]
2738e8oR9j42J11R3r9m9lK08k85K56k72J61O7j51J67o6J00j05r9J92j58L3q5Q2
2763iJ04JJ50k71m6J10J47k50J17K8r0R8l21L14j50m7J66Qj59K17k01J16j96J97
2787C3R6q0j10J06j74K52o9n8R1j06J62j45P0j48l8J02J69j93j55K15RP9k00J03
2811A1p9J96k59K59m5j55N3m9J43l06J84n7K12k50J71J33j48r5M0P2o1Q5L6r1
2835@M3Q6j18Q5k64K89r0p6Q2j35J26Mj45J08o0N3K2J27k31J34J43l49K36Jn6
2860A5M2J58j95jj16Q5J22j43K5P3p8n2J04J69k52L0J77j65j6P6q2K2j9q3O4j51
2886a91Q3n8K21j34l4J51L4nRK4j34R9j22J82r3O0n3k2m3Qo9J96k6n6M5j14J17
2913G5P0j60l5MJ55q9P1J7k35J63j75Q7J36r9j31K17J10l05K28j87N1J36lj02
$$ y = [-58, -64, 35, -107, 4, 97, -2, -51, -54, 154, -131, 125, -147, 14, 81, -70, 97, 31, 131, 26, -73, 119, -39, -6, -91, -9, 95, 96, 246, -25, -71, 39, 186, -64, 53, 81, -9, 89, -232, 82, -68, -115, 51, 59, -100, 117, -84, 32, -164, 33, 129, 49, -61, 45, -129, 123, 54, -4, 87, -19, 143, -2, 68, -80, -118, -16, 153, -40, -195, 20, 29, 108, -92, 11, -68, 128, -131, 128, 83, -72, -19, -68, 75, -231, -47, -104, 108, -142, 29, 162, 14, -81, -41, 31, -30, 55, 91, 0, 43, 129, 11, 96, -168, 121, 31, -45, 37, -98, 28, 32, -113, -5, -65, -12, 10, 137, -94, 40, 183, -166, 70, 71, 15, 57, 215, 20, 19, -97, -12, 110, -33, -8, 65, -13, -65, 39, 208, -44, -14, 163, -2, -18, 58, -24, -2, -21, -104, -40, -191, -108, -166, 55, -79, -113, 38, 72, 67, 76, 100, -34, 65, -57, 125, 32, 92, 39, 17, -26, -18, -87, 109, 83, 27, 72, -42, 75, 145, -15, -50, -46, 109, 20, 91, 108, -127, 36, -139, -52, 84, -15, -146, 71, 181, -124, 104, -83, -32, 104, 101, -1]
2937aK1K4j90J87k51K71L1M2k4p6l4n0N5j36O9K45k85j1L05k04NO8lj85p4J90
2963a1q0J59n3L7j61J91k13J50j07J18R6n4j87J6K57k02P0q4O5j53J35r7O8K43
2987B03k45m4K41j65j19k8K34k19L56l28K05r0q3J38j03M9O7O3k48Q9J09j12J76
3010A46j44l9j31J61R6j07Nl9M7j04m7K12o5Pn9L4r8J27R8k93J57Q2p5N9j38J05
3036ck3R3j00k8L2l3J68P6j25l7r3R8J58n7k13Q4onO0Nk0j01n7p4K41k7k0Q1p0
3065DP9m4j58R0j3n2o6J44K8%J57j67l5j5J9K55j09j50R5k1j8m5L3j17J20j5o7
3092f8K15J4j29L6j55j3N1LJ23J00k41O2Q1k93J12OJ68j48K02j42J40o4k74K81
3116F7o0n7k2l7J1J54j98P2Q3M6M3j8J2j80J17j42J99j57K21j27n4J95K7j90M2
$$ y = [-1, 20, 44, -146, 41, -210, 61, 92, 134, 110, 34, 0, -50, 5, -131, -62, 183, -102, -113, 192, -12, -7, 61, 58, -127, -201, -11, -91, 68, 15, 52, -109, 82, -131, 19, -88, 30, 126, 72, -115, -99, 158, -44, 26, -58, 7, -146, -11, -108, -40, 203, -42, -86, 155, -10, -129, -157, 77, -142, 214, -114, 91, 1, -82, 56, -47, 2, 69, 132, -116, -27, 82, -30, 146, 2, -37, -168, -7, 89, -18, -13, -52, -5, -109, -156, 56, -9, -2, -61, -27, -125, 2, 100, -193, -36, 46, -29, 30, -108, -3, -26, 67, -33, -61, -29, -62, 106, 182, 57, 20, -73, 25, 183, 126, -87, -3, -9, -14, 46, 51, 31, -70, -127, -201, 40, 13, -7, 74, 4, 83, 39, -119, -29, -42, -94, -160, -16, 12, 12, 169, 2, -33, -48, -29, 226, 117, -33, 62, 41, 23, -22, 11, -106, 14, -1, -68, 147, 161, 32, 68, -87, -100, -49, -46, 77, 177, -64, -2, 79, -214, -102, -96, 72, -76, 126, -16, 124, 60, -214, 67, 7, -50, -72, -109, -98, 56, -142, -70, 13, 59, 102, 84, 96, -84, 33, -109, 90, -67, 154, 27, -27, 168, 195, 5, 47]
3141D7j44N2J48j32O5N7k01M0LJ2L1p7O5K1j2Lp1J23o4k36L08n0j00J21kj83K35
3168E9q6J12j0P7j27j24J47j94J17Lp1J45m3M1K62l74J40m1o8M4qlkJ14N1j63
3194bk5K79k59J25j21j71L01j22j49Q0j50J45j2K9J11J02n4j60K60k56K44o7r8
3217C0L1r7PJ9Ol5J9l6rp8J15J15j06J4o5J56p5m1j7Q9M0j32NK0m6L3lp4O4J50
3247I9j97J40n3j04J14j26K67j37l1J34r5n2J07k07O2J35j51K34j59O5Q8Lk19
3270h3N3J1J09L3Jj34M9r0o0J09%J28r2j1L7l26J71J14j5K4l2M8r7J00K8j16J32
3297I1r0J18l12n8J90J26p5O5J8K6j71J28j18k11J89R5Q3k80J73P2k6J19j31J2
3321C3Q3J0k45P2M3L4L5k07J82M3j66K6rK15q9j76N1J46j88J06m4Q3n5n0J8p4
$$ y = [47, -97, -45, 103, -29, 36, 93, -108, -68, -65, -53, -22, -99, -34, -13, -25, -22, -93, 30, -34, -270, 38, -12, -112, 9, 7, -176, 59, -27, 85, 75, 152, 25, -99, 48, -146, -29, -26, -97, 48, 5, 46, 308, -66, 74, 33, -35, 9, 1, -2, -4, 110, 161, -2, -27, 252, -7, 118, -3, -174, 127, 5, -144, -64, -214, -69, -81, -52, 59, 161, 107, -53, 207, -49, 195, 128, 30, 61, -36, -29, -10, -4, -39, -20, -56, -65, -143, -28, 87, -19, -5, -70, 86, 11, -30, -47, 42, 82, -50, -45, -25, -71, -38, -41, -115, -51, 99, -98, 42, -11, -115, -1, -127, 140, 3, -28, 106, 11, -41, 66, -141, -79, 56, -95, 139, -20, 45, 133, 136, -83, -30, -19, 90, 123, 124, -10, 39, -51, -111, -2, -2, 126, 34, 23, 60, -266, -95, 19, 4, 28, -4, 44, -53, 47, 75, -41, 91, 1, 119, -193, -251, -61, 65, -10, 55, 73, 99, -72, 56, -62, -273, -84, 11, 94, -186, -13, 59, 33, 152, 21, 33, 116, 126, -119, -47, -4, 30, 65, -142, 40, 83, -83, -57, -66, 149, 60, -116, -65, 81, -107, -1, -45, 38, -17, -67, -49, -123]
3347a23Q3q9M5J6J36j34J84l0n4j65K13j79J27P8r9lL7J53k14k2k8O4j1k5Q3J30
3373A73j03m9l9l2J3m9J17q7R7l2K7n4L3j10J16o3O9K4k11P7O7N5n2j00K78k78
3399a13J15m1J25Rn2j05O2n9NJ84j27J02r2k3k5l7K59r8j86R5JqR9j8o1M2j12
3426e9J15P8l4k00l5J52O2j06O5J4j29J49p5m4P6j07J3O9J1J7R9l41K21L7R9j0
3452A37r6Klj78K99r5j13J15j85N0j9j31L74j14J01j91R5n8p0J04m3O3j21J34
3476E7k7q2J05j6j15M0J62j32n6J99r1m6N2k37K03P2q4j6m4R6l1P0m2J07l5q4
3502B5L1PN2j49R2J04Rl08J06J67p5O1j32Oo9k9J16J49k82l7J39rL8Q2r7J44j96
3529e5J4J9j53J23n6Q8n9J21N7p5J70k00j1L0r3K16m7j42R6m6R3k81L15j30O8
$$ y = [-123, -40, -129, -84, -68, 68, -66, 118, 88, 34, -131, 82, -97, 30, 108, 9, 6, 43, 196, -18, -40, -68, -4, -15, -40, 43, 173, 70, 21, -18, -50, -37, -86, 31, -56, 41, 9, 36, -18, 15, -95, 21, -42, 27, 51, -160, -83, -16, 39, -13, -113, 165, -113, 2, -39, 86, 95, 43, -62, 0, -59, -54, 130, 3, 105, 13, -10, -35, -72, 187, 89, -97, -2, -1, -9, 90, 72, 11, 53, -59, 56, 134, 100, -100, -135, 17, 79, -27, 38, 52, -77, 72, -3, -47, 29, -78, -65, 4, 15, 32, 131, -210, 11, 48, 147, 137, 41, 43, 40, -138, 161, 66, -47, 68, -117, -67, -86, -217, 157, 43, 144, -47, 48, -10, -80, 24, -19, 44, -77, 57, 30, -52, 53, 37, -78, -38, 124, -8, -64, 135, 44, -2, 50, -187, 16, 88, 4, -12, -56, 40, 9, 79, 37, 144, 109, 25, 56, 63, 115, -34, 58, 162, 171, -137, -31, 136, 61, 122, -10, -4, -73, -102, 14, 163, -119, -156, -17, -26, 12, 94, -3, 141, -55, -41, -22, -175, -52, -108, -20, -79, 42, 99, 24, 194, -6, -17, 13, -80, 136, 89, -53, 43, -3, 90, -191, 124, -6, 62]
3554F2N1l7j34j7L32k34j17p6J66J57j00l2k7r9J53n2j53J7J46K12l26K02r9p4
3578g9KlJ3R3j33J20m7l9J21p8K07j72J59j63r8J65l7J20q7n4J9j48K27k21J82
3603F9Op2k5J02Kn8op8n5M1l5K59l6k22O2J08j76O2j10k6J71M0q1j6P2K20l82
3630a64J59l7j36K76j83J36K5Rj28j35K05j02Jn8J61J5j4J25r7mj69J6Q8ROQ5
3656H9j63J50Mj10K4O6r5L2n0k2k4J37m9pQ7k9J38j56r3L9P3j48K2K65j42p3K47
3683B12j39k52L50j45J11j70k0J23j50J01N5Qj86n0K59q8p0J30o7J07k13N2j08
3706a50J16K7p1J99k08K07j40Q2K9L7q5j59J4P7J8O3m3J15r4j67J45j11J8O9k7
3731c9J64q9m5J38j18k9K08j69Q8j41M5m7MJ24k46J91r3l8R2r0m7J63O2o9k7J5
$$ y = [62, 113, 76, -58, -75, 257, 23, -94, -170, -4, 153, 53, 21, -6, -105, 48, -4, -157, -140, 6, 218, -108, 94, -5, -79, -77, -80, -67, 26, -107, 13, -34, -73, 48, -30, 177, 5, 164, 1, -97, 68, 31, 151, 64, 10, 29, -119, 108, -113, 69, 75, 3, -22, 80, 82, 24, 18, -60, -115, -74, -109, 150, 114, -108, -46, 62, -114, -52, -162, -188, -17, 23, -58, -74, -2, 218, -164, -5, -42, -178, 98, -85, 51, 76, 85, -43, -178, 27, -75, -74, -132, 29, 44, 30, 155, 58, 54, -115, -99, -11, -2, 4, 89, -74, 76, 80, -30, -6, 60, -35, -3, -53, -75, -99, 38, -11, -18, 69, 40, 178, 22, -71, -32, 41, -107, -85, 180, 38, -35, 212, 73, -179, 171, 26, 137, -33, -53, 70, -80, 21, 76, 84, -102, -152, 107, 19, -51, 79, 12, 119, -94, -42, -150, -34, -7, -78, 121, -87, 120, -20, 62, 91, 128, 43, -116, -102, -25, -7, 56, 13, 128, 34, -133, 12, -99, -81, -12, -39, 125, 36, -9, 129, 11, -18, 190, 21, 109, -32, 13, -34, -30, 94, -152, 39, -54, -92, 0, -90, -137, 26, 88, 19, -8, 7]
3757GO3k3q3J5pq4J85nk34J53PK7j54J70Mo4R7l16L68o7k14J84j45K71j76O4L1
3784G4J9k14P5O8R8k41K44j63J4Q2j49J68j82J17R8j9Q5k43J94k28J53m4p9J06
3808C3k2j0K9q9J29Lm5p7K30o2l09L44j36Q2oo4N7j70K23o2j20q2J76Nj72R0J17
3835I2p6J4k40J68L5j07R3q0J06o8l7J74n5rNR6j96Q7l0M5Q2k06Q2p1O3Q6L8m3
3863D8O3k46Q0oR3o1L0J60j41k9Q1j57J16M3N7l7j11J76q0M0j34J02j18J60qk15
3889i4J25qr7R3P5K9o8R2k43j05J37k2K26j46j35M5LM0k0QO0j25R4j31K14n9K3
3916A1n9Q3k3N0k5m8J48j38r9K25Q2l61N9K02j13j86J92J14k80J3L06j67p0Q4
3940@k6l1L7L1r0R6n6J03K1j13k0L0O9p8J68k78N4J68n7Ql5J93j26o5Q6j02O7
$$ y = [7, 70, 47, -36, -21, -28, -112, 73, 68, -166, -13, -6, 21, -133, 37, 41, -23, 74, -242, 126, 59, -155, 29, -116, 155, -21, 43, 74, 93, -121, -46, 22, 120, -121, 123, -40, -26, 56, -93, 75, -107, 10, 108, 89, 174, -69, 125, -103, 50, 6, -73, 33, 11, 1, 30, -59, 70, 73, 28, -49, 181, 119, -190, 154, 18, 100, 94, 30, 87, -83, 140, 78, -42, -124, 52, 57, -115, -25, 92, 16, 30, -210, -42, -7, -114, -21, -101, 5, -63, -100, 74, 19, 10, 15, 111, -85, 2, -28, 17, 99, -107, -25, -96, -33, 53, 91, 48, 111, -135, -55, -61, 32, -29, 1, 161, 20, -9, 72, -85, 31, 74, 131, 94, -17, 159, 79, 119, -15, 87, -31, 129, 121, -94, 31, 23, -74, 19, 94, 123, 55, 147, -96, -201, -64, -86, 140, -6, -141, -96, -93, -53, -73, -65, -5, -130, -36, -167, 47, -12, 11, -48, 35, 12, 62, 37, -11, 137, -1, -100, 125, 207, -154, -95, 107, -6, -192, 0, 114, -166, -153, 153, -14, -84, 0, -26, -57, -20, 11, -79, 17, -39, 64, 85, -28, -48, -18, 51, -27, 141, -137, -83, 85, 28, 36, 1, 194, 68, 3, 89, -13, 54]
3967E4k27P2J34mK0n2MJ59j49j8N5l3l6K9o2n6p2J86M2k66J18lr0J53q7J34J9
3994B4m9o5J29j84J92m5j98L15K9j56m8J32j11J53j62o4J66q9J20P6k47PK01l41
4018b15J19J67oJ69j51j43O0p9J60o3K1j93M7jJ13j73K43k52J80k8K14l02k9J74
4042C2oJ8j3O4k46M06l39MJ22P8r8M9k2j86qJ21J58j05P1N9k08J42n8j47L2J35
4068E5oo9R2P2k11R2O2m9M2k30N7K8j4J23j68K64k82J17j00P3L8M8O5j19j11Q0
4094e1O3p9M2K10j71m4J23j51J28j4k7k9J0J81l55J63Q8j2j59LJ12k04J35L4K2
4119A8R9j94N3m3J5J15o6J38j85l7O7p2J34j22m8J52P1j57n0K19j48K2j43J20
4143d2L3L5j46J72KL5q3N3j35k8J56k36K23j34Q6J6R2j10o0J79r5N6OK0j77J94
$$ y = [54, -173, -101, 33, 29, 49, -3, 1, 160, 11, -7, 48, 15, -21, 8, -54, -110, -182, 4, 46, -220, -102, -105, -195, -42, -129, 5, 24, -25, -90, 39, -145, 47, 2, -196, 119, 148, -8, -56, 76, -35, 118, -44, -108, 58, -31, 89, 165, -82, -75, 126, -215, -96, 71, 65, 234, 83, -60, 0, -79, 81, 18, 39, -154, -107, -108, 5, -168, 75, -177, 3, -25, 189, -113, -142, 32, 26, 44, 31, 95, -151, 255, -84, -80, 42, 120, 22, 71, 49, -137, -145, -24, 134, 29, 100, 159, -49, 93, 35, -112, -80, 55, 49, -20, 72, 144, -67, 25, 87, 38, 80, -150, -93, -65, -79, 44, -124, 140, -142, -25, -125, -52, -14, 34, 99, -20, -131, -51, 12, -67, -25, 185, 14, -30, 93, -58, 70, 56, 29, 0, 10, 191, -164, -1, 87, 75, -84, -81, 31, -173, -38, -4, 18, 117, -77, -24, -67, -52, 63, -3, 135, -50, -87, -20, -92, 42, -80, -128, 24, 95, -62, -112, 107, -41, -19, -162, -42, -9, 26, -120, 52, 54, 89, 6, 59, -76, -104, 52, -184, 39, -95, -9, 7, 99, -11, -71, 108, 13, 69, 75, 95, -82, 112]
4169A12R6k21N8j9j6j13k3P5r5j6K29m1J22j25j14mJ60J67j38lm5j4J29j65k2
4194b6p8M8K9J59K2j42k0k7R0k8J62n2k22J40j3j04L0j39J27j0J58k10K16r1K5
4219D4kOL0k38L33j95J35l4p9K6r1J74j48N2j52M7JJ04K05j11j75K9K07l63K76
4244H1j23J89j70j11J71m7K2n8K75l01j2L6O1P2j0j92NK04j46n1Q2J16j7Qj08
4269b4n7R3j96J67L7n6P5j21M0q2Q6o7J98m8j61K41j04J69k08nl5J49p3k74J81
4294g5K11L2j59LL7L4k7k8j7n2J88j07j44k1M3K1P7r9J59r2k8J04J18k08M3L2
4320D5j06R3Q8o6l2J32p3pr0M1j67J84O1o2o1LJ7K9k4K9j65K31j49J00j03O9j5
4347BJ4m9N0r3K21k27j12J93O9l3n3l7J08p8m8J67j92J77l9K4l5j0p0n9M8R7O9
$$ y = [112, 208, -13, 45, 26, 10, -103, -126, -51, -146, -162, 67, 26, 148, 23, -91, -95, 65, 232, 94, 91, 46, 32, 161, -4, -26, -104, -56, -27, 132, 154, 12, -8, -35, 55, 27, 189, 137, -85, 55, 42, -62, -32, -171, -44, -54, 104, -106, 110, 19, 44, 42, 48, 78, -160, 173, -22, 113, 79, 0, 26, -65, 109, -39, 13, -139, -92, -91, 13, 218, 107, -68, -39, 168, -195, 81, -42, 147, -23, -134, 37, -10, 12, -46, 229, -72, -84, -48, 13, 85, 75, -117, -112, 92, -54, -105, -23, 93, 76, 84, -24, -81, 12, -184, -17, 20, -36, 39, -82, -42, -124, -38, -105, 93, 45, -116, 125, 21, 190, -18, -23, -58, 91, 18, -256, -75, 136, 168, 9, 12, 49, 83, 56, 28, 11, -41, 147, 40, -104, -125, -82, -61, 16, -83, 76, -16, -44, 60, 178, -30, 13, 45, -61, 32, 120, 54, 22, 154, 81, 74, -16, 25, -142, 42, 103, 41, -20, -17, 0, 29, 5, 34, -131, 100, -49, 51, -52, 17, 2, 16, -33, 17, -76, 145, -82, -194, -1, 68, 35, -18, -55, 53, -25, -73, 94, -98, 79, 40, 64, 29, 19, -51, -110, -62, 35, 104]
4374A04k55J53n9Q7o5J06j08K3O6J3r0r7K30j72r2K7K11K8j74O9K30j54k27K13
4398F7j0K43k16q3n7QJ01n3p1J53o7j13mo2K59j66m8J99j72jP3l8M2L2O4j56J90
4425A14k3q3j34J35j27K5J9M5lq3J87m4J88j24j92K8J29j59K93j82k00K84o1k1
4449A1N1Kk7J08n7j16lq9Q2o8J45J32j51j59J96L4q4J14l71K72L3k40J40O7p2
4474e0k8J41O2j81J0J83j74L7j0J79p1Op0q8Q9n2q9J35n5o8P1K25j99m5J23j98
4500a17J77p5J73n9j31Q4j48rl5K11k34O8%J39r5N0n4P1j45J27KO7L4p1j54J37
4526A3P5j27J86j34R9M0K6l14Q0Q0L3j38J73k4k4j16q2K14k2j3K9k21J41L2j01
4551i5R8R9j24k0j45L22k38M2j4n5O6j32K06kN1j21Q2p4Q9l0j79J6K15O6r5K2
$$ y = [104, -151, 2, -57, 30, -35, 71, -37, -14, 52, 65, -25, -122, 108, -64, -156, -129, 82, 110, -64, 5, 235, 81, -146, 67, 57, 300, 84, 1, -56, -48, 53, 0, -71, 82, 15, -98, -102, -164, 95, -71, -119, 80, -92, -93, -20, -58, -16, 16, 80, -76, 114, 91, 8, -126, 9, -118, -93, -74, -29, -32, -115, 72, 28, 216, 92, -100, -72, 57, -102, 191, 9, -191, 93, 32, 11, 62, 64, 37, 145, 88, -28, -31, -120, -38, -106, 39, 171, 20, -139, 57, 91, 7, 121, -250, 22, 55, -185, -45, 22, -50, -78, 63, 125, -56, -46, 137, -37, 0, -10, 169, 98, 104, 34, -54, 35, -17, -106, 29, -26, -94, -23, 202, 3, -42, 81, -117, 60, -15, 158, 99, -32, 52, -96, -105, -140, 71, -163, -95, -95, 44, -51, -1, -55, 16, -129, -2, 0, 67, 101, 30, -124, 13, 88, -39, 147, 13, 112, 152, 178, -136, -56, 24, 57, -81, 92, 68, 44, -72, -154, 60, 38, 25, 54, -167, -26, 6, -95, 3, 102, -22, -42, -187, 135, -103, -61, -75, -130, -64, -196, 10, 8, 59, -62, 20, -54, 35, 5, -174, -158, 57, 123, 28, 50]
4577E0m9J15j74J16J28m33L79k32K46k21R8p2P2q3K34r1L2o2n7K51k05m8j93O5
4601a34K50p9Ok7n9K4j07Q6Q4M7p6l7P3k7n3J37p4J14k6j91J33o0j24R9j7J34
4627I6k39K02P5j31q7K11k21J24k6j19K75k88J20O8pJ1jk78L20j25o7k3J78k05
4651a37J65m0k2L2k2R3p1j09J07n5J58P2l35M6J21J9j28J76M5j18o0%K3R5J8q5
4677a2J45j14l5J14n6j53J81j02k5lJ3n2K42j96LjO0j9p3J01p6K81j80m1k5N5
4703C2r9q5Q7Lj7N6J5K01j65k2O2p9R6N0p5m7j73J16J5J35j32J16r7J59j02Q9
4729A39j62J52j12j11N7n9j06L17j31JK8R3j61J51j21J38n6k01K56j28J50p7j68
4752a11p3K83j75L4nJ81j69oJ40K0m9j9j44P0o9J28j9j89J28j4K4J1L2l8J34j64
$$ y = [50, 1, 116, -58, 58, 186, -247, 132, -100, 146, -75, 23, -49, 23, -60, 174, 83, 115, 53, -4, 247, 42, -6, -199, -134, 116, 37, 43, 16, -43, -19, -126, -40, 44, 91, 15, -22, 51, 24, -29, 108, 34, 148, 122, -69, 64, 4, -120, -21, -38, 96, -143, 59, 134, 3, -84, 127, -94, 30, 4, -115, 160, -128, -8, 60, 53, 64, 63, -215, 105, -20, -87, -110, 68, -137, 28, -12, -34, -2, -24, 69, -2, -111, -4, -59, 99, 171, -164, -118, 3, 22, -106, 70, 115, -3, -63, -63, -40, 55, 73, -12, 133, 19, -16, 98, 42, -111, 70, -32, -57, -60, -47, -99, 143, -53, -50, -51, 9, -10, -83, 18, -58, 223, 43, 2, -23, 32, -67, -152, -65, -62, -79, -23, -8, 193, 28, 6, 68, -11, 85, 135, 60, 13, -160, -44, -29, 106, -26, 90, -7, 152, 50, 139, -23, 129, 17, -94, -37, -96, -202, 115, -16, -15, 13, 106, -55, 96, -25, 113, 57, -144, 112, -16, 134, 57, -111, -184, 99, -76, -42, -47, 134, -35, -41, 99, 119, 70, 51, -93, -23, -92, 36, 17, -172, -44, -58, -34, -23, 9, -29, 105, -59]
4778e9L0P1J4r9J51l6j46J13N3j34L0o1M9j5J50p3j27J58j00%kQ7j82K86r8o0
4804@l8K28j58n6J60k20nQ3q9j48J66J71j00m6l5J56p8J1Q2l0j10K75l06J41k3
4829C1Q2K3j88j9N5Qj06J42m4o5J73n3M7K1j59LJ49j3J1k06R1J72j35nm6J57l9
4856H7N5q9p5J15l0j08J18j03J27P4j65J3r6J56p1K8j31l2J89O3k47O8j00K57
4880A03L0j20Q7j67O0o4J95m8k04Q7J56l05K68o3k1J50j40Q5j58j34L2J91O1j06
4904b5L2Q9j01j18k9J88q8RP7R2j40Mj44M7m9L1J86J23l02J81kj04Q2r9l3J46
4930E3j97J83j08j7K08j7q7N1P1k66M0O5N0o4Q6N5r9JN3q2L8N7p9K8K5j54OK45
4958A45j43k8J20l2j9J02k62R8J40q0k8j48J16%k7q2K09j59R5p6K33k94R3K2n0
$$ y = [-59, -29, 42, 56, -43, 108, 72, -74, 39, 92, -42, -12, -73, -24, -39, 111, 38, -89, 69, -31, -31, -33, 54, -128, 158, 60, 0, -38, 190, 32, -24, 136, -84, -89, -6, -95, -243, -77, 94, -6, -52, -87, 69, -9, 2, 84, 54, -56, 219, -87, 54, 31, 113, 136, -52, -71, -16, -8, -114, 28, -16, -81, 92, 39, 86, 107, -52, -49, 100, 87, 98, -108, -17, 155, 20, 15, -31, 126, 87, 142, 53, -22, 93, 63, -45, 73, -30, 97, 171, 6, 19, -77, 79, 8, 36, -95, -127, 62, 125, -122, -54, -154, 103, 133, 13, 100, -67, -7, -71, 124, 76, -128, -41, 115, -190, 78, 15, -6, 144, 4, 89, -69, -203, -171, 20, 81, -25, 7, 96, -5, -123, -152, 36, -52, -43, 34, 126, -14, -10, -154, -107, -156, -125, 61, 184, -118, 63, 61, -43, 39, -60, -93, 53, -144, 39, -69, -86, 122, 105, 18, 69, 140, -126, -86, -21, 29, -35, 51, 106, 7, 8, 61, -21, 17, 74, -5, 23, 48, -106, -100, 145, 2, -26, 94, 62, 43, 145, -117, -19, 121, 41, 13, -135, -19, -19, -46, -128, 81, -78, 17, -59, 174, -120, -27, -5, -55]
4983e5j1P1N1j07M9M6M3j2k1l2Q9j88O1M9l5l9J13M2L7n9j32K17k65o6K73k8j47
5010e6K05n6n8j25J32j63J54p7J44kj08R2k0n4j18k4K24n1j73J69K8J09k75K07
5034A04r8q7R1J1j52J57m5p3Ll9Q0J1l8j65J92J49r3N2J5r1n3J42RLO8j95J36
5061I4k55L36j57J09j75K0L02l34L4M5j07J26M6q3R9l7k8j23j11O4J72k85K58
5084A0m5Q4L2q4k3J8J1j18K49j87L8J42P0j35J40r6R7m9m1q2Mrj2r4N1J45q3k6
5112GqJ03p9P4R5lj40K9j06l2M7j90K24Pk82K74K4j65L18j98J61k33n6J41R2j08
5138dQ1L9l44J46K36k36L0n4Q4q0J44k8pl5L1j04Q3R6n5r5m5O5N4j23J13l3j1
5165e2MJ97j8N5p0p3j7J37j54N0j6J2k14K01o5r2J41N0k2j50J67k44K47Q2j23
$$ y = [-55, -66, 5, 56, -51, -2, 44, 87, 75, 54, 22, 111, -77, -16, 33, -2, -41, 72, 114, 151, 92, -40, 177, -88, -154, 119, 91, -56, 149, 93, 35, -90, 42, -121, 33, -44, 100, 98, -10, 82, 62, 8, -110, -134, 90, 39, -134, 35, 63, 172, -103, 104, 6, -81, 10, 21, -131, 26, -19, -92, -89, -128, -48, -37, -75, -240, -48, 101, 8, 60, 75, -16, -69, 73, 82, 85, 153, -42, 94, -161, 175, 18, 127, -48, -28, 274, -60, -26, 19, -88, 38, 84, 1, 100, 63, 35, -88, -199, -135, 37, -248, 10, -35, 49, 81, -3, -26, -8, 3, -115, 134, -53, -15, 127, 197, 62, 202, 106, 203, 154, 113, 31, 35, 26, 14, -80, -29, 116, 33, 7, -1, 102, 23, 97, 192, 189, 49, 78, -28, -60, -13, -203, 21, 28, -254, 20, 44, -121, 197, -1, 160, -73, -129, 12, 104, -4, 77, 116, -228, -82, 154, -82, -52, -106, -22, -102, 42, 14, 7, -28, 3, -101, -18, 78, 23, -72, -117, -52, 2, -121, -8, -41, -52, -48, 149, 131, 186, 116, 43, 26, 163, 9, 59, 43, 55, -159, 42, -23, -115, 26, 76, 54, -96, 71, -173, 74, 156, 33]
5190C3j71J41p7J32q9R8j81p7J96k18K25k3l8P3K1L2q2Q7q9p1O5QP5R2q1j33p6
5217a28J62J87j86Q1k35P5R2O0j67N8J1l4q7R0l1J8J60k0j80p7O3J58k07K02k
5242F3r9O8J3%j55P6O3L3K6o8m4O0J6K4q1J25j59Q8k4j46N6J01n4JJ82k63J23
5269B5R8j1M1k30O3J2P4p9J9q4O9l5n4O6m4oJ08qm6Q5j47n4J86J7l0k9j74M2K44
5298A18k22P4J13j87K15j10K35k08k30J8K46p7L9n0j33P7J79q6M3%j98J01q4J25
5322bP0P5j33q2J6k7J54O2j99Q9j70J11m7P5j06J67l11K63j75K49p7r8j2J07j95
5347a96%L07j7j86k0J30q6M4R6M2l30K63jj15P5J10j36J29j43l5Ol2J31k57P8
5372a43J53qr4R2J91l88J00J27N4r5J3J01j00q4P4m1J93k82J63r1L1q7j03J75
$$ y = [33, -138, 3, -74, 58, -31, 67, -114, -191, 5, -213, 12, -11, -49, 24, 45, 77, -5, 82, -7, -78, -13, -5, 70, 162, 81, -52, -128, 34, 221, 35, 116, -119, -44, 48, 108, -59, -1, 10, -24, -111, -21, -52, -34, 126, 106, -74, -151, -88, 70, -137, 65, 63, -36, 32, 45, 45, -110, -34, 29, 62, 88, 20, -24, 36, 52, 76, -5, 120, -39, 49, 25, -121, -65, 36, -18, -17, 165, -98, 25, 123, 112, 153, -77, -14, -2, 72, -7, 12, -72, -3, -38, -92, -26, -70, -76, 32, 24, -22, 63, -84, -138, 48, 65, 35, 6, -168, -126, 118, -104, -30, 83, -104, 111, 1, 236, 28, -202, -184, 62, -15, 24, -26, -159, -82, 97, 11, 54, 54, -144, -43, -127, -2, 68, 143, 10, -72, -56, -83, 71, 133, -66, 23, -147, -36, -83, -8, -114, 53, -258, 5, -170, 79, 2, -96, -108, -1, -196, -196, 111, 94, -92, -112, 18, -68, -24, 72, 114, -216, 47, 46, -69, 6, 116, -20, 109, -34, -69, -63, -95, 36, -221, -143, 10, 2, -92, 0, 191, -197, -97, 30, 84, -11, 2, 103, 3, -81, -7, -48, 145, -137, 26, -65, -34, -121, -224, -49]
5396d9Qm4j2R7Q1l2J30l29pK99j13P5q9N6R7r0q0p4N0O5j80J11k0J27j37J61m6
5423E5j08J7qL2P7j69J25j70J12o8J13K13j52R5j04J26j52j08J59o7n2k4J27o6
5447CL7n8J48j79J87K3k00k14L48k50J23J53l46R5K48j11J98k57K2n5J18J17k44
5470i4J09p0J31j15K8J79j10j10M0%o8J77q7J9j37M8K00mj06q9j17K17M5o4p5
5495e3j12K12o7m6Q1R7o7o3l4m3N9R7j68J70k9K3j18r8o8J80p2J84j15L8J77k01
5521c6N8M3j52K5o1O8J22k9p7l4P2pj79L13j15k03K24L0j87K67l1j49Q2M6j91
5546a01J10p6J96k13K25J19j78K18k91j0N0Q8j84J13j58J46j4k2l3J12j80j12
5568a95J3K52RL1j77K5n7RJ18r8P5n8P0o2J29j00P8J3K8j68J89R3k99M4J03l9
$$ y = [-49, -41, -85, -97, 0, 81, 49, 179, -150, -157, 142, 29, 104, 15, 71, 168, 78, -2, -76, -26, 39, -141, -30, -50, 77, -60, 101, 55, -53, -36, -44, -12, 65, -104, 21, -149, -37, -105, 8, 221, 69, 164, 60, 186, 34, -74, 85, 18, -34, -58, 69, 3, 40, -18, 130, -49, 138, 161, -39, -253, 95, -155, -32, 121, -225, -130, 118, 7, 205, -52, -30, -85, 33, 150, -94, 15, -55, 76, -39, -11, 168, 58, -52, -12, -12, -80, 97, 10, 29, -108, -60, 140, 136, 30, -59, -176, 41, 86, 22, -53, -165, 47, -20, -66, 15, 112, 45, -18, -52, -95, -36, 61, -107, 63, 34, 57, -61, -159, -227, -47, -119, 65, -50, -12, 165, -36, 22, 65, -87, -62, -123, -55, 67, 38, -39, -73, -1, -8, -187, 126, 11, -192, 32, 62, -125, 142, 111, -38, 44, 90, -101, 9, -67, 129, -84, 141, 260, 82, 300, 9, -1, 49, 137, -47, 66, -92, 54, 40, 18, -15, 97, -83, -195, -182, 70, 79, 110, -67, -42, -99, -90, 28, -70, 5, -53, 17, -45, 84, -16, 62, 75, 103, -65, 124, 217, -82, -38, 65, 26]
5594B6M3q2p4J23j04O5L2j14O9J47j39m9J44j24J48K0q6j47J35n3j8P1j62j69
5618b98L59j18J10j13J00k1J73k51J76q7J6k4p8K6Q0j99J13P0k9Qp9L0j8L3j31
5643a52J53k2L0K7j24J15kl7J15k70L19j25r4K40j1q2n5J55l04K41m0q3j54K31
5667G1r5j05K00P3j11p2PN8k2Q7j80J62r2J85k84j7J73n2M5M0r2j42J85j5N2N6
5693A15m7p6O3r2J1%O9j94K14j22N1L9Kr7J2n0K29j4j46M1J84j67P7j6j10M5K6
5720D7j77J14N0p8k69J52L19p5k1l8J51k50L7J40k6k14J64j4m1K8J10r1K7j21
5744g6J93j09l6o8J08l7J69J6j68N0P3k14J5M7m7L41l28K44j37N4j78M1K1J94
5768A68k44JK18j81r4J51l5J9P4p9J24k10P5k5Q0k03j4J75J06q9m7j2J29r5J81
$$ y = [26, 69, -13, -87, 36, -68, -3, 29, -85, -16, 131, -8, -57, 87, -37, 111, 131, 45, -102, 33, -20, -38, 33, -129, -298, 61, -57, 53, -60, 40, 19, 192, -59, 117, 30, 46, 22, -56, -30, 50, -149, -36, 34, 5, 13, -66, -36, -54, -21, -152, 1, -21, 9, 36, -88, 27, 25, -12, 103, -167, 152, 27, -67, 173, 162, 80, 25, 180, -124, 117, 77, -6, -160, 71, -24, -129, 71, 144, 33, -39, -32, 26, 4, 91, -89, 73, -19, 166, -118, -135, 38, -14, 31, 71, -21, -163, 22, 7, 59, 115, 68, -8, 55, -37, -26, -26, 43, -151, 63, -59, -8, 31, 33, -64, -52, -102, 127, 113, -33, 8, 192, 25, 102, 86, -24, 21, 47, -130, -16, 34, -44, -313, -161, 158, 83, 62, 24, 175, -75, -38, 102, 76, -138, 26, 12, -29, -1, 109, 18, 45, -76, 117, 8, -28, -96, 12, -25, 144, 160, -8, 42, 115, -99, -84, -37, -84, 257, -71, 173, 36, 90, -88, -47, -26, 168, -76, -75, 143, -38, -132, 19, -16, 3, 77, -2, 122, -88, -13, -38, 42, -161, -175, 0, 106, 17, -30, -42, 87, -8, 173]
5793A73j72j10J89j61J70p1o2P5j02j3J03p9J74r5q4J11j87J76K0j27J11j50K4
5816h7p0P3J15Q0j93J30QJ00j86o6L5K0J01n0r9J83o9LJ05j02k02J22P1J26k69
5841a21O5J50p4p2L8j37J48J0Rk3pJ84j01k11N7L6P9l3p5J27j47K91k76k1J11
5866Go0J05J79k15r9j4K63J0j77J08l07K81j5o2P5r8m2P4K7j00O1n5J26J3j31
5891d6qO5QL5j33N2N1Kq4l3n6J28nl3J27K06l81J29O5k04Q8J99k9k28O4p5K17
5918A21j52j30J92N6l2j9Rj38L2n6R4J19j14j0l5Q8R9k07K56j79M0K1L8j9l3o
5944C5l6MJ03j49q1Q8q4J67l1n4J9n3R7N8J55j98J6N7l0k6L5j81J69m1J56j05
5970I0n6J3j56K32k68K83j34J22j81rJ05K1K1J6j98M6J26r5Q2L9j99Q0L2O0j91
$$ y = [173, 1, -109, 80, -81, 89, 18, -44, 31, -71, -84, 19, -60, 114, 19, -65, 46, -141, 35, 55, -72, 39, -111, -87, -157, -84, 31, 111, -82, 48, 56, 156, -30, -96, -61, -41, 60, 10, -89, 94, 25, 28, 133, 31, -171, -49, 22, 148, -121, -56, 94, 20, -52, -14, -151, -3, 7, 16, -7, -14, 170, 69, -142, -85, -49, 30, -3, -78, 49, -98, 193, -83, -104, 7, -53, 52, 231, 16, -83, -97, 166, 176, -1, 107, -200, 81, 66, 4, 79, -19, -61, 13, 40, -60, 1, -54, 72, 85, -46, -54, 11, 19, 54, -79, -27, 24, 26, -58, -91, -147, -19, -24, -57, 70, 276, -105, 24, 89, -115, -27, 172, 143, -85, -21, -96, 121, -31, -161, 31, 87, 55, 36, 45, -93, -61, -117, -23, 96, -18, -28, -63, 25, 124, -83, 173, -6, 34, 55, 93, 74, 41, 35, -1, 3, 106, -43, -124, -36, -120, 47, 16, -38, -19, -72, 25, 83, 238, 40, 56, 113, 83, 57, 92, -89, 80, 39, 195, 90, 34, 47, -109, 123, -145, 138, 4, 126, -55, -64, 41, 62, 83, 99, -99, -53, 73, -22, 60, 99, -100, -20, 12, 72, -119]
5995a19N5J66O2k5k55n6J62J2n4K24k08R9j19J57j85L2L9n7J33j33R4l9lO0k6
6020A6q0J96j12rk13R8O2j76K03M3o1rl9L8J50q3J16k52J46j9M0k0j39J77q7j18
6046a32n0R3j8j9k0K26m3p3Q9j44PR3LP3j12O4o1m7K27l01N1N9J14p3j6J54k13
6073f9R7j1j85J29J35j74P3pp4J02m2j29J72J2r3L7p8K7L0J07j75J13J05l5n6
6098A1k38J80N5J43l02O6N4q1R7K6l9P5lq5R1o0J18o8o7j05K48n1j7RRJ74j82
6125E8k29L0J54J30k22N6J13j92K08p9j33J75j4q2m3J08p0Jq1J50k12K2R3J68
6149A09n4j35K9P6j10pK94k45j78L08J07l25J44R6j08N7R9k17J21N2n1o2NQ8r5
6174bq0O0R4p0LM4O9l4j37jK16k09o3J95m5j64J34j66K51r0pmo6J76n8J50r9j28
$$ y = [-119, -64, 102, 164, 139, -116, -172, -10, 2, -52, 172, -36, 63, -56, 101, -84, -52, -13, -70, 63, -70, 24, -15, -18, 42, 16, -64, 132, 20, 11, -202, -104, -42, -218, -15, 28, -33, -42, -81, -43, 107, 24, 140, -112, 34, 15, 55, 35, -104, 73, -14, -132, -182, -89, -107, -126, -146, 80, 37, -36, 53, -91, -84, 9, 12, 85, -27, 37, -24, -71, 156, -145, -94, -35, 79, 6, -10, 144, -69, 28, 17, -168, -39, 96, -78, -5, -12, -86, 16, -26, -155, 17, 29, -64, -27, -105, -78, -48, 59, -116, -3, 102, 67, 11, -227, -47, 8, 151, -151, -85, -31, -112, -15, 11, -28, 47, 44, -41, 50, -10, 108, 40, -27, -132, 116, 65, 48, 57, 66, 240, 58, -171, -141, 13, 143, -79, -23, 90, -102, 106, 27, -106, 69, 55, -27, -70, 38, -32, -31, -112, 38, -174, -152, -59, 109, 55, -80, -51, 25, -85, -92, 202, -43, -221, 87, 194, -131, 13, 109, 1, 58, 157, -60, 61, 113, 62, 0, 5, 93, -2, -82, -22, 72, 2, 5, 49, 118, 84, -53, -54, 162, -47, -110, 85, 40, -124, 10, -156, 95, 5, -2, -6, -72, 104, 46, 196, 97, -31]
6202c1j35J14J7J34l2j43N5m6P6JJ6j6o9K48k15K01j89J6J1j95M35l13J75J2j31
6227dKL8J21r2l08R2J41L5j29J7J28j1q0R5M3j30R7m8j50K10J04j10N0j89K7K6
6253b5k8LQ8q1j07L70j49N8r9m9Q5oj02J2J73k61J01kK81j26k13r0J20k4K0M9
6279bn5j3M5J04k40m9K93p7J03r2j14J58lJ9j02Q5j36P4LJ80j97R2r2J9J24j46
6305a9J61k04n1J39j23N7J54o1j3m3j87J77j4L5QJ51l38J99j09J63j60r7K04j51
6329a22J58r9m9R0k8m1K8M8O4j22J91r2M7n9o3Q3k1kPM2k0J04q3oM9j47M4m5N
6358c9j9m9P9R4k1j09J1J69k61J25k7P8M9j59R4k7MQ1j49Q1N0J8n0J5r3O7l2K4
6386Dj1j20Q1J64K7j07M3r6mJ06m2o6O6l8o2r2J73o9J78k23n9J60l3r2P3j32J04
$$ y = [-31, -166, -52, -35, 99, 67, -76, -21, -67, 9, 10, 26, 10, -59, 189, -26, 175, -14, 2, 13, -182, 253, -60, 115, 127, -4, -2, 36, 157, 65, -243, -151, -10, 25, -104, -87, 41, 30, -50, 45, 88, -42, 55, 7, -143, 67, 171, 61, 111, -78, -51, -25, -53, -50, 38, -43, -150, 220, 71, 129, 30, -19, 66, 60, -42, -30, 143, -118, -17, -19, 262, 136, -77, -167, -47, -71, -51, -2, -57, -70, -25, 79, -161, -210, 83, 6, 109, 17, -97, 61, 58, 77, -25, 60, -76, -2, 1, 181, -16, 76, -16, 3, 127, -19, 142, -62, -113, 26, -97, -40, 114, 53, 40, -3, -190, -13, -27, 8, 16, 167, -171, 28, -81, 82, -78, -175, 29, -122, 36, -63, -112, -22, -50, -91, -63, -15, 49, -73, 118, 26, 73, 14, -49, 34, 13, 11, 18, 60, 40, 144, 61, 55, 104, -43, 1, -44, -39, -58, -107, -28, 66, 45, -64, -53, 116, -145, -20, -47, 31, 80, -79, 15, -12, -8, 73, -76, 5, 55, 73, 23, 38, -55, 12, -20, 4, -7, -127, -46, 118, 145, 38, 81, -15, -19, 87, 45, -21, 45, 7, -55, -147, 26, -43, 135, -88, -147, 13, -20, -112, -39, -171, -67]
6413f7J09J94k61n4J9Q7J46k62M5l6P1k8q6J49J20o8k20J19j3J41k03J5J18l4
6437Aq5L3J51k13J02l1k0K06q9j17J40p0J02o6j43J02p7K37l45L17n1j31J43m3
6461E3j45J10J12k85K15L8r2j3oN8l8p0J81k09J18Q8j93L5N7LJ05j42M7k7K3j32
6487a09m3K86k95J79r4p6K29k09K95j51J18l70J67R4n8M6R7k09J53q9J5R3n6j66
6511a53M1R4r3Q3j64J56M8kJ08r5p0J26q2o4o2%J49P6j47p2J71q5M9l0j04J45
6537B3Lro7qK60m06N3K11n7N4p2p6K70j14rrj17M0p2K68j37lJ70j64L2m7M3Mo3
6566AJ42r9J4k7L5nqm7N9j3r5j44Q4P0P9k0k4K10k00m6m3J54m6O5k59J09J06N3
6594A05q3j48J51n8j40K15N3j96N9m1J28J8l5l4j10K03L2q6J07m4n6p7K7O9j41
$$ y = [-67, 42, 236, -25, -79, -60, 27, 173, -89, -44, -80, -9, -37, -123, 26, 146, 78, -142, -23, -36, 105, -98, -83, 35, 1, -84, -51, 100, -113, -11, -42, -62, 144, 55, -62, 78, 8, 110, 44, -99, 3, -74, 163, -182, 135, 84, -47, 96, 53, -92, 18, 130, -155, 60, 98, 6, -7, -13, 45, 7, -63, 118, -91, 27, 115, -78, -43, 14, 17, 122, -20, 27, 0, 23, -109, -152, 134, -161, 18, -76, -152, 77, -132, 163, 12, 130, -240, -73, 21, -37, 9, 106, -103, 50, -39, -24, 69, 13, -153, -112, -18, -111, -28, -192, -36, 12, 10, 118, 23, -47, 79, -3, -67, -129, -129, 20, 96, -51, -123, 48, -37, 12, -18, -122, 23, 26, 17, -50, -58, 202, -204, -151, 60, 3, 57, -15, -91, 179, 65, 56, 47, -70, -30, -102, 166, 29, 26, 196, 32, 64, 17, 60, 64, 1, 143, 44, 58, 31, 66, 61, 53, 6, 65, 52, -43, -187, -103, -33, 46, 26, 2, 212, 12, -34, -77, 77, 31, 96, -163, -54, 52, 105, 22, -126, 25, -33, -173, 42, 95, -101, -42, -83, 45, 63, 28, -6, -116, 87, 119, 33, 140, 96, 40, -37, -10, 59, -82]
6619h2J12m0r7Q4pM6P4j27r6N8j0J78k6k20N8K23l9k38R8LK86k32M4j53O6R8j09
6646d8j17J82o3J75q8j35K2O6J52j97Q2p3K77j65o7j30L42j70j0jl0OQ1j15J28
6671A04l3j09l3K30l40K55o6m8R1J7j62j08K85j10J23j13l8N0rM8N7j14K0l6j45
6696a84J34K27j59P4j75J4K26k89K7J01j14j9J72jj10k5K68j53l3M1j13J97o3
6719D3n7l7J35rj16J75n9j50P7K3n0J02j71J68j75J09M4j21Q3m1n7O0o5R9j64
6744a54J25N2j50J70j79K23l3r3L4Q6pm3j64K71r1l0J1j41K40j72rQ1L1j66K1
6769h7J47J3J15j66m0O8j0J99k38L7J24j17j02Q6J00o1O9j1l03K32P3j76j9J11
6793D4j48L4K66j73k01J88j04K06M3k22K0m9o5O0R1n7M4rO6j98J81lj34J60K3
$$ y = [-82, 30, -10, -107, -23, -30, 16, 90, -37, -133, -75, -85, 93, 67, -153, -95, 128, 89, -149, -51, -48, 238, 6, 50, -103, -37, 61, -48, -165, 17, -46, 129, 41, -94, -72, -6, 146, -51, 31, -42, 235, 70, 3, -127, 215, 45, 35, 34, 4, 10, 91, -24, 104, 71, -38, -71, 159, -181, 74, 8, -40, 51, 68, -94, -202, 83, -27, 96, -17, -55, -5, -14, 34, 91, -23, -3, -39, -184, -50, 177, 18, 92, -83, -69, 157, -132, -105, -4, -118, -137, 35, 34, -76, -101, 167, 14, -19, 22, -91, 106, 43, -14, -51, 84, 75, -41, 134, 75, -75, 2, 25, -25, 77, -94, 74, -101, 8, 52, -69, 14, -27, -84, -24, -89, 10, -154, -29, 23, -127, 43, -136, 87, 54, -39, -5, 81, 74, 31, -133, 138, 47, 17, 28, -113, 127, -45, -54, 27, 58, -108, -87, 60, 73, 188, 22, -18, 50, 40, 239, 1, 38, 162, 45, -57, 29, 129, 68, 137, 126, -177, 55, 128, -48, -67, 44, -104, -70, 196, 23, -178, 10, -94, 112, 155, -67, -47, -96, -161, -101, -10, -67, -23, -32, 34, -164, 17, 14, -120, 40, 63]
6818F3Q2j15rk2j04J26j42M8p7J47j07QQR4k03K66j0P4j22r3M3L17k40O3N6j81
6844c0O5kk7n8Q3Q4k28o5K69r5r3J75M7j78m9J02m8j23J10J94j00j56o4J97J65
6869A75j27k38J25Q1q9J02n0J39q9J8k4q5O3j7J51j74m9Q5j66O4J01N3j11K12
6893A50l8k9o5n4j25N1J50N0JL1k27O6j6J81j1j06j50N7QK02o5r2J07j49J37q3
6919a9LM1j10J33j17j04J70J55j84m6O2kJm7Q5n2P8j31J67j67K92j84k2J4j16
6944a00K35q0o2J8j73L41k52Q4j52R4J67j28Q0l9p4J54j52J34r9Kj64K24j02P1
6968B7j10N5K43k33o1J09j2k4M8o4j3o0J71j16N5J04k03J64q4L4Q9N9p6j14J00
6993H8q5J50j98kpJ31L7k66J53l2l3N2K2J33k22J38q0k5K8L6K8n9J70j86N7o5
$$ y = [63, 145, 30, 21, -1, -105, 21, -121, -73, -150, -3, -110, -102, -94, 0, -203, 63, 53, 127, 5, -88, -45, 272, 32, 95, 151, -30, 35, 33, 6, -52, 31, 115, -113, -178, 91, -4, -97, 78, 125, -53, -102, 0, -48, -171, -61, 133, 33, -123, -187, 10, 175, 48, -190, -65, 16, -73, 29, -21, 118, 29, 47, 23, -62, 1, -16, 135, -39, -88, -3, -169, -105, -4, 49, -62, 150, 112, 83, 18, -36, -161, -110, 40, 90, 91, 122, -105, -39, -55, 126, 115, 9, -141, -84, -76, 126, 61, -31, 76, -73, 64, -19, -16, 25, -85, 48, -69, -173, -3, 152, -32, -78, -16, -18, -17, -64, 21, -31, 47, -84, 83, -84, 208, 24, 2, 16, -100, 135, 55, -7, 11, -162, 179, -73, 11, -141, -47, 120, -8, 72, 33, -41, 113, -39, 95, -4, -2, -166, 58, -44, 27, -83, -28, 215, -18, -79, 30, 18, -6, 42, -22, -35, -95, 76, -40, 15, 119, -84, 80, -4, 30, 119, 178, 102, -12, 88, 3, 153, -45, -47, -54, 77, 114, -152, 1, -31, -64, -12, 10, 143, -79, 59, -21, -46, -18, 18, 46, -13, 157, -29, 28, -37]
7019c7P2j47p7K88j03Q1k4n6l6Oo4K52m6j39J10M9Pn1j42o7J69p1M1j16J05j6
7045a2K4j16N3k9R4L7L0m3j32J27L3L3j11J34j01r2J83r8o3J24L5k18J6J83j27
7070c6k7J98j94R0j73J75j4L0pk83K00K7j42K40r4P5m2j96K68j90M1N2j60J45
7094a7J0k8J92k2k56J66M1k87K04L3j73J10N3j21M1L18j40j53j32K32q0P9k31
7117a61L36j54j39J48j59J88jj69J89r7j34M5J11Q4K2k46J72RP9k49J2P5K75j36
7141A00r5M0j44J00M5j47L21k01Q1j36J23p6O2k8q4J48Pp1j59J62j38J94k57J81
7165B8M2n2J39M7l19O5K99j43k06L9R6j41%l6J46m3r0J60LM1n5j14R1l5J5R6O4
7192A37k07nJ57m2O1k37J85q4P9p4L2j58K97j40l5J2j17J24J13r8j09K1J31k3
$$ y = [-37, 35, -112, -189, 99, -4, 77, 53, -3, -39, -33, -97, 155, 109, -30, 80, 129, 136, 85, -57, -124, 45, -26, 15, -101, 4, -12, 12, -104, -51, -80, 14, 51, 81, 38, -94, 33, 66, 99, -12, 122, 21, -71, 112, 14, -49, 75, 110, -108, -92, 91, -36, -63, 135, -59, 31, -142, 33, 19, 49, 42, -241, -41, -14, -156, 84, -10, 65, 23, -173, 95, -95, -54, -2, -162, -17, -7, -35, 157, 135, -121, 45, 86, -201, 3, 36, -137, -27, 26, -95, -54, 264, 124, -29, -161, 71, -9, 70, -161, 175, 21, -118, 30, -129, 59, 58, -111, 78, -19, -153, -108, 3, 87, 109, -137, 35, 44, 123, -126, -114, -39, 236, 100, 5, 45, -99, 1, 46, -101, 220, 19, 100, -36, 87, 11, 73, 45, -39, 109, 116, 45, -114, 48, -90, 104, -153, 28, 70, 18, 157, 204, -115, -50, 249, 106, -100, -61, 35, -106, -106, -142, 4, -39, -129, 31, 34, 75, 20, -94, -3, -38, -23, 73, 137, -70, -75, 82, 40, 101, -136, 49, -35, 44, -30, 2, -156, 141, 1, -34, -22, -139, -15, 98, 0, -109, -88, 43, 20]
7216B0O8j69J61j62K56j70QK9j63K11M0Qj40J36k02n8J46m0JJ25m9q1k5j29K34
7241E5j96J24J47j14k50Q9L00j65K02k27m9J18k1O3Lj81J74j05%NK7Nk3Jn9J86
7267A09j16J60q5N4n0L0p8q2J85j58j6RO5Q1j33m8L23j32k40J06J42k36J30j12
7291i2J28P6k82K29m6p8%J02R9j99R1j55J50m8jJ4K9n0N8j81Q5J06m0qj1N3r0
7318f1J25j11J44k6M4j13ql9O4R7j76Q0NJ96l00L4j21J78Q0j04mn5o6N2k7R0R7
7345G5j53J85j22n4K29j78O4k7k4O9o1k3j19L05k4j0k51J45j53J02K9j0Ok01Q8
7370a13J75M8k14R4JL5MN1j75K06q7n1L5K8j5J0jo7j76L09j26J06r1jJ70k02j49
7397a96O1Q3k3l4M6O4L9o8K1m9Rj0J16j24M4r2J34j00K24j89J4J79j61K00k98
$$ y = [20, 88, -81, 80, -82, 174, 4, 12, 41, -122, 89, 129, 137, -3, 133, -69, -127, 19, -21, -20, 105, 56, -25, -50, -179, 55, -141, -17, 130, 16, -234, -145, 155, -10, 192, -35, -84, 34, 13, 76, 79, -102, 72, -33, -33, -28, -1, 4, -19, -18, -77, 109, -7, 153, 68, 122, 72, 102, 24, -58, 127, -31, -47, -38, 27, 108, -25, -73, 250, 118, -122, -16, 126, -110, 20, -92, 36, 112, -170, 59, 13, -65, -65, 37, 136, -63, 28, -127, 23, -25, -26, -12, 17, -33, 25, -156, -71, 35, -5, -13, -24, 29, -61, 64, -47, 97, 71, 115, 2, -6, -45, 19, 116, -60, 20, 25, 221, -79, -45, -166, 12, 92, -12, -16, -71, -137, -85, -112, -22, 75, -78, 107, -15, -69, 160, -18, 46, 19, -5, 64, 3, -20, -139, 166, 142, 132, -119, 26, -127, -25, 4, -6, 0, -201, -113, 62, 110, -104, -10, -9, 26, 30, 81, -94, 112, 25, -26, 9, 37, 22, 32, 31, -36, -212, 97, -29, 77, -14, -15, 155, -47, -196, -135, -52, -75, -109, -63, 1, 40, -28, -7, -56, -47, -57, 59, -65, -21, -113, 21, -79, 145, -44, -30, 149, -12, 188, -110]
7422a10R3Kl6qJ52j22j25K15k52J70p2J26Q3q4P5j92L4J08o1J57p7j91R0j0R9
7447F4J9LR6j32M7J7m3l8j6J24j79M9j46j8Q5Q0J36p2j49P8Q8j83O7J47j87O5
7473Bk10K88Nj65J99p6O7j31J37k57K37j29k4J01j00K1L9j48K4J03J10j07QMJ4
7498A2N7p4O3qj26J12Nq5J38j50J73j18n4%J14M8j75J17q9j0J14n0M4R4k36Q8
7524Dj40J09J32j78j9J46l7l8r5M0J17m4j89K10j43J44j10N8j2N9RO8Rj96K0n7
7550a33J44J26r2K4l4J15j82K7O1m0l9J2K1Lj4RJ0J42r5k76K73l01K53k4M9J54
7576A93j89m8N4n3K6K72l13K9J15j83j7q5K01m3j7N3r9J41rKj74J95j29q0L25
7601A67j57j6p2J12j00K27n0r7k5P9L5r3p8Q1j76K49j56R9q0K4o7K2R9k32K49
$$ y = [-110, -17, -15, -51, -59, 93, -29, -154, 61, -191, -21, -93, 33, 116, 32, 107, -85, -51, 57, -4, 153, 76, -115, -25, -35, 64, 83, 86, 182, 50, 97, 114, 71, 33, 17, 141, -38, 11, -135, -153, -68, 12, 148, 76, -73, 5, 93, -90, -23, 124, -63, 2, -208, 80, 85, -80, 119, 43, 110, -21, 116, -141, 96, -33, -57, 44, -56, -35, 4, -144, -120, -17, 93, -14, -6, -2, 12, 69, -5, 58, 50, -76, 36, 41, -44, 94, -56, 117, -1, -55, -55, 59, 107, -68, 49, -40, -50, 64, 14, 58, 152, -84, 4, -136, -27, 105, -73, -92, 54, 17, -21, -116, -76, 41, -3, -192, 18, -125, 19, -91, -33, -45, 14, 23, 91, 100, -96, -76, -133, 11, 137, 45, 69, 35, 150, -32, -5, 56, 16, -23, -11, 10, 13, -1, 8, 18, 160, 65, -211, 62, -239, 14, -10, 39, 193, 4, -44, 10, -43, -17, 255, -58, -29, 86, -97, -114, -199, 2, -41, -58, -5, -104, 37, 28, 30, -144, 51, -78, -158, 167, 10, -6, -78, 34, -66, 161, 111, 14, -11, 68, 103, 10, -68, 13, -163, 86, -70, 29, -51, -27, -94, -72, 27, -205, 44]
7626D4jR8o6jr0J91j98n8O6J05p4k2k3p4r9J70K22l47L32J2l09J36J64j16n6j0
7652dn5P1m3M2J15l1k49K17j48K01k60O0R0q9N2K07l59K14o8Q0j47J16J5j01j
7677g5L6L7R0o8n6O4P4j30K4J74k93J43j26J79l7j03K87k51J21J4k94K92k18K29
7701A13j86p6J24lK8J5J5NL8n4r3J67Q0l96J70j03J21Qk2rN9j68J98Q1j14j5j0
7728b7N9N3p3k2M7j50J20j96J71Qm5N1J51o8r0R0N6j18N8j56J45m9N9O2j34K6
7754B8J7R6k36J13m4q8j8R5R1J40j87Km0P5J6m0Q8j3j47K4O1l5N8k47K73p3jj7
7782iN7p6O4p0J42j30J5j27P7N0K4J28N3l27J80L0j09J1j6K53k22R6J16j51j4
7807D5j03M2J46l5j99K73k38R8j71K67o5j74n4J69l0J26k14N1J34k0k32K20k2
$$ y = [44, 43, 141, 75, 74, -16, 175, -23, -81, -15, 90, 16, -6, -29, -103, -202, -32, 190, -157, 175, 187, -122, 14, 178, 62, 6, -4, -59, 12, -31, 11, 126, 95, -154, 63, -85, 116, -144, -84, 6, -83, -31, 176, -183, 31, -37, 43, -104, 12, 27, -74, -75, -39, -2, 88, 20, -36, 28, 102, -28, -4, 170, -123, 20, -106, 73, 36, -67, 220, -31, 90, 104, -190, 102, -116, 113, -73, -149, -25, -28, 0, 15, 30, 35, 73, 19, -74, 93, 173, -223, -53, -156, -35, -27, -49, -58, 1, -167, 31, 112, -2, -17, -27, 32, 85, 12, -10, 37, -113, 7, -189, -18, -10, -55, -4, 147, 79, -11, 79, 135, 17, 75, -81, 64, 15, 74, 136, 2, 28, 45, 141, -95, 18, -26, -114, -132, -37, 54, 194, 7, 9, -31, 44, 60, 20, 108, 95, -52, -28, 33, -2, 56, -191, 82, 9, 8, -9, 48, -28, 36, -34, 108, -22, -7, -134, -57, -7, 17, 145, 198, -129, 51, 81, -28, -17, -33, 220, -2, 94, 210, 59, 45, -58, -16, 130, 95, -104, 169, -69, 29, -142, 125, 60, -114, -168, 1, -29, 97, -117, -66, 68, 48, -184, 36, 14]
7830A4j1p0J03o6J14j6k16K59j97R3j32J77j69O9J24q6L1O9k3q5K2m5Q2o1m5K
7856f3K0K7K05k66K09l5jj44n1K4o1J24L2N7j27j47M12k96PJ35j5n7Q4n7J25k50
7882a09N1Q9oQ2o7J01k29O7K68k07l4pj18N3j9K71k06J28Qq2l3L8j18M0K40k46
7908d5RJ22j9nk58K8J45O0J24k03M6m3N7j47J88n4r1K1m4k9K93k21j02J21P3Q3
7934A09j08qj37J70N8k42K05jo5j07P1P3n1K46k63L0K26k92J55L3j52M6o6Q5j1
7959DM3q2J11q9J02k15j7J96l4k5K9k1q3J12J38j64J10j75J2Q8Q3k73J03J07j06
7984d6J38j58N9j71Q0J85K9k52J37J14k3j61p3J02J51j45K43j28K3l7M3j08L2
8007C4k5K5O5p6m1J26L5J2j25k05M06k36p9o2J98j33K1J66o4P6q7K20j78j02j25
$$ y = [14, 3, -67, 36, -30, 84, 68, -148, 111, -86, 7, -125, 52, -117, -48, 76, -10, 21, 90, 67, -18, 4, -41, 41, -20, -65, -63, -43, -16, 189, -77, 132, 97, 96, -48, -99, -75, -136, -12, 20, 77, -50, -197, 215, -81, -74, 61, 46, -11, 73, 16, 141, -109, -58, 31, 25, 107, 40, 141, -88, -21, 247, 40, 6, -1, -119, -66, -85, 186, -20, 108, 116, 34, 1, 39, -79, -39, 201, -45, -36, 86, 67, 62, -196, -168, -23, 37, 161, -42, 4, -39, 18, -129, 59, 5, -86, -65, -109, -138, 155, -66, -168, -47, 26, 109, 1, -7, -144, 26, 84, -158, 47, 46, -19, -126, -55, 18, -33, 213, -50, -20, 206, -86, 69, 102, -50, -4, -70, 15, 4, 47, -35, 76, -13, 89, -126, -143, 53, 19, -6, 23, 2, -81, 31, 169, 5, 115, -60, -48, 40, 123, -150, -47, 60, -46, 92, -66, -7, -178, -98, 87, 116, -136, 1, 115, 92, -69, -142, -40, 111, -34, 209, 81, 104, 67, 110, 2, 34, 9, 34, 99, 23, -18, 108, 143, 155, 30, -175, 231, -5, -84, -146, 52, -81, -60, 106, 42, 118, 31, 251, 73, -29, -154]
8032a54L3K2R4n4R4j24K25n4p3l5Q7n2j46L00j07j4L5oL4r2J28p2N9q0m4J06j30
8059b0q8K5J18q2p8RN3J67P6k40J29j24J62k70K45j39k8O6r2J38M5N3j58o6J51
8084E2J8M7j65J16l6q2Q6k00J72j35J08KL02l58J26O4r1m3j55Q4O9J4K5j11M2
8109d9K02O0r9M6j56j8n2Q9O0J1j46Q7P2j66K72l74J24J36O8k33R8l5J63j57K9
8134C2O3j61j7O7k3J20j07Qm4K01j29J54j81l0O8m6L2K1O7j8P0j11j35J85p6M5
8160E5%j66K0Q9L07k03j81K68k92M5K01l65L46l9l14L68j12l3rm8J31k71K76P4
8184A47q6N1j63J00j15J39j16
$$ y = [-154, -121, -99, -5, -59, 35, -89, 136, 82, 9, -26, 61, 9, -137, 163, 56, 42, 77, 71, 105, 13, 141, 69, 128, 48, 4, 110, -20, -108, -83, 35, -47, -125, -116, -63, 104, 180, -60, 69, -55, 107, -163, 82, -57, -85, -19, -111, 27, 72, 125, -33, -99, 52, 70, 117, -48, 68, 32, -50, 36, -164, 8, -127, -19, -17, 285, -73, 53, 117, 26, -17, -172, -88, -19, -5, 20, -91, -49, 153, 213, 114, 160, 4, -14, -66, 23, 83, 94, -52, 35, 107, -59, 213, -161, -37, 99, 167, -66, 32, -3, 160, 3, 32, 95, -66, -83, -16, -39, 81, -26, -18, -62, 139, 10, 164, -17, -47, 21, -25, 7, 28, 95, 77, 147, 36, -99, 86, 10, 55, 55, -111, -91, -2, 305, 102, -79, 189, -103, -58, 143, -222, 124, 85, -229, 139, 27, -6, -15, -63, 68, -203, 73, 147, 61, 112, -51, 49, -66, 73, -43]
8191d3
$$ Imaginary data points
##PAGE= N=2
##DATA TABLE= (X++(I..I)), XYDATA
0@%%%%%%%%%%%%%%Qj6J6j6J6k1K9l2L9m7N3o1P2q3R1j04J20j37J57j79K01k25
36a19K52k82L16l53L92m35M82n32N87o49P18p91Q70r58J057j166J284j417J568
55H24j737J930k154K416k725L098l562M153m931O008p600J0177j5004K6931j05847
70h8023j43191L10592J3993j68968J05008N3113j65097L2159J19141k6741j7612
81B4374j6958q9013N6957R8922o7606k1559N6273r5035k8881J51968r448j19299
93e9305N4331J6846q7742P7471Q7645j08583l4849P0461m1792J994J03881n5223
105B5135r8536P1238L1113n6746N3017K9407r4224j306O7597k2544L498L4203
117D1852o7710k7145Q1297n680m3616M8742j3069p3113N1536N7560n6026p296
$$ y = [0, 0, 0, 0, 0, 0, 0, 0, 0, 0, 0, 0, 0, 0, 0, 8, -8, 8, -8, 8, -13, 16, -16, 23, -24, 29, -32, 40, -43, 48, -56, 64, -73, 84, -95, 106, -119, 133, -149, 167, -186, 206, -229, 253, -279, 308, -341, 377, -414, 456, -502, 555, -611, 673, -744, 824, -913, 1017, -1137, 1279, -1446, 1652, -1910, 2243, -2688, 3320, -4280, 5897, -9107, 17824, -88023, -231214, 79378, 93371, -75597, 29411, 82524, -82573, -50414, 68727, 41986, 24374, 7416, -81597, -24640, 74282, 6676, -14883, 41390, -53645, -82526, 69442, 59994, -59305, -4974, 11872, -75870, 1601, 89246, -19337, -54186, 16275, -25517, -23523, 80358, 25135, -73401, -2163, 28950, -27796, 25221, 54628, -39596, -40902, 26695, 4151, 7649, 41852, -25858, -53003, 28294, 22614, -21002, 27740, 14671, -58442, -6906, 50654, -5372, -12668]
129a2668L4630m4366l918O5014j7842m0525K6727j1276k3517N1773Q596n5760
141b3132J5422K5571l8136J4955M4954m0710l0985L8324K49j6867K8308p292l5490
154b4829K0665J6185k1316J5764J2250l8718J808L7487j5501j4618K3816j3113
166a20k2854K7822J1691k3782N771O335j9058J0571J9120j8117n094J4469j3950
179g196l637K5032p564k1134J4539N367j5396J1596J1105j9314k202J4402p366
192a768j540J2248r474r626J2987J078q808R352O15j3848O703R630r398J52P797
207F100r502k580J2155l044p526P328o16q276P145N318q629K47N182n363K89O718
223D946m219l682M775j411k641N790j198n911M011K408n277K381M277n870j464
$$ y = [-12668, 21962, -22404, -26322, 38692, 20850, -19675, 7052, -4224, -27741, 24032, 32628, -23132, -7710, 17861, -20275, -5320, 39634, -1076, -32061, 6263, 6512, -10355, 17953, 10661, -24829, -4164, 12021, -9295, 6469, 18719, -19999, -18191, 19296, 3795, -10823, 12993, -120, -22974, 4848, 16539, -7243, -1472, 4863, -14195, -3624, 15496, -2621, -7715, 6754, -7196, -10833, 14199, 6635, -14499, 40, 5407, -9989, 1607, 12712, -6602, -8804, 5598, -1768, -3308, 8940, -534, -10160, 2827, 3905, -4903, 4449, 5064, -8784, -2081, 7549, -1849, -1697, 6100, -3402, -5982, 6173, 3129, -4397, 2931, 2315, -5961, 1184, 6502, -2127, -1880, 3302, -2061, -1772, 4946, 727, -2955, 1820, 409, -2232, 3558, 2360, -3551, 460, 2868, -2409, -28, 4249, -1621, -3085]
238c085N980j893l264L903k99l761K494J525k327Q85Q06k524J202K310k928j87
254a163K810k210j814L496m9l088J738J470k623O81J954j625p01J410o73l04J135
271D44p39o22J264o17q55J415l5j486R83P56j153q2J246o74n96J006k4o49L65
290e3M08o64J68L98k12j58L56j85o0M48n39j45P76m14l59P95r7q32N06M15n32
311B0j19N15k6m18J95L2O8o9j47J63J53k80j72M37l9m24K33J63k54k37K36J49
333A79k97K66m2j23j01J12K7j01pJ25J37k98L3Q9P9j53j47L74j55j97J69N0k33
356b14M6J81R0l49J4K53k9o7o3J34k35K3N0J37P1k13L03k48j30J57L79l11k50
379b71L27N2j58J00M8o6k3j89L01o0Qj37R3M7Pj40J41l9K9PK71j91J87j26l21
$$ y = [-3085, 2895, 1002, -2262, 1641, 1342, -2419, 75, 1600, -727, 158, 964, -1560, -358, 1952, -976, -1163, 1647, -563, -2377, 1119, 1070, -2018, -280, 1190, -1433, -752, 1202, -423, -1124, 286, -387, -691, 444, -295, -917, 347, -270, -1125, 290, 255, -1231, -248, 508, -645, -727, 519, -155, -751, 255, 231, -418, -53, 355, -309, -141, 257, 45, -113, 243, 58, -2, 446, -93, -238, 538, 124, -235, 560, 463, -369, 137, 552, 20, -99, 416, 390, -28, 167, 199, 267, 198, 51, 214, 367, 87, -85, 352, 313, -111, 122, 285, 31, -206, 30, 179, -118, 148, 106, -17, -118, -6, 21, -80, -87, 38, 175, -123, -90, -1, 78, -75, -222, 152, -3, -200, -31, 19, -214, -168, 13, 103, -246, -232, 21, -8, -75, -138, -4, -239, -216, -166, -29, 42, -171, 132, -116, -246, -89, 290, -21, -271, 56, 108, -50, 50, 98, 32, 9, -180, 121, 61, 69, -68, 25, 72, 79, -61, 80, 41, 70, 77, 348, 157, 344, 218, -103]
404a03Q6J80j1p0lp2J62M4j31k44N2J04q5K14Pk90M33m2l42M6K53k57j2M1K11
429A71j53j12K14q3r5m4MJ02J88j50r8J21k95J23P4o0k3J57J43l20J00J84q3k57
453a92K86J1l72K54N7k13k0K73r0J27j67O3r4J11m3K0J44j02j46L13j81k03K01
476C7L7j08n1J47r7m2J81p1N4j8j14J94k03o6J51j05J84j95J1L13l06j57K15L0
500B1p0J60j14m6P7n4KM3L9j74J45J57m96L19L3K5j61K89k48rO7R7j69J1J41j37
526e2MJ24j16Q2L9L3j11l2M6J4J26l75J72J40J9k38J4K68k4k04R0q1r5K33K2j50
552e2j90K61J1l9P4o3o1J22j15J31J00l72J88P9j65k33L46K4j00j9jO2K52ml17
577h1J65j01K5PK41k00r6L7K5L4m5L8m5j88L27O5k33Q2o6J20k16J49r4m3j05J92
$$ y = [-103, -17, 163, 152, 82, 79, 7, 169, 213, 82, -162, -110, -6, -91, 123, 130, -160, 273, 231, -111, -65, 188, -69, -81, -40, 171, 18, -94, 120, 37, -58, -102, -98, 4, 192, 42, -56, 65, -230, -107, -33, -93, -116, 41, 184, -136, -36, 148, 65, -192, 94, 105, -267, -13, 44, -169, -189, 84, -6, 121, -46, 17, -77, 34, -9, 11, 155, 53, -93, 220, 39, -164, 37, 74, -34, -85, 62, -35, -77, 104, 33, 87, 69, -45, 149, -54, -120, 31, -74, 110, -85, -74, 239, -67, -224, -9, 21, -49, 111, -3, -49, 28, -26, -24, 19, 58, -116, 29, 186, -310, 9, 42, 67, -94, 195, -53, -62, 5, 102, -67, -56, 85, -52, -48, 76, -40, 42, 81, 114, 3, -29, 17, 31, 157, -218, -46, 94, 113, -125, -111, 157, 133, -71, 19, -62, -157, 76, 98, -52, -242, 19, 30, -9, 65, 2, -59, 63, -52, 79, 179, -193, -5, 74, -91, -324, 22, 46, -54, -73, -74, -12, 240, 236, -81, 84, -17, 8, 15, 256, 56, -40, -3, 22, 56, 11, 49, 4, -184, 143, 208, -25, 57, -9, 111, -105, 44, -50, -93, -198, -6]
603fj21Q8N6Q6J21k18q4J31r5P6q5l3J43j33J68l7p0l8QJ57M3k70J11oJ05j11
629a4oo6K40j19L7p5l2J92j37n0MJ67pk45o9P3J80J37k01j67J63J24j04l0N1m4
655Bj17JJ30L3p2kK6J21l05J29J23j31m2J87Nk55J34M4l0n1j62K92J5Q8k24P3
681A2J79o1k17J18M9k01O2J93L3k78O7J8o7Mn3J03O9L0O0L1p0j2p2M7j3m5K21
708B07k45l3K48j97joM0N8r5p1Q6K23k71M1j82J97P1o0J01Kk16L7j7R9k0K8N9
735H3rLj11J6O6j5j83L06r5N5p7q1J08n8P4n7P9m7Nq5J30j01J07j49j71J26K14
762A33k48Q9j29J51J0J19j5o7j34J86k54J77k8JK20j79J9n1N2o5J04j24N3l6J0
787fJ9J14nj02K0M1j16j24J12L5K0q4L01j83l8P7%q9j52O6J85j10q4M4J2J48j65
$$ y = [-6, -127, -39, 17, 103, 224, 6, -78, 53, -42, 34, -51, -84, 59, -74, 94, 57, -13, -51, -43, 114, 157, -113, -2, -8, 97, -14, -20, -86, 154, 35, 72, -3, -35, 157, 20, -30, -26, 141, 134, -111, -180, -107, 73, 210, 9, -158, 5, 129, 25, -5, 46, 2, -115, -114, 16, 49, -23, -25, 1, 122, -183, -54, 69, -62, -104, 83, 88, -167, -33, 11, -19, -70, -232, 60, 75, 163, -61, 12, 191, 130, -87, 31, 80, -121, -59, 134, 167, -111, -44, -26, -93, -89, -142, -39, 30, 60, 120, 151, 81, 69, -3, 44, 31, -14, 207, -38, -71, 177, -20, -21, -27, 13, 71, -24, -95, -9, 214, -57, -16, -198, -1, 70, 10, 111, 113, -103, -66, -83, 16, -4, 24, 83, 74, 77, -34, -18, 48, 33, -150, 156, 61, 116, 39, -42, 66, 8, 82, 25, 104, 57, 62, -23, 107, 6, 113, -36, -207, -81, 133, -115, -26, -155, -4, 6, 125, 110, 43, -91, 95, -159, 18, -10, -9, 211, 32, 51, 0, 52, -13, 91, -33, 20, -16, -6, 13, 127, 122, 20, 40, 81, -35, -159, -47, -12, 8, -76, 225, 42, 4, 81, 81, -8, -160, -94, 91, -19, -103, -59, -47, 101, -64]
814f4J5J95j29q3j27N6L04k04J5J64j70m6Q4j07J89j87m9O2K17j93q4K06J7j18
838c7lK34k83J18j17L10k42J51l0n9r4L7nj22L08j49m1Q5j92j3n1K35J07n1l9
863E7k67J65j3M3L3J24j70J45j82l2J7n2J15L4n1j8J19n9R3p2j25mJ91J48k6l05
889i2J59r7M9J9J2j67K72k53L9J18kk9O5q4M3K7l3J11k26J78j26m9L1m8O6%J00
916H3Qj20m4K5J14o2j40K52L0j00j2q5J49j22J90j58R0p0QJ07j80M6P7k9m0M6
942F3Qj35R2Q8r3J14j2j35J35j13N5r3j47K96k39O0J3l8L1J40j35J17j21m2j23
967b14J85Q3j35P5J17j03n9R0k2L2N7k12K24K1j93O4K25k63J2M5K5j00M6J01N3
992A54k18J27J38j17Q7j87p5N8P3j2rj81J96k3n7q2J22J1n2J4J54l18O9k3J64
$$ y = [-64, -49, 146, 17, -66, -193, -137, 167, -37, -22, 142, -28, -74, 10, -97, 92, -95, -144, -82, 135, -58, -142, 64, 81, -37, -40, 194, -89, 29, -88, 222, -20, 131, 101, 42, -52, -15, -20, -142, 166, 17, -24, 61, -131, -144, -195, 40, 147, 96, 57, -210, -45, -58, -15, 18, 142, -28, 117, -65, -97, -80, -132, -17, 17, -34, -52, 67, 8, 101, 29, -96, -100, 91, 239, 213, -92, 67, -30, 19, 38, 50, -117, 155, -98, -59, 59, 57, 28, 93, 9, 52, 79, 46, 157, -69, 109, -17, -66, -35, -83, -17, -17, 83, 91, -29, -73, -48, 66, 4, -136, 116, 146, 46, 34, -51, 98, -24, 166, 8, 98, 28, 36, 143, -37, 9, 86, 57, 17, 63, 71, -64, 28, 116, 23, 137, 125, -10, 125, 12, 67, -26, -173, 123, -116, -56, -43, -81, -50, 90, -45, 72, -49, -91, -214, -29, 54, -81, -6, 111, 8, -51, 39, 17, 49, 106, -106, 118, 139, -54, 10, 235, -28, -16, 29, 54, -46, 0, 101, 154, -64, 63, 201, 84, 171, -16, -91, -33, 40, 28, 19, -162, 34, 11, -46, -128, -6, 5, -47, -33, 121, -197, -128, -151, 13]
1017A3j9lm2O9k13J88M5Q5k54J77M7n9m0p5J42l5k2J3j01J31M1J5r4J45l9j18
1043cJ6M2m0M3q7K3n3M1j03l3J86O9l6n9J78l04J26q7J00N2Mj80oK21k6L3j68
1070e1P9J9j75rJ63L7m0o9K62k47J57k57J52J6j85K15j33J13j8l6J17j27qJ22
1094I7Q0o3l7n1qk51J94n9R8L8k4n7rK10p3N5j75J04M1lq3q3l2k9L7j1J80j70
1122h4OL7M9J79j26j3K9N5m8j80M5r1K02j31P4jM9k13R9J85j80j1J03K3k91M02
1148A68k56LL37l19J0J03j54J17K0R5j50J22j83J02J63j13m3L5j0J6q9P9k0n6
1172b3r2J81q2Q6m9J5l9j11K61J0j38J03j86Q8N1r8K10j64%L0q7M1O1j9R6j36
1198IJ41j41j09O7j2K00j24j20N8j3o2L18k54R2j62K25j30J3K5n1R8j38J74o6
$$ y = [13, -6, -9, -51, 18, -195, -7, 38, 123, -131, 46, 93, 34, -6, -81, 61, 26, 4, 17, -84, 47, 88, 103, 9, 154, 115, -3, 13, 55, 15, 58, -29, -6, -59, -18, -121, -154, 32, 101, 65, 6, 184, -120, 6, -81, 19, 71, 75, -105, -111, 110, 84, 117, -51, 28, 47, -128, -137, 26, 63, 23, -46, 216, -31, 126, -131, 21, 37, -148, 67, -66, 47, 29, -7, 110, -17, -25, 97, 177, 114, 77, 26, 18, -233, -39, -98, 0, 38, 14, -43, -52, 158, 85, 140, -35, 69, 110, 107, 24, -59, -91, -120, -83, -94, 86, -84, -78, -41, 8, 187, 61, 48, 77, 132, 84, -96, -51, -142, 60, -71, 3, 2, 51, -162, -63, 122, -58, -69, 34, 57, -234, 168, -88, -85, 252, -67, -57, 46, -108, 9, 29, 124, -26, 96, -87, 15, 178, 65, 22, 57, 47, 63, -26, 53, 33, -23, -115, 66, -16, 70, 21, 36, -3, -114, 147, 157, 19, 122, -64, 24, 75, -23, 187, 23, 23, 53, -34, 7, 68, 49, 145, 9, 150, 9, -100, -33, -45, 155, 31, -89, -31, -44, -106, 212, -42, 50, -112, 113, -17, -4, 21, -30, 68, -70, 104, 38]
1222C8m9J09L7O5p0j47l0m0J2J31j56J92p7j19N3Q5j11k5J46r1Q2L1j2r0n3R3
1248Dj99J4K97j03N0J0n6j23K23j90M2K63q9j5j06Q6o2m5j13K95o7j82J14k51
1272b03K56j65J2P7pP9k4K9l9L4Q4J21k34P1M9Jj93K21l06J80j9K03j13p7jl4
1298Bpl0J37j19j9j11K23n4j35L58k60N8j34L0J90j03N6j48J37j69J54j83J09
1321a8J4lL12l11J01j30N9Mp6o1R5K6J6K8m9p0R3j93R5K24j21J03j43N4M9q5J36
1348A49l62K52L1j02q7P6N1P3j59K9J40m5r9J04K7j56R0K1j51K38k04k0J15J0
1372B1l7J73k02o6J38J42j82J20o4j7n8J4r6K6jK74j86J19J51l96J73k49K38Q8
1396A23r3l3M2J52k86q8R9m1K05P6q7j61PJ40l2J9O0j04j93J82j90J44M2q3J06
$$ y = [38, -11, 98, 135, 200, 130, -17, -47, -87, -75, 56, -100, 92, 15, -104, -51, 34, -77, -102, 44, -47, 35, 66, 54, -36, -89, 4, -195, -181, 116, 13, 63, 73, 17, -106, 117, -73, -31, 232, 143, 128, 22, 108, 46, 1, -112, 183, 116, -66, 48, -203, 53, -112, -100, -23, -30, 49, 25, 54, 15, 49, 133, 254, 20, 91, 140, 141, -52, 169, -137, 43, 24, 227, 114, 37, 36, 2, -5, -35, 102, -17, -36, -147, 76, 22, -113, 245, -15, 43, -91, -61, 129, 26, 82, -66, 71, -98, 56, -127, -18, -4, -7, 305, -6, 95, -35, 24, 28, -48, -109, -14, 12, 28, 56, 7, -63, 30, -163, -68, 156, 35, 138, -5, 49, 98, 13, 149, -213, 39, 70, -32, -119, -43, 8, 81, -78, -49, 91, 46, -53, 51, 78, -78, 12, 33, -118, 120, -84, -104, 11, 21, -16, 157, -45, -111, 27, 169, -13, 107, 43, 26, -32, -18, -114, -88, -89, 185, -1, 118, 269, -127, 46, -203, 35, 123, 30, -3, 39, 191, -95, -183, -84, -125, 80, 156, 69, -92, -85, 55, 23, 42, 102, -2, -195, -13, -203, -59, -17, -100, 6]
1421FP4o5p2J22l7rjm0j44K23o2P3O6Nj95N3Kj34L5p3O4J15oN0j12J33j79J81
1449G3J69l69K05P0j67R2n4J70j27l3p3J01L9n1j49J02J01j81R1mj2m9mJ24O3
1474A27k79N0L8o2J06M7J12j35J70o7j62M7k4O8q6L7n0J88j55K9o1q4J37j08K47
1499A30k22PN7J23m4j15J15l9q8P7k2L0m9O2K28m11J54M3k27n1M39j73q1P8lP5
1525I3q4l0R0k00L00k53J84o1n7O4j70J71M1l4m6j13K4k2O1o4J14J24j95J18k33
1550a78L82l51J67P8j85N6K16j34Oj57J09o4p6m5J19O4O4J06l00J8J70j45J63
1573H3j71J28j13k7j03K07J08m5L0j50J99j85M9j9L3j16P9P6l5N7l8l4K7l8kq1
1599h1J83q9P5q9Q4J0j39K6N0j10M2p8J90l9j25n4N3P3p1RJ00j35K20Q9j41Nk47
$$ y = [6, 80, 15, -57, 65, 28, 19, 18, -22, -166, 57, -5, 68, 134, 139, -56, -3, -1, -135, -100, -173, -109, 6, 0, 50, -62, 71, -108, 73, 242, -127, 78, 148, -19, 73, 19, 189, 62, 29, -44, 57, 96, 45, -104, -2, 99, -82, 9, 5, -7, -56, -60, 64, 127, -152, -102, -64, -126, -20, 27, 139, 4, 174, 107, -55, -8, -32, 36, -50, -13, -63, 125, -30, -1, -62, -146, -9, -117, 130, -92, -85, -28, 95, 51, -64, 51, 12, -76, 1, -21, 9, -40, 22, 250, -161, -7, 36, -191, -242, 197, 24, -57, 21, 18, 93, 9, -21, 69, -131, 169, -84, 100, 39, -18, 46, -124, 47, 88, 54, 8, -105, -81, -103, -42, -106, 8, 132, -63, 55, -178, 204, -147, 20, 98, -87, -31, 185, 51, 57, -100, 9, -55, -131, -176, -57, 7, 71, 177, -123, -105, 65, -80, 83, -88, 40, -73, -100, -203, 4, 112, 67, 97, -53, 146, -39, 10, -9, 24, -92, -13, 63, 28, 85, 47, 13, 40, 2, 0, -81, 102, 13, 88, -1, 83, 93, -46, -20, 30, -80, -38, -116, 74, 35, -90, -144, -91, -18, -89, -80, 20, -115, 105, 194, 53, 58, -189]
1626a89K60j48O1J33j94j4J24O9j37J31k7k09Q7J00j50K12l3q2J34n0j43P0m2
1649c7J9L0o6Q0j05LJ09J6L7Op4L6K3q3j25J43lK11k89J6qn9J90l3l3j54J25R1
1677F6k96L04j72oO3r2O5J15J35j05j61M9l4M1nm7K41j08o6o6N3Q0j43j5R4R1
1703H1j46M2nk4J04o4o6O4J94j65L0O4r4N5K6k74J60M0J15j89J4K0L3K3R5n2k04
1730a23K02J15j19k50J66j02N1l7J25r3P5j01J39q9J16k34L23l01N1K92k55N9
1752A0k8J70j13j27RN3J01k79Q8Q1J3M3m8K06r5j84L2k1J01MK46k60J9M1N9q1
1778D0m9J00k13K03n8N0j73K3M4O0qm0O1n9j0R2M6n7j4o4R6q7j49J47m0J93k24
1805i0O4j12J38NR1j46q3M0M8Q4j76J13R8K1j93L3Q9j16R1m8R9p0J63j70J63m6
$$ y = [-189, 71, -77, -16, 117, -77, -91, 33, 102, -35, 96, 69, -140, -53, 47, -103, 109, 76, -6, 128, 78, -65, 5, -37, -18, 12, -54, 26, -79, -76, 33, 49, 86, 92, 18, 54, 77, -6, -131, 12, 9, 220, -69, -53, -61, -120, 70, 37, 4, -150, -25, 66, -230, 74, -98, -104, -41, -133, -68, 47, 182, 77, -84, -35, -69, -28, -33, -80, 161, 53, -13, -79, -26, 54, -89, -104, -10, 81, -65, -23, -28, -52, 52, -12, -78, -14, 180, 15, 45, 109, 15, 70, 96, -178, -18, 22, 137, -52, -38, -18, 15, 38, 133, 81, -123, 79, 194, 75, -175, -9, -111, -60, -97, 28, -65, 10, -91, 48, -41, 75, -159, 164, -137, -86, 206, -49, 10, -18, 152, 39, -88, -79, -26, 75, -204, -116, -35, -22, 21, -27, 179, 84, -100, -68, -89, 12, 16, 262, 2, 21, 62, 121, 40, -9, 91, -122, 81, 23, 73, -100, -77, -33, 27, 19, -21, 40, -19, -29, 63, 109, 52, 38, -26, 70, -17, -166, -19, -59, 134, -90, -26, -138, 0, 5, 96, -50, -133, -93, -45, 39, -137, -24, 74, 95, -98, -65, 24, -92, -1, -49, 50, -20, 143, -27, 136, 90]
1831I0j60LJ05J5M9j82K33m5l2j12j49R3ML3p6J92r0kJ3N3oj38J36J1K6j02K35
1858A97j93J0j35J73n5K5J52j69P6p1k0k3j70R2P6r3J27J25q5j24J26J02j98O8
1882A3J8l1k39K02nk4J5rK8QmP5j67Q3R7q1o4jmM3m0%J55j7R3n5r2pJ10N0k34
1913h4L74j72r7j7O9N7j18P0o6L9kj34M5K8k9J53p1o2k3J66j62J83r6L6n6J11
1939A42k8p7L7j10MK40k34n1J36j02j78K23K3n1J34n1j3j48J37pK9j54J79J81
1963B61k14l9n7K18k25J34k1oJ01o1j21J07O5m6r5J12k07J19M0J00j71N1L3r7
1987a9p5J42k0K0k5Q4j06j29Q8J69j82m7J99L6k41M0j31J84J94l8j53J4J50j36
2011A8p9O8k8r2Q2J02L7k50J53J38k72L07j15o2l5o2K34n7n9n4L5M0l7j5O4p6
$$ y = [90, -70, -67, 38, 53, 102, -80, 153, 108, 76, -36, -185, -92, -88, -55, -131, 61, -29, -31, -18, 35, 29, -109, 27, 38, 64, -38, 197, 4, 14, -121, 52, -3, 22, 174, 5, 81, 10, -10, -33, -203, -111, -35, -128, -1, 124, 39, -85, 41, 143, -55, 13, 31, 0, -239, -37, -42, -66, -51, -60, -32, -24, -28, 47, -120, -37, 60, -21, -85, -86, -90, -47, -87, -87, 68, 51, 144, 89, -3, -10, 100, 150, -84, 290, 118, 21, 4, 73, 130, 12, 82, 16, 55, 53, -81, -36, -8, -37, 116, 45, -17, -40, 126, -36, 147, 51, 87, 31, 142, 114, 37, 74, -36, -32, 208, -26, -77, 59, -43, -221, 2, 25, -26, 108, 57, 44, -104, 33, 26, 55, -99, 80, 261, 47, 8, -49, 169, -56, 78, 57, 51, 152, 91, -30, 77, 142, 96, 1, 113, -94, 25, 65, 165, -6, 45, 78, -19, -94, 48, 28, 48, 23, 107, 1, -128, -40, 129, -53, -100, 99, 135, -106, -66, -197, -13, 181, 143, -10, 4, 154, 18, -61, 7, -21, -113, -31, 71, 108, -142, 11, 149, -123, 184, 69, 7, -28, -90, 144, 87, 28, -26, 9, 49, 12, -3, 61, -15]
2037a5Q6n1N8K2j87L3K51j69j41J03q2J68M3J7q3m8J01j08N3k38J05J76O4j69
2061a1j79K16J18j0j27j5R8J2k88J53P5j11J8J4q6L31j47J07lj60q5J68m0R7j86
2086d1P3j36J61r6R1j4j1J37n2j66P5n4k8k7J85p8J42o7j68J10m0L09m03J16P1
2111H9j32Q5m8N6M8M8j15J4L1j03j83L69k24j3O8lj00J52j03JJ9l2O4m2J37O3
2137A46o4M8l0k8K8j19J9l6J67l8k93J46l1J28j64M4J59j63J01k8L9P2p6p8O0
2162IP6k0N5m9j81J2J43J31l15J08K0MR1J06l11L16o2q3n0%n9J98j37P2j44m5
2188a15K84m28J35J95j95N8nJ62mn3rm3n3j3O2n6K50k41K2km5J92j27R4j30K82
2214B17l34l4J15m1jN2k9J8ql4p8J39J46j71J45o5L8j69j6N0L5M8K4q4J22j9j23
$$ y = [-15, 71, 20, 78, 100, -87, -54, 197, 28, -113, -10, -92, 76, 119, 136, 53, 5, 106, -2, 51, -187, -82, 94, 158, -11, -190, 26, 144, 134, 7, -8, 90, 102, -186, -33, 42, -69, -51, -37, -123, 208, 61, 168, 165, 5, -80, 88, 48, 145, -41, 32, -104, 57, -39, 52, 38, 27, 164, 112, -54, 21, -33, -61, -88, 97, 19, 161, 94, -74, 36, -4, 305, -98, 18, 89, -43, 42, -6, 50, 98, 146, 31, 45, 76, -27, -210, 159, -65, -78, -10, -13, -113, 39, -64, -63, -44, -76, -12, -54, 83, 146, 82, 130, 100, 72, 100, -19, 0, -36, 131, 93, -200, -54, -85, 43, -121, -77, 82, -81, 20, -8, 31, 103, 27, -51, 9, 85, 65, 120, 71, -110, -98, 45, 176, -139, -31, -11, -7, 84, 190, -121, 195, 133, 50, 0, 0, -59, 139, 2, 74, -70, -115, 169, -259, -124, 71, -124, -66, -71, 91, 87, 34, 25, -18, -71, -84, -22, -78, 172, -69, -47, -49, -94, 98, -29, 65, -65, 217, -117, -151, -36, -77, -78, -26, -55, -37, -45, -79, -157, -18, 128, -43, 102, 37, 75, -94, -110, -60, -25, 23, 47, -37, 85, 66, -57]
2241e7J19j13J13r5J75j36N4r9n1J0J49j2n3J32m7p9L0j97L36k38K55k62J01R
2265D4J1j24O9oj71J03J0k4l0J74Q2n1o7j10n2J45Kj92K13k5J5j36P9j9jJ1K7
2292b3M8q4J23j28N1n0M2O0l0N7q6M6n4p3K51L1k23R0j04l3KP6n2J05pJ06j11
2319C0K6q5J35j51M5j0j2O0n5k4Rj45K41j77J43K2j79K64j31J04j59M4O0K4q2
2344co9l2J79l6l2omJ6j7o5J10Lj8P4j24J68j42J0N2n1J66j12P3j74J02K7o8J13
2372A40k42J23K6r6J61o6q7rR4J7j44J37k1k1J44J8k15J22J37k80L3R0j01j7J14
2397E7O2K5k42J1K91k31M8Pp7q7J52O1p0j5L5n1j9J87q1o0K12k65J2O2QO6k6p4
2425bL7J1j20J53l0P7L0j33O6j40N7j11r5L53l40L55j89P9rJ0m7o6L8M4j15l7
$$ y = [-57, 62, -51, 62, -33, 142, 6, 60, -39, -90, -80, 69, 57, 4, 136, 89, 10, 40, -157, 179, -59, 196, -66, 35, 44, 55, -69, 0, -6, -177, -74, -64, -88, -118, 56, 138, 87, 20, -90, -142, 3, 5, -187, 26, 1, 16, -120, -41, -60, -61, -50, -23, 25, -59, 64, -64, -13, -63, -21, 39, 9, 66, -20, 26, -28, -101, 150, 181, -42, 48, -56, -89, -87, -11, -63, 42, 35, 141, 30, 56, -29, 106, -45, 0, -10, -22, 38, -17, -41, -32, -177, 64, -113, 30, 52, -127, 137, 6, 110, -49, -5, 55, 79, -3, -72, -104, 75, 39, 7, 1, -3, 13, -4, -69, 41, 44, 26, 100, -24, 144, 2, 12, 64, 13, 179, 67, 140, -34, 68, 95, 27, 140, -102, 21, 47, -49, 112, 46, -41, -50, 44, 61, -83, 54, 33, 12, 156, 174, -41, 81, 218, -62, -29, 61, -40, -57, 57, 119, 144, -98, -87, 204, -27, 21, 28, -49, -136, 16, 77, 7, -8, 27, -24, -43, 144, 63, 3, 215, -50, -38, 24, 32, 98, 72, -2, 35, 46, -74, 79, 49, 126, 156, 23, 89, -51, 6, -105, -200, 153, -187, 168, -21, 58, 49, 59, 12, -54, -16, 28, -87, -124]
2451a24J59J7J83k63L9q3J38k72J17N8l0J02j33N5J4p4j12L74j19m6j08J78J14
2474A84q3p5p7n7M4P9N1j30R1j23P9N8o5j21R4j4J78j46J0o9JJ65j02J75o0k10
2500a23J42l6O6%jn6n1J47po2J1j9J7q7P7m7J15n5j40J41j14J12nj84J09N7N5
2527F2n4pRm3N8N7m0k26J94j8rj00K36j60L5L9n1j35J74P2p8j98l4J53q4L28k58
2554g8%p4O4p3J78j15N0O5p4J31o6J18j64kO0n0J83j93Q9j99J05J27k12J56p4
2579d8J38k60J65J65k87J81K1M6j99O6N0j04J80r7L8o8jJ80j55k6J15j93J15n4
2603c2j6m6J4J17R5r0k03J51J02q4Q4j73J66k32L9L06j03k06J37J2j85K3J30N5
2627F1ko7J07m2j40J51j53J45j0Mj20p0P2l9J57j30J70j68J3K00k81L10k11J9
$$ y = [-124, 35, 52, 235, -28, 11, -72, 66, -206, -89, -31, -61, 41, -92, -37, -23, -97, -209, 165, 46, 0, -108, 70, 184, 101, 26, -51, -108, -64, 15, 66, -64, 27, -96, -17, 41, -24, -145, -51, -65, 113, -33, -23, -92, -91, 74, -28, 147, 87, -123, 19, -17, 49, 49, 48, -8, -59, 88, 81, 19, 30, 11, 28, -59, 18, -29, 86, 31, -109, 32, -82, 30, 25, -159, -50, 7, 62, 8, 1, 10, -33, 25, 82, 42, -184, 10, -8, -17, -117, 119, -41, -6, 33, -18, -153, 21, 93, 15, -183, -217, -64, -148, 180, -78, -78, -152, -88, -161, 17, -98, -48, 17, -57, 74, 8, 126, -38, -40, 20, -30, 153, -40, 49, -150, -45, 82, -130, 26, -48, 90, -170, -5, 160, -127, 54, 75, 121, -78, -12, 38, -66, 114, 17, 55, -13, -14, 166, 11, -15, 100, -93, 22, -32, -48, -94, -80, 37, 132, 42, -161, -10, 92, 8, 92, -81, 85, -147, -108, 198, 95, -111, 26, 38, -147, -124, 6, 61, 59, -8, 99, 57, -83, 68, -85, 60, 50, 54, -66, -136, -64, -103, 54, -76, 94, -74, -61, 139, -142, 168, -43, -24]
2651b4L6n4K6j6Jl6nK83k16jj20P9J57k91L19j85P8r8j0M6P3l3p4J88k5k28K73
2678A43k38J74j53J64j10J1J44n4M9k02L9K9K3k8O7j32J18j48J86j85N6O1q8J05
2702C1o7O4nM5r3L5Q3q9l4J23k65K76k7O5r7j9j04J20J27R3k47J67j73j2J9m6
2728c0mO6j67K3K40l2o1k3r7K2L9K6r7K35l44K87l8qj83O3R7p5R9k8J25l39J53
2755e1J35j27J67r9n3m5J97j66r3K7M3K22k51j4J45R7j38R1o6J4j21K29J7j91
2779c1N3j33O8K0R9M8m3M0j96J20j48M5J06j22J08J26r9L2po1m2Lr4O4k8O4M0
2806C2j58J6J30R3L2j61N9N9l3j07L8K2l9J7q5O2r5k3K48j22o3J73j14n9L3L7
2832hM0j73K3J59J07j56PQ8j68R6L8mn1K4Q2j75J26o3J06m9M1k10J50n6L8j35
$$ y = [-24, 12, -42, -16, -32, -31, -67, -72, 211, -5, -6, -126, -47, 110, -181, 138, -47, 31, -67, -77, -31, 42, 9, -65, 123, 98, -130, 143, -95, 79, -74, 90, -20, -9, 135, 81, 130, -72, -33, -4, 19, -9, 58, -74, 44, -104, 82, -103, -47, 14, -74, 31, -36, 28, 23, 68, -25, 10, 93, 4, -30, 93, -172, 104, 77, 142, 45, 26, -78, 42, 169, 262, 15, 182, 9, -3, 16, -30, -34, 32, -135, -112, 128, 96, 35, 12, -85, -63, -24, 2, -95, 140, -204, 83, 45, 37, -146, -83, 14, -61, 38, 10, 135, -204, -51, 84, -43, 124, 25, -28, -73, 124, -42, -135, -108, -65, 157, -94, -108, 37, 134, -4, 87, 21, 35, -86, 143, 160, -31, 22, -111, -43, -23, 76, 124, 81, 121, -75, 45, -103, -58, 48, -74, 34, 160, 61, 93, 86, 25, -17, -14, -108, -44, -72, -8, 32, -126, -110, 20, 113, 145, -16, 43, 102, 69, -38, 0, 22, -17, 0, -85, -23, -118, -141, 107, -15, -78, 95, -19, -78, -45, -8, 32, -141, -118, 41, 148, -8, -1, 87, -81, 15, 53, 49, -2, 22, 104, -71, 55, -8, 98, 49, 90, -120, 30, -26, 12, -123]
2858a23L7L9O4K8P3%l7q2O2j58J39jN5L2k35K13k5j5j75N5M3oN6jm7Q6j2j40J13
2887C8j65K53j75N5P3kM0k20J94j15K2k8J4j6M6RKO9p2jp5N8M2j99K19pR0k85
2915a36L2L2J09k21J76r4J4K1K9N9JQ6p4j26o8Q6K29q2k3J5m2j52K67k54K41j47
2941b2M9n8RQ4k11K16j5n5J3n0J28k32Q3J90j14m6J3j36K4J37m3r3K20j49M4J42
2967A28l52L87l23L78k17O0m2O9j1L7j38p1P5J16pj96K62j39OK1p3M3o7L8J14
2992I8k4r7P0m0n2P8lj42J04j60K23j03J28k45L6K48r1j81J75O7j13J40p6J31
3016A71j58n5J1J43k20J74j25J80q5j0j42pJ90q5N7k0R9n1l9m2j7R1k5k27J99
3041Gj77O0K92j33j69j22L01Kj65Q9o3q2J06J57k08LQ2q6K71k05M9m0P5p1j07
$$ y = [-123, -86, -47, 17, 45, 118, 118, 81, -1, 61, -97, 42, 41, 96, 128, -107, 106, 81, 66, -109, -54, -11, -17, 39, 38, -9, 77, 65, -75, 38, -127, 126, -49, 6, 79, 77, 117, -103, 91, -24, -2, -30, -16, -32, 14, 23, 25, 94, 22, 21, -54, 4, 46, -153, 66, 59, 149, -136, -104, -72, 37, -184, -8, -102, -88, -67, -38, 21, 22, 108, 34, -92, -160, -74, 155, 73, 50, 65, 23, -129, 138, -116, 125, -22, 27, -31, -22, 62, -149, 67, 52, -3, 10, -40, 88, -144, -61, 129, 15, -31, -18, -154, -130, 7, -36, -129, 91, -58, -14, 128, -224, 163, -160, 218, 1, 61, 19, 88, 77, 114, -24, -95, -20, 96, 89, -107, 155, 16, 22, 43, -30, 13, -54, -16, 98, 74, -23, 47, 7, -45, 33, 30, -112, -8, -168, 55, -48, 80, -165, -129, 119, 28, -153, 22, 89, -24, 116, 40, 171, 13, -42, -31, 112, -108, 66, -59, 121, 36, 26, -116, -123, 67, -18, 39, 19, 118, 67, 28, -14, -31, 60, 35, -192, 7, -170, -110, 182, 49, -120, -242, 59, 61, -104, -15, -78, -160, -54, 103, -105, -102, -20, -106, 165, -40, 9, -31, 44, -27, -134]
3066a34K13j07P9r1L7M4n8Q6k6j08mJ51k23P6J08q5J49l6j7K3n6J45j19L9J4j08
3092hj00J15k6J8P1l4O2j85J36k53L50p7j33J81j7j35o4L7n9K05N2j46K5M8MN3
3118A20k0m3L0Q7k3q0k26M7L0J96j28L5r9J69j40m9NJ94r1p5K18j08k5q4J21q9
3144b8RR1j37J79q9J01j6k36L03Q0j49J16k85l6J62P4k04M3J79j27j54J70q7j05
3168a46R4k10J31j3J10J74q4p9m6Q8P8K1l1j80R9R2j24p5J35k8K13l21M7J57p0
3193C2n1J04j79J07j41J90j17O3p6P0k1NK16k75l5K0L5J23oj8J16n7k00J13O4
3218H2l6n8m6Q5r7R1N2Pj45N9j28N3O9J27j52L6n1j0J99j04K9m0r6P3O7j90J70
3245D6n1j7P6o2m8J04j07K4J50q3N7j8L7j02QM4j18p7J8J4j5L06k48M6o3K34l
$$ y = [-134, 79, -28, 51, -40, -3, 41, -17, 69, 43, -65, -69, 82, -141, -65, 43, -42, 107, 71, 54, 77, 21, 166, 47, 86, 100, -8, -108, 7, -19, -1, 70, 36, 98, -87, 49, -204, 146, 69, -64, 117, 100, -35, -99, -62, -121, 84, 136, -10, 15, 63, 67, 120, 100, 57, 87, 174, 151, 71, -155, -108, -78, 118, -10, 25, -74, 95, -45, -94, -89, 105, 14, -61, 157, 49, 24, -60, 61, -28, -19, 72, -65, 114, 25, 126, 110, -126, 177, 257, 108, 224, -61, -97, 65, 139, -65, -22, 157, 30, -124, 46, -41, -146, -52, -262, -131, -144, -34, 140, 56, -23, -69, 19, 97, 118, 87, -93, 6, 98, -26, -101, 34, 6, 219, -102, -55, 102, 32, -19, 85, -94, 13, -128, 62, -55, 8, -68, 2, -19, -14, 202, -73, -108, -88, -53, 70, 64, 46, 162, 105, -95, 18, 82, 46, -12, -58, 27, -70, 21, 73, 80, -65, -6, -134, -81, -12, 115, -37, -1, -52, -62, 137, 33, 62, 22, -74, -1, 66, -124, 46, -5, -22, 54, -8, -56, 48, -59, -35, 115, 32, 89, 71, 108, 6, 14, 58, -60, -137, -119, -105, -120, 186, -62, -16, -79, 155, 152]
3272A52k2n0K4qj1k6Oj29J98k58K28q0L7Qm0MM9j44L2qj15L02k30Q0J9N2o0q9
3300g9P5M5n3K3L6r4k61K47j2J39j04J87j41j66L4MJ64q6J07o1R7p0j60R9p8J41
3326C3l6j30J30N1m3J1j18J16M6m9K4L7n8Nm0Mj78J65Kq8Q5P7O8o4j50J68Qj50
3354g4J38q8p0n8R2J50j06Q5j35O5k40K06J24p1o1L62l57J64j5j70kN1q9J08j40
3379a31J86m8r8J3M8j10N5J60l0r2L80k34j11p3n8P7P0j6J26j21JQ9l6k56J25
3404h4pJ02J59l50K79j31J00k70K98j39K9K2m1R0m8m8KL2n5J58k96K70q8p6J07
3429A5J09j74J02J5p1l1K1q8J50j14J21j4Ok0Kk8r8J36j24K26m35K78J9m1J77
3454A39r8O3M5q8J41j23l2n0m5J38O9k65J13j55R1J81j50k4P3j00J97j67M4J48
$$ y = [152, 130, 80, 104, 96, 85, 59, 65, -64, 134, -124, 104, 24, 61, 69, 29, 33, 82, -62, -30, -38, -153, 149, -81, -1, 18, 70, 10, -79, -4, 41, -12, 11, 47, -47, -308, -61, -73, 66, -38, 149, 8, -158, -124, -120, 44, -42, 65, 4, 101, 31, -129, -30, -108, 33, -3, -133, -3, 48, 5, 16, -102, 14, 60, 11, 35, 72, 14, 19, -21, -17, -195, -30, -28, -116, -31, 46, 114, 50, -100, 68, 76, -74, 64, -24, -94, -152, -60, 90, -16, 69, -66, -1, -241, -35, 89, 18, -43, 319, -38, 126, 111, -59, -61, -10, -99, 9, -131, 55, 7, -91, -78, -30, -140, -85, 75, 45, -47, 333, 99, -12, -85, -143, -66, 4, -12, 114, -7, -6, 83, 47, -209, -84, -91, 11, 170, -180, 99, -32, 68, -202, 96, -43, -14, 8, -33, 57, 9, -39, -37, -5, -60, 98, -198, 72, -16, -92, 15, 124, -50, 52, 67, -4, -35, -14, -102, 48, -66, 55, 41, 47, 27, 29, 1, -97, 39, -85, 141, -294, -16, 3, -38, 139, 41, 104, 149, 61, 202, 79, 47, -3, -48, 90, 159, -106, 7, -148, -57, 124, -26, -50, 23, -77, 120, -47, -3, 145]
3478A45n9l7n8J00o8J08l63K10L8m7J53j5q2K5j24J84K0kRk2p8oj37J55j77K49
3504A21k69K04j22J15K8P4n8k06J39J11L7j80k0L4J04l34K61j80Q8J54j24k0k22
3527b65J37Q1J04k13J61K3j76R2j12L04j79J15Rj54R1J52k24j19K56p4k2m1j8
3550g2j0J71n1K02k53Nj1l1O2J23j38n1M1n1J78M6m1p0k7q9R0K5J6r0J25j70l6
3577a07P5j06J49m6O8j23J58J1l3P2j80kJ09j27l4J46j65J24Nq6LJ10qM1k1N4
3603H7j03p9P2j5q3K68j74P5k2j05J30j23J60k43K80j21m1J16j48k7N8j52K53
3626F3J66j55k51K4L09j80j38O8J15k16J67O5J42r0j54J46Q2k46N4J36j88R9J30
3649A48m8n1k41J37K0J67j24L5K48l22R9j21k1J28k0j18k3Rm7K08n1k2j11M27
$$ y = [145, 86, 49, -9, 91, 23, 131, -232, -22, 16, -31, 122, 107, 25, 50, -74, 110, 130, 128, 137, 115, 37, 31, -106, 49, -128, 121, -148, 56, -66, 49, 77, 151, 93, -113, 26, 137, 174, -6, -26, 8, 112, -222, 39, -141, -53, 101, -23, -43, -265, -128, -47, 57, -156, 5, 28, -148, -56, -168, 136, -43, 72, 81, -73, 18, 170, -54, -173, 83, 9, -13, -54, -72, -82, 89, 38, 240, -13, -8, -19, -50, 12, 135, -3, -54, -13, -64, 114, 160, 119, 49, 22, -67, 23, 48, 64, -26, 99, -71, -107, -32, -138, 11, -35, 33, -90, 68, 79, 46, 118, -62, -64, 45, -82, -116, 30, -135, -11, -6, -92, -89, 21, 13, 54, 33, 87, -16, -95, -23, -38, -121, 147, -27, 48, 26, -79, 51, -72, 88, -155, 125, 4, -37, 79, -69, -96, -38, -190, 63, 229, 74, -177, -153, 156, -24, -162, -94, 21, -195, -28, 37, 179, 89, -65, 81, 163, -83, -29, 107, -81, 18, 148, 100, 49, -192, -55, -35, 132, 8, 43, 291, -31, 68, -53, -74, 54, 34, -84, -107, -98, -145, 63, 12, -10, -121, 306]
3673C06j24j24o4J04k37K5R7l9jJ34j9J23k46n9J42j01o6O9J12K1j35J25K8m4
3697B7j39J76j10P0j46J26j08M7K02n8k7L1k69P2m8J22K09k96j40L63k0j01j6
3720c3J00PL4j72Q3M9J9n4K2l6q8J75k79J78M3K6l3K80l81KK6j4M6nn4J84O6j66
3748B5MJ2L4k6k9p6O3o1M8J32Rj39l5M2Nj49Q2J20p9K7R6j23l9J31J6j80K8N9
3776cj65J96j73J64p5N1l4p5N7L5k9O0j3k6N7j9l5m5J03j11J39r2J3Q0p2p0j4
3803i6K7n3R9J0J37p0Qk5k58K73l4O2j25R8p6J22j47o4J32R1Nl4K8j60M3K2m9
3830c4K46l72J11K6l6j44K28N4j01J89j20J02k0j49M8j67OJ36j01Q3j06K07N4
3853A40k69N9J21J38m14J42K6J2K03j23M5J5j75J98qj38J44j60J03qp6J20R1k79
$$ y = [306, 182, 58, -6, 98, -139, -114, -17, -56, -57, 77, 58, 181, -65, -124, 18, -83, -149, -80, 32, 53, -82, 43, 71, 27, -112, 64, -46, 24, -122, 4, -104, -57, 145, 87, 60, 91, -178, -106, -154, -32, 177, -119, -259, 104, 84, -17, -33, 67, 74, 108, -64, 19, 68, 87, 33, 55, 19, -69, 106, -173, 5, 48, 74, 41, 321, -60, -58, -32, -46, 0, -5, -59, 125, 191, 25, 29, 41, 75, 49, 20, -56, 7, -54, -6, 126, 135, -4, -39, 3, 8, -141, -59, 61, -18, 9, 105, -18, -57, 74, 90, -90, -62, -3, -168, 28, -145, 19, -56, -5, -39, -114, -57, -22, -51, 9, -4, -30, 27, 8, -27, -72, 31, -80, 59, -33, -20, 60, -12, -82, -96, -69, -122, -23, -13, 124, 54, 62, 37, -221, 52, 18, 80, -45, 53, -23, 99, -48, -112, 20, 111, 116, 82, 110, -50, -7, 15, -34, 212, -160, -49, -23, -59, -203, 25, 79, -22, 167, 47, 149, 129, -20, 28, -139, -133, 3, -98, -15, -121, 86, 140, -129, -70, 51, 189, -225, -83, -57, -45, 158, 35, 80, 95, -80, 118, 110, -28, 116, -44, 59, 51, -25, 95, 186, -93]
3877i3O1R4q%L8J00k2r9q0k6J21Pk9j99J85p2q6J07K47k99K3Q8j56J32o3j64L88
3904A95j34k25K74q5K2o8P3j4j13J76m9o9Ll1q3K14J5r5J61j89j24K03K1o4l8
3929b4J15qN3n1j26J64k34m6L01J2r7q4J10n4Q0j23p3J48n0r8j6P2mj53J14J21
3955D9j39J07j52P1K6j9J58o7j04J12J71j45o5P5j07K2j21O4J23p7J31k10j5O5
3979d7P8J31j21n4m4rK11j46j58K27j51K14n2o7J19q7O8Mr5K7k03N2K65k21J59
4004A00n9l5o4k9l4N4J10j15J25l7p0M2j66o4J95R7r0K33k73J08J3L0j12M1K65
4029B65k82J1J44p7J7J2p6J20k17P8J31j31k2J7m0k31M64j89j57J74M2p9Ml1k1
4054g4Q5r0J10r6J93j38lJ31q2J1R6k93O9J18j8o5J22K3k59J81N0r5N4l4J9J19
$$ y = [-93, -32, 62, 54, 54, 92, 192, 170, 71, -9, -35, 86, 93, 64, -135, 50, -22, -108, -1, 246, -53, -30, 58, -98, 34, -29, -193, 195, 61, -164, 110, 25, 47, -21, 52, 38, -75, 101, 52, -17, -14, -45, -128, 86, 101, 6, 167, -22, -146, 57, 78, 14, -24, 91, 83, 136, 85, -41, 123, -111, -157, 144, 156, 59, -25, 85, 31, 111, -12, -85, 63, 13, -85, -101, -29, -33, -186, -72, 49, -90, 17, -135, -64, -38, -57, 101, 34, -70, 42, 213, 68, 3, 78, -29, -7, -128, -64, 59, -18, 113, -97, -112, -47, 31, 162, 41, -13, -57, -66, 145, -1, -159, 68, -83, 131, 79, 12, 131, 44, 112, 116, 21, 48, -155, -103, 162, -59, 100, 41, 6, -58, -87, -121, -67, 43, -72, 53, 16, -54, -12, -178, -242, -47, 50, -40, 193, -80, 28, 41, 71, -41, 0, 265, -17, -6, 138, 61, 78, 90, 14, 134, -83, -5, 126, -5, -27, -10, -50, -281, 183, -6, -163, 11, 53, -26, -22, -53, -74, 11, -79, 31, -65, 128, -10, -13, 118, 36, 47, 143, -150, -81, 37, 19, -46, 76, 99, -160, 21, 71, -24, 30, -4, 15, 134]
4080A34o6m2J38j90P0j40N7J8pmO9J32m10K27Q2q1PL0M4J9p1N1o0j15jJ67K9j60
4108g3M6O1n2k7K08l30rJ13j24J21J40K1j4j96K41J2j79J4J%Kj25J45n1jR7j21
4135h0l1K11p8l8M4j6Q2j29J11j75J00j20J59J39k30R7nj56J52M8o2M7j99J21
4159h%M6R7k11J08j64R0J00p2KQj01Q9J2J8j18JO3M4j79L00k6k24J65q6L8k7j3
4187d8k1j31K55m2l2j3k6RJ67k16J87o2j20J58k48J82n1J25j33P6R9n8j66J57
4211D8k4j0J7q9J74n3k27R4J21j80K77j16n1j40Q5J72k03M5j8J75J7j17J07n3
4235E1L5m3r5q8l7K96j57n2K2k1J35r9O6r0J12l2q2r4L66j88J1N7l9j05J82j20
4261ij0N4j26K71o6Np3M1k28L00j29k6m6%l0J1KJ27r9M4J52j92n3J2R9O1j69K17
$$ y = [134, 68, 26, 164, -26, 44, -96, -39, -21, -28, -32, 37, 169, -241, -14, 68, -13, -6, 24, 68, 87, 16, 67, 7, -108, -109, 58, 87, -73, -27, 34, -18, -45, 163, -167, -176, -63, -187, -66, 74, 95, 81, -115, 126, 138, -41, -27, -26, -26, -24, -149, -4, -55, -56, 41, -80, -111, 100, 22, -16, 28, 12, 94, -35, 76, -99, 1, -119, 40, 179, -51, 46, 41, -115, 37, 85, 23, 70, -129, -8, -8, 38, 135, -76, 32, -132, -42, 58, -14, -12, -4, -105, -16, -4, 14, -104, -103, -40, 4, -175, 125, 99, -125, 40, -46, -8, -35, -48, -69, -200, 55, 13, -19, -32, -58, -49, 118, -98, 89, 27, -93, 65, -183, -1, -52, 73, -60, 16, 115, 57, -109, 48, 24, 14, 31, -58, 116, 63, -164, -70, 51, -129, 148, 32, -19, -159, -74, 98, -105, -60, -78, 97, 114, -3, 104, 51, 86, 43, -52, -140, -177, 119, -38, -90, -68, -89, 46, -53, 13, -77, 35, 3, -79, -173, 193, 5, 16, 73, 34, -71, 111, -9, -19, 35, -91, 180, 114, 119, 46, 87, -141, 159, 30, 4, -42, -42, -72, -61, -59, 68, -31, 13, 165, -27, -80, -68, 31, 92, -77, 140]
4289A40j00K4n0J06j46L4J11k72J31OJ89j77J39k31K00j67J30j63K42N2k38N4
4311A4QJ03j08l0J53k74K75p9k39J72Q2j98J52j19n1K06l1j67M6PK30j43n2n5
4335i8l3J29J90m6K9l09K89q6j31J89r5j41J9J58o2J55j71Q8j07J33j56J43k5
4358F2QQ5k69O4K5J43kk9op9M2n1J40q9J13k10J54j66J12r1kL8J15j49k0J27j1
4385E4J31j99m0K85j30r7j3L5Jl8J00l1Jk08Q9J3J87j08j21J3R9r3N8j26P9P9
4411B0M1j20J30p4p7L5j78K60j02K62j07nL6q7j1j03O8j48n8L33q4M0j47L1l9
4436h4k4J63r3M8j9LQ2M2j34J19j55N1N6j04K26k87K3J22J74j82k4J79r1j87J50
4461E4j79J09J07j42j83J85r5J94j43K31j87O8q7k5J18J83j0m31P6J84J54j09
$$ y = [140, 40, 64, 14, 120, -26, 8, 119, -153, -22, -16, 173, -4, 135, -96, 104, -63, 67, -96, 146, 198, -40, 14, 22, 125, 17, -13, 140, -134, 141, 62, -177, -5, 77, -121, 31, -88, -139, 67, 36, -131, -85, -78, 152, 9, -43, -98, -131, -2, 188, 142, 171, -138, 151, 65, -66, 123, 28, -113, -94, 64, 2, 157, -14, 74, -33, 100, -56, 87, 62, 70, 155, -114, -50, -25, 118, 116, 87, 81, 2, 44, -7, 133, 44, 157, -53, 101, -65, 47, -44, -46, -8, 107, -42, -62, 65, 54, 185, -14, -54, 231, 101, 4, -9, 26, 27, -11, 89, 58, 59, -149, -60, -47, 140, 32, -89, -76, 23, -70, -12, -138, -59, 20, 61, -59, 71, -3, -80, -45, -223, 37, -65, 197, 90, 85, 121, 34, 23, -80, -12, -160, -218, 115, 31, 71, -76, -45, -84, -108, 55, -38, 10, -9, -6, 76, 118, -16, 103, -52, -1, 55, -49, 177, -110, -87, 35, 209, 27, 3, 182, 91, -96, 54, -125, -16, 91, -51, -234, -49, -144, 50, -93, 138, -49, 19, -68, -93, 25, 208, 198, -233, -157, 27, 181, 72]
4483G2j13J55p6K05k31kJ4O6k4q6q6J03m3j0j8J12j35J69L8j13L2Q6o9n4j54K41
4509G9J12j66N2k0J5j00kJ38j9r8L3j00J04q2K6M4j93M9L6P5nj30K36p3r4K33
4535A50j61K8N7p7JN3lr0J81k27j8o6K55j79J77Kk32K08j38R7J55j84k9J40k21
4560a21N3J1m5J96j76o0j9K40R3j66Pj02M5R3k01J52J4j76R3R5p1J68q9L1j82
4585a17K43j16l2L1%M1M4N3k47K58k02k7k0j9J69j27O0k8k6L9j7K2l2R3m9J48
4611A42n3j02O4j15k5o0k9M07k25j62K14k17K38j10q8R5l6m0J11J62k80K18j29
4634b0O0k1p2QK0J2n8J4nM2k1N8J66j97M0k3J9r1N4N7j37K0J1J6O0K6l7k5j1j6
4664e1J80j65K1M4l5l5n1K4O8J5Q2j33N1J69l14N3qn9J1J94j32O9o5J21P1k94
$$ y = [72, -41, 114, 38, 243, 12, 10, 24, 90, 66, -20, -106, -3, -46, -56, -74, 38, -97, 72, 110, -3, 29, 115, 46, -8, -162, 79, 191, 25, 77, 57, 72, -28, -30, 108, 89, -9, 24, -76, 28, -54, -28, 16, -177, -128, -92, -17, -22, -152, 84, 11, -83, 150, -11, 17, 74, -3, -2, 51, 48, -42, 139, -88, -106, -172, 83, -96, 81, 83, -149, 59, -79, 18, 173, -11, -40, 100, -121, -68, -57, -102, 94, -82, -142, -161, 79, 172, 6, 13, -89, -44, 49, -152, 0, 14, -162, -69, 26, -45, 123, 34, 65, -117, 126, 10, -22, 9, 9, 50, 94, 147, -100, 158, -44, -71, -91, -110, 59, -68, -8, -36, -62, -23, -40, -18, -50, 43, -6, 142, 89, -13, 51, -64, -89, -149, -178, 229, 4, -158, 56, -161, 77, -33, -121, -26, -62, -102, 9, 171, -109, 109, -20, 40, 19, -53, -45, -25, -13, -71, -57, -62, -20, -41, 17, 183, -14, 26, 3, 22, -69, -15, 42, -95, -75, -64, -48, 12, 38, 1, -24, -35, -51, 129, -36, -15, 29, -6, -41, -92, -68, 0, 15, 97, -36, 15, 184, -130, -77, -85, -144, -133, 61, -71, -2, -67, 54, 125, -169]
4690a69N8N1L4qk3o7Q6J34j52Rpl7J15rN1J15k42q4K11m8j45J87j6j50R2k8K0
4717b2M5%j49N0J84k6l2q3k0kJ43mK4m2R5j43n2M9l8K23k59O3l4k4k4J03q1mJ21
4746F1n1Lj41K28j55J18k43K3J80o2N6J40k29O9J7N7J0K3J8j22N4N2p6L8j66P1
4772b7J0j4O5J8j55J42m6L3Mo5r5m7K69j22n3j4M4m9J27r9J65M7j56Q4m8J96k48
4799c4j13K60j24J54k52P6j4O3J68j02q5K6k76L54p0rJ2m8l6J56j02l1L9qm9l
4825d8J24m9p2Q8N3r9j6Q3r4K30j02j32k8J37j34O8M9J1r2P6R9N2j66N0m9j39
4851a00J21J23j04k47L33k49J17O2j10J24M3n4k38K20R0o8j04J77j00j6J53j64
4873IP2k99K52K3O1k20K14q9p6Q6r6R1M1j12O3n2r9oJ65j46J30K6K4n0J0J24K9
$$ y = [-169, -111, -60, -26, -34, -57, -124, -38, 96, -56, -47, -54, -91, 24, 15, 66, 181, -61, -145, 66, 18, -127, 60, 44, -106, -14, -42, -22, 23, 23, -126, -76, 108, 82, 50, -33, -53, -55, 88, 84, 108, 66, 161, 18, -34, 15, -23, 200, -59, 4, -30, -54, -78, 25, -56, -60, 61, 10, 13, -128, 100, -55, 63, -180, -157, 23, -39, 17, 157, -72, -3, 14, 71, 81, 104, 122, 0, 54, 106, 30, 68, -98, -27, -17, -31, 34, 52, -103, 39, -7, 26, 30, -35, -130, -177, 92, -30, -83, -97, -53, -102, 25, -74, 91, 138, -18, 66, 18, 214, -34, -147, 113, -11, 143, -109, -33, -47, 16, 184, 82, -3, 23, -253, 101, 31, 22, 34, -14, -50, 106, 4, -27, 12, 4, -45, -48, 76, 27, -45, 43, 96, -3, -19, 64, -30, 200, 98, -34, -62, 75, -59, 9, 58, 69, -23, 53, 152, 204, 38, 88, 39, -100, 21, 144, 40, -207, 126, -123, -6, 56, -54, 70, 113, 59, -179, 41, 131, 63, -41, 136, 36, 20, 173, 9, 81, -218, 34, 57, 118, -102, 112, 23, -53, 33, -63, 28, 69, -43, 20, -32, -131, -137, 28, -118, 12, 38, 62, 12, 22, 146, 175]
4900A75k29M0l8j8K3%J68o2k14P8J13P4r7KR3QJ1p1J0j65M3M3Q4m5l3oR6lr4j0
4930b4J18l0L9k73Q6n5J60J14k6r0M9j47J05L2j95K22j34J26o1P5j33P3m2J83
4954A72k38J30j37K95j27j80P7J97j7j06J10k82J75j31J99n8k49J47j29JK91k24
4976h4K37j75M9k6j79K90k11P9NJ04po7l0Q2n5j06J06p6O1j28K90k41K22q6K03
5001B57j33k49J43q6k3JJ96j03J12j23q4R7j5M2j61R6j1l8R9m2nO2Rj11j1K7K5
5028b9j6j20K0M5K95j14K0K4j59P2l8p8K20r2on5o7o8O2J88j10L5Q0N5q1J23j72
5055C4P0k21J80k4J21p8j00N3l5p3j05J57k8R2P6j50oL4r6J28J01j95L9l0K59
5080B03k10O5j53O2J96k88N3P8K8m3Q%L1k9J4o6J93k29J05K60k08k31K00Q2N2
$$ y = [175, -54, -14, -52, -70, -47, -47, 121, 59, -155, -77, 36, 110, 13, 15, 108, 116, 127, 56, 66, -99, -56, -13, 71, 26, -7, -13, 83, 80, -14, -24, 94, 64, 103, -170, -84, -139, 21, 135, 109, 19, 68, -79, 26, 58, -137, 85, -49, 77, 16, 91, -42, 31, -11, 172, -66, 64, -73, 222, 95, -85, -8, 189, 172, 66, 176, -106, 69, -62, 137, 79, -170, -23, -152, -151, 140, -84, 153, -22, 27, 1, -178, 112, -99, -20, -15, 89, 82, 15, -15, 67, 12, -94, 12, -64, -3, -131, 159, -82, 140, 54, 257, 124, -125, 18, -68, -91, -90, 106, 3, 115, -8, -92, 5, -10, 32, -129, -33, -44, -82, 17, -25, -30, 32, 41, -70, -81, -54, -29, -45, -165, -145, -100, 195, 81, 101, 125, -34, 38, 0, -78, 142, 50, 44, -11, -78, -146, -84, 104, -6, 29, 109, 164, 83, 206, 34, 104, -117, 63, 39, 160, 82, -18, 35, 0, -73, -178, -21, -49, 43, 119, -31, -37, -3, -99, 29, 130, -65, -26, -56, 203, -7, 58, -95, -33, 163, -125, -72, 6, 34, -9, -1, -1, 30, 1, 15, -51, 142, -87, 18, 278, 70, -161, 39, 121, 173]
5105A73j12j27l2J47J39p0k01K56j81M8j32J18J2m8P8n1n4JL4J03j48R6M2q8J17
5130A20k29J41L0n6J16j79P0L0m7p7o0K1o8K77j9k28J58J8N1k5J4k5k8r9n7j0
5156a61J31n1n2n9J40m1K01j33J48j84J23q3O5N3P8p0j51J83j51R9j52J57p9p4
5180f3j2P6J15k12J95q9O1o7MK0J9p6m2J24OO2k30M67k01l4j47K1N5j98J68J22
5206A44k16J09r7O9j38M5J05o5J71kk98L83j25j25J5J06Kq6J62j29o4J27j43j21
5230a71L62j45n4j06K32j00m0o2J38p8p4K56j15k3m5n0J14j12J44j8nM6r7J0r7
5255i0J01K4r4J30j32Q3L9j60m5L2J78l0q4j2J02j13L2J13p0N7j18N4mJ32n4O7
5281A38j80J28j09M8j42J79j75J01L2l2q5J2K16j80j1P4L3k0q8J78j32P6J71k34
$$ y = [173, 61, -66, -98, 49, 188, 118, -83, 173, -8, 40, -92, 26, 38, -10, 68, 17, -37, -36, -2, 101, -47, 49, 91, 3, 120, -109, 32, 62, 6, 122, -57, 13, 43, -4, -81, -141, -120, -188, 89, 70, -158, 0, 18, 69, 44, 58, 33, 5, -94, -151, -161, -30, -81, -133, -192, -52, -93, 108, -25, 123, -61, 62, -21, 44, 97, 175, 105, -46, 137, -14, 85, -67, 90, 11, -63, -75, 1, 116, -96, 99, 10, 71, 4, 8, 28, 47, -29, -71, 53, 59, 121, -109, 358, 157, 123, -24, -3, 52, -146, 22, 144, -72, 37, -60, 9, -129, -84, 21, -44, 127, 125, -173, 210, 85, -40, -25, 81, 83, -3, 159, 30, -34, 93, -50, -171, 191, 46, -8, -114, 118, 18, -22, -84, 54, -24, -98, 158, 43, 20, -25, -75, 39, -73, 71, 53, 48, 94, -3, 7, -90, 11, 35, -59, 71, -61, 22, 61, -99, -144, -112, 66, 36, -48, -60, 42, -71, -39, 74, 4, 61, -57, -3, -7, 125, 71, 138, -42, 86, -23, 25, -117, 62, -113, -12, 20, -12, -97, -85, 131, -49, -60, 14, 47, 27, -61, 117, -15, 61, 232, -2]
5305bMN4J1j08N5P2o2j50J14m6Ol1K4J7O2K03j79j8j11K28k4j24j4k1N4N0j35
5332g1m2J68N8n3j0k02J43J14k24J29p4n2Q1N9J9j42L3q2K13q1J01k3p0Ln9K26
5358A62j66J80l67K85J50k20JR3j24l0R2J4m3jm5q6J42J88k88L0K11k56r7R5J04
5383B4K9k00K85m2q1L0Q8o1j2j27m6J44j37n8M3M0M3NL5j03J47L7j34N6j50K12
5409F7m4j16m1J52N4k32J98p7K3j4O1l7J19j08J94k66O8J72l24J15N0p2MN5p0
5434f9R8K5j78N2O8R2J2j28rL8j21O3N4O1J17j24j36l7L4J23j69N2J09o3JJ19
5460H4k06J80j37n2J92Q4k13J12J64k18J44k11j49L5J62K61j51n6K16k40o0J06
5482D7L0J49l51J5K05j13J19j00J2K48l82R8k0J3J44j56K4J23j54nJ18k29Q1J67
$$ y = [-2, 2, 56, 67, -41, 14, 86, 24, -126, -12, -58, -52, -83, -59, -42, 20, 223, 44, 26, -85, 143, 119, -5, -19, -40, 14, 64, -71, -113, 55, 113, 60, 50, -152, -9, 105, -119, 10, -64, -116, -35, 24, 43, -99, -66, -148, 65, -16, 85, 62, -8, -5, -64, 162, -4, 176, -191, 94, 244, 24, 25, 118, -6, -36, 56, 70, 27, 26, -19, -105, 37, 225, -63, -33, 178, -78, -175, -80, 24, 53, -147, 138, 96, 15, 45, 133, 72, 60, -67, -113, 31, -106, -164, -121, -81, -38, -33, 2, -101, 46, 83, -51, 5, -145, 67, 23, -93, -134, 18, 72, -160, 38, -39, -16, -30, 31, -6, 113, 5, 199, -67, 1, 173, -151, -36, 14, -58, -54, 1, -69, 29, 54, -124, -72, -4, 88, 100, -28, -37, 1, -120, -57, -3, 58, 175, 51, -85, -122, -88, 35, -134, -82, 27, -36, -35, 84, -122, 58, -79, -131, 61, 145, -68, 44, 208, -10, 134, -77, -226, -191, -29, 232, 81, 25, 241, 1, -59, 47, 77, 226, -125, -110, 95, -18, 101, 1, 13, 261, -121, -23, -43, -30, 114, -42, -18, 105, -49, -54, 64, -165, -84, 83]
5506H3j8oQ8l4p2k7r9N6Q2jm8j48K61j28n1j3R5P2Mr7j76K13O5L8j12J36j06k
5534E5l6Oj23r7L36l19J88M1r8J58j31l5J2J27r3J03K4L8k29N2k6J72j92J29k3
5559C9K6j88J14j30N2O8J08Pn7Q7o3Qj68J1oM7R3k65R5Po9J03P1q2J28P8PK6m
5588A43j16j2R6r6l6Jj8O1l3K6p0M8N1J5j15J60k3j3KKnk6r1P7P8j33QP3k28K04
5618C0L4LJ9k61L91p1j23p6J72j05j00R1m3K43l04J02J11j86J12j23l8o2J32N1
5642aj58J27P7k6o1J07q5K7j85K27o4J37j18Q5q8L1r7P1Q0q6O1nK6%O7j75j15
5669a41L85l46R6N4l0O0j15n5J10N2j06l3R1O6j22r5m3P1K0J71k51R6K66j99J80
5694A82k69P1L8j68J76J35k01P7k23J16L40l18Q1n2J12p8q2R4O6j63N7R5q0K4
$$ y = [83, 65, 59, 147, 113, 41, 14, -85, -29, 53, 52, 4, -144, 117, -11, -62, -75, 20, 92, 96, -1, -177, 36, 101, 139, 27, 163, 57, 55, 19, 25, -98, -195, 141, -178, 10, 51, -47, 111, -20, -55, -43, 84, -9, 94, 118, 156, -73, -21, -47, 125, -67, 62, 39, 65, -123, -9, -139, -87, -19, 89, 96, 39, 126, 63, 71, -97, -86, -92, -45, 48, -217, -122, -115, -184, -81, -10, -92, 36, 114, 121, 147, 143, 27, 15, 111, 15, -21, -20, -38, 23, -10, 16, -54, -6, 45, 60, -55, 105, 82, 69, 71, 73, 68, 42, -49, 28, 106, -27, -19, 54, -174, 30, 64, 67, 86, -175, 216, 145, 22, -54, 118, 13, -87, 4, -39, 204, -100, 2, 113, -73, 39, -84, -122, -184, -52, -1, -159, -32, 45, 19, -42, 65, -20, 7, -178, 49, -15, 122, 4, 89, 1, 32, -65, 6, 86, 0, 61, 56, 82, 82, 149, -26, -141, 244, -102, -6, 48, 18, 78, -37, -92, 18, 70, -36, -69, 22, 88, -34, -129, -172, -101, -81, 90, -161, -65, 201, 2, 182, -87, -16, 22, -146, 30, 165, -36, 41, -182, -66, 274, -44, 37, -15, 97, 19, -63, 31, 97, -66, -9, 86, 6, 30]
5718C0j31J85j46K0L3m1M5J18j44m0l6M6j07O1J21j33j0N6nP1j01J22o0NJ06j22
5744e7o0Q1j7K8NJ69k90J51j21N9L3l7R7j39Q9R3k46Q8k8L4J3R4L8q0j22N5R3
5771B3P2k35K35k41R9oN5k5J9K3j3K5q2J01p8LJ4k5K02m7q3J0M5k24K73j05oP4
5799A03k93K69j41m8J04L3n8p8J84j18K02q0l9k20o2K73J82l47o1L01o9J66j92
5822A1n5no2R2J1P9q4J4o7j25K12qj94R3%Q3j00J43j8q9l9l3J83K0m9jjj12K9
5851g2K16j92J19j45K24k06N5p4J14r5J82r2k7R7j79K6J2n6k5K1N4J07k40K90
5875A14j32R1L3j41KM8r4J10L0j78J88j01j43O8J47j87J88O1k4r1m0L5J6Q9J9
5900A08p7N9p4j23J44q6J06j42J57oJn8M5j23j2P5m4j8K7J03o0n5M1j14K21p5
$$ y = [30, -101, 84, -62, -42, -9, -50, -5, 113, -31, -71, -107, -61, -168, -107, 14, -119, -129, -73, -78, -7, -108, 14, -46, -41, 65, -57, -117, -36, -53, -25, -20, 149, -141, 10, -111, -52, -19, -56, 41, -98, -9, 84, -162, -74, -102, -68, -55, 39, 77, -3, -125, -70, 23, 95, -140, 95, -146, -47, -53, 2, -23, -4, 19, 6, 31, -51, 50, -28, -25, -11, -36, 166, 119, 36, 46, 91, -133, 140, 35, 29, 103, -190, 79, -62, -110, -6, 27, -31, -109, 75, -43, 159, 79, 40, -180, -242, 31, 213, -134, -195, 106, 37, 203, 11, -44, -49, -111, -19, -8, 71, -13, 1, -66, -191, 21, 13, -181, -88, -88, -5, -105, 38, 20, -69, -108, -141, 42, 62, 13, 12, 11, -101, -72, 144, -48, 71, -74, 150, -56, -1, -75, 39, -56, 126, 34, 7, 104, -75, -49, -37, -93, -118, -97, -43, 64, -176, 114, -18, 73, 106, -35, -33, 15, -79, 31, 61, -117, 71, -30, -173, -105, 42, -145, 43, 104, 80, -11, -51, -16, 0, 89, 108, 31, 90, 16, -107, 37, -49, 57, -85, 72, 66, 67, 9, 54, -69, -81, -6, -50, -68, -41, 62, 2, -53, -12, -126, 95, 20]
5926B0o4J34r8j22J71p1J09o1N3k5M1m9O3r9r9J10k5m9n6p8J42Q3Mo4M0J8j31
5953a03m8j1K31J6k65K78m1k5J5r4mQ1j10l7J11P4R6k88R8M2o7J56k5j47J0n5
5979a12J47J34l32J9J90M1j97Q7oJ29K1k18K32j46q5J27j4mj5P2j5l3j04j1J79
6004H6k10K02j1j49O6KM0j06K18j27j18J00M6O9j25oJ19k32Q2J30l03J35K62j17
6028E3J19j24k00K59J8j12j00O5Qn5J5p5K54n3r3P0r6J53k74K54j22J00j4L6r1
6053eJ26j11l2K5N6j44k7N5J10P1J1j89J0Q6N6p7J8O8j88N7J60j49M1L3Q9o8j76
6080i4J8J40Lk1j61J32j10jJ21j07k65L22O9j48P9rp8J22J05Mk42J78J8J39l23
6105a09%J1k0K64j25J21p4j7q6OJ17r2M9l9j38Q8M2j4J09j0o2n4J01k42K80j55
$$ y = [20, -44, 90, -8, -130, 41, -30, 79, 18, 71, 46, 87, 38, 101, 2, -97, 13, -12, -61, -117, -195, -53, 30, 34, -30, 10, 28, -103, -151, -162, 69, 85, -180, 98, 57, 32, 47, -47, -51, 30, -80, -117, -6, 68, 164, -124, -26, 16, -51, 105, 80, -67, -57, -112, 35, 169, -163, -144, 46, 87, -110, -23, -29, 100, 121, -97, 135, -11, -96, 31, 17, 13, -2, 70, 55, 22, -82, -93, 86, -124, 78, 67, -82, -16, -14, 26, -80, 138, 11, -107, -7, 39, 108, -17, -23, 96, -136, -54, 76, -227, -92, 170, 53, 172, 48, -152, 107, 125, 13, -87, -22, -14, -69, -54, -129, 125, 72, -21, 49, -47, 106, -168, 86, -36, 64, 50, 86, -5, 121, 10, -22, 3, 59, -85, -112, -57, 53, 124, 135, -54, -44, 42, 98, 21, 39, 107, -81, -24, 136, -13, 28, 61, 150, 82, -94, -76, 64, 67, 46, -115, 17, -93, -94, 27, -80, -345, -23, 46, -102, -23, -32, -110, 12, 117, 121, -121, 57, 75, 214, -109, -109, -98, -118, 146, 21, 142, 68, 51, -35, -29, 88, -4, 45, 6, -132, -44, -2, -16, 93, 83, 21, -33, 68, -174, 106, -49]
6131d9J11j77K24r7j7k5K19j91J2p0O8l3ok3k8J20J8P4j34J15j36L4j9j9J99q1
6157H9p7N7J48k27L8j07J05p6J10k7o7J0o3K0OM0kQ9M3j24Q3o7q7j5o6J21O6j05
6185h5R6q0J24j13Mn2K07j80J67m8k5N7M7J4m1k5L7j06P2N5j59k3K21p2j80K2
6211f6J65j21L8j8J7q2J08L3j94J15K7M2j25J57L6j92j35L19m6k9m4j7M6K4Nk49
6237a86L98k40P6K4j20J36q3K3m0J07k0j20j4L2P7o3L2j09kK87m43J22J78r0K8
6262a0j14J46nL8j33K65j21j13J18Oj13P8k14J32O5r6L4J43j45j0J7j12K91l20
6286a73K38j7k1K3R3n0l9l8m5Rp7J00M5K1K7j07o0KP4K46k05j94J69L7Rq0N4j37
6314i6L7K11j73LQ0j42J98o2O9k02P8Q3j69J27p2J16p0j33J09k2R6j78j45L05
$$ y = [-49, 62, -115, 109, 12, -5, -30, 189, -2, 10, -60, 8, -25, -31, -54, -82, 38, 56, 130, -4, 111, -25, 9, -10, -29, 170, 89, 12, 69, 217, -10, 28, -79, 26, -50, 60, 33, -34, -24, -87, -67, -61, -21, -23, 66, 109, -15, 68, 1, -86, -101, -167, -46, 20, -85, 11, -69, 55, -58, -54, -106, 101, -79, 88, 40, 15, 72, 119, 133, 92, 67, 104, -2, 70, 125, -34, -57, 164, 92, -88, -66, 99, -22, 16, -2, 15, -67, 41, 74, -120, -5, 22, 64, -61, 96, 132, -60, -195, 124, 78, 49, 5, -12, 34, 58, 63, -186, 212, -28, 48, 72, -48, 88, 5, 28, -12, 95, 75, -45, -59, -27, 50, -13, 19, -90, -92, 195, -248, -126, 52, -38, -10, -124, 22, 17, 55, -78, 187, 66, -47, 71, 77, -36, 42, -172, -40, 25, -71, -37, 106, -39, -49, -32, -144, 147, -173, 65, 48, 27, 50, 143, 93, 54, 16, -29, -20, -97, 3, 48, 69, 96, -11, -71, -69, 5, 251, 46, -148, 21, 58, 67, -13, 41, -96, -59, 152, -21, -18, 62, -80, 118, 56, 125, -77, 1, 84, -85, 42, -30, 86, 16, -117, -8, -30, 66, -112, -257, 48]
6338D8k22J79JN8k71L37j60j16J64J67j78Qj32J70j12O1J03r8J31j41n0K17j82
6361a8L9N4P6k24L2KK12j96J0J29k04N1P8k51J73K41l19J29K10l07K38p7J14l75
6385a83L14j83p3O1j59J43J85L5j51jJ65j07q9P6j09J88k84O9J11p4J53j17n3
6408h3R4N2pk17K23J26k38P8M4K9k41J14J12m6r0lJ43j31M3j1m5N6j97J75l2j05
6434a57J90q7j2J47j04Q7j61J06J1j45J53j69K20m1R7j52m0K3JJ42q1J58q6j74
6458g4J89k34R5k0l5R5M7j59O0l8J34r4J05j9J80j44j02Q3p0J30k22oJ22O0k28
6483a45K84k24J00m0j51L29m1mK4K2k44J71q6%qqj55J94j68JL00j35q2R3j63J33
6509cPj14O8j17J01L2J0Q7k6p3R8q7l0Q6M4r9J27R9j78K5K2j24R3l9R2j70N0L3
$$ y = [48, -174, 5, 6, 64, -207, 130, -30, -146, 18, 185, 7, 15, -117, 53, -59, 2, 105, 7, 138, -3, -53, 164, -18, 21, 75, 151, -73, -41, -39, 173, -23, -13, 116, -88, -37, 41, -210, -37, 204, -115, 14, 224, -83, 155, 78, 192, -183, 131, -52, -125, -64, -223, -80, 105, 140, -11, -12, 153, 46, -43, 33, -76, 112, -172, -103, 8, -66, 87, -30, -83, 11, 63, 56, -161, 62, 188, -50, 28, 72, 101, -140, -26, 86, 40, -50, -53, 90, -41, 2, -9, -54, 2, -195, -20, -52, -157, 33, -54, -66, 81, -23, 64, -97, 9, 20, -125, 28, -141, 79, 38, 135, -17, -57, -34, -33, 109, 28, 186, 100, -74, 115, -119, -24, -44, -79, 16, 63, -96, -36, -74, 60, -34, 71, 52, 232, 88, -14, 69, -1, 129, -93, -99, 23, 83, -145, 139, -85, 15, -25, -176, 153, 112, 108, 132, 154, -90, 81, -5, -5, -13, -21, -176, 18, -150, -149, 151, 16, -66, 27, -136, -3, 4, -110, -42, -159, -58, -26, -16, 71, 45, -28, 70, -17, -47, 39, 83, -16, 111, 210, 32, 57, 79, -45, 48, 9, 101, -69, -19, 14]
6537A4m0k0p0K5K12k97M3J16M6J30j74K3P7j05j16K09o4P7j04L2O4O1qJ2j21K7
6563D9J35k60J05N6j59r6P1J46k33J31K06M0m9j62N0k26K25q1L1K15k40K14K0
6586A88j75P2j48J70l47K46Q0k2l8j90J60j8K4P6k03K15r8%m3Q9q3K4k10L56J08
6611B33k85j97K18O5Q8j49K11j85j5K3M5L6l7K4j96J14R3l6n6N8M9J36k43M2n5
6636a9q3JJ99j24k2p5P3qJ74j41M5k02O4Q0J09k48J88rj12K57k86J06j41K06j3
6661A9J13j52pj4k6n0J05q6J10m1p5J24O2k7oo9K45j78r7p7J60lL6Kj30J03mo9
6689c2Q5J39j45l4N5j81Q0J54Nkk2Jj14J61m8j19J98l17J90n5q9K3N2R8k00J72
6715E5nj36j35J57K38j92M2K2J2j29J40N9j59J61P0j57P5j21O9j66K78l22M5J84
$$ y = [14, -26, -46, -116, -91, 121, -176, -133, -17, 29, 159, -15, 8, 85, -20, -136, 73, 9, 86, -18, 14, 78, 139, 131, 143, 22, 49, 184, -76, 29, 85, -74, -170, -99, 47, -186, -55, 151, 191, 142, -20, 30, -196, 29, -52, -21, 194, -46, 168, 188, 13, 85, -63, 107, -240, 6, 86, 64, 26, -164, -4, -22, 2, 78, -125, 90, -8, -8, -51, 38, -45, -21, -231, 125, 233, -52, -249, -31, 34, 122, -27, 184, -1, -16, 7, 52, 88, 51, 75, -121, -7, 86, 50, -6, 52, 101, 237, -6, 36, -19, -102, -101, 98, -26, -48, -123, -50, -58, 116, -25, 20, -182, -118, -38, 71, -177, 11, 2, -110, 147, -139, -33, -174, 32, 19, 132, -20, -27, -41, -67, -117, -12, -98, 12, -29, -104, 20, 82, 55, 49, -20, 225, 47, -50, -127, 33, 30, 66, 68, -62, 41, 37, -32, 53, 192, 47, 13, 68, -113, -33, 121, 126, 124, 102, 103, -11, 150, 102, -17, 181, -136, 54, -1, -90, -67, -15, 83, -117, 55, 50, -86, -221, -64, 174, -18, 24, 46, 58, -71, 69, 128, -31, 130, 200, 43, 118, -3, 66, -100, 178, -144, -99, 85]
6739H5k8R6j55M4n7J54j63N3m0J2J52j7l58J57J43p2j4r0L1J98k69J56J10qk06
6764h6k6J85j98j5L5L03r9k65K31K1j20M2J49j11j72J56K6j5l9n4j28L8K70L1
6788A59j58J01k88K10k6or3J32j1l5lN7OJ9R9j72j02R7q3J19j19Q4P4n1M0q5J24
6815H9J13k59M8j40K70p8o7k2o7K46r2n4J11o6P9N8j64j0n6m4k8J34Po5O8j8N8
6842E1r3M7l3p0O4j3K14k01jP8j4q2J27o7l2m2k9N3O7j83P7J17j04L1J11Q1l67
6869b13K85l2oq7J89j84L3K1K2k6L1L52k03k02R7q1KJ10l38J79J48Lj77L6J08
6894F7j13N4R1k36J81o4j75J85J06k4j3k08K05o8L8k8k11L58j12J27p2j97P8O2
6918C1j36J55n3pJ44j06P3l10K74q4J01j48J12L1Pr0J60j08j2K1r6J9KKN0Q3k91
$$ y = [85, 57, 153, -2, 42, -15, 139, -24, 29, -11, 1, 153, 136, -222, -65, 78, 6, -8, -98, -67, 131, -138, 18, 128, 120, -86, -112, 73, -125, -140, -105, 198, 99, -166, 65, 86, -34, 8, 157, 46, -126, 30, 56, 41, 2, -52, -180, -142, 128, 159, 1, 102, -186, 24, -2, -8, -101, 31, 20, -15, -18, 39, 45, 64, 163, -9, -111, -14, -97, 22, -97, -13, 61, 10, 50, -35, 89, 202, -57, -9, -149, 121, 43, -24, -46, -113, 133, 41, -13, 98, 32, 111, 169, 5, -5, -61, -105, -133, 1, 8, -57, 11, -7, 51, -42, 5, -28, -98, -34, -47, 167, -34, -35, 43, 29, -53, 74, 7, -25, -67, -96, -43, 24, -159, -82, 35, -69, -38, 73, 154, -213, 72, 40, 34, -53, 136, -48, -15, 6, 28, 2, 33, 385, 182, -20, 77, -4, -2, 108, -230, -51, 97, 100, -77, -41, 67, -46, 8, 99, -137, 44, -20, -195, -10, 96, 72, 59, -149, 56, -12, 26, -2, -213, 145, 33, 160, 88, -109, -31, 31, -105, 50, -3, -10, 134, 28, 101, -209, 65, -19, 82, -66, 46, 77, 84, -6, 154, 46, 34, 55, -41, -22, -20, -18, 32, 115, -176]
6945a76k1K00oJ84k26N2P0j15m8K0K20j40l9K6J89j32K4j97L22ok78O8N9J8n1
6970A7p8J3K39r4k79K41j77rL9P0J8j47N2K37j44K11k22J15k28J55l9k4qo2J97
6995I3o6O8j63L6J56j15o9PK49r3O6j17J67j62l9J6ml9J10j04j37R2M5N7k57K80
$$ y = [-176, -197, 3, -3, 181, -45, 7, 77, -38, -86, -66, 154, 14, -25, 1, 190, 58, 82, -115, 207, 201, -77, -9, 50, 68, 17, -61, -48, 191, 97, -182, 59, -118, -127, -88, -18, 0, -147, -95, 142, -2, 209, -13, 102, -126, 29, -10, -34, -42, -104, 93, 27, 95, -68, -32, 124, 9, -60, -53, 196, 103, 169, 52, 219, 57, 18, 34, 30, -9, 101, -3, -140, -48, -3, 54, -203, 77]
$$ [...]
8191A35
##END NTUPLES=NMR FID
##END=
