##TITLE=1H_LR-618-R4-C1
 CDCl3, 8 sc, 
 7.07.2021
##JCAMPDX= 6.0         $$ Bruker NMR JCAMP-DX V2.0
##DATA TYPE= NMR FID
##DATA CLASS= NTUPLES
##ORIGIN= UXNMR, Bruker Analytische Messtechnik GmbH
##OWNER= root
$$ XWIN-NMR		Version 3.5
$$ Wed Jul  7 12:28:37 2021 Russian Standard Time (UT+4h)  she@DPX200
##.OBSERVE FREQUENCY= 200.131506
##.OBSERVE NUCLEUS= ^1H
##.DELAY= (6, 6)
##.ACQUISITION MODE= SIMULTANEOUS
##.ACQUISITION SCHEME= undefined
##.AVERAGES= 8
##.DIGITISER RES= 18
##SPECTROMETER/DATA SYSTEM= spect
##.PULSE SEQUENCE= zg30
##.SOLVENT NAME= DMSO
##.SHIFT REFERENCE= (INTERNAL, DMSO, 0, 15.7039)
##AUDIT TRAIL= $$ (NUMBER, WHEN, WHO, WHERE, WHAT)
$$ ##TITLE= Audit trail, XWIN-NMR		Version 3.5
$$ ##JCAMPDX= 5.01
$$ ##ORIGIN= Bruker BioSpin GmbH
$$ ##OWNER= she
$$ F:/spectra/data/she/nmr/H-F/1/audita.txt
$$ ##AUDIT TRAIL=  $$ (NUMBER, WHEN, WHO, WHERE, WHAT)
(   1,<2021-07-07 12:26:58.98 +0400>,<she>,<DPX200>,
      <created by zg, POWCHK disabled, PULCHK disabled
       configuration hash MD5:
       00 E9 B6 7A A2 85 ED C7 34 08 36 98 17 FE 4E 26
       data hash MD5: 16K
       45 3B 70 47 9D 61 4A AF 25 5F A0 9C DC 98 74 95>)
$$ ##END=
$$ 
$$ hash MD5
$$ 83 C8 52 42 DE 12 A8 CC A6 73 2B 11 E0 47 41 2C
##$RELAX= 
##$RELAX= 
##$RELAX= 
##$RELAX= 
##$RELAX= 
##$RELAX= 
$$ Bruker specific parameters
$$ --------------------------
##$DU= <F:/spectra>
##$EXPNO= 1
##$NAME= <H-F>
##$PROCNO= 1
##$TYPE= <nmr>
##$USER= <she>
##$AMP= (0..31)
100 100 100 100 100 100 100 100 100 100 100 100 100 100 100 100 100 100 
100 100 100 100 100 100 100 100 100 100 100 100 100 100 
##$AQSEQ= 0
##$AQ_mod= 1
##$AUNM= <au_zg>
##$AUTOPOS= <>
##$BF1= 200.13
##$BF2= 200.13
##$BF3= 200.13
##$BF4= 200.13
##$BF5= 200.13
##$BF6= 200.13
##$BF7= 200.13
##$BF8= 200.13
##$BYTORDA= 1
##$CFDGTYP= 0
##$CFRGTYP= 5
##$CHEMSTR= <none>
##$CNST= (0..31)
1 1 145 1 1 1 1 1 1 1 1 1 1 1 1 1 1 1 1 1 1 1 1 1 1 1 1 1 1 1 1 1 
##$CPDPRG= <>
##$CPDPRG1= <>
##$CPDPRG2= <>
##$CPDPRG3= <>
##$CPDPRG4= <mlev>
##$CPDPRG5= <mlev>
##$CPDPRG6= <mlev>
##$CPDPRG7= <mlev>
##$CPDPRG8= <mlev>
##$CPDPRGB= <>
##$CPDPRGT= <>
##$D= (0..31)
0 1.2 0 0 0 0 0 0 0 0.06 0 0.03 0 0 0 0 0.0002 0 0 0 0 0 0 0 0 0 0 0 0 
0 0 0 
##$DATE= 1625646418
##$DBL= (0..7)
120 120 120 120 120 120 120 120 
##$DBP= (0..7)
150 150 150 150 150 150 150 150 
##$DBP07= 0
##$DBPNAM0= <>
##$DBPNAM1= <>
##$DBPNAM2= <>
##$DBPNAM3= <>
##$DBPNAM4= <>
##$DBPNAM5= <>
##$DBPNAM6= <>
##$DBPNAM7= <>
##$DBPOAL= (0..7)
0.5 0.5 0.5 0.5 0.5 0.5 0.5 0.5 
##$DBPOFFS= (0..7)
0 0 0 0 0 0 0 0 
##$DE= 6
##$DECBNUC= <off>
##$DECIM= 32
##$DECNUC= <off>
##$DECSTAT= 4
##$DIGMOD= 1
##$DIGTYP= 9
##$DL= (0..7)
0 120 120 120 120 120 120 120 
##$DP= (0..7)
150 150 150 150 150 150 150 150 
##$DP07= 0
##$DPNAME0= <>
##$DPNAME1= <>
##$DPNAME2= <>
##$DPNAME3= <>
##$DPNAME4= <>
##$DPNAME5= <>
##$DPNAME6= <>
##$DPNAME7= <>
##$DPOAL= (0..7)
0.5 0.5 0.5 0.5 0.5 0.5 0.5 0.5 
##$DPOFFS= (0..7)
0 0 0 0 0 0 0 0 
##$DQDMODE= 0
##$DR= 18
##$DS= 0
##$DSLIST= <SSSSSSSSSSSSSSS>
$$ [...]
##$SUBNAM2= <"">
##$SUBNAM3= <"">
##$SUBNAM4= <"">
##$SUBNAM5= <"">
##$SUBNAM6= <"">
##$SUBNAM7= <"">
##$SUBNAM8= <"">
##$SUBNAM9= <"">
##$SW= 20.0188882624521
##$SWIBOX= (0..15)
0 0 2 0 0 0 0 0 0 0 0 0 0 0 0 0 
##$SW_h= 4006.41025641026
##$TD= 16384
##$TD0= 1
##$TE= 0
##$TE2= 300
##$TE3= 300
##$TEG= 300
##$TL= (0..7)
0 120 120 120 120 120 120 120 
##$TP= (0..7)
150 150 150 150 150 150 150 150 
##$TP07= 0
##$TPNAME0= <>
##$TPNAME1= <>
##$TPNAME2= <>
##$TPNAME3= <>
##$TPNAME4= <>
##$TPNAME5= <>
##$TPNAME6= <>
##$TPNAME7= <>
##$TPOAL= (0..7)
0.5 0.5 0.5 0.5 0.5 0.5 0.5 0.5 
##$TPOFFS= (0..7)
0 0 0 0 0 0 0 0 
##$TUNHIN= 0
##$TUNHOUT= 0
##$TUNXOUT= 0
##$USERA1= <user>
##$USERA2= <user>
##$USERA3= <user>
##$USERA4= <user>
##$USERA5= <user>
##$V9= 5
##$VALIST= <valist>
##$VCLIST= <CCCCCCCCCCCCCCC>
##$VD= 0
##$VDLIST= <DDDDDDDDDDDDDDD>
##$VPLIST= <PPPPPPPPPPPPPPP>
##$VTLIST= <TTTTTTTTTTTTTTT>
##$WBST= 1024
##$WBSW= 4
##$XGAIN= (0..3)
0 0 0 0 
##$XL= 0
##$YL= 0
##$YMAX_a= 140829
##$YMIN_a= -108986
##$ZGOPTNS= <>
##$ZL1= 120
##$ZL2= 120
##$ZL3= 120
##$ZL4= 120
##$ABSF1= 10
##$ABSF2= 0
##$ABSG= 5
##$ABSL= 3
##$ALPHA= 0
##$AQORDER= 0
##$ASSFAC= 0
##$ASSFACI= 0
##$ASSFACX= 0
##$ASSWID= 0
##$AUNMP= <proc_1d>
##$AZFE= 0.1
##$AZFW= 0.1
##$BCFW= 1
##$BC_mod= 2
##$BYTORDP= 1
##$COROFFS= 0
##$CY= 11.3945322036743
##$DATMOD= 1
##$DC= 2
##$DFILT= <>
##$DTYPP= 0
##$F1P= 15.9154993809931
##$F2P= -4.1035820241983
##$FCOR= 0.5
##$FTSIZE= 0
##$FT_mod= 4
##$GAMMA= 1
##$GB= 0.15
##$INTBC= 1
##$INTSCL= 1
##$ISEN= 128
##$LB= 0.24
##$LEV0= 0
##$LPBIN= 0
##$MAXI= 10000
##$MC2= 0
##$MEAN= 0
##$ME_mod= 0
##$MI= 1.114404
##$NCOEF= 0
##$NC_proc= 0
##$NLEV= 6
##$NOISF1= 3.799351
##$NOISF2= 2.8
##$NSP= 1
##$NTH_PI= 0
##$NZP= 0
##$OFFSET= 15.70392
##$PC= 1
##$PHC0= -12187.8
##$PHC1= 15.601
##$PH_mod= 1
##$PKNL= yes
##$PPARMOD= 0
##$PSCAL= 0
##$PSIGN= 0
##$REVERSE= no
##$SF= 200.130013532006
##$SI= 16384
##$SIGF1= 3
##$SIGF2= 2
##$SINO= 400
##$SIOLD= 16384
##$SREGLST= <1H.CDCl3>
##$SSB= 0
##$STSI= 0
##$STSR= 0
##$SW_p= 3612.71676300578
##$SYMM= 0
##$S_DEV= 0
##$TDeff= 0
##$TDoff= 0
##$TI= <>
##$TILT= no
##$TM1= 0
##$TM2= 0
##$TOPLEV= 0
##$USERP1= <user>
##$USERP2= <user>
##$USERP3= <user>
##$USERP4= <user>
##$USERP5= <user>
##$WDW= 1
##$XDIM= 8192
##$YMAX_p= 0
##$YMIN_p= 0
$$ End of Bruker specific parameters
$$ ---------------------------------
##NTUPLES= NMR FID
##VAR_NAME=  TIME,          FID/REAL,        FID/IMAG
##SYMBOL=    X,             R,               I
##VAR_TYPE=  INDEPENDENT,   DEPENDENT,       DEPENDENT
##VAR_FORM=  AFFN,          ASDF,            ASDF
##VAR_DIM=   8192,          8192,            8192
##UNITS=     SECONDS,       ARBITRARY UNITS, ARBITRARY UNITS
##FACTOR=    0.0002496,     1,               1
##FIRST=     0,             0,               0
##LAST=      2.0444736,     0,               0
##MIN=       0,             -108986,         0
##MAX=       2.0444736,     140829,          0
$$ Real data points
##PAGE= N=1
##DATA TABLE= (X++(R..R)), XYDATA
0 0 0 0 0 0 0 0 0 0 0 0 0 0 0 0 0 0 -8 8 -8 8 -8 8 -16 16 -16 24 -24 27 -32 36 -40 48 -55 60 -67 75 -84 96
38 96 -105 118 -131 145 -160 179 -196 217 -238 263 -290 318 -351 388 -428 470 -521 578 -644 720
58 720 -810 916 -1047 1210 -1420 1704 -2104 2710 -3735 5761 -11237 54942 140829 -57313
72 -57313 -54816 53930 -12988 -38721 57163 26090 -38614 -14975 -4764 6545 47580 4470
84 4470 -38085 5407 8054 -15949 33746 27361 -43766 -17572 30436 -4430 -366 29916 -15190
97 -15190 -31677 21055 17197 -8511 11940 -1668 -30202 7165 26290 -8197 -5689 8747 -14156
110 -14156 -7802 20034 4089 -11434 499 -5438 -6589 14299 6070 -13563 -972 3529 -8228
123 -8228 4473 11619 -8749 -9097 5731 -409 -2598 6736 -1791 -9284 1789 3423 -2204 2925
137 2925 655 -7523 -160 5346 -2247 -1133 3176 -3829 -3816 4743 1973 -3212 259 -148 -2511 1873
153 1873 2406 -2041 -559 733 -1916 527 3009 -1227 -2027 1408 103 -922 1787 568 -1981 82
169 82 1141 -341 496 814 -1062 -292 1091 -83 -42 855 -504 -751 1019 540 -577 343 277 -653 268
188 268 771 -264 -168 297 -241 -1 566 -59 -337 240 26 -211 360 131 -351 35 186 -183 90 197
208 197 -242 -125 221 -68 -121 156 -73 -230 112 65 -126 28 23 -142 -9 82 -96 -26 45 -104 -29 66 -55
231 -55 -59 55 -55 -40 68 9 -94 36 5 -32 15 40 -11 -52 36 6 -26 29 -12 5 18 11 -7 28 25 -4 30 18 -22 -15
261 -15 48 -11 -23 19 8 -5 39 -8 4 24 31 25 23 11 21 14 18 -4 18 3 17 5 27 0 6 7 -19 1 1 -1 -2 22 -21 -2 -14 6
297 6 -18 -1 3 -16 -7 15 -1 10 -14 7 2 -13 7 -2 13 5 -3 -17 -9 -2 -8 -23 5 13 -19 3 7 2 22 -14 22 -14 -11 -7 16 13 14 2 21
336 21 8 18 2 8 -4 6 -2 12 -7 32 23 17 -7 18 30 -11 7 17 16 -1 19 -1 8 22 0 9 1 24 25 15 -4 25 -3 -4 -23 -14
372 -14 -19 -2 1 9 5 -10 -8 -31 -16 -10 -2 -3 4 5 10 -3 19 -11 -10 -32 22 -9 -15 11 -1 5 14 1 -18 25 7 20 -8 16 14 -16 -9 -38 1
411 1 -3 -33 -10 -40 13 28 18 13 11 -1 9 -10 12 19 12 -27 6 5 -5 29 -6 16 -14 6 5 -12 22 -23 -9 -17 0 14 -13 34 -22
446 -22 -6 -6 22 -10 42 -5 -21 -14 3 -17 -4 10 4 15 -7 -12 -12 -9 -8 2 14 -12 4 3 -14 7 -18 6 32 -11 9 24 20 -6 -9 -8
482 -8 -15 5 17 -4 3 18 -21 24 -15 -14 -16 -5 -16 -10 -39 5 -1 4 -26 -21 -14 -10 -7 28 -11 4 5 -5 -29 -34 2 3 26 29 -8 -15 5 1 -3 10
522 10 35 -23 22 -20 -1 21 -13 19 -18 1 -10 -12 -27 10 7 -10 4 -14 15 21 9 -3 -20 -7 -5 -9 -3 0 21 -1 12 -6 -18 -33
556 -33 3 3 -21 7 8 -16 -9 2 5 19 6 16 -5 27 -19 1 15 14 -6 -1 -3 -13 11 -12 25 -18 -7 -26 1 -4 -30 -4 -1 1 -12 -23
592 -23 -14 1 18 -12 9 4 35 36 21 29 -20 4 -25 -1 -4 24 -3 -1 -4 -8 17 1 10 -11 -5 0 10 16 24 4 21 -2 -15 -7 3 2 -2 1 -6 14
632 14 20 -13 14 3 12 -9 2 -20 20 -12 -13 -8 -19 27 -1 14 4 9 6 27 5 21 36 16 4 5 -19 23 -13 6 -4 -2 12 11 8 -10
668 -10 -5 -4 -18 -14 -10 -8 4 1 19 4 8 -1 -31 15 -9 -16 17 13 -21 21 -12 16 6 11 -21 6 -12 -2 31 -1 7 25 13 38 21 -4 21
705 21 18 25 -1 4 3 2 -3 0 -29 -11 -34 -6 -11 22 -2 -7 -22 5 -4 2 9 16 -16 19 12 7 -17 -4 21 -9 -1 -11 -3 18 -18 -25 35 27 27 24 -8
746 -8 0 7 -1 32 -3 8 -4 -3 2 -16 -12 13 12 4 11 9 -17 -13 -2 -22 -25 -13 12 -7 12 -3 0 -8 -33 1 10 -17 9 -6 0 18 -10 11 6 -6
786 -6 5 -4 -21 5 11 10 -11 2 18 34 7 -8 4 -13 7 25 -3 -4 4 -13 17 -16 -7 -1 -37 -14 -10 -1 -6 19 11 -9 0 -5 -24 -11 1 3
824 3 1 11 0 8 -5 1 2 27 12 -14 16 -8 -9 3 9 3 7 -19 9 -4 -32 6 4 17 -20 5 5 -11 21 -30 3 4 -2 -32 12 -14 20
861 20 -35 0 19 -26 -7 -12 23 11 7 -34 -18 -3 -10 12 14 0 18 -4 -3 13 25 -14 0 14 -11 -14 21 23 3 -7 9 10 13 22 15 -4
897 -4 -1 33 -1 12 0 -3 12 4 19 3 21 0 2 0 -14 -6 -15 1 -7 9 -11 10 3 -21 10 -9 13 18 27 2 -7 -7 21 -2 8 3 26 29 5
936 5 17 -3 13 0 22 -5 0 10 -8 -25 -13 2 15 10 -12 3 -9 3 21 3 13 -5 24 13 17 -3 15 -11 -4 -31 35 24 -8
969 -8 39 -18 21 41 39 5 5 -17 16 19 -10 49 18 6 24 38 14 -1 -4 -16 22 2 10 19 22 -5 30 5 17 -3 2 -17 -2 4 7 -14
1005 -14 -7 14 14 -27 -11 -10 17 7 -8 -8 -16 12 23 -9 1 23 34 21 4 11 -19 0 19 -6 27 13 -24 13 -6 6 5 -12 5 12
1039 12 10 -2 -11 -4 35 2 14 -9 13 0 1 -2 14 25 32 14 10 -11 -18 -7 -12 -4 16 16 17 -26 0 39 -6 16 8 -18 -27 15 -26 7 -4
1076 -4 22 -12 12 4 15 -2 -4 2 13 15 5 13 11 -5 0 27 3 -6 -1 17 4 -3 -17 11 -14 2 4 6 -1 6 -19 -9 1 6 27 -23 -14 20 21
1115 21 38 -9 4 14 -31 -6 -22 15 5 18 10 11 -2 4 14 12 14 6 -14 16 -19 8 -2 16 19 -21 3 -7 21 -18 6 -4 7 11
1149 11 3 5 15 23 12 13 -8 7 -3 5 -2 -7 3 10 29 34 10 6 -14 4 -9 14 8 6 16 -15 28 6 -9 -12 5 -8 29 -28 19 -9 0
1186 0 -13 -2 -20 6 -16 -16 -7 29 3 5 0 -9 4 8 -9 4 -3 7 -9 12 35 17 13 -7 -11 8 -2 0 -10 -17 -3 10 2 9 9 -7 7 -11
1224 -11 -36 16 20 -14 -5 -8 -24 -23 -10 -9 -19 19 7 1 16 -1 -13 17 4 7 24 8 9 -6 -4 13 -9 -13 21 27 7 29 -11 -16 -15 10 5
1261 5 -1 13 14 14 -19 2 -24 11 10 24 -3 10 27 -17 11 16 3 8 -26 17 27 -8 -12 -2 11 46 8 1 -11 14 -23 -4 30 -1 9
1296 9 -13 4 24 11 19 1 11 6 23 7 -6 -1 -11 -17 -26 25 8 23 12 -17 19 -16 2 -12 -3 -3 6 9 10 9 11 39 -21 -9 -3 -23 -9
1333 -9 20 -3 13 -19 -3 9 6 5 -23 0 -8 5 -3 -3 4 27 22 2 1 6 23 -16 40 10 -11 -5 -7 2 15 27 -17 15 11 15 5 -15 -4 -16
1371 -16 -5 23 -5 4 8 33 -15 -5 -9 1 -22 -7 2 12 -15 10 13 -4 -22 -16 5 -2 0 13 -23 8 -3 -28 19 4 -17 46 -15 23
1405 23 6 35 -3 -4 -6 -14 36 -5 12 47 16 -10 5 11 -22 17 -8 -6 -16 -20 28 -5 10 -22 26 -16 -5 7 2 15 2 13 -4 1
1439 1 -24 -3 8 14 -5 35 4 -22 9 -4 5 -4 16 -17 -7 20 -29 -1 18 3 15 11 -14 -39 1 -1 3 16 -1 10 -3 -11 2 8 15
1474 15 21 -24 9 -12 19 15 33 -16 -1 -5 -1 -1 21 26 6 5 -3 -2 9 15 8 26 14 8 14 8 19 21 15 10 -4 -22 -7 1 5 17 25 18 -7 28 -14
1515 -14 -15 -18 12 -7 8 -1 -39 16 13 4 -13 5 -2 -9 9 -6 -10 -13 16 -9 18 4 17 16 -11 36 0 9 -23 -5 7 8 -8 -3 -7 -19 -2
1552 -2 9 -3 -13 31 1 -1 -23 10 10 19 -7 2 2 -4 -7 -5 -9 -11 -8 7 -8 19 10 9 7 6 -14 4 17 12 -7 11 -14 16 29 16 20 20 2 7
1592 7 26 25 2 14 29 3 28 -17 -8 -22 11 42 -13 -4 -14 -11 13 35 10 -19 -6 -17 -11 0 -13 -8 1 -13 21 -10 -14 8 21 8 -13
1627 -13 10 8 7 -3 -8 18 3 33 12 6 21 -13 1 10 40 18 24 1 9 -8 -24 29 -27 -8 -2 -15 -4 -11 2 -3 12 8 12 0 10 2 -12
1664 -12 5 18 2 29 14 19 -15 -10 26 11 0 7 15 3 -20 -1 11 1 -8 14 -18 23 -10 18 23 14 17 -2 -37 19 -21 -8 1 -6 -11 29
1700 29 20 13 -5 4 -19 -7 0 -8 0 9 22 3 2 0 25 2 -16 -9 -11 -20 -29 -4 0 17 -5 12 13 -9 30 36 1 19 6 2 -6 37 14 -19 -5
1739 -5 14 -14 -2 -7 2 5 -1 7 5 18 3 20 -1 8 4 13 -11 18 -24 -1 10 3 22 6 -16 -15 2 -1 -24 -12 30 -32 23 17 11 17 2 13
1777 13 17 -8 13 28 17 7 30 7 33 -5 14 5 1 -5 -20 -44 -16 -7 -1 6 15 8 2 -32 -33 -25 0 -9 24 -5 -10 16 -13 -15 30 0 -9 -3 -5
1816 -5 -1 -3 6 -4 -12 10 20 0 5 -13 -5 -27 6 -6 8 35 5 11 22 5 -12 12 -4 11 7 -7 4 9 16 13 -18 28 9 -6 -4 -9 6
1853 6 -8 -35 29 13 -14 6 23 11 3 -7 9 1 -2 1 -16 9 -2 -15 4 16 18 4 37 6 -6 -2 15 11 -9 0 -34 -3 10 -3 -10
1888 -10 -6 -14 -11 -5 -21 3 -5 9 16 4 -3 -8 -5 -11 12 6 -8 -20 18 10 -17 -8 19 -7 14 32 -9 30 5 24 4 16 20 -17 -25 -1 -10 15
1926 15 29 -5 5 22 12 17 -10 -6 -15 -18 10 -4 -3 11 -4 -23 -7 2 1 25 -8 15 -8 15 6 -14 1 24 11 30 -3 -8 -5 6 5 16
1962 16 1 20 -5 -13 -1 12 -3 -3 -9 -4 -6 -10 -30 3 -5 4 -2 -31 -9 5 -7 -3 -11 -9 3 -25 -7 21 1 1 -19 10 17 -19 14 -4 12
1999 12 24 32 7 -2 4 12 -7 2 24 14 -7 1 4 5 -23 8 -12 -8 -6 -2 13 10 -14 23 31 13 7 -1 1 -18 15 4 11 8 32 28 -10 12 -13 -5
2039 -5 -6 -7 -11 3 11 14 5 24 -8 23 -7 9 21 32 11 4 -2 12 -8 0 -13 -14 16 -14 18 1 14 8 30 25 -10 -38 1 -17 7 29 10
2076 10 -17 -11 -10 17 3 -21 -26 -10 -22 -10 -1 -27 -7 7 17 0 16 9 13 -8 6 0 20 13 4 14 1 30 -13 8 19 28 10 -20 -1
2111 -1 -12 -11 13 -27 6 20 5 -12 4 -10 -5 2 -6 13 -12 8 -26 -21 -7 -1 12 8 10 0 12 12 12 3 14 15 27 20 -13 24 -10 9 -3
2148 -3 5 24 12 29 11 6 -1 -16 5 -22 17 -21 -7 -7 -8 -4 -12 2 -25 13 18 15 -19 -1 -4 2 1 -10 -12 -17 7 -19 -12 -4 -2 13 14 0 2 30
2188 30 1 3 -18 -23 -5 4 19 5 -19 -17 -17 28 7 12 -21 -6 34 -21 -29 -6 -12 10 -8 -3 -23 -18 -5 21 -10 -22 -15 -15 -6 20 2 3 -5 -23
2226 -23 12 14 9 3 15 41 20 9 -11 16 2 0 27 2 11 10 -3 20 9 -11 -7 4 8 5 -5 22 -13 -9 -3 21 -5 -21 -9 -16 -17 9 -6
2263 -6 -1 1 -6 17 -29 17 3 -22 25 13 4 -10 22 10 -1 -6 20 24 15 -10 -1 -2 -18 21 9 25 5 16 15 8 13 -6 1 9 -34 10 -20 21
2301 21 16 -10 9 -3 26 -20 11 11 6 19 17 -7 -30 30 -16 19 12 -7 -12 28 0 -4 -14 6 4 -15 11 12 7 20 1 9 30 7 -1 32
2337 32 21 4 9 0 -9 4 -1 -15 13 -4 -37 -7 -27 10 -6 -30 -13 -4 3 -10 2 -4 -26 8 -1 -27 -2 12 4 -9 9 -3 12 -7 2
2372 2 35 13 -4 18 30 1 -11 -3 -1 -11 21 6 28 -4 11 -26 8 -1 -16 7 -14 -24 -4 -13 -14 -2 -22 -11 -13 -20 -18 -19 -10 5 -8 -8
2408 -8 2 -16 19 20 -1 13 -23 10 32 1 -6 5 -20 -5 42 1 -26 19 -9 14 18 -8 9 -6 -2 -36 -3 24 1 23 -1 12 -12
2441 -12 -10 -35 -1 6 23 -12 7 -2 0 -4 -7 -2 -28 34 7 44 13 4 6 -19 -17 -29 2 16 18 -1 -21 -1 13 0 21 -9 7 6 -26 -11
2477 -11 -9 22 6 22 5 -1 1 1 -8 -8 -12 5 -4 -21 -1 23 -13 -7 -2 11 5 9 21 -14 17 -7 22 -21 -19 2 -6 29 -6 -2 -12 4 -13 31
2515 31 4 -32 27 15 4 -12 -17 2 6 -1 6 -5 19 7 0 -4 -16 -21 -7 16 -22 -5 2 -22 0 1 8 20 0 3 -8 -13 -12 -12 29 5 -1 11
2553 11 7 6 -3 1 1 -19 35 -5 2 9 -4 14 3 5 -3 -21 -2 12 -2 -3 -14 -22 -1 18 20 16 -6 7 -5 5 14 -4 -6 -10 -23 2 15 -13
2591 -13 10 -20 -13 -10 0 14 15 5 -33 -1 -22 6 -5 20 -19 -7 -9 38 10 9 8 -3 -9 16 2 -6 19 33 16 -11 5 -6 8 1 12
2626 12 -10 -15 20 18 6 10 8 0 -6 -13 8 12 -16 -15 -14 -18 -5 -22 -2 -5 22 -42 -1 -2 -15 27 -18 6 25 33 9 -1 -9 -6 10 -4 14 5 3
2665 3 -1 13 6 -19 -4 -1 -4 -38 4 26 -4 3 1 -3 -6 -23 -19 1 -8 -5 19 2 -6 0 13 1 26 6 -8 10 17 5 4 4 5 16 4 -23 -1
2704 -1 -11 -2 -15 -3 -31 -8 6 35 -7 3 19 4 -4 17 -1 -28 -19 2 -3 -20 -25 -11 -1 -22 -15 -19 -6 15 -11 -24 -3 -15 19 -9
2738 -9 13 1 -29 4 -2 8 -12 -24 -10 12 -5 15 19 5 19 15 0 26 6 25 -9 -4 -19 0 0 11 5 23 2 -3 -28 8 26 5
2772 5 8 2 -23 -24 14 -10 10 -15 -16 4 17 3 15 -11 -2 -17 32 -14 -5 24 10 -4 -12 1 22 2 18 -10 1 -9 3 8 1 -3 -7 8
2808 8 5 -18 7 11 0 -1 2 -14 -13 -16 2 4 30 7 -11 -22 -16 0 0 7 4 -6 -29 11 3 6 -7 -4 20 26 -3 14 18 -21 10 23 -17 27 2
2847 2 -12 -20 14 -1 23 25 14 -4 -1 -15 -20 15 1 -11 -20 -2 -14 29 -10 -12 25 21 4 4 -26 14 -17 -16 -21 13 -10 -30 20 -8 -15 4
2883 4 31 -2 -2 -3 20 0 16 6 12 15 -5 46 -7 16 5 14 12 17 -23 29 -22 1 23 -15 6 1 -3 3 2 1 -9 -36 -15 -3 -20 6 8
2920 8 4 21 17 4 -17 2 9 36 -8 -1 -2 8 5 5 28 9 -3 12 -11 -6 30 -16 13 20 4 4 16 -2 -18 8 2 15 -9 -16 9 30 -15
2957 -15 9 5 -14 16 -12 2 -11 -13 14 -7 8 -12 13 2 -2 -10 0 -9 -12 -20 -11 24 11 7 -24 -4 10 -13 6 19 6 2 0 -8 -8 5 0
2994 0 -3 21 -6 7 -1 -10 -5 -7 -3 -3 17 -33 23 16 6 -16 9 21 -4 2 -3 -5 -2 -1 23 6 8 -15 -1 18 5 -21 12 -3 3 8 22 -13 6
3033 6 29 6 -1 -6 26 10 44 27 -15 15 29 -24 -4 -11 28 0 -22 25 -24 -1 -6 -8 5 -32 0 -8 1 24 19 -10 -21 15 5 3 5 28
3069 28 11 14 -22 -8 -15 0 5 35 -20 1 33 10 1 -2 7 -8 17 5 27 -12 14 6 -33 22 18 -18 9 19 -17 9 -15 -27 -3 4 -8
3104 -8 -1 15 -14 10 1 6 -7 -6 22 -10 -7 0 2 8 15 14 -10 -22 18 -6 5 20 4 -2 -6 -3 10 -7 12 18 4 -10 -15 -3 -24 11 -28 11
3142 11 -23 -16 -17 -2 -7 11 -15 -6 -23 -14 -7 -9 16 -23 -7 4 14 5 0 17 3 22 -4 0 -7 -1 17 1 33 -28 -15 16 8 16 -28 17 22 -4
3180 -4 15 -10 2 -4 -42 1 -1 -5 -11 15 12 9 -9 -1 -13 -9 -33 -9 -5 2 18 -9 14 2 5 -8 5 8 13 16 30 -20 20 8 2 10 -16 5 18
3219 18 22 5 6 -13 -1 11 27 -35 17 -21 6 -21 12 4 19 -1 -23 12 -37 13 -16 -7 8 10 13 4 30 7 -22 23 -17 2 7 15 5
3254 5 -2 14 25 -11 2 -11 -9 4 8 -23 15 -19 2 18 20 -3 6 10 -8 4 5 0 -13 0 -9 -5 -14 15 -8 -6 -35 -16 6 11 -2 6 8 -12
3292 -12 -23 -17 -2 -4 -11 3 7 16 42 0 8 3 0 12 -25 22 26 -3 13 -6 6 0 -5 -7 1 11 16 -7 1 1 3 4 -3 8 18 16 -14 -17 -10 8 -5
3333 -5 15 -22 -7 10 -8 2 14 -13 -17 4 -8 -15 16 -11 -27 8 7 -11 40 5 -4 6 13 -8 -6 0 5 18 -11 -5 24 10 -10 24 4
3368 4 -13 1 -13 -6 22 -2 23 -23 -17 -5 -1 -1 -13 5 -8 3 2 17 -15 -13 8 -17 19 -28 -18 -27 33 -17 -2 12 9 -16 -27 38 2
3403 2 8 0 18 13 -32 3 -4 -1 -16 -33 5 -22 -25 14 -12 -9 -1 6 3 -13 0 16 16 -23 28 6 -17 2 -1 28 -8 1 -28 -12 9 1 -26 -10
3441 -10 30 27 -7 19 0 -14 3 9 7 14 -13 2 17 -1 6 -13 8 -19 2 -10 7 -10 13 -24 -3 -14 2 -13 -32 -3 -29 -12 -10
3474 -10 -23 -10 19 -10 -1 -18 -24 -26 -8 16 -9 16 -10 15 -8 1 1 7 8 22 -4 -5 2 2 29 27 -4 20 -6 -15 -11 13 11 21 -5 0 -18 -30
3512 -30 28 -42 -5 -14 -2 4 20 -4 -11 4 -12 9 2 -27 8 17 12 -18 5 -9 -4 14 4 8 -8 21 -22 20 18 0 -29 21 10 13 -17
3547 -17 -4 -28 25 8 -8 -4 -16 0 3 -2 -26 0 8 -15 -13 22 27 4 2 30 -20 0 -4 -20 5 13 -4 16 3 -15 30 22 15 -33 4 -5
3583 -5 26 -2 -2 6 20 11 12 -6 -2 7 12 -30 -12 -15 -11 -2 1 16 3 2 3 33 2 23 9 -19 5 29 8 4 -13 -14 15 2 -38 -9 -24 -40
3621 -40 -12 -15 23 20 1 30 12 0 0 5 14 27 6 30 1 34 -26 -7 1 2 8 13 13 2 -2 -21 27 -32 -2 -23 -5 -9 -7 18 3 21 -11
3658 -11 -27 -10 8 -8 -28 11 17 -15 -10 -6 7 13 16 5 0 13 24 14 -2 23 21 6 -5 9 14 1 3 -9 21 8 -26 4 9 -11 -15 -5
3694 -5 -5 -33 -14 -15 -23 -4 5 -11 -5 -11 15 -12 -14 23 0 13 -18 -17 -14 -9 15 7 7 -2 -15 -2 8 -2 4 -13 1 16 -8 -16 11 11 21 12 -8
3733 -8 0 25 26 29 -19 11 -1 -12 -14 4 -4 -14 19 4 -3 -37 -16 -13 -4 5 -10 6 -27 -18 -8 -18 11 -16 9 -15 28 -5 -10 7 25 8
3769 8 15 14 -11 21 0 -9 -6 25 -6 33 8 30 -4 -29 -12 11 27 -7 -11 12 19 8 3 -23 -19 1 -10 30 18 3 -11 8 11 4 30 4
3805 4 16 18 4 9 25 -12 10 13 21 -4 13 -2 2 7 13 -7 -13 -24 6 -4 -15 9 9 3 -9 21 28 -11 14 -14 17 -18 -15 -26 -27 -15 -18 0
3843 0 -17 -11 -24 -8 5 -5 -1 -11 -1 12 -31 -30 10 4 24 15 13 18 -18 17 -6 -8 -5 -15 6 -8 -3 -16 9 13 1 -6 14 2 14 -1 -4
3880 -4 2 0 10 -7 -24 -22 -13 -4 -30 -1 5 0 -3 -22 -12 10 -14 22 14 17 -10 -9 16 -12 11 -9 -4 -17 27 7 9 15 -5 6 17 -19 -5 17
3918 17 2 -25 -1 14 -22 -1 -15 3 -14 -2 4 1 -6 21 -30 -17 -1 -1 -11 1 -5 -10 -14 14 -10 34 -18 -18 4 -10 12 20 19 13 10 1 -15
3955 -15 13 22 20 17 -5 23 5 8 -13 2 2 0 15 28 1 -7 -2 -19 -14 6 -12 5 -20 3 -2 3 -6 -10 -13 -22 -9 -11 -19 0 -13 -6 24 27 5 19
3995 19 -3 5 17 14 39 11 2 -11 12 24 -31 -10 35 -13 -3 27 -12 5 25 -14 -33 6 -18 -3 14 -16 -4 36 -41 -21 -20 -25 -10
4028 -10 -25 -29 -13 -28 -4 -32 3 2 -8 0 -12 1 36 -10 19 5 19 2 2 16 -11 25 -2 2 -6 3 11 -13 23 21 10 9 4 2 14 -3
4064 -3 8 9 -1 -36 -25 3 20 12 24 14 -15 -24 -3 -4 17 -20 -9 2 15 25 -14 16 11 -22 8 17 -3 12 11 -8 5 -16 28 14
4098 14 18 14 -13 16 29 3 19 -3 -10 13 -20 6 5 2 -9 11 -29 -13 -5 -27 8 -12 4 -7 8 -19 -10 -26 -12 10 -6 14 -27 11
4132 11 11 -14 2 14 1 12 6 5 -7 17 10 14 0 -8 13 11 -18 10 28 -31 19 2 -17 5 -23 -12 9 1 -6 10 -7 -7 -4 -5 -8 -30 -4
4169 -4 -9 -4 7 -5 -2 -17 3 -10 -15 5 4 -20 12 7 -17 -41 6 -17 -14 7 -1 -2 4 -11 17 2 -10 -16 -26 9 -1 -1 -36 0 -23 -5 -5
4206 -5 2 5 6 -15 12 10 -19 29 -6 -33 -4 44 -6 -8 -38 -17 -6 4 5 -4 -33 14 -5 -7 22 2 12 -1 -1 17 14 -19 -4 -6 0 1 6 -10
4244 -10 23 -1 2 9 -3 -9 2 -17 -21 14 44 10 -44 6 14 10 -9 1 -25 6 -2 -7 13 -13 15 -1 20 -2 -3 -6 -27 21 19 10 -4 27
4280 27 6 26 -14 18 23 14 12 2 5 3 -6 -7 -33 -1 8 -6 9 15 -17 -27 -25 0 -32 -20 -10 3 -19 -32 -2 -29 -21 -24 10 -6 2 23 -47
4317 -47 -19 -25 4 23 13 -23 19 16 3 10 5 8 -3 17 34 1 -20 -6 -14 17 8 -17 16 -12 -17 23 -20 -17 -29 27 -3 -13 -7 -3 -13 -16
4353 -16 -18 -14 -4 -28 -12 -2 -17 -43 -27 4 -8 24 0 -15 7 -10 -16 -12 -10 -20 2 15 21 -3 25 -12 23 11 -24 -9 -4 7 -9 -14
4387 -14 1 -7 -18 24 4 -17 5 14 2 7 -5 -20 1 -19 0 -4 -12 -7 -24 0 0 -3 -10 17 -3 -11 9 -9 -13 -7 0 -2 8 1 28 5 23 -2
4425 -2 43 -3 10 24 2 1 4 -16 -20 6 -31 8 8 4 20 15 15 -5 -4 3 -22 28 12 -14 3 -11 -29 15 -4 -10 25 -5 9 7 10 9 -2
4462 -2 -4 0 -15 -15 -4 8 -11 -11 1 25 -10 13 20 9 20 1 -11 2 -3 2 -2 5 -8 -17 1 -21 -21 -21 5 -14 -4 2 -17 -25 -10 -2 8 -20
4500 -20 -14 19 -9 -34 18 16 -5 13 -7 -12 16 3 -31 4 16 23 -4 -4 6 1 13 7 -14 32 3 8 31 6 -12 -12 -10 8 11 26 5 12
4536 12 -25 2 -9 -29 -1 1 -21 -11 -15 -35 12 26 15 -13 -23 -3 18 25 -2 6 16 12 21 16 1 -9 -14 3 6 -1 -34 8 26 -2 12
4571 12 -9 -16 -3 1 -38 -19 -17 -19 5 -13 -13 -25 3 -13 -25 -17 13 14 -17 -26 4 10 7 8 14 -18 -13 -24 -3 -7 -18 3 39 0 3 16 -27 11
4609 11 1 -6 22 24 14 14 2 -2 11 6 -20 -3 6 -6 -19 32 14 -19 -10 -17 -15 -2 -4 -17 -13 4 23 -29 -14 -12 9 -1 23 -5 -4 4 -21
4646 -21 10 -5 3 20 10 8 7 12 12 -2 -11 9 16 11 12 22 3 8 0 20 11 28 16 -1 -6 6 -3 -4 4 -20 -17 19 -1 3 -5 -9 -5 -4 34 9 -9
4687 -9 3 -11 -1 -21 8 -6 -23 28 -3 18 8 1 2 17 -14 11 12 23 6 -8 -11 10 5 -15 -14 -12 -6 -2 -35 10 -4 1 29 0 -33 -3
4723 -3 13 -7 -4 9 -4 5 -14 -14 18 -7 -12 1 1 16 15 -33 -21 7 13 6 -5 8 15 -7 5 19 47 3 -18 5 6 -15 4 11 16 9 -3
4760 -3 1 3 -34 3 -12 5 3 20 0 13 16 11 3 -23 -23 0 15 -1 0 -18 -14 -21 17 18 12 15 33 -2 20 -25 -3 1 2 31 -9 -13 -2 -15 -37
4799 -37 0 22 44 -6 -10 -9 -4 23 -12 -18 5 -13 -26 19 8 20 4 -11 -21 -15 -44 -10 -13 -11 -2 3 -14 -24 -15 -20 -34 -5 5 -13 -13 -21 9
4836 9 1 19 22 27 23 0 11 3 -14 36 -30 15 -4 3 14 -8 2 10 -14 15 -14 -13 -12 -13 -8 -10 -33 -14 26 -8 -3 16 -3 -27 0 7 -4 33
4874 33 -12 -6 -7 4 -3 -6 11 10 18 5 11 12 -12 -6 -16 7 19 18 -4 12 5 4 18 2 17 -4 -12 -9 6 -11 -28 13 7 -34 15 12 -18 4
4912 4 -20 -17 8 -3 -13 -6 -4 -20 2 11 28 -10 9 4 5 11 0 5 -11 -13 -15 -4 -3 4 0 12 5 12 -8 8 11 2 -1 2 -28 -17 -14 3 -14 -17 0
4953 0 -2 -11 13 1 -25 -16 -11 5 4 -18 10 -13 17 -6 -9 -11 30 25 -7 9 -11 -11 -11 1 -1 8 11 -7 15 0 -14 -4 -5 17 21 12 -18 15 4
4992 4 -19 -21 -23 -4 -1 -9 -11 27 -10 -7 -10 -5 -3 -4 -42 1 -4 -20 -17 -1 -15 -7 -26 5 19 21 26 6 2 -8 25 -15 -20 26 21 17 20 24 31 9 6 31
5034 31 12 22 19 -5 -9 -11 -26 11 0 -11 4 24 26 1 13 -12 5 16 -31 -25 8 -7 0 2 12 32 -16 -2 -6 13 1 -2 -4 -29 4
5069 4 3 -22 22 5 -9 -9 1 15 -5 -9 -10 -8 8 -6 4 5 3 5 -15 -29 25 5 -16 0 -27 17 -26 -3 -15 15 -2 5 -10 -3 7 -3
5105 -3 14 -16 -12 -29 -19 14 -13 -13 -15 -27 5 30 2 -27 23 -4 -10 7 9 4 3 4 -9 -1 1 13 -8 14 4 0 -13 0 0 12 21 22 12 -28
5143 -28 -6 -13 11 4 1 -11 -7 -1 13 -23 -14 -19 -29 -14 -3 20 30 -5 -7 4 8 -4 16 0 9 -2 31 4 -18 -3 13 -25 -10 32 18
5178 18 12 7 5 -19 -8 7 6 -8 22 -17 13 -3 -14 9 38 5 -8 -9 1 16 15 26 14 -8 0 -7 24 -11 6 12 -11 -4 -2 25 -9 12
5214 12 5 6 3 7 8 -3 -8 -8 37 -2 16 8 -3 6 9 -7 -23 -35 -8 -31 -3 -3 9 -1 -11 -9 -6 -17 -5 2 -28 -3 5 4 -6 17 11 -1 -9
5253 -9 2 -23 31 0 -8 17 -3 6 12 15 -3 9 -10 4 -18 3 1 12 -24 -8 -4 -5 -23 7 -7 -18 -21 -14 19 -22 -7 0 1 -10 -13 -4 -16
5290 -16 -6 -35 -8 16 0 7 1 -27 0 -1 22 21 11 5 12 24 5 8 17 12 -11 0 6 26 30 -2 -8 -11 -4 -4 10 5 4 -7 -6 25 -15 -14 2 -19
5330 -19 -4 12 -18 -30 -7 -3 -13 -28 -3 -15 -3 -16 -4 24 -24 -9 1 1 6 -10 22 18 -13 -24 11 27 -4 -10 -47 -11 -34 -16 19
5363 19 -5 8 -8 -32 12 -11 -4 -12 -6 1 -9 -50 -17 16 -17 1 -6 -20 -8 15 -5 -6 -14 -13 13 9 -1 -17 15 -20 34 2 -7 32 -23
5398 -23 0 -1 2 -1 13 13 -6 16 15 0 2 -3 -21 -2 6 -40 0 -22 36 -2 -23 17 13 -9 0 1 3 -5 -8 -16 -32 1 20 26 -14 -18 -5 0 13
5437 13 -5 9 -8 21 -2 4 -8 17 12 2 25 48 4 17 2 7 15 -12 2 -12 45 15 -2 -22 -9 -30 5 2 7 -23 -2 -24 -22 0
5471 0 -8 15 -2 -25 1 10 3 -22 -10 -20 1 41 -1 -13 6 2 -18 1 17 5 9 -27 6 13 16 9 18 24 -5 -30 26 -6 -8 17 -2 -6 -7
5508 -7 -32 -20 -26 -22 -5 -9 -7 1 -16 7 0 -22 -5 -3 -20 3 -3 21 -10 -8 11 -8 6 -2 10 25 18 -18 6 14 14 8 -7 10 21 -10 -1 21
5546 21 25 -15 -11 22 7 -17 -9 -24 5 -23 -8 3 22 19 8 -7 13 -15 -16 -2 -3 -6 4 20 4 -7 -11 -11 5 26 9 -4 0 -2 4 10 -3
5583 -3 14 7 0 -5 36 30 -3 18 9 -8 6 -9 26 21 7 12 5 12 -10 -4 19 -21 -34 -9 13 5 -1 12 19 -20 4 -1 -4 -6 -6 9 -1 6 -12 -9
5623 -9 -2 6 -17 27 4 21 -18 5 -27 38 -2 -36 -7 -3 6 -5 -38 -6 4 -25 -11 10 15 -2 1 0 14 -3 -2 -9 9 1 -12 5 -5 -25
5659 -25 -10 -7 10 8 -21 3 7 -18 -8 -26 -29 -2 -21 26 13 17 -9 6 -8 5 8 -8 14 -15 -2 -22 28 -12 10 -7 12 -6 16
5692 16 25 0 12 2 15 0 -27 -25 -22 -23 -4 21 -16 6 -13 18 17 6 -11 9 18 -28 3 -3 -16 23 3 12 7 -16 -14 18 -8 11 10 -17
5728 -17 -12 24 6 8 28 -7 17 7 2 10 3 -6 -12 -20 -7 18 5 20 4 5 -30 1 -5 1 10 14 -6 6 -19 34 10 25 -25 -25 -18 1 -3 13
5766 13 -5 1 6 10 10 20 27 -12 -3 11 29 -32 -10 4 -13 -17 17 14 3 18 -7 -14 5 -9 14 -21 -18 -39 -13 -6 -12 -29 -31 -26 5 3 -6 0 -18
5805 -18 -14 -9 -1 -14 0 -4 7 -1 -10 5 -20 -9 -11 10 6 23 31 0 13 5 -17 19 -21 -4 -23 -3 1 -16 -7 -15 -7 9 -13 20 -16 -25 -21 12
5843 12 7 8 13 1 -5 -23 -15 -39 19 6 4 -26 -7 11 -9 21 24 -8 5 15 -5 3 -42 29 2 1 -1 -4 20 -26 20 -22 5 -7 2 11 -12
5880 -12 4 1 -14 -28 -11 -10 -29 -10 20 10 -3 -12 -15 -24 1 -25 3 -9 -27 -5 14 1 -15 12 21 8 25 -27 4 6 -18 -6 15 -13
5914 -13 23 40 -7 -6 0 44 -2 10 -16 -5 -45 -27 -7 -7 -21 8 4 3 -26 -1 -12 -5 23 10 10 -3 -14 -19 13 -4 -5 -13 -6 2 15 -20
5950 -20 -11 1 -19 -4 0 21 8 27 14 4 -16 -16 4 8 2 -9 -9 19 -3 3 12 15 1 -9 5 -1 10 -11 18 18 -18 -14 -38 -10 -14 -11 -14 -2
5988 -2 -7 -16 -6 4 8 12 -11 -26 -16 11 -11 13 11 -10 3 -6 -2 -13 -13 6 27 -14 13 21 12 -20 -17 11 31 -16 11 -12 17 -20 17 -7
6024 -7 -3 5 -17 -13 0 18 -23 -2 -18 -3 -5 -19 6 17 2 13 -9 -10 12 18 -10 -13 12 16 -2 18 7 23 20 -14 5 27 8 18 1
6059 1 0 6 -21 -2 15 24 -6 22 21 39 -12 -1 -4 -23 -9 -22 -11 -8 6 -24 8 -1 -1 17 17 -23 -15 5 -5 -14 -22 20 21 10 -2 -18 7
6096 7 7 19 4 52 4 -10 -15 7 -6 23 -6 31 -11 18 -16 -24 -10 -23 -3 -20 -17 -9 -4 2 -5 -21 8 -8 8 4 -19 -9 0 23 -2 -26
6132 -26 3 17 -25 8 1 1 17 -2 -1 -8 -11 21 -2 15 12 -11 -13 -1 1 11 17 4 17 32 3 7 -8 13 -7 -23 -18 -13 -14 -4 4 6 -18 8
6170 8 -14 -16 34 20 7 21 -5 -21 -25 9 6 -5 -10 3 30 29 11 -25 30 32 2 -1 29 -4 -21 -15 29 22 -9 9 -14 -10 -15 5 4 -5 -15
6207 -15 -14 18 -7 -2 -5 1 -24 6 -9 -13 9 -4 -14 -3 -1 -5 -6 16 -16 3 6 34 3 -45 5 3 4 0 -3 23 -11 -21 -13 12 17 9 22 -5
6245 -5 -21 2 20 21 -20 -36 -10 -5 30 7 -2 -8 -18 -17 9 17 -19 -23 15 -13 12 7 -2 4 -5 2 20 -10 24 -7 4 15 1 -3 7 7 -26 -2
6283 -2 8 -17 22 8 5 -7 0 6 7 28 -15 7 -43 -1 14 -17 10 -1 -21 -23 -18 22 -55 5 5 5 -15 -34 14 0 -2 -43 2 -14 -9 -1
6319 -1 6 28 11 19 12 14 -12 8 10 -19 3 -4 10 14 15 -18 3 -11 -3 1 -12 5 -3 -16 -8 -7 6 21 -16 9 -11 -16 -19 5 -14 -7 -24 -14 -5
6358 -5 -3 30 -25 -4 8 6 13 -10 16 12 -7 -4 0 -11 28 21 12 -8 1 5 23 -2 15 13 9 11 7 -10 0 -6 -1 -7 -1 -11 -27 -9 14 5 -20 -11 5
6399 5 -6 -16 0 -7 -16 -28 -11 -15 -6 5 14 0 -11 -14 3 13 2 -10 25 -5 11 12 16 7 -15 -17 12 -1 -13 18 -10 13 15 10 -18 -15 -22 -19
6437 -19 17 -41 -7 14 -5 -12 -2 -4 -19 -24 -13 0 -26 -30 16 -25 -16 -16 -21 0 9 -7 -5 13 -9 11 -11 -17 -15 -4 8 -17 2 -2 2 13 17
6474 17 12 -6 -3 -4 4 -23 -9 12 -7 21 14 9 -11 -12 -11 -6 2 -3 0 -12 10 -14 -33 -37 -21 -16 -15 28 15 -2 8 13 2 5 11 11 8 1 24 14 -18
6515 -18 23 18 6 20 14 10 -3 1 -2 6 -8 22 15 3 1 -5 5 -21 -14 -27 -10 -17 -24 -12 4 5 -9 -19 -15 -12 -26 -21 4 -13 0 -15 -4 26
6553 26 -12 -21 -9 8 31 -16 0 16 16 14 -4 -6 13 -10 -25 -3 -4 3 16 -34 14 -3 -7 7 -26 -8 1 -18 5 18 -25 -3 -1 -2 -18
6588 -18 -15 6 -14 10 -11 -2 -16 -22 -7 15 24 -10 -26 1 3 1 -8 -26 3 -3 38 -9 -31 -11 14 -24 -1 -8 -3 1 -8 -14 -16 -11 19 -6 -6 -2 -16
6627 -16 -21 -18 7 26 -15 -14 -11 -24 -22 8 36 13 -5 -35 -3 -7 17 -3 -7 -12 12 13 -3 19 8 -8 -22 26 8 -10 -9 7 -22 4 4 -27
6663 -27 -11 -1 -11 -1 3 12 17 9 -2 -17 -14 -15 -2 -23 -7 -27 10 -2 -3 0 -5 -22 -8 22 3 6 0 5 19 -4 -9 -4 -14 -11 -11 30 25 29 7
6702 7 -16 7 -16 2 -22 -30 0 10 -21 -9 -31 -15 -7 -7 -14 -22 -2 11 -23 23 -5 -6 -33 -1 -19 -15 6 -9 -20 -10 6 -4 8 12 9
6737 9 0 19 0 2 -15 2 0 11 27 -38 -8 14 -38 -20 -7 -10 -13 -24 -4 3 -2 -3 2 4 -30 36 -20 -6 -19 3 -18 -20 -2 -1 -24 -2 -29
6774 -29 -10 5 1 8 -19 -14 -7 -19 -16 -22 -2 6 13 -18 -12 23 10 -4 46 3 1 13 23 6 22 -1 -19 15 -3 -9 -17 -8 -4 -4 -21 16 -7 -2
6812 -2 -10 25 36 -13 -22 -19 -23 -16 11 5 -13 -17 9 -3 -7 6 15 11 21 15 -14 -46 23 14 -2 0 -3 13 0 10 10 -2 -3 -29 6 -20 30 -30 7
6851 7 35 -31 7 0 11 -31 -5 -13 15 15 -13 -9 -43 12 -24 -15 11 0 -3 24 -14 15 36 1 17 22 -6 -8 14 -10 -5 5 -8 7 9 17
6887 17 -20 -31 40 4 -28 -34 9 20 10 -44 13 5 -6 25 3 -1 -12 -2 -16 -12 -2 4 -36 -3 -17 -12 3 11 4 -5 -9 -3 3 -35 1 -30
6923 -30 -11 -15 -27 -13 -18 13 -6 0 49 14 1 17 23 12 -8 1 -17 -15 -4 -10 -20 -24 -13 8 11 8 -38 9 4 -1 4 -20 -14 -3 -4 -10 7 -3
6961 -3 36 16 -8 -16 -9 16 -10 -2 -5 20 22 -25 25 7 -2 11 -7 8 5 7 27 -2 -11 14 -14 16 20 -5 -20 3 14 -2 10 0 -25 -1
6997 -1 11 -12 4 6 7 -17 -29 15 0 -12 -16 -20 5 -11 17 -22 -31 10 32 -4 8 -4 22 18 0 40 -17 8 -5 16 15 13 -7 -14 4
7032 4 5 -4 6 19 9 3 -3 -9 -1 -29 18 -20 6 1 -3 4 5 6 -29 26 -30 -8 -17 9 -4 0 -13 -46 -14 3 14 -24 -17 3 -9 17 4 3
7070 3 5 7 31 4 -5 -3 15 -5 -12 -25 2 19 9 14 -5 -11 0 13 -25 -12 8 2 5 -4 -27 -13 -20 -33 -13 3 9 -15 16 -5 -1 -23 -15 12
7108 12 -6 -10 13 0 14 23 50 9 -8 -2 -1 -11 -27 2 0 -4 -1 14 1 22 22 13 -15 13 -8 -9 -9 -18 8 29 2 -7 -16 14 5 -18 -26 9
7146 9 -10 -13 10 7 -11 -18 3 8 3 6 24 -33 -7 -4 -3 28 5 4 -27 -11 8 12 -11 4 9 10 -32 18 5 11 22 -3 0 15 13 11 4 4 -9 11
7186 11 1 5 -7 -8 -8 -12 -6 -10 34 -10 3 -7 -23 -12 0 2 10 47 6 13 4 20 9 12 5 20 4 27 32 -1 -3 5 -2 -16 -9 15 -33 16 -4
7225 -4 -10 -12 -1 -8 13 -19 3 -13 7 -20 -6 5 -17 -10 -14 -5 18 14 -34 16 1 5 35 9 17 18 -32 23 13 18 13 -9 7 14 32 -22 16
7262 16 21 17 -4 12 -2 -6 14 -9 -13 -13 0 -6 6 1 3 32 1 -2 -4 -1 -25 0 8 3 -26 -4 31 8 0 7 10 0 -3 6 -8 14 2 -9 -23
7301 -23 -4 31 3 8 -5 -9 -17 9 -8 -7 -8 7 -10 4 -11 7 1 14 25 15 -4 -7 -22 -35 -34 -20 -17 -6 -6 -18 -19 8 20 -22 -7 21
7337 21 -1 -36 -12 -7 -5 9 0 0 -14 -6 -12 -5 -8 18 2 33 8 29 -16 -10 1 20 29 -1 -12 -6 21 -1 13 -10 8 10 -2 9 -42 -31
7373 -31 -18 4 2 -8 19 18 -8 8 1 -16 -10 -6 0 9 15 -2 24 -22 9 1 -16 17 17 10 21 -18 5 13 -3 -9 0 37 -10 10 16 19 -12 -13 16
7412 16 23 -22 -20 -7 -16 -1 -15 -12 -7 -19 -12 6 19 -23 11 32 17 7 -1 -16 -5 -10 6 -4 9 -4 -17 31 17 4 -6 -1 -2 12 9 45
7448 45 17 7 16 22 19 -10 -4 4 4 12 -8 6 -1 10 3 -13 -5 15 -8 -9 -12 4 -33 2 1 -10 -14 -29 2 -17 -2 5 21 5 20 10 -8 -2
7486 -2 1 -19 8 1 18 8 -11 -2 1 34 -10 -17 -20 14 2 -13 2 27 15 -7 14 4 -7 9 10 -18 -15 -2 8 -8 -6 -11 20 0 17 -38
7522 -38 -46 -12 6 33 24 -3 -19 -6 -14 26 9 -1 -3 17 -2 15 23 -15 18 15 -11 29 -3 -24 2 -23 -5 0 -12 20 2 20 -12 8
7556 8 -2 -11 -16 -16 -8 10 -26 -2 -6 -20 3 5 10 22 -30 3 -3 -3 20 2 1 5 0 -8 -2 17 44 29 -11 8 0 19 28 13 11 24 7 -4 8
7595 8 -2 21 -13 21 -5 2 -7 6 -8 -4 -15 -1 5 -4 10 -23 -28 -9 21 -10 11 -6 -10 18 20 10 35 4 -3 2 26 10 -2 7 1 -11 13
7632 13 -29 16 22 12 33 -23 18 -5 -2 -41 26 13 2 -24 -7 7 10 -4 -3 -17 -5 28 -19 -26 -20 -1 -40 -12 14 17 25 -1 2 -4 25
7667 25 -10 -20 -6 -6 21 46 -10 -9 -3 30 18 34 27 -15 -12 15 8 -12 -12 -3 14 -8 -16 16 11 10 3 25 32 -23 0 -3 8 -23 -11 -6 18 -1
7705 -1 -10 12 22 0 27 -8 -4 16 6 11 17 -13 31 -3 -4 26 6 33 -5 17 -8 -10 -3 -4 -8 -5 12 21 -1 8 9 -20 1 -8 1 -6 7 3 -10
7744 -10 20 13 -23 22 -20 -25 1 -29 -9 -13 -16 10 5 2 -24 -22 -2 -15 18 1 12 28 15 -4 26 13 6 -13 -16 24 20 25 5 0 6 -11 2
7781 2 -1 -23 -7 -32 -12 10 20 10 -6 -20 15 -21 7 7 -12 9 -4 -5 -10 -31 23 29 -9 -8 14 5 -15 -9 14 29 3 14 16 7 -6 18
7817 18 35 -3 -4 4 18 9 -2 -9 -14 24 -4 9 -10 -17 -6 -7 -5 4 32 10 -21 -7 -14 -24 1 -4 -8 -21 14 -1 -21 10 -7 -13 22 0 0
7854 0 -13 -7 27 -28 -21 1 -29 4 -5 3 -23 7 0 8 14 -12 3 -3 -17 6 0 -16 4 -5 -18 -16 -5 -17 -17 1 -3 -15 0 -32 -19 4 -4 8
7892 8 -12 -38 -10 -18 36 -12 22 12 1 31 3 18 15 11 -15 -23 22 -27 18 2 0 2 -3 18 -8 6 46 8 7 9 37 -18 -6 -22 20
7927 20 4 -29 -13 -21 4 15 11 -7 -5 -13 5 -8 7 19 -6 8 -15 -15 12 22 -6 40 -30 20 -4 -17 4 -3 30 15 16 -28 5 10
7961 10 40 0 14 7 16 2 9 7 26 -9 -8 22 2 -2 9 22 -7 40 -22 9 -6 -2 -32 12 17 -6 7 7 -7 -13 -11 29 14 -10 12 -22
7997 -22 21 -4 9 -8 -20 -1 16 11 -6 0 9 25 6 21 32 4 21 -1 39 -16 -10 18 7 3 -18 -8 -24 1 -4 -7 -7 2 -6 16 14 -35
8033 -35 8 0 -23 5 -19 3 11 -4 -5 -3 14 28 9 -6 1 -2 -7 8 22 6 9 -6 -8 2 0 13 25 -4 -13 22 -2 -12 32 5 6 -9
8069 -9 15 26 -26 3 -6 -9 4 -13 9 10 -2 1 1 12 13 -27 19 -9 26 -10 -3 -16 5 6 13 18 8 23 39 5 9 24 6 4 13 3 -5 5
8107 5 17 26 26 9 -9 2 -25 6 -16 -8 -1 -18 14 -15 6 -16 -2 24 3 20 -15 20 -7 -4 21 20 -2 6 2 21 22 17 28 32 8 18
8143 18 29 13 18 27 -7 -8 -11 -23 3 -23 -2 11 -28 7 -11 -17 -15 11 23 3 -8 -14 7 -23 -5 -13 -6 -22 24 -29 -15 -3 0 10 -10
8178 -10 9 4 22 35 14 -33 9 -7 -4 -9 -7 8 26
8191B6
$$ Imaginary data points
##PAGE= N=2
##DATA TABLE= (X++(I..I)), XYDATA
0 0 0 0 0 0 0 0 0 0 0 0 0 0 0 8 -8 8 -8 8 -16 16 -16 24 -24 32 -40 40 -48 56 -64 75 -88 96 -112 128 -144
35 -144 160 -184 203 -228 256 -283 315 -351 387 -429 474 -523 576 -635 699 -770 850 -937 1033
54 1033 -1139 1263 -1400 1559 -1744 1957 -2216 2530 -2923 3430 -4116 5099 -6629 9346 -15650
69 -15650 61069 -28345 -108986 58833 8732 -40140 45194 40206 -57369 -22670 13519 14041 32757
82 32757 4119 -50631 -3205 22384 -8875 15552 24726 -44716 -26427 38162 8575 -15137
94 -15137 18894 -11070 -35287 18407 26244 -16677 -3856 812 -25110 3731 30531 -8660 -17813
107 -17813 7241 -6503 -9601 18520 5491 -18144 -3024 2145 -4498 10761 6731 -15806 -4800
120 -4800 8506 -4126 680 10506 -7736 -11653 7446 4404 -4343 3964 47 -8988 2038 7040
134 7040 -2031 -105 1523 -5798 -360 7249 -782 -3221 3006 -1391 -3474 4977 3307 -4020 -669
149 -669 1763 -1354 1474 2951 -2025 -1465 1660 -597 154 2888 -779 -2579 1552 1274 -1030 1107
165 1107 880 -1966 -134 1766 -163 -211 702 -846 -535 1257 171 -608 510 -239 -858 869 694
182 694 -847 -92 422 -557 18 756 -318 -577 251 -81 -220 404 -46 -539 143 115 -277 143 135 -435 -90
203 -90 253 -133 -71 148 -227 -188 209 37 -184 111 16 -204 102 117 -167 -22 71 -87 11 141 -74 -61 48
226 48 -34 -28 87 -38 -89 54 5 -29 74 40 -94 1 83 -20 -16 33 -5 -33 58 27 0 4 -2 16 43 2 -13 11 23 -20
256 -20 -10 26 -36 27 27 -24 11 21 -6 -2 1 -16 -39 23 -13 -39 3 -15 -18 21 -5 -7 -33 2 -38 5 6 21 -7 -12 2 -14 -25 4
290 4 -2 -13 8 -18 1 4 2 -6 10 -4 -23 16 38 6 -2 0 22 -1 10 8 -4 33 33 -5 -16 22 6 7 3 19 10 23 26 -4 -1 -9 -3 1 -1 -27
330 -27 -6 -7 -6 -12 2 2 -20 24 26 -10 12 3 11 3 -2 -4 10 13 10 -11 -25 25 4 -8 -3 18 -19 8 -1 4 -20 -13 -2 14 -20 -34 11 9 -11
369 -11 -4 11 -8 -2 18 1 -2 -27 -14 -32 -8 27 3 -2 11 11 31 10 4 -18 -14 -13 -2 20 8 9 6 -13 -6 0 12 0 0 5 12 -14 3 4 -1
408 -1 15 -4 -6 0 10 -10 -13 1 4 16 -17 11 0 1 -1 -3 9 -15 -11 -9 -4 3 1 22 -20 12 16 17 7 -20 37 -8 14 1 -11 10 9 3 5 -7
448 -7 -17 -10 4 28 9 0 -12 -6 -14 9 -5 -13 1 -4 19 -2 -4 4 -25 23 -12 13 11 4 -12 7 -17 5 14 -1 -10 18 9 8 -9 3 -7 -36
486 -36 25 -14 16 -10 6 -16 -17 32 3 -6 4 19 -5 3 10 35 27 -13 19 13 0 8 6 10 -1 18 26 8 1 -11 24 10 3 -1 -3 8 22 -3
524 -3 27 25 13 -3 -14 13 -8 14 -24 1 -11 27 -8 36 9 3 12 14 -12 -11 18 13 5 -5 -1 -9 27 6 0 -4 5 -3 -4 -11 5 2 3 11 -30 4
564 4 -11 5 6 3 11 19 -12 6 -1 0 17 -5 -5 5 -8 2 -12 4 4 -8 0 7 -19 9 22 12 -4 -5 0 -12 -14 4 1 -5 9 -11 -16 -17 -6 14
604 14 -11 -10 10 3 -16 10 -28 12 -23 -4 -15 10 -19 6 12 32 14 11 19 -8 8 6 14 2 7 17 15 -13 8 11 15 32 8 -13 -19 24 -17
641 -17 19 -6 -11 -11 16 -1 -6 -22 34 19 2 -7 9 -7 -3 5 7 26 -6 23 23 29 16 4 -32 -33 -16 -7 13 0 3 22 -5 -23 -8 -9 2
678 2 22 8 5 17 25 32 -7 17 0 1 14 -2 -3 1 21 4 3 -52 -16 -12 -9 -15 1 8 -8 -14 0 13 2 8 -15 12 7 15 27 9 11 17 23 30 7
719 7 -12 10 -27 23 -4 -19 -6 -18 -9 -8 26 -32 16 5 -2 40 9 14 14 -15 32 19 -25 14 19 -14 0 -4 -3 -17 -10 26 14 5 8 -12 -26
756 -26 -15 8 -2 13 17 -2 10 -21 -26 -9 -5 3 25 -6 -19 19 34 -6 2 -10 6 -1 27 -8 -1 10 -16 -14 -3 -9 1 -18 8 9 -1 -4
792 -4 1 4 -24 4 -10 26 -26 17 7 7 -4 5 2 -19 0 1 -7 -21 0 -3 2 16 -23 14 9 -21 8 1 0 -22 5 -43 17 -4 8 -9 -10 18
830 18 2 -11 -10 21 0 0 -3 -30 -16 12 2 -21 -6 -16 -32 -10 9 12 3 6 9 27 -5 16 2 25 -3 -16 13 0 3 13 -16 0 22
865 22 8 25 -16 2 -6 7 -13 -4 18 4 -24 3 -3 -15 -23 0 1 -11 -11 -11 -39 -13 -21 13 -14 27 -16 -11 0 43 24 4 22 24 -1 -4
901 -4 6 -7 7 26 -8 -1 12 -28 -14 4 -17 13 -27 -7 18 2 2 -33 -1 -14 -6 -10 -19 8 -31 19 -5 17 -10 1 -11 -16 -29 -7
935 -7 3 -8 -15 2 3 -23 -28 24 -19 11 15 24 -9 15 20 -4 1 -13 3 16 0 -18 8 22 -12 14 1 5 -4 -16 18 -5 -30 2 7 -5
971 -5 23 -6 -2 7 -22 -7 -1 -11 22 13 -11 6 12 6 8 0 0 -4 -8 7 -4 26 6 -7 -9 -7 -18 2 -15 17 -14 0 -4 -2 -4 -5 -8 -1 16 -27 -5
1012 -5 0 5 12 20 28 -22 -14 -22 -10 -3 -16 -14 -51 12 -7 -19 -20 3 -3 -2 9 -9 22 5 -6 15 2 -3 -11 5 -8 6 -14 -21 10 9 -9 -19 11
1051 11 3 6 16 -31 11 -4 -3 -19 7 20 1 15 5 1 3 -19 0 -19 -13 -17 -8 9 -8 -2 21 0 -4 -4 11 -15 26 26 -24 19 16 14 5 3
1089 3 -1 1 -6 33 -4 12 1 11 -11 5 12 -9 10 10 -17 -16 -14 1 -3 -3 -22 -21 5 -3 5 -7 3 8 -3 9 8 -5 -7 -11 -17 -5 -7 20 -11 -10
1129 -10 3 -5 -7 9 20 -1 -9 -15 -8 -15 -18 6 7 -5 -17 -4 -4 -9 14 0 -23 18 43 9 7 -9 5 4 -23 -10 -34 -6 -7 -17 2 11 1
1166 1 -5 14 9 -8 -1 -13 27 18 -11 6 -10 -3 4 2 -27 29 -3 -15 32 -3 -7 6 7 -6 -6 15 -3 1 -10 -33 -22 -14 -3 11 10 -11 -5 9
1204 9 -1 -27 5 -15 -13 5 15 -10 -8 -21 -24 12 -18 -5 18 25 7 -4 8 -12 11 -20 17 -25 10 -19 8 -13 -10 9 20 -8 11
1237 11 -9 0 -5 -8 11 -9 -11 -40 7 -3 4 -7 -1 -22 2 -26 -17 -1 -3 3 -13 20 -38 27 -24 -8 8 -20 10 -4 9 -2 6 -21 7
1272 7 17 4 12 22 -16 3 -2 31 16 -15 6 -4 -5 -21 -3 -14 13 22 1 -7 7 4 13 -3 -27 12 -6 -15 -2 20 10 1 2 -4 9 4 3
1309 3 12 23 10 7 0 10 -4 -13 3 6 2 -17 -7 8 16 -17 7 13 -7 -12 -14 16 24 21 17 21 25 -1 11 -18 -11 4 9 -12 -24 -7 10 1 -34 15
1349 15 -9 -25 10 20 15 15 -34 -17 -4 7 21 17 19 6 2 4 24 9 -1 17 10 25 -18 -13 13 -4 -2 4 -4 7 -8 20 16 -6 6 4 14
1386 14 8 -19 14 22 4 0 -15 -2 14 29 -1 -2 -21 10 -26 25 5 -2 -3 -5 34 4 1 -17 4 16 -18 -12 27 31 2 5 3 -7 -13 0 -8
1423 -8 4 10 29 -1 -10 -19 7 -16 -8 -15 -6 -20 8 8 -21 -11 -8 -21 -28 -6 12 5 14 -9 -13 1 11 -5 19 14 -8 5 -24 -1 -25 1 0 -5
1461 -5 -8 25 -1 -7 33 -8 13 -10 -7 -2 12 -10 3 17 20 -31 -7 -22 -22 -1 6 7 -37 -4 -37 -6 14 -12 6 -12 -10 -19 -1 3 -3 -24 5
1498 5 -14 -26 -2 14 -7 -16 22 -21 -12 41 13 -14 10 15 4 19 -1 -9 3 11 15 -2 -22 -13 20 -11 -8 -19 1 15 4 -15 -20 -19 12 -9
1534 -9 -10 -18 -43 0 3 17 -9 -28 -6 19 -11 -7 -6 6 -14 -18 3 2 15 7 32 12 -11 12 35 18 -15 12 -7 8 2 13 -3 34 -5
1569 -5 15 -2 3 -17 3 21 -20 -19 -16 21 22 4 -5 -10 13 -10 -3 32 33 -40 -18 9 -10 7 -2 -6 33 6 11 -7 4 -12 17 -14 -2 12
1605 12 29 12 -9 8 -6 19 -7 13 11 -6 9 -8 -12 -10 29 -26 -11 14 -1 10 6 10 -1 6 -24 -14 15 -1 23 1 -2 4 11 36 11
1640 11 2 12 2 -15 6 -17 0 7 11 -11 4 17 4 1 1 -3 -20 20 4 6 -9 22 -19 0 -14 -18 22 -20 13 14 23 0 -31 -3 -6 1
1676 1 -17 -15 0 -22 23 -5 -17 15 -2 0 -10 7 -19 -13 2 -1 -34 12 -2 -8 18 -9 -6 12 -18 -19 0 12 -12 28 7 -18 18 -8
1710 -8 -2 6 14 -24 -41 2 4 -32 -17 -16 -12 1 16 -17 -14 -14 -15 9 -16 5 -11 -23 26 -14 -14 7 5 2 -1 9 -5 -15 13 22 13 3 -16 -11 23
1749 23 3 22 -20 -5 16 1 28 -20 12 -6 -3 6 6 2 -1 -27 -10 15 7 7 18 -18 -17 -4 7 4 -5 8 -16 -9 18 3 10 -14 5 3 -9
1786 -9 7 -50 13 9 -9 5 8 -11 -2 4 -14 -1 5 23 -15 -26 -13 0 3 -9 9 -28 8 13 10 13 11 -24 16 -33 10 -15 19 8 20 -7
1822 -7 33 -4 -8 16 -13 14 -37 -8 16 17 0 28 14 -6 -20 11 -20 -1 9 14 11 -24 -24 21 11 -8 14 -5 -8 -5 -31 -6 -8 13 -8
1857 -8 -7 8 -13 -8 3 -15 -14 2 14 -10 -2 -16 6 -28 14 4 -1 -1 -23 -21 -28 31 -2 5 -9 3 -12 -9 5 17 -26 -4 -9 2 10 14 17 6
1895 6 22 -6 6 15 0 -11 -22 -10 -14 -25 -28 -12 -8 -40 17 -4 -15 -5 7 -35 11 1 -7 -7 7 -6 -6 25 -13 19 15 -11 16 1 3
1930 3 -10 14 5 -16 -4 13 28 -22 -4 14 -2 -2 6 11 -21 21 -12 -2 -19 -18 13 -13 1 9 -9 -24 15 -18 1 -3 -9 -12 -16 3 -19 -6
1966 -6 1 -30 -19 12 25 -11 -22 -14 -3 22 -3 16 0 -9 -10 7 11 -5 8 -4 19 -10 -36 5 -7 3 -3 -4 -4 -12 -19 -17 -13 -24 -16 28 -10
2003 -10 -23 -25 14 -5 -20 -11 -5 12 -8 -33 2 0 -16 0 -12 -2 5 -14 -4 -15 -37 -20 9 6 -3 -21 -1 -15 -18 -10 4 -36 12 1 1
2038 1 5 9 -8 -15 14 6 10 -21 -11 9 4 -5 -2 11 6 3 9 25 36 -22 5 -24 3 -2 -21 -18 13 10 0 27 26 2 -4 -14 -14 -18 -4 -5 21 8
2078 8 -44 -21 0 20 18 10 9 25 -16 -17 1 -17 -20 3 -4 13 -22 -11 13 2 -27 24 2 20 5 -4 -21 -16 10 2 2 -11 11 1 17 -4
2114 -4 11 6 20 -11 -1 -7 -1 28 3 13 -23 -13 10 10 -15 14 -18 -32 18 -12 18 -30 -23 -11 -45 -16 11 11 4 -11 -29 29 33 -15 21
2149 21 5 9 16 14 9 21 -1 -13 8 -3 2 -4 10 -8 -7 11 -16 -11 -10 -11 23 14 -2 -24 -9 -1 -30 3 -10 -15 -2 7 -8 21 -7 -2 -28 -22
2187 -22 -19 -6 -48 -11 0 2 -31 -5 7 4 -6 12 21 11 -10 -15 3 -15 0 4 -12 11 -7 6 -21 11 13 -12 13 -11 10 -16 3 -5
2221 -5 31 21 5 8 19 -15 0 -14 39 3 -4 16 17 12 5 -3 9 22 5 7 10 20 14 2 5 12 -5 -11 22 -8 -35 0 -33 -26 1 -1 40 16
2259 16 -2 -32 10 10 33 -9 -45 -17 -17 3 -8 4 -26 5 11 -13 -23 -37 -3 10 -15 -30 -29 -1 -37 -29 -16 3 -11 12 -1 -4 -18
2292 -18 -12 -10 11 6 -3 2 25 24 -11 19 -1 -24 -14 -5 -1 18 -11 -1 -14 -37 3 22 -9 14 -14 3 9 -14 -13 24 -5 -5 6 -20 1 -6
2328 -6 7 -6 7 4 -7 1 -8 -20 12 -5 1 2 11 -4 -22 -8 -29 5 16 31 -1 -11 14 -15 -9 -3 8 12 14 -41 7 18 -2 -25 -10 0
2364 0 5 -7 8 4 -9 6 -5 -20 -6 -6 -5 5 13 7 -6 -2 -19 8 -22 -9 -11 12 21 14 -9 -8 17 20 -19 -14 4 12 -29 -13 6 -9 33 24
2402 24 6 -8 43 -11 -16 13 -5 4 19 6 11 -10 -20 -2 19 -9 12 -24 -20 -28 -40 3 6 18 -25 14 12 11 26 -2 -11 14 27 8 -8
2437 -8 -2 -24 7 15 4 -2 -10 19 8 -7 -14 2 13 -16 8 9 2 -14 9 19 -25 23 21 4 9 9 -14 19 10 -14 -16 0 -3 -21 -7 -5 7 11
2475 11 3 -8 -11 28 7 -8 -1 -5 -8 -1 5 -1 -17 -5 -9 18 -4 7 3 3 -5 -11 5 -1 -18 26 -11 -2 14 -20 19 -11 23 8 28 -2 -1 -4 -15
2514 -15 1 -19 11 0 -1 -22 11 -3 -16 9 -4 -16 -14 4 13 -21 9 -9 10 17 17 -4 -25 -27 9 5 -6 -19 20 -10 -12 -10 -28 14 30
2549 30 20 -10 3 -10 19 -18 7 17 -23 -9 7 -22 7 7 12 2 -6 5 -23 28 2 -8 -2 -16 9 -7 -5 13 -27 -14 -1 10 11
2582 11 3 5 -17 20 8 19 4 -8 15 -4 -7 -10 -25 -3 0 -10 9 4 10 -21 -13 0 -8 0 -8 9 -14 -8 -26 -3 -15 -19 -7 20 -22 -3 -23
2619 -23 -22 -26 -13 -11 0 -1 3 -34 4 -25 -12 -24 -14 7 22 25 -10 31 1 3 8 0 2 -18 -2 -5 -16 21 -13 -10 13 -8 -5 -24 -9 1 6
2656 6 8 21 -4 -33 10 20 2 -29 9 -7 -15 16 30 1 8 11 -6 9 20 -21 -15 5 13 -11 -17 3 -4 13 4 -1 13 -10 6 -13 1 2
2692 2 -20 22 -9 1 -23 10 -1 -23 10 10 -1 -36 -4 6 18 7 16 14 -12 14 1 -15 -9 27 0 -2 20 -2 1 -10 2 7 24 16 19
2727 19 15 18 8 4 17 5 -16 -14 -22 3 -10 5 13 -14 7 -28 2 -8 -22 -8 3 -30 -14 1 -4 5 -7 -1 -5 2 9 -22 6 -3 12 -14 -17
2764 -17 19 5 16 -5 -12 31 -13 -7 7 8 1 -8 -7 -10 -9 -11 5 17 -2 -4 5 42 14 18 13 1 31 -25 -26 -5 -13 5 24 -8 -3 -17 -24 8 30
2803 30 -8 -1 5 -1 8 10 8 -11 12 7 7 6 -7 -4 3 26 -5 1 9 -5 1 -7 -1 19 -18 3 9 27 2 -3 -15 15 4 -4 8 11 17 7 -21 -2 29
2844 29 -5 6 10 -7 4 -15 -23 -1 21 -10 0 -3 30 22 23 -3 17 5 47 19 5 -12 18 6 -17 27 -29 23 -4 16 19 2 36
2877 36 4 -2 -8 -11 -2 4 -9 -14 -6 25 -11 14 0 0 5 -21 2 -14 -21 -2 -1 -13 -11 11 4 4 -23 9 15 15 23 -12 7 5 21 -13 21 -11 7
2916 7 -15 18 13 4 -1 -2 37 -2 -10 -24 23 -8 0 14 -29 -11 6 -18 0 -9 1 -20 -35 -5 13 -23 -16 -5 6 -12 -19 4 -11 -1 21
2951 21 16 -5 15 35 24 -6 21 14 7 -8 27 -14 -22 5 -20 -11 -17 17 2 -26 -22 5 11 12 -6 13 -29 -29 28 9 9 9 22 -7 -9 -8 -12 15
2989 15 3 15 -10 -5 7 7 16 -5 -4 18 6 -15 -39 2 -13 8 -39 12 -13 3 -40 -5 19 -11 16 1 -21 6 15 -16 -28 -22 26
3022 26 -1 -7 18 6 -19 -24 11 -18 -4 21 12 13 -19 5 7 -7 5 -2 -14 -2 -15 34 14 24 14 0 2 0 -18 -14 -1 14 9 -13 7
3057 7 3 -1 4 -20 4 -12 5 11 7 3 15 -6 -5 -12 2 6 11 18 -8 -20 -7 -22 -14 -8 -6 -27 22 25 18 -3 23 -6 4 -13 22 18 -20 3 20
3096 20 12 22 -22 18 -12 4 14 5 27 -8 0 -8 10 -1 13 -10 -4 0 -2 -14 10 2 -16 8 23 -11 -12 -1 -9 -12 34 7 -5 -7 27 -12
3132 -12 -21 -22 -16 -5 -7 23 10 -7 6 16 -13 10 3 6 -6 -4 -14 -5 2 15 16 -15 20 -2 15 5 -12 -18 32 38 14 5 -24 -36 2 -4 -8 -19
3170 -19 -2 8 16 -32 -12 9 8 1 2 16 12 -7 -5 13 11 22 2 -1 45 15 16 8 25 -9 -8 -10 12 -9 6 26 -8 5 6 1 11 -6 -13 10
3208 10 5 -18 -22 -13 10 -15 -18 16 -3 2 13 -16 -1 37 5 21 26 30 13 38 21 -4 8 -29 -1 -6 -19 1 8 4 -10 -6 -10 6 -30 7
3244 7 4 -23 -27 4 11 9 24 20 10 -5 15 6 2 -6 4 28 -5 5 4 -13 29 12 -19 2 -13 5 5 -3 -8 22 -6 -2 -34 14 3 -5 20 -21
3282 -21 -13 -4 24 8 4 0 15 -29 18 7 -20 -13 7 -4 -14 -12 6 20 15 -7 -3 -18 -9 12 5 -5 5 -9 1 5 -4 8 -8 -1 -2 11 14 -10
3320 -10 -6 8 31 -43 2 20 11 21 0 16 26 -1 -16 -2 11 -12 -10 28 2 -7 11 7 -25 -9 -6 -6 -12 19 13 4 1 3 -16 11 1 1 13
3357 13 -12 -19 4 -17 -10 19 -1 13 29 18 -13 18 34 7 8 -9 -18 -10 -17 -12 14 -12 13 -6 0 -5 -2 29 -29 5 -5 17 -22 -14 -30 -32
3393 -32 -7 -14 26 3 6 10 -4 13 -15 1 2 13 2 23 19 12 21 1 12 -13 0 -5 37 -9 -19 -4 -8 -12 0 1 -10 14 25 12 -7 -24
3429 -24 10 8 6 -6 6 -22 1 -3 0 2 -2 -4 5 5 -1 4 17 19 6 -9 13 20 -8 -20 16 3 24 -3 3 -3 9 1 -4 10 -3 23 -14 12 16
3468 16 -10 -8 -5 1 8 3 -16 10 13 25 3 6 21 -8 -17 8 -2 -26 -8 -12 7 7 4 -18 23 2 3 6 12 36 5 19 12 -1 41 8 2 -25
3506 -25 -10 12 20 8 12 31 30 -4 33 19 5 7 -2 15 27 -2 22 10 -7 -13 -19 7 33 16 12 27 29 -9 5 -5 6 23 -5 -24 36
3541 36 16 4 -8 -5 9 10 25 -4 11 32 -10 10 -8 -7 36 -1 -3 3 2 47 29 -3 7 -29 13 -3 4 0 -9 -14 -9 -22 6 16 15 24 15
3578 15 1 -24 -7 11 7 3 10 10 -5 -18 -3 6 21 6 13 22 1 29 7 6 -8 6 28 20 2 -11 33 20 -4 -16 1 16 9 -4 6
3613 6 1 -24 0 -10 -15 32 -11 9 -2 -10 8 -9 15 14 0 11 9 -6 -11 -12 20 37 24 37 1 31 -23 -11 20 25 13 23 13 17 -23
3648 -23 -9 15 -3 23 15 -38 2 9 6 23 6 -1 -9 -1 16 -10 -19 -19 15 18 22 10 -3 0 21 2 27 -10 2 -3 -8 0 11 -6 -7 -4 2 16 -8
3687 -8 1 -20 17 -3 18 7 8 12 13 -5 10 2 8 -11 16 5 25 11 17 7 1 2 -11 2 2 -15 -19 8 -9 8 28 -18 -8 -3 18 -3 -8
3724 -8 2 19 -17 12 13 7 18 28 26 -17 -8 5 -18 -4 -13 4 -59 -4 -1 7 20 -13 -5 17 12 24 -17 19 -5 13 10 -10 -31 -1 6 6 10
3761 10 -4 4 20 -14 -10 25 -13 -12 7 -8 -10 14 10 -8 4 23 -4 1 -8 36 -11 4 5 16 5 20 4 1 -11 5 32 30 12 20 4 -16
3797 -16 18 0 -3 1 9 1 8 -34 -44 1 19 10 13 2 -7 -24 -26 -2 -19 -10 -15 -5 3 1 4 18 -7 -22 21 3 18 -16 8 -6 -29 -4 18
3834 18 12 19 7 -1 -3 -9 26 -4 -14 -8 7 -9 10 -20 5 3 10 4 11 13 9 -12 25 22 4 3 1 -12 7 25 15 15 -15 5 -4 -7 2 34 1 7
3874 7 9 19 22 7 -4 10 5 3 5 -13 -5 11 34 21 -8 11 22 23 -31 -4 -11 31 -11 20 13 -5 23 18 14 -14 25 13 12 7 35 5 -22
3911 -22 32 -7 4 7 23 35 -7 16 -13 -7 18 -3 0 47 18 29 38 19 3 8 11 2 -12 -13 10 -1 20 16 21 12 -18 -22 4 -4 6 -7 6
3948 6 -6 12 10 19 -5 3 0 -1 1 -9 14 14 10 4 -8 8 10 1 -22 14 19 -9 0 10 8 12 21 1 4 10 4 -8 -6 4 -9 23 30 30 20 -10 -9 7
3990 7 -21 -33 -2 29 -2 -10 7 -3 30 -22 0 15 11 22 15 4 6 9 -4 -17 11 8 26 5 0 11 19 -12 14 21 -34 -2 12 -16 14
4025 14 18 7 -7 32 22 2 -23 -11 -14 -3 3 16 13 4 -5 -24 0 -1 -25 4 -22 -2 -20 4 -5 -14 3 -40 29 8 6 -25 -24 7 1 -12
4061 -12 5 -23 11 7 0 13 2 4 29 -17 31 4 0 32 12 -15 11 3 22 -5 22 -3 4 -3 11 9 9 -4 12 -16 25 23 4 -11 -20 3
4097 3 -6 -31 -4 -3 0 15 11 -9 -4 21 -4 -12 -6 20 -13 6 -4 -17 4 -16 21 13 17 24 -38 -2 -23 -2 -2 -17 12 33 1 16 -13 8
4133 8 -11 3 -16 23 13 1 6 8 -6 -5 -5 3 9 -32 -13 4 -10 32 -22 -2 9 -7 15 10 -13 -15 -10 -1 -10 13 29 -4 1 -4 21 -9 17
4170 17 25 0 -3 -32 -20 28 16 4 19 -19 11 -8 -21 31 13 11 12 15 -9 4 26 -11 -9 7 13 4 25 15 35 17 19 7 13 -12 15
4205 15 26 -10 30 -14 8 19 18 -7 -8 8 7 -12 26 4 15 -10 17 1 -27 5 -4 -4 -2 2 22 -19 14 19 29 12 9 1 18 -1 19
4240 19 4 16 21 -10 4 -4 -8 0 -3 5 14 8 14 30 12 13 16 -2 -22 9 -7 -34 15 -9 37 0 6 17 11 -22 -6 -21 12 1 -7 -27 -18 2
4278 2 -18 4 -19 9 2 20 -10 0 19 9 0 1 25 15 13 -2 -6 10 3 5 16 -7 -3 1 16 -19 3 16 -15 -3 -13 30 10 7 -6 11
4314 11 6 -16 -4 -1 -32 -22 4 -14 -21 -11 -18 -9 -24 -2 -7 -7 4 -9 -13 13 7 0 11 0 9 -2 4 12 -12 -1 19 -3 8 4 5 3 4 -1 9
4353 9 5 26 14 35 14 3 19 -2 -6 1 7 -15 -9 -9 -7 -20 25 -3 -4 12 18 9 17 2 1 20 3 1 15 -1 -7 11 9 19 20 8 34 8 6
4392 6 6 34 -24 -6 -4 -13 -2 8 8 28 20 21 12 5 7 15 17 -15 0 29 0 4 10 19 -27 17 27 -2 23 20 20 8 14 -30 -5 -1 -9 21 -12 -8 5
4433 5 -2 1 -11 18 24 0 4 -38 8 11 13 8 8 6 15 -13 34 15 -9 -16 3 2 -6 5 37 -21 18 7 6 -3 -27 13 -1 -3 -22 5 1 11 -21
4472 -21 -3 -3 -1 -14 15 -29 11 12 -8 13 3 -2 -16 19 4 10 17 5 10 -20 13 10 12 2 12 16 -6 -5 2 41 19 4 10 -3 -20 12 -15
4509 -15 10 12 -1 41 -14 12 28 5 34 17 3 4 7 -2 -13 -16 -21 23 6 -8 -2 -19 21 -4 29 -20 25 18 4 14 4 -12 -11 -14 15
4544 15 10 13 -12 -22 1 10 -4 0 9 4 -37 0 10 9 -9 0 -6 -3 17 11 12 -31 6 -2 -10 10 -3 -10 -11 -6 7 -26 -16 -4 -19 -4 19 -23 12
4583 12 15 12 -12 8 14 24 4 8 12 3 1 36 -16 19 7 -16 2 6 -22 -10 2 -53 -12 2 2 -3 15 -5 27 -7 -19 6 -6 6 34
4618 34 -26 -3 2 -36 -17 31 -13 -20 -2 3 -2 -4 -14 14 10 -9 2 26 -13 12 -16 -19 1 7 38 6 17 -6 -12 -17 10 3 4 47 -15 -1
4654 -1 3 -10 11 10 -9 9 1 -2 15 2 8 -7 -5 7 10 -2 -2 -27 -20 11 0 -14 14 -6 -4 0 -14 15 -8 17 11 11 6 23 -9 -2 -4 -1 7 -10
4694 -10 -11 28 12 -1 -5 -14 -5 -3 -20 -31 13 -12 -6 4 -12 -9 -4 -10 -18 12 6 5 -1 7 3 11 14 2 3 0 6 -5 3 -11 -5 17 14 3 -6 8 10 -12 -36
4737 -36 -18 11 6 11 16 10 3 -14 16 17 -22 -22 -13 16 -20 0 -6 -11 0 15 -11 11 2 33 -20 18 3 21 12 4 7 -1 -16 -6 -4 4 11 6 -1 -15
4777 -15 0 13 5 -20 10 -17 3 7 -4 -1 3 -7 16 17 -1 2 -24 18 -3 -2 14 27 17 -18 5 -10 0 9 14 -15 16 -5 32 5 25
4812 25 -12 2 -15 -3 -5 4 17 -4 15 12 24 15 -11 -19 17 9 9 9 -3 -14 24 15 -5 -11 -8 -3 -1 30 -23 3 4 3 -11 -18 3 -2 29 3 29
4851 29 23 -7 26 2 9 -4 0 5 9 -21 18 23 -13 22 0 -16 11 15 19 -6 10 -20 -2 -6 -7 7 3 14 2 -22 -13 -4 5 25 -6 -10 -7 -8 -16
4890 -16 -33 31 15 4 -10 -7 -17 11 2 11 12 -18 0 4 -1 7 -4 7 17 -11 9 10 4 14 14 20 21 -6 13 -7 8 -2 -12 -13 4 15 24
4927 24 4 -35 -11 5 6 3 10 21 16 -1 -11 -8 28 11 14 -7 6 -12 13 -22 -18 3 9 -14 -4 -1 -19 10 -12 11 24 20 27 10 -5 -6
4963 -6 -3 -11 -19 10 3 -18 0 31 -11 16 6 24 4 10 1 16 -19 16 22 1 6 15 -6 -4 -5 -3 16 13 -2 -27 5 -5 14 12 -1 3 -11 -7 1
5002 1 12 -22 6 -18 7 -1 -20 -15 -11 5 13 -22 4 0 6 33 10 -17 41 6 -1 15 2 15 1 -15 14 27 -8 4 -7 -18 7 4 3
5037 3 0 -6 -29 10 -13 17 24 26 9 -34 -32 21 9 21 3 -3 -8 -26 1 10 -7 13 20 10 9 19 17 25 26 23 -6 5 -7 -6 1 6 7 -10 0 11
5077 11 -17 3 -13 14 7 -6 -14 -8 -15 -3 8 5 -8 -14 -5 18 13 20 14 -4 4 27 -5 4 -2 -21 -13 5 12 -27 -1 -2 -5 3 16 0 25 -4 3 1
5117 1 1 -11 -8 -9 4 25 2 -36 -29 -6 0 12 -10 24 -22 -3 -18 6 -23 -2 17 -2 -5 -14 -7 -9 9 14 -2 17 -9 -5 -13 11 6 20 -27
5154 -27 -35 28 -27 22 -1 -14 -6 -9 -20 18 -10 2 11 22 9 0 15 -12 14 8 -4 -10 -18 9 1 -13 14 7 11 -29 -4 -11 2 13 -11 19
5190 19 15 6 1 -27 4 24 -9 -13 0 -6 1 -29 -8 -20 -1 -9 8 -19 19 -19 -12 18 21 -10 -8 -3 32 -23 -2 24 -13 8 -6 14 -18 12
5226 12 17 -14 9 10 24 7 18 19 22 -18 -10 12 12 -1 -11 27 7 2 -4 -5 -6 13 4 -17 12 9 -4 -24 -1 9 -30 -11 -13 -28 16 0 -7
5263 -7 18 7 11 3 3 20 -16 -2 4 -1 -40 10 -30 -31 0 9 -2 -4 -16 -11 -27 5 -11 13 -27 -13 34 -15 -15 0 -5 12 -5 -24 12 7 -16
5300 -16 -23 -9 5 0 -16 3 15 -6 -5 -16 -18 -4 -19 13 0 5 -9 -13 22 7 2 -5 -3 -18 -4 -2 16 3 1 -21 2 10 -25 10 4 4 29
5337 29 9 -7 8 12 5 2 6 -1 -9 3 31 -14 20 18 -3 7 20 -11 22 15 -27 16 26 11 -13 11 -4 -11 8 22 24 -10 29 14 22 32
5373 32 35 -13 -20 0 40 27 29 19 -10 -13 7 1 -2 33 -8 2 6 -14 15 -5 -4 -19 -2 -10 -2 17 21 11 -9 1 11 -5 10 23 -2 18
5409 18 6 0 -3 5 2 19 1 6 6 5 24 13 14 21 14 0 7 23 5 3 5 10 -17 -8 27 8 2 -5 18 6 -38 4 -8 -8 7 4 -5 12 4 -23 7
5450 7 1 9 4 4 10 -10 -1 -6 23 17 -11 9 15 4 -4 13 10 14 25 7 10 6 11 30 -18 15 -7 24 3 -12 2 -15 4 -3 -2 -24 -12 1 6 7
5490 7 -9 14 0 -8 27 20 7 13 19 -18 -6 11 -5 24 -7 11 -18 -19 9 -10 -5 -25 16 -15 11 -8 10 -6 9 -5 -35 2 3 3 15
5525 15 19 -14 2 11 0 0 7 20 31 -15 12 2 14 7 -2 26 26 35 3 7 -9 -8 6 -18 19 0 12 23 8 16 11 18 27 36 19 -10 5 31
5563 31 1 0 -5 18 2 6 -3 -6 16 18 -7 2 0 -3 -4 25 8 4 -4 0 55 1 -3 -6 12 -2 -35 9 9 -9 -7 6 -8 24 2 8 -8 12 -7
5602 -7 0 -26 -10 0 13 12 -7 -4 19 9 2 8 20 16 7 8 -6 -18 15 2 -6 -7 -11 -8 -8 16 17 17 6 15 -17 0 0 16 -21 -1 -5 -17 4 -23
5642 -23 -3 26 -13 11 1 5 -4 -7 8 10 -6 -38 -14 4 -1 -2 -8 1 -11 -1 2 -9 4 15 20 4 13 -13 -3 3 10 3 10 -10 9 22 5 15
5680 15 4 22 3 11 -1 1 -10 15 17 7 9 -5 0 12 5 2 27 30 39 0 -4 -10 -8 16 11 -14 -11 23 4 -16 9 2 4 4 4 -12 15 5 -2 -18
5720 -18 -15 24 27 10 -5 -13 -4 -8 -11 15 -9 11 15 3 17 -7 1 0 11 -14 -13 18 -3 14 -11 -17 11 4 28 -14 12 28 18 7 29 22 11
5757 11 3 14 3 -4 12 -18 -23 22 12 7 9 15 -8 0 24 -4 14 -11 34 -7 -12 6 5 10 -10 -9 -12 -11 34 35 16 4 -7 -3 12 -11 -32 15
5795 15 25 18 5 -11 14 -22 4 -18 2 11 -7 -8 -14 7 4 29 15 14 4 5 27 19 14 0 5 1 5 0 11 -26 6 -15 -21 21 2 -28 -7
5832 -7 16 -13 -3 12 -15 10 25 -33 -6 11 2 3 21 17 -7 -20 -1 6 24 0 -2 -9 -13 -8 -9 9 1 15 18 22 0 12 11 10 21 2 8 -12
5870 -12 1 28 12 3 -8 10 10 -3 -4 -3 9 -23 35 -6 0 -4 -5 28 -35 -5 17 10 -12 3 -4 -18 24 15 -5 -10 -3 20 15 -2 -26 -15 9
5907 9 -5 -10 10 17 2 0 6 12 11 -9 7 -32 24 19 2 27 1 16 22 0 -16 14 -6 15 30 8 -20 -2 32 2 31 14 -36 -18 2
5942 2 5 3 -36 -1 -11 39 -6 11 -18 -4 -6 -12 8 10 -6 1 -9 -6 23 -3 -13 -3 -1 15 -15 -27 -26 5 3 19 8 -17 18 1 -13 -18
5978 -18 -13 -5 3 -6 1 2 5 17 -1 -9 5 -17 -14 4 18 -3 3 20 -9 -2 -4 -26 -26 17 -17 -10 42 12 24 -10 -1 15 -3 8 -22 12 8 3 11
6017 11 9 -3 0 -4 44 -4 13 3 10 6 -5 -4 0 12 -21 -13 -21 -24 2 -13 -11 -4 0 21 0 22 -13 6 12 6 -9 -17 21 -3 -18 -5 9 13 22
6056 22 9 -10 10 9 -14 -18 -22 -5 -5 13 7 27 8 8 -7 -9 3 8 20 3 22 9 12 3 24 -19 -3 -21 -27 -11 12 -16 8 14 1 -8 2
6093 2 12 -6 -14 -2 -10 -2 12 -9 12 -10 -24 -2 -13 29 5 -24 8 4 -10 4 -13 13 -18 12 -21 -11 9 21 -9 2 8 -23 36
6126 36 -14 -19 12 10 -8 3 0 10 -15 9 -8 24 5 -19 -13 -10 20 7 -3 1 -5 -1 3 5 -12 4 8 -16 -2 -3 -4 -8 -7 -8 18 32 7 5 -2
6165 -2 2 14 -16 -6 10 10 14 -8 15 -1 -6 -35 -11 -7 -17 -2 32 -5 -29 18 15 1 10 -21 -12 9 1 -10 -6 1 -7 12 -12 8 19 -5 16
6202 16 35 15 18 4 -7 3 -4 -19 10 0 -1 29 16 -5 -1 -5 -19 7 -16 6 14 -1 4 9 5 6 3 -18 -1 -21 -33 15 5 27 34 -10
6238 -10 -5 14 0 -26 29 2 11 14 -6 -8 13 -10 10 20 12 10 7 -10 15 -16 -36 16 -4 -21 -25 2 -6 7 -22 -11 -9 -3 -10 18 -23 33
6274 33 -4 -8 -23 -21 11 15 21 17 6 13 -19 19 -1 -1 33 -12 10 30 21 -7 -4 10 -5 28 2 18 3 29 18 7 16 -13 4 4 25 -8
6310 -8 17 -13 8 3 11 24 15 -19 -4 -3 -29 1 2 0 -9 -9 13 -29 11 12 25 13 -1 -39 18 -1 0 -3 40 22 -9 13 9 -5 3 -41 21
6347 21 1 4 -7 8 20 -9 3 -13 -24 7 4 -27 0 8 11 0 0 19 -19 14 -34 -5 -3 3 26 -19 -10 -4 -1 -33 1 23 3 -17 -1
6382 -1 -12 -20 -16 -14 16 -6 -22 12 -27 3 -6 5 -5 -6 -13 4 -20 22 6 -5 -35 1 -34 -18 7 -2 -11 -6 29 23 0 -5 6 -8 18 13 6
6419 6 -17 -12 1 4 22 12 5 3 -9 -7 -35 27 -2 -14 10 1 11 -8 9 -26 -4 -2 7 26 -1 2 -5 5 4 6 -16 8 9 1 16 6 -36 1
6457 1 -4 -31 5 23 3 10 2 -13 34 6 13 16 -11 13 -3 1 40 6 16 17 -5 -9 20 2 31 -17 -29 25 -19 21 11 5 -1 -11 -3 -4 10
6494 10 17 -10 -4 20 -3 5 3 5 -10 -7 -26 7 4 4 5 5 -3 -18 11 -11 -3 5 20 -23 50 8 16 21 6 7 -13 -6 -11 -3 21 -9 -23 -1 -5 -5 -24
6535 -24 30 -3 -14 21 -18 -5 1 9 11 -15 -1 -25 11 -1 -27 2 16 -22 -1 -28 30 19 0 -1 -29 7 17 18 35 18 -6 20 -2
6568 -2 29 -6 5 26 -18 -17 -1 0 19 -6 27 5 2 -1 22 8 15 11 0 17 3 7 25 1 4 8 4 1 2 16 7 3 13 22 13 -10 8 4 21
6607 21 -17 7 24 -17 14 -10 -4 4 27 4 4 -11 -2 9 9 33 -3 8 -3 -28 17 -5 0 -8 -12 7 18 8 24 8 14 22 12 -24 -21 -14
6643 -14 19 19 4 8 -35 15 -9 11 4 -19 14 -6 -5 -7 -10 2 -7 -4 13 -19 19 2 -18 6 6 19 27 -10 -16 0 -15 -6 24 32 41 10 12 7
6681 7 0 7 14 -5 -11 -9 -1 3 11 8 -9 -18 11 -7 -3 13 3 14 -31 -29 15 10 -27 -13 -13 7 39 14 -11 36 -4 20 -13 33 -16 12 -9 6
6719 6 -5 -16 -13 -12 23 -12 -9 -14 -22 -6 -15 -22 -18 14 5 29 -6 -17 -6 -30 -30 -5 13 -1 21 -5 -10 -10 -20 17 20 16 -18 31 6 -17 21 16
6757 16 0 -7 -9 7 -8 5 12 -1 9 -29 1 -30 -17 -8 10 -25 -5 2 -3 -24 12 -22 -8 -8 0 -3 -11 -16 -18 -28 11 -4 14 22 18 -18 -36
6794 -36 19 3 -22 7 9 -9 6 3 -6 3 6 1 23 35 -5 23 12 40 7 32 16 -8 22 6 8 13 -12 3 8 0 -4 30 4 5 14 12 26
6831 26 6 2 3 6 -13 14 20 0 46 15 -9 -21 -5 19 10 -14 -13 -27 0 14 16 -16 34 14 21 -3 33 5 4 4 25 31 -1 -7 7 -10
6867 -10 -14 24 -13 -7 1 -6 12 -6 -10 -1 -22 -7 -5 13 -19 31 0 -13 21 3 -16 -5 -12 -1 -13 -4 13 14 8 -16 -4 -5 -9 -14 -6 9 21 14
6905 14 8 -15 -11 -1 5 -13 -20 16 12 -28 0 -2 -2 18 -16 4 12 -3 24 -5 -34 -10 -10 -7 -10 -32 -28 15 18 7 11 13 1 7 -14 28 -18 -1
6943 -1 18 -6 14 0 -10 14 11 16 25 2 14 -14 -3 -14 15 22 10 -9 -3 -4 21 -11 -1 3 -19 -6 -4 43 -2 18 -19 7 1 -2 22 4
6979 4 -8 -26 3 7 2 -14 9 -12 -6 -4 -4 -4 1 8 21 2 10 8 -13 -2 25 18 -10 -2 18 20 19 -7 13 -23 -2 16 -7 -5 14 6 4 5 6 -11
7019 -11 3 18 27 23 -5 8 13 2 2 17 -4 12 29 5 9 15 13 14 -14 -11 22 -7 -17 5 -9 -9 9 0 -9 6 -30 -6 7 9 0 -2 -11 22
7057 22 -18 25 -31 -16 -27 -9 -11 -4 11 -35 -1 -29 -9 0 -22 18 26 -4 -3 20 13 5 5 4 -2 -1 -26 -4 16 -8 11 3 5 38 28 -23 -23
7094 -23 5 18 15 -6 26 12 -3 -2 -5 7 0 -9 -15 4 -10 -8 -2 7 -11 17 18 19 -26 -1 5 -4 -4 12 -32 8 26 -22 28 1 25 15 2
7131 2 -2 27 -27 28 -13 22 0 -4 -7 11 -13 -14 4 8 6 1 -16 -1 4 3 6 -11 9 -8 -17 22 15 5 -13 19 -10 27 -7 -19 -7 -5 -6 -13
7169 -13 6 -1 -6 -7 15 -1 -4 24 18 -14 41 -17 10 10 -15 0 -20 -22 -11 -12 0 6 0 0 11 14 -4 23 23 -29 -1 -3 11 0 12 -24 -11
7206 -11 3 18 18 -5 -8 -5 1 -12 -12 -35 5 -2 -4 -12 -15 -7 3 1 9 6 5 -29 -23 -1 4 22 -25 -14 -3 -31 3 -2 -21 -21 29 -3 12 -3 16
7245 16 14 14 -43 -16 -13 -21 -28 -21 6 -9 19 30 20 -9 -3 8 -5 -8 4 -14 20 -6 37 14 -2 -29 15 11 -1 -3 -24 1 28 -2 1 -3
7281 -3 1 -7 -34 -1 8 -18 -1 -4 -19 6 23 -6 -8 12 3 5 8 -6 -16 3 -9 9 39 7 12 11 -25 -14 -27 7 16 19 -23 -9 -15 -3 -4 6
7319 6 4 -2 -4 -15 11 -15 -19 15 4 19 -3 -7 -21 -32 6 21 13 0 0 -2 6 -6 18 -32 -4 1 0 -17 28 -6 -23 -6 3 -16 15 -1 13
7356 13 19 2 19 0 20 30 9 -11 28 2 0 27 16 -8 0 2 -7 3 -5 -41 3 19 -14 7 -7 11 10 2 -19 22 -22 10 -8 6
7390 6 -1 2 14 0 4 17 7 -28 11 4 17 15 16 8 9 7 16 16 -21 -3 14 3 -18 -23 40 18 28 2 -22 2 4 -5 -3 13 19 12 3 2 9 -3 -11
7431 -11 -2 -12 -7 -27 9 15 6 -2 -14 -32 -5 -15 5 27 -26 5 12 1 -42 0 12 23 0 -5 10 -12 7 -3 -12 17 -1 23 -12 8
7465 8 -6 -9 10 -13 5 -13 -31 4 -12 10 1 -11 2 -4 1 -9 25 20 1 -20 17 -12 -8 -18 -9 1 -16 -9 -23 -27 30 21 -16 1 19 -21
7501 -21 18 -30 -14 21 2 15 -8 4 -11 -2 -6 -10 48 31 14 22 3 2 4 6 -18 -8 9 -8 -6 -7 -16 -7 25 -20 -17 -20 -10 -57 17 4 26
7538 26 -4 -9 2 -16 -13 -2 5 6 -8 -5 -13 11 24 6 16 29 34 -19 -7 8 16 1 -16 -3 2 11 -9 -17 -44 -15 -10 -17 -12 -11 4 -17 3 -9
7576 -9 18 -19 40 -5 0 11 17 -29 -38 -27 17 5 14 -15 12 -14 -3 17 -14 4 1 -1 -2 -1 6 -1 -15 15 -5 14 -15 -3 -22 -2 -15 25
7612 25 20 -2 3 -6 -35 -13 -15 0 -4 -24 12 10 -5 -4 18 -36 8 -12 10 -7 -1 -21 5 4 -7 -17 -9 -19 20 1 13 1 2 27 15 -8
7648 -8 -6 -5 -10 -2 10 -17 1 18 -20 7 10 -6 -7 3 -16 -4 -15 6 12 13 -9 11 -2 -5 -5 -13 15 -21 -4 -32 0 6 0 8 -14 17 14 -6
7686 -6 -11 43 1 -16 -3 9 14 31 -15 -19 19 -11 -9 -7 -21 -16 -38 -23 7 36 -3 -5 10 5 18 9 9 -16 4 1 -24 12 19 3 -23 28 0
7723 0 4 6 -9 7 -27 -16 3 -20 4 -7 -13 -9 -8 -8 15 2 -26 6 -5 -12 -13 1 5 -10 7 15 21 9 7 -2 -19 -9 11 -12 -16 -21 13 3
7761 3 -16 -8 -11 5 13 7 -30 -27 -3 -5 1 26 -26 -25 10 10 11 20 6 -22 23 12 20 3 5 0 5 17 27 18 34 24 -1 -21 0 3 -31 -18 -2
7800 -2 11 -5 2 -4 23 1 -1 -1 -10 23 31 -20 13 38 9 25 9 -26 5 10 -18 -12 8 4 8 13 4 11 19 4 14 -5 -5 12 -3 28 8 -1 17
7839 17 -3 -2 25 -5 -30 -10 -6 8 -2 11 9 -4 -4 2 -15 3 -11 6 14 11 -9 6 21 10 11 -7 -4 13 10 28 -8 8 18 5 13 5
7875 5 -2 -13 2 -3 12 23 19 11 26 11 -3 23 0 2 11 13 12 -12 -7 7 -16 -1 -21 -19 17 -24 -10 2 13 11 5 19 -17 -10 15 7 11 -20
7913 -20 14 5 -1 -13 1 8 -14 22 21 8 9 -11 8 20 -1 5 1 9 -12 6 -3 36 -6 5 -25 -28 5 -36 2 -6 -2 23 -11 13 17 -16 8
7950 8 43 -7 -25 -13 12 -5 -39 33 15 -27 13 10 -3 9 13 7 16 -12 11 -11 24 -21 2 4 -15 -1 -9 21 11 -28 10 -4 19 -23
7984 -23 29 1 -22 -44 -36 19 6 -24 -4 12 -10 1 -15 -14 1 -2 -28 -9 -32 -35 8 9 32 7 6 -15 6 12 -10 4 -19 21 -5 -17
8018 -17 -16 21 -6 7 8 10 15 -4 -1 7 -13 -5 -32 -22 -5 4 -10 10 -4 13 -10 -18 -9 -2 -12 -16 -48 16 13 -1 8 26 -5 25 13 1 0 7
8056 7 20 -43 -24 -1 -18 12 24 19 22 9 -3 -26 0 25 5 -9 -10 -16 1 12 12 0 13 -2 25 3 2 -25 -16 -14 -12 6 20 2 -36
8091 -36 -10 6 27 -4 30 15 -19 -3 -7 -5 -20 -19 -16 26 -22 1 8 4 -3 -8 0 33 19 -16 5 -9 -3 -13 -9 -20 31 -12 28 29 7 -17
8127 -17 -5 -16 -10 -7 13 -21 13 17 4 10 -14 27 4 2 1 23 -17 7 0 14 -25 9 -22 -6 37 33 -2 7 -1 -20 -4 -9 12 20 6 30
8163 30 28 -17 5 11 -14 11 -2 13 -17 13 10 3 -8 -12 12 8 -6 -8 -11 0 -2 -16 -14 -5 -10 -13 -17 14
8191A4
##END NTUPLES=NMR FID
##END=
