##TITLE=1H_LR-618-R3-CR9-17
 CDCl3, 8 sc, 
 28.06.2021
##JCAMPDX= 6.0         $$ Bruker NMR JCAMP-DX V2.0
##DATA TYPE= NMR FID
##DATA CLASS= NTUPLES
##ORIGIN= UXNMR, Bruker Analytische Messtechnik GmbH
##OWNER= root
$$ XWIN-NMR		Version 3.5
$$ Mon Jun 28 11:46:38 2021 Russian Standard Time (UT+4h)  she@DPX200
##.OBSERVE FREQUENCY= 200.131506
##.OBSERVE NUCLEUS= ^1H
##.DELAY= (6, 6)
##.ACQUISITION MODE= SIMULTANEOUS
##.ACQUISITION SCHEME= undefined
##.AVERAGES= 8
##.DIGITISER RES= 18
##SPECTROMETER/DATA SYSTEM= spect
##.PULSE SEQUENCE= zg30
##.SOLVENT NAME= CDCl3
##.SHIFT REFERENCE= (INTERNAL, CDCl3, 0, 15.7039)
##AUDIT TRAIL= $$ (NUMBER, WHEN, WHO, WHERE, WHAT)
$$ ##TITLE= Audit trail, XWIN-NMR		Version 3.5
$$ ##JCAMPDX= 5.01
$$ ##ORIGIN= Bruker BioSpin GmbH
$$ ##OWNER= she
$$ F:/spectra/data/she/nmr/H-F/1/audita.txt
$$ ##AUDIT TRAIL=  $$ (NUMBER, WHEN, WHO, WHERE, WHAT)
(   1,<2021-06-28 11:45:15.85 +0400>,<she>,<DPX200>,
      <created by zg, POWCHK disabled, PULCHK disabled
       configuration hash MD5:
       00 E9 B6 7A A2 85 ED C7 34 08 36 98 17 FE 4E 26
       data hash MD5: 16K
       55 5E F6 BC 37 9E 31 C8 8A E9 0D 5E 52 90 32 B6>)
$$ ##END=
$$ 
$$ hash MD5
$$ 36 A5 C3 76 43 DD CA 16 1C 3C D6 3C 30 70 AD FF
##$RELAX= 
##$RELAX= 
##$RELAX= 
##$RELAX= 
##$RELAX= 
##$RELAX= 
$$ Bruker specific parameters
$$ --------------------------
##$DU= <F:/spectra>
##$EXPNO= 1
##$NAME= <H-F>
##$PROCNO= 1
##$TYPE= <nmr>
##$USER= <she>
##$AMP= (0..31)
100 100 100 100 100 100 100 100 100 100 100 100 100 100 100 100 100 100 
100 100 100 100 100 100 100 100 100 100 100 100 100 100 
##$AQSEQ= 0
##$AQ_mod= 1
##$AUNM= <au_zg>
##$AUTOPOS= <>
##$BF1= 200.13
##$BF2= 200.13
##$BF3= 200.13
##$BF4= 200.13
##$BF5= 200.13
##$BF6= 200.13
##$BF7= 200.13
##$BF8= 200.13
##$BYTORDA= 1
##$CFDGTYP= 0
##$CFRGTYP= 5
##$CHEMSTR= <none>
##$CNST= (0..31)
1 1 145 1 1 1 1 1 1 1 1 1 1 1 1 1 1 1 1 1 1 1 1 1 1 1 1 1 1 1 1 1 
##$CPDPRG= <>
##$CPDPRG1= <>
##$CPDPRG2= <>
##$CPDPRG3= <>
##$CPDPRG4= <mlev>
##$CPDPRG5= <mlev>
##$CPDPRG6= <mlev>
##$CPDPRG7= <mlev>
##$CPDPRG8= <mlev>
##$CPDPRGB= <>
##$CPDPRGT= <>
##$D= (0..31)
0 1.2 0 0 0 0 0 0 0 0.06 0 0.03 0 0 0 0 0.0002 0 0 0 0 0 0 0 0 0 0 0 0 
0 0 0 
##$DATE= 1624866315
##$DBL= (0..7)
120 120 120 120 120 120 120 120 
##$DBP= (0..7)
150 150 150 150 150 150 150 150 
##$DBP07= 0
##$DBPNAM0= <>
##$DBPNAM1= <>
##$DBPNAM2= <>
##$DBPNAM3= <>
##$DBPNAM4= <>
##$DBPNAM5= <>
##$DBPNAM6= <>
##$DBPNAM7= <>
##$DBPOAL= (0..7)
0.5 0.5 0.5 0.5 0.5 0.5 0.5 0.5 
##$DBPOFFS= (0..7)
0 0 0 0 0 0 0 0 
##$DE= 6
##$DECBNUC= <off>
##$DECIM= 32
##$DECNUC= <off>
##$DECSTAT= 4
##$DIGMOD= 1
##$DIGTYP= 9
##$DL= (0..7)
0 120 120 120 120 120 120 120 
##$DP= (0..7)
150 150 150 150 150 150 150 150 
##$DP07= 0
##$DPNAME0= <>
##$DPNAME1= <>
##$DPNAME2= <>
##$DPNAME3= <>
##$DPNAME4= <>
##$DPNAME5= <>
##$DPNAME6= <>
##$DPNAME7= <>
##$DPOAL= (0..7)
0.5 0.5 0.5 0.5 0.5 0.5 0.5 0.5 
##$DPOFFS= (0..7)
0 0 0 0 0 0 0 0 
##$DQDMODE= 0
##$DR= 18
##$DS= 0
$$ [...]
##$SUBNAM2= <"">
##$SUBNAM3= <"">
##$SUBNAM4= <"">
##$SUBNAM5= <"">
##$SUBNAM6= <"">
##$SUBNAM7= <"">
##$SUBNAM8= <"">
##$SUBNAM9= <"">
##$SW= 20.0188882624521
##$SWIBOX= (0..15)
0 0 2 0 0 0 0 0 0 0 0 0 0 0 0 0 
##$SW_h= 4006.41025641026
##$TD= 16384
##$TD0= 1
##$TE= 0
##$TE2= 300
##$TE3= 300
##$TEG= 300
##$TL= (0..7)
0 120 120 120 120 120 120 120 
##$TP= (0..7)
150 150 150 150 150 150 150 150 
##$TP07= 0
##$TPNAME0= <>
##$TPNAME1= <>
##$TPNAME2= <>
##$TPNAME3= <>
##$TPNAME4= <>
##$TPNAME5= <>
##$TPNAME6= <>
##$TPNAME7= <>
##$TPOAL= (0..7)
0.5 0.5 0.5 0.5 0.5 0.5 0.5 0.5 
##$TPOFFS= (0..7)
0 0 0 0 0 0 0 0 
##$TUNHIN= 0
##$TUNHOUT= 0
##$TUNXOUT= 0
##$USERA1= <user>
##$USERA2= <user>
##$USERA3= <user>
##$USERA4= <user>
##$USERA5= <user>
##$V9= 5
##$VALIST= <valist>
##$VCLIST= <CCCCCCCCCCCCCCC>
##$VD= 0
##$VDLIST= <DDDDDDDDDDDDDDD>
##$VPLIST= <PPPPPPPPPPPPPPP>
##$VTLIST= <TTTTTTTTTTTTTTT>
##$WBST= 1024
##$WBSW= 4
##$XGAIN= (0..3)
0 0 0 0 
##$XL= 0
##$YL= 0
##$YMAX_a= 162680
##$YMIN_a= -285011
##$ZGOPTNS= <>
##$ZL1= 120
##$ZL2= 120
##$ZL3= 120
##$ZL4= 120
##$ABSF1= 10
##$ABSF2= 0
##$ABSG= 5
##$ABSL= 3
##$ALPHA= 0
##$AQORDER= 0
##$ASSFAC= 0
##$ASSFACI= 0
##$ASSFACX= 0
##$ASSWID= 0
##$AUNMP= <proc_1d>
##$AZFE= 0.1
##$AZFW= 0.1
##$BCFW= 1
##$BC_mod= 2
##$BYTORDP= 1
##$COROFFS= 0
##$CY= 11.3945322036743
##$DATMOD= 1
##$DC= 2
##$DFILT= <>
##$DTYPP= 0
##$F1P= 15.9154993809931
##$F2P= -4.1035820241983
##$FCOR= 0.5
##$FTSIZE= 0
##$FT_mod= 4
##$GAMMA= 1
##$GB= 0.15
##$INTBC= 1
##$INTSCL= 1
##$ISEN= 128
##$LB= 0.24
##$LEV0= 0
##$LPBIN= 0
##$MAXI= 10000
##$MC2= 0
##$MEAN= 0
##$ME_mod= 0
##$MI= 1.114404
##$NCOEF= 0
##$NC_proc= 0
##$NLEV= 6
##$NOISF1= 3.799351
##$NOISF2= 2.8
##$NSP= 1
##$NTH_PI= 0
##$NZP= 0
##$OFFSET= 15.70392
##$PC= 1
##$PHC0= -11572.96
##$PHC1= 10.60101
##$PH_mod= 1
##$PKNL= yes
##$PPARMOD= 0
##$PSCAL= 0
##$PSIGN= 0
##$REVERSE= no
##$SF= 200.130013532006
##$SI= 16384
##$SIGF1= 3
##$SIGF2= 2
##$SINO= 400
##$SIOLD= 16384
##$SREGLST= <1H.CDCl3>
##$SSB= 0
##$STSI= 0
##$STSR= 0
##$SW_p= 3612.71676300578
##$SYMM= 0
##$S_DEV= 0
##$TDeff= 0
##$TDoff= 0
##$TI= <>
##$TILT= no
##$TM1= 0
##$TM2= 0
##$TOPLEV= 0
##$USERP1= <user>
##$USERP2= <user>
##$USERP3= <user>
##$USERP4= <user>
##$USERP5= <user>
##$WDW= 1
##$XDIM= 8192
##$YMAX_p= 0
##$YMIN_p= 0
$$ End of Bruker specific parameters
$$ ---------------------------------
##NTUPLES= NMR FID
##VAR_NAME=  TIME,          FID/REAL,        FID/IMAG
##SYMBOL=    X,             R,               I
##VAR_TYPE=  INDEPENDENT,   DEPENDENT,       DEPENDENT
##VAR_FORM=  AFFN,          ASDF,            ASDF
##VAR_DIM=   8192,          8192,            8192
##UNITS=     SECONDS,       ARBITRARY UNITS, ARBITRARY UNITS
##FACTOR=    0.0002496,     1,               1
##FIRST=     0,             0,               0
##LAST=      2.0444736,     0,               0
##MIN=       0,             -285011,         0
##MAX=       2.0444736,     162680,          0
$$ Real data points
##PAGE= N=1
##DATA TABLE= (X++(R..R)), XYDATA
$$ [...]
1716a48K81m23J42J51m88K85K30n21J38N55j71l38L15j52n40O81J77p99L75M19
$$ -148 133 -290 -148 3 -485 -200 30 -491 -353 202 31 -307 8 -144 -684 -3 174 -625 -250 169
1736A69m83J01P47n25k59M00m7l71N43l3m80L65L08q68L32N21o15J67K78J30n24
$$ 169 -314 -213 534 9 -250 150 103 -268 275 242 -238 127 435 -433 -101 420 -195 -28 250 380 -144
1757a44P36l16n59O85j54k34J59L83q85M42L80m35M5N56m16l07M75j45n10L10
$$ -144 592 276 -283 402 248 14 173 556 -329 113 493 58 103 659 243 -64 411 266 -244 66
1777F6K42o85M06L51o84J50M58m73p7O55l76j95K91j46m27N32O5o12L29N20n90
$$ 66 308 -377 29 380 -304 -154 304 -169 -246 409 33 -162 129 -17 -444 88 153 -459 -130 390 -200
1798b00q3N35n28k26P17n57k67P79k17n69M48L22n47L4M64p23L67O93p89k6N72
$$ -200 -283 252 -276 -502 215 -342 -609 170 -47 -616 -168 154 -393 -359 105 -618 -251 442 -347 -373 199
1819A99l79j82N11j26m57K06N48n95J40M10l70k43O42k73k60L84J20o94N32N7
$$ 199 -180 -362 149 23 -434 -228 320 -275 -135 275 -95 -338 304 31 -229 155 275 -419 113 170
1839A70n38N30R1k71K00P1Qm46N89k78p6M66r4n11M28j28k44J62L07k45p4L10
$$ 170 -368 162 253 -18 182 253 261 -185 404 126 50 516 422 -89 339 211 -33 129 436 191 117 427
1861D27l85k67O82l98n78Q81r8n83L97K95l88m0K1J43p8K12n45j18M56k19l8K00
$$ 427 42 -225 457 59 -519 362 264 -319 78 373 -15 -55 -34 109 31 243 -302 -420 36 -183 -221 -21
1883b1o2j22J25n6k26K61L44m01j80N20n16J89K27j96m6J59j4j14O2O1k83QQ9
$$ -21 -83 -205 -80 -136 -362 -101 243 -158 -338 182 -334 -145 82 -114 -160 -1 -15 -129 -67 -6 -289 -281 -192
1906a92j06n9K98m6N8J76l01k45K61K20m12K21K13l35J46L40k59J0jL5m2K58j90
$$ -192 -298 -357 -59 -105 -47 129 -172 -417 -156 64 -348 -127 86 -249 -103 237 -22 -12 -13 22 -20 238 48
1929D8k8jK60l08R1M0k29N38r7l70P2K18n3j31o0M05l06j46N14l12L7K79l44p0
$$ 48 20 19 279 -29 62 102 -127 411 314 -56 16 234 181 50 -10 395 89 -57 457 145 182 461 117 47
1953D7J65j91k27L85J2j49J0n7k50R6K26k24J93q1p5N5K40k53J00J04P4j99j65
$$ 47 212 21 -206 179 191 42 52 -5 -255 -159 67 -157 36 -45 -120 -65 175 -78 22 126 200 1 -164
1976a64N9M7j94K78j89j12J86m5Q9n7j85j7J55J7L9RJ50k27O9K93n38J53j38K56
$$ -164 -105 -58 -252 26 -163 -275 -89 -134 -45 -102 -287 -304 -149 -132 -93 -84 66 -161 -92 201 -337 -184 -322 -66
2000f6j32L52k99J78JR4m11J22J95m2j58K45m9L5J48j10j17j07K05k4J03J30m00
$$ -66 -198 154 -145 33 34 128 -283 -161 34 -8 -166 79 30 65 213 103 -14 -121 84 60 163 293 -107
2023a07K93j21J41q4M26m57M7K18j28j62L30o7l20K26k07J27mk71L22j96J11o8
$$ -107 186 65 206 122 548 91 138 356 228 66 396 329 9 235 28 155 151 -120 202 6 117 49
2045D9J20J48k78j16nK28j4L8k8j70k4J00k85OK68j25k39K97J08q0o2J58l33J10
$$ 49 169 317 39 -77 -82 146 132 170 142 -28 -52 48 -237 -231 37 -88 -327 -30 78 -2 -64 94 -239 -129
2069a29m9J12j2O0j40O5J83k47N0jP1k18L40j53r4P0p7j22L09j26o6j41L38k56
$$ -129 -178 -66 -78 -18 -158 -93 90 -157 -107 -108 -37 -255 85 -68 -162 -92 -169 -291 18 -108 -174 -315 23 -233
2093b33K81l5l07J73K40q5Q3k40J2J63O4r1nm4M2r5M3j21J00L03j81J17q1J41
$$ -233 48 13 -294 -121 119 34 117 -123 -111 52 116 25 20 -24 18 -77 -34 -155 -55 248 67 184 103 244
2117B44J14q4Q8j3m15o4M9J27J10j00J12k61M44o6k75J35Q3m4j74L09l13j81K01
$$ 244 358 274 362 349 -66 -130 -81 46 156 56 168 -93 351 285 10 145 228 184 10 319 6 -175 26
2140B6J38P7k39J25k27L17k2k68r0L05k82j2J47k06J35l7N9k48K33O9J17l46K54
$$ 26 164 241 2 127 -100 217 195 -73 -163 142 -140 -152 -5 -211 -76 -113 -54 -302 -69 0 117 -229 25
2163B5k04K16l8l7m5jJ04l65L39j61j18L20r9k27L20r3n9r6K85j15J62j87j69
$$ 25 -179 37 -1 -38 -83 -84 20 -345 -6 -167 -285 35 -64 -291 29 -64 -123 -219 66 -49 113 -74 -243
2186b43K70K8j46L1l1O5p3J92m8k22J59M0k0o5J43O2l88M63P1j80N7K31Jk46N0
$$ -243 27 55 -91 -60 -91 -26 -99 93 45 -177 -18 22 2 -63 80 142 -246 217 288 108 165 396 397 151 201
2211B01r3l4L1J24k51K48m46K04K29M6k21L04k86k67K64P9l03J02K77k02J96m
$$ 201 108 74 105 229 -22 226 -220 -16 213 259 38 342 56 -211 53 132 -171 -69 208 6 202 198
2233A98k42M8J47k35q4K02R6n18M46K4j73k49L53q2k59L00k82R6L59o9J7pm31
$$ 198 -44 4 151 -84 -168 34 130 -388 58 82 -91 -340 13 -69 -328 -28 -310 -214 145 76 93 86 -345
2256c45K08J96j46m2oJ83Mj15J53k79J14k9J57k29J40N5l8j04P3q0Q1n6J28L7
$$ -345 -137 59 -87 -129 -135 48 52 -63 90 -189 -75 -104 53 -176 -36 19 -19 -123 -50 -130 -49 -105 23 60
2280F0j43J74p5n9K09k42K2P8j61K02n7j53K0J78o6J42k30K39q0q9J93R3l52L47
$$ 60 -83 91 16 -43 166 -76 -54 24 -137 65 8 -145 -125 53 -13 129 -101 138 58 -31 162 255 -97 250
2304B50k87M7L63l55M9J8j54k1L06j26Pj81K04j32J21o1L6o4J06j13K2m2k16O1
$$ 250 -37 10 373 18 67 85 -69 -90 216 90 97 -84 120 -12 109 48 84 20 126 13 35 -7 -223 -162
2328a62K17n0n8J41R4m79M89m8L1k77J48j95J34M6j04p3J46j47j83K64J7J30m73
$$ -162 55 5 -53 88 182 -297 192 144 175 -102 46 -149 -15 31 -73 -146 0 -147 -330 -66 -49 81 -392
2351c92L77j38J39J71j50k6J53j56j37mK31l6r6r2J32o3m5L9J18m5j26K86j49
$$ -392 -15 -153 -14 157 7 -19 134 -22 -159 -163 68 32 -64 -156 -24 -87 -132 -93 25 -20 -146 140 -9
2374iN0j57K23j32R3l2j94L20l4k6j16N6L6j91o1L15p6K1m7k30J48M02j18j92
$$ -9 41 -116 107 -25 68 36 -158 162 128 102 -14 42 78 -113 -174 141 65 86 39 -191 -43 359 241 49
2398D9J64j88m1o3j29L91j52M8K08l43J34j0L3P4j80p8M9j02j84K61P2j47l1J51
$$ 49 213 25 -16 -79 -208 183 31 79 287 -56 78 68 101 175 -5 -83 -34 -136 -320 -59 13 -134 -165 -14
2422a4j22J45j9j26j5K06m5j78J19k22K87k11K02k86K48k2J27l85M07k41J49J97
$$ -14 -136 9 -10 -136 -151 55 10 -168 -49 -271 16 -195 7 -279 -31 -53 74 -311 96 -145 4 201
2444B01n52L06P6N2k16K88k39K54j52M4k51j28K00K08j54K33k15K48k32J22P0
$$ 201 -351 -45 31 83 -133 155 -84 170 18 62 -189 -317 -117 91 -63 170 -45 203 -29 93 163
2465A63l74J73K24P7l75J36rR9p6M2l4K03j94OJ49l58L14k28J56j1j40R2k4j8
$$ 163 -211 -38 186 263 -112 24 15 114 38 80 46 249 55 61 210 -148 166 -62 94 83 -57 35 11 -7
2489gm1Q1K6j41r5L44p8j66L4j08L4J66m5R0Q6P7m11K38Qk2J52k05o0k5L1J53
$$ -7 -48 33 59 -82 -177 167 89 -77 -43 -151 -117 49 4 94 180 257 -154 84 92 70 222 17 -43 -68 -37 116
2515A16j87Mk04J02K00j21n3MK32k74j72M30l62K94j63J28o7N8q0J79j47n3K9
$$ 116 -71 -67 -271 -169 31 -90 -143 -139 93 -181 -353 77 -285 9 -154 -26 -93 -35 -115 64 -83 -136 -107
2538a07N2j22J42j88K59q9j89K15P5k12L35p3k26N07n18J50JJ11K0K2o3N7k27
$$ -107 -55 -177 -35 -223 36 -53 -242 -27 48 -164 171 98 -128 379 -139 11 12 123 143 165 102 159 -68
2561f8P4M1J15j79k0M2m2K10k60L29J2k80q0Q4L8L3kk18J57J27J23j65j83J72
$$ -68 6 47 162 -17 -37 5 -37 173 -87 242 254 -26 -106 -22 16 49 47 -171 -14 113 236 71 -112 60
2585F0R2k43m0R5J8m1N6K25m20K3K53n0q2K48k68j36J53qrJ37J90j28j90J9J76
$$ 60 152 -91 -131 -36 -18 -59 -3 222 -198 -175 78 28 -54 194 -74 -210 -57 -65 -74 63 253 125 -65 -46 130
2610A30p7j22K17k63M9J33l62J85J4l5J46n3j70K35n9j00L29l29K4K36K31k40
$$ 130 53 -69 148 -115 -66 67 -295 -110 -96 -131 15 -38 -208 27 -32 -132 197 -132 -108 128 359 119
2632A19P7j00j66J44l36K18l13P31m91j30L67j99K42M9k67J40P3j79J33N0q1k88
$$ 119 196 96 -70 74 -262 -44 -357 374 -117 -247 120 -79 163 212 -55 85 158 -21 112 162 81 -207
2654b07J8J57J62k13Q2l1K3J88O9k30j23R3Q7n9j51K51o0L02k92J95o9j30J2l8
$$ -207 -189 -32 130 -83 -1 -32 -9 179 248 18 -105 -12 75 16 -135 116 56 358 66 261 192 62 74 36
2678C6k9N2k6p2kJ61n8n6j77K25j5k28J04k39N00l99K92j91J68o3j44QM2j64K47
$$ 36 7 59 33 -39 -41 120 62 6 -171 54 39 -189 -85 -324 176 -223 69 -122 46 -17 -161 -153 -111 -275 -28
2703b8jj42P8J46m2j05J57j08k52M31j20j64K38k39K28J4j54j40L17J12k41m1
$$ -28 -29 -171 -93 53 11 -94 63 -45 -297 134 14 -150 88 -151 77 91 -63 -203 114 226 -15 -56
2725e6P2k7l32K42J71j24L9m3J41J9Q9k75J70J26k54J6O1j20J77q6J8O0l2n6k27
$$ -56 16 -11 -343 -101 70 -54 -15 -58 83 102 191 -84 86 212 -42 -26 35 -85 92 6 24 84 52 -4 -231
2750b31L04m1n8P9m8n2l5L03l40J64J7k15J01N2M3j40J1K87k64R1J07l34L00p5
$$ -231 73 32 -26 53 5 -47 -82 221 -119 45 62 -153 -52 0 43 -97 -86 201 -63 28 135 -199 101 26
2774B6j0k0P5j6M4j32P8J89k46p1Q4J02l9l2p8J05p1j77K73j99j88J84k0k8K04
$$ 26 16 -4 71 55 99 -33 45 234 -12 -83 1 103 64 32 -46 59 -12 -189 84 -115 -303 -119 -139 -167 37
2799C7Pk13j84M54l02N3J89Nj58R0k8n2kJ52K2k74K62j19j3Q2L1m2p7K50k57R7
$$ 37 44 -169 -353 101 -201 -148 41 46 -112 -22 -50 -102 -104 48 70 -204 58 -61 -74 8 39 -3 -80 170 -87 10
2825A0K6J2j76K60k77J59K3q7m7K4J43o8k4Q3j97K20n4o6k1Q2J19j16K75l26K3
$$ 10 36 48 -128 132 -145 14 37 -50 -97 -73 70 2 -22 61 -136 84 30 -36 -57 25 144 28 303 -23 0
2850@j08J61j79K86k0j10qJ64j19j43J74j09R0K15k53k8M5J04j39n1L9J83J95
$$ 0 -108 53 -126 160 140 30 22 186 67 -76 98 -11 79 294 41 13 58 162 23 -28 11 194 389
2873C89k33n69L09L14j74j95K32n3LJ12k9l95K06k4J94q8J32oO4k62K03j80Qq4
$$ 389 156 -413 -104 210 36 -159 73 20 23 135 106 -289 -83 -107 87 -1 131 125 189 -73 130 -50 -42 -126
2897a26l4P4J89j14K6J69k54O8P7L5j81k7R5M7j73R2j58K68P1k8j09o7m8R7P8
$$ -126 -160 -86 103 -11 15 184 -70 -2 75 110 -71 -98 -3 44 -129 -37 -195 73 144 116 7 -60 -108 -11 67
2922F7Kr0N0j96J84l9J67J9j37K48l86J78O6j9k90M26k16j18R5J74k14R5q5L13
$$ 67 69 -21 29 -167 17 -22 145 164 27 275 -111 67 133 114 -176 250 34 -84 11 185 -29 66 -19 294
2946B94j66j55J26J2j40K02j02O2L3j16J49l64J00q0K70r3J25k4l13J02k2P7j21
$$ 294 128 -27 99 111 -29 173 71 133 166 50 199 -165 -65 -145 125 32 157 133 -180 -78 -100 -23 -144
2969a44k1P5m8O4q1K5k08M29JO2l65J36j11J05R4L0j4q9n4P3J5j28K58J7r4k42
$$ -144 -165 -90 -138 -74 -155 -130 -338 91 92 154 -211 -75 -186 -81 13 43 29 -60 -114 -41 -26 -154 104 121 27 -215
2995b15k4J74L4k09K86k85J00J78j77K02J55r7mN4k26M2R6j25r8L70l71L31j96
$$ -215 -239 -65 -31 -240 46 -239 -139 39 -138 64 219 122 118 172 -54 -12 84 -41 -139 231 -140 191 -5
3018eJ69l4l94L38q0q1K72K12m42q3L9J88rn4q4J16J67l03j3K0K10j46K42n3k79
$$ -5 164 130 -264 74 -6 -87 185 397 -45 -128 -89 99 90 36 -48 68 235 -68 -81 -61 149 3 245 192 -87
3043h7O0RL7j42n4L17j61M9P1k23K12k42J2K25k62K63J6J5l24J41K39j51l4k09
$$ -87 -27 -18 19 -123 -177 140 -21 28 99 -124 88 -154 -142 83 -179 84 100 115 -209 -68 171 20 -14 -223
3067b23J95j2j06l2J85j33K38L6j11k32K61k69o2K76j60j84L80L8k42lK08p7j57
$$ -223 -28 -40 -146 -178 7 -126 112 148 37 -195 66 -203 -265 11 -149 -333 47 85 -157 -160 48 -29 -186
3090a86J89j25R1k10K33J98j07k89K17R6j25L13l11J16L0j68J02k4J43M2o5N6
$$ -186 3 -122 -31 -241 -8 190 83 -206 11 107 -18 295 -16 100 130 -38 64 40 183 225 160 216
3112B16rl28K01J09k82R5j00K63r3k29M27l69j27K22o1J43r4r8q5J85m1J78j13
$$ 216 207 -121 80 189 -93 2 -98 165 72 -157 270 -99 -226 -4 -65 78 -16 -114 -199 -14 -55 123 10
3135A0p4K01j40K39m81M78j89r9R3J85k34J04k01K35O2j13k67K16n0M6j94J9J8
$$ 10 -64 137 -3 236 -245 233 44 -55 38 223 -11 93 -108 127 189 76 -191 25 -25 21 -173 -154 -136
3158a36J77L4j75k8K30k23K2J13K2k7K6K8j23Q8Lk11K66P1n0r9L6k06l4L7O5p
$$ -136 41 75 -100 -128 102 -121 -99 14 36 9 35 63 -60 28 31 -180 86 157 107 8 44 -162 -196 -159 -94 -101
3184a01K30j55n4J68J3o2K2lj89K25k16J06O9j22K27p6n1K55k22r7R9K1m6J09
$$ -101 129 -26 -80 88 101 39 61 58 -131 94 -122 -16 53 -69 158 82 31 286 64 -33 66 87 41 150
3208A50M7k12P6J32k31j04K37k8k37K86K9k89J23j28J80j16q5J59J71k51j2J12
$$ 150 197 -15 61 193 -38 -142 95 67 -170 116 145 -144 -21 -149 31 -85 -170 -11 160 -91 -103 9
3230Il9p8O4J09J02j87L3Ql0n1k2O2j37K75j08j17j15L93k79%J46k36j91M50Q9
$$ 9 -30 -108 -44 65 167 -20 13 21 -9 -60 -82 -20 -157 118 10 -107 -222 171 -108 -108 38 -198 -389 61 150
3255A50j80Q9j31j40J97J13p8m3j41J42j77K66l7j27J0J05K15r6k47K89l82J58
$$ 150 -30 59 -72 -212 -15 98 20 -23 -164 -22 -199 67 30 -97 -87 18 233 137 -110 179 -203 -45
3277d5J05L0k59K39k30J79QJ51M9l96J11j6J74l64M34M1k34R7Qr7o5o6K72j18
$$ -45 60 90 -169 70 -160 19 27 178 227 -169 -58 -74 100 -264 170 211 -23 74 82 -15 -80 -146 126 8
3301HK60J61l77J24J7j21Q5j80J80J29k71k54L50o5p0m8j18M07l82J61K05j74
$$ 8 268 429 52 176 193 72 157 -23 157 286 15 -239 111 46 -24 -72 -190 217 -165 -4 201 27
3323B7O6j87K44k52Q2j15J23k7K10k17J18j73J14J76k96J62p6j33O2N9Lj64L55
$$ 27 93 -94 150 -102 -20 -135 -12 -39 171 -46 72 -101 13 189 -107 55 -21 -154 -92 -33 -30 -194 161
3346A61k94J56J06p7j68m2J00J73l35K81Nm15Q3K66j93J62P6j32J51j78R2p9K64
$$ 161 -133 23 129 52 -116 -158 -58 115 -220 61 66 -349 -266 0 -193 -31 45 -87 64 -114 -22 -101 163
3369A63k72q2J75J60J1Om9P7l01K84J0k36K34J4k49L04k34J65j62Q1m3N6K2r2
$$ 163 -109 -191 -16 144 155 161 112 189 -112 172 182 -54 180 194 -55 249 15 180 18 99 56 112 134 42
3393D2K27r1n5j7j83J68r8K00l25K76j40l5P7j26R6L7j61j17K52j2p2Q3J92l14
$$ 42 269 178 123 106 -77 91 -7 193 -132 144 4 -31 46 -80 16 53 -108 -225 27 15 -57 26 218 -96
3417i6n6K5K39q0n1r1J27k34L1K66k00K77k65l8K87m06K73k54K49l0J04K9j99
$$ -96 -152 -127 112 32 -19 -110 17 -217 -186 80 -120 157 -108 -146 141 -265 8 -246 3 -27 77 106 -93
3440i3p8O3j5J24j13J0j03L34j53O3j66J95r4J4J99j80R1k78K60O7p8j78Q6K17
$$ -93 -171 -108 -123 1 -112 -102 -205 129 -24 39 -127 68 -26 -12 187 7 98 -180 80 147 69 -109 -23 194
3464A94k02j22K12M9R8J8j4l29J83j10j11O6p5k8L25m5r3rQ9J66r9j46L0j30K04
$$ 194 -8 -130 82 131 229 247 233 -96 87 -23 -134 -68 -143 -171 154 109 16 7 96 262 163 17 47 -83 121
3489A21l4j71J15k5l4l9J51P1M8p9j57j68L28k19J88J6k65K59j37J90j40J5k41
$$ 121 87 -84 31 6 -28 -67 84 155 203 124 -33 -201 127 -92 96 112 -153 106 -31 159 19 34 -207
3512b07M9J23k21K96J32j58J51j31j56L3K05q4o1m1l6J30J12J5l52M05l97K7J02
$$ -207 -158 -35 -256 40 172 14 165 34 -122 -89 116 32 -29 -70 -106 24 136 151 -201 204 -193 -166 -64
3535f4M0P4j22o9J92M5k01k1N7O9mj00J78M4l46R1J29J04k57K1K51m9j87M12j41
$$ -64 -24 50 -72 -141 51 96 -105 -126 -69 0 -4 -104 74 118 -228 -137 -8 96 -161 -140 111 62 -125 287 146
3560A46M3j41N0j35j33J81K95m6l77J16K07j36K84l58K1r7K17l30O2R1J10J24
$$ 146 189 48 98 -37 -170 11 306 260 -117 -1 206 70 354 -4 17 -80 137 -193 -131 -40 70 194
3582A94j87J1k00K91J07k45J08n9J97j73q6K21k88p3J21Q9j3j07K41l00J57K9
$$ 194 7 18 -182 109 216 -29 79 20 217 44 -42 179 -109 -182 -61 28 15 -92 149 -151 6 35
3604C5j39j11R5L8QpN5L6L1l08J61m6L08k17m9K44J16k38j38J68J05O6l05rJ69
$$ 35 -104 -215 -120 -82 -74 -81 -26 10 41 -267 -106 -152 156 -61 -110 134 250 12 -126 42 147 213 -92 -101 68
3629F8R4j47k32M14l18J68J7r6J31%j47J63Qj27P8k92K67J89l34M70l79K8J40
$$ 68 162 15 -217 197 -121 47 64 -32 99 99 -48 115 123 -4 74 -218 49 238 -96 374 -5 23 163
3652A63pK2n6j02n6J42q9J4p4r1M2J56l72K33J7K41R5K0m92L02J49N3l27k82L3
$$ 163 156 178 122 20 -36 106 17 31 -43 -134 -92 64 -308 -75 -58 183 278 298 -194 108 257 310 -17 -299 -266
3677b66K61L58m93L34k64J00J37l64K41m2j27L13j97j24J25J39k98J60l7p4m7
$$ -266 -5 353 -140 194 -70 30 167 -197 44 2 -125 188 -9 -133 -8 131 -167 -7 -44 -118 -165
3698a65K71j25j88J76P9m9k35Q9J10j42K64J2k07K42k90J50j39J61o9j70K63j13
$$ -165 106 -19 -207 -31 48 -1 -236 -147 -37 -179 85 97 -110 132 -158 -8 -147 14 -55 -225 38 -75
3720g5n9J7J54m7q3J49k9k20N48m12P6Q7j76J85J24j45j29P7p1J50L7l42L03j65
$$ -75 -134 -117 37 -10 -93 56 27 -193 355 -57 19 106 -70 115 239 94 -35 42 -29 121 158 -184 119 -46
3744d6k05J92n3L8R4J02j30K95j07j91j14J32j86K35K1j63M7N7J8J43k08p7N5
$$ -46 -251 -59 -112 -74 20 122 -8 287 180 -11 -125 7 -179 56 77 -86 -39 18 36 179 -29 -106 -51
3767e1k6r7M17j70k31K79k43K99m40M12r0J93j29j84l5o3J77K13k86Q0m5L3j19
$$ -51 -77 -174 243 73 -158 121 -122 177 -263 149 59 252 123 -61 -96 -159 18 231 -55 25 -20 13 -106
3790a06K42p7J17k72J38J57l48K23j09K04k08K8j69J79pN8k27K61pj61Q6M5L8
$$ -106 136 59 176 -96 42 199 -149 74 -35 169 -39 -11 -180 -1 -8 50 -177 84 77 -84 2 47 85
3813H5n5j21N9R0j82J75O4N8p1j87O4J7o3J60l47L34j06J75j70k7K53k61P2K2
$$ 85 30 -91 -32 58 -124 51 115 173 102 -85 -21 -4 -67 93 -254 80 -26 149 -21 -48 205 -56 16 38
3837C8P0J3q1m8J84j35Q2k13J28p1J97k63r2M39J18k79P3J7j61p2J78J44l28J33
$$ 38 108 121 40 -8 176 41 123 -90 38 -33 164 -99 -191 248 366 87 160 177 16 -56 122 266 -62 71
3861G1n2J71k32K04j97K88l71O1J27jj77j26J70M4km7q8J92p6R3k94L42k32J05
$$ 71 19 190 -42 162 -35 253 -118 -57 70 69 -108 -234 -64 -20 -22 -69 -157 35 -41 52 -242 100 -132 -27
3885b7j6o8o2J04J87k46J1K5J26j17J57qJ10j82J45k02j54K94k21j17N20m30J5
$$ -27 -43 -111 -173 -69 118 -128 -117 -92 34 -83 74 66 176 -6 139 -63 -217 77 -144 -261 259 -171 -156
3908a56J75o4N2N2O0l17J70J87j89k96K43N2j7M5j2j99K45p8o6J54p5O5j31K27
$$ -156 19 -45 7 59 119 -198 -28 159 -30 -326 -83 -31 -48 -3 -15 -214 31 -47 -113 41 -34 31 -100 127
3932A27j30k4K7k05J50J46k04J52q9j2J44p6J56j60p9%J78k29K83j83k3J19p4
$$ 127 -3 -27 0 -205 -55 91 -113 39 -50 -62 82 6 162 2 -77 -77 101 -128 155 -28 -51 68 -6
3955fL6k39J94J26j55J81j16J8J06p5L2Q9j38J6m8oJ0Q5k59L30j33k17P5R5M8
$$ -6 30 -209 -15 111 -44 137 21 39 145 70 102 191 53 69 21 15 25 110 -149 181 48 -169 -94 1 49
3980D9j75J62R1N8k39Q5j64J20K5q0kJ17Q9j36M6k19J0K73j22J47M7N3k64Q8j89
$$ 49 -126 36 127 185 -54 31 -133 -13 12 -68 -70 47 136 0 46 -173 -163 110 -12 135 182 235 -29 59 -130
4005a30J40j56J56Kj47K70J1p3n0j4k25J56K17j17k5J39j06r3l6J21l3j5R9l14
$$ -130 10 -146 10 12 -135 135 146 73 23 9 -216 -60 157 40 15 154 48 -45 -81 40 7 -8 91 -223
4029b23L86J6l62K54o7Q5m0j69j3P0K80j48j23Q5n7J80J6k65R4o1n2J1o3L12m13
$$ -223 163 179 -183 71 4 89 49 -120 -133 -63 217 69 -54 31 -26 154 170 -95 -1 -62 -114 -103 -166 146 -267
4054b67L55O5j65J87%p1jO5j96K45m51L10j60j9N3J1k5O6j4J06lj21J27r0j5L9
$$ -267 88 153 -12 175 175 104 103 168 -28 217 -234 76 -84 -103 -50 -39 -64 2 -12 94 91 -30 97 7 -8 31
4080C1j60K45k52N1J73K03j76l9j81J07K4l4J13j60J04J09J51k50J01k90K63j74
$$ 31 -129 116 -136 -85 88 291 115 76 -105 2 26 -8 105 -55 49 158 309 59 160 -130 133 -41
4102d1O0J22k23j37L97n6l3r1p2P9k03J53J63p7Q7R6j68N6j97R6LJ26k44K39j58
$$ -41 19 141 -82 -219 178 122 89 -2 -74 5 -198 -45 118 41 128 224 56 112 -85 11 14 140 -104 135 -23
4127b3LN9k1j04L02l70J95K2j64M1k9J67j76J25j26K37r6P9m7J25j31J6j20j85
$$ -23 -20 39 18 -86 216 -154 41 63 -101 -60 -89 78 -98 27 -99 138 42 121 74 199 68 84 -36 -221
4151b21J08k5O6J66J80l77j02L11k16J86l7k1j58P9J92RL6j95l1J8J24l8J75k3
$$ -221 -113 -138 -72 94 274 -103 -205 106 -110 76 39 18 -140 -61 131 140 176 -19 -50 -32 92 54 229 206
4175B06j27k18j41L95K04m88O7L28j92m55O23j63Q0lk57M9O4o2J7K24Lr8j27J86
$$ 206 79 -139 -280 115 319 -169 -102 226 34 -421 202 39 119 116 -141 -92 -28 -90 -73 151 154 56 -71 115
4199A15k27P1p4Q2j24rL77l33J69j24pJ29L2r1J34j14k73M5J44L3R7O6r9K4K8
$$ 115 -112 -41 -115 -33 -157 -166 211 -122 47 -77 -84 45 77 -14 120 6 -267 -222 -78 -45 52 118 19 43 71
4224G1j26k4J42P1P9j5m1k15K14o6M7j71p9J03j03j45J31J2M1jJ72kj22j80L82
$$ 71 -55 -79 63 134 213 198 157 -58 156 90 137 -34 -113 -10 -113 -258 -127 -115 -74 -75 97 95 -27 -207 175
4249A75l56o5K12J82l22R1K72k12Ok85L08p6r0J37J23p7J4j70J96j49O7j75M51
$$ 175 -181 -246 -34 148 -174 -83 189 -23 -17 -302 6 -70 -160 -23 100 23 37 -133 63 -86 -19 -194 257
4272B57k36q8J66J26l59J52J25j71j86K18n5L50k21j54Q3J40k54M02j04l01P3
$$ 257 21 -67 99 225 -134 18 143 -28 -214 4 -51 299 78 -76 7 147 -107 295 191 -110 -37
4293c7J9k96N89l39M7l2j67L46q0J75k48J33p7r1M1M9j14m5K90l35J13K09j52
$$ -37 -18 -314 275 -64 -17 -49 -216 130 50 225 -23 110 33 -58 -17 32 -82 -127 163 -172 -59 150 -2
4316bj29J02Q3n8P6m6p0J69l04K96K1k07M1J86k92p9L58j93L8ok08K05O3q0M9
$$ -2 -131 -29 54 -4 72 26 -44 125 -179 117 138 -69 -28 158 -134 -213 145 -48 -10 -16 -224 -19 44 -36 13
4341A3K07j71j2J39k91J82l44N4M32k82KJ78l65L92k72K36l61M36k8k9q8k20K52
$$ 13 220 49 37 176 -115 67 -277 -223 209 -73 -71 107 -258 134 -138 98 -263 173 145 116 28 -192 60
4364F0j7L2J38j23P9k17l6KJ10M7l7M4rP1j86K40j43p8q9j36J99Q3l7O1q7M8J9
$$ 60 43 75 213 90 169 -48 -84 -82 28 75 38 82 73 144 -42 198 55 -23 -112 -248 -49 34 -3 58 -29 19 38
4391C8m8J15j88LN8j42Q2K99j57J21l23j1j2K67j25QJ44l05L26j34M0R3j63k04
$$ 38 -10 105 -83 -80 -22 -164 -82 217 60 181 -142 -153 -165 102 -23 -15 129 -176 150 16 56 149 -14 -218
4415b18N5J69j63J17mr9M15j60p0Q5N2m08M4J57j36r2l6L17J42k94p4R2j09K55
$$ -218 -163 6 -157 -40 -44 -143 272 112 42 127 179 -229 -185 -28 -164 -256 -292 25 167 -127 -201 -109 -218 37
4439C7l7K05l79O4L22l13N0K68q2p7Rp4J55j01k89k7K83O1k38K52K29m27J8J54
$$ 37 0 205 -174 -110 212 -101 -51 217 135 58 67 -7 148 47 -242 -269 14 75 -163 89 318 -109 -91 63
4463F3j19J35k70K22n7J04P2j33k3q5P9J00k94J96K47m07P4L28k9j47k18J35j54
$$ 63 -56 79 -191 31 -26 78 150 17 -6 -91 -12 88 -206 -10 237 -170 -96 232 203 56 -162 -27 -181
4486a81L12N5k36r7K39k40J78L2o3j43N4P1j93L41l31L14q3k6K0k52K15o8L56
$$ -181 131 186 -50 -147 92 -148 30 62 -1 -144 -90 -19 -212 129 -202 112 29 3 23 -229 -14 -82 274
4509B74j87k30K99N4j76J13mj20j05K99j71J05k45J59j45k02J57K83k18K13qk70
$$ 274 87 -143 156 210 34 147 143 23 -82 217 46 151 -94 65 -80 -282 -125 158 -60 153 145 -125
4531a25K71k4j9j93K78J0q8l03K05J65j94j84K29K0j76l59P41l39O9J00j07l0
$$ -125 146 122 103 -90 188 198 110 -193 12 177 -17 -201 28 48 -128 -487 254 -85 -16 84 -23 -53
4553e3K35J3j19l49K28j18J83k16N1J60o6L98k14j39J20j09J15j16O4K33k54l66
$$ -53 182 195 76 -273 -45 -163 20 -196 -145 15 -51 347 133 -6 114 5 120 4 68 301 47 -319
4575c19K54j0L57o86L90J10r6o6J4J09j84J58J37j28O0o7K8j05k59L98k1j98K0
$$ -319 -65 -75 282 -404 -14 96 0 -66 -52 57 -127 31 168 40 100 33 61 -44 -303 95 74 -124 -104
4598a04k3Q3j22K44P4q2j21k5k2J54j57j13R2j2J95r7L0o2J76K7J41k36j18J43
$$ -104 -127 -44 -166 78 152 70 -51 -76 -98 56 -101 -214 -122 -134 61 -36 -6 -68 108 135 276 40 -78 65
4622F5Q2l30J37J6j68K61P7k89L28j02j74L7N9n6M3l7J28J07j48l0K2j92J24M01
$$ 65 147 -183 -46 -30 -198 63 140 -149 179 77 -97 -60 -1 -57 -14 -51 77 184 36 6 28 -164 -40 361
4646C61m42J46j70K08l4K21k78J96j14qj84J78O1j89J12k76K02o0J07Pj69p4L34
$$ 361 -81 65 -105 103 69 290 12 208 94 86 -98 80 141 -48 64 -212 -10 -70 37 44 -125 -199 135
4669A35k82l3K92j03n7J31k48R2J22j37J66o6k7K06k86J21k4O4n5k22K43r6l1
$$ 135 -147 -180 112 9 -48 83 -165 -73 49 -88 78 12 -15 191 -95 26 2 66 11 -211 32 -64 -95
4692i5L6O2Q7l31N8J11J90k25J46mr4j7J33Q4r9Q8l3o3l68J55N3K31k50L31j44
$$ -95 -59 3 90 -241 -183 -72 118 -107 39 35 -59 -76 57 141 42 130 97 34 -334 -179 -126 105 -145 186 42
4717D2k17J54K64k00Nj28J09P7k36R9L6R2l1j59m7r2J71k73L34Ml5O5L01m45R9
$$ 42 -175 -21 243 43 48 -80 29 106 -130 -31 5 97 66 -93 -140 -232 -61 -334 0 4 -31 34 335 -110 -11
4742a1K44j81J74k67J85j15j32mM5m6P4o2J18k24L92N5j82R5k98J16j54L04k69
$$ -11 233 52 226 -41 144 29 -103 -107 -62 -108 -34 -96 22 -202 190 245 63 158 -140 -24 -178 126 -143
4765a43P0K31k32L3j24L87j44K2k81J1J70o7L01k03l24L42j64J20j0J55k19J75
$$ -143 -73 158 -74 -41 -165 222 78 100 -181 -170 0 -67 234 31 -293 49 -115 5 -5 150 -69 106
4787A06l93J82L10l17K22lk0n0j33n4J62k02K51j81K60l16M8J0L51k15r5k5J37
$$ 106 -287 -105 205 -112 110 107 87 37 -96 -150 12 -190 61 -120 140 -176 -128 -118 233 18 -77 -102 35
4810C5j77K28r6m4R0J16k73J68J05n0J34j04q0L4n2J17j84p4N6J59o9L0j26K1
$$ 35 -142 86 -10 -54 36 152 -121 47 152 102 236 132 52 86 34 151 -33 -107 -51 108 39 69 -57 -36
4834c6J21k94PM85k21q1p0J33j27M7J03k76K80Q1k92j71K48j0n6m6m9l2NK08k75
$$ -36 85 -209 -202 283 62 -19 -89 44 -83 -36 67 -209 71 152 -140 -311 -63 -73 -129 -175 -224 -256 -251 -43 -318
4859c18L16k69K46k2j43Q3k9R2O4pk0O1o1q7K05k25N4k9J49j11J15L8p3j13j5
$$ -318 -2 -271 -25 -47 -190 -107 -136 -44 20 13 -7 54 -7 -94 111 -114 -60 -89 60 -51 64 102 29 -84 -99
4884i9N1Q9j20J26j17P6M2j52K16K4j43n7J12o6Q4l19L43k2j3o8j50P1N4JK68
$$ -99 -48 41 -79 47 -70 6 48 -104 112 136 -7 -64 48 -18 66 -253 90 68 55 -13 -163 -92 -38 -37 231
4909B31k44l0N6J01k42N2K32j64J90l53L20J65j68j57k1O9J41n1j66k4m6J84l7
$$ 231 -13 -43 13 114 -128 -76 156 -8 182 -171 149 314 146 -11 -32 37 178 127 -39 -63 -109 75 38
4932C8J96k2l63N9J59n0J37j62M4J2M6J83l97J95j01j65L2M94m33j29J32k89J14
$$ 38 234 212 -151 -92 67 17 154 -8 36 48 94 277 -120 75 -26 -191 -159 335 -98 -227 -95 -384 -270
4955b70K32J73l30q4M57l43K01j04rON8Q1q0L5J6n7l8RJMm7p0R1r6K07J1l9j24
$$ -270 -38 135 -195 -279 178 -165 36 -68 -77 -71 -13 68 -12 23 39 -18 -56 -47 -46 -42 -89 -159 -68 -164 43 54 15 -109
4983a09M8J28j56K23l59N85m02J03K0j33J49N3k91K79j70j31L15l9Jk57K10P0
$$ -109 -61 67 -89 134 -225 360 -42 61 81 -52 97 150 -141 138 -32 -163 152 113 114 -143 67 137
5005A37j01p2p6L69l03k7q4k10K57J21l8j09K41l89L73n2oq4N6m8N5j88%K90k60
$$ 137 36 -36 -112 257 -46 -73 -157 -367 -110 11 -27 -136 105 -284 89 37 31 -53 3 -45 10 -178 -178 112 -148
5030a48O5n4R0K36k59p5M5R9l5J56j88R9k28L58k70K56l10J10N4O2L1j13o4J62
$$ -148 -83 -137 -47 189 -70 -145 -100 -1 -36 120 -68 31 -197 161 -109 147 -163 -53 1 63 94 -19 -83 79
5054G9k37J62Q4jN3r2nj58j15K05k3J9K44l00m4K67q8J4q3K34j67k38K20j95L6
$$ 79 -158 4 88 87 140 48 43 -115 -230 -25 -48 -29 215 -85 -129 138 50 64 -19 215 48 -190 30 -165 -129
5079a29P6q2K11j99J04J23j82P2K4j66K03j7m5J75k85K75j85J00j28J15MN6j40
$$ -129 -53 -135 76 -123 -19 104 -78 -6 18 -148 55 38 -7 168 -117 158 -27 73 -55 60 64 120 -20
5102b0j50J73k1J09l7M2j16j00J98p6J04j10Jjj6j2k2R2p4o3K26j57l8P8l67L81
$$ -20 -170 3 -18 91 54 96 -20 -120 78 2 106 -4 -3 -4 -20 -32 -54 38 -36 -99 127 -30 -68 10 -357 24
5128B4mj70L58Pn7k95K2Q9J03r2k1L5j10R9m2L3j0L0J26k23R2N1K77m33K86j82
$$ 24 20 -150 208 215 158 -137 -115 -26 77 -15 -36 -1 -111 -12 -54 -21 -31 -1 125 -98 -6 45 322 -111 175 -7
5154gm5J96k93R0Nl7l4J73j11L2J69j02P8M7j47O7P8k3j99O4o0l9J57M8P8l02
$$ -7 -52 144 -149 -59 -54 -91 -125 48 -63 -31 138 36 114 161 14 81 159 136 -63 1 -59 -98 59 107 185 -117
5180a17M4J14j6K53l27Q6Q6N7M1J44l18J54k53l3Q8J15o4j31l9j67K92Kj16r7
$$ -117 -73 41 25 278 -49 37 123 180 221 365 47 201 -52 -85 3 118 54 -77 -116 -283 9 11 -105 -202
5204b02J89k4j09J51q9Q4o9R0K0K0j19M9J32J90k60q7o8L1K01j28J34j46N9R0
$$ -202 -13 -37 -146 5 -84 0 -69 21 41 61 -58 -9 123 313 53 -34 -102 -71 130 2 136 -10 49 139
5228A39k38J66k7R1k15p3J35r0J56P9j98K5k10J98L9r6P0M4o0K25l26l6J80k8
$$ 139 -99 67 40 131 -84 -157 -22 -112 44 123 -75 -50 -260 -62 -23 -119 -49 -5 -65 160 -166 -202 -22 -50
5252e0R1k1j64o8J19R3J14m0Q3l53K64m8j6J71l70Q3L24k66P6k02K44m5R7J6j10
$$ -50 41 20 -144 -212 -93 0 114 74 157 -196 68 20 4 175 -195 -112 212 -54 22 -180 64 19 116 132 22
5277B2q0k88N35l90K24r2J15P0k20K81m65L47j57%J64K15j60j48j38P2j03L00
$$ 22 -58 -346 189 -201 23 -69 46 116 -104 177 -288 59 -98 -98 66 281 121 -27 -165 -93 -196 104
5299A04JR7k31R3k42L63k72k96M45J03j47j58L47j28j19m4l14K27j04J91J56l28
$$ 104 105 202 -29 64 -178 185 -87 -383 62 165 18 -140 207 79 -40 -84 -398 -171 -275 -84 72 -256
5321b56K66K5k3m4m3K13J2j42kj03J35k2L0j55M5J23j66l4K46j67mJ14m3J11p4
$$ -256 10 35 12 -32 -75 138 150 8 6 -97 38 16 46 -109 -64 59 -107 -141 105 -62 -66 48 5 116 42
5346D2l19M78j64j51L10k16L09l42n4j12K65kPOj5J20j99K93Lkm25L19J06k17
$$ 42 -277 201 37 -114 196 -20 289 -53 -107 -219 46 44 51 57 42 162 -37 256 259 257 -168 151 257 40
5370D0j15k3K23j73R2j74L17j36j54r5J34J77q8J7j23P0j23J96J89j40k21K42
$$ 40 -75 -98 125 -48 44 -130 187 51 -103 -198 -64 113 25 42 -81 -11 -134 62 251 111 -110 132
5392A32j6j27J7J01j46j15l6J70J73l93L05J4l6M5r9J02j08P7j28L6M7j03J04
$$ 132 116 -11 6 107 -39 -154 -190 -20 153 -240 65 79 43 88 -11 91 -17 60 -68 -32 15 -88 16
5415A6p2j8N6j64Q1J17l7k8Q6q3J86j17J31j21J10l38L65m16N31o4m89L30q1m3
$$ 16 -56 -74 -18 -182 -101 16 -21 -49 37 -46 140 23 154 33 143 -195 170 -246 285 221 -268 62 -19 -62
5439f2L0oK19r8j67K82k49J10j10q4l1QJ93J83k07J65k36J46nk8n3M8M7m9k11
$$ -62 -32 -38 181 83 -84 198 -51 59 -51 -135 -166 -158 35 218 11 176 -60 86 81 53 0 48 95 46 -165
5464a65L22j61q8J24p8o3K56j46o9j73K4J72L01l56J35J25j92k8J05J33m2l06
$$ -165 157 -4 -92 32 -46 -109 147 1 -68 -241 -217 -45 256 -100 35 160 -32 -60 45 178 136 -170
5486a70J46J3J21K6o9k44L18r5n2J56j10l6L3j74J5K24l6J0k64L08j81J75o7j9
$$ -170 -24 -11 110 136 67 -177 141 46 -6 150 40 4 37 -137 -122 102 66 76 -188 120 -61 114 47 28
5510B8r1j42J82K30l75K53N7k84K68q8j65J53R2j44j3q4O2q5J08o5K14j63K35
$$ 28 -63 -205 -23 207 -168 85 142 -142 126 38 -127 26 118 -26 -39 -123 -61 -146 -38 -103 111 -52 183
5533A83m7k11K1n0N56k72l3j34J31j46K04k06J23Lr1n2K18k23L5l5K31j89k16
$$ 183 136 -75 -54 -104 452 180 147 13 144 -2 202 -4 119 122 31 -21 197 -26 9 -26 205 16 -200
5556b00J72P5r3P0kj91N6L92l77R6nj57J76j15J52K4l17K93n9J17O7j99N9j31
$$ -200 -28 47 -46 24 22 -169 -113 279 -98 -2 -7 -164 12 -103 49 73 -244 49 -10 107 174 -25 34 -97
5580i7J65l32L41k2j5j09J50l0k8N2j06j2l1M5j91K33o5k14L49K0m2k04K78k39
$$ -97 68 -264 77 55 40 -69 81 51 23 75 -31 -43 -74 -29 -220 13 -52 -266 83 103 61 -143 135 -104
5604a04p7K31l1J31m7j12j56J79j4O5n8K00N7k03j09j29J55J30k5j56K3K4J4Q5
$$ -104 -181 50 19 150 103 -9 -165 14 0 65 7 207 264 61 -48 -177 -22 108 83 -73 -50 -26 -12 73
5628G3j25k25R7N8K36j39O9Q5K09k23n21M40j45p9K80n3Q8k5P1n6O9j13p8L0l5
$$ 73 -52 -277 -180 -122 114 -25 44 129 338 115 -406 34 -111 -190 90 37 125 100 171 115 184 71 -7 23 -12
5653a2j36J12N4l3j70J23Q7Q4l2j01J38N9k31N8j68J5K42l87L35K08k74k03R8
$$ -12 -148 -36 18 -15 -185 -62 25 109 77 -24 114 173 -58 0 -168 -153 89 -298 37 245 -29 -232 -134
5676a34L07k05J75l65M82k46j95R5qJ2RO5j38K04m5k1k5j1n5J6J24r5j56L23q9
$$ -134 173 -32 143 -222 260 14 -181 -86 -94 -82 -73 -8 -146 58 13 -8 -33 -44 -99 -83 41 -54 -210 113 24
5701B4O0P8k30J22o1k48M01m2o9J24k22P0j67L26j74k08K20nNj77K07L4P9j46
$$ 24 84 162 -68 54 -7 -255 146 104 35 159 -63 7 -160 166 -8 -216 4 -1 4 -173 34 68 147 1
5725AJ4L5k15K69j71Nj16J54o2J89j10jJ7j01O6L5J49k21r7J32k72K29L5J83j20
$$ 1 15 50 -165 104 -67 -62 -178 -24 -86 103 -7 -8 9 -92 -26 9 158 -63 -160 -28 -300 -71 -36 147 27
5750B7j31l1m2%J08Q1l9P2j27J74k69J46J64K72j61k72k71M57n62M34J28j02R8
$$ 27 -104 -135 -177 -177 -69 12 -27 45 -82 92 -177 -31 133 405 244 -28 -299 158 -404 30 158 56 154
5773A54j90j3k57M15j16Q3J78j6o5k56J49j82L7K07m96M50k94L56Rj55q9J66N3
$$ 154 -36 -49 -306 109 -7 76 254 238 173 -83 66 -116 -79 128 -368 82 -212 144 153 -2 -91 75 128
5796A28jo6j1j69K34nk18pJ93j45j08J30K23J5l28QK22J8j70k6P1J47m34J67R9
$$ 128 127 61 50 -119 115 110 -108 -115 78 -67 -175 -45 178 193 -135 -127 95 113 -57 -83 -12 135 -299 -132 -33
5821c3Q9p2n4L4N0QJ07j67l44K63P1R9k0j32J0K60k51l7J81k14K02l14J57K25
$$ -33 56 -16 -70 -36 14 22 129 -38 -382 -119 -48 51 31 -101 -91 169 -82 -119 62 -152 50 -264 -107 118
5845A18l05M07q5q2k5r5r1J2JK58pn1K43l49K29j25j24J20q6J48L8r0m2qk5j78
$$ 118 -187 220 135 53 28 -67 -158 -146 -145 113 106 55 298 -51 178 53 -71 49 -37 111 149 59 17 9 -16 -194
5871a94J97N3N0j64J20J03p5k68N9l8L68r6J45j19J14l78r3M36j44o3k87M26j65
$$ -194 3 56 106 -58 62 165 90 -178 -119 -157 211 115 260 141 255 -123 -216 220 76 13 -274 152 -13
5894a3j32j7J50Q7o9K31L1j97m3j05q5J49j2J08j34J53l21J99K05k55P7j97J99
$$ -13 -145 -162 -12 75 6 237 268 71 28 -77 -162 -13 -25 83 -51 102 -219 -20 185 -70 7 -190 9
5917Ij71J36q4K36J35r3J58j23k59k4J27J4O8J03k25M5K00l67J33p0mJ32q8K03
$$ 9 -162 -26 -110 126 261 168 326 203 -56 -80 47 61 129 232 7 52 252 -115 18 -52 -56 76 -12 191
5941A91k63q3J92n8J03m9J21j45P2l36L78l17L69j60q5J45k36L36q7j46P7k9L5
$$ 191 -72 -155 37 -21 82 33 154 9 81 -255 123 -194 175 15 -70 75 -161 175 88 -58 19 -10 25
5964B5j11J62N1j10K0pJ22k24J74qj42J08k7P7k31J95q6P2Q5j65kK03j13j67K1
$$ 25 -86 76 127 17 37 30 152 -72 102 94 -48 60 33 110 -121 74 -12 60 145 -20 -22 181 68 -99 -78
5989g8l3J64k78o3K39k7P6J12l5q0K9L9O6Rk39Q3M3N9p1j67K00j26J17j5M9j03
$$ -78 -111 53 -225 -288 -49 -76 0 112 77 -3 26 65 131 140 -99 -16 27 86 15 -152 48 -78 39 24 73 -30
6015c0p1J24j55K05k74j87L99J6j27J59r2j8k38L00m8K48k81N0k4j54K55R9j5
$$ -30 -101 23 -132 73 -201 -388 11 27 -100 59 -33 -51 -289 11 -37 211 -70 -20 -44 -198 57 156 141
6038A41l08L79q4n4j15J97P8pk63j00L47j87O9j55m2J39m9Q5m4l1M2p4o2Q2r8
$$ 141 -167 212 128 74 -41 156 234 227 -36 -136 211 24 93 -62 -104 35 -14 71 27 -4 38 -36 -98 -16 -114
6063a14N3R3kn7K26p3oq1J76j61K1j26j11M5O8R5j73K31r0n9J54m0o4l4k4r7L42
$$ -114 -61 32 30 -27 199 126 120 39 215 54 75 -51 -162 -117 -49 46 -127 104 14 -45 109 69 5 -29 -53 -150 192
6090A92k5r4k24J87N4m11K12O9o8P8k2j46J32J26k35J01K27k42J45j9P4j10k48
$$ 192 167 73 -151 36 90 -321 -109 -40 -108 -30 -52 -198 -66 60 -175 -74 153 -89 56 37 111 1 -247
6113b47J28J13J13R7q6k80K74j39P2J71k55o2J25K38m47J51K36m31L20k8j24P
$$ -247 -119 -6 107 204 118 -162 112 -27 45 216 -39 -101 24 262 -185 -34 202 -229 91 63 -61 -54
6135e4Q1o1J48j1m69O40j84k37K52Q9q6k23O0Km4k2J04K3Kl4N9J74j92j73Q9n5
$$ -54 27 -34 114 103 -366 274 90 -147 105 194 108 -115 -55 -53 -97 -119 -15 8 10 -24 35 209 17 -156 -67 -122
6161a22J78O8p5K00k08Q3k40J29J36k98J74j38j0R7n6K12O2j92j9J50j80Q8q7
$$ -122 56 124 49 249 41 124 -116 13 149 -149 25 -113 -123 -26 -82 130 192 0 -19 131 -49 39 -48
6184d8j10J43O2l05L59k11Q2J57j7j02l8o1K85j42J97k32J58l94N6Q9N6q2j89
$$ -48 -158 -15 47 -258 101 -110 -28 129 112 10 -28 -89 196 54 251 19 177 -217 -161 -72 -16 -98 -287
6207b87L53nj89JQ9N6m7R9oj83Q0%J13k21K74m43M38m2j72R3J28o7J19j88j17
$$ -287 66 61 -128 -127 -38 18 -29 70 64 -119 -39 -39 74 -147 127 -316 122 80 -92 1 129 62 181 -7 -124
6232a24K95j60J33j32J22n4k6Q7k20k7J28j64K35L7K64l54J41j59j07J44j92Q3
$$ -124 171 11 144 12 134 80 54 141 -79 -106 22 -142 93 130 394 40 181 22 -85 59 -133 -50
6254e0O4J1O9j19k69K43K1k3P5l1j97j20L31k76J06J99M8j29O9k13L83k52J80
$$ -50 14 25 94 -25 -294 -51 -30 -53 22 -9 -206 -326 5 -271 -165 34 82 -47 22 -191 192 -60 120
6277A20r1k31J55j54m0L21r6J74j69m0q7J13Q5J46l39m1J94K6l46L72k36J46j84
$$ 120 29 -202 -47 -201 -241 80 -16 158 -11 -51 -138 -25 60 206 -133 -174 20 46 -300 72 -164 -18 -202
6300b02L56n9k92K84k40K78j20k98M76r8j20J16l52K56K28K4k77P6j65J97j65
$$ -202 154 95 -197 87 -153 125 5 -293 183 85 -35 81 -271 -15 213 237 -40 36 -129 68 -97
6321i7J32j35J85n2j11Kj48M5K61K8n7j39J98j61J73k35J22j00MJ1J68l2k61K66
$$ -97 35 -100 85 33 -78 -76 -224 -179 82 110 53 -86 112 -49 124 -111 11 -89 -85 -74 94 62 -199 67
6345F7M2J47l80k2J88P2Q1j87K0r1J59K3jL7m67N22k06O2m4K76l00L02j86j87
$$ 67 109 256 -124 -146 42 114 195 8 28 -63 96 119 118 155 -312 210 4 66 22 298 -2 300 114 -73
6369g3r9L72j1r1P3J07l41J09j40k60L16L47j29l61L05j46K17k17NQkk0P3L3J80
$$ -73 -172 200 189 98 171 278 -63 46 -94 -354 -38 309 180 -181 124 -22 195 -22 -17 -9 -11 -31 42 75 255
6394B55k98l1o2K15j42J78M7j40k06Q9K43o9J5j18r5N8j53L14l31R4K89j12R2
$$ 255 -43 -74 -136 79 -63 115 162 22 -184 -95 148 79 94 -24 -119 -61 -214 100 -231 -137 152 40 132
6417A32j88Q5K00q4n9j23j37K21o2mJ21k15K9L51k46J10k37K58r7K09j65j46j3
$$ 132 -56 29 229 145 86 -37 -174 47 -15 -19 102 -113 -84 267 21 131 -106 152 55 264 99 -47 -60
6440f0K11q3k81K85K1j50M6K22j28r3Q1j90J34N5j81oM89m78P6N9j63K18j13J08
$$ -60 151 68 -213 72 93 -57 -11 211 83 -10 71 -119 15 70 -111 -117 372 -106 -30 29 -134 84 -29 79
6464G9j08o7J74p5j87N8N4k4j73K76j32L52l08J16o4j29K73J01n2j72K39j47j62
$$ 79 -29 -96 78 3 -184 -126 -72 -96 -269 7 -125 227 -81 35 -29 -158 115 216 164 -8 231 84 -78
6487g8r8J56p4K0J03l61N15j26j68M6j5N9j25O3j2J17K06j33K2l1R3K6r6k87K99
$$ -78 -176 -20 -94 -74 29 -332 183 57 -111 -65 -80 -21 -146 -83 -95 22 228 95 117 86 179 205 109 -178 121
6512A21l5k84K86J7j50jL27l45n6J49j3Kj10j93L07L9p0P8m2j7J30k65L84k45
$$ 121 86 -198 88 105 -45 -46 281 -64 -120 29 16 18 -92 -285 22 61 -9 69 27 10 140 -125 259 14
6536A4K3k56L28j40RJ64k47J32j67L0m0J17J28R9k61J46M9j14j50K77k03J2J17
$$ 14 37 -219 109 -31 -22 142 -105 27 -140 -110 -150 -33 95 194 -67 79 128 14 -136 141 -62 -50 67
6559F7LM3j43K78l72j9L1K44P0p0k64K37m19L93k0l2R9j54j3p5P5j07l4J19O4
$$ 67 70 113 -30 248 -124 -143 -112 132 202 132 -132 105 -314 79 59 27 126 -28 -41 -116 -41 -148 -182 -63 1
6584AJ79k27l1K09l86L73K9m17J57Kj90J62Q5j21J67J24l61K29J02k9J3l26L49
$$ 1 180 -47 -78 131 -255 118 147 -270 -113 -111 -301 -139 -54 -175 -8 116 -245 -16 86 57 70 -256 93
6607I3k59L23k5j22j23J19J15K6l3J12k05R4k39O3J06j51r8l2R3J31n1j03J79
$$ 93 -166 157 132 10 -113 6 121 147 114 226 21 115 -124 -61 45 -106 -204 -236 -143 -12 -63 -166 13
6630A3J25j34O7j90J67%j7J8r0q3%J44mJ47J82j99k2K1j11mr3J10K4j80L07r3
$$ 13 138 4 71 -119 48 48 31 49 -41 -124 -124 20 16 163 345 146 124 145 34 30 -63 47 71 -109 198 105
6656A05k98n9J71J76j33K3Q1J65l66K30K08m19o7K27J84n46J99O2K37k81J41O
$$ 105 -193 -252 -81 95 -38 -15 66 231 -135 95 303 -116 -183 44 228 -318 -119 -57 180 -101 40 46
6678D6k33K03J43j10M6m6j85J05j5L6j0L68j91k4j87q6L16j17J66j29J5m8j5m06
$$ 46 -187 16 159 49 95 49 -136 -31 -46 -10 -20 348 157 133 -54 -140 176 59 225 96 111 63 48 -358
6702c58L44j15J90j41K33o0k60K82l80J89J09J8r9K14M0l54K25J28j82pk74M16
$$ -358 -14 -129 61 -80 153 93 -167 115 -265 -76 33 51 -48 166 206 -148 77 205 23 16 -258 158
6724A58j50j14K37k65Q4n5j9J38j77j85L24o3L9j81RM41k00o0j36O3R3Q0j22J68
$$ 158 8 -106 131 -134 -50 -105 -124 14 -163 -348 -24 -87 -48 -229 -220 221 21 -39 -175 -112 -19 61 -61 107
6748A07M5p5k08M5N5J94j03j34K4P9j56L29j74J11l55L95k28J40J16N7n00K11
$$ 107 152 77 -131 -86 -31 163 60 -74 -50 29 -127 202 28 139 -216 179 -49 91 207 264 -236 -25
6770b5Rq4J21j58p0J46R4K9L1k45L83j21j50J75m8k69L21l9Q6j18j78J45K17o9
$$ -25 -16 -100 21 -137 -207 -61 33 62 93 -152 231 110 -40 135 87 -182 139 100 186 68 -110 35 252 183
6794A83k14J66o3j52K0m6K4o6M13j25j9k49J58J74j14j12k1K2K03j27k74L11q9
$$ 183 -31 135 72 -80 -60 -106 -82 -148 265 140 121 -128 30 204 90 -22 -43 -21 182 55 -219 92 3
6817Cj49J79j9k07L4K52j13k68N35k85m4j0J4K34j83M6k68K23J26k1J18j91j73
$$ 3 -146 33 14 -193 -159 93 -20 -288 247 -38 -82 -92 -78 156 -27 19 -249 -26 100 79 197 6 -167
6840a67J79m8k30N7j44L16r1KJ04K7q2J77q2R6k86J55j01J88j49N7j28J85KM3
$$ -167 12 -36 -266 -209 -353 -37 -128 -126 -22 5 -77 100 18 114 -172 -17 -118 70 -79 -22 -150 35 37 80
6864H0k19J49p0J09rj6K2P4l51P1K70k11K84k39K15j33l49L23q9m0J11r8pK23
$$ 80 -139 10 -60 49 40 24 46 120 -231 -160 110 -101 183 -56 159 26 -323 0 -89 -129 -18 -116 -123 100
6888A00p7m9J32j12M8q9N0J76q0j37R9j82K5L0K77k48rk5J60P3q9j0j53j0m6N1
$$ 100 23 -26 106 -6 42 -47 3 179 99 -38 61 -121 -96 -66 211 -37 -46 -71 89 162 73 63 -90 -100 -146 -95
6914i5j1J15J48j90P1j41k5n8N42l93n7J43K49j75l52Q1J44J40o6k08J39Q6j9
$$ -95 -106 9 157 -33 38 -103 -128 -186 356 -37 -94 49 298 123 -229 -148 -4 136 70 -138 1 87 68
6937F8O0j54R5j04j3K47o6o1Nk8k29M30l97M0K14j79J71k57N5l9M41j83j69K4
$$ 68 128 -26 69 -35 -48 199 133 72 77 49 -180 250 -147 -107 107 -72 99 -158 -103 -142 299 116 -53 -29
6961b9j4R6K6k06nkJ61j05k63M39k35K24J41j05q9m9R4M3j27K63l06P1J51k83
$$ -29 -43 53 79 -127 -132 -134 27 -78 -341 98 -137 87 228 123 34 -15 79 122 -5 258 -48 23 174 -109
6985a09j0Q1pj3K20p6R9j6k25M2P0n9L4ok96Q9J07J12p2q0R6p8Q2K75l51J16k0
$$ -109 -119 -38 -45 -58 162 86 185 169 -56 -14 56 -3 31 25 -271 -182 -75 37 -35 -115 -19 -97 -15 260 -91 25 5
7012EL7jJ17j01k6M1l39L75l34K73k1J15j01R5j73q6J10N9P0j19K32k44K20k86
$$ 5 42 41 158 57 31 72 -267 108 -226 47 26 141 40 135 -38 -124 -14 45 115 -4 228 -16 204 -82
7036h2q3K65l20J21Q7J25j50N2J5Q6N9j26l5J78r4j07m7j38K39lL3k01K49j11
$$ -82 -165 100 -220 -99 -12 113 -37 15 30 116 175 49 14 192 98 -9 -56 -194 45 42 75 -126 123 12
7060A2m6j42J40K06j54L6lLk4k3j00J40o7M7r1j66L06j77M2n2L05j75J43k98L58
$$ 12 -34 -176 -36 170 16 52 49 52 28 5 -95 45 -22 25 -66 -232 74 -103 -61 -113 192 17 160 -138 220
7085B20k33j23J54o4M6j52K07j78K34k4l14K33J38L2k45r7K61k63M2M8J68j63
$$ 220 -13 -136 18 -46 0 -152 55 -123 111 87 -227 6 144 176 -69 -166 95 -168 -126 -78 90 -73
7107g3M1P2j04M3L6Q7P8M3j41R4j68r6K44o6NJ49P7m36O9J49j98K62j67p8m3K3
$$ -73 -32 40 -64 -21 15 102 180 223 82 176 8 -88 156 90 95 244 321 -115 -46 103 -95 167 0 -78 -121 -98
7133i8M09n52Q9q2L27j27K6Q3l2m8K39l98K88r5j16O6P2M0r4K9j21J00K7J26l42
$$ -98 311 -241 -152 -234 93 -34 -8 75 43 -5 234 -164 124 29 -87 -21 51 91 -3 26 -95 5 32 158 -184
7158a84J31K63k69L68l83J58Q5J9k07J55j11J44l10J85K0l6j8K6l8mk63M27j65
$$ -184 -53 210 -59 309 -74 84 169 188 -19 136 25 169 -141 44 64 28 10 36 -2 -6 -269 158 -7
7181gKl8K03p1m9k57R4M98l43M3l7Q3l0j15J31j6q2Jj36J89p1K34k87K28L9l47
$$ -7 -5 -43 160 89 40 -217 -123 375 32 75 38 121 91 -24 107 91 9 10 -126 63 -8 226 -61 167 206 -141
7207a41J4L26kl05O4J37m9q2R9j95J53J80j87n3J0MO8K31k33K10j53KJ02k12K02
$$ -141 -127 199 197 -108 -44 93 44 -38 61 -134 19 199 12 -41 -31 -27 41 272 39 249 96 98 200 -12 190
7232A90k24K39k4j92p8J33j45O2j72j22L0L52j73K29k53K60l16K51p1j08J40r9
$$ 190 -34 205 181 -11 -89 44 -101 -39 -211 -333 -303 49 -124 105 -148 112 -204 47 -24 -132 8 -91
7254i1k2R0n7k94O80l86K08Kj89J29K3k04K06j83J74M2j87j0j72L07O4j62k8k62
$$ -91 -113 -23 -80 -374 306 -80 128 130 -59 70 93 -111 95 -88 86 128 -59 -69 -241 66 130 -32 -60 -322
7278c22N12l8q9P3j20K5k66R7L58m56L07j10M9j28J69j09j8O6l6O8J7J20k33Q8
$$ -322 190 152 63 136 16 41 -225 -128 230 -226 81 -29 20 -108 61 -48 -66 0 -36 32 49 169 -64 24
7302B4j29j37K70j74L99j85j72J36q2J16j04J18n1K81l06j76K31N9j26j04J02
$$ 24 -105 -242 28 -146 253 68 -104 32 -50 66 -38 80 29 310 4 -172 59 118 -8 -112 -10
7323a0q1O1J8k10K16J11j89kJ2J49O9l9J4j26Pr5R2o2K26n19L32J14j25n2k1P4
$$ -10 -91 -30 -12 -222 -6 105 -84 -86 -74 75 144 105 119 -7 0 -95 -3 -65 161 -358 -26 88 -37 -89 -110 -36
7349c6O6k8j51K1P9J23J39k32k27J03J78M8j50K94k21J76k70K5P9k07J78k01K26
$$ -36 30 2 -149 -128 -49 74 213 -19 -246 -143 35 83 -67 227 6 182 -88 -63 16 -191 -13 -214 12
7372A2k5K29k64K70m49O1J70k01K28j01J71j10J21j26l01O22K8m67M8J28j30O6
$$ 12 -13 216 -48 222 -227 -166 4 -197 31 -70 101 -9 112 -14 -315 307 335 -132 -84 44 -86 -20
7394b0j93K45j51K72j30K4J1p8J42J21l97J29L15n06K07m1j07J95R0J8k04l1K5
$$ -20 -213 32 -119 153 23 47 58 -20 122 243 -154 -25 290 -216 -9 -50 -157 38 128 146 -58 -89 -64
7417f4J28j54O5Q0J06m8M6k22M1J2j92L71m07M09j14m6m3J05j27K35k6n9k10Q8
$$ -64 64 -90 -25 55 161 113 159 -63 -22 -10 -202 169 -238 171 57 11 -32 73 -54 181 155 96 -114 -26
7441b6j00J44j67K07J4p0J16o4p6k92N17r2j97N2M6j90K9J22O9K5j16p2N1j11
$$ -26 -126 18 -149 58 72 2 118 54 -22 -314 203 111 -86 -34 12 -178 -149 -27 42 67 -49 -121 -70 -181
7465a81J40j3K60k27J33k32K8n8L28k37P3j18K32M2k39j91L20q2m6j27O3J49k16
$$ -181 -41 -54 206 -21 112 -120 -92 -150 178 -59 14 -104 128 170 -69 -260 60 -22 -68 -195 -132 17 -199
7488a99K43mk35j7J54M2J97Jm97M18J3Q9j52k27K33rP0k09K21n19L00J34K0j39
$$ -199 44 40 -195 -212 -58 -16 181 182 -315 103 116 205 53 -174 59 50 120 -89 132 -387 -87 47 67 -72
7512g2L3m9R3J04j93L4K0q0K45m77K17L25j48r8n0J09J18m10M95j97p5K5j18K20
$$ -72 -39 -88 5 109 -84 -50 -30 -110 135 -342 -125 200 52 -46 -96 13 131 -279 216 19 -56 -31 -149 71
7536G1l51K12l1M3J05NP2j08J65k7r0k67K28P8l06K15k19K59P1j22m9J81j91r3
$$ 71 -280 -68 -99 -56 49 54 126 18 183 156 66 -201 27 105 -201 14 -205 54 125 3 -46 135 -56 -149
7560a49J5J96l3O3j54l9P4o0N0J6k6J55O8k72Q9J82m05N00M2l20mq2L18j96m8
$$ -149 -134 62 29 92 -62 -101 -27 -87 -37 -21 -47 108 176 -96 -7 175 -230 270 312 -8 -12 -94 224 28 -20
7585b0k55L76j25r7K33q3J30Nl1l9j95K99j98l0K6j8L2O7j94R7J44q9j08N0J18
$$ -20 -275 101 -24 -121 112 29 159 164 133 94 -101 198 0 -30 -4 -22 10 77 -117 -20 124 35 -73 -23 95
7610I5m7n4O2J14l8P5l81P3J52K85l50P9K62k68J67l05rNk3K17n4J94l31J41K08
$$ 95 48 -6 56 170 132 207 -174 -101 51 336 -14 65 327 59 226 -79 -88 -83 -106 111 57 251 -80 61 269
7635B69k31k80M99m01OO6K4J07p8J66l88K54K80M3k79j6j59K98l66J65J62r3N1
$$ 269 38 -242 257 -144 -138 -72 -48 59 -19 147 -241 13 293 336 57 41 -118 180 -186 -21 141 48 99
7658I9l3J09j23J35j50O0k09K98j09k14N1L25k07o0M3L5J21k06K6J06R8r9R3j05
$$ 99 66 175 52 187 37 97 -112 186 77 -137 -86 239 32 -28 15 50 171 -35 -9 97 195 96 189 84
7682H4R0k59q8o9J41J26k77M03K35m23j8P7Q5j45P7p9N0Q0k52K96k6J58m56J21
$$ 84 174 -85 -173 -242 -101 25 -252 151 386 -37 -55 22 107 -38 39 -40 10 90 -162 134 108 266 -190 -69
7706f9j7J20Q7j61J27j80J53Pj59J41j81R1j60K85k5k2j42R2j01n0J29J18l0k62
$$ -69 -86 34 121 -40 87 -93 60 67 -92 49 -132 -41 -201 84 59 37 -105 -13 -114 -164 -35 83 53 -209
7730b09K20j37J32l11M71k74J8J66L9L9n0k6J1J32k99J09l0j25j69J27R9p2R6
$$ -209 11 -126 6 -305 166 -108 -90 76 115 154 104 78 89 221 -78 31 1 -124 -293 -166 -67 -139 -43
7753d3J53P2k44J76k48J71p2K42l50J39J68k10K05j50j14K08j65N7k4O6k04J85
$$ -43 110 182 -62 114 -134 37 -35 207 -143 -4 164 -46 159 9 -105 103 -62 -5 -29 37 -167 18
7775A8q7K1J96j9k17n7J09l9J67K2Lj60Q3j98K31j58J37J1q2m4MJ35k77J75L3
$$ 18 -69 -48 148 129 -88 -145 -36 -75 92 114 117 -43 40 -158 73 -85 52 63 -19 -63 -59 76 -201 -26 7
7800Gn3J12P9j57m5O4k73N02k39l6M8N7k60J95R8o8J93j69p8m9K2J52Q3k73R9
$$ 7 -46 66 145 -12 -57 7 -266 236 -3 -39 9 66 -194 1 99 31 224 55 -23 -72 -50 102 185 -88 11
7825A1K94l64p0Q1p3J66J3R7M0k72J36j47J62q7J39q3k83J72r0K23k28L41j70
$$ 11 305 -59 -129 -48 -121 45 58 155 195 -77 59 -88 74 -13 126 43 -240 -68 -158 65 -163 178 8
7848Hk8O6J60r7P0j11j38J9l8J31Kj15N7J43m74N48j52j85L2K06o7q2j1kp8J28
$$ 8 -20 46 206 109 179 68 -70 -51 -89 42 44 -71 -14 129 -345 203 51 -134 -102 104 37 -45 -56 -58 -136 -8
7874hJ00l12J12K85k57J34o5r4J44J9K2j05J32q2Q6J08k26J41k01O0L3r1m0M1
$$ -8 92 -220 -108 177 -80 54 -11 -105 39 58 80 -25 107 25 111 219 -7 134 -67 -7 26 -65 -105 -64
7898f4J23q7J67o8j53M8P5p6k61L70P2j58k2mL0K10J78n95J63O2m3lj16K01K5
$$ -64 59 -28 139 71 -82 -34 41 -35 -296 74 146 -12 -34 -38 -8 202 380 -215 -52 10 -33 -36 -152 49 74
7923G4j20p2J77j36L8j62K81l5J77k59j03L71l96L29J90n48J91j35l8P9Q2K73
$$ 74 -46 -118 59 -77 -39 -201 80 45 222 -37 -140 231 -165 164 354 -194 -3 -138 -176 -97 -15 258
7945B58l46J63j65J16j42M20m16K45j12J76pj74n7N1k18M3M63k00q0j46J68R2
$$ 258 -88 75 -90 26 -116 304 -112 133 21 197 190 16 -41 10 -208 -165 298 98 18 -128 40 132
7967A32j99K95j72l8o3J35K36m51K39j32k57K48O0n1K42j83j82j44J40K92j54
$$ 132 -67 228 56 18 -45 90 326 -125 114 -18 -275 -27 33 -18 224 41 -141 -285 -145 147 -7
7988gn3m6j58L09j43L6J92j56K6J58k75M8N3J29l28J42Q4k36K00O0J36j60J66
$$ -7 -60 -106 -264 45 -98 -62 130 -26 0 158 -117 -69 -16 113 -215 -73 11 -225 -25 35 171 11 177
8011A77Q5l32J76j33J02k3q5m7J04J94j57j39L8j98J47M1l0j9K24r8m3K5R7R4
$$ 177 262 -70 106 -27 75 52 -33 -80 24 218 61 -78 -40 -238 -91 -50 -80 -99 125 27 -16 9 106 200
8035B00k70Q7J24J26k34j39J20k3L6n1R0j38M7M9K64Rj36j18R6O0k34P3p8K11
$$ 200 -70 17 141 267 33 -106 14 -9 27 -24 66 -72 -25 24 288 297 161 43 139 199 -35 38 -40 171
8059A71l6j44p7J86l43J23O6K06P0l55J46N9q7J82j07k2o3J79k8k01K2P0o4o3
$$ 171 135 -9 -86 100 -243 -120 -54 152 222 -133 13 72 -15 167 60 38 -25 154 126 -75 -53 17 -47 -110
8083a10j7J26K89k38J72k57q4jK83j25J75k31j24J33J94k35J26j99J07J98k32
$$ -110 -127 -1 288 50 222 -35 -119 -120 163 38 213 -18 -142 -9 185 -50 76 -123 -16 182 -50
8104e0J7J68j1O4R0l30p4k94O10j10k02J32j86L13k8j26q7O6jm2j1K4J49J36j08
$$ -50 -33 135 124 188 278 -52 -126 -420 190 80 -122 10 -176 137 109 -17 -104 -38 -39 -81 -92 -68 81 217 109
8129A09j47J76n5p6Rj36qK62j47O1p6k8J08j55P2j7J1j24K01J95k25N5j40K3m
$$ 109 -38 138 83 7 16 -120 -128 134 -13 48 -28 -56 52 -103 -31 -48 -37 -161 40 235 10 65 -75 -52 -56
8154e6J62k23J58m8J06M7j74L27l23q9N7K79l63J54J30l46K3K19k32r4M21k26
$$ -56 106 -117 41 -7 99 146 -28 299 -24 -113 -56 223 -140 14 144 -202 -179 40 -192 -286 135 -91
8176i1J49j65o0L21m17M1K26j22J18J37l86M8J5J29l1
$$ -91 58 -107 -167 154 -263 -222 4 -118 0 137 -249 -201 -186 -57 -88
8191h8
$$ Imaginary data points
##PAGE= N=2
##DATA TABLE= (X++(I..I)), XYDATA
0@%%%%%%%%%%%qJ6j6J6k2L0l2M0m8N6p2Q8j04J20j36J57j81K08k40K75l13L55
$$ 0 0 0 0 0 0 0 0 0 0 0 0 -8 8 -8 8 -14 16 -16 24 -24 32 -40 48 -56 64 -72 85 -96 112 -128 147 -166 189
33A89m02M55n13N76o47P23q05Q96r95J105j224J353j495J650j820K003k207K432
$$ 189 -213 242 -271 305 -342 381 -424 472 -523 582 -642 711 -784 866 -954 1049 -1158 1274
51A274k680K955l259L603l990M428m931N513o201P030q043R317j0977J3233j6494
$$ 1274 -1406 1549 -1710 1893 -2097 2331 -2600 2913 -3288 3742 -4301 5016 -5961 7272 -9222
66i222K1637l0953N2943j95170j24246M47356j08288j86566J75379J0042k20529
$$ -9222 12415 -18538 34405 -160765 -285011 162345 54057 -132509 42870 52912 -167617
77a67617J12757J41198n9133k2482l8037r8599J37047J07716j22877O445O8291
$$ -167617 -54860 86338 27205 4723 -33314 -131913 5134 112850 -10027 -3582 64709
88F4709j64031J9849K30189q1744j63667J21710q372j26692J57422R7250k01583
$$ 64709 -99322 -79473 150716 68972 -94695 27015 18643 -108049 49373 146623 -54960
99e4960k1757J07916q0079L4713J50797j36256j28110J40884J5511p7593J14618
$$ -54960 -76717 31199 -48880 -14167 136630 374 -127736 13148 28659 -48934 65684
110F5684L33j70200M9686J11555o0374K7483M5438j44859p855J62101m4611o8219
$$ 65684 66017 -104183 -54497 57058 -3316 24167 69605 -75254 -83109 78992 34381 -33838
122c3838R7448n9757j15201J35872P4028j23327J4521N0422r8376K9205J21652
$$ -33838 63610 3853 -111348 24524 98552 -24775 -10254 40168 -58208 -29003 92649
133I2649p2517o2277O4223m6569k6010J24793k2736j18673O4971L4463q9204O2846
$$ 92649 20132 -42145 22078 -24491 -50501 74292 51556 -67117 -2146 32317 -56887 5959
145E959Q3037j15855m4716R5974j5405k6322O5227m1688o9935O7443J6848m5872
$$ 5959 88996 -26859 -71575 24399 8994 -17328 47899 6211 -63724 3719 20567 -25305
157b5305N7563J751j01164M0162Q4240o4348j7931O4648n6677m5792R2280J0851
$$ -25305 32258 34009 -67155 -26993 57247 -7101 -25032 39616 -17061 -62853 29427 40278
169D0278o7979K8186P563n0089M3536L7259n6468M144L0809m9560J2331P0703
$$ 40278 -27701 485 8048 -42041 1495 38754 -17714 -13570 17239 -32321 -19990 50713
181E0713m5669n0368N7184k151m5230N3363J8969o8469J1891M1385l2663O582
$$ 50713 5044 -45324 11860 9709 -35521 17842 36811 -31658 -19767 21618 -11045 -4463
193d463L6339m1881k0407M6925p977k1835L4626j1849m1541L6269K0640l7447
$$ -4463 31876 -10005 -30412 16513 8536 -13299 21327 9478 -32063 4206 24846 -12601
205a2601J6492J8662m4421P651M5427k7250k0008L4040j4216k8240L7985J1252
$$ -12601 3891 22553 -21868 -14217 31210 3960 -16048 17992 3776 -24464 13521 24773
217B4773l8177J0168J7401k4281Q221K2506k2312o311J7760j4583o23K5149j6772
$$ 24773 -13404 -3236 14165 -10116 -1895 20611 -1701 -8012 9748 -4835 -5458 19691 2919
230B919k0242K6611L03k6095K2212J4197l4925K124K9569j6038j1330K0387p260
$$ 2919 -17323 9288 9591 -16504 5708 19905 -15020 -12896 16673 635 -10695 9692 2432
243B432j5090J3682L606r517O779j728j1244J2876N504j7571P420J2072j9584
$$ 2432 -12658 1024 4630 -4887 1892 164 -11080 1796 7300 -10271 -2851 9221 -10363
256a0363j136K2897j0863j4437J6563J857j5578Q642R473j2505j432R173n534
$$ -10363 -11499 11398 535 -13902 2661 4518 -11060 -2418 7055 -5450 -6882 2291 -3243
269c243o15P271o480j435P330o075j681J0450n372q082J0221L053j1875M714R254
$$ -3243 -3858 3413 -3067 -4502 2828 -3247 -4928 5522 150 -7932 2289 5342 -6533 -1819 7435
284G435j0471l150J2064k688p574O275J858n055J856J690j243J190q29j742M102
$$ 7435 -3036 -6186 5878 3190 -4384 1891 3749 -1306 550 2240 997 2187 1358 -384 3718
299C718J68n743L113N304p198j599R021l235o937O289K935o788r6N345j660l678
$$ 3718 3886 -1857 1256 6560 -638 -2237 6784 3549 -3388 2901 5836 -952 -1048 4297 2637 -1041
315a041K144K144j782j235J46J342M01l919J404M222l458l193M842P49n575N36
$$ -1041 1103 3247 1465 230 376 1718 2119 -1800 -396 3826 368 -2825 2017 2766 -2809 -2273
331b273M965k535m179M286J965m366q17L308k75k359m90K521L18l235K66L812
$$ -2273 2692 157 -4022 264 2229 -2137 -2954 354 79 -2280 -2770 -249 69 -3166 -2900 912
347I12k024l397K910K937l666k275N058L62n073J722L480k363k584K829K151k473
$$ 912 -1112 -4509 -1599 1338 -2328 -4603 455 817 -4256 -2534 946 -1417 -4001 -1172 979 -1494
363a494j098K663Q77l308r3L421J03l544P44M449j889m078M068K448m894k48M750
$$ -1494 -2592 71 948 -2360 -2453 968 1071 -2473 -1729 2720 831 -3247 821 3269 -1625 -1873 2877
380B877o90l612J970L333k820k092K511J158j376j088J515K050k801j938M076
$$ 2877 2187 -1425 545 3878 1058 -1034 1477 2635 1259 171 1686 3736 935 -1003 3073
395C073K79m314J013M630k901l696M448J898n555K82M621k216k569K507O37j344
$$ 3073 3352 -962 51 4681 1780 -1916 2532 4430 -1125 -843 3778 1562 -1007 1500 2137 793
411G93j181N51J510o10k643J147L012k808k483M332Q31o592K357N442n195k121
$$ 793 -388 163 1673 1063 -1580 -433 2579 -229 -2712 1620 2451 -4141 -1784 3658 -1537 -3658
427c658M959n76m144K159K314k478j372J932k59j03J46j108J615K39m136K763
$$ -3658 1301 725 -3419 -1260 1054 -1424 -2796 -864 -1123 -1226 -1080 -2188 -573 -334 -4470 -1707
443a707M476n559j733O252j669n314N153L201o510j044O639k064k817L165j88
$$ -1707 2769 -2790 -4523 1729 60 -5254 -101 3100 -3410 -4454 2185 121 -2696 469 281
458B81j836O66Q0J548J356m206o05N693j309m664M788K977q174J90R524l649o242
$$ 281 -1555 -889 -809 739 2095 -2111 -2716 2977 1668 -2996 1792 4769 -3405 -3215 6309 2660 -3582
475c582N493J187n054K405L691k163k316Q3Q62L178p99m236K379K402n600J276
$$ -3582 1911 3098 -1956 449 4140 1977 -339 -256 606 3784 2985 -1251 1128 3530 -2070 -794
491g94Q077n399o668O805K302n984K885L544n791k221N164L61j529P03k663r78
$$ -794 7283 1884 -4784 2021 4323 -1661 1224 4768 -1023 -3244 1920 2281 752 1455 -1208 -2186
507b186L579p97j084L081m091l613O288K236n713J401K129n477O24Q112l122o121
$$ -2186 1393 596 -488 2593 -1498 -5111 1177 3413 -2300 -899 1230 -4247 -3623 4489 1367 -4754
523d754L638K80l001M732J973n097j251Q65P52L435R8n066O5K926k511K080N939
$$ -4754 -1116 -836 -3837 895 2868 -2229 -3480 -2615 -1863 1572 1670 -3396 -3331 -405 -2916 -836 5103
540E103o209o493P160L578m825K079J912n920r15N919J660j930j741k820J364
$$ 5103 -1106 -7599 -439 3139 -1686 393 2305 -3615 -4530 1389 3049 1119 -622 -3442 -2078
555b078M697j233p41K369n148l579R005L637p865n48L291l482R30O560j423o425
$$ -2078 2619 1386 645 3014 -2134 -5713 3292 6929 -936 -1484 1807 -1675 -745 5815 4392 -2033
571b033j26K104K131K783k383m032J569o64k09O750m15r249M15O518j786l39L500
$$ -2033 -2159 -55 2076 4859 2476 -1556 13 -651 -860 5890 5475 -3774 -3359 3159 1373 1034 4534
588D534l974n959M392M944j715o07k175l459L134L210o97L47k450m968L202O128
$$ 4534 560 -5399 -1007 3937 2222 1615 -560 -4019 -885 2325 1628 1975 -475 -5443 -2241 3887
604C887k091l197J161l359j447Q075J501o999j002J900j846L479M032m271m362
$$ 3887 1796 -1401 -240 -3599 -5046 3029 4530 -2469 -3471 -1571 -3417 62 4094 -177 -4539
619d539J191J523K662K296l779l739K579jP18N147k282q467L081N933k505M91
$$ -4539 -3348 -1825 837 3133 -646 -4385 -1806 -1807 -1089 4058 1776 -6691 -3610 2323 -182 309
635C09K407n129l071N752L122k136j047k072j763M441K194k510J046j464m838
$$ 309 2716 -2413 -5484 268 3390 1254 207 -1865 -3628 813 3007 497 1543 79 -4759
650d759M812O091m893l084K852j717j357O149J192o658l99K223j15K564J394m807
$$ -4759 53 6144 1251 -1833 1019 -698 -2055 4094 5286 -1372 -1771 452 337 2901 4295 -512
666e12o37J604n60K575K823n890l181N132R03k547L614o02o670K020N805k535
$$ -512 -1149 455 -105 2470 5293 -597 -3778 1354 2257 -290 3324 2722 -3948 -1928 3877 1342
682A342q91J342l656o08M567j70k005M05j807j738M924R78m326J158N24l867L252
$$ 1342 451 1793 -1863 -2471 2096 1926 -79 326 -1481 -3219 1705 2683 -1643 -485 39 -3828 -576
699e76M660m925k498L822j699j645M843m87n041P94K813j116J369R58m091LL162
$$ -576 4084 -841 -3339 483 -1216 -2861 1982 1495 -3546 -2752 61 -1055 314 1272 -2819 -2816 346
716C46j556Q75K445m172j944N068J11l444K540P76m498K046M250k669j509J986
$$ 346 -1210 -335 2110 -2062 -4006 1062 1173 -2271 269 1045 -3453 -1407 2843 174 -1335 651
732F51j569o59L563r54j786J679j217j115L392N96m066J429K027k974R80L993
$$ 651 -918 -1577 1986 1032 -754 925 -292 -1407 1985 2581 -1485 -56 1971 -1003 -23 3970
748C970l536k491L709j49k244K727R3l012J173J668j390M51Q86k632N95K661k191
$$ 3970 434 -2057 1652 1503 -741 1986 2079 -933 240 1908 518 969 1855 -777 -182 2479 288
765B88m88K767k540k081L837K49l067J653J072l178P35K979j801j840J930p85
$$ 288 -200 2567 27 -2054 1783 2032 -1035 618 1690 -1488 -753 2226 425 -1415 515 -270
781b70r36J949n48j677J625o40j235K398l5k585Q66J979k233k82K779j885j958
$$ -270 -1206 743 195 -1482 143 -497 -1732 666 631 -1954 -1088 891 -1342 -1624 1155 -730 -2688
798b688K576N90k324J227O12j406M77Q72q35J40L86j085P67J229j064r57K327
$$ -2688 -112 478 -1846 -619 -7 -1413 -936 -64 -899 -759 -373 -1458 -691 538 -526 -1483 844
815H44p72j957J962Q26k348R84J707j692k53J442l99q66R33M20r24P00j52l85
$$ 844 72 -1885 77 903 -1445 -461 1246 -446 -699 743 344 -522 411 831 -93 607 455 70
833G0Q54l52q45J398K03j621O94J260r08q85J432K8j856J305Q32j403p2Q67n66
$$ 70 924 572 -273 1125 1328 -293 401 1661 753 -132 1300 1328 -528 777 1609 206 134 1001 435
852D35nJ86j38K82l00m63L31O71p98n11J118P7j602P56P63j194j38R15l47q17
$$ 435 430 616 478 760 460 -3 328 999 201 -310 808 885 -717 39 802 -392 -530 385 38 -779
872g79M51M41l91n16P34l4l57k11J31K90j18q86Q25O20j252M9J192p13q00O67
$$ -779 -328 113 -278 -794 -60 -94 -451 -662 -531 -241 -359 -1245 -420 200 -1052 -1003 189 -524 -1324 -657
892f57P35j035j54J092l43o60M60K68k47j26J61N90j39p11M27L74n18q9P18L66
$$ -657 78 -957 -1111 -19 -362 -1022 -562 -294 -541 -667 -506 84 -55 -766 -339 35 -483 -572 146 512
912E12r65K34J180p62o50J329j98p15N0O30J7n00K12K87k61k40K96L97P7r80P37
$$ 512 -453 -219 961 199 -451 878 680 -35 15 645 662 162 374 661 400 160 456 853 930 -50 687
933F87M54q59k31R70j73r51Q72K45o16m11P73K5q17L22J87J09k62k55K49K09q78
$$ 687 1141 282 51 1021 848 -103 769 1014 398 -13 760 785 -32 290 477 586 324 69 318 527 -351
954c51RQ63m03o67P16L69j191k13J586m26j278O90L97p25R3L41j60j22j10n0M81
$$ -351 -342 521 118 -549 167 536 -655 -868 718 292 -986 -296 101 -624 -531 -190 -350 -472 -582 -632 -151
975a51k71m67N50N29j282K13J014m45j303J689M8j157N77O86j163J5R20J46n71
$$ -151 -422 -889 -339 190 -1092 -879 135 -310 -1613 76 124 -1033 -456 230 -933 -918 2 148 -423
994d23K37j41Q2L34o75J08J184r29n98J416J39j596P17J247j531P8J580o72j107
$$ -423 -186 -327 -245 89 -586 -478 706 -223 -821 595 734 -862 -145 1102 -429 -351 1229 557 -550
1013e50J049O92j134N12K89q20O19K41q58Q00J19j384P11J332j291k92J451n41
$$ -550 499 1191 57 569 858 38 657 898 40 840 959 -425 286 1618 327 35 1486 945
1031I45j942J615Q11j997Q09J117j834L19J410p41m71L44m93k39R65k63j140J277
$$ 945 -997 618 1429 -568 241 1358 -476 -157 1253 512 41 385 -108 -347 618 355 -785 492
1049D92l56j505J752Q47k424K84J876j736n54K195j039j102J029N18j247Q60L66
$$ 492 136 -1369 383 1230 -1194 -910 966 -770 -1324 871 -168 -1270 -241 277 -970 -110 256
1066B56j674N29J266j564Q38J146k181n46K618j166p42J975p82j940K036J050
$$ 256 -1418 -889 377 -1187 -349 797 -1384 -1930 688 -478 -1220 755 -27 -1967 69 1119
1082A119k170K62J233j522M49J948j316p73J449r47k85J928q05j654J236P18j843
$$ 1119 -1051 -789 444 -1078 -629 1319 3 -770 679 -268 -553 1375 570 -1084 152 870 -973
1099i73J483J525k896j35K554j181p05J985r27j981K206L56j511J177J97k169
$$ -973 510 2035 -861 -996 1558 377 -328 1657 730 -1251 955 1311 -200 977 1174 -995
1115i95J134J575j521j51J587k075l33K836q49k185J755J1k066J671J566k452
$$ -995 139 1714 193 42 1629 -446 -779 2057 1208 -977 778 789 -1277 394 1960 -492
1131d92l79J821j344k00K194j611j270J716o80p69K109m21k437J287J343k018
$$ -492 -871 950 -394 -594 1600 -11 -1281 435 -245 -1014 1095 674 -1763 -476 867 -1151
1147a151Q49J509k511n95K700n84j447J842r07j414J728P25j780P76M06j814R12
$$ -1151 -302 1207 -1304 -1899 801 217 -1230 612 -295 -1709 19 744 -1036 -260 146 -1668 -756
1164g56J930j715n77J590j216q28K582l74k260J285O99j405J191J161j924n63
$$ -756 1174 -541 -1118 472 -744 -1572 1010 636 -1624 -339 360 -1045 146 1307 -617 -1180
1180a180J638o70j47J666j084j603J807L89j353J845k88k197J209J604j528N2
$$ -1180 458 -212 -359 1307 223 -1380 427 816 -537 1308 1020 -1177 32 1636 108 160
1196A60J606j760j280K767l73j556J204j15j718J787P06j448K75O27j518O62J479
$$ 160 1766 6 -1274 1493 1120 -436 768 653 -1065 722 1428 -20 255 882 -636 26 1505
1213A505j514q83J766o23j019K077l00k232J197J101j500L17J190j543m58J359
$$ 1505 -9 -892 874 251 -768 1309 1009 -1223 -26 1075 -425 -108 1082 -461 -919 440
1229D40%q54Q69o86j063J249M88j191P18K50j422O80J346j171m95R71o95p45J570
$$ 440 440 -414 455 -231 -1294 -45 443 -748 -30 220 -1202 -522 824 -347 -842 129 -566 -1311 259
1248B59K13j274R3M68q05O17Q70j194J78N26r11L82J477j242o78J177Q7j050J034
$$ 259 472 -802 -709 -241 -1046 -429 441 -753 -575 -49 -960 -578 899 -343 -1021 156 243 -807 227
1267B27K14j189K08J384q75O6P28r92k07J063j10m94N39k20p60O22P43j030M64
$$ 227 441 -748 -540 844 -31 35 763 -229 -436 627 517 23 562 342 -418 204 947 -83 381
1286C81K75j007M08Q85n44m23O64j59o81R38K07o73p7L18k53K0M71o92RP46l99
$$ 381 656 -351 57 942 398 -25 639 480 -201 737 944 271 194 512 259 279 750 58 67 813 414
1307D14k60M38p60l90R76m9n47L33L0p26J91O86j93m45L85k09m44Q52l20p2R4
$$ 414 154 592 -168 -558 418 369 -178 155 185 -541 -350 336 143 -302 83 -126 -570 282 -38 -110 -16
1328a6m19k92M24L26n17P0J19j08j71Q22m80p20O78K82o44L72K05j94k02K01M4
$$ -16 -435 -727 -303 23 -494 -424 -305 -413 -584 238 -242 -962 -284 -2 -646 -274 -69 -263 -465 -264 -220
1349b20k5J44j70k34M30j38j46M97j64n07O89K19n61K0N79k10j99J08K20k29M0
$$ -220 -245 -101 -271 -505 -75 -213 -359 138 -26 -533 156 375 -186 -166 413 203 4 112 332 103 143
1370A43K17l40L93j7j59J60m4l06M00p8m09M79L70k66m19M28j57j86Q1J39l70
$$ 143 360 20 413 396 237 397 353 47 447 369 -40 439 809 543 124 552 395 209 290 429 59
1391E9J87j3j43J76L3j9pk09J05l5O2J16l27J8J48o78N93J86m77J5J03r0oK9Q2
$$ 59 246 233 90 266 299 280 273 64 169 134 196 312 -15 3 151 -527 66 252 -225 -210 -107 -197 -203 -174 -92
1416i2o6m32O19m29K00O3k38J86k92K90O6q1m17J19M35k80k48M37k1q3k26L81
$$ -92 -158 -590 29 -400 -200 -137 -375 -189 -481 -191 -125 -206 -623 -504 -69 -349 -597 -160 -181 -264 -490 -109
1438a09k12j59K07L68m83J3M95r7k5j28K52m01M73m74L49K15l41l4M03k12J17
$$ -109 -321 -480 -273 95 -388 -375 120 23 -2 -130 122 -279 194 -280 69 284 -57 -91 312 100 217
1459B17J03p5p8j18N75j18m17K26Pl23J82M3Q0kj28J63n7k52J2K67J11k29j4P5
$$ 217 320 245 167 49 624 506 89 315 322 -1 181 224 304 302 174 337 280 28 40 307 418 189 175 250
1483B50J48k93J05K79m07p7R4j28MKJ60J06k70j12K32k07R0Nj9j78j07J31p0N0
$$ 250 398 105 210 489 82 5 99 -29 -25 -23 137 243 -27 -139 93 -114 -24 -19 -38 -216 -323 -192 -262 -212
1507b12K08k7j83k3K64j74j06N8lM4j58N5j06J26k54J93l5k0J32J81k36J26J74
$$ -212 -4 -31 -214 -237 27 -147 -253 -195 -198 -154 -312 -257 -363 -237 -491 -298 -333 -353 -221 -40 -276 -150 24
1530B4Kk03l7K18m3R2p8M3J19l38Q8L55j37j86J40L51j86j95K64q8j67pL74J09
$$ 24 26 -177 -214 4 -39 53 -25 18 137 -201 -113 242 105 -81 59 410 224 29 293 205 38 31 405 514
1554E14l47L02k14m5J70j17j83L76k87J95J9k87n5K71j47J58Q1k11N1p4J4lk11
$$ 514 167 469 255 210 380 263 80 456 169 364 383 96 41 312 165 323 404 193 244 170 184 181 -30
1577c0J00m6Q8k57k2L28P4l64j06K23j40J65j5J78m70J76K43p7l35M60n05J83
$$ -30 70 24 112 -145 -167 161 235 -129 -235 -12 -152 13 -2 176 -294 -118 125 48 -287 173 -332 -149
1599a49J06l1k45L01m0m90M27Rk5M2q2j10k6J86j1k24K50n4j83K81M8l69P9J42
$$ -149 -43 -74 -319 -18 -58 -548 -121 -112 -137 -95 -177 -287 -313 -127 -138 -362 -112 -166 -349 -68 -20 -389 -310 -168
1623a68L9o4K98k73m5K65j47K58j52p6j03M64O9n89L34K87l37NK20N5l66L06l4
$$ -168 -129 -193 105 -168 -213 52 -95 163 11 -65 -168 296 365 -224 110 397 60 65 285 340 -26 280 246
1646B46j35J50N0q7PJ16n06L45L31m18R6J68l68L7O92l14o63O27j01m02M38J97
$$ 246 111 261 311 224 231 347 -159 186 517 99 195 363 -5 32 724 410 -253 374 273 -129 309 506
1668E06q42K65K50l71K07K48m54j00N20j28n27O86j49m48N20J15p20Q7K81j46
$$ 506 -336 -71 179 -192 15 263 -191 -291 229 101 -426 260 111 -337 183 298 -422 -335 -54 -200
1688b00n9N18m02m14Q03l38m97N48j93k24M93j46m37K41M76o56l3O33m06j06M69
$$ -200 -259 259 -143 -557 246 -92 -589 -41 -234 -458 35 -111 -548 -307 169 -487 -520 113 -293 -399 70
1709G0j77m68L94M53o63M05L15n73j2P91n94p0N99o40k28P70k45n02M73L50q03
$$ 70 -107 -575 -181 272 -391 14 329 -244 -256 535 -59 -129 470 -170 -398 372 127 -375 98 448 -355
1730c55L71O00n73k42O78o83KO84k23n11M74R1m88N84J81r47M38K83n38K86M71
$$ -355 16 616 43 -199 479 -204 -202 482 259 -252 222 313 -175 409 590 -357 81 364 -174 112 583
1751E83n14o3O67n67l38N46q1p35N51M32p26L40J29n95O7Q55m85m88Q10m07o76
$$ 583 69 6 673 106 -232 314 233 -502 49 481 -245 95 224 -371 -304 551 66 -422 388 -19 -695
1772f95P59k31l34M03J95o62J03P35n93M2L71l3m50N80m76j77M21p5m28J87M05
$$ -695 64 -167 -501 -98 97 -565 -462 273 -320 -278 93 60 -390 190 -286 -463 -42 -117 -545 -358 47
1793D7k06j87N48n14N9O54n18l22P22l51l78M56L40n25M5N73m22r0L27l06k4O14
$$ 47 -159 -346 202 -312 -253 401 -117 -439 283 -68 -446 10 350 -175 -130 443 21 -69 258 -48 -72 542
1815E42l90k69N59j79o32O68j7m46L42N06m01k93N31l29l50M24m1l59P29j48o22
$$ 542 152 -117 442 263 -369 299 282 -164 178 684 283 -10 521 192 -158 266 225 -134 595 447 -175
1836a75L06P4j20q2O23p96k9N79k09j25J54J8o24O85M1q17O25J48m21m1O73l75
$$ -175 131 205 85 3 626 -170 -199 380 171 46 200 218 -406 279 320 -497 128 276 -145 -186 487 112
1858A12k21J62l8k48K80L1o19M47N9m51N36j67k79K40J77k50j66M18j34l31K47
$$ 112 -109 53 15 -233 47 78 -541 -94 -35 -486 50 -117 -396 -156 21 -229 -395 23 -111 -442 -195
1879a95J10m12M88J74q28P08k2l06J50M21l29l86M52n2l11L05Jr5J20J68l19N2
$$ -195 -85 -497 -9 165 -663 45 23 -283 -133 288 -41 -427 25 -27 -338 -33 -32 -127 -7 161 -158 -106
1901a06L14l01J68L08k96k29J94J83j07J16q7k45Q3J61Nk9L0p6K50J21k15j63
$$ -106 208 -93 75 383 87 -142 52 235 128 244 157 -88 -5 156 161 132 162 86 336 457 242 79
1923G9L3K95n56L19J05k85j93L71j35M8J35j32p6L48k98j04K95P8m15J96N6k02
$$ 79 112 407 -149 170 275 -10 -203 168 33 81 216 84 8 356 58 -46 249 327 -88 108 164 -38
1945c8L2J41j40k13J54q4K2Q1K22n49N44n1k26J08p5r9j41J99j66J43R1j42k94
$$ -38 -6 135 -5 -218 -64 -148 -126 -45 177 -372 172 121 -105 3 -72 -171 -312 -113 -279 -136 -45 -187 -481
1968d81K98L1j46M01j33k45K98o5l7j93J94n4j5K35l44K16J72j99k1K52j48j67
$$ -481 -183 -152 -298 103 -30 -275 23 -42 -79 -272 -78 -132 -147 88 -256 -40 132 -67 -88 164 16 -151
1990a51l9L01k27R6M09m09K3KJ41k55M42l78K62k9j56L1M8r9J9J88J07j81Q3O7
$$ -151 -190 111 -116 -20 389 -20 3 5 146 -109 333 -45 217 188 32 63 111 12 31 219 326 145 228 295
2014B95j85o1K42k7j80J10J85l66N5l6J12k93K07J06j22j24J03Qoj18k87N57r9
$$ 295 110 49 291 264 84 194 379 13 68 32 144 -149 58 164 42 -82 21 29 23 -95 -382 175 76
2037G6q5K34k85k16P8K11q0n2N6j36P6j8J78l38J69K42k02l26L93qk33L24k25
$$ 76 -9 225 -60 -276 -198 13 -67 -119 -63 -199 -123 -141 37 -301 -132 110 -92 -418 -25 -33 -266 58 -167
2060a67N9J34k29Q5J1n5Pq3J84N9j74K62m07K87n3L2n9K39r5j2j20J57r5N8K32
$$ -167 -108 26 -203 -118 -107 -162 -155 -238 -54 5 -169 93 -314 -27 -80 -48 -107 132 37 25 -95 62 -33 25 257
2085B57k46p6L83l68J70j00J99j60n0J60k15L7LJK37Q4n1l94O4L6M7K13j08n3
$$ 257 11 -65 318 -50 120 20 219 59 9 169 -46 -9 -6 -5 232 316 265 -129 -65 -29 18 231 123 70
2109G0L0R5q2J8K64j73r6r8k05L99k42n2L9K22l48J32rN5J1J4k7j81R1N8j16n9
$$ 70 100 195 113 131 395 222 126 28 -177 222 -20 -72 -33 189 -159 -27 -36 19 30 44 17 -164 -73 -15 -131 -190
2135a90J06R9k38L29k64J6k95O07k13j4j33O0j05K22p9n6M9k26L07O3r7j85j3
$$ -190 -84 15 -223 106 -158 -142 -437 170 -43 -57 -190 -130 -235 -13 -92 -148 -99 -325 -18 45 -52 -237 -250
2158b50NL73k92L18n3j23J44r3j14J91l3n2o5J78j71P5J69l86K86R4o8M1n6Kn2
$$ -250 -245 128 -164 154 101 -22 122 29 -85 106 73 21 -44 134 -37 38 207 -179 107 201 133 174 118 120 68
2183F8K6p1RJ44o4r1N3j33K94j22Jj70P3J09q2jJ08N3l31K46q5O1J83k38J16j41
$$ 68 94 23 32 176 112 21 74 -59 235 113 114 -56 17 126 44 43 151 204 -127 119 34 95 278 40 156 15
2209A5J19j46p7K23r4J6j76K4M0J64j60n6Q8J65m41L91m6j8k98K56Q7l04R0O2
$$ 15 134 -12 -89 134 40 56 -120 -96 -56 108 -52 -108 -20 145 -296 95 49 31 -267 -11 76 -228 -138 -76
2233g6J79k79R6j78Q7k06L13N7P9l22k0K53j19L9Q4O7j72N1Q7n6l6%J48j07on8
$$ -76 103 -176 -80 -258 -171 -377 -64 -7 72 -250 -270 -17 -136 -97 -13 54 -118 -67 20 -36 -72 -72 76 -31 -37 -95
2259i5QR2P2p9p4J00k2J52k35%K80l27K66P7j42L69k35O3j08j95KQ1r9L11j50
$$ -95 -87 5 77 -2 -76 24 2 154 -81 -81 199 -128 138 215 73 442 207 270 162 -33 -31 50 -49 262 112
2284A12l55L01J5K19l34L19l7k83K15r5P4j30J3j81Q4K23k78L99k63pRJ28j47
$$ 112 -243 58 73 292 -42 277 240 -43 172 77 151 21 34 -147 -63 160 -118 281 18 11 20 148 1
2307Ak5q4K48j08J0j07Mk07L35k99J82m2l1p1N0J64l58L22k31K30k40K28j25j35
$$ 1 -24 -108 140 32 42 -65 -61 -268 67 -232 -50 -92 -123 -194 -144 20 -338 -16 -247 -17 -257 -29 -154 -289
2331b89L49j29lQ1j98K62j09k16N3J72J9j39O3J27nj14M5L9j36J2R6n0J1o5J30
$$ -289 60 -69 -72 9 -189 73 -36 -252 -199 -27 -8 -147 -84 43 38 -76 -31 8 -128 -116 -20 -70 -59 -124 6
2356FR1J1J7k6Pl8L1J95k18n4J9Q7j8K3O4n7m4L7o3N0J76k63n9L4J2K3R2k56K19
$$ 6 97 108 125 99 106 68 99 294 76 22 41 128 110 133 197 140 96 133 70 120 296 33 -26 8 20 43 135 -121 98
2385I8L4Q0k74N5j17P9P2k6O9j45J86n6n8jj69Q0j02M12k97J14j21K8j31K13p4
$$ 98 132 212 -62 -7 -124 -45 27 1 70 -75 111 55 -3 -4 -173 -93 -195 217 -80 34 -87 -59 -190 23 -51
2410e1l5K60j70j31J77r5j33J31j9J69k06K27k49J42k06M6J03J89k20j06K92o6
$$ -51 -86 174 4 -127 50 -45 -178 -47 -66 103 -103 124 -125 17 -189 -143 -40 149 -71 -177 115 49
2432D9l07M88m39J58M8L5n09N42m3j45K56k20m7J93j24j15L59k46J11J65p0j05
$$ 49 -258 230 -209 -51 -3 32 -477 65 22 -123 133 -87 -134 59 -65 -180 179 -67 44 209 139 34
2454C4L4pJ1k16J30K72j46l03K22P6J11J48o8j43J32k43j29J33J16j95K0L95m63
$$ 34 68 61 72 -144 -14 258 112 -191 31 107 218 366 298 155 287 44 -85 48 164 -31 -11 384 -79
2477g9J93j20Rj03o0K68j74r5J68j31j18K34J42k73N5J29j02j89J68J39k83K71
$$ -79 114 -6 3 -100 -160 108 -66 -161 7 -124 -242 -8 134 -139 -84 45 -57 -246 -78 61 -222 49
2499D9j02j33L48j58j78j6J98J5k13J11j07J33n2J88Q9m61P4L73j51K49m50r6
$$ 49 -53 -186 162 4 -174 -190 8 23 -190 -79 -186 -53 -105 83 172 -289 -215 158 7 256 -194 -290
2521b90N3J06J30R1j28J67P8k40J57l38R6L9p1L88j15j29J73j12k34L09pR0k37
$$ -290 -237 -131 -1 90 -38 129 207 -33 124 -214 -118 -79 -150 238 123 -6 167 55 -179 130 123 213 -24
2544b4R0L4j81Q6K49j62J68k06OK29j94j21J29l09L72j33P4j23J95j99q0J19m1
$$ -24 66 100 -81 5 254 92 260 54 60 289 95 -26 103 -206 166 33 107 -16 179 -20 -100 19 -22
2567b2JK64k33M6q8K21k39J88j12L10j90K9l19j1J49Q9R8l87J64M6n7l9N1q4l
$$ -22 -21 243 10 56 -32 189 -50 138 26 336 146 175 -144 -155 -6 83 181 -206 -42 4 -53 -92 -41 -125 -128
2592a28M8j1J5J32l49J91p0JN1oK50r6j02%j48K03k05L83j20j63q1R2J27j7j68
$$ -128 -80 -91 -76 56 -293 -102 -172 -171 -120 -126 124 28 -74 -74 -222 -19 -224 159 39 -124 -205 -113 14 -3 -171
2617a71M35j27m19J03P6Q0M4j9l6J36k24J32m4N5j85j4K34K15j09j4K5k1j29L9
$$ -171 264 137 -282 -179 -103 -23 21 2 -34 102 -122 10 -34 21 -164 -178 56 271 162 148 173 152 23 62
2641F2j94L11q1l9j12P6P7J43j00L08k51k8j30k15K87j86j66K64j72J27L3j25
$$ 62 -132 179 98 59 -53 23 100 243 143 451 200 172 42 -173 114 -72 -238 26 -146 -19 14 -111
2663a11K30r4j09J11k33K39k26Q1O2N8J3q1K01k37n2J00J44j80j00j05J89j50
$$ -111 119 25 -84 27 -206 33 -193 -112 -50 8 21 -60 141 -96 -148 -48 96 -84 -184 -289 -100 -250
2685b50J54j98J83m0K19m31L39J54k70L92l30O0n2J99k29K08j57J72k47N8p9o4
$$ -250 -96 -294 -111 -151 68 -363 -24 130 -140 252 -78 -18 -70 129 -100 108 -49 123 -124 -66 -145 -209
2707b09J73M2o2j49J26K81j39o0r0J97j20ok2N8J13K39n11p6M20k45J86q0K0n3
$$ -209 -36 6 -56 -205 -79 202 63 3 -87 110 -10 -16 -38 20 133 372 -139 -215 205 -40 146 66 86 33
2731C3J53k24L1J96k15r8J23l6j11q3K52k9j93J30L6k1Q2j27J14k9r3j58M50r2
$$ 33 186 -38 -7 189 -26 -124 -1 -37 -148 -231 21 -8 -201 -71 -35 -56 26 -101 13 -16 -109 -267 183 91
2755I1m23K85J5l8Q8n1p5R5l7m8j27L06r7Qp8L8l23K86l6J12j53J24m9Q8j38L39
$$ 91 -332 -47 -32 -70 18 -33 -108 -13 -50 -98 -225 81 -16 -8 -86 -48 -371 -85 -121 -9 -162 -38 -87 1 -137 202
2781B02P3k79p6J27K0j30J2j25K61k91Q0J01j55K64k2RJ23p8o2p2P2o9K3N7j21
$$ 202 275 -4 -80 47 67 -63 -51 -176 85 -206 -126 -25 -180 84 62 71 194 116 54 -18 54 -15 8 65 -56
2806e6l0R1L9lj71K28j17oo6J16Q8j62j39L29J37k70m1J1M62j54m29K20L8q0j43
$$ -56 -86 5 44 41 -130 98 -19 -25 -91 25 113 -49 -188 141 278 8 -33 -22 440 286 -143 77 115 35 -108
2831a08L3K60r0L7q5N7j40J83j61p2j0K14k38m4K43O2k73K19j68K11l09M9J88
$$ -108 -75 185 95 132 47 104 -36 147 -14 -86 -96 118 -120 -164 79 141 -132 87 -81 130 -179 -130 58
2854E8k36R5J80l8k84J96k7J30r6k1K02o7lk16O9J89l78R1P5K07j87k5K54J6k3
$$ 58 -178 -83 97 59 -225 -29 -56 74 -22 -43 159 92 89 -127 -58 131 -247 -156 -81 126 -61 -86 168 184 161
2879A61m09K7L52j63j9J57r1j34J43m5O4r8q8J74p9J01K5J56q9j71K7J23J76k78
$$ 161 -248 -221 131 -32 -51 106 15 -119 24 -21 43 -55 -143 31 -48 53 78 234 145 -26 1 124 300 22
2903B2k0K02j29j31J53M23l70O4j21r3J09m2O8k84L29K6m7oj59J12j99j36J24
$$ 22 2 204 75 -56 97 520 150 214 93 0 109 67 135 -149 180 206 159 153 -6 106 -93 -229 -105
2926a05K34K44l11P6k18K74k28l1j07J92J89%m00K34K35m60M5P2j2K04l37J54
$$ -105 129 373 62 138 -80 194 -34 -65 -172 20 209 209 -191 43 278 -182 -137 -65 -77 127 -210 -56
2948e6K75k50K56l79L5J60k08K60j23oJ76k36p8K23k29J9J50J89p4j15o4P4k29
$$ -56 219 -31 225 -154 -119 41 -167 93 -30 -36 140 -96 -174 49 -180 -161 -11 178 104 -11 -75 -1 -230
2971b30K38q2JM6M4J43l27J32O1j93K79K7o7K40l33r9K51l24J38L5J3N0L5K10
$$ -230 8 -74 -73 -27 17 160 -167 -35 26 -167 112 139 72 312 -21 -120 131 -193 -55 -20 -7 43 78 288
2995B88n7k03J92j22O5m7o7k66M27j34k5N4l1J7l0L28j42l87J11J61k97K13o5
$$ 288 231 28 220 98 163 116 49 -217 210 76 51 105 74 91 61 389 247 -140 -29 132 -165 48 -17
3018a7J33j00j85K39j21m1J79k24K19k3j19P9K30j88j69j19K72j78rK01o1N2R
$$ -17 116 16 -169 70 -51 -92 87 -137 82 59 -60 19 249 61 -108 -227 45 -133 -142 59 -2 50 59
3041E9R7j88J08J74j35o4j60o8J32M2j4o4q1L10j67k2j57J99J4l5L4J14j97p8
$$ 59 156 -32 76 250 115 51 -109 -177 -45 -3 -17 -81 -162 148 -19 -41 -198 1 15 -20 14 128 -69 -147
3065a47N7M9O9j44J27k3p6j17J88j70J14qK67k58J80o0J84l66L48l26J14J73p4
$$ -147 -90 -41 28 -116 11 -12 -88 -205 -17 -187 -73 -81 186 -72 108 48 232 -134 214 -112 2 175 101
3088A01J75j59n5j70K6J22q8m9lR8j67J69M0p2n1J48J2l33R4L73k00R6k54K90
$$ 101 276 117 62 -108 -82 40 -48 -97 -100 -2 -169 0 40 -32 -83 65 77 -256 -162 211 11 107 -147 143
3112A43j94J63j03k1M2j41R8j47R6R1k1r4M1m7M0jj36K76p0kL0L0p2R3m34K46
$$ 143 -51 112 9 -12 30 -111 -13 -160 -64 27 6 -88 -47 -94 -54 -55 -191 85 15 13 43 73 1 94 -340 -94
3138i4K37r9r7j4K3N2o9K4O0J42n13L81j26K1J01q8K40j86J4l9n9O8m5N9M3p5
$$ -94 143 44 -53 -67 -44 8 -61 -37 23 165 -348 33 -93 -72 29 -59 181 -5 9 -30 -89 -21 -66 -7 36 -39
3164c9J42l16K03k19M7K94j09q1J62Pj31j55L70l65J33j87K38J19k65K6L03k00
$$ -39 103 -213 -10 -229 -182 112 3 -78 84 91 -40 -195 175 -190 -57 -244 -6 113 -152 -126 177 -23
3186b3%l9K26J70m68J53N0k19K55j17o6K40j56n2J1R6k30M5L24q6n0j78J83n3
$$ -23 -23 -62 164 334 -134 19 69 -150 105 -12 -78 162 6 -46 -35 61 -169 -124 200 114 64 -114 69 16
3210A6m8N3p9K51j02j83J19j62M69k77J9j90q6K02Rk7p8J2n5K13n3o0J3Jj9n8
$$ 16 -32 21 -58 193 91 -92 27 -135 334 57 76 -114 -200 2 11 -16 -94 -82 -137 76 23 -37 -24 -23 -42 -100
3236a00L4J60p3J64o9j06k40L75j42J37o7n2j84K1J16n9L3lK19l90L96m5j63P5
$$ -100 -66 94 21 185 116 10 -230 145 3 140 73 21 -163 -142 -26 -85 -52 -55 164 -226 170 125 -38 37
3260C7Q8k08K24j1Q0qQ2k01j94K26j51J95j37ln7J35n3j81q8K58O0q8R4j15J96
$$ 37 125 -83 141 130 210 202 284 83 -111 115 -36 159 22 19 -38 97 44 -137 -225 33 93 5 99 -16 180
3285A80j65l7KL8j02J0J45k28K18p6k18J23K07k26l2k1J57j11J49k04L63k93K32
$$ 180 15 -22 -20 18 -84 -74 71 -157 61 -15 -233 -110 97 -129 -161 -182 -25 -136 13 -191 172 -121 111
3308A11j32q0K26k89J83k52L43k97ML7K27j10j60K43R0j8j73N1J46j09o6J19j91
$$ 111 -21 -101 125 -164 19 -233 110 -187 -183 -146 81 -29 -189 54 144 126 -47 4 150 41 -25 94 -97
3331i7O8J34j1j96j5K52j50K07m03J87o7q4Nj2K31J48k46L3K67m06LJ14j53K06
$$ -97 -29 105 94 -102 -117 135 -15 192 -211 -24 -91 -175 -170 -182 49 197 -49 -16 251 -155 -152 -38 -191 15
3355A5k01J44K8MJ07n4l9L15j26k23nK6M5j47J58j46J44j27J18k0QO7o4j17J94
$$ 15 -186 -42 -14 -10 97 43 4 319 193 -30 -35 -9 36 -111 47 -99 45 -82 36 16 24 91 27 -90 104
3380A04j43o5N9J4J18n1K12m17J28K83n69L40P1Q9j45l0J2m0N6j67K98j19J51
$$ 104 -39 -104 -45 -31 87 36 248 -169 -41 242 -327 13 84 173 28 -2 10 -30 26 -141 157 38 189
3403A89l31PR5K7l4j92M54l02l8J31j07QL8l8j74L15J5m6J81k57J24M8l73L46
$$ 189 -142 -135 -40 -13 -47 -239 215 -87 -125 6 -101 -93 -55 -93 -267 48 63 17 198 -59 65 113 -260 86
3427H6k39J15J38j41K09j36L7K3k02q0J83O8j36J88k51L3K20j16K28j83J4P9N8
$$ 86 -153 -38 100 -41 168 32 69 92 -110 -190 -7 61 -75 113 -138 -105 115 -1 227 44 58 137 195
3450A95j92k5L1M0p1J66k69J13J61j4j39J21k37m3J95j11L90l55K47j59j91K28
$$ 195 3 -22 9 49 -22 144 -125 -12 149 135 -4 117 -120 -163 32 -79 311 -44 203 44 -147 81
3472H1J2j10j54K11l43L64j31J49j2N5K03j37l28mK15j00J58j77j3r7P3Q0J62
$$ 81 93 -17 -171 40 -303 61 -70 79 67 122 325 188 -140 -144 71 -29 129 -48 -61 -158 -85 -5 157
3495A57m32K86J88j73p6J83j06p0JM4j89J37J33MLm9j21j56N8L43l86M66l07K10
$$ 157 -275 11 199 26 -50 133 27 -43 -42 2 -187 -50 83 87 90 41 -80 -236 -178 165 -221 245 -62 148
3519A48l76K11j2O0O3n1L1j26Qo1K75j57K04k32J63k37N1n4O5J35k04l6K36l8
$$ 148 -228 -17 -29 31 94 43 74 -52 -44 -105 170 13 217 -15 148 -89 -38 -92 -27 108 -96 -132 104 66
3543F6j13Q3j41J36o6O9J7j48J0M4J38j44m4r7N7L41k84oJ13j04J05L0j00MnP5
$$ 66 -47 36 -105 31 -35 34 51 -97 -87 -43 95 -49 -93 -190 -133 208 -76 -82 31 -73 32 62 -38 -34 -39 36
3569C6q7k0L1p8K85k56j69K05J81l05J72j59J6M7J24j25j54K39J11rJ09n7k94
$$ 36 -51 -71 -40 -118 167 -89 -258 -53 128 -177 -5 -164 -148 -101 23 -102 -256 -17 94 85 194 137 -157
3592a57J10p2K51j41o7J78j48mKJ41k36R9J75k03O6N7R0j07o1K72k94j61L3K33
$$ -157 -47 -119 132 -9 -76 102 -46 -50 -48 93 -143 -44 131 -72 -6 51 141 34 -27 245 -49 -210 -177 56
3616E6Om0q3N2J27j20O4M8Mm2L3o2rj70J28J13j44k3J44J45L2k38r9J17Q7l69
$$ 56 62 22 -61 -9 118 -2 62 110 114 72 105 43 34 -136 -8 105 -39 -62 82 227 259 21 -78 39 126 -243
3642b43J7L31J3m2m05K54K28l17K86k33J43j63P2J92j39j56J58R9k1j11K32n9
$$ -243 -226 105 118 76 -329 -75 153 -164 122 -111 32 -131 -59 133 -6 -162 -4 95 74 -37 195 136
3664A36q3j55j98L67m3J7Q2j72p9O7J23o2o7q9J46q9J47j69N6n2Qm7J21L3J57
$$ 136 53 -102 -300 67 24 41 123 -49 -128 -61 62 0 -67 -156 -10 -99 48 -121 -65 -117 -109 -156 -35 -2 155
3689A55j33P3P7k10J03N1k16R7k50N11k4k25J72k37J91k48L07q1nj0l58K56n5
$$ 155 22 95 172 -38 65 116 -100 -3 -253 258 234 9 181 -56 135 -113 194 113 108 98 -260 -4 -59
3712e9M6l1J41k49J20N8j5L6j66J22K69l33j47N30k79M1j64K67l95M56M3j70k2
$$ -59 -13 -44 97 -152 -32 26 11 47 -119 3 272 -61 -208 322 43 84 -80 187 -208 248 291 121 99
3735I9k30n0J2K81K6j52J09j62Q8J98l14J38N8lN9j96j90K95p3j35J13J71j17
$$ 99 -131 -181 -169 112 138 -14 95 -67 21 219 -95 43 101 98 157 -39 -229 66 -7 -142 -29 142 25
3758B5R2k33J13R7J09j84k25P7k1L14j12j54M7K10l85K39q0J89l37J33r8K50n0
$$ 25 117 -116 -3 94 203 19 -206 -129 -150 164 52 -102 -55 155 -230 9 -71 118 -219 -86 -184 66 16
3781A6O6n8j65P0O8K36l64QJ37Q8O5j10j58M1Q7J10j8k06J58r5l4j14J24K13j67
$$ 16 82 24 -141 -71 -3 233 -131 -123 14 102 167 57 -101 -60 27 137 119 -87 71 -24 -58 -172 -48 165 -2
3806bk0J13nj30J21k6k60K82J6J5k98L42k05j69J80J55k15J3R6J07o9n2j94P4
$$ -2 -22 91 86 -44 77 51 -209 73 89 104 -194 148 -57 -226 -46 109 -106 -93 3 110 41 -11 -205 -131
3830a31M40m10J55k76K75j28J90k81%R6L3K00k92K09j59O9J99k57O2j83r8J11
$$ -131 309 -101 54 -222 53 -75 115 -166 -166 -70 -37 163 -129 80 -79 -10 189 -68 -6 -189 -287 -176
3852a76K17n7P8n1q4J99l19J71j2J02O9k0j2m1m5j23J68j30n5Q8m6K71P4m77P8
$$ -176 41 -16 62 11 -73 126 -193 -22 -34 68 137 117 105 64 19 -104 64 -66 -121 -33 -79 192 266 -211 -133
3877a33NJ48J80j63l71K86J2J02j28J48R7m09M06n9lj36J44k40R3L8j11J95k71
$$ -133 -128 20 200 37 -334 -48 -36 66 -62 86 183 -226 180 121 118 -18 126 -114 -21 17 -94 101 -170
3900a70M14j04j34Q4p9J58j56j11J64JL1m2r1K5Q5K3j31K45j25j93J58l33J46
$$ -170 244 140 6 90 11 169 13 -98 66 67 98 56 -35 -10 75 98 -33 212 87 -106 52 -281 -135
3923a35N0Q1N6L6m9r4K08k47n4J43N3K4j41M0K26l01J6L07k26J13m29K20L11j21
$$ -135 -85 -4 52 88 39 -55 153 -94 -148 -5 48 72 -69 -29 197 -104 -88 219 -7 106 -323 -103 208 87
3947H7l8o3J25k15j4K1J68n4K5j42R9L7j64J2K34n9k66J23J84j82L03m31K06J28
$$ 87 49 -14 111 -104 -118 -97 71 17 42 -100 -1 36 -128 -116 118 59 -207 -84 100 -82 221 -210 -4 124
3971A24j55j41k8K65l2j34J12q0p0K20n8j08O2q0J40K4J23j06j85J31l07L81k9
$$ 124 -31 -172 -200 65 33 -101 11 -69 -139 81 23 -85 -23 -103 37 61 184 78 -107 24 -283 98 69
3994F9P2j77K29k67J17K55k82J62j99n2q0J39n6K07j14mr6J91M9l08P7J8J17j3
$$ 69 141 -36 193 -74 43 298 16 178 -21 -73 -153 -14 -70 137 23 19 -77 114 163 -145 -68 -50 67 54
4018E4M1k51K91L8l9j6j19k3j32K18n4l1j85O9K2Q5K95m01J55K6Rkl25K65P8j6
$$ 54 95 -156 135 173 134 118 -1 -24 -156 62 8 -23 -208 -139 -117 -32 263 -138 17 43 52 50 -275 -10 68 52
4044E2k09K60J96j43j58o9K28L6l33o4K62k00P5J49l5l42J49J14p1K77k32J23
$$ 52 -157 103 299 156 -2 -71 157 193 -140 -204 58 -142 -67 82 47 -295 -146 -32 -103 174 -58 65
4066F5r2k4M1q6Q2J76m3r0o2j47K58o1n7j60O1MK21l11L03o7K06j64j18K46j20
$$ 65 -27 -51 -10 -96 -14 162 119 29 -33 -180 78 17 -40 -200 -139 -135 86 -225 78 11 217 53 -65 181 61
4091F1J69j47j26o3R3k0nN0P5J2l31J09J81l5M0r0P7J93m1l77RK78Q9q2q5m4J52
$$ 61 230 83 -43 -106 -13 -33 -38 12 87 99 -232 -123 58 23 63 -27 50 243 202 -175 -166 112 201 119 34 -10 142
4118A42j15J04l9k12Q4M4O4j72q2J86q9K7J01N7j37k92M52k28N9J20k45P9nN9
$$ 142 27 131 92 -120 -36 8 72 -100 -182 4 -85 -58 43 100 -37 -329 123 -105 -46 74 -171 -92 -97 -38
4142c8J96m2k32J72q3j70K45m1j7M8j6Ql8M3j52J72m6k39mJ30M3k7r4L7O7J28
$$ -38 158 116 -116 56 -27 -197 48 7 -10 38 22 30 -8 35 -117 55 9 -230 -234 -104 -61 -88 -182 -145 -78 50
4168E0j40O2K56k64J48n3K4Jk11Q0k01L59J47k46j58J45Nk02J37j06R2K50l71
$$ 50 -90 -28 228 -36 112 59 83 84 -127 -47 -248 111 258 12 -146 -1 4 -198 -61 -167 -75 175 -196
4191a96L96j89m6j41K79j15J72k54J38j6M9R0m58K84L8Q9l29R2K75k3j13J0j9
$$ -196 200 11 -35 -176 103 -12 160 -94 44 28 77 167 -291 -7 31 120 -209 -117 158 135 22 32 13
4214A3N3N2m2j85j06L21j79J34k16R2K04j85j31K00j43q5P5n6oK23k12J70P3N5
$$ 13 66 118 76 -109 -215 106 -73 61 -155 -63 141 -44 -175 25 -118 -203 -128 -184 -190 33 -179 -9 64 119
4238A19n1l1N5j0k51ML71k08M8j22J15j71M1J77n3j12p6J12k0J91q9P2N3j14j20
$$ 119 68 37 92 82 -169 -165 206 -2 46 -76 39 -132 -91 86 33 -79 -155 -43 -63 128 39 111 164 50 -70
4263g0K17L7k22m0L1J86j23j36k2K30lJ6p6J33l10K47l03M10k11J33NJ4o7j73
$$ -70 147 184 -38 -78 -47 139 16 -120 -142 88 85 101 25 158 -152 95 -208 202 -9 124 129 143 76 -97
4287i7O6j25J50k76L16K2L2k17j03K25L5r1k08K86k3k29K39P6m30K07N8j04R4
$$ -97 -31 -156 -6 -282 34 56 88 -129 -232 -7 28 -63 -271 15 -8 -237 2 78 -352 -145 -87 -191 -97
4310i7J00J99k56J19k00J63J17l37R3J74j56O4q1K68q1J07j1r1O0j33j36m2K6
$$ -97 3 202 -54 65 -135 28 145 -192 -99 75 -81 -17 -98 170 89 196 185 94 154 21 -115 -157 -131
4333a31R7K26j27l64K20J78k06J91k90O8K39n6m9j78K12O9q3K5K05k55j07J50
$$ -131 -34 192 65 -299 -79 99 -107 84 -206 -138 101 45 -4 -182 30 99 16 41 246 -9 -116 34
4355C4J03l0k01R6J01j51K18qj15n5k50J75M4O2M7j94Q7N7L3n7M0j8q4J58j92
$$ 34 137 107 -94 2 103 -48 170 162 47 -8 -258 -83 -39 23 70 -124 -37 20 53 -4 36 18 -66 92 -100
4380a00N1M7K40l93QR5M4Qn9J33m8k44L56k21J3J0L7L9R6k33J13j19Q4j42J26
$$ -100 -49 -2 238 -155 -147 -52 -8 0 -59 74 26 -218 138 -83 -70 -60 -23 16 112 -121 -8 -127 -43 -185 -59
4405e9J22j65M0q8n0J76j47Q8Q5J30j88m7p0K65l08K12j88K55P5k33J36j63K58
$$ -59 63 -102 -62 -150 -200 -24 -171 -83 2 132 -56 -103 -173 92 -216 -4 -192 63 138 -95 41 -122 136
4428A36J9k95K16L6J75k93J4J41J30k01jk08J41J43q0R6k29j37L75k25Q8p3j48
$$ 136 155 -140 76 112 287 -6 8 149 279 78 77 -131 10 153 73 169 -60 -197 178 -47 41 -32 -180
4451a80Q3L20p3l16J52R6j82J42L5mJ77l96J07J08j11J44r2j9j03J51k25K41j79
$$ -180 -97 223 150 -166 -14 82 -100 42 77 73 250 -146 -39 69 -42 102 10 -9 -112 39 -186 55 -124
4474a24J69o1J78l45K87j67L19r6l54J34J27j42J8J45l39J84j4j06J48K70j91
$$ -124 45 -16 162 -183 104 -63 256 160 -194 -60 67 -75 -57 88 -251 -67 -81 -187 -39 231 40
4495D0o7n2K88k29q3L59j43%l0k51J25P2K6N3O4M0l59k21Q59n34j17J12L0k1N8
$$ 40 -27 -79 209 -20 -103 256 113 113 83 -168 -43 29 55 108 172 212 -147 -368 491 -43 -160 -48 -18 -39 19
4520A9o7J51j12o4J17m3p7R3k72L23M9l28K66J95j82KJ81k17N5q0K75k84Mj18
$$ 19 -48 103 -9 -73 44 1 -76 17 -255 68 117 -211 55 250 68 70 251 34 89 9 284 0 4 -114
4544a14k6K0K77j75j8k34M92j8j80Kj0J33l6J5k4j51l0J51p8M0j47K09j13o5J88
$$ -114 -140 -120 157 -18 -36 -270 222 204 24 26 16 149 113 128 104 -47 -77 74 -4 36 -111 98 -15 -80 108
4569A08l58M8K32q4P6K32r9l9j86M8k12L10j88K11j40N7o6K86j43q9m0J1L02l90
$$ 108 -250 -202 30 -54 22 254 155 116 -70 -22 -234 76 -112 99 -41 16 -50 236 93 4 -36 -25 277 -113
4593a13O7j87K72j4k35L74k64K2K04j82LJ28k0K70k34j32K19k33j03K57K52l72
$$ -113 -46 -233 39 25 -210 164 -100 -78 126 -56 -53 75 55 325 91 -41 178 -55 -158 99 351 -21
4615b1P1j51K81k31J1qM4j14Q5L9N1L21m72L84k95R2m4O7K1Pqj32mj63j6L44j48
$$ -21 50 -101 180 -51 -40 -48 -4 -118 -33 6 57 378 -94 290 -5 87 43 110 131 138 130 -2 -6 -169 -185 159 11
4642A1J53k05m4Q1j64K50k02k26J99K38k37J19R9j44L5J26N8N9j55k4j27J15K7
$$ 11 164 -41 -85 -4 -168 82 -120 -346 -147 91 -146 -27 72 -72 -37 89 147 206 51 27 -100 15 42
4665D2K4j3O6J7L9k14k40L04K8k71K44l4J91j00k18J08J94k24J61J26k66K05j9
$$ 42 66 53 119 136 175 -39 -279 25 53 -218 26 -8 183 83 -135 -27 167 -57 104 230 -36 169 150
4688A50j52n7o0K29j06L0q8Q2m4J94l65m6M02J72k41j32P3kj87qJ57l7j4R8j56
$$ 150 -2 -59 -119 110 4 34 -54 28 -16 178 -187 -233 169 341 100 -32 41 39 -148 -156 1 -36 -50 48 -108
4713a08j8J00k08K46j06M0K32rQ5k27Q9J47n6r0J30l33J36J48k42J67n3r8pn4
$$ -108 -126 -26 -234 12 -94 -54 178 169 254 27 116 263 207 117 247 -86 50 198 -44 123 70 -28 -35 -89
4737h9J01l2o9R0M2J43l75P8N4o0j26R2J63M0k4j18j3j4j01K68o2j17L09k19l75
$$ -89 12 -20 -89 1 43 186 -189 -111 -57 -117 -243 -151 12 52 28 -90 -103 -117 -218 50 -12 -129 180 -39 -414
4762d14L73J87l12J53p1J27j11N8j6j22J41J62k22k8J04K06l99J48J72j8k0j14
$$ -414 -41 146 -166 -13 -84 43 -68 -10 -26 -148 -7 155 -67 -95 9 215 -184 -36 136 118 98 -16
4784a6j12J25J32p8j3K99l92j4J64Ql36L3M8L8n2L61r0k06J07L2p7J25r9N0K78
$$ -16 -128 -3 129 51 38 337 -55 -69 95 103 -233 -200 -152 -114 -166 195 105 -101 6 38 -39 86 -13 37 315
4809C15l39O8l36K34J04J68j13j51O9j27J31j52K79l45K98j00J60j75O0k23R3
$$ 315 -24 44 -292 -58 46 214 101 -50 19 -108 23 -129 150 -195 103 3 163 -12 48 -175 -82
4830h2L51l78K5Mj01K38q4O7J47l55j45K19L3Q8o4q2R4j34J33m9n9K5q1p3K47
$$ -82 269 -109 -84 -80 -181 57 -27 40 187 -168 -313 -94 -61 27 -37 -119 -25 -159 -26 -75 -134 -109 -190 -263 -16
4855a6K04m17J39J37k01J70N5k28J99k4k16J24J08j71n8L81j72k27J59J77j72
$$ -16 188 -229 -90 47 -154 16 71 -157 42 18 -198 -74 34 -137 -195 186 14 -213 -54 123 -49
4876d9L06k25k3O9k77j4J36K20m4j14M6J92j47k16J23P4k51N5L03k99P6L89l47
$$ -49 257 32 9 78 -199 -213 -77 143 99 -15 31 223 76 -140 -17 57 -194 -139 164 -135 -59 330 -17
4899a7p0J18k69M18p8o7O8J04m3J5k66l4R2LP8l2L4n17M94o4J40k3J02k94k1J09
$$ -17 -87 31 -238 180 102 35 103 207 164 179 -87 -121 -29 -26 52 20 54 -463 31 -33 107 84 186 -108 -129 -20
4925b0J65k78j7k8K06j35j04J54M06k82k10L26l03J47J74m52J60K42j79j35o9
$$ -20 145 -133 -150 -178 28 -107 -211 -57 349 67 -143 183 -120 27 201 -251 -91 151 -28 -163 -232
4946b32L00r8k0J99k29J8J36l1p8j78Q6M9K45j5k64J14n8K5m9L05k44J21m8mM5
$$ -232 68 -30 -50 149 -80 -62 74 43 -35 -213 -127 -78 167 152 -112 2 -56 -31 -80 225 -19 102 54 50 95
4971I5np7k05L21j30L05Jk65J53j49N1J58l32R1L3K6p5j32J43N9J69l30K4J16
$$ 95 90 13 -192 129 -1 304 305 40 193 44 95 253 -79 12 45 71 -4 -136 7 66 235 -95 -71 45
4995D5l4l0j24q4J35J70l85K70j39K81l35J81l11L67q3P0k52L46p4j39J48L8j27
$$ 45 11 -19 -143 -227 -92 78 -307 -37 -176 105 -230 -49 -360 7 -76 -6 -258 88 14 -125 23 61 -66
5018f6J08p7J71j14K9K30k08j52J6L9R5r5Pj74J07J61j17k3J75j27k95Q5J90N2
$$ -66 42 -35 136 22 51 281 73 -79 -63 -24 71 -24 -17 -191 -84 77 -40 -63 112 -15 -310 -225 -35 17
5042A7O8j90k0j1KK23p9J5m7J2r7Q0J0P9K25k91j3K2K1j15j77L70j03j09J22O1
$$ 17 85 -105 -125 -136 -134 89 10 25 -22 -10 -107 -27 -17 62 287 -4 -17 5 26 -89 -266 104 1 -108 14 75
5068G5J76r1j90p3J56j14J3J15o6P6n1j26K04j16l6N3j4J89k44j59J97P8p4m5
$$ 75 251 160 -30 -103 53 -61 -48 67 1 77 26 -100 104 -12 -48 5 -9 180 -64 -223 -26 52 -22 -67
5092f7N1j66K81l55K93k56K02J18m2j07J05k1j62J35j65K40q8K6Mj24K34j40p6
$$ -67 -16 -182 99 -256 37 -219 -17 101 59 -48 57 36 -126 9 -156 84 -4 22 26 -98 136 -4 -80
5115h0L6rk58M11p9J14kj38J43l24K99j75rQ5k25L11j86LJ39J00L6k78Q8L9j3
$$ -80 -44 -53 -311 100 21 135 133 -5 138 -186 113 -62 -71 14 -211 100 -86 -83 56 156 192 -86 2 41 28
5140B8k31J30r2L31j79R8J98m22K28k19R4J92l4j48K30o3j94J87l43K52M1r6J78
$$ 28 -203 -73 -165 166 -13 85 283 -139 89 -130 -36 156 122 -26 204 141 -53 134 -209 43 84 -12 166
5163A66k02o5Q7j03o1J66J63k40O0L2K0j98J10L8k8Q9k50j2M16k36q9J52p3m5
$$ 166 -36 -101 -14 -117 -178 -12 151 -89 -29 3 23 -175 -65 -27 -55 34 -216 -228 188 -48 -137 15 -58 -103
5187a03o2K68k30J91o4K2J07Pl57P5J06K62r7l06J42J16o3R3l47L28l1j89K57
$$ -103 -165 103 -127 64 0 22 129 136 -221 -146 -40 222 125 -181 -39 77 14 107 -240 88 57 -132 125
5210A25k43j90K68J87m19L76j70P7o4J18j47J76j10j4J2n5K50o5J10k55J01j63
$$ 125 -118 -308 -40 147 -272 104 -66 11 -53 65 -82 94 -16 -30 -18 -73 177 112 222 -33 68 -95
5232i5J1J74j0R1j11Nk31K96J12k26L04m00O3K77j78q1K4k15L74k94J46q2m6j04
$$ -95 -84 90 80 171 60 65 -166 130 242 16 320 -80 -17 260 82 1 25 -190 184 -110 36 -46 -92 -196
5256a96K19J80j19J81l74J09M8o9M8K0j22j3O2P5j26J55k1ork5q0Jj86j8K67M2
$$ -196 23 203 84 265 -109 0 48 -21 27 47 -75 -88 -26 49 -77 78 57 51 42 17 -63 -62 -248 -266 1 43
5282D3l0j22J43P2n5L04m17OJ01j55L2j36J50R7j16N9P4q3L2J8j08O1K17k69J13
$$ 43 13 -109 34 106 51 355 -62 -56 45 -110 -78 -214 -64 33 -83 -24 50 -33 -1 17 -91 -30 187 -82 31
5307C1k66K41K47l23J84j80j71L64J5j38o0Q6n57P06m29L73o7K08m26K36q8L26
$$ 31 -235 6 253 -70 114 -66 -237 127 142 4 -56 30 -527 179 -250 123 56 264 -162 74 -14 312
5329C12k68p1Q1j0J05k34K2J1J53m31K51R5n2P1J07M5k02J28k04L1O7J94j20k25
$$ 312 44 -27 54 44 149 -85 -63 -52 101 -330 -79 16 -36 35 142 187 -15 113 -91 -60 7 201 81 -144
5353a44o3J73L21l06Q1r2J21j93RJ89k93J95L0L4l17N6L17o8Lm2J7k43J63j09
$$ -144 -207 -34 287 -19 62 -30 91 -102 -93 96 -197 -2 28 62 -255 -199 118 50 53 11 28 -215 -52 -161
5377a61n2J97q4M4m1L0K0J52j77n6p6J10J37j18Q9j22O8K61j87j28p3L13j90n0
$$ -161 -213 -16 -100 -56 -97 -67 -47 105 -72 -128 -204 -94 43 -75 14 -108 -40 221 34 -94 -167 146 -44 -94
5401i4k16J86J12o0K38k82O7j46M8J05J20j59N5J28k86J11R5K3K26l43J21j44
$$ -94 -310 -124 -12 -72 166 -116 -49 -195 -147 -42 78 -81 -26 102 -184 -73 22 45 271 -72 49 -95
5423i5p7J05l7K47k01K19j13M5j4P0o6L7O5p8K7l28K49j66J25j8n3J59j88J98
$$ -95 -172 -67 -104 143 -58 161 48 93 79 149 83 120 185 107 134 -194 55 -111 14 -4 -57 102 -86 112
5447A12l22K57R8j33l86K90J72j03m1J84k12J00j99J99j92O1R3J9M6k02j19J07
$$ 112 -210 47 145 12 -374 -84 88 -15 -56 128 -84 16 -183 16 -176 -115 -22 -3 43 -159 -278 -171
5469a71L59Rk18pj80J21K87l48L28l26J41O5L0k55J05R8k1M0q8K1K1j33M0qO8
$$ -171 188 197 -21 -28 -208 -87 200 -148 180 -146 -5 60 90 -165 -60 38 17 57 -31 -10 11 -122 -82 -90 -22
5494b2j75J77M9O6j64K9k9Nn4J1K50n5m5j43J48K5J38j32N3j01l6P4k5j07Q4m9
$$ -22 -197 -20 29 95 -69 -40 -69 -64 -118 -107 143 88 43 -100 48 73 211 79 132 31 -5 69 44 -63 21 -28
5520b8j60K42j92P7l8lJ11Lj00p9P8P4J72j67p9r4N13n54K58J01j93j91K12o7
$$ -28 -188 54 -138 -61 -99 -102 9 12 -88 -167 -89 -15 157 -10 -89 -183 330 -224 34 135 -58 -249 -37 -104
5544a04O2j78K86k4J20j22R5l2Q2j40k23J93m1J02n9j91J53k59J72r4K50Q8k25
$$ -104 -42 -220 66 42 162 40 135 103 185 45 -178 15 -26 76 17 -174 -21 -280 -108 -202 48 136 -89
5567h9K45j08j67K2l8J68L3k8l54L27K90j05j34j25J75r7P2P5j1k49N3j11j21
$$ -89 156 48 -119 -97 -135 33 66 38 -316 11 301 196 62 -63 112 15 87 162 151 -98 -45 -156 -277
5590b77K27J0N5J07k21J20j6j43J43k43Q5J74Q9l06M27k33P0K0j34J58N3k07l1
$$ -277 -50 -40 15 122 -99 21 5 -138 5 -238 -153 21 110 -196 231 -2 68 88 -46 112 165 -42 -73
5613g3j04K85n4j12j0J29j8j99M5J63k88K22J30k80J33ommJ82p8j33j82L77k29
$$ -73 -177 108 54 -58 -68 61 43 -156 -111 52 -236 -14 116 -164 -31 -37 -41 -45 137 59 -74 -256 121 -108
5637a08j12M50k02M2q9k11J63O1K63p3k46n4K23j37K28j87q9R1J5j75K64k69K6
$$ -108 -220 230 28 70 -19 -230 -67 -6 257 184 -62 -116 107 -30 198 11 -78 13 28 -147 117 -152 -126
5660a26K41m0j83J7L96j51j45J66k65L99l10J36j43o4J77N7O9j53K99l51K17m15
$$ -126 115 75 -108 -91 305 154 9 175 -90 309 -1 135 -8 -72 105 162 231 78 377 26 243 -172
5682a72K50k05K01J60k51L66m66J71j10j38L15r5k65M10q8q7L0J96q4k01j7J68
$$ -172 78 -127 74 234 -17 349 -117 54 -56 -194 121 26 -239 171 83 -4 26 222 138 -63 -80 88
5704H8j29J10L0J41l18M57l30Qj75PO7kJ03j00J14J6j98J86q1j44O0P4K5O8P0
$$ 88 -41 69 99 240 -78 379 49 57 -118 -111 -44 -46 57 -43 71 87 -111 75 -6 -150 -90 -16 9 77 147
5729A47l08J13j7K27J9k19L16l29L01r4k83P1j7K82k21k7K97l61Mm5K27j85J20
$$ 147 -161 -48 -65 162 181 -38 278 -51 250 156 -127 -56 -73 209 -12 -39 258 -103 -99 -144 83 -102 18
5752A8J47Qj30J27k2j72LJ11L8j1n2j92M1P5N8j8J62j24k45M29k56O3j99N5J97
$$ 18 165 173 43 170 148 -24 -21 90 128 117 65 -127 -86 -11 47 29 191 67 -178 251 -5 58 -141 -86 111
5777A11j22J70j42J33j44M9P3k2j75L79l09N2O1j80J52k16J58J51J1l7p9r1k32
$$ 111 -11 159 17 150 6 55 128 106 -69 310 1 53 114 -66 86 -130 28 179 190 153 74 -17 -249
5800b49L56L6n1q0jJ87l83L9L3P6Q8J06l39K57j19r5J02j36K41j17p6J94J75j11
$$ -249 107 143 92 12 11 198 -185 -146 -113 -37 51 157 -182 75 -44 -139 -37 -173 68 -49 -125 69 244 133
5824A33k43J7J20q8J82l35N7K14j57n1J41K09k79O5O1j21n3j00pJ70j0j43K35
$$ 133 -110 -93 27 -61 121 -214 -157 57 -100 -151 -10 199 -80 -15 46 -75 -128 -228 -235 -65 -75 -218 17
5847A7j58P0R9r3ro1J32j25P7mJ84j57q4j17K63K4J6j59J92k0o4J29pj73k7L9
$$ 17 -141 -71 28 -65 -74 -135 -3 -128 -51 -55 129 -28 -112 -229 34 58 74 -85 107 87 23 152 145 -28 -55 -16
5873a6j54J26rM0j51J89r1l0J65j7q5J43j07M6l2j03K47m0J58j73j22J38j49j65
$$ -16 -170 -44 -53 -13 -164 25 -66 -96 69 52 -33 110 3 49 17 -86 161 121 279 106 -16 122 -27 -192
5897a92l2jNJ83J31j34O5L8m1j48L20k91j3J38Q0n6l18K43o9J28j45n1J52q0J19
$$ -192 -224 -225 -220 -37 94 -40 25 63 22 -126 194 -97 -110 28 108 52 -266 -23 -92 36 -109 -160 -8 -88 31
5922C1mq3m3J6J46p3J4m5Q9j28O7J20j63Q8j73j0J85J72k01R0J55k97J57k77K8
$$ 31 27 -56 -99 -83 63 -10 4 -41 48 -80 -13 107 -56 32 -141 -151 34 206 5 95 250 -47 110 -167 -139
5947a39J32j42K1J81J22l04N5K15j41N0%r6J00k10M32j84j37q3R6j29J32J41l2
$$ -139 -7 -149 -128 53 175 -129 -74 141 0 50 50 -46 54 -156 276 92 -45 -128 -32 -161 -29 112 80
5970H0Q9j29J77j53p3q6R7J07q3j58J40J54k01R1J34k63K89j17k32N7L8l08K49
$$ 80 169 40 217 64 -9 -95 2 109 26 -132 8 162 -39 52 186 -77 212 95 -137 -80 -42 -350 -101
5993a01J66N9j52J60q2j54K57k52P8JJ17o6m1j86K45j69K8K70j15l3k96L39j82
$$ -101 65 124 -28 132 50 -104 153 -99 -21 -20 97 31 -10 -196 49 -120 -92 178 63 30 -266 73 -109
6016a09o2K79k80j1L66k01l2K6J90m73K70L4K5O0m1j05J58j31O7j62L00p0J38
$$ -109 -171 108 -172 -183 183 -18 -50 -24 166 -307 -37 -3 22 82 41 -64 94 -37 30 -132 168 98 236
6039B36k22qq9N7J96k72L27l50J68j27N8j24R3j12K62j79j32L17l7K29k76l06
$$ 236 14 6 -83 -26 170 -102 225 -125 43 -84 -26 -150 -57 -169 93 -86 -218 99 62 291 15 -291
6061b91M37k26n4J26Q9o4J8P4j12R2k3o0O1j4m2k87K62J13j32q9J90j56j71K71
$$ -291 146 -80 -134 -8 81 17 35 109 -3 89 66 6 67 53 11 -276 -14 99 -33 -122 68 -88 -259 12
6085A2o2j31K10Q8j84j05J73j01J80j46kj00J02J51k90K18N0J86j92j27J91l32
$$ 12 -50 -181 29 117 -67 -172 1 -100 80 -66 -68 -168 -66 85 -205 13 63 249 57 -70 121 -211
6107b11N27l62J17k01J31j1J09P9j83r2J30j23J90k09J57J37k06O8l3j10K02j05
$$ -211 316 -46 71 -130 1 -10 99 178 -5 -97 33 -90 100 -109 48 185 -21 47 14 -96 106 1
6129Aj0J61O3ql50K13j74j15K88M5l7n9l14L66l12L09J51j05o8j37p2L82kj91
$$ 1 -9 152 215 207 -143 70 -104 -219 69 114 77 18 -296 70 -242 67 218 113 45 -92 -164 218 216 25
$$ [...]
8191B78
##END NTUPLES=NMR FID
##END=
