##TITLE=1H_LR-618-R3-CR9-17-TFA
 CDCl3, 8 sc, 
 28.06.2021
##JCAMPDX= 6.0         $$ Bruker NMR JCAMP-DX V2.0
##DATA TYPE= NMR FID
##DATA CLASS= NTUPLES
##ORIGIN= UXNMR, Bruker Analytische Messtechnik GmbH
##OWNER= root
$$ XWIN-NMR		Version 3.5
$$ Mon Jun 28 12:35:54 2021 Russian Standard Time (UT+4h)  she@DPX200
##.OBSERVE FREQUENCY= 200.131506
##.OBSERVE NUCLEUS= ^1H
##.DELAY= (6, 6)
##.ACQUISITION MODE= SIMULTANEOUS
##.ACQUISITION SCHEME= undefined
##.AVERAGES= 8
##.DIGITISER RES= 18
##SPECTROMETER/DATA SYSTEM= spect
##.PULSE SEQUENCE= zg30
##.SOLVENT NAME= CDCl3
##.SHIFT REFERENCE= (INTERNAL, CDCl3, 0, 15.7039)
##AUDIT TRAIL= $$ (NUMBER, WHEN, WHO, WHERE, WHAT)
$$ ##TITLE= Audit trail, XWIN-NMR		Version 3.5
$$ ##JCAMPDX= 5.01
$$ ##ORIGIN= Bruker BioSpin GmbH
$$ ##OWNER= she
$$ F:/spectra/data/she/nmr/H-F/1/audita.txt
$$ ##AUDIT TRAIL=  $$ (NUMBER, WHEN, WHO, WHERE, WHAT)
(   1,<2021-06-28 12:34:15.34 +0400>,<she>,<DPX200>,
      <created by zg, POWCHK disabled, PULCHK disabled
       configuration hash MD5:
       00 E9 B6 7A A2 85 ED C7 34 08 36 98 17 FE 4E 26
       data hash MD5: 16K
       3E 6C 48 CC 38 AB 8D EF C8 56 D8 61 52 15 56 80>)
$$ ##END=
$$ 
$$ hash MD5
$$ 78 F1 14 DE 45 12 60 52 7D 73 A6 53 23 22 78 6E
##$RELAX= 
##$RELAX= 
##$RELAX= 
##$RELAX= 
##$RELAX= 
##$RELAX= 
$$ Bruker specific parameters
$$ --------------------------
##$DU= <F:/spectra>
##$EXPNO= 1
##$NAME= <H-F>
##$PROCNO= 1
##$TYPE= <nmr>
##$USER= <she>
##$AMP= (0..31)
100 100 100 100 100 100 100 100 100 100 100 100 100 100 100 100 100 100 
100 100 100 100 100 100 100 100 100 100 100 100 100 100 
##$AQSEQ= 0
##$AQ_mod= 1
##$AUNM= <au_zg>
##$AUTOPOS= <>
##$BF1= 200.13
##$BF2= 200.13
##$BF3= 200.13
##$BF4= 200.13
##$BF5= 200.13
##$BF6= 200.13
##$BF7= 200.13
##$BF8= 200.13
##$BYTORDA= 1
##$CFDGTYP= 0
##$CFRGTYP= 5
##$CHEMSTR= <none>
##$CNST= (0..31)
1 1 145 1 1 1 1 1 1 1 1 1 1 1 1 1 1 1 1 1 1 1 1 1 1 1 1 1 1 1 1 1 
##$CPDPRG= <>
##$CPDPRG1= <>
##$CPDPRG2= <>
##$CPDPRG3= <>
##$CPDPRG4= <mlev>
##$CPDPRG5= <mlev>
##$CPDPRG6= <mlev>
##$CPDPRG7= <mlev>
##$CPDPRG8= <mlev>
##$CPDPRGB= <>
##$CPDPRGT= <>
##$D= (0..31)
0 1.2 0 0 0 0 0 0 0 0.06 0 0.03 0 0 0 0 0.0002 0 0 0 0 0 0 0 0 0 0 0 0 
0 0 0 
##$DATE= 1624869254
##$DBL= (0..7)
120 120 120 120 120 120 120 120 
##$DBP= (0..7)
150 150 150 150 150 150 150 150 
##$DBP07= 0
##$DBPNAM0= <>
##$DBPNAM1= <>
##$DBPNAM2= <>
##$DBPNAM3= <>
##$DBPNAM4= <>
##$DBPNAM5= <>
##$DBPNAM6= <>
##$DBPNAM7= <>
##$DBPOAL= (0..7)
0.5 0.5 0.5 0.5 0.5 0.5 0.5 0.5 
##$DBPOFFS= (0..7)
0 0 0 0 0 0 0 0 
##$DE= 6
##$DECBNUC= <off>
##$DECIM= 32
##$DECNUC= <off>
##$DECSTAT= 4
##$DIGMOD= 1
##$DIGTYP= 9
##$DL= (0..7)
0 120 120 120 120 120 120 120 
##$DP= (0..7)
150 150 150 150 150 150 150 150 
##$DP07= 0
##$DPNAME0= <>
##$DPNAME1= <>
##$DPNAME2= <>
##$DPNAME3= <>
##$DPNAME4= <>
##$DPNAME5= <>
##$DPNAME6= <>
##$DPNAME7= <>
##$DPOAL= (0..7)
0.5 0.5 0.5 0.5 0.5 0.5 0.5 0.5 
##$DPOFFS= (0..7)
0 0 0 0 0 0 0 0 
##$DQDMODE= 0
##$DR= 18
##$DS= 0
$$ [...]
##$SUBNAM2= <"">
##$SUBNAM3= <"">
##$SUBNAM4= <"">
##$SUBNAM5= <"">
##$SUBNAM6= <"">
##$SUBNAM7= <"">
##$SUBNAM8= <"">
##$SUBNAM9= <"">
##$SW= 20.0188882624521
##$SWIBOX= (0..15)
0 0 2 0 0 0 0 0 0 0 0 0 0 0 0 0 
##$SW_h= 4006.41025641026
##$TD= 16384
##$TD0= 1
##$TE= 0
##$TE2= 300
##$TE3= 300
##$TEG= 300
##$TL= (0..7)
0 120 120 120 120 120 120 120 
##$TP= (0..7)
150 150 150 150 150 150 150 150 
##$TP07= 0
##$TPNAME0= <>
##$TPNAME1= <>
##$TPNAME2= <>
##$TPNAME3= <>
##$TPNAME4= <>
##$TPNAME5= <>
##$TPNAME6= <>
##$TPNAME7= <>
##$TPOAL= (0..7)
0.5 0.5 0.5 0.5 0.5 0.5 0.5 0.5 
##$TPOFFS= (0..7)
0 0 0 0 0 0 0 0 
##$TUNHIN= 0
##$TUNHOUT= 0
##$TUNXOUT= 0
##$USERA1= <user>
##$USERA2= <user>
##$USERA3= <user>
##$USERA4= <user>
##$USERA5= <user>
##$V9= 5
##$VALIST= <valist>
##$VCLIST= <CCCCCCCCCCCCCCC>
##$VD= 0
##$VDLIST= <DDDDDDDDDDDDDDD>
##$VPLIST= <PPPPPPPPPPPPPPP>
##$VTLIST= <TTTTTTTTTTTTTTT>
##$WBST= 1024
##$WBSW= 4
##$XGAIN= (0..3)
0 0 0 0 
##$XL= 0
##$YL= 0
##$YMAX_a= 184351
##$YMIN_a= -321190
##$ZGOPTNS= <>
##$ZL1= 120
##$ZL2= 120
##$ZL3= 120
##$ZL4= 120
##$ABSF1= 10
##$ABSF2= 0
##$ABSG= 5
##$ABSL= 3
##$ALPHA= 0
##$AQORDER= 0
##$ASSFAC= 0
##$ASSFACI= 0
##$ASSFACX= 0
##$ASSWID= 0
##$AUNMP= <proc_1d>
##$AZFE= 0.1
##$AZFW= 0.1
##$BCFW= 1
##$BC_mod= 2
##$BYTORDP= 1
##$COROFFS= 0
##$CY= 11.3945322036743
##$DATMOD= 1
##$DC= 2
##$DFILT= <>
##$DTYPP= 0
##$F1P= 15.9154993809931
##$F2P= -4.1035820241983
##$FCOR= 0.5
##$FTSIZE= 0
##$FT_mod= 4
##$GAMMA= 1
##$GB= 0.15
##$INTBC= 1
##$INTSCL= 1
##$ISEN= 128
##$LB= 0.24
##$LEV0= 0
##$LPBIN= 0
##$MAXI= 10000
##$MC2= 0
##$MEAN= 0
##$ME_mod= 0
##$MI= 1.114404
##$NCOEF= 0
##$NC_proc= 0
##$NLEV= 6
##$NOISF1= 3.799351
##$NOISF2= 2.8
##$NSP= 1
##$NTH_PI= 0
##$NZP= 0
##$OFFSET= 15.70392
##$PC= 1
##$PHC0= -11566.1
##$PHC1= 13.00101
##$PH_mod= 1
##$PKNL= yes
##$PPARMOD= 0
##$PSCAL= 0
##$PSIGN= 0
##$REVERSE= no
##$SF= 200.130013532006
##$SI= 16384
##$SIGF1= 3
##$SIGF2= 2
##$SINO= 400
##$SIOLD= 16384
##$SREGLST= <1H.CDCl3>
##$SSB= 0
##$STSI= 0
##$STSR= 0
##$SW_p= 3612.71676300578
##$SYMM= 0
##$S_DEV= 0
##$TDeff= 0
##$TDoff= 0
##$TI= <>
##$TILT= no
##$TM1= 0
##$TM2= 0
##$TOPLEV= 0
##$USERP1= <user>
##$USERP2= <user>
##$USERP3= <user>
##$USERP4= <user>
##$USERP5= <user>
##$WDW= 1
##$XDIM= 8192
##$YMAX_p= 0
##$YMIN_p= 0
$$ End of Bruker specific parameters
$$ ---------------------------------
##NTUPLES= NMR FID
##VAR_NAME=  TIME,          FID/REAL,        FID/IMAG
##SYMBOL=    X,             R,               I
##VAR_TYPE=  INDEPENDENT,   DEPENDENT,       DEPENDENT
##VAR_FORM=  AFFN,          ASDF,            ASDF
##VAR_DIM=   8192,          8192,            8192
##UNITS=     SECONDS,       ARBITRARY UNITS, ARBITRARY UNITS
##FACTOR=    0.0002496,     1,               1
##FIRST=     0,             0,               0
##LAST=      2.0444736,     0,               0
##MIN=       0,             -321190,         0
##MAX=       2.0444736,     184351,          0
$$ Real data points
##PAGE= N=1
##DATA TABLE= (X++(R..R)), XYDATA
0 0 0 0 0 0 0 0 0 0 0 0 0 8 -8 8 -8 16 -16 24 -26 32 -40 48 -56 66 -80 93 -106 124 -144 165 -189 216 -244
33 -244 277 -314 354 -397 445 -496 556 -616 687 -761 844 -935 1033 -1140 1256 -1384 1527
50 1527 -1681 1852 -2040 2251 -2488 2751 -3051 3397 -3794 4262 -4821 5504 -6355 7453 -8934
65 -8934 11047 -14323 20123 -33496 133238 -78265 -200676 174419 15781 -119151 67536
76 67536 51377 -170039 -74491 32317 54065 127695 54813 -122309 -10575 62788 -59103
87 -59103 11332 88569 -140114 -138878 118706 71527 -40042 99101 26367 -161137 -1859
98 -1859 119744 -50444 -43288 31814 -110647 -67393 154527 66569 -70296 18056 -12472 -94759
110 -94759 42648 72672 -69268 -39438 5686 -62053 47194 140697 -42989 -91930 49138
121 49138 -20785 -72686 89758 48005 -121914 -21308 75611 -15960 17426 72993 -54945
132 -54945 -71694 40346 6277 -9403 60447 -29406 -87672 56853 66473 -43433 22914 47606
144 47606 -81782 -37349 88525 13737 -40663 25251 -14846 -39950 60525 43024 -40272
155 -40272 8435 9975 -55136 20350 68558 -34413 -35363 39342 -11727 -20736 64458 14183 -62641
168 -62641 4094 20213 -29029 23800 36364 -45144 -18713 39365 -9848 -7784 39875 -21577
180 -21577 -52935 23593 21170 -24068 17014 10456 -45506 1927 38254 -18853 -11310 21708 -30281
193 -30281 -29045 37619 9816 -32580 8147 5332 -30363 11901 26830 -23151 -11873 10694
205 10694 -20724 -3114 30158 -12433 -24752 18627 87 -22150 22034 16196 -32737 -6553
217 -6553 21939 -9952 -3759 20598 -9084 -14980 14599 2794 -5948 14466 -2199 -18521 11690
230 11690 13750 -11407 6922 15028 -16678 -3797 24602 -1904 -11058 15098 778 -14208 13441
243 13441 13850 -9711 1315 10213 -5862 924 12693 -3568 -4784 7463 -3148 -2181 13081
256 13081 -422 -9387 8751 3315 -11090 5951 10007 -11702 -5297 12123 -2515 -8316 8086
269 8086 1525 -10502 993 3437 -4594 -763 -1159 -5091 719 251 -6535 531 3092 -8998 -5269
284 -5269 7250 -3285 -10410 3758 2095 -10372 -1589 5061 -4540 -5372 1837 -653 -4000 -808
298 -808 -598 -1690 -429 -2603 -1069 3434 -2116 -3855 4084 1303 -5775 1420 5522 -3180 -3048 5933
314 5933 2760 -3802 1711 4879 -1118 -1399 3040 3090 788 359 2551 4221 489 -1051 4227 3789
330 3789 -1622 854 6528 1858 -2426 3655 5418 -1913 -633 4906 2191 -1491 1184 3850 945
345 945 -2161 947 3204 -414 -2274 1695 3162 -1884 -2757 3094 1343 -4818 -793 3298 -1948 -3993
361 -3993 1105 1646 -3295 -3382 1462 -146 -4370 -2275 839 -1587 -4010 -2074 1050 -2002 -4996 -141
377 -141 1440 -4273 -3550 1923 -182 -5026 -1674 2158 -2741 -4590 1281 977 -3005 -1248 1207 150
393 150 -2216 -1420 1467 383 -2450 -604 3064 308 -2770 1359 4284 -2520 -2011 4891 1721 -2937
409 -2937 1960 4445 -472 -945 3284 2610 -640 1203 2767 1759 1379 196 1864 3529 -364 -519
425 -519 4997 1894 -2794 2724 4831 -1627 -1418 4659 890 -3043 2820 3300 -2192 489 2210 -1081
441 -1081 56 834 -661 438 554 -2218 -295 2434 -2477 -3111 2846 -771 -5245 2041 2406 -6155
457 -6155 -1872 3588 -3349 -4158 2091 -894 -4508 -221 325 -3035 -762 -849 -3626 156 -10 -4652
473 -4652 577 1678 -5627 -2098 4817 -2111 -5115 2941 852 -5984 931 4520 -3366 -1924 2840
488 2840 -1550 -703 3036 -1054 -1198 3166 -880 -1198 5356 1289 -4485 2770 4543 -3384 1451 6369
504 6369 -2622 -2431 6168 1442 -1755 4544 1262 -3358 3342 4515 -1562 1396 3334 -2737 448
519 448 5470 -728 -805 4531 -1637 -2726 6285 1762 -4737 2660 2933 -5026 922 6358 -2999 -4369
535 -4369 3332 -592 -3059 3849 172 -4846 548 -6 -2681 2922 717 -6777 -1029 3216 -3974
550 -3974 -1796 4746 -4063 -7523 3215 2040 -5109 513 633 -6406 -1359 3668 -1954 -2216 432
565 432 -4441 -2560 4396 -711 -4253 2190 -1305 -4991 4033 4066 -5134 -1366 2906 -2957 -187 6400
581 6400 -763 -4934 1969 1232 -1456 3914 2723 -3937 108 2904 -366 3184 3604 -3594 -1321 4751
597 4751 590 77 5411 -360 -5310 3702 6156 -1938 1057 3290 -3195 -1179 5706 2494 -1067
612 -1067 349 -1322 -717 4078 1913 -2241 1081 -432 -3792 3344 5189 -3985 -3228 2772 -1504 -2022
628 -2022 4345 670 -5516 -1548 1652 -937 570 1096 -3832 -2584 470 -1072 562 1194 -4308 -3863
644 -3863 1779 -167 -2449 1446 -863 -5755 -508 3906 -1724 -2221 1013 -2765 -3250 2632 1685 -1850
660 -1850 -1182 -1258 -1482 1532 1348 -916 -311 -552 -2120 1594 4061 -1362 -2762 2117 361 -1412 3309
677 3309 2556 -2641 -1004 2179 1598 1045 1263 -258 -613 1064 997 2227 2484 -1313 -1535 2714 2019 -140
695 -140 1819 1534 -1928 -321 3411 1489 -666 523 303 -857 1214 1738 296 -192 -1112 -350 1757
712 1757 746 -945 -24 39 -1630 129 2375 -335 -2556 -13 247 -1172 380 795 -1831 -2112 -469
729 -469 28 -420 -1174 -1155 -1239 -1159 -776 -79 19 -2086 -2292 418 -54 -1365 2 -295 -1805 -1302 921 277
749 277 -1212 -794 -53 -364 -316 374 696 -278 -1060 -368 1265 327 -723 819 619 -721 551 1755
767 1755 712 -505 385 1146 360 405 1353 690 143 334 1330 1589 588 3 1275 710 130 1308 1433
786 1433 92 -238 1149 1214 239 654 1053 -176 75 682 559 -10 -63 38 577 -208 -300 199 -80 -797
806 -797 -242 325 -165 -1280 79 -167 -1512 -590 58 -647 -808 -948 -396 -522 -864 -564 -443 -824 -1040
825 -1040 -720 -175 -819 -1130 -91 -557 -1280 -118 -44 -1021 -767 -129 -78 -901 -489 109 -383 -536 212 -128
845 -128 105 -175 -475 342 -315 -271 420 385 -174 368 867 230 -90 852 848 -148 422 997 643 128 722 1042
867 1042 822 570 457 1236 648 420 966 905 404 244 1009 826 21 391 1069 -64 89 617 365 109
887 109 -86 466 191 -361 39 204 -91 -397 -321 13 -239 -774 28 49 -927 -526 178 -695 -1017 -169 -127
908 -127 -844 -1112 105 -554 -814 -471 -263 -442 -713 -744 -165 -287 -761 -220 -13 -704 -706 -218 63 -857 -491
929 -491 304 -521 -590 410 115 -319 -231 243 52 -251 4 493 282 -64 372 631 609 140 683 1050 57
950 57 -28 1107 250 78 395 1154 360 61 789 907 34 425 858 234 441 492 530 629 10 494 651 340
972 340 -104 180 646 133 -452 840 388 -710 305 302 -325 -565 312 -182 -478 -499 -59 -121 -345 -361 -142
993 -142 -239 -682 -723 -250 -411 -889 -248 43 -816 -704 -12 -541 -1102 -464 -71 -683 -544 239 -129 -655 -358
1014 -358 -476 21 -204 -457 -41 230 -538 -185 495 72 -820 435 685 -707 -318 851 149 -277 659
1033 659 589 319 166 566 249 546 406 300 589 779 119 662 852 -183 211 1605 336 -255 1171
1052 1171 793 -257 317 989 149 23 713 204 72 437 389 247 689 -277 -318 765 254 -411 603
1071 603 367 -805 -284 789 -571 -1203 245 -174 -1203 328 101 -1186 -114 -183 -729 -234 135 -837
1089 -837 -278 -365 -713 -307 623 -529 -1188 287 -19 -1069 223 360 -1313 -389 327 -715 -692 490
1107 490 -330 -618 234 251 -481 181 113 -890 287 563 -681 206 689 -773 -388 1287 361 -596 843
1126 843 693 -482 743 1174 -389 56 875 5 -14 1236 35 128 959 187 71 1155 624 -540
1144 -540 615 1020 -427 400 1365 -415 -525 1298 277 -839 696 123 -692 317 819 -448 -135
1161 -135 233 -671 -171 761 -540 -440 255 -613 -790 552 106 -1470 -213 438 -1023 -495 995 -768
1179 -768 -1063 250 -402 -884 313 -491 -1117 -1 -443 -710 275 55 -1394 -522 581 -483 -718 628
1197 628 -772 -1028 904 698 -836 364 457 -787 385 791 -387 -211 516 -153 -64 1009 425 -419
1215 -419 766 473 -683 852 1040 -533 56 1033 -133 401 1329 46 -661 357 811 103 767 610
1233 610 -429 280 801 -8 393 534 -509 -332 1036 237 -186 647 205 -930 400 845 -732 -111
1251 -111 251 -758 -70 423 -212 -531 42 -371 -356 215 -78 -1019 -313 -65 -1058 26 155 -594 -725 192
1271 192 -361 -536 -90 -183 -1090 -336 -17 -332 -321 -386 -563 -115 170 -387 -94 160 -879 -332 447 8 -278
1292 -278 108 288 -839 61 645 -160 -428 317 48 -24 518 360 -59 116 106 224 319 498 -208 165 663
1313 663 -100 316 697 149 -257 630 530 193 465 529 72 87 599 144 -78 404 -121 -49 418 249 -129
1334 -129 298 -66 -196 381 259 -469 -59 53 -409 -62 343 -68 -290 164 90 -466 -275 -92 -378 -400 -411
1355 -411 -355 -148 -122 -416 -332 19 -393 -349 266 -9 -699 -277 209 -313 -304 -81 -488 -131 -156 11 -275 66
1377 66 -67 94 130 -201 -53 201 -144 -119 275 224 -158 99 407 135 48 351 392 38 15 338 205 163 231
1400 231 55 91 293 190 460 485 -131 129 298 149 244 423 122 -224 278 590 367 233 271 91 227
1421 227 134 258 -147 -171 357 15 -43 24 -112 -125 -77 -285 -118 99 -65 -44 -376 -300 -388 -241 -196 -226 -158 -87
1445 -87 -29 -217 -194 -185 -143 -450 -352 -20 -149 -356 -241 -302 -262 -25 -128 -13 -206 -46 -134 -144 -136 -145 52 31 -169
1470 -169 33 114 -124 -200 -126 9 -194 273 137 59 88 28 200 51 14 480 310 53 147 305 7 235 380
1493 380 250 307 280 260 217 187 240 150 27 57 114 266 20 -137 -2 -92 18 17 -169 -127 99 163 214 -274 -215
1518 -215 -28 72 -100 -175 -172 -19 -208 42 -106 -302 -252 -14 -135 -105 -416 8 64 -98 -206 -182 -187 -378 -357
1541 -357 137 -175 -438 -147 -225 -476 -232 -173 -83 -235 -182 61 -244 72 255 290 29 46 -237 232 -139 -159
1563 -159 241 35 202 40 151 75 158 47 24 203 -80 472 213 394 18 245 22 10 67 371 151 -14
1585 -14 334 136 -105 190 133 -12 237 527 164 163 -184 298 283 226 -100 238 188 24 136 106 -39 -216 -72
1608 -72 -68 -203 49 8 51 -293 -181 -102 -21 -193 -76 83 -177 -120 -278 -26 -256 -136 -269 73 -147 7 147
1631 147 -102 -563 44 -96 -156 -229 -165 -66 22 240 19 -169 -93 -46 -33 -9 292 -12 1 47 48 201 115 92 131
1656 131 176 334 73 146 -6 -303 323 188 160 166 320 78 400 275 94 -27 114 213 202 -49 188 174 15
1679 15 415 71 223 187 303 44 230 84 -66 -14 104 -80 3 -123 117 -306 51 -261 -328 -1 -95 -3
1701 -3 -23 -320 -97 74 76 -205 -180 -274 -411 -279 -149 -17 -313 -282 -190 -120 12 -168 128 0 -294 -151 70
1724 70 -16 -79 -298 95 -183 191 420 -20 -269 161 -91 -9 -97 -75 18 -15 -7 92 364 153 102 231 302 378 308
1749 308 334 -172 -53 186 232 -7 148 125 -112 7 269 319 187 140 113 -74 104 22 244 -79 -8 49 38
1772 38 32 110 6 16 -180 -84 203 -131 -401 60 21 22 398 -70 -24 -109 81 -25 -146 177 -189 -36 24 185
1796 185 -68 -10 -124 -269 -73 -122 -125 76 -51 32 -206 -3 -142 -8 -281 113 -149 -101 -79 -121 -220 -51 -317
1819 -317 -236 120 -84 -44 132 15 -375 267 55 -196 104 96 189 126 286 149 -122 309 183 121 216 114 298
1842 298 126 546 44 -54 74 40 406 244 85 54 231 -33 214 268 357 -197 45 76 21 -127 -17 186
1864 186 -50 128 -7 36 128 35 -33 -118 -67 -52 -51 144 -91 -274 19 -97 -202 -112 -348 -163 55 -136 -387
1887 -387 97 13 -324 -119 -116 -298 -399 86 -194 -147 37 -53 -283 -404 -148 -447 -155 271 -139 15 -181 -111
1909 -111 5 70 83 -179 -256 -252 280 40 32 -66 287 83 76 -40 196 85 103 455 60 138 259 182 28 128
1933 128 161 38 1 171 126 20 -7 235 229 65 230 -108 161 70 -77 -48 38 120 27 113 -192 -227 103 103 24
1958 24 -17 237 -242 -76 72 -26 -53 -75 103 129 -47 -343 -179 -295 -183 14 -96 262 -109 -269 -361 -11
1980 -11 -92 51 28 144 67 -7 42 -67 84 -54 -70 -171 -431 -56 41 -140 -110 57 8 91 -185 -87 -130 -15
2004 -15 326 -62 -10 70 130 -67 175 104 383 -13 370 44 186 -13 79 5 100 -33 112 31 -101 175 -48
2027 -48 91 279 92 74 -40 293 89 -85 124 -48 65 94 259 94 114 194 286 -112 65 32 -111 -38 -36
2050 -36 28 -82 -64 -233 -377 32 7 -155 -161 -231 78 64 -104 117 -39 232 -104 -174 113 -119 -208 -11 -63 121
2074 121 3 31 -244 150 -24 -156 -55 110 -29 150 -107 -241 130 -142 0 50 -25 -14 -44 -11 -50 -163
2096 -163 42 308 90 69 77 82 96 100 239 135 350 218 117 48 81 74 220 142 98 -73 341 152 227 89 226
2121 226 54 138 113 -86 48 32 97 -46 -201 92 -36 139 -16 71 -54 186 -103 -162 -29 -59 -295 -106
2143 -106 -68 113 -14 168 -96 211 -90 -97 -121 -63 3 -164 -95 -152 -111 -154 -171 -247 -187 105 -10 94 -111 -68 -72
2168 -72 -240 -2 -122 68 82 132 145 428 -114 76 113 292 5 -209 -29 -168 33 -79 255 112 228 -99
2190 -99 -110 -36 184 89 46 81 8 -92 -299 -72 67 20 -158 28 42 132 79 190 -44 -112 104 188 291 55
2214 55 183 79 -59 -21 67 4 88 -172 24 -18 202 -121 -17 72 143 -208 177 257 21 94 8 -361 -427 -206
2238 -206 -137 -70 189 -215 -192 -139 36 213 -205 -38 32 -206 -164 -228 54 -172 -235 -209 -155 -42 -124 -94 -19 -56 -131
2263 -131 128 159 43 91 28 152 -92 44 -158 140 34 -71 81 139 258 107 75 37 37 203 200 140 124 221
2287 221 382 -30 109 -26 317 -21 41 -202 128 62 71 57 230 95 75 223 -247 125 -22 71 147 152 -147
2310 -147 -160 -38 -38 -20 -90 -103 102 -217 75 -285 1 147 -276 -218 262 -21 231 -14 -142 -123 62 55 -155
2333 -155 -196 -135 -20 82 -104 120 269 -320 -214 2 -39 98 -42 -140 -89 21 -50 123 -215 -33 -206 51
2355 51 -64 -70 -97 -65 3 264 112 -6 37 -332 -324 -51 55 21 -273 -70 -1 -160 89 -117 -68 -210 -22 -15 179
2380 179 174 -173 -33 287 -42 152 -122 -33 223 161 -21 152 -25 -36 -26 -163 66 70 93 -19 47 213 45
2403 45 -9 -81 -309 -150 -2 161 -166 65 -56 78 -12 51 -80 52 -49 -64 -258 166 10 -183 30 113
2425 113 -144 65 -56 -249 -126 -150 -76 -42 -80 -87 -164 85 189 -231 -38 101 -13 92 114 224 -156 -28 -122
2448 -122 -98 14 204 89 55 177 -12 141 237 -251 -16 41 337 284 16 -20 64 -152 -137 31 -142 211 351
2471 351 203 251 132 90 -24 -79 -29 245 188 -72 -26 184 -151 -58 54 11 -168 3 66 -236 -127 -157 -142 -90
2495 -90 16 -123 64 21 -78 -88 -12 -136 -89 -189 8 149 -7 -125 -270 -106 -120 159 13 -278 107 -149
2517 -149 -236 47 -15 -80 436 -59 -200 171 81 101 121 151 86 153 -221 -17 210 43 41 -10 175 95 -34 -259
2541 -259 101 102 67 -86 91 144 56 -58 52 117 96 348 151 -95 -5 395 90 148 -282 75 -23 147 -184
2564 -184 191 249 -148 -184 143 -45 -108 -21 -31 5 -68 -130 91 10 30 -181 -256 -172 -166 -151 79 -53 -218 -53 13
2589 13 -66 -39 79 -81 47 3 -130 -19 66 -72 -117 -4 -66 -42 -266 -46 -104 137 -20 -83 -117 -3 -281 105
2613 105 -46 -133 -159 -125 -97 -40 -76 -61 255 102 152 -11 46 54 139 59 124 258 252 67 -63 -51 174 148 -96 60
2639 60 -124 7 -27 -134 255 79 -46 -110 -127 -103 -56 139 65 60 -79 73 167 -9 -151 60 -268 211 -10
2662 -10 -158 145 94 221 73 -136 188 149 122 -9 14 -130 -90 46 -145 106 8 -75 29 -170 -167 -90 125 -152
2686 -152 -364 148 -119 -194 -229 -33 -194 20 -54 211 -20 -214 -6 -129 85 35 -309 -36 152 -42 75
2707 75 39 -189 -46 190 -51 -23 109 -85 -199 69 -22 521 147 -121 137 -265 72 -146 146 -22 -98 -104
2729 -104 -58 141 173 3 212 -163 -161 232 -272 -64 13 12 10 20 -215 187 174 259 -8 -9 60 76 -59 45 -197
2754 -197 -200 -23 185 78 93 17 107 109 -28 21 -77 -127 -310 215 -2 -405 106 -60 -296 44 -157 -166 -282 -6
2778 -6 -22 -49 172 -26 -91 -95 309 -40 -73 109 152 -134 11 158 134 -39 69 145 127 39 72 33 -98 109 51
2803 51 119 194 -39 94 -82 -126 64 140 -377 -38 272 -50 -99 217 191 -36 112 244 -67 68 62 207 115
2826 115 156 -115 -15 -90 -184 161 86 65 86 -152 -23 -27 -238 -165 -177 163 -172 251 -315 92 56 -100 105 -8
2850 -8 76 39 -20 137 196 -390 -132 312 -237 -78 63 -255 151 133 -45 -49 223 101 -236 -7 -264 201 84
2873 84 -119 -10 -180 159 -3 117 -35 -67 -235 96 -124 -62 -172 397 -203 80 355 85 -30 -87 90
2894 90 243 45 57 176 -288 298 -76 91 108 199 104 237 -135 -13 -323 156 -225 -143 430 -71 233 -262
2916 -262 -45 -232 -97 44 -281 -223 29 -296 -178 -315 -175 375 311 -247 103 187 -204 -427 41 -54 -512
2937 -512 52 -149 323 50 -175 -301 53 -7 -241 -118 175 56 271 -34 -86 -35 43 -227 -81 -277 24
2958 24 -7 -362 237 -194 536 -24 -295 196 -217 137 162 50 -168 -280 121 -284 -263 60 -13 256 32 163
2980 163 515 -167 -98 459 -37 -86 73 -67 -151 310 154 40 109 452 -26 0 68 25 -273 145 196 91 184
3003 184 -199 -397 305 -95 227 -81 -222 -8 113 61 4 -408 -441 -198 34 195 -105 29 -209 -139 -123 28
3025 28 -121 -106 -253 114 -10 -282 400 -47 -42 -121 -61 180 -228 2 -75 -39 -222 103 -526 -291 159 11 241
3048 241 155 106 114 -37 -115 -106 -82 -220 16 -375 21 128 -383 -175 -29 -210 -137 276 -185 214 455 510 78
3071 78 224 230 444 28 -270 -172 -131 -299 361 484 -73 -8 123 -159 196 390 241 518 183 325 -419 -211
3093 -211 -16 427 152 405 92 284 -172 -27 -238 8 -214 -46 -392 90 -61 -35 -24 -531 196 -265 -188
3114 -188 -127 200 95 -128 151 25 -567 46 115 -464 -11 607 -529 369 -811 296 144 -132 355 625
3134 625 571 -574 -71 -320 -237 -262 253 321 -29 203 -64 257 516 69 168 180 383 -72 -136 -97 139 267
3156 267 -67 288 166 -71 46 215 367 124 101 -212 -265 -44 213 177 -44 130 -501 -325 396 -445 26
3177 26 578 -69 -18 -48 142 429 166 215 5 136 -109 61 -81 -248 -499 454 -302 -156 -21 -199 -79
3198 -79 -430 45 -39 -479 -66 348 171 -417 -136 -73 -448 -106 -288 -172 61 -164 -180 333 128 195 -109 -215
3220 -215 -297 31 366 188 359 -325 -221 -183 -466 186 311 -129 384 113 -11 611 -85 196 623 -27 -33
3241 -33 558 192 131 -218 283 -212 -23 36 39 539 -178 35 190 -11 -51 -55 302 -171 -178 274 -215 94 -410
3264 -410 397 174 -23 -202 382 17 243 167 55 396 383 146 -233 182 239 263 -239 -317 205 230 -206 230
3286 230 -88 -137 -51 29 -23 -98 44 133 784 122 377 285 173 194 2 331 387 -102 -57 22 216 221 -342 -48
3310 -48 296 178 30 -355 328 -215 37 -180 -157 567 143 140 25 124 -6 232 91 78 82 393 322 -156 -9
3333 -9 213 462 544 -93 -295 34 566 200 248 -106 -26 -39 -436 68 84 -524 -424 -126 -40 -506 -392 127 -269
3356 -269 -17 351 -93 -560 98 -165 -159 -381 -303 72 191 -137 280 -264 -223 39 -102 512 -264 789 367
3377 367 97 307 -682 -355 -283 -276 223 138 -441 -282 33 35 -410 457 382 -300 -99 -140 -603 -122 -65 -404 193
3400 193 -75 70 -327 -707 -171 -8 595 -331 -134 -576 527 63 -310 44 298 -187 440 457 349 545
3420 545 -571 -439 570 150 -201 -206 452 -96 -179 173 605 -139 -939 -250 520 -286 225 -381 -186 -671
3440 -671 152 500 -470 291 -149 -330 349 128 -325 -491 -374 20 331 232 398 244 645 66 -129 -473
3460 -473 -270 -544 175 -516 -38 804 622 149 -19 -653 -125 18 64 23 213 144 -606 183 895 844 185
3481 185 926 282 301 432 -160 -284 -303 -206 -682 171 -9 378 -647 135 -225 -35 -455 98 -289 -38 -179
3502 -179 164 78 -206 228 354 265 -313 96 111 144 -313 -433 184 3 77 -283 87 34 490 -44 -62 -102 -24
3525 -24 220 -601 277 -100 -119 -195 190 915 -438 648 -543 291 717 392 -335 63 167 867 -184 -231
3545 -231 238 -529 -369 -133 -422 48 164 -169 -454 58 -260 -1059 148 423 137 -146 494 -284 122 -54
3565 -54 -428 -290 -96 -1176 -805 -551 216 505 -300 216 -170 54 170 -241 372 606 169 -141 56 70
3585 70 -144 585 472 186 284 -132 261 648 73 442 13 -43 238 -584 660 52 -296 -289 -225 867 -196
3606 -196 479 -139 -181 -44 422 -84 520 443 132 518 -358 1182 307 266 62 318 570 -333 518 1169 123
3627 123 587 -169 -668 533 -156 -450 83 613 -218 162 570 351 140 32 -76 110 -267 831 -50
3646 -50 -171 112 -116 88 331 97 -939 -660 216 -87 420 544 -258 -7 291 -518 -452 -738 163 -652
3666 -652 -18 98 -104 486 252 10 338 184 98 -510 -871 384 603 -3 527 -346 -772 446 -163 246
3686 246 -192 692 -224 -125 1019 503 -49 276 -161 521 257 -276 673 331 391 -616 161 -193 -511 396
3706 396 234 -9 185 281 104 296 77 -160 719 100 -426 524 -64 -63 82 193 -509 338 -247 211 -60
3727 -60 158 -94 372 -36 -76 -137 -553 472 386 -79 958 335 -239 288 470 219 217 79 -263 -181 -257 260
3749 260 -630 151 -46 -341 73 -36 -85 475 -100 -1338 -180 655 692 -59 67 9 -72 117 186 119 505
3770 505 786 82 -889 1305 -98 -72 271 240 341 16 -234 153 113 53 426 245 164 -14 -26 590 253
3791 253 -625 559 478 321 629 876 247 433 -240 -988 -233 50 -10 -158 -265 -506 -394 -10 -420 32
3811 32 -160 192 -250 -848 -224 401 141 95 406 184 643 1171 6 -259 51 234 346 11 505 562 376
3832 376 -745 354 258 366 225 -722 -501 391 -600 -478 720 -221 195 -246 -341 253 393 328 466 116
3852 116 -130 -213 -511 -263 828 258 -382 8 290 -42 837 -62 -270 -136 218 659 72 374 -408 566
3872 566 -116 201 89 296 -274 -400 -242 316 529 -37 -339 -725 204 -407 -415 418 894 274 292 400 444
3893 444 -511 163 -682 -237 577 206 -807 492 -42 86 -94 177 -186 316 297 -399 -142 205 248 174
3913 174 594 30 -364 -14 246 839 -152 -24 266 124 366 -159 206 209 770 59 -232 -258 -161 149 113 353
3935 353 -78 32 525 -811 292 497 -346 611 -133 -203 845 325 1093 -375 -70 -98 934 487 272
3954 272 -97 -188 -525 -1172 558 286 -284 211 -4 -268 -355 -11 569 -26 419 190 -96 372 -78 449
3974 449 -195 275 632 1478 -275 612 -172 53 939 -320 93 -211 660 541 278 -38 -161 188 487
3993 487 -539 -328 -267 744 528 438 -180 -66 -285 209 -17 -698 291 -395 546 235 972 -204 -85 -204
4013 -204 708 -202 70 -265 266 -626 -797 273 359 -21 572 -561 -181 -261 362 -7 428 327 51 -107
4033 -107 -61 -872 741 1097 434 -15 -530 540 -209 558 -226 -215 -322 -520 141 -275 -866 423 -122 245
4053 245 -447 511 346 383 71 608 513 -86 -275 617 1001 140 -523 -448 160 -229 -67 -12 77 149 1735 481
4075 481 735 108 223 244 -143 -288 -575 290 -195 -482 -469 -176 -714 -241 -549 -167 202 -134 -576 1111
4095 1111 -80 -419 208 -194 -99 81 75 -1 266 -265 -327 -146 -536 539 350 225 77 -453 654 -106
4115 -106 -703 81 152 199 102 412 -442 955 277 -725 -466 736 926 -35 -536 89 231 431 -588 -249
4135 -249 358 289 396 508 334 754 238 568 27 458 395 -248 388 421 -428 -365 -28 261 -548 97 -82
4156 -82 643 608 -372 300 396 -614 233 52 -80 163 -167 89 477 -177 244 -167 -202 -37 -180 369 -333
4177 -333 190 -196 380 318 262 121 364 333 -264 180 747 284 66 -58 -352 -192 -242 563 246 160 398 273
4199 273 -246 53 -463 -69 -282 -165 135 -206 193 -465 62 291 223 -195 -227 -64 426 158 -412 -295 -180
4220 -180 73 -100 257 -881 -34 148 -48 346 -370 320 256 146 605 -625 -319 -207 -192 70 -237 295
4240 295 -194 -86 75 -305 94 136 156 302 237 -239 83 -44 124 -112 23 27 -94 112 16 102 55 -72 -263
4263 -263 -279 119 108 -137 -75 -120 66 -108 -32 111 -29 -302 156 160 -126 9 -262 -240 -50 272 206 162 -139
4286 -139 -182 181 -192 -159 -34 -253 -110 -76 -26 -93 -8 228 -76 19 -282 -51 117 -111 62 157 58 236 159
4309 159 5 41 -108 -54 -202 56 -41 39 -123 192 78 1 38 -129 311 161 -54 -29 -108 258 -40 60 154
4332 154 -54 -136 -18 89 -191 168 -51 252 -1 -41 328 17 71 -150 168 62 -8 48 2 -28 -159 31
4354 31 -124 13 -189 -54 -415 -264 -17 -184 -264 -46 -193 -39 1 -104 -155 181 58 -167 4 -24 -19 -39 -40
4377 -40 -67 -115 16 234 -45 40 -150 -37 224 -45 -137 -202 -80 -23 -41 -178 -71 -149 -211 127 101 -56 -227 3
4401 3 -145 -107 -47 -92 -294 22 -59 12 14 -355 -159 -115 93 41 115 -41 66 -131 -36 -29 118 13 -96 -79 104
4426 104 -99 172 -40 267 168 -234 -20 71 -240 6 -55 -124 -52 -54 164 -100 64 -94 29 43 229 -43 60
4449 60 -39 182 -157 72 -24 -105 -123 173 25 -298 175 -42 78 -52 -9 112 8 -68 -205 -317 93 -29
4471 -29 99 340 -56 -49 30 76 -99 -27 -61 181 30 -16 301 -153 -114 78 -294 -246 76 57 -292 75 -46 -173
4495 -173 105 64 -116 -214 -41 -58 -69 64 89 -15 -51 -73 -108 17 154 192 -134 -88 160 65 -138 402 132 -245
4519 -245 228 392 -226 -118 9 -265 -45 343 -128 568 341 -2 -74 78 77 133 -113 -14 167 90 379 201
4541 201 678 94 37 -260 -461 15 -84 161 -14 162 -112 88 -14 411 -186 -451 -57 -197 -394 112 203
4562 203 69 -12 -428 -120 161 317 -197 11 -584 -276 37 -470 -537 164 -167 260 336 -46 -442 -974 -29
4583 -29 -190 -709 -207 -954 468 319 -63 509 727 18 876 911 1221 -479 -719 186 -177 98 43 913
4603 913 914 111 164 184 553 380 -101 -279 -1011 625 268 -533 264 212 228 -504 -179 -302 -350 -148 -193 -30
4625 -30 645 45 -106 58 35 -775 97 204 133 -530 142 -343 -249 450 26 -226 -392 -217 96 148 -599 -126
4647 -126 -113 -98 240 -218 -253 -196 39 886 -465 106 47 248 285 -346 368 -239 192 266 -92 -217 374 -176
4669 -176 -140 492 207 184 140 -347 288 -388 -344 -183 -459 137 -53 64 -247 -73 729 -326 530 456 -58
4690 -58 116 557 171 -216 105 492 -757 -6 117 285 289 -195 213 -328 73 116 -298 -113 85 -211 -46
4711 -46 -401 -230 294 83 86 -318 41 -71 125 34 -241 -304 4 -187 128 351 239 313 427 -423 -486 525
4733 525 -341 135 -199 381 -61 132 237 -244 734 534 637 268 -38 -258 -64 -341 337 -332 -750 -76
4753 -76 -65 183 572 -190 210 -616 -259 -210 -257 -101 462 -123 344 -184 -95 -342 279 -6 321 112 112 215
4775 215 472 43 -79 64 125 295 -246 140 -33 -64 -47 -75 236 -227 -90 431 -133 -27 -149 184 127 20
4797 20 2 132 -31 103 -382 -93 220 -101 9 39 -19 -232 -185 148 177 -111 -95 170 51 -336 -162 -140 82
4820 82 -248 5 182 -21 -119 -14 39 147 3 -94 114 -36 -207 -162 -224 -79 -17 76 -95 -8 157 -34 -58
4843 -58 125 -364 116 38 19 181 134 -75 -16 -23 -249 36 28 -164 -25 -46 26 25 250 192 66 64 -112 153 -54
4868 -54 -20 -62 -40 111 28 -78 183 108 191 -36 4 -175 101 -163 472 -464 181 1175 67 1409 580 774
4890 774 519 277 -105 -596 509 312 658 -105 -456 -63 -784 -834 127 -528 321 786 325 255 533 -202
4910 -202 574 -119 -239 -692 -808 -806 -314 422 443 153 480 402 -180 -85 -394 -35 -659 -37 190 61 -156 -62
4932 -62 171 108 96 123 3 -112 -82 24 381 87 -33 -28 -154 23 -109 206 191 232 233 -68 125 -5 -297 -290
4956 -290 -61 212 467 173 405 -50 345 -47 -279 -284 197 75 -488 331 1144 17 -840 -11 -564 54
4976 54 572 378 -805 -695 -118 637 -396 301 -51 -242 -46 -366 121 -81 267 75 124 -308 -358 476
4996 476 -33 157 -191 -95 169 991 386 686 186 104 -465 -38 -6 207 102 245 436 203 348 -87 -86 97
5018 97 -415 -270 -246 -346 874 105 317 364 -10 -22 172 -391 -389 -258 -502 106 -112 79 138 169 -238 -72
5040 -72 -77 391 -153 -63 -274 298 153 -145 -236 -91 -67 631 -397 316 37 -243 -146 -19 96 77 -115 46
5062 46 428 48 -80 82 -278 181 143 75 91 -373 223 516 -46 -128 -153 -185 -60 166 -111 161 -603 -856
5084 -856 20 419 549 299 -432 -121 -354 278 -303 -229 1292 338 327 633 -145 702 52 86 166 651 356
5105 356 304 -503 228 -122 27 125 -167 -527 -674 51 100 12 -45 -247 456 42 -161 5 -614 -476 635
5126 635 -242 -54 374 99 445 -200 256 -159 -462 124 387 128 -234 155 -293 -228 -452 85 -189 -60
5146 -60 464 -375 744 -1103 6 -256 -487 421 -534 -888 -206 -52 -148 90 -207 255 -52 466 212 -494
5166 -494 -488 -187 -226 577 120 -550 941 77 -391 -277 10 89 -49 -21 37 -163 -8 -98 -21 -3 76 118 6
5189 6 -147 -87 3 -15 99 -82 264 -155 32 -146 -44 -135 -20 -87 89 -107 138 -26 184 158 -22 -148 128
5212 128 181 104 85 214 98 90 65 -136 44 -1 -6 86 3 144 52 204 18 59 -315 276 17 202 -67 -320
5236 -320 263 -184 45 -354 142 -152 -84 42 140 -69 -159 -18 6 19 -24 167 37 68 33 -138 -133 -38 -83 -29
5260 -29 179 -14 15 -66 261 -152 154 69 -61 67 82 86 -147 -128 -48 -237 -211 -114 86 -78 4 -155 199 -1
5284 -1 28 -35 -124 62 84 -49 29 -62 -6 238 -204 -52 19 145 -35 -330 122 117 -165 -172 94 -4 98 -42 -119
5309 -119 76 -119 -32 -92 -39 -8 167 147 -17 -20 9 -12 169 -13 71 -276 -221 133 -90 -118 37 172 25 13
5333 13 177 64 -176 -98 -59 -197 -279 147 -37 7 -137 32 -65 -51 49 151 50 237 -168 -342 -166 -180 -53
5356 -53 -177 -86 89 127 -91 -71 -107 206 149 28 -119 -163 54 -100 -130 124 -158 -31 -96 -113 199 33 -124
5379 -124 -398 85 -71 114 -104 -24 185 13 -27 -399 -104 141 -153 163 -97 27 45 26 99 -107 65 126
5401 126 -237 -109 134 12 110 169 152 -240 -97 -43 -194 32 22 84 -195 -210 -88 -111 -193 57 49 -72 -74 -67 -105
5426 -105 -115 17 -22 -40 -15 166 240 -76 122 -31 270 105 -141 -175 45 44 -88 38 -97 99 25 122 -98
5449 -98 173 -25 10 -173 238 82 21 -194 70 -212 -278 -61 -173 131 -164 -17 5 55 -206 -208 -78 35 -4
5472 -4 -51 -135 -40 -63 -78 -59 -142 -81 -102 91 -80 -118 -213 46 -145 91 132 -171 -49 -190 38 -262 -79 236 94
5497 94 -15 -38 2 -33 -123 -171 51 -75 68 185 -45 25 83 -6 63 -204 165 -54 154 152 -24 113 153 -79
5521 -79 -59 -97 86 70 -17 119 106 -113 -185 -418 89 151 -207 -35 44 141 168 248 -55 -104 2 -154 -6 5 -176
5546 -176 -150 -203 -147 -153 -205 -46 78 -94 -95 45 -118 333 -60 46 -219 -104 28 69 44 63 142 -132 -255 73
5570 73 4 -27 -171 233 102 -28 -312 270 169 86 130 -58 6 -226 45 71 -48 -61 113 -115 208 32 2
5593 2 -117 144 -54 -212 -126 365 -42 142 -70 103 -56 129 131 -13 -205 -75 -67 -29 -120 35 -42 -151 -112 -99
5617 -99 18 -27 32 187 136 -148 162 -156 -155 53 149 35 -12 100 -55 -88 209 -225 210 -100 -87 160 20
5640 20 -110 50 17 80 71 -107 -91 128 -83 1 43 2 23 -92 -138 62 -98 -60 39 -152 -5 -199 -10 -117
5664 -117 -255 -203 -17 295 -139 7 105 -128 -47 23 8 -93 -100 -24 178 52 -152 -149 159 -65 158 -7 -18 -126
5688 -126 155 245 107 -7 239 -91 -75 99 108 -291 88 -88 46 -121 -251 -173 107 -12 65 245 -46 -9
5710 -9 7 166 114 -1 -3 30 152 -78 236 325 -7 75 297 100 126 -96 221 79 -39 -61 -51 72 -83 -19
5734 -19 -11 100 -45 -15 -99 -167 -122 -72 30 -89 -2 -5 128 -14 -100 47 8 53 39 34 -116 36 -139 -45 -218 69
5760 69 20 -177 183 -22 150 68 -239 -250 245 -31 114 87 189 -40 357 69 18 104 0 81 -47 161 198
5783 198 175 -86 217 -198 -136 -137 14 -57 154 198 58 -3 -179 -68 -251 317 81 174 -94 -97 32 101 -170 89
5807 89 306 -168 344 -6 90 140 28 -8 -275 72 93 200 -198 82 -14 144 155 71 -109 -87 118 65 -60
5830 -60 -142 -32 111 60 -4 -29 -3 161 -163 -20 16 -138 -19 -42 25 42 305 -108 46 -12 -219 -24 -43 -114
5854 -114 81 134 192 -53 92 97 -104 -73 -80 88 15 17 -173 36 -114 -55 286 410 172 -183 -31 -12 99 -231
5878 -231 -411 -18 -65 -314 11 74 -26 49 -161 -242 111 -142 60 183 113 -9 -52 -59 -201 127 -126 1 -45
5901 -45 255 244 115 32 -223 264 -61 122 137 26 269 176 -21 -56 221 -2 285 -1 -142 222 67 119
5923 119 -156 -18 -87 -61 -193 -102 -195 -9 19 -52 -75 -175 36 5 -33 164 102 -40 221 -272 226 -302 82
5946 82 -57 99 -36 -132 -19 18 91 -135 11 172 102 -84 -33 221 307 -195 166 -79 26 -70 -81 -142 40
5969 40 -46 -158 -88 34 9 -100 145 66 63 117 65 -245 -172 138 -6 85 -95 -123 -55 74 -64 130 5 312
5993 312 -120 22 176 -14 -10 37 141 -160 142 67 -76 -149 -272 84 -246 66 -96 -79 -88 41 170 -96 -175
6016 -175 -15 -79 78 -276 -380 -23 -55 116 115 -163 89 -102 -228 -73 -86 23 -10 84 252 -77 5 308 51
6039 51 36 -158 29 -87 203 -158 -140 -327 -24 -64 11 -34 57 -12 -97 -117 -82 42 108 291 1 177 -60 102
6063 102 -18 -43 -89 -241 19 -67 -171 -193 -207 310 -40 140 162 100 155 333 16 27 196 -147 -213 82 101 -25
6087 -25 183 -84 -28 52 97 -10 126 -70 11 -89 -140 -26 -162 -83 -72 7 -192 108 115 -191 -60 -120 170 134
6111 134 -94 270 -207 104 -17 -81 -266 26 70 -46 -9 1 124 8 126 -163 59 243 -44 149 -265
6132 -265 97 60 -118 -146 2 174 99 -37 95 51 118 -73 -135 -162 158 148 -214 -107 -24 111 60 -214 134
6155 134 -41 -97 282 -106 -163 99 174 29 -48 -171 173 100 148 -205 -126 73 117 104 156 -161 410 67 160 22
6179 22 -75 37 402 101 133 203 -21 115 -133 -183 -22 -30 -54 -96 -97 -26 -55 47 -147 83 -137 178 57 242
6203 242 -9 -40 -16 139 114 47 164 15 -74 108 -230 -10 -29 146 -16 -38 101 -162 -361 -134 -180 -18 -193
6226 -193 -230 -57 -32 -96 -41 83 200 -5 185 -118 -107 0 -179 111 -52 -111 14 -70 107 121 231 159 323
6249 323 31 143 132 67 344 81 -24 6 22 -61 -81 -169 15 108 -14 41 53 176 -126 -49 -233 -208 -107 37
6273 37 -3 -172 265 40 162 3 54 203 -49 -126 -257 105 82 -142 27 -62 19 -69 -220 -283 0 -34 -160
6296 -160 36 -87 -292 51 -181 -45 -374 -108 1 -171 114 -131 -203 -162 -10 246 104 123 123 69 -126 128
6318 128 128 60 -52 59 -19 -45 202 150 68 37 -80 29 -149 260 147 -52 143 16 194 257 -243 3 87
6341 87 -174 123 -179 -119 -51 85 368 231 15 -124 98 14 -9 -193 -163 85 -144 -119 266 -112 62 -281
6363 -281 162 26 -3 -146 102 -106 -228 -210 -211 -236 -71 248 69 -135 110 -42 110 -95 -27 65 -214 -1
6385 -1 -208 -5 -128 149 -131 79 162 152 123 -138 -100 76 50 62 98 73 -281 -257 -274 -63 31 5 41 201 101
6410 101 208 -260 -77 -125 -78 -80 -25 140 -90 56 177 -15 -291 -58 113 -31 -4 170 144 -2 66 151 280
6433 280 60 153 9 203 -58 -77 -25 -171 179 0 -95 78 -108 -270 61 -180 386 19 -107 43 19 -15
6455 -15 43 113 53 -126 -57 -13 -157 -309 -80 174 -79 300 -93 -3 -56 -180 162 83 34 6 -85 -28 -1 76 -104
6480 -104 202 -221 -7 26 -12 108 -115 -185 -154 -97 53 -203 201 131 -222 155 35 64 35 -31 -62 64 -179
6503 -179 108 -50 92 128 150 314 -64 -53 -239 -140 -110 -174 -47 -132 -120 82 -27 15 -164 97 -112 -57 65
6526 65 -36 -72 184 7 59 53 -97 52 50 45 164 200 -236 -69 -123 -133 47 232 -217 -113 72 -120 -149 -195 -177
6551 -177 -111 131 -8 121 3 -155 -11 1 177 -34 -239 140 25 -197 -22 22 -59 2 -24 -84 46 61 -124
6574 -124 -297 -24 -26 31 311 -156 115 9 -31 15 66 132 -341 47 147 52 -152 -184 184 -48 -33 19 40 -90
6598 -90 -216 -169 262 -174 157 -100 -121 174 -124 132 -43 25 -42 -63 48 60 -91 -169 -13 70 76 -68 -119 60
6622 60 -9 -123 -19 -6 175 -134 -86 8 -93 183 90 -157 -256 -245 -11 60 -90 -34 153 103 -100 -33 -104 -13 67
6647 67 -35 25 -5 81 -151 -51 146 -49 107 80 -7 322 50 -346 80 43 93 -42 130 -276 127 -53 178
6670 178 -116 122 -150 124 108 15 -8 -312 -212 -18 144 162 -23 -26 149 -60 -116 219 -165 66 75 -54 41
6693 41 119 106 102 198 46 -2 -226 -9 -308 190 156 -95 -244 -194 15 68 56 -13 -142 -99 57 -163 159 3
6717 3 -319 60 -52 9 -89 1 320 -44 -83 -87 -48 64 165 72 88 -198 66 120 -3 55 -52 68 157 31 145
6742 145 -142 -133 78 124 81 83 19 -194 -107 249 53 219 129 197 132 237 199 -217 -141 129 190 90 -86 -79 106
6767 106 -80 184 -152 11 -40 -17 -7 -154 84 -170 -117 -124 207 61 15 89 -98 -156 -78 -147 2 95 95 296 131
6792 131 71 -286 -11 -87 80 -84 -31 -85 -137 57 64 361 -77 -201 206 -69 -97 179 -17 20 69 191 117 -190
6816 -190 -213 -10 -126 -80 65 -149 -160 -170 -250 7 19 -23 53 -106 -64 -196 70 -17 -136 -92 51 -109 399 -20
6840 -20 -94 -99 -133 332 74 -130 -172 243 139 10 -83 101 -142 -106 -78 12 -80 -140 86 -305 -386 -6 -32 201 -204
6865 -204 101 -50 43 -87 16 334 -161 -149 22 149 200 49 167 128 -7 -49 171 -105 -32 -323 53 -229
6887 -229 205 13 7 -81 116 15 142 -194 -3 54 120 82 0 240 -269 -72 -114 85 47 14 -208 -262 123 -134
6911 -134 129 84 -185 22 -19 36 42 -101 25 256 -117 376 -15 64 -117 -116 194 -154 30 -135 176 -299 -191
6934 -191 -58 146 -46 -185 55 -176 77 72 -129 53 -151 -98 -54 71 39 -218 -32 -69 127 18 -111 -35
6956 -35 -204 -21 62 149 -72 -6 -63 16 -93 45 -100 -245 141 169 -36 -64 -237 76 152 111 133 120 -135 55
6980 55 35 -104 219 -234 48 17 401 -32 49 -226 -218 53 29 -59 -71 -76 -172 -213 -70 -19 -220 -180 -36 -122 27
7005 27 44 51 44 23 2 9 62 -134 91 -9 287 166 -159 -31 -97 -248 -76 -44 -227 200 185 124 22 -155 -37
7030 -37 42 -91 -51 18 227 -50 -84 63 100 108 32 -125 100 99 -92 -9 -213 260 78 -17 -25 -123 99 -137 -130 343
7056 343 15 -1 -101 -29 232 103 33 13 62 183 108 -219 30 231 80 -14 395 102 91 106 -72 138 -183
7079 -183 79 161 46 -5 -60 43 -85 192 125 -117 101 79 -225 0 -38 -174 -65 32 75 -180 220 -66 -153
7102 -153 102 141 72 -156 280 106 -118 94 0 -169 -35 75 49 47 42 119 -45 153 -1 88 -52 92 -72
7125 -72 -115 28 102 134 167 67 226 152 -172 -60 -280 -189 141 -152 -184 137 -47 -327 -72 40 93 -258 -158
7148 -158 -72 -175 105 -29 -113 -94 104 221 -167 57 51 229 -147 -45 210 -198 189 -102 -31 80 -177 -236
7170 -236 -41 102 25 150 73 -102 106 -50 175 -57 0 -187 -29 -128 -436 170 -101 -93 -40 190 44 56 -122
7193 -122 -15 -297 -4 -46 24 -56 -81 -31 -278 -93 7 25 148 180 394 -28 -60 151 104 -146 -22 137 275
7216 275 223 122 108 127 37 -80 -83 -301 246 -28 45 175 158 106 -14 -200 110 -144 -155 135 -68 -199 53
7239 53 -200 -28 -149 -197 -179 14 25 201 60 76 -109 133 170 -262 60 -253 16 215 -25 -93 -213 21
7261 21 199 -139 139 -8 -48 193 -14 -177 -15 -143 -39 28 114 28 165 -32 -120 165 -68 -95 -67 -1 201
7284 201 -128 47 4 219 180 92 -4 -1 49 138 -173 -287 195 4 118 33 166 -164 -75 -121 -90 48 -153 73
7308 73 9 -100 -73 172 -9 -144 152 -27 -58 92 217 51 115 90 86 -77 -95 105 4 -116 -5 -27 -69 11
7332 11 -11 -226 58 16 -236 -2 80 12 -87 194 -42 86 -113 -73 93 -50 -111 156 3 117 28 233 189
7355 189 -58 115 35 -107 -62 -315 -35 128 245 -63 58 -72 -155 107 -71 88 38 101 30 -56 14 -232 -27
7378 -27 10 -314 -157 -228 -109 -154 -73 -101 123 -81 -98 -9 130 1 35 38 261 -41 -126 78 14 -113 37 -8 -3
7403 -3 118 32 189 -122 227 100 65 72 27 -99 75 42 162 70 203 23 -191 -70 61 -99 -45 -65 171 -116
7427 -116 -36 80 -61 -168 -196 -142 -127 -144 237 107 -117 -42 231 175 39 -80 -111 -49 -133 -92 -213 -20 198 196
7451 196 -131 -34 141 28 131 114 -200 -65 7 -50 -374 76 -138 143 -21 -409 -26 80 -79 -43 -199 -93
7473 -93 -81 -62 -12 106 70 -178 77 -78 -171 72 252 308 6 138 37 150 -41 -57 66 19 -145 -92 96
7496 96 -95 -122 -131 -8 46 -9 -84 43 -52 -285 8 198 146 -13 54 22 36 -35 109 23 175 2 48 -25 -62 5
7522 5 160 129 18 58 -152 136 35 -162 59 -100 2 -22 193 -40 163 -179 -192 185 -153 9 127 21
7544 21 19 -187 81 -146 127 -192 -42 -137 154 -28 -71 -55 -21 50 -158 348 42 -340 -27 -115 -1 -78 17 171
7568 171 51 164 124 44 27 53 -396 37 -55 3 -111 -116 47 39 -158 -75 -144 -92 -68 -15 135 307 3 254 19
7593 19 192 104 -85 92 179 -49 87 56 -69 -180 -27 5 183 254 -144 -99 171 65 50 91 -58 -77 -12 56
7617 56 -11 210 -59 63 -216 -15 59 286 -72 4 -5 112 317 126 124 -37 -169 74 133 116 169 -25 26 -170
7641 -170 14 62 83 -12 -208 -17 229 -128 -50 -22 -62 -217 107 14 15 233 2 118 160 -23 -102 -1 -215 -13
7665 -13 43 -166 274 -131 201 -114 118 -80 305 85 189 74 32 -118 79 154 215 -69 -71 -35 246 -80 131
7688 131 88 108 43 59 84 -67 68 2 52 190 43 -123 -334 -114 29 -7 -101 35 -89 106 -219 89 -167
7711 -167 -74 56 223 147 -7 -87 -82 135 5 109 195 -215 52 -106 79 97 -153 -123 -90 154 2 28 217
7734 217 70 -21 -33 122 209 34 126 46 151 -118 156 -106 52 95 86 102 125 48 71 35 -77 132 -88 12
7758 12 117 217 -238 77 113 -55 -176 -1 139 43 4 132 -71 -41 131 140 292 80 -112 -63 -15 -30 46 161
7782 161 37 -166 -16 -62 77 -182 237 -31 -99 26 110 -91 25 -29 40 -87 -57 -130 -1 -33 19 -116 94
7805 94 -44 -37 1 -253 -94 66 -167 -85 -42 -110 159 -226 -321 -143 -100 189 -171 -280 107 -4 -48 129 -115
7828 -115 157 92 -285 71 -139 24 -281 109 -44 -192 -83 -70 26 73 117 207 -206 10 102 90 136 -50 27
7851 27 57 16 123 89 -243 40 -110 -126 -219 54 111 -106 -159 -274 59 -30 108 96 350 14 201 -2 15 -7
7875 -7 -24 144 -114 -243 73 14 84 17 -210 98 -34 66 -85 -276 180 -66 -83 -40 245 -150 126 68 131
7898 131 -83 35 113 72 53 -15 -116 235 118 164 96 21 -206 -8 60 122 -50 -125 167 -303 45 155 22
7921 22 -81 -19 38 -68 -79 -31 46 357 -136 -6 -119 -42 -106 -30 14 80 -146 -76 -58 -194 -49 -187 208 -17
7945 -17 -50 -96 57 97 -62 60 -166 -332 79 -15 -127 228 36 -16 212 105 25 220 93 -51 -22 19 117
7968 117 -164 -9 -19 175 -53 14 130 -180 -261 106 -23 262 -131 -67 69 123 69 57 -160 -152 220 -81 -66
7991 -66 56 -346 -114 220 -173 -41 177 51 3 81 -262 -323 151 12 -38 18 36 110 4 245 52 248 -129
8014 -129 -6 -296 -7 259 26 25 -71 134 144 117 132 -21 -150 178 -33 122 -243 -44 3 107 182 77 -192
8037 -192 36 69 -53 -261 182 143 -173 1 -190 125 -86 170 300 -107 -77 -121 -44 -153 145 56 151 193 -176
8060 -176 -7 161 72 -95 -95 19 -16 165 313 63 -23 163 127 -105 -31 -41 37 -2 98 250 -78 -5 -13 14 305
8085 305 -31 -106 -14 -135 -120 -226 -85 -49 -130 89 -57 22 5 -107 -125 -119 -253 68 129 272 -264 -129 -21 27
8109 27 -161 281 -88 -133 102 -22 -56 319 -87 242 -148 -182 -44 -49 -212 -208 4 -29 142 -365 41 -17 147
8132 147 -381 66 257 2 305 -65 54 66 41 -83 141 115 22 83 -343 21 -62 -88 -44 -108 -15 -152 -182 63
8156 63 220 265 -179 56 159 -158 -84 -240 118 67 -185 77 65 24 -182 60 50 -198 19 -72 49 8 -8
8179 -8 -41 59 73 31 -47 -36 -150 -68 240 -37 180 212
8191B12
$$ Imaginary data points
##PAGE= N=2
##DATA TABLE= (X++(I..I)), XYDATA
0 0 0 0 0 0 0 0 0 0 0 0 0 -8 8 -8 8 -8 16 -16 24 -24 32 -32 40 -48 56 -64 79 -88 103 -119 135 -151 170 -194
34 -194 218 -247 274 -307 345 -385 425 -473 524 -580 641 -706 778 -858 947 -1043 1148 -1267
52 -1267 1397 -1541 1706 -1891 2103 -2348 2635 -2976 3390 -3904 4560 -5435 6653 -8481 11504
67 11504 -17368 32816 -157027 -321190 172314 143882 -78068 80052 116739 -144593 -92950
78 -92950 56359 13103 2695 -20732 -141207 -13558 142665 26223 4280 89602 -97403
89 -97403 -154697 96448 77015 -111337 2302 38178 -116654 18986 184351 -7075 -87043
100 -87043 24671 -65912 -82332 121269 58592 -121760 -15064 51208 -34811 56398 104587
111 104587 -62929 -75113 22188 -29228 10592 106906 -41763 -113556 65942 59354 -45976
122 -45976 68972 61330 -125069 -50144 93982 -2682 -27571 55781 -28790 -63269 68753
133 68753 55087 -22419 25379 -20039 -91309 38269 81840 -48578 -15583 57570 -45624
144 -45624 -34276 97910 26349 -75050 -3141 3101 -41536 40744 48757 -49886 -13807 32123
156 32123 -30508 6450 63463 -36136 -65133 30984 7486 -33038 42532 20140 -66662 -3730
168 -3730 44591 -19819 -1666 28364 -46046 -36674 41692 3515 -24607 27284 -7045 -49965
180 -49965 23752 37774 -29626 -7560 12954 -38755 -6266 45831 -9576 -24848 22702 -9940
192 -9940 -27094 35259 18414 -40235 -3374 18351 -20318 6475 34229 -16215 -18642 20191
204 20191 -4106 -7447 27727 -5162 -29458 17635 16066 -17703 16007 23924 -26553 -9971 30928
217 30928 -836 -12297 17855 -2186 -17644 16177 12929 -7732 9056 4089 -16473 8601
229 8601 18686 -11667 -3354 14638 -11449 -8658 24065 2553 -17859 9484 6019 -16115 6365
242 6365 13949 -13457 -7283 9952 -4252 -5199 10111 -3547 -11302 4387 -853 -7622 6919 -1033
256 -1033 -14437 3283 5546 -12024 -387 9166 -12004 -10299 10698 -1233 -13076 3694 2867
269 2867 -11735 -1136 6038 -4491 -3526 723 -4254 -627 1749 -5114 -938 4335 -5066 -4472 8513
284 8513 1213 -9527 3582 6507 -7385 -1460 8621 -971 -4292 4839 3591 -1378 1189 3026
298 3026 769 1293 1256 1222 4587 1363 -2272 4999 5275 -3291 2034 7685 -436 -2641 6255 4697 -3065
315 -3065 750 5792 -32 -1653 3581 3153 28 -272 1507 2761 -374 -2319 2347 2860 -2831 -1511
331 -1511 3906 -89 -4958 518 3459 -3875 -3982 2715 317 -4280 -1633 1470 -1288 -4423 -1606
346 -1606 1217 -2572 -4379 -236 924 -3432 -4593 806 451 -5741 -2790 2689 -2150 -5013 130
361 130 1346 -3622 -3777 1058 260 -3753 -1441 1705 -227 -2823 -815 1965 -294 -3642 691 3618
377 3618 -2020 -2139 3268 2032 -2861 -129 4258 146 -2462 3293 3954 -940 236 3238 1939 -315
393 -315 429 2898 2504 -116 1059 4042 2137 -1344 1661 5154 -531 -1867 4960 3218 -3006 1162
409 1162 4856 -395 -1685 2850 2539 -1561 -305 2034 662 -461 -733 331 1643 -1296 -2590 2693
425 2693 1012 -4549 -141 3314 -3244 -4102 2571 239 -5142 -217 2068 -3612 -2617 1268 -2250 -2655
441 -2655 -309 -2021 -1886 -543 -2804 -1810 999 -2662 -4503 1402 357 -5389 606 3114 -5319 -2708
457 -2708 4134 -1561 -4562 2533 1289 -3932 343 2610 -1518 -524 1159 -1698 902 2583 -1928
472 -1928 654 4294 -2412 -1718 6356 745 -4212 3889 4507 -3431 1095 6703 -1067 -2174 4626 1514
488 1514 -852 4051 1048 -1186 3243 1299 -1010 4212 2010 -4049 1583 5650 -2375 -838 5991
503 5991 -1829 -4353 5577 2124 -4185 2031 1951 -4129 946 3826 -2485 -1876 2276 -3000 -2194 3840
519 3840 -1389 -4601 1929 -1106 -4741 3337 1619 -7016 -942 2910 -5154 -1885 4992 -3355 -7060
534 -7060 2162 908 -4487 1169 641 -5754 -741 1742 -2603 562 1061 -5840 -1581 4798 -1787 -3335
550 -3335 3928 -1548 -6818 3887 5061 -4897 -599 2873 -3563 -760 6330 -34 -2478 1751 -872
565 -872 -998 5490 2198 -4237 2077 2405 -2567 4266 6272 -4215 -2069 5213 241 -486 5760 833
581 833 -5002 2546 4548 -838 2480 2788 -3775 -508 4653 195 688 2758 -2976 -2465 4875 1637
597 1637 -2140 2390 -254 -5839 1989 6062 -2881 -3449 2222 -2775 -2722 4505 1371 -4299 -1562 -1164
613 -1164 -1512 2291 622 -3964 -1474 330 -3484 878 3905 -4885 -5690 2384 -212 -3087 2339 482
629 482 -6198 -1954 3062 -313 -1215 494 -3141 -2463 1930 499 -318 1132 -2733 -3049 3130 1966
645 1966 -1993 840 638 -3771 495 5262 130 -2715 1878 96 -1528 3576 3130 -1795 -753 902
661 902 801 2732 2250 -397 -314 961 4 2102 4383 -767 -2911 2353 2210 -490 2649 2544 -2466
678 -2466 -1299 3095 2117 153 464 -798 -797 1193 1130 527 645 -1416 -2396 2308 1861 -1533 53 514
696 514 -2585 -1269 2570 401 -2928 -1067 -181 -1451 109 631 -1467 -1681 -1442 -944 745 -102 -2130
713 -2130 -1536 -765 -1760 -485 1303 -1165 -3244 -596 697 -1348 -111 353 -1951 -1855 68 734 -199
730 -199 -616 -638 -206 22 193 494 497 -715 -890 1271 1662 -592 255 1203 -466 -204 1782 1572 -157
749 -157 -253 1389 1113 587 1095 1031 643 -132 539 2097 1279 -496 903 1447 13 780 1764 747 -662
768 -662 656 1544 623 46 410 635 -143 104 787 882 -153 -666 414 26 -682 -155 352 -834 -1102
787 -1102 181 253 -996 -775 85 -966 -1208 28 -98 -1077 -1191 -894 -476 -672 -874 -405 -686 -1169 -925
806 -925 53 -590 -1612 -447 -146 -1113 -497 363 -577 -758 -321 -92 -270 -512 -230 148 -419 -384 128 727
826 727 -40 -340 599 489 -349 498 1233 231 -32 780 695 -14 501 676 811 190 956 1201 526 372
846 372 532 1059 1005 465 916 1130 61 502 901 605 8 657 850 -71 238 956 473 -222 461 440 12
867 12 -9 67 383 -18 -497 -69 -126 -494 -690 -168 94 -850 -644 6 -747 -726 52 -263 -824 -788 -561 -753
889 -753 -914 -522 -418 -730 -867 -407 -340 -617 -1017 -328 27 -714 -927 -43 -281 -676 -158 117 -789 -593 159
910 159 -66 -571 -386 431 -7 -300 126 224 109 10 201 554 150 -136 732 707 338 226 895 672 -317
931 -317 821 1028 275 306 1128 605 247 187 782 814 276 445 832 527 157 164 825 599 -172 620 481 -142
953 -142 161 728 121 -663 149 600 -304 -72 305 -148 -525 -292 -128 -191 -448 -320 235 -363 -650 -144 73
974 73 -622 -922 -170 -147 -1153 -741 32 -614 -589 -343 -416 -873 -617 -121 -318 -514 -592 -43 -280 -409 -646 55
996 55 69 -433 -174 563 -436 -285 654 134 -491 -84 761 123 -119 559 481 121 284 350 343 550 174 489
1018 489 558 84 102 504 805 -213 587 1047 -95 -132 1229 500 -326 929 673 -294 370 699 165 360
1038 360 548 -72 200 393 -13 48 579 -435 -716 829 27 -1047 409 315 -985 -399 292 -280 -724
1057 -724 38 -263 -986 -111 -204 -786 -281 -472 -846 -48 -170 -988 -222 16 -1246 -472 397 -601 -941 276
1077 276 -120 -955 58 206 -1259 -357 29 -663 -117 438 -353 -183 274 8 -242 615 -143 -918 540
1096 540 637 -704 312 1083 -647 44 1360 167 -601 815 598 -292 707 950 -262 521 697 -181
1114 -181 664 972 121 309 1077 -142 -131 1324 765 -587 640 855 -489 246 1101 -731 -600 796
1132 796 -141 -256 881 -139 -741 660 98 -292 463 -59 -1216 -336 676 -605 -558 680 -887 -1242
1150 -1242 530 290 -1256 -119 140 -1017 -398 548 -848 -944 292 -853 -561 571 -578 -1198 362
1167 362 -500 -768 157 198 -1203 -452 921 -746 -402 645 -323 -1128 541 41 -534 607 106 -813
1185 -813 462 596 -166 375 335 -655 -63 1313 150 -386 1076 370 -497 844 1038 -494 179 854
1203 854 -150 275 1274 316 -141 461 371 133 1145 422 -783 621 656 -319 740 1050 -764 -378 715
1222 715 341 -359 671 210 -922 337 458 -653 23 -27 -797 -87 553 -90 -284 100 -782 -720 523
1241 523 206 -1002 129 -286 -1007 95 361 -817 -869 382 -498 -587 81 -189 -825 -232 -65 -451 49
1260 49 102 -754 -206 201 -365 25 450 -574 -718 348 295 -453 363 147 -483 48 585 329 -148 276
1280 276 128 114 695 99 199 762 -178 -157 967 422 -140 440 672 -56 185 1011 315 -224 490 380
1300 380 3 620 663 -203 69 -5 10 198 217 21 -7 419 -75 -61 414 -109 -446 380 238 -302 -252 -103
1322 -103 -274 -416 77 -261 -513 69 -336 -349 192 -300 -425 -325 -333 -667 -247 -5 -721 -409 33 -408 -613
1343 -613 -19 -279 -630 -374 10 -417 -410 -144 -99 -386 -279 113 157 66 -180 -251 83 -103 -329 343 273 -481
1365 -481 -8 308 -67 -150 426 21 87 336 309 312 -122 124 242 -2 206 133 493 222 -21 371 659 -115
1387 -115 -52 437 208 225 366 108 -160 268 258 66 60 47 -61 173 75 181 137 -177 -156 -322 79 6 -641
1410 -641 -169 -136 -264 -157 59 -308 -336 -29 77 -219 -231 -247 -136 -296 -174 -164 -37 -482 -579 -47 53 -320
1432 -320 98 -236 -379 -327 -77 -131 -328 -1 86 -326 -170 -209 3 -217 51 249 -89 -175 79 103 128 -151
1454 -151 203 113 243 161 140 388 10 51 226 284 112 28 -193 116 136 15 152 255 193 242 282 271 251 169
1478 169 346 455 362 178 32 -60 114 209 -23 96 166 2 -316 228 261 -27 -127 -89 101 -140 -119 -351
1500 -351 -174 -225 -424 -167 -319 -109 99 -267 -335 -312 -254 46 -62 -266 -35 -23 -265 -152 -381 -341 -96 -234
1522 -234 -181 -271 -81 -185 -150 -256 -229 152 -99 -176 -26 38 -32 -116 108 -104 -133 31 159 68 -15 -23 18 128 202
1547 202 317 33 86 142 31 464 -42 233 344 352 328 76 53 284 140 348 214 79 214 238 40 159
1569 159 99 242 43 30 225 20 -163 79 -16 65 -142 209 82 -336 -126 58 0 -194 -31 29 -242 -49
1591 -49 -21 -13 -204 69 -145 -35 -121 -314 -201 -142 -190 -306 -133 -104 -597 -215 -116 175 -150 -35 -89 -168 -137 -164
1615 -164 -270 -171 -81 -317 139 -139 -93 39 217 -172 -229 170 -21 -202 -153 -193 -187 286 300 -30 387 234 268
1638 268 -54 292 76 -31 -134 318 175 393 43 217 378 299 28 211 442 117 183 362 290 -86 255
1659 255 331 -87 311 25 -231 61 -6 -3 -178 84 11 70 -47 61 -294 -8 67 -364 -18 105 -176 -302
1681 -302 -93 -86 -84 -137 -136 -185 -151 -238 -263 -212 -161 -33 -224 19 -111 -109 115 -85 -173 -41 -293 -494 -75 220 -346
1706 -346 -142 52 -187 -169 181 40 -31 66 -59 104 152 124 123 60 -54 -44 58 19 153 45 205 -137 164
1729 164 105 201 -112 258 229 -220 275 227 -76 120 329 135 192 129 239 -159 241 328 52 227 196 -52 100
1752 100 99 -332 204 182 178 224 -54 63 -87 -12 -56 166 180 48 -163 -189 -205 -197 126 -223 -297 -366 51 -41 -257
1777 -257 205 -47 -628 -80 -11 -269 -140 -86 -373 -65 51 -302 -154 -171 -43 -26 -76 37 -119 9 -343 -66
1799 -66 -107 184 -125 -130 -2 -120 172 23 -14 -229 -113 87 73 36 29 -14 143 127 -95 343 137 -22 264 340
1823 340 144 -47 119 217 77 120 289 -20 207 141 -7 -7 278 197 -41 -3 30 63 230 81 311 -199 9
1846 9 42 -4 2 -163 -263 67 82 -82 274 44 -108 118 -127 -67 -15 -58 25 -120 -119 -40 20 -49 -137 -120 24 -174
1872 -174 -309 -11 -161 -221 -78 1 -25 -230 -60 -136 -216 -110 42 -18 211 -107 -49 214 178 147 -219 165 -79
1895 -79 82 106 -112 72 73 203 -117 86 152 146 228 57 176 94 126 20 54 212 237 276 224 213 244 88 228
1920 228 40 85 19 219 77 166 12 4 -121 76 92 -74 -35 80 150 49 22 228 -202 -149 -46 -33 -32 -315
1944 -315 -176 -27 -143 -60 -40 -314 81 61 -51 -120 -42 -198 -150 -106 -222 -63 -170 143 -163 -40 46 -163 -29
1967 -29 3 -72 -7 101 -90 -62 243 -96 -81 -146 140 70 -281 -118 163 31 -102 -102 252 60 152 -21 2 -31
1991 -31 68 300 218 -108 -13 374 143 207 -20 -232 297 -23 221 255 -117 -8 94 158 122 373 69 -76 25
2014 25 88 -147 95 2 213 172 270 203 160 20 42 78 34 -135 -48 -2 53 -309 387 -157 213 -7 -151 -123 -98
2039 -98 47 -75 -204 51 -245 -184 -98 -121 -55 -48 -242 -344 -4 -83 27 -58 -36 -253 58 -155 -174 -205 -120 -94 -263
2064 -263 -26 -40 99 144 -85 -12 -83 -18 198 -68 81 -72 -215 348 -220 138 -33 64 -107 47 321 -54
2086 -54 -48 114 143 -51 183 285 88 -242 -37 194 47 158 -37 146 294 306 -98 41 202 149 175 166 125
2109 125 -23 -4 186 63 -166 -103 27 147 -83 -246 -80 -284 123 35 -3 -28 -134 -3 -151 -122 -68 1 -117
2132 -117 -130 35 -192 -82 -42 -97 -84 -89 -225 -132 86 -113 -132 -163 -157 -273 -127 -38 235 127 -409 -77 -16 -95 -28
2157 -28 235 -27 -121 82 106 -188 -167 145 -42 90 -2 4 136 209 -78 -46 21 -183 -61 302 96 124 -104 46
2181 46 10 74 -76 34 69 161 -69 -86 -75 114 32 195 176 -41 8 -37 -99 -95 -51 324 -49 -65 -145 51 135 -393
2207 -393 -96 144 -21 -186 196 -94 -38 7 -29 -184 -113 -148 -12 -245 -97 242 -231 -131 -200 105 -32 -86
2229 -86 182 65 -161 -102 -164 70 -50 -111 75 27 31 -194 18 -127 -174 281 -215 76 69 119 117 -158 90 150 -38
2254 -38 -40 48 380 -91 160 -41 182 -25 -69 189 -141 187 -34 325 307 -28 200 17 233 -149 136 219
2276 219 89 -298 -15 -14 229 74 -66 171 -14 -192 104 92 -20 143 -242 135 2 -70 37 50 -22 -149
2298 -149 -129 19 -209 34 -207 31 -6 2 166 -136 75 -63 -74 103 -299 -154 -116 42 -250 198 -133 -46
2320 -46 -56 1 -74 2 46 -107 -111 -166 -229 -39 -220 82 68 -63 29 25 -192 238 -202 247 187 -118 81 181 164
2345 164 185 155 65 144 112 237 200 247 -234 -87 320 388 -70 49 98 -160 162 187 -192 162 5 71 129 57
2369 57 16 209 245 130 -45 -290 246 57 -71 33 -50 157 -157 -179 52 -178 96 -3 83 42 104 26 21 -167
2393 -167 -53 128 -17 -120 17 107 29 56 -42 -137 106 10 5 227 -78 13 -264 -47 -270 -315 -165 -200 -235 47
2417 47 209 60 24 -26 153 4 -192 114 193 -115 -138 -101 136 -115 131 70 -9 90 190 90 31 -72 38
2440 38 146 109 131 -47 164 -34 9 -191 24 97 21 49 14 316 11 103 183 234 -185 -137 6 -189 137 -43
2464 -43 -26 -37 -341 242 -101 334 36 -114 95 -105 -16 42 9 -35 -7 32 48 75 -178 -172 -125 49 -207 139 -59
2489 -59 -164 -132 -182 91 -16 -120 -208 142 -96 89 -80 -165 115 -184 15 25 -3 9 70 -52 -69 37 255
2512 255 212 167 -48 -119 344 2 114 -136 -22 10 213 -124 -32 143 206 36 -259 -75 157 -209 189 -61
2534 -61 29 200 -159 -2 163 -27 -53 64 0 -43 48 165 -82 -11 -37 -95 47 162 117 -352 198 67 -224
2557 -224 134 -160 32 189 60 48 -220 -68 -36 -106 -10 -155 144 -69 80 2 105 277 -280 91 242 43
2579 43 -52 202 150 -182 191 148 -92 -134 82 -51 -39 151 -242 246 -177 -144 -80 277 -49 126 92 78 32 -44
2603 -44 -193 73 197 108 49 159 144 40 -162 -21 -16 -100 163 18 13 84 389 -152 55 43 44 207 -134 -38 79
2628 79 -110 142 -181 74 1 175 197 -242 281 -17 -100 -95 181 26 -176 122 54 -78 -274 45 313 161
2650 161 -240 -119 140 -66 116 -100 -203 -232 -11 -91 192 96 -96 -159 143 -136 50 100 5 -69 152 24
2672 24 76 29 -26 -177 174 70 -78 98 107 -83 -47 62 -9 -58 -63 149 26 -102 -105 -57 69 -141 -20 -42 -334
2697 -334 135 -19 334 -122 -104 42 333 206 145 77 25 -39 207 168 25 -15 -226 304 91 100 293 -10 -131
2720 -131 -240 210 297 -23 193 124 51 60 -154 -17 -88 -278 -77 -117 171 -155 -116 106 -152 -88 44 18 -150
2743 -150 12 -484 -40 -28 -249 -21 -37 -75 -160 -67 -29 -68 -135 -8 101 -246 -160 33 -92 -120 -186 13 77 -22
2767 -22 9 260 177 -196 317 60 53 140 -32 -258 -116 232 0 -52 7 215 -47 124 -109 130 -81 -229 -17
2790 -17 9 -227 115 -108 210 116 -76 97 23 127 27 -46 1 -129 -238 91 14 241 45 -83 206 144 -74
2813 -74 73 -135 179 -52 7 199 -60 74 -344 51 -1 -226 39 -42 -59 176 -46 78 22 -179 -152 -199 -246
2836 -246 239 -7 6 -21 95 56 -197 10 -215 206 68 76 -279 -30 76 129 -61 85 -173 319 -79 158
2858 158 207 -151 -15 -109 41 60 14 233 99 0 -29 65 51 140 162 114 79 261 62 275 100 -354 -248 66
2882 66 128 303 44 76 3 -23 156 240 -3 36 -26 -329 96 -108 -15 202 52 162 76 13 -197 10 190 -128
2906 -128 -87 -18 34 -152 -133 -171 -111 -177 -206 137 55 413 50 4 -28 264 337 -229 -462 -159 -26 -293 -217 6
2930 6 -63 -18 137 29 172 7 186 -37 64 -177 -18 -232 -286 260 -35 -32 203 -94 6 31 12 -49 -212
2953 -212 197 97 -51 101 43 -41 171 -92 -121 -317 -228 82 331 119 -5 149 -68 93 -89 -72 89 219
2975 219 -79 -355 22 221 112 -98 -86 103 -16 -82 140 317 -322 76 -39 -157 207 162 -368 27 -542
2996 -542 -136 -55 48 -63 124 289 177 46 28 -504 160 79 -204 330 -43 298 -141 -233 310 140 91 98
3018 98 -219 55 -109 -131 -458 -70 -219 52 -278 -232 425 234 -56 118 -166 22 -337 -170 27 35 -136 -157
3040 -157 -18 106 436 -155 -129 429 185 243 65 -417 -12 121 -73 195 23 250 544 -126 868 120 136
3061 136 598 153 21 -205 33 429 -360 -64 317 -383 444 353 368 -379 287 -854 263 -49 172 78
3081 78 -151 -123 55 -276 -17 -80 115 165 56 -109 -543 -50 -132 287 -342 -214 -594 30 -136 35 43 264
3103 264 -29 -230 -537 -173 -202 -2 -289 117 -138 -392 -216 -494 -33 123 -195 -50 60 -314 -63 -149 -83
3124 -83 -274 -29 306 -229 166 202 -20 177 91 47 433 338 -108 132 117 -10 262 -308 250 14 403 -236
3146 -236 -186 -376 447 176 -107 -339 170 -71 -213 427 -141 215 278 -266 -54 238 -266 -208 394 60 358
3167 358 -107 217 -265 -224 -196 197 -350 248 627 -412 299 49 277 -430 142 421 -321 349 512 -503
3187 -503 -166 -151 -121 -170 363 38 -278 333 85 -295 -199 -93 258 -762 -317 57 -139 196 -160 144 -193
3208 -193 182 176 -47 -144 -303 15 50 370 81 62 29 352 2 -360 379 101 140 -63 -13 -492 -714 92 -359
3231 -359 451 321 -678 97 400 294 -142 294 34 -106 215 -123 -140 287 -47 293 -176 -262 71 -48 850
3252 850 308 -63 -30 148 -86 303 -134 9 28 40 -147 243 155 14 397 252 -46 -496 239 227 -112 -20
3274 -20 -197 377 14 347 326 -237 -121 205 262 146 -191 45 434 -173 170 -350 -396 -223 629 61 -61
3295 -61 -285 -268 -166 -263 554 -218 -64 394 232 152 77 -71 -108 78 -164 242 -95 40 -186 232 24 -375
3317 -375 -104 367 483 512 72 -202 81 185 -280 188 -76 -318 59 40 -116 148 122 2 471 369 152
3338 152 668 -278 -166 -486 -144 76 -197 195 -161 -139 -27 150 404 -188 -103 -14 323 54 -144 -158 -2
3359 -2 247 -105 -16 -31 111 -481 241 285 -1 45 383 190 -57 -7 -198 -176 421 -187 -219 91 -195 -116 32
3382 32 -257 482 -207 200 44 -425 -137 -22 219 638 102 100 -727 -682 23 -296 -306 102 1097 45 -708
3403 -708 -529 210 -48 -183 401 462 66 -576 834 293 -593 147 76 -88 768 115 358 185 446 99
3423 99 136 -389 -56 -609 185 -109 -314 572 -327 586 -286 -661 -591 -133 -366 362 456 604 726 -808 90
3444 90 201 -18 -193 -54 -299 -645 -102 -127 134 -564 541 583 92 -268 308 83 79 -809 -133 -343 252
3465 252 273 349 903 603 -232 -97 -49 558 -200 -253 -126 -197 -483 -577 -165 -531 240 -418 -236 -64 -430 455
3487 455 -292 -205 112 262 -423 194 1106 154 -167 -159 97 61 385 604 242 93 217 287 -608 109 208 -437
3509 -437 -27 95 -42 365 101 83 -21 48 -405 -293 22 68 280 489 55 290 -76 38 591 9 -647
3530 -647 720 -130 -170 629 -496 290 -516 358 404 -447 -224 -632 -342 -581 22 802 362 -53 752 -352
3550 -352 -85 -717 190 -352 352 1008 506 630 226 -553 -151 123 585 -21 55 -596 30 385 320 -131 704
3571 704 230 -608 -61 -131 -260 -69 149 -195 55 281 358 401 235 539 671 275 198 598 612 -625 832
3592 832 626 -382 886 418 152 -445 -146 -206 124 -27 -303 474 -712 -949 -500 -403 -944 479 35
3611 35 490 238 -205 108 -7 518 788 -367 44 759 553 329 -182 -676 106 240 -52 650 -141 -344
3631 -344 -162 551 48 -754 388 -593 372 253 -337 718 167 415 90 588 -169 216 -720 -825 94
3650 94 136 -126 956 27 63 402 184 -36 -17 124 606 417 -23 270 783 146 400 331 134 457 -52
3671 -52 303 312 -409 213 -40 -250 298 -850 -119 -188 -318 401 200 -221 -85 -36 -327 354 388 674 -53 117
3693 117 98 -344 283 47 141 53 418 -151 -535 428 -217 426 -269 -340 43 13 -56 -259 -544 610 266 593
3715 593 -113 181 118 -630 -587 -279 846 -158 126 345 -268 361 -525 524 464 -401 499 -109 86 324
3735 324 172 350 -435 339 701 -178 55 285 122 367 -379 -11 437 95 -158 6 198 -380 -56 169
3755 169 -98 -179 88 831 37 147 -83 1 -737 -352 -188 -177 -489 -5 537 199 183 9 386 -162 -977
3776 -977 -477 123 743 96 -333 -335 257 -8 131 -783 235 -59 18 37 3 -137 -163 -72 1011 280 171 -152
3798 -152 -807 131 224 75 207 468 460 -156 -313 -227 49 257 241 -814 -189 -84 807 319 237 452 499 -662
3820 -662 94 473 -467 147 -111 310 272 -463 589 647 23 549 -335 -237 23 -60 223 697 -193 -175 576
3841 576 460 884 -292 -255 1034 138 -176 370 549 772 328 -87 -175 -293 574 -596 -347 168 -694 17
3861 17 -248 -502 -20 1157 841 -358 -371 -259 -360 389 -338 -114 -158 211 235 315 -376 13 539 -177 145
3882 145 493 -308 1083 252 -881 -409 -223 223 578 -590 -498 536 -23 847 600 319 -78 -291 383
3901 383 341 387 -392 720 -2 -179 1010 -88 227 -139 -194 -450 203 387 245 602 176 538 286 -362
3921 -362 394 347 493 94 -86 594 307 -777 37 538 -624 73 540 100 -142 -253 -86 -526 110 494
3941 494 -24 480 -10 739 -259 -193 -539 -232 -24 291 -110 -77 301 263 117 387 1023 189 564 300 -313
3962 -313 106 -315 177 133 -836 200 388 -941 -205 -630 -293 -301 -83 710 251 1038 -501 591 469 259
3982 259 -196 -318 -105 183 -69 575 227 662 544 1077 -513 -127 203 -1006 -1257 -459 948 121 994
4001 994 26 189 329 -100 -271 -123 -353 -26 -113 931 445 531 -465 -195 172 -67 819 474 -196 444
4021 444 368 -38 -258 97 -264 635 -258 -823 457 809 -754 240 -588 -889 608 43 69 -237 -373 484
4041 484 1425 6 -947 -90 152 725 167 -335 -10 9 -539 111 -481 -451 -499 189 -12 -345 862 303
4061 303 100 216 47 -199 -860 -350 -187 436 275 -76 155 636 -671 -70 125 34 126 -278 453 393 6
4082 6 54 -365 49 250 498 -397 834 294 501 -174 282 419 77 -488 150 676 -588 -45 59 254
4102 254 -199 -533 389 1033 136 -365 472 98 200 378 -16 -71 -101 -1244 292 -92 -153 92 -78 1238
4122 1238 -206 629 88 -202 323 453 520 644 938 72 -409 -327 -228 575 -551 230 265 -915 131 535
4142 535 58 -85 585 -877 415 138 308 310 -502 170 -138 485 -44 -200 -345 -67 -27 526 -165 -359
4162 -359 242 110 384 -207 -215 -447 -143 -154 427 -171 -122 58 445 -412 -34 -279 474 377 -133 736 -468
4183 -468 -673 -519 -321 -470 722 59 820 229 -492 41 -185 165 179 -15 -120 -712 53 122 -372 -261
4203 -261 -172 462 -12 -51 -447 113 312 82 -320 -539 324 -265 540 -354 308 136 -117 162 133 247 41
4224 41 67 154 212 246 -79 -200 -189 223 -161 72 -83 -136 -303 -33 -135 276 234 -161 48 -60 -202 -160 403
4247 403 -468 234 -345 -3 -240 -108 82 -69 -404 120 388 -102 139 168 -61 -161 -40 281 217 14 99
4268 99 -146 179 -87 -25 -78 111 285 29 117 -33 35 -2 65 -136 110 -140 39 177 49 159 -149 48
4290 48 236 -136 180 -7 -147 -53 234 192 -42 -137 182 51 247 -27 35 11 -300 162 -182 -49 140 -169
4312 -169 -142 -35 108 -76 109 0 -243 -66 -62 -3 -157 -73 -125 94 168 -41 -12 53 59 -92 -61 -63 86 167 94
4337 94 219 -2 -162 -173 -365 227 76 58 -52 -21 93 130 304 88 -66 -49 88 49 -80 138 223 104 298
4360 298 -85 69 210 -3 317 -228 -44 -170 -65 204 -37 431 -94 -314 -94 -18 -9 12 12 -34 -263 215
4382 215 -205 -165 -125 65 -228 278 -33 -100 -26 -42 58 -130 -154 138 -325 -113 81 -90 120 141 -132 -170 105
4405 105 -85 90 -83 8 -224 113 -26 70 129 18 39 37 19 193 176 -250 19 -81 9 -20 24 133 76 -206
4429 -206 116 107 101 -79 250 -77 -140 -90 84 116 -6 -189 250 -180 53 -51 -22 160 85 9 -317 -344 65 -145
4453 -145 -26 -51 36 -11 -204 94 -67 -123 2 85 255 -106 -53 26 162 48 170 262 61 -67 -75 39 322
4476 322 -136 25 239 73 92 70 17 25 200 110 150 246 119 51 14 52 34 -117 178 92 17 25 151 22 71 -70
4502 -70 -22 90 -263 -240 -124 -72 -107 -103 40 -96 -222 -149 73 -65 182 13 -153 -152 -101 -340 -140 532 22 -134
4526 -134 4 205 236 4 27 5 -285 -4 -73 106 164 -139 -168 150 125 -65 -19 -471 -128 -129 27 319 415 95
4550 95 -127 -824 -242 366 -503 -98 -261 67 605 -245 143 657 66 77 136 -319 175 2 290 116 769
4571 769 270 173 76 25 429 -508 671 675 49 355 1407 296 -95 -22 405 -171 775 8 726 17 -106
4592 -106 -115 684 463 -379 365 -128 271 34 252 357 160 256 11 -119 195 -235 5 475 24 1081 -482
4613 -482 -109 293 -382 629 -38 207 244 -68 -104 9 35 145 -557 0 -497 -90 -231 -622 -290 -184 689
4634 689 386 259 -322 -182 690 266 -743 446 612 -347 370 41 -662 291 196 451 -396 186 191 -140
4654 -140 -206 382 -124 -55 1 259 -237 -120 6 -323 -136 -141 10 -780 168 272 -408 252 14 368 -288 -361
4676 -361 200 -338 435 -193 38 -67 -128 -62 -195 -166 51 405 -347 -181 33 125 -227 -120 -137 54 728 -116
4698 -116 177 -182 322 143 113 193 16 -600 -357 -58 421 77 -111 42 -369 -130 -619 153 459 451 -37
4719 -37 -238 390 -142 -248 125 -232 432 95 -498 831 -139 -1081 -524 321 371 802 -393 -98 373 -554
4739 -554 251 177 357 -531 -194 -399 212 -372 -1440 -506 -296 326 -1000 676 356 546 53 -72 238
4758 238 709 532 301 -699 -305 -118 225 62 51 -69 220 -161 400 -247 341 -12 -232 -241 -334 164 104
4779 104 125 228 280 -15 -58 412 200 13 122 181 -70 -27 -83 37 -329 -103 37 -48 40 51 282 141 244
4802 244 144 -216 282 98 249 -9 -62 36 -279 15 97 54 -84 -117 44 96 -197 -16 48 62 -89 -53 -277
4825 -277 -69 17 276 -137 -51 5 -60 -213 -51 -97 -113 10 -47 72 -82 62 35 -101 156 -158 116 53 -134
4848 -134 -68 -200 287 61 28 64 -88 -6 -28 147 -357 -56 191 6 71 -72 -51 -85 -60 -9 -152 18 5 -68
4872 -68 43 -134 31 -296 221 -118 282 -132 561 255 -552 66 -271 -116 -696 655 -582 -436 592
4891 592 147 58 -317 190 -74 456 -331 254 1085 -121 274 -118 277 -32 267 772 316 -454 63 605
4911 605 41 -928 357 -231 182 88 384 -311 -166 61 -10 -17 -615 -50 -213 -80 -87 -300 3 17 -171 88
4933 88 -396 436 9 -268 205 190 -51 224 213 117 45 118 32 -16 -312 45 -42 85 17 278 -270 145 -15
4956 -15 49 -108 168 -38 -286 726 -29 737 -202 558 382 -647 428 -529 -207 -334 118 330 -14 376
4976 376 169 173 162 -133 -50 310 -102 151 242 -216 -37 -206 -137 -21 -12 -53 -224 430 146 55 241 -308 425
4999 425 613 -63 523 221 -856 -123 251 -194 -204 -115 -449 340 -85 211 -635 -470 142 83 872 -221
5019 -221 -142 -468 144 -261 125 -36 105 176 -679 695 150 481 -266 -36 200 -48 147 189 81 -71 -223
5040 -223 -226 -116 230 279 -341 -63 24 -346 -316 -334 451 -35 213 232 -251 -255 -132 25 -17 -11 123 -177 -233 429
5064 429 172 160 -450 -106 509 251 98 -226 -91 279 51 -38 -141 54 -388 -202 -371 425 783 157 -108
5085 -108 -557 661 -15 33 373 -85 -413 746 -440 639 -339 -57 827 -813 275 -1123 273 70
5103 70 -358 738 63 125 451 199 -446 144 -86 92 20 206 -43 358 371 -412 -498 95 -156 -322 513
5124 513 -50 378 -41 -226 286 488 153 49 136 144 288 193 -227 632 223 -10 251 83 -83 220 -219
5145 -219 -169 -387 241 53 628 189 510 923 -45 -351 -31 85 318 -282 343 419 -274 -18 -129 -289 -578
5166 -578 255 463 174 616 -36 42 243 -83 192 -148 -146 -294 -111 13 228 -155 158 -30 1 -47 105 179
5188 179 105 227 -385 -83 53 233 -178 -30 -200 93 56 199 -16 -36 212 -109 66 -89 8 118 148 -119
5210 -119 -76 9 106 -148 200 12 60 249 97 55 -221 10 -119 97 -43 -69 -8 -176 157 23 -27 77 69
5233 69 -57 -11 73 -81 -66 211 15 73 -70 -57 197 116 160 -97 249 173 -201 19 107 -59 -195 102 -31
5256 -31 -234 46 10 236 -79 -101 -308 -75 107 65 26 199 -25 67 -197 52 157 140 109 52 -192 -32 124
5279 124 71 -193 26 -248 118 11 46 -34 -107 -100 215 -28 -169 103 -34 -11 -10 -280 10 -71 199 -45 20 167
5303 167 -67 143 -233 131 61 -74 -118 -350 165 -15 144 66 121 36 5 -228 204 -45 -140 10 -96 -7 -135
5326 -135 -134 -11 -50 7 76 118 312 115 91 127 -46 22 -181 -110 33 67 -145 101 -37 194 145 -126 89 70
5350 70 -8 -68 -106 -89 159 -103 57 -68 155 -336 159 -66 361 102 185 -99 -98 -29 -163 -313 270 198 -122
5373 -122 -160 -382 90 125 -237 -86 -72 -16 8 -144 2 -128 -102 -30 121 3 -240 157 -94 -112 16 256 129
5396 129 -36 22 12 -54 243 -70 -316 -58 -104 -111 -49 -286 77 -77 58 -268 -196 129 -127 43 113 115 72 27
5420 27 182 34 -180 -143 -107 -10 113 134 79 -94 -175 -186 -228 25 123 167 1 -157 -35 -173 60 74 90 -59
5444 -59 264 72 208 -6 26 -1 389 -85 254 270 -54 127 -97 -313 56 16 235 -104 -16 8 49 -45 -126
5467 -126 129 45 -146 42 -83 179 95 -304 129 106 176 -30 -137 46 207 -49 -195 -137 7 169 10 -8
5489 -8 64 -133 141 -164 45 186 -15 -78 -168 -16 -37 -95 -41 82 -86 -9 54 63 -62 39 3 -90 -217 251 196
5514 196 -46 9 50 -35 -149 -22 45 -246 29 -51 130 76 -119 10 -149 166 -219 -75 -185 59 -55 122
5536 122 112 -67 -20 -115 -120 -45 -85 -270 49 -358 -149 -40 -7 -23 -64 178 -121 -28 -142 125 -83 -44 19 412
5560 412 61 59 -116 -65 -77 149 -15 -53 226 -231 34 -130 -89 63 -38 186 66 -30 125 -164 27 178
5582 178 8 -78 -8 -194 -129 -123 32 -155 -206 141 76 -127 2 91 2 -106 -71 16 23 85 143 -230 -131 -138 -283 25
5608 25 38 -102 51 87 -29 185 -190 231 -82 -28 74 -336 -77 -35 82 -74 -133 -153 64 -175 -29 67 -234
5631 -234 50 -87 -60 -33 79 -24 -111 214 -40 -80 49 -132 78 183 27 191 116 -134 53 207 69 -31
5653 -31 -78 -117 106 -209 -39 -63 -237 110 -81 80 105 -159 -31 46 42 124 109 162 228 48 232 -178 -5 -42
5677 -42 305 105 -33 93 -100 -82 207 314 -24 -91 78 111 19 179 -108 78 334 9 120 207 -172 -56
5699 -56 35 245 75 -108 -6 47 -315 54 93 45 -94 -122 31 -9 6 -60 -147 -107 -93 138 -95 -30 42 -87 -402
5724 -402 111 -111 -133 -31 103 171 -23 126 101 -105 46 -219 161 93 -39 92 -104 -21 -7 183 -23 89
5746 89 227 -89 -171 139 -23 151 -39 -63 264 -143 -71 -179 -114 106 -54 0 257 18 207 -51 19 -115
5768 -115 173 145 237 37 -248 59 72 29 -33 -100 -101 -290 72 -164 -78 123 142 118 129 -104 -21 -108 38 -56 -77
5793 -77 103 106 4 -321 69 -172 -101 70 232 22 242 103 72 -199 112 77 129 -62 -55 36 -215 -46 53 132
5817 132 -16 -7 -56 384 138 -74 -166 -57 -19 103 158 -29 -154 79 112 -129 218 57 -164 111 143 85 -16
5840 -16 277 -208 -39 -36 -2 90 -32 -117 30 155 133 154 156 11 12 -22 -84 -19 22 -105 86 -32 188 -19 -395
5865 -395 -152 56 -36 300 16 -237 -7 252 -9 17 -25 31 -10 226 28 150 -65 -84 296 22 149 15
5887 15 -148 13 250 -254 -105 -100 234 -7 -337 -129 -34 56 33 45 218 -246 107 166 153 -42 55 -150 -67 -189
5911 -189 87 31 124 -98 -133 15 -65 -21 -31 -86 -202 -259 -162 -242 37 133 161 -125 138 19 -33 173 24 43 231
5936 231 129 -143 126 32 125 -45 84 52 -269 -71 154 60 -132 -184 56 386 136 2 190 -12 252 57
5958 57 217 -103 250 -171 121 -211 -181 54 68 -66 74 -85 -127 -12 -29 -182 -17 129 203 18 98 113 -176
5981 -176 331 -178 -120 -164 248 3 -168 -28 176 -223 -172 97 -54 204 -28 52 328 65 -90 -333 -8
6002 -8 -18 -8 -198 109 97 155 226 75 -62 -109 -168 18 216 133 -85 164 -34 13 -222 237 107 -76 166 -24
6026 -24 127 202 250 -114 15 117 170 -199 205 143 289 -141 177 171 20 96 65 260 86 12 -111 4 59 47
6050 47 245 -81 -75 26 -142 93 -111 -63 -143 -44 -18 115 -412 -77 -132 -71 9 147 -74 -173 -337 -250 -172 -52
6074 -52 295 141 -124 77 -41 -266 28 73 -90 -144 -93 57 143 0 264 -217 -10 114 19 130 -85 -29
6096 -29 109 48 90 26 -98 -7 20 -46 14 -273 231 127 -79 -93 51 157 345 11 -147 -69 39 128 -9 -1
6120 -1 -50 46 -46 135 -98 134 -84 16 106 103 200 -105 -46 -77 111 -36 -289 39 -154 93 82 -171 119 109
6144 109 -45 -85 -154 -86 130 -55 157 -210 236 -117 -47 3 -90 195 -52 -32 -181 -61 -96 -155 167 -96 -11
6167 -11 -114 161 167 148 77 -365 42 -71 -75 54 25 35 -79 291 48 267 112 219 -90 135 -250 51 -53
6190 -53 114 76 -76 -94 -144 -112 -128 78 -24 254 38 5 186 -44 149 158 -163 175 193 -286 228 -61 -125 -141
6214 -141 -135 -11 -204 47 -127 -92 -111 2 -250 56 -107 -87 193 61 71 78 68 -23 250 -203 -91 142 -110
6237 -110 182 92 -59 -52 -50 121 -402 -38 -80 85 -121 197 56 -125 -179 -55 27 -37 -37 30 -147 -79 126 -153
6261 -153 40 -88 164 -37 30 107 149 -20 198 101 -2 -80 -163 213 -87 95 -94 4 51 186 41 325 206
6284 206 -10 -54 -81 166 26 -274 90 -39 -21 -99 -122 142 -66 -27 -35 21 64 102 66 88 33 -176 -92 -25 104
6309 104 3 68 31 -78 -44 142 123 76 273 27 57 138 -40 -177 106 -76 246 51 36 -157 36 -113 181
6332 181 -33 21 -237 -11 185 -118 178 -22 -83 -117 -43 299 -34 -5 -63 221 -145 -357 62 196 -60 -116
6354 -116 36 11 -68 -74 299 153 83 -282 -26 -29 54 190 -64 -29 -41 101 -13 1 272 53 -254 27 -190 -7
6378 -7 23 -52 -273 -324 194 -144 -1 -56 -37 223 17 -16 -78 162 -119 85 88 -255 -58 57 181 71 -122 212
6402 212 -10 100 -31 98 -113 77 -189 37 85 65 -8 -94 249 71 37 4 -154 66 256 -15 34 110 -145
6425 -145 -15 48 237 26 -70 -160 12 -49 105 -20 150 268 -70 -125 -345 85 90 -77 81 -2 71 110 27 -128
6449 -128 -166 23 127 -172 -147 -8 -163 113 111 115 97 -72 -213 29 -53 43 -343 -60 93 -85 -66 -117 42 20
6473 20 25 -46 -71 -283 39 -116 82 56 -145 105 67 -137 -77 111 -75 116 -32 89 -143 -18 -268 -65 48
6496 48 -57 251 135 303 141 -64 -282 18 80 -203 -126 -133 59 -47 67 -125 -160 27 -89 149 -81 -132
6518 -132 -122 36 -66 90 152 33 81 54 66 74 61 212 32 188 -167 -55 -25 98 188 131 151 95 55 128 -308
6543 -308 43 -253 108 -85 -25 -126 60 -175 -101 68 -28 408 68 148 -14 -113 -223 276 93 40 9 32 -11
6566 -11 -9 -44 -229 96 15 -6 117 76 269 -127 65 -20 -50 -116 -127 -71 193 17 39 -79 299 106 -178 182
6590 182 -154 61 -55 -133 -55 80 61 -114 70 195 30 100 138 121 179 72 198 166 21 -53 -181 278 -356
6613 -356 52 -164 -201 43 -137 181 121 -158 -82 -233 242 -32 -119 48 -309 146 -71 65 -136 -174 -45 176
6635 176 -220 112 94 -167 -219 -65 88 -90 21 -278 123 124 67 -48 -137 -77 -46 -66 34 65 25 -150 -3 -178
6659 -178 -15 94 274 320 -54 111 -118 -299 -27 -97 -130 267 -15 58 20 65 89 -108 191 -182 -21 -112 46
6682 46 -30 140 3 -23 -4 -78 266 147 -78 -119 323 -23 -21 288 -96 134 -156 47 -96 -97 -120 -137 85 110
6706 110 114 -30 -34 55 152 125 -47 -202 275 108 -163 84 -43 156 39 -50 91 -149 -188 155 287 11 52
6729 52 -35 -290 17 80 94 -28 -2 -128 108 77 -37 82 116 295 -22 81 32 -76 -154 -50 -130 -202 3 -136
6753 -136 13 -185 32 -23 -60 7 126 -55 -186 104 -95 -83 -248 -223 54 -39 24 -28 -308 -7 -35 -12 -32 -8
6777 -8 354 -65 302 -44 102 -218 -77 1 -30 374 -307 -68 166 209 -65 44 102 -31 -78 -121 -32 -157 54
6800 54 165 53 125 33 61 82 -133 -65 8 16 213 1 -37 230 -84 -224 -94 -155 -179 -373 11 81 -109 -143 117
6825 117 102 148 132 172 -67 6 322 7 211 -93 24 -194 58 -178 183 -1 128 -32 124 -246 -235 -25
6847 -25 -8 211 -488 105 -52 -114 211 42 -172 -72 -25 -115 111 -34 -81 126 -305 203 -397 21 137 -116
6869 -116 -89 -161 176 210 -28 76 30 -71 105 33 -173 289 -115 -83 300 75 -253 12 57 82 43 -118 -40
6892 -40 -128 25 335 102 48 -182 -371 205 225 -19 -19 -79 50 -122 142 -358 152 146 -52 297 -200 64 -66
6915 -66 -74 -255 45 -187 90 -89 189 -40 89 106 116 62 -150 94 -182 40 183 165 -27 117 125 258 37
6938 37 89 -145 73 114 -110 178 -212 316 -17 74 -111 -22 -235 -32 1 -7 -139 -134 -104 71 -81 159 -150 144
6962 144 111 -99 63 -79 88 93 -115 71 -73 15 -100 -149 100 193 182 -16 161 -152 46 -220 -67 22 208
6985 208 -88 -209 -54 40 3 -3 -65 -324 13 120 38 250 53 106 -11 -252 184 169 4 -45 -129 -65 -43 -163
7009 -163 -167 39 121 237 -120 76 236 -307 -145 88 -246 -235 23 -16 -107 28 150 21 91 179 124 90 -149
7032 -149 155 100 -14 -179 93 73 40 -70 -17 -27 -15 -154 145 -48 83 136 -106 -21 -109 -160 -46 -109 -32 231
7056 231 44 -54 -10 -127 150 -5 239 50 120 -86 -205 -136 -122 95 -27 -53 -81 249 -256 -117 -67 -142 93
7079 93 102 130 234 18 -221 -9 141 -29 -101 157 33 -108 204 -176 97 115 -124 42 134 -138 -300 34
7101 34 187 -82 -27 -125 201 -124 -50 135 -64 -22 -139 221 188 -92 -174 144 -2 83 22 -72 141 113 7 142
7125 142 -215 136 -37 94 238 85 -263 -28 -5 91 157 -11 115 1 37 26 -35 -14 102 165 -157 -122 117
7148 117 -49 -257 15 -66 225 -135 -109 -122 -257 83 161 -82 -37 18 -4 -96 -8 -200 54 3 -42 -273 -24 143
7172 143 43 271 48 -89 -60 41 -69 127 -247 9 5 -22 3 0 50 -15 -58 -47 11 -61 71 48 -155 -6 79
7197 79 61 59 92 -99 -56 -104 -8 141 43 153 225 -83 -95 251 -418 55 -2 -175 -51 328 -91 113 43 -50 -169
7222 -169 41 -131 33 -124 -90 21 -238 41 -58 25 -195 238 252 -144 -28 -10 132 -50 -181 120 -22 205
7244 205 152 110 -121 75 1 177 21 41 132 308 113 47 79 49 158 123 87 -115 64 -80 76 -116 135
7267 135 -62 -56 -203 -157 -187 6 -10 14 206 46 -47 -44 -136 5 177 135 131 73 -266 -31 -385 69 -250 -258 -269 -12
7293 -12 -4 -161 131 5 121 54 -11 90 -104 -268 38 -108 -36 10 -155 53 -93 7 16 -172 -103 -21 141 -157
7317 -157 -193 -49 38 -138 16 271 -205 67 -93 -101 -67 -26 -71 32 32 172 67 71 194 97 53 -169 17 -204
7341 -204 185 142 -11 -8 5 -92 130 -90 -248 -55 -95 -198 -12 -218 -393 -20 15 -51 -97 68 -6 -73 31 42
7365 42 -56 -162 -122 -34 -12 -41 55 -150 8 -44 12 230 61 267 57 -80 73 -298 -460 91 -123 -93 304
7388 304 -85 -116 -273 -19 -90 -2 25 -243 -64 -15 -52 -6 -301 119 99 -44 133 -316 52 -201 -35 -45 -151
7411 -151 -157 62 -145 58 90 32 161 -16 -77 -116 -143 -136 -381 113 71 -38 106 35 -39 139 159 92 -126 59 74
7436 74 74 209 -92 118 198 138 -199 -179 -115 -164 138 142 95 73 215 37 -108 -342 -82 195 30 -53 -55 -32 40 116
7462 116 -104 108 137 185 143 -21 -170 197 -31 55 24 34 -146 12 -126 247 -12 -98 -75 -9 -209 128 60
7485 60 16 34 -21 105 -228 90 -137 100 32 13 -54 -62 41 64 215 45 216 82 -201 307 85 -119 -117 -219
7509 -219 94 -100 -9 420 -213 59 59 260 33 -30 0 -197 69 -68 102 -104 101 193 161 21 -32 320 -96
7532 -96 -5 25 -19 -152 -54 42 216 -164 70 357 -7 -76 243 0 -150 -124 43 -264 167 29 16 47 -172
7555 -172 -99 130 118 -77 -20 -123 -25 131 106 226 245 59 -263 33 -128 47 139 -21 75 -92 -79 35 -35
7578 -35 -145 -100 302 168 141 244 94 60 79 -95 86 -30 -200 160 120 -36 -24 -149 -74 61 123 129 173 97
7602 97 -23 68 168 69 -35 149 -89 -369 -97 89 78 177 223 -129 165 -48 128 47 -123 -80 141 -269 -58
7625 -58 68 -80 -5 22 -1 -73 150 -193 136 -123 -52 94 -61 -148 62 -44 116 104 -86 18 105 87 -21
7648 -21 -114 -287 30 130 -111 84 90 -58 -33 -68 187 -24 -7 -204 -103 -210 23 -73 74 129 -329 74 140
7671 140 163 146 -161 106 -21 -63 171 28 -29 -61 -59 199 57 -159 -134 -236 -169 -260 36 22 -103 -177 -272 26
7695 26 96 -14 -269 19 -267 -309 -59 129 27 -127 141 -153 -26 -187 91 207 12 -80 -13 -181 32 105
7717 105 -59 -14 -265 1 -83 10 -7 49 116 302 154 45 147 14 68 -10 191 -6 -304 129 19 -131 -32
7740 -32 100 -73 -3 58 -136 -137 130 343 -163 -205 -130 3 -76 181 -136 78 185 77 -33 -17 -210 168 -111
7763 -111 132 64 -255 -123 81 83 17 73 -22 30 -36 -31 150 -110 -60 -95 -90 121 155 -182 -164 84 -77 47 157
7788 157 68 -68 -54 176 92 -19 60 -54 -87 34 233 -78 86 107 279 -144 -240 -219 0 -95 155 49 253
7811 253 -57 18 -7 -5 145 -182 39 40 -201 17 482 83 -47 -49 -85 -3 159 -173 -50 -1 61 222 108 5
7835 5 -127 155 80 84 -122 -53 -204 -17 -220 -109 -111 188 -24 -49 -70 -146 156 88 -139 53 74 62 271 87 14
7860 14 -84 12 -64 -75 -134 42 63 -125 -9 -203 46 72 262 -226 -450 -61 173 -325 21 -42 151 57 -90
7883 -90 57 -59 -69 21 99 -31 54 50 125 -90 23 214 -15 75 111 5 -93 240 64 48 48 -51 -93 83 11 7
7909 7 -273 239 236 -68 274 -190 251 -6 116 -24 24 -79 -18 -105 -154 -149 -163 -33 210 -98 91 -217 98 173
7933 173 27 178 -84 28 -28 259 -29 61 34 -148 15 80 -154 173 170 142 -52 -227 95 -75 -137 20 -94
7956 -94 -161 114 -32 98 202 -127 -12 110 -244 -108 132 -234 -99 94 -54 -27 -39 -137 42 14 39 -71
7978 -71 -344 -219 -48 -79 26 43 -89 -54 70 -163 -223 -175 -96 -159 -93 -69 -123 249 -5 -244 -98 -58 -317 -75
8002 -75 7 -116 150 130 86 -66 -83 118 -101 -231 -65 83 -174 -14 86 64 318 -38 91 -117 -74 91
8024 91 197 -70 -36 -86 -207 232 -217 -54 70 -16 -123 0 105 -22 88 -69 11 135 -43 -175 99 168
8046 168 -21 23 -16 187 58 206 -193 -159 -139 105 -158 350 -257 9 145 145 -30 231 143 -28 90 36 -33
8069 -33 -76 -91 -27 26 -102 -90 225 291 -24 37 -81 45 -44 -65 -194 -68 176 -117 91 -122 -238 144 159 39
8093 39 -134 -34 21 -121 79 -101 -45 29 -65 33 35 -232 -31 46 59 -45 -28 -147 123 -67 -70 144 -13 46 -166
8118 -166 134 39 142 74 -3 -233 -91 98 78 103 47 75 35 52 -220 79 -106 71 -307 -106 40 -83 -65
8141 -65 -2 -166 -24 -42 -45 116 173 68 -4 220 4 -74 -61 -34 144 21 139 50 -82 75 -185 -129 -98 34
8165 34 -20 -210 -81 -406 89 122 252 -82 257 166 -18 161 -51 -2 -23 -13 36 107 14 268 25 74 290 377
8189 377 91 -56
8191e6
##END NTUPLES=NMR FID
##END=
