##TITLE=1H_LR-618-R3-CR7
 CDCl3, 8 sc, 
 30.06.2021
##JCAMPDX= 6.0         $$ Bruker NMR JCAMP-DX V2.0
##DATA TYPE= NMR FID
##DATA CLASS= NTUPLES
##ORIGIN= UXNMR, Bruker Analytische Messtechnik GmbH
##OWNER= root
$$ XWIN-NMR		Version 3.5
$$ Wed Jun 30 08:40:55 2021 Russian Standard Time (UT+4h)  she@DPX200
##.OBSERVE FREQUENCY= 200.131506
##.OBSERVE NUCLEUS= ^1H
##.DELAY= (6, 6)
##.ACQUISITION MODE= SIMULTANEOUS
##.ACQUISITION SCHEME= undefined
##.AVERAGES= 8
##.DIGITISER RES= 18
##SPECTROMETER/DATA SYSTEM= spect
##.PULSE SEQUENCE= zg30
##.SOLVENT NAME= CDCl3
##.SHIFT REFERENCE= (INTERNAL, CDCl3, 0, 15.7039)
##AUDIT TRAIL= $$ (NUMBER, WHEN, WHO, WHERE, WHAT)
$$ ##TITLE= Audit trail, XWIN-NMR		Version 3.5
$$ ##JCAMPDX= 5.01
$$ ##ORIGIN= Bruker BioSpin GmbH
$$ ##OWNER= she
$$ F:/spectra/data/she/nmr/H-F/1/audita.txt
$$ ##AUDIT TRAIL=  $$ (NUMBER, WHEN, WHO, WHERE, WHAT)
(   1,<2021-06-30 08:39:42.65 +0400>,<she>,<DPX200>,
      <created by zg, POWCHK disabled, PULCHK disabled
       configuration hash MD5:
       00 E9 B6 7A A2 85 ED C7 34 08 36 98 17 FE 4E 26
       data hash MD5: 16K
       D1 66 95 19 BA 08 E4 66 9E 7E B7 AD A1 CB F6 43>)
$$ ##END=
$$ 
$$ hash MD5
$$ 1B 69 EA CB 42 63 5B C4 C8 68 4F CB 78 E0 1B BF
##$RELAX= 
##$RELAX= 
##$RELAX= 
##$RELAX= 
##$RELAX= 
##$RELAX= 
$$ Bruker specific parameters
$$ --------------------------
##$DU= <F:/spectra>
##$EXPNO= 1
##$NAME= <H-F>
##$PROCNO= 1
##$TYPE= <nmr>
##$USER= <she>
##$AMP= (0..31)
100 100 100 100 100 100 100 100 100 100 100 100 100 100 100 100 100 100 
100 100 100 100 100 100 100 100 100 100 100 100 100 100 
##$AQSEQ= 0
##$AQ_mod= 1
##$AUNM= <au_zg>
##$AUTOPOS= <>
##$BF1= 200.13
##$BF2= 200.13
##$BF3= 200.13
##$BF4= 200.13
##$BF5= 200.13
##$BF6= 200.13
##$BF7= 200.13
##$BF8= 200.13
##$BYTORDA= 1
##$CFDGTYP= 0
##$CFRGTYP= 5
##$CHEMSTR= <none>
##$CNST= (0..31)
1 1 145 1 1 1 1 1 1 1 1 1 1 1 1 1 1 1 1 1 1 1 1 1 1 1 1 1 1 1 1 1 
##$CPDPRG= <>
##$CPDPRG1= <>
##$CPDPRG2= <>
##$CPDPRG3= <>
##$CPDPRG4= <mlev>
##$CPDPRG5= <mlev>
##$CPDPRG6= <mlev>
##$CPDPRG7= <mlev>
##$CPDPRG8= <mlev>
##$CPDPRGB= <>
##$CPDPRGT= <>
##$D= (0..31)
0 1.2 0 0 0 0 0 0 0 0.06 0 0.03 0 0 0 0 0.0002 0 0 0 0 0 0 0 0 0 0 0 0 
0 0 0 
##$DATE= 1625027982
##$DBL= (0..7)
120 120 120 120 120 120 120 120 
##$DBP= (0..7)
150 150 150 150 150 150 150 150 
##$DBP07= 0
##$DBPNAM0= <>
##$DBPNAM1= <>
##$DBPNAM2= <>
##$DBPNAM3= <>
##$DBPNAM4= <>
##$DBPNAM5= <>
##$DBPNAM6= <>
##$DBPNAM7= <>
##$DBPOAL= (0..7)
0.5 0.5 0.5 0.5 0.5 0.5 0.5 0.5 
##$DBPOFFS= (0..7)
0 0 0 0 0 0 0 0 
##$DE= 6
##$DECBNUC= <off>
##$DECIM= 32
##$DECNUC= <off>
##$DECSTAT= 4
##$DIGMOD= 1
##$DIGTYP= 9
##$DL= (0..7)
0 120 120 120 120 120 120 120 
##$DP= (0..7)
150 150 150 150 150 150 150 150 
##$DP07= 0
##$DPNAME0= <>
##$DPNAME1= <>
##$DPNAME2= <>
##$DPNAME3= <>
##$DPNAME4= <>
##$DPNAME5= <>
##$DPNAME6= <>
##$DPNAME7= <>
##$DPOAL= (0..7)
0.5 0.5 0.5 0.5 0.5 0.5 0.5 0.5 
##$DPOFFS= (0..7)
0 0 0 0 0 0 0 0 
##$DQDMODE= 0
##$DR= 18
##$DS= 0
##$DSLIST= <SSSSSSSSSSSSSSS>
$$ [...]
##$SUBNAM2= <"">
##$SUBNAM3= <"">
##$SUBNAM4= <"">
##$SUBNAM5= <"">
##$SUBNAM6= <"">
##$SUBNAM7= <"">
##$SUBNAM8= <"">
##$SUBNAM9= <"">
##$SW= 20.0188882624521
##$SWIBOX= (0..15)
0 0 2 0 0 0 0 0 0 0 0 0 0 0 0 0 
##$SW_h= 4006.41025641026
##$TD= 16384
##$TD0= 1
##$TE= 0
##$TE2= 300
##$TE3= 300
##$TEG= 300
##$TL= (0..7)
0 120 120 120 120 120 120 120 
##$TP= (0..7)
150 150 150 150 150 150 150 150 
##$TP07= 0
##$TPNAME0= <>
##$TPNAME1= <>
##$TPNAME2= <>
##$TPNAME3= <>
##$TPNAME4= <>
##$TPNAME5= <>
##$TPNAME6= <>
##$TPNAME7= <>
##$TPOAL= (0..7)
0.5 0.5 0.5 0.5 0.5 0.5 0.5 0.5 
##$TPOFFS= (0..7)
0 0 0 0 0 0 0 0 
##$TUNHIN= 0
##$TUNHOUT= 0
##$TUNXOUT= 0
##$USERA1= <user>
##$USERA2= <user>
##$USERA3= <user>
##$USERA4= <user>
##$USERA5= <user>
##$V9= 5
##$VALIST= <valist>
##$VCLIST= <CCCCCCCCCCCCCCC>
##$VD= 0
##$VDLIST= <DDDDDDDDDDDDDDD>
##$VPLIST= <PPPPPPPPPPPPPPP>
##$VTLIST= <TTTTTTTTTTTTTTT>
##$WBST= 1024
##$WBSW= 4
##$XGAIN= (0..3)
0 0 0 0 
##$XL= 0
##$YL= 0
##$YMAX_a= 60887
##$YMIN_a= -130302
##$ZGOPTNS= <>
##$ZL1= 120
##$ZL2= 120
##$ZL3= 120
##$ZL4= 120
##$ABSF1= 10
##$ABSF2= 0
##$ABSG= 5
##$ABSL= 3
##$ALPHA= 0
##$AQORDER= 0
##$ASSFAC= 0
##$ASSFACI= 0
##$ASSFACX= 0
##$ASSWID= 0
##$AUNMP= <proc_1d>
##$AZFE= 0.1
##$AZFW= 0.1
##$BCFW= 1
##$BC_mod= 2
##$BYTORDP= 1
##$COROFFS= 0
##$CY= 11.3945322036743
##$DATMOD= 1
##$DC= 2
##$DFILT= <>
##$DTYPP= 0
##$F1P= 15.9154993809931
##$F2P= -4.1035820241983
##$FCOR= 0.5
##$FTSIZE= 0
##$FT_mod= 4
##$GAMMA= 1
##$GB= 0.15
##$INTBC= 1
##$INTSCL= 1
##$ISEN= 128
##$LB= 0.24
##$LEV0= 0
##$LPBIN= 0
##$MAXI= 10000
##$MC2= 0
##$MEAN= 0
##$ME_mod= 0
##$MI= 1.114404
##$NCOEF= 0
##$NC_proc= 0
##$NLEV= 6
##$NOISF1= 3.799351
##$NOISF2= 2.8
##$NSP= 1
##$NTH_PI= 0
##$NZP= 0
##$OFFSET= 15.70392
##$PC= 1
##$PHC0= -11924.96
##$PHC1= 23.20101
##$PH_mod= 1
##$PKNL= yes
##$PPARMOD= 0
##$PSCAL= 0
##$PSIGN= 0
##$REVERSE= no
##$SF= 200.130013532006
##$SI= 16384
##$SIGF1= 3
##$SIGF2= 2
##$SINO= 400
##$SIOLD= 16384
##$SREGLST= <1H.CDCl3>
##$SSB= 0
##$STSI= 0
##$STSR= 0
##$SW_p= 3612.71676300578
##$SYMM= 0
##$S_DEV= 0
##$TDeff= 0
##$TDoff= 0
##$TI= <>
##$TILT= no
##$TM1= 0
##$TM2= 0
##$TOPLEV= 0
##$USERP1= <user>
##$USERP2= <user>
##$USERP3= <user>
##$USERP4= <user>
##$USERP5= <user>
##$WDW= 1
##$XDIM= 8192
##$YMAX_p= 0
##$YMIN_p= 0
$$ End of Bruker specific parameters
$$ ---------------------------------
##NTUPLES= NMR FID
##VAR_NAME=  TIME,          FID/REAL,        FID/IMAG
##SYMBOL=    X,             R,               I
##VAR_TYPE=  INDEPENDENT,   DEPENDENT,       DEPENDENT
##VAR_FORM=  AFFN,          ASDF,            ASDF
##VAR_DIM=   8192,          8192,            8192
##UNITS=     SECONDS,       ARBITRARY UNITS, ARBITRARY UNITS
##FACTOR=    0.0002496,     1,               1
##FIRST=     0,             0,               0
##LAST=      2.0444736,     0,               0
##MIN=       0,             -130302,         0
##MAX=       2.0444736,     60887,           0
$$ Real data points
##PAGE= N=1
##DATA TABLE= (X++(R..R)), XYDATA
$$ plain form
0 0 0 0 0 0 0 0 0 0 0 0 0 0 0 0 -8 8 -8 8 -8 16 -16 18 -24 26 -32 40 -43 50 -58 67 -79 88 -100 114 -129 146
36 146 -162 181 -203 227 -255 281 -311 345 -382 423 -466 514 -568 625 -689 758 -836 923 -1018
55 -1018 1127 -1251 1392 -1556 1748 -1978 2260 -2612 3067 -3682 4563 -5939 8396 -14157 60887
70 60887 -24375 -95556 45932 2988 -42113 36322 44741 -40916 -13598 17257 7142 25727
82 25727 6576 -58499 -15700 31271 -2820 15488 46496 -38252 -56415 30140 18558 -27018
94 -27018 23245 10022 -52699 1920 48988 -12637 -16697 8187 -42029 -25313 54755 17493
106 17493 -36638 4517 -2663 -40891 14466 37297 -23931 -21429 8146 -14850 6853 36921
118 36921 -19910 -39223 12256 -40 -15128 35895 16402 -45445 -9152 24803 -11464 936
$$ packed form
0@%%%%%%%%%%%%%%qJ6j6J6j6K4l2L4m2N0n8P2q3R3j08J25j46J67j88K14k43K75
36A46l08L43l84M30m82N36n92O56p27Q05q89R80j082J193j314J447j594J759j941
55a018K145k378K643k948L304l726M238m872N679o749Q245j0502J4335k2553P5044
70F0887q5262p1181J41488m2944m5101P8435Q419q5657K7318L0855j0115J8585
82B5727j9151o5075M2799M6971l4091J8308L1008q4748j8163Q6555j1582m5576
94b7018N0263j3223o2721N4619M7068o1625m060K4884n0216J6716Q0068l7262
106A7493n4131M1155p180l8228N5357K2831o1228K502K9575k2996K1703L0068
118C6921n6831j9313N1479j2296j5088N1023j9493o1847L6293L3955l6267J2400
$$ plain form
130 936 24012 -22337 -23191 26712 10971 -8165 15780 -9022 -31796 17953 27121 -12952 5209
143 5209 16294 -24832 -7739 35129 3402 -17596 9863 -332 -9787 23367 15280 -16905 342
156 342 5448 -14275 12673 27693 -13642 -14410 16730 -1076 -7797 20718 3259 -22647 3932
169 3932 13843 -4588 7051 8284 -17764 -6093 14610 -2972 -2805 12583 -9836 -16304 13931
182 13931 8089 -14197 1932 3588 -15914 82 14339 -6619 -8512 3576 -9109 -7191 11725
195 11725 -669 -12631 2547 -528 -11092 5395 6675 -13164 -5635 6058 -6239 -2288 9493
208 9493 -6119 -11675 4978 1327 -6700 5216 2516 -10701 -181 7319 -3761 -1048 5164 -5161
222 -5161 -3960 7483 1379 -2973 4806 -545 -5404 6245 5580 -4724 2603 5740 -4252 443 9523
$$ packed form
130I36K3076m6349q54M9903j5741j9136K3945k4802k2774M9749R168m0073J8161
143E209J1085m1126J7093M2868l1727k0998K7459j0195r455L3154q087l2185J7247
156C42N106j9723K6948J5020m1335p68L1140j7806o721K8515j7459k5906K6579
169C932R911j8431J1639J233k6048J1671K0703j7582J67J5388k2419o468L0235
182A3931n842k2286J6129J656j9502J5996J4257k0958j893J2088j2685J918J8916
195A1725j2394j1962J5178l075j0564J6487J280j9839P529J1693j2297L951J1781
208I493j5612n556J6653l651q027J1916k700j3217J0520P500j1080K713O212j0325
222e161J201J1443o104m352P779n351m859J1649o65j0304P327L137r992M695R080
$$ plain form
237 9523 -282 -3752 5603 2407 -1834 5729 4639 -2396 2083 3682 -921 2974 4634 -2144 344
252 344 5226 -249 -623 5411 284 -3704 3148 3453 -2554 1231 2910 -2784 -857 3067 -1067 -1727
268 -1727 1634 -1230 -2529 1244 -418 -3321 216 -646 -3772 -83 755 -3483 -2061 161 -2867 -3056
284 -3056 567 -1592 -3673 -686 -1017 -2951 -1307 -838 -2591 -1850 -954 -2185 -1360 -91 -2207 -1418 113
301 113 -1219 -1898 648 -85 -2254 -153 1049 -1057 -762 1163 67 -732 887 1056 61 756 1037
318 1037 928 952 1064 728 1757 1281 654 1697 1864 826 1373 2416 1285 682 2280 2030 971 1487
336 1487 1966 1350 1166 1427 1633 1289 995 801 1486 1189 377 661 951 595 177 875 388 -342 42 540
356 540 -496 -393 -69 -257 -553 -514 -459 -841 -880 -830 -807 -899 -1365 -1424 -785 -1227 -2121 -1330 -603 -2204 -1840 -709
$$ packed form
237I523r805l470R355l196m241P563j090p035M479J599m603L895J660o778K488
252C44M882n475l74O034n127l988O852L05o007L785J679n694J927L924m134o60
268a727L361k864j299L773j662k903L537q62l126L689Q38m238J422K222l028j89
284c056L623k159k081K987l31j934J644M69j753P41Q96j231Q25J269k116P89J531
301A13j332o79K546p33k169K101J202k106K95J925j096p99J619J69r95O95K81
318A037j09K4J12l36J029m76o27J043J67j038N47J043j131o03J598k50j059N16
336A487M79o16j84K61K06l44k94j94O85k97q12K84K90l56m18O98m87p30L84M98
356E40j036J03L24j88k96L9N5l82l9N0K3r2m66n9O39m42q94P91P27j601L64J131
$$ plain form
378 -709 -1315 -2180 -1426 -717 -1648 -2091 -961 -1141 -1477 -1016 -962 -809 -951 -1104 -446 -52 -928 -1031 366 -273
398 -273 -1057 77 725 -812 -406 1222 694 -7 784 840 415 541 823 1013 1417 1011 789 1611 1808 615
418 615 1591 2108 686 835 2367 1298 179 1790 1884 568 1471 1906 680 632 1915 1103 850 1462
436 1462 726 223 981 396 348 1175 166 -1227 846 1075 -1377 -270 1099 -1200 -1758 973 -19 -1990
454 -1990 -742 -251 -1449 -947 -295 -1409 -938 -1148 -2507 -621 220 -2213 -1958 23 -1882 -2719 621
471 621 -426 -3198 -1623 127 -1649 -1246 104 -1227 -1772 -654 -463 -465 -50 -1564 -1518 965 97 -1274
489 -1274 1020 565 -2036 121 2117 -273 -530 1463 161 -675 2270 1740 162 706 807 48 2004
506 2004 2288 -83 522 1528 446 1563 3051 537 -437 1693 1135 612 2763 1578 -1652 659
$$ packed form
378g09o06q65P54P09r31m43J130j80l36M61N4J53j42j53O58L94q76j03J397o39
398b73p84J134O48j537M06J628n28p01P91N6m25J26K82J90M04m06k22Q22J97j193
418F15R76N17j422J49J532j069j119J611R4j316R03M35j226m8J283q12k53O12
436A462p36n03P58n85m8Q27j009j393K073K29k452J107J369k299n58K731r92j971
454a990J248M91j198N02O52j114M71k10j359J886Q41k433K55J981j905q37L340
471F21j047k772J575J750j776M03J350j331n45J118J91kM15j514M6K483q68j371
489a274K294m55k601K157J996k390k57J993j302q36K945n30j578N44J01p59J956
506B004K84k371O05J006j082J117J488k514r74K130n58n23K151j185l230K311
$$ plain form
522 659 2635 532 637 1983 -558 -1127 1386 1782 740 -18 -915 -908 1355 1019 -581 390 -624 -2576
540 -2576 322 2137 -699 -2380 -228 -863 -1540 815 590 -1951 -2155 -1415 -887 727 36 -2782 -1853
557 -1853 -763 -1958 -222 1270 -1946 -3367 -534 104 -946 92 -564 -3013 -1565 478 426 207
573 207 -769 -2572 -1124 1514 299 -120 187 -1506 -2064 1691 2284 -512 -185 98 -906 1273 2608
590 2608 732 -518 147 -43 1247 2740 1297 -612 287 666 903 2789 1852 -811 167 1334 1251
607 1251 2345 2564 -761 -1287 1493 1896 961 1829 180 -1642 298 2047 1562 781 -214 -1910 164
624 164 1848 374 284 -11 -2417 -1451 2123 1092 -1824 -1134 -661 -1715 344 1228 -1100 -2186 -1368
641 -1368 -1024 207 941 -1643 -2527 -1160 -1037 -1001 1275 -255 -3238 -1588 501 -838 -288 287 -2065
$$ packed form
522F59J976k103J05J346k541n69K513L96j042p58q97PK263l36j600R71j014j952
540b576K898J815k836j681K152o35o77K355k25k541k04P40N28J614o91k818R29
557a853J090j195J736J492l216j421K833O38j050J038o56k449J448K043n2k19
573B07r76j803J448K638j215m19L07j693n58L755N93k796L27K83j004K179J335
590B608j876j250O65j90J290J493j443j909Q99L79K37J886r37k663R78J167q3
607A251J094K19l325n26K780M03r35Q68j649j822J940J749m85p81r95j696K074
624A64J684j474r0k95k406R66L574j031k916O90M73j054K059Q84k328j086Q18
641a368L44J231P34k584q84J367J23L6K276j530k983J650K089j339N50N75k352
$$ plain form
658 -2065 -2483 269 468 -553 161 -1524 -2143 391 1074 -53 -60 -660 -2012 170 2393 354 -273 408
676 408 -806 -374 2652 1775 -877 -122 784 117 1796 2330 -141 -417 965 763 1127 2403 316 -652
694 -652 1353 1146 761 2303 991 -1461 451 1975 500 704 1567 -341 -878 1778 1355 -144 507
711 507 -4 -1067 795 1412 -313 -9 189 -1541 -37 1534 -501 -1522 -5 -679 -1166 577 612
728 612 -1929 -1281 -299 -1218 -286 426 -1809 -1673 -283 -797 -923 72 -883 -1958 -220 -232 -1126 -183 -41
747 -41 -1926 -881 617 -759 -936 44 -870 -986 789 429 -583 55 -20 -641 239 902 -662 -117 784
766 784 -382 283 1523 284 -505 1020 814 74 1247 964 -172 271 1091 780 745 1299 250 264 1342
785 1342 900 398 1316 747 -183 833 1273 -159 684 1105 2 26 1141 392 -7 508 396 -319 538
$$ packed form
658b065m18K752J99j021P14j685o19K534O83j127po00j352K182K223k039o27O81
676D08j214M32L026q77k652P55R06o67J679N34k471k76J382k02L64J276k087r68
694f52K005k07l85J542j312k452J912J524j475K04Q63j908n37K656m23j499O51
711E07n11j063J862O17j725L04J98j730J504J571k035j021J517o74m87J743L5
728F12k541O48R82r19R32P12k235J36J390n14j26R95r55j075J738j2q94R43J42
747d1j885J045J498j376j77R80r14j16J775l60j012O38p5o21Q80O63j564N45R01
766G84j166O65J240j239p89J525k06p40J173k83j136M43Q20l11l5N54j049J4J078
785A342m42n02R18n69r30J016M40j432Q43M21j103K4J115p49l99N15j12p15Q57
$$ plain form
804 538 504 -523 59 -11 -583 -32 32 -1048 -352 84 -609 -849 -148 -631 -1244 -552 3 -735 -668 -271 -986
825 -986 -709 -553 -908 -739 -531 -879 -853 -573 -551 -886 -536 -280 -975 -184 46 -760 -558 40 -658 -608 311
846 311 -140 -440 79 162 -518 105 361 60 334 276 493 229 632 237 343 890 472 89 624 902 303
867 303 378 948 718 420 761 529 276 634 644 478 646 518 648 548 349 533 605 412 305 345 599 158
889 158 349 401 263 -84 243 411 -62 -126 130 -74 -312 -108 -221 -225 -519 -489 -69 -70 -717 -517 -473 -654 -857
912 -857 -402 -416 -734 -618 -622 -672 -586 -642 -589 -914 -471 -615 -416 -517 -419 -578 -402 -406 -739 -422 67 -482 -300 158
936 158 -67 -89 98 121 -255 85 181 197 172 235 102 214 411 405 396 545 594 393 784 454 402 780 632 378
960 378 500 808 499 190 535 718 550 469 564 476 513 428 431 271 547 140 530 551 294 167 593 6 1 318
$$ packed form
804E38l4j027N82p0n72N51O4j080O96M36o93k40P01m83o13O92N55p38O7L97p15
825i86K77J56l55J69K08l48K6K80K2l35L50K56o95P91K30q06K02N98o98N0R19
846C11m51l00N19Q3o80O23K56l01K74n8K17k64M03l95J06N47m18l83N35K78n99
867C03P5N70k30k98L41k32k53L58J0j66J68j28J30j00j99J84P2j93j07M0K54m41
889A58J91N2j38l47L27J68m73o4K56k04k38K04j13mk94L0M20jo47K00M4j81k03
912h57M55j4l18J16mn0Q6n6N3l25M43j44J99j01R8j59J76ml33L17M89n49J82M58
936A58k25k2J87K3l76L40R6J6k5O3j33J12J97orJ49M9k01L91l30n2L78j48k54
960C78J22L08l09l09L45J83j68q1R5q8L7q5Lj60K76m07L90K1k57j27M26n87nL17
$$ plain form
984 318 327 -261 -254 -45 -105 -291 27 -456 -351 -380 -439 -403 -468 -632 -703 -96 -653 -652 -250 -396 -915 -360 -209 -972
1008 -972 -559 -131 -444 -1150 -422 -581 -649 -194 -430 -551 -287 -120 -456 -61 -101 -715 -128 358 -365 -342 297
1029 297 -100 -679 399 568 -489 149 394 -31 -36 1007 205 133 1040 269 369 749 356 -4 602 770
1049 770 129 911 1069 -179 431 1002 410 146 1058 460 -66 748 583 252 595 617 -312 510 782 -280
1069 -280 48 782 -381 -368 752 17 -674 434 85 -649 231 398 -784 -429 16 -640 -347 571 -525
1088 -525 -1230 -57 -467 -852 81 -345 -1314 -294 23 -730 -555 53 -1314 -980 160 -322 -824 271
1106 271 -159 -957 52 -67 -772 -395 -74 -679 -199 748 -344 -675 528 -564 -719 1106 469 -892
1124 -892 -87 766 -285 607 1106 -304 -432 992 161 138 1039 415 -470 864 739 86 968 540 -440
$$ packed form
984C18Rn88PK09o0j86L18m83J05k9n9L6o5j64p1O07n57JM02j46n19N55J51p63
1008i72M13M28l13p06P28j59o8M55k36j21K64J67l36L95m0o14N87M86p23K3O39
1029B97l97n79J078J69j057O38K45m25nJ043q02p2R07p71J00L80l93l60O06J68
1049G70o41P82J58j248O10N71n92k64R12n98n26Q14j65l31L43K2r29Q22K72j062
1069b80L28P34j163J3J120p35o91J108l49p34Q80J67j182L55M45o56K93R18j096
1088e25p05J173m10l85R33m26r69J020L17p53J75O08j367L34J140m82n02J095
1106B71m30p98J009j19p05L77L21o05M80R47j092l31J203j092j55J825o37j361
1124h92Q05Q53j051Q92M99j410j28J424q31k3R01o24q85J334j25o53Q82m28r80
$$ plain form
1143 -440 425 1301 39 481 1211 208 -497 1144 683 -235 529 374 -770 520 871 -431 108 414
1161 414 -398 46 955 -37 -674 279 -70 -482 411 472 -1100 -689 218 -682 -120 441 -845 -1203 161
1180 161 -437 -854 117 -646 -1474 -112 149 -786 -340 32 -933 -736 381 -551 -966 -66 -606 -986 286
1199 286 287 -1003 -357 37 -459 225 550 -419 -362 269 3 -197 741 244 -747 531 845 -132 904 843
1219 843 -522 -19 765 -150 266 1246 153 -186 1086 597 251 716 846 -337 797 1046 -98 161
1237 161 740 38 100 1106 380 -423 385 157 -381 334 702 -457 -11 384 -340 174 200 -186 -425 157
1257 157 -147 -251 267 -39 -499 -124 86 -387 -148 73 -844 -640 -33 -286 -701 -163 -433 -914 103 -171
1277 -171 -600 -316 -297 -788 -530 77 -455 -581 -91 -333 -546 361 -175 -806 -37 -246 -374 -360 214 -331 -230
$$ packed form
1143d40Q65Q76j262M42P30j003p05J641m61r18P64j55j144J290L51j302N39L06
1161D14q12M44R09r92o37R53l49m12Q93O1j572M11R07r00N62N61j286l58J364
1180A61n98m17R71p63q28J362K61r35M46L72r65J97J117r32m15R00n40l80J272
1199B86Jj290O46L94m96O84L25r69N7O31k66k00R38m97r91J278L14r77J036o1
1219H43j365N03P84r15M16R80j093l39J272m89l46M65J30j183J134K49j144K59
1237A61N79p02O2J006p26q03Q08k28n38P15L68j159M46L95p24N14K6l86k39N82
1257A57l04j04N18l06m60L75K10m73K39K21r17K04O07k53m15N38k70m81J017k74
1277a71m29K84J9m91K58O07n32j26M90k42k13R07n36o31P69k09j28J4N74n45J01
$$ plain form
1298 -230 268 -113 -73 261 66 28 374 219 150 583 535 158 353 508 261 404 666 120 200 307 575 227
1320 227 385 548 172 950 817 486 202 429 109 259 787 184 -148 483 505 113 332 60 -16 104 345
1341 345 -127 -165 -75 -41 -127 143 -110 -90 160 185 -419 -129 -153 -475 -375 -306 -519 -111 -362 -386 -452 -436 -437 -458 -216
1366 -216 -290 -283 -412 -376 -756 -370 -360 -437 -222 -95 -411 -58 -231 -211 -395 9 -32 -66 -225 50 -75 -96 92
1389 92 208 -147 89 170 85 253 91 -22 46 110 66 246 491 100 368 567 694 215 397 655 93 599
1411 599 408 352 438 602 610 290 477 158 361 335 124 285 176 163 -198 -105 87 -92 61 192 177 55 227
1434 227 42 -4 12 49 -29 -241 -58 -250 -240 -103 -256 -263 -267 -397 -184 -259 -400 -345 -243 -252 -459 -646 -232 -433
1458 -433 -314 -241 26 -434 -93 -158 -331 -219 -209 -345 -239 -449 -139 -194 -181 -83 -316 -114 -42 -289 -45 163
$$ packed form
1298b30M98l81M0L34j95l8L46j55o9M33m8l77J95J55k47J43K62n46Q0J07K68l48
1320B27J58J63l76P78j33l31k84K27l20J50N28o03l32O31K2l92K19k72p6J20K41
1341C45m72l8R0L4q6K70k53K0K50K5o04K90k4l22J00O9k13M08k51k4o6J6jk1K42
1366b16p4Pj29L6l80L86J0p7K15J27l16L53j73K0j84M04m1l4j59K75j25k1J88
1389I2J16l55K36Q1q5J68j62j13O8O4m4J80K45l91K68J99J27m79J82K58n62N06
1411E99j91n6Q6J64Ql20J87l19K03k6k11J61j09j3l61R3J92j79J53J31j5j22J72
1434B27j85m6J6L7p8k12J83j92J0J37j53pmj30K13p5j41N5J02rk07j87M14k01
1458d33J19P3K67m60L41o5j73J12J0j36J06k10L10n5J3R8k33K02P2k47K44K08
$$ plain form
1480 163 181 99 -49 122 67 151 115 311 423 48 157 318 215 138 339 153 154 210 392 101 222 171 467
1503 467 308 320 362 387 470 625 431 289 336 191 4 291 -259 -39 369 202 232 59 71 3 -44 -152 60
1526 60 -264 -265 -127 -105 21 -60 -270 -305 -431 -103 -269 -371 -463 -294 -237 -191 -186 -225 -532 -272 -201 -270 -281 -429 -370
1551 -370 8 -180 -413 -167 -173 -155 -149 -164 -206 -49 71 -164 4 39 -159 325 127 -172 85 210 -107 10 -50
1574 -50 112 116 183 283 209 294 86 -44 78 524 230 193 359 530 309 394 135 71 318 326 255 662 191 179
1598 179 267 176 264 34 182 112 110 16 22 -58 181 104 -77 -18 218 29 13 158 -229 -128 -172 -35 -258 -156 -304
1623 -304 -77 -192 2 -28 -117 -478 26 -166 -211 -258 -335 -343 80 -183 70 -332 -491 -236 89 -265 -193 91 -222
1646 -222 -382 91 -95 -298 129 -141 -233 -20 70 -9 79 256 -86 268 151 38 -155 206 66 -82 242
$$ packed form
1480A63J8q2j48J71n5Q4l6J96J12l75J09J61j03p7K01j86JN6J82k91J21n1K96
1503D67j59J2M2K5Q3J55j94j42M7j45j87K87n50K20M08j67L0j73J2o8m7j08K12
1526F0l24jJ38K2J26q1k10l5j26L28j66j02r2J69N7M6Nl9l07K60P1o9j1j48N9
1551c70L78j88k33K46oJ8Oj5m2J57J20k35J68L5j98M84j98k99K57J25l17J17o0
1574e0J62MO7J00p4Q5k08j30J22M46k94l7J66J71k21Q5k59o4K47Qp1M07m71j2
1598A79Q8r1Q8k30J48p0kr4Oq0K39p7j81N9K36j89j6J45l87J01m4J37k23J02j48
1623c04K27j15J94l0q9l61N04j92m5m7p7qM23k63K53m02j59K55L25l54P2K84l13
1646b22j60M73j86k03M27k70r2K13R0p9Q8J77l42L54j17j13j93L61j40j48L24
$$ plain form
1667 242 199 90 335 175 66 382 400 78 131 361 224 284 307 297 120 501 298 -83 379 161 -7 350
1689 350 359 179 -148 265 237 -59 319 553 -285 125 107 -90 227 349 -86 -199 421 -213 -264 229 -160 -283
1711 -283 -56 -194 -511 -95 -139 -550 -185 -206 -554 -329 8 -685 -348 -355 -122 -228 -58 -69 -598 -167 75 -513
1733 -513 -286 -216 -102 -386 201 -10 -176 175 -327 -383 197 104 -226 219 53 -289 254 212 -85 -270 296
1754 296 165 -192 390 -5 -89 358 340 49 130 420 32 125 350 3 193 171 66 169 619 353 259 183
1776 183 177 14 104 453 166 -51 300 -75 -88 389 138 8 16 0 -225 151 370 46 50 108 -82 8 40 -117
1800 -117 -151 -17 -249 -199 173 180 -402 -299 -345 -381 -583 -245 -644 -718 26 -295 -473 -290 -177 -719 -167 73
1822 73 -418 -243 -305 -374 35 -19 -262 -243 63 -210 -197 202 252 -118 -63 407 -312 72 231 -252 154 270 293
$$ packed form
1667B42m3j09K45j60j09L16J8l22N3K30j37O0K3j0j77L81k03l81M62k18j68L57
1689C50Rj80l27M13k8k96L78K34q38M10j8j97L17J22m35j13O20o34n1M93l89j23
1711b83K27j38l17M16m4m11L65k1l48K25L37o93L37pK33j06J70j1n29M31K42n88
1733e13K27P0J14k84N87k11j66L51n02n6N80r3l30M45j66l42N43m2k97j85N66
1754B96j31l57N82l95q4M47j8k91Q1K90l88R3K25l47J90k2j05J03M50k66r4p6
1776A83oj63R0L49k87k17L51l75j3M77k51j30Qj6k25L76K19l24MN8j90R0L2j57
1800a17l4J34k32N0L72Pn82J03m6l6k02L38l99p4P44l21j78J83J13n42N52K40
1822G3m91J75o2o9M09n4k43J9L06k73J3L99N0l70N5M70p19L84J59m83M06J16K3
$$ plain form
1845 293 40 45 164 129 328 326 31 47 195 59 342 402 248 -137 531 249 264 403 84 -48 471 327 82
1868 82 59 291 142 106 354 215 60 389 -93 -70 -100 -45 21 283 68 -275 -137 190 34 -220 -96 -389
1890 -389 -101 53 -4 -64 -142 -46 -580 -168 -4 -66 -240 -256 -406 -256 -40 -336 -453 -126 -170 -256 -87 -304 -345
1913 -345 -47 46 -168 -14 42 -266 -203 89 -244 -79 64 95 -183 127 33 128 -40 368 64 3 357 103
1935 103 319 99 122 122 84 205 298 145 376 43 110 337 134 160 391 245 313 236 184 316 177 67 62 275
1959 275 260 244 125 304 15 161 139 188 199 -8 -127 203 -121 -145 -12 19 150 -101 189 82 65 -274 -184
1982 -184 -210 -58 -91 -341 -80 -66 -276 -20 -397 -225 70 -249 -20 -23 -33 -93 -286 -235 -156 103 -349 197 -109
2005 -109 -131 -136 -195 -198 -80 60 -263 139 27 -241 -124 -3 70 149 -93 327 184 152 104 113 159 103 358 37 63
$$ packed form
1845B93k53NJ19l5J99kk95J6J48j36K83O0j54l85O68k82J5J39l19j32N19j44k45
1868H2k3K32j49l6K48j39j55L29m82K3l0N5O6K62k15l43J38L27j56k54J24k93
1890c89K88J54n7o0p8R6n34M12J64o2j74j6j50J50K16k96j17L27m4q6J69k17m1
1913c45K98R3k14J54N6l08O3K92l33J65J43L1k78L10r4R5j68M08l04o1L54k54
1935A03K16k20K3%l8J21R3j53K31l33O7K27k03K6K31j46O8p7n2J32j39j10nK13
1959B75j5j6j19J79k89J46k2M9J1k07j19L30l24k4J33L1J31k51K90j07j7l39R0
1982a84k6J52l3k50K61J4k10K56l77J72K95l19K29lj0o0j93N1P9K59m52N46l06
2005a09k2nn9lJ18J40l23M02j12k68J17J21P3P9k42M20j43l2m8RM6n6K55l21K6
$$ plain form
2030 63 -77 121 131 111 39 397 -44 340 237 431 3 108 -50 -17 -19 156 191 89 91 89 -70 94 108 176 200
2055 200 414 77 30 164 110 100 -63 -148 187 -196 -249 87 -134 -199 -165 270 25 -161 -20 -140 -288 -284 114
2078 114 -3 -234 -152 -2 18 -154 -116 -91 -99 -58 -284 -64 -145 -43 -4 -122 -267 -259 15 -175 -267 -165 -154 32
2102 32 -229 348 84 -240 -80 -68 115 179 223 243 -231 52 21 -98 146 159 123 262 -11 -31 243 57 181
2125 181 33 82 26 128 104 -28 125 300 145 16 115 144 -1 -53 137 265 -4 285 75 -102 139 185
2147 185 -43 -1 85 -49 -42 -33 -9 -72 292 -64 -231 -105 -124 -115 27 28 -120 -114 75 15 -12 -132 -179 -57 -144 132
2173 132 -316 12 -223 -315 -99 79 -372 -84 -161 -172 -102 1 -318 -122 -237 -316 -25 -47 -212 -33 115 -236
2195 -236 -200 74 -55 -157 -22 149 -10 132 -110 0 -15 204 167 103 -137 48 116 171 96 -40 -26 228 130
$$ packed form
2030F3j40J98J0k0p2L58m41L84j03J94m28J05j58L3kJ75L5j02Kkj59J64J4O8K4
2055B00K14l37m7J34n4j0j63q5L35l83n3L36k21o5L4M35k45j86J41j20j48ML98
2078A14j17k31Q2J50K0j72L8K5qM1k26K20q1J02L9j18j45QK74j90r2J02J1J86
2102C2k61N77k64l24J60J2J83O4M4K0m74K83l1j19K44J3l6J39k73k0K74j86J24
2125A81j48M9n6J02k4j32J53J75j55j29R9K9j45n2J90J28k69K89k10j77K41M6
2147A85k28M2Q6j34PRK4o3L64l56j67J26j9RJ42Jj48OJ89o0k7j20m7J22q7K76
2173A32m48L28k35r2K16J78m51K88p7j1P0J03l19J96j15p9K91k2j65J79J48l51
2195b36L6K74j29j02J35J71j59J42k42J10j5K19l7o4k40J85O8N5p5j36J4K54r8
$$ plain form
2218 130 28 492 138 127 408 206 -82 248 188 63 217 237 225 200 29 65 378 236 149 31 22 142 67
2241 67 -98 -105 -104 248 178 188 22 -86 143 -126 58 75 -97 -146 82 -551 161 112 108 -104 71 4 -100 -38 -196
2266 -196 -171 31 -239 -55 59 23 -145 -27 -130 -203 -33 -160 -70 -399 -37 -118 45 -79 -20 -73 153 180 206
2289 206 -60 -32 100 -105 47 -155 88 156 -60 36 168 -8 82 168 -5 241 178 153 174 -53 249 276 -189
2312 -189 68 285 37 87 -10 -64 105 191 -65 286 113 86 -25 -34 172 -6 98 152 -131 94 -37 -145 -88
2335 -88 100 124 -42 41 -211 -172 -9 144 -250 -79 19 -340 -213 -25 -174 -288 174 130 -8 1 -250 -42 -157
2358 -157 5 -108 78 -157 -61 -183 -24 177 -339 189 21 -14 32 -59 -212 39 -5 -103 267 203 -97 -52 232
2381 232 -171 86 302 411 91 227 134 179 219 164 267 -53 -89 117 155 165 -48 -142 87 -55 -140 336 98
$$ packed form
2218A30j02M64l54j1K81k02k88L30o0j25J54K0j2k5j71L6L13j42q7j18rJ20p5
2241F7j65pJL52p0J0j66j08K29k69J84J7j72m9K28o33P12m9mk12J75o7j04O2j58
2266a96K5K02k70J84J14l6j68J18j03p3J70j27R0l29L62q1J63j24N9n3K26K7K6
2289B06k66K8J32k05J52k02K43O8k16R6J32j76R0Q6j73K46o3k5K1k27L02K7m65
2312a89K57K17k48N0r7n4J69Q6k56L51j73k7j11rK06j78J04N4k83K25j31j08N7
2335h8J88K4j66Q3k52L9J63J53l94J71R8l59J27J88j49j14M62m4j38Rk51K08j15
2358a57J62j13J86k35R6j22J59K01n16N28j68l5M6r1j53K51m4r8L70o4l00M5K84
2381B32m03K57K16J09l20J36r3M5M0n5J03l20l6K06L8J0k13r4K29j42q5M76k38
$$ plain form
2404 98 -40 101 143 290 61 156 71 27 246 204 40 82 84 122 87 104 -66 134 -143 -132 31 -112 -44 -125 -66
2429 -66 -88 -136 -193 -35 -109 11 -292 173 151 -256 -143 -176 121 -46 38 -166 -184 62 32 -233 -235 -113 -330 29
2453 29 -117 -15 -212 -17 -175 -59 -94 96 58 -121 -48 -105 -59 -274 4 115 36 78 -4 323 -101 -326 70
2476 70 -15 225 392 146 -78 225 -93 42 28 40 -23 291 -14 162 114 208 30 50 152 196 409 129 91
2499 91 296 -179 -26 -130 -198 133 115 254 88 -79 136 12 1 169 213 80 99 50 -129 -157 62 -282 27
2522 27 51 -220 -243 -135 76 -143 -6 126 -223 -223 -70 -38 95 -194 -168 -46 -131 -195 -46 -86 -74 -98 -181 -115 -103
2547 -103 -41 -275 34 22 33 -74 -48 20 289 -90 -161 -180 15 -33 -132 33 332 117 75 129 71 -132 24 83
2571 83 154 86 89 62 -30 -121 251 74 253 70 252 192 171 297 211 49 -9 10 337 122 -96 169 88 97 54 299
$$ packed form
2404I8j38J41M2J47k29R5q5m4K19m2j64M2KL8l5J7j70K00k77J1J63j43O8q1N9
2429f6k2m8n7J58p4J20l03M65k2m07J13l3K97j67Q4k04j8K46l0k65kJ22k17L59
2453B9j46J02j97J95j58J16l5J90l8j79P3n7M6k15K78J11p9M2q2L27m24k25L96
2476G0q5K40J67k46k24L03l18J35j4J2o3L14l05J76m8R4j78K0J02M4K13k80l8
2499I1K05m75J53j04o8L31j8J39j66j67K15j24j1J68M4j33J9m9j79k8K19l44L09
2522B7K4k71k3J08K11k19J37J32l49%J53L2J33k89K6J22q5o4J49m0J2k4q3O6J2
2547a03O2k34L09j2J1j07K6O8K69l79p1j9J95m8r9J65K99k15m2N4n8k03J56N9
2571H3P1o8Lk7r2r1L72j77J79j83J82o0k1J26q6j62n8J9L27k15k18K65q1Rm3K45
$$ plain form
2597 299 48 -224 212 51 21 202 -40 15 -125 66 49 -225 -188 -83 -209 -294 93 -28 -277 95 32 -127
2619 -127 -191 -257 -288 4 80 -125 -148 -46 -234 -329 -120 -282 -73 -6 -77 -132 -178 -37 -330 -145 -216 -134 113 -219
2643 -219 -188 -12 -230 38 9 141 -249 190 -271 -213 49 -193 -59 -56 185 208 30 -33 293 188 114 -9 -143
2666 -143 -9 303 272 -25 99 120 264 232 -46 176 245 345 357 216 84 306 142 -101 3 193 143 1
2688 1 175 137 19 -58 375 84 59 -45 -123 267 15 20 62 -206 177 -30 101 -326 -13 -177 -197 -38 -38 -119
2712 -119 -303 -13 -186 -95 -140 -60 -345 -256 -293 -114 -24 -28 -289 -186 -43 -209 71 -50 -84 -190 -140 -337 159
2735 159 -90 91 -75 -24 154 -97 51 14 -43 14 -69 184 -189 -9 -77 -57 54 -21 39 282 6 -121 -119 7
2759 7 -57 108 173 18 258 51 114 -100 361 -2 67 82 209 138 15 92 18 -64 131 92 -71 278 61 196
$$ packed form
2597B99k51k72M36j61l0J81k42N5j40J91j7k74L7J05j26q5L87j21k49L72o3j59
2619a27o4o6l1K92P6k05k3J02j88r5K09j62K09O7p1n5m6J41k93J85p1Q2K47l32
2643b19L1J76k18K68k9J32l90M39m61N8K62k42J34LK41K3j78o3L26j05p4j23j34
2666a43J34L12l1k97J24K1J44l2k78K22O9J00J2j41j32K22j64k43J04J90n0j42
2688AJ74l8j18p7M33k91k5j04p8L90k52NM2k68L83k07J31m27L13j64k0J59%q1
2712a19j84K90j73R1m5Q0k85Q9l7J79R0mk61J03J43j66K80j21l4j06N0j97M96
2735A59k49J81j66N1J78k51J48l7n7N7q3K53l73J80o8K0J11p5O0K43k76j27KJ26
2759Go4J65O5j55K40k07O3k14M61l63O9J5J27p1j23P7p4q2J95l9j63L49k17J35
$$ plain form
2783 196 -210 154 37 -211 -31 -55 249 -21 -122 -130 33 6 -10 -162 10 -59 -56 -211 -228 -130 -153 -147 -137 -139 147
2808 147 -193 -187 -109 -117 17 50 -292 -322 -28 -322 -178 -79 30 -249 -97 182 -176 -83 -96 -11 128 42 -69 -74 19
2833 19 117 67 70 157 -105 242 43 -129 47 -177 84 83 -395 -94 -54 144 122 23 204 99 -178 -124 65 99
2857 99 325 -18 24 155 105 288 -82 -143 140 239 42 135 27 149 -140 52 42 49 -155 265 158 58 -127
2880 -127 -157 148 -205 218 15 44 -91 -185 19 59 -94 31 61 -186 -40 40 -113 9 -53 -149 -231 -170 -139 118
2904 118 -245 -94 89 -63 193 -118 51 100 20 -210 -55 36 58 88 -208 -23 -176 182 161 -1 -5 12 185
2927 185 -11 -164 67 -32 234 8 25 114 -44 259 230 294 -146 129 -68 152 51 175 5 4 69 97 39
2950 39 -103 -7 194 46 174 -70 -275 73 16 -156 -147 -197 -42 3 141 148 -20 39 -223 -109 -54 -89 -134 -93 217
$$ packed form
2783A96m06L64j17k48J80k4L04k70j01qJ63k7j6j52J72o9Lj55j7R8k3OJ0kK86
2808A47l40OP8qJ34L3l42l0K94k94J44R9J09k79J52K79l58R3j3Q5J39q6j11nR3
2833A9R8n0LQ7k62L47j99j72J76k24K61jm78L01M0J98k2r9J81j05k77N4J89L4
2857I9K26l43M2J31n0J83l70o1K83R9j97R3j08J22k89J92j0Pk04M20j07j00j85
2880a27l0L05l53M23k03K9j35r4K04M0j53J25L0k47J46Q0j53J22o2r6q2O1L1K57
2904A18l63J51J83j52K56l11J69M9q0k30J55R1K2L0k96J85j53L58k1j62mJ7J73
2927A85j96j53K31r9K66k26J7Q9j58L03k9O4m40K75j97K20j01J24j70jO5K8n8
2950C9j42R6K01j48J28k44k05L48n7j72Rn0J55M5J38Pj68N9k62J14N5l5m5M1L10
$$ plain form
2975 217 -271 71 -99 -8 -11 120 251 144 15 -173 27 -26 -223 -143 149 64 -455 -69 186 16 -70 -28 -172
2998 -172 102 -105 16 41 46 61 -170 -214 110 80 -31 -131 -86 90 76 -111 107 -203 0 61 5 -125 -75 -74
3022 -74 -36 71 156 103 268 341 54 77 80 138 94 109 36 -14 -79 241 375 40 103 111 -2 -33 1 75 -90 131 -65
3049 -65 -32 256 170 6 199 -144 -34 -258 111 196 29 76 -63 -32 152 -79 208 -210 -373 -51 -109 -16 -191
3072 -191 -162 -233 -218 -193 85 -159 -25 44 -215 48 -58 -51 -191 -212 -127 -159 148 -122 -220 -85 102 -22 -51 72
3096 72 -50 -126 -51 -139 -69 -203 143 -108 7 -53 9 -181 6 5 76 106 -31 77 -111 239 94 -18 335 218
3120 218 121 -30 63 156 241 130 182 302 89 -112 -109 158 -135 476 143 25 -238 -26 -244 -38 -173 -172 35
3143 35 305 408 361 -11 -7 41 -59 -21 -134 -222 27 -23 122 -210 69 30 -184 -23 -197 29 -243 -142 -131
$$ packed form
2975B17m88L42j70R1lJ31J31j07j29j88K00n3j97Q0K92q5n19L86K55j70q6M2j44
2998a72K74k07J21K5NJ5k31m4L24l0j11j00M5J76j4j87K18l10K03O1n6j30N0J
3022g4L8J07Q5n3J65P3k87K3LN8m4J5p3n0o5L20J34l35O3Qj13l1L4P4j65K21j96
3049f5L3K88q6j64J93l43J10k24L69Q5j67M7j39L1J84k31K87m18j63L22n8R3j75
3072a91K9p1J5K5K78k44J34O9k59K63j06Pj40k1Q5l2L07k70r8J35J87j24k9J23
3096G2j22p6P5q8P0j34L46k51J15o0O2j90J87jP1L0j37J08j88L50j45j12L53j17
3120B18r7j51R3R3Q5j11N2J20k13k01LK67k93O11l33j18k63K12k18K06j35JK07
3143C5K70J03m7l72MM8j00L8j13q8K49n0J45l32K79l9k14J61j74K26k72J01J1
$$ plain form
3166 -131 -92 -102 -13 -198 -68 -277 -6 -98 -123 -22 262 -86 -191 43 45 -430 -62 -85 -268 -7 -49 -66 23 4
3190 4 -102 -171 276 146 37 35 -1 73 -114 125 220 138 -53 89 -151 -119 -100 197 223 56 -152 -87 266 117
3214 117 348 182 322 89 65 12 -33 93 317 7 -55 308 9 92 -170 98 197 284 49 -180 145 -167
3236 -167 -72 -71 -17 -212 83 -87 -47 -90 -139 -32 29 -114 -56 143 22 -140 -89 -194 228 -26 78 -341 -227
3259 -227 -75 -273 59 294 96 -376 -116 -30 -61 -267 32 43 -105 49 -139 -360 21 -221 -43 116 30
3280 30 81 -26 160 -240 -27 86 223 -41 -11 -201 -20 251 -22 -52 93 347 167 274 -24 199 219 5
3302 5 203 121 135 -42 60 -141 169 -35 -17 72 170 214 -21 67 149 -138 -57 -75 -157 -11 -57 158 -137 -58 -61 -67
3328 -67 -187 -26 59 -129 109 -73 89 -264 56 -97 -14 17 -258 -214 60 12 -107 -135 -106 2 -222 127 -160
$$ packed form
3166a31L9j0Q9j85J30k09K71r2k5J01K84l48j05K34Km75L68k3j83K61m2j7Q9j9
3190Dj06o9M47j30j09kl6P4j87K39R5q2j91J42k40L2J9K97K6j67k08O5L53j49
3214A17K31j66J40k33k4n3m5J26K24l10o2L63k99Q3k62K68R9Q7k35k29L25l12
3236a67R5JN4j95K95j70M0m3m9J07O1j43N8J99j21j62N1j05M22k54J04m19J14
3259b27J52j98L32K35j98m72K60Q6l1k06K99J1j48J54j88k21L81k42J78J59q6
3280C0N1j07J86m00K13J13J37k64L0j90J81K71k73l0J45K54j80J07k98K23K0k14
3302EJ98q2J4j77J02k01L10k04J8Q9R8M4k35Q8Q2k87Q1j8q2J46m6K15k95P9lo
3328f7j20J61Q5j88K38j82J62l53L20j53Q3L1k75M4K74m8j19k8K9J08k24L49k87
$$ plain form
3351 -160 -202 -19 18 -159 -36 -346 7 109 -28 -80 -204 66 -122 -99 -54 47 -209 -205 90 -273 20 85 32
3374 32 16 -118 211 -51 -81 -157 50 -51 40 194 119 48 -134 172 104 107 52 167 -5 102 233 23 514 -155
3398 -155 103 131 -10 272 40 -5 -34 96 105 56 -59 180 159 130 -58 -36 -38 18 63 57 -8 176 -7 -175 -199 -138
3424 -138 -152 -94 -63 -218 -12 221 -16 -22 87 81 4 241 -126 -214 47 -108 73 -13 36 -47 -246 -123 -200 21
3448 21 47 -24 -282 -136 118 -245 43 -48 162 -63 -55 158 -216 -25 147 98 -225 64 -19 139 -45 49 -55
3471 -55 -109 -163 268 -55 131 272 70 85 134 20 71 184 -190 272 165 405 -76 -3 -66 278 -109 -126 137
3494 137 -4 205 106 -42 -82 66 114 152 -49 183 38 -32 41 -202 218 -19 -232 159 111 -80 22 -18 -111
3517 -111 -17 -67 36 -173 -63 52 -225 109 150 -306 -17 -25 -125 121 -171 114 -122 52 -22 -89 -118 -157 -95
$$ packed form
3351a60m2J83L7j77J23l10L53J02j37n2j24K70j88K3M5J01k56MK95l63K93O5n3
3374C2j6j34L29k62l0p6K07j01R1J54p5p1j82L06o8Ln5J15j72J07J31k10M91o69
3398a55K58K8j41K82k32m5k9J30Rm9j15K39k1k9j88K2kN6M5oo5J84j83j68k4O1
3424a38j4N8L1j55K06K33k37oJ09op7K37l67q8K61j55J81q6M9q3j99J23p7K21
3448B1K6p1k58J46K54l63K88r1K10k25QK13l74J91J72m9l23K89q3J58j84R4j04
3471e5n4n4M31l23J86J41k02J5M9j14N1J13l74M62j07K40m81P3o3L44l87j7K63
3494A37j41K09r9j48m0J48M8L8k01K32j45p0P3k43M20k37k13L91m8j91J02m0r3
3517a11R4n0J03k09J10J15k77L34M1m56K89qj00K46k92K85k36J74p4o7k9l9O2
$$ plain form
3540 -95 -432 -35 95 -14 -7 -59 -82 -25 -147 -176 132 126 111 4 137 -90 -8 20 -147 144 219 -109 -255 85
3564 85 -276 114 221 -112 -56 -79 61 31 95 -41 -65 247 82 55 56 274 -10 246 303 -9 -15 38 -36 -56 173
3589 173 148 -85 97 315 98 -186 -98 124 -154 -99 -145 -8 -70 12 179 -123 -159 24 282 145 86 -142 -55
3612 -55 -168 97 -207 75 -109 70 88 81 26 -79 -87 -44 -114 -87 -175 -169 -136 332 37 -17 4 79 -168 141 110 -65
3638 -65 -267 147 54 39 -155 -40 158 161 87 -316 -108 -84 27 118 130 2 138 -54 8 -122 170 69 99 -46
3662 -46 270 151 45 -56 66 60 513 -7 89 28 379 -55 57 2 54 40 -115 97 -100 66 46 -97 254
3685 254 133 -144 -72 -26 170 55 106 -135 40 61 163 -80 -150 -26 -29 -97 -13 36 -35 91 -86 -71 -123 -170 25
3710 25 -34 -121 43 68 -126 -95 -61 107 -177 -11 -310 -148 211 98 92 -92 -239 160 -153 216 -43 -192 14
$$ packed form
3540i5l37L97J30j09Pn2k3N7j22k9L08oj5j07J33k27Q2K8j67K91P5l28j46L40
3564H5l61L90J07l33N6k3J40l0O4j36k4L12j65k7JK18k84K56N7l12oN3p4k0K29
3589A73k5k33J82K18k17k84Q8K22k78N5m6J37o2Q2J67l02l6J83K58j37n9k28Q7
3612e5j13K65l04K82j84J79J8pn5j05qM3p0K7q8OL3M68k95n4K1P5k47L09l1j75
3638f5k02M14r3j5j94J15J98Lp4m03K08K4J11R1J2j28J36j92O2j30K92j01L0j45
3662d6L16j19j06j01J22oM53n20R6o1L51m34J12n5N2j4j55K12j97J66k0j43L51
3685B54j21k77P2M6J96j15N1k41J75K1J02k43p0J24lo8Q4M9p1J26j77J5n2m7J95
3710B5n9q7J64K5j94L1L4J68k84J66k99J62L59j13oj84j47L99l13L69k59j49K06
$$ plain form
3733 14 -88 189 -82 109 -212 -147 -257 156 72 191 190 -97 -69 -252 183 -65 213 38 49 -42 111 227 53
3756 53 -28 196 199 14 -26 -141 -108 257 67 -172 253 28 192 -72 51 252 -60 -64 322 -33 152 120 -135
3779 -135 -148 -26 174 18 -100 -165 -183 -160 -75 87 56 -11 167 10 21 144 -259 260 -230 -56 -7 63 -97
3802 -97 -106 -155 62 -64 -87 -12 134 -18 191 343 -46 -260 125 -25 -59 -440 -6 -119 -74 -204 99 231 -65
3825 -65 -81 55 -33 -17 -23 -188 -51 -143 58 62 18 -120 65 128 -6 297 157 -13 198 79 161 -119 141 -123
3849 -123 -30 -17 -14 -35 -233 -24 -17 89 63 229 65 105 198 117 6 162 -120 -286 -105 87 -9 -56 -22 70 -235
3874 -235 -228 -63 -121 -109 -38 -197 -39 94 -243 127 132 -132 -158 -243 -164 -104 47 -341 -121 -88 0 -47 -243 -110 -169
3899 -169 52 -282 -93 112 113 49 22 -219 40 -275 -291 194 -144 115 252 75 -111 -123 -127 35 -35 -82 -47 -8
$$ packed form
3733A4j02K77k71J91l21O5j10M13q4J19jk87K8j83M35k48K78j75J1r1J53J16j74
3756E3q1K24Lj85m0j15L3L65j90k39M25k25J64k64J23K01l12mL86l55J85l2k55
3779a35j3J22K00j56j18o5j8K3Q5J62l1o7J78j57J1J23m03N19m90J74M9P0j60
3802i7rm9K17j26k3P5J46j52K09J52l89k14L85j50l4l81M34j13M5j30L03J32k96
3825f5j6J36q8J6oj65J37r2K01Mm4j38J85O3j34L03j40j70K11j19Q2k80K60k64
3849a23R3J3Lk1j98K09PJ06k6J66j64M0R3q1j11J56k82j66J81J92r6m7L4R2l05
3874b35PJ65n8J2P1j59J58J33l37L70Nk64k6q5P9O0J51l88K20L3Q8m7j96J33n9
3899a69K21l34J89K05Jo4k7k41K59l15j6M85l38K59J37j77j86j2mJ62p0m7L5L9
$$ plain form
3923 -8 -196 -321 142 24 228 -113 -88 87 145 -97 73 23 -27 87 -26 95 290 124 54 374 249 74
3945 74 203 28 -330 42 -158 0 105 76 -87 253 198 -252 19 152 -56 -49 3 7 3 -17 -96 -104 -44 -183 229
3970 229 -487 -76 -37 -98 -27 7 -188 -198 -64 -228 -99 -34 108 57 131 -169 86 -56 -124 -189 287 95 -163
3993 -163 -244 -199 -113 -25 255 15 106 133 -259 -57 86 94 -430 -41 25 117 -66 78 102 -198 69 119 15 79
4017 79 27 163 136 10 63 187 22 -71 12 260 283 -54 -91 217 331 307 151 -172 409 -27 162 -2 30
4040 30 77 -70 155 44 14 248 -157 162 -91 -47 75 60 -54 158 -373 -224 86 -243 -14 49 8 -231
4062 -231 -173 -185 -8 -222 -146 77 -475 -134 -37 11 93 2 -58 -61 -83 -218 37 -103 60 -115 -60 -177 243 91
4086 91 -15 -333 149 101 125 35 -161 68 172 176 7 204 0 12 -222 138 100 316 46 -8 282 43 76
$$ packed form
3923hj88j25M63j18K04l41K5J75N8k42J70n0n0J14j13J21J95j66p0L20j25j75
3945G4J29j75l58L72k00J58J05k9j63L40n5m50K71J33k08PN2Mmk0p9qO0j39M12
3970B29p16M11L9o1P1L4j95j0J34j64J29O5J42n1P4l00K55j42o8o5M76j92k58
3993a63q1M5Q6Q8K80k40R1K7l92K02J43Qn24L89O6R2j83J44K4l00K67N0j04O4
4017G9n2J36k7j26N3J24j65r3Q3K48K3l37l7L08J14k4j56l23N81m36J89j64L2
4040C0M7j47K25j11l0K34m05L19k53M4J22j5j14K12n31J49L10l29K29O3m1k39
4062b31N8j2J77k14P6K23n52L41R7M8Q2r1o0lk2j35K55j40J63j75N5j17M20j52
4086I1j06l18M82m8K4r0j96K29J04Mj69J97k04J2k34L60l8K16k70n4K90k39L3
$$ plain form
4109 76 -146 -18 85 136 227 -101 45 41 75 350 139 -25 320 8 11 15 -215 47 162 213 245 297 48 -43 37
4134 37 -66 229 188 77 20 -88 -191 129 -271 -7 -52 -66 85 -97 -141 -47 61 138 -338 -432 -37 -237 -167
4157 -167 -346 -238 -150 -244 -188 36 -99 -95 27 -101 -96 -309 -237 -32 -324 -48 -294 144 22 159 -15 -36 285
4180 285 -108 19 -246 -130 -214 -64 367 -34 -149 133 200 81 12 198 51 98 212 195 -25 208 8 -266
4202 -266 190 252 177 -3 90 -1 -26 106 -62 43 7 140 -54 246 -154 72 111 -26 -80 38 -78 12 -47
4225 -47 -3 325 -29 -114 -190 -103 153 -90 -250 -206 -45 -101 111 -47 -112 -114 16 -88 111 107 51 -225 2 113
4249 113 -42 -31 31 -33 -101 81 -275 -8 5 70 10 -221 56 18 247 -153 -140 140 -239 -40 -42 -83 174 -8
4273 -8 93 108 -45 162 386 -80 -258 148 165 -99 283 -35 388 329 11 105 22 8 -9 165 -159 19 342
$$ packed form
4109G6k22J28J03N1R1l28J46mL4K75k11j64L45l12LMk30K62J15N1L2N2k49r1Q0
4134C7j03K95m1j11n7j08j03L20m00K64m5j4J51j82m4R4J08P7m76r4L95k00P0
4157a67j79J08Q8r4N6K24j35MJ22j28Nk13P2K05k92K76k46M38j22J37j74k1L21
4180B85l93J27k65J16q4J50M31m01j15K82O7j19o9J86j47M7J14j7k20K33k00k74
4202b66M56O2p5j80R3r1k5J32j68J05l6J33j94L00m00K26L9j37n4J18j16R0n9
4225d7M4L28l54q5p6Q7K56k43j60M4J61n6K12j58o5kJ30j04J99mn6k76K27J11
4249A13j55J1O2o4o8J82l56K67J3O5o0k31K77l8K29m00J3K80l79J99km1K57j82
4273hJ01J5j53K07K24m66j78M06J7k64L82l18M23n9l18R4q3j4j7J74l24J78L23
$$ plain form
4296 342 38 325 262 -56 -73 -70 195 290 -67 22 -12 -53 60 132 66 131 25 -103 -361 81 -35 59 -144 109
4320 109 -132 -130 0 -146 -198 74 65 -74 -9 -15 7 -144 -26 -88 -26 -260 57 233 -354 -385 83 -152 181 -123
4344 -123 133 -62 -348 87 -131 35 -49 114 -40 -150 -160 38 -39 101 74 28 -23 -4 22 7 -113 -126 84
4367 84 -14 24 139 -181 138 -27 -41 -133 344 146 433 281 42 -117 194 117 79 60 194 54 23 380 45
4390 45 114 -28 -27 69 -92 63 -28 106 286 312 -108 -95 -171 191 47 367 178 63 176 -146 -71 -139 -188 -135
4414 -135 85 -21 -314 52 -299 -88 -60 -83 -122 218 21 -5 -252 -208 -49 -205 85 -37 -59 -21 122 -361
4436 -361 -5 -233 -242 56 105 55 -121 -265 -94 -70 -94 84 -360 188 40 -121 -198 -63 144 -128 -13 -26 278
4459 278 17 -74 -147 90 74 -22 -47 136 235 222 238 231 128 142 118 68 -151 -230 100 8 -114 -32 94 303 -5
$$ packed form
4296C42l04K87o3l18j7LK65R5l57Q9l4m1J13P2o6O5j06j28k58M42j16R4k03K53
4320A09k41KJ30j46n2K72rj39O5oK2j51J18o2O2k34L17J76n87l1M68k35L33l04
4344a23K56j95k86M35k18J66q4J63j54j10j0J98p7J40k7m6n1J9K6j5j20j3K10
4367H4r8L8J15l20L19j65j4r2M77j98K87j52k39j59L11p7l8j9J34j40l1L57l35
4390D5O9j42JR6j61J55r1J34J80K6m20J3p6L62j44L20j89j15J13l22P5o8m9N3
4414a35K20j06k93L66l51K11K8k3l9L40j97k6k47M4J59j56K90j22k2L8J43m83
4436c61L56k28rK98M9n0j76j44J71K4k4J78m44N48j48j61p7J35K07k72J15j3L04
4459B78k61r1p3K37j6r6k5J83R9j3J6pj03J4k4n0k19p9L30r2j22Q2J26K09l08
$$ plain form
4484 -5 207 145 96 82 -57 219 55 164 54 63 -24 142 110 131 -52 -43 338 -225 30 -136 22 128 -135 262
4508 262 130 -1 -239 -118 37 103 -151 -194 -60 -71 -9 -427 200 211 -20 -220 -80 -146 -185 96 78 -224 -285
4531 -285 -93 -9 -230 57 155 93 -144 -119 42 133 -253 51 129 -88 22 -175 -204 -9 -14 91 290 -46 68
4554 68 203 -53 62 173 -103 225 84 -27 31 -98 121 328 214 -131 18 68 -111 85 -253 26 198
4575 198 58 -142 125 -218 50 -168 286 175 -118 85 27 223 -22 -166 -322 31 -271 -295 -137 -92 -117
4596 -117 -266 29 -27 -17 -166 58 -236 -36 -120 -130 229 -130 -18 -97 -21 20 -12 -3 -126 -214 -136 21 -69 -132 -113
4621 -113 -31 -132 -22 -34 247 24 -69 -17 -328 54 -10 -53 -48 111 85 12 149 150 -19 -104 25 142 -131 120
4645 120 23 167 137 246 118 21 -148 159 108 -140 -78 558 -60 -27 11 131 119 233 -77 158 -85 115 -65
$$ packed form
4484eK12o2m9j4j39K76j64J09j10Rq7J66l2K1j83RL81n63K55j66J58J06k63L97
4508B62j32j31k38J21J55O6k54m3J34j1O2m18O27J1k31k00J40o6l9K81j8l02o1
4531b85J92Q4k21K87R8o2k37K5J61R1l86L04P8k17J10j97k9J95nJ05J99l36J14
4554F8J35k56J15J11k76L28j41j11N8j29K19K07j14l45J49N0j79J96l38K79J72
4575A98j40k00K67l43K68k18M54j11k93K03n8J96k45j44j56L53l02k4J58M5k5
4596a17j49K95n6J0j49K24k94K00q4j0L59l59J12p9P6M1l2Rj23q8P8J57r0o3J9
4621a13Q2j01J10j2K81k23r3N2l11L82o4m3NJ59k6p3J37Jj69q5J29J17k73K51
4645A20r7J44l0J09j28r7j69L07n1k48O2O36o18L3L8J20j2J14l10K35k43K00j80
$$ plain form
4668 -65 429 280 -40 116 -29 266 -251 163 -187 4 -167 -15 302 19 -56 -226 29 76 95 -27 -86 -53
4690 -53 167 30 -264 37 153 -64 -267 -250 173 73 30 -94 -85 -98 96 42 -76 11 10 69 14 -33 178 131 -18
4715 -18 -107 -84 122 169 71 -223 171 -48 -109 16 59 -30 -41 -198 -12 69 34 120 61 113 -25 -162 53 10 34
4740 34 191 55 -135 -4 250 93 242 128 -17 -16 92 58 20 -198 53 108 45 183 267 184 -26 96 52
4763 52 30 126 223 -19 64 102 50 16 24 -143 -48 -193 164 -197 161 72 -22 82 -300 6 -120 -141 -25 160 -19
4788 -19 210 -292 133 -92 46 -77 130 -312 109 13 -298 -147 -218 -233 222 -1 -147 -35 -191 186 -82
4809 -82 181 206 -97 -394 24 -15 -93 25 108 -78 269 96 182 -42 -34 -82 229 27 236 0 41 25 143 105
4833 105 -37 -119 291 219 67 41 -10 -167 -81 44 -93 -88 139 334 87 -8 -51 -66 15 -69 94 75 -76 -296
$$ packed form
4668f5M94j49l20J56j45K95n17M14l50J91j71J52L17k83p5j70K55M7J9j22n9L3
4690e3K20j37k94L01J16k17k03J7M23j00m3j24Rj3J94n4j18Q7jN9n5m7K11m7j49
4715a8q9K3K06M7r8k94L94k19o1J25M3q9j1j57J86Q1l5Q6n9N2j38j37K15m3K4
4740C4J57j36j90J31K54j57J49j14j45JJ08l4l8k18K51N5o3J38Q4q3k10J22m4
4763E2k2R6R7k42Q3L8n2l4Qj67R5j45L57l61L58q9r4J04l82L06j26k1J16J85j79
4788a9K29n02M25k25J38j23K07m42M21r6l11J51p1j5M55k23j46J12j56L77k68
4809h2K63K5l03k97M18l9p8J18Q3j86L47j73Q6k24Qm8L11k02K09k36M1j6J18l8
4833A05j42q2M10p2j52k6n1j57Q6J25j37NK27J95k47r5m3j5Q1q4J63j9j51k20
$$ plain form
4857 -296 -45 -97 168 -73 -40 -239 43 -245 -28 84 4 94 -24 -34 -67 -190 -355 15 68 -175 51 -183
4879 -183 -190 -74 137 -132 121 -125 -227 -36 183 -89 -256 -72 -32 336 45 171 47 285 -16 84 -122
4900 -122 85 -254 -154 42 -39 -157 116 87 87 85 113 -123 -70 67 -53 102 173 -350 86 7 -29 220 17 476
4924 476 155 44 -155 -14 390 -210 35 110 -85 -12 64 -81 86 -92 -24 -246 151 -75 -94 -86 -203 175
4946 175 193 -26 51 146 -174 108 -2 -130 -70 -86 36 245 -141 202 -318 -19 -161 -6 44 -163 -110 -90 -18
4969 -18 28 -79 -208 172 103 -19 -100 137 -2 154 -132 -26 -111 21 112 57 142 118 48 28 -6 265 20 -287
4993 -287 -24 -24 147 -43 138 -123 90 51 -108 253 -146 -43 -131 207 131 111 129 -104 -42 100 76 -335 -32
5016 -32 391 95 -299 -72 23 361 -124 -9 58 178 33 7 268 54 -68 10 -5 131 -94 -69 -113 -209 10
$$ packed form
4857b96K51n2K65k41L3j99K82k88K17J12q0R0j18j0l3j23j65L70N3k43K26k34
4879a83pJ16K11k69K53k46j02J91K19k72j67J84M0L68k91J26j24K38l01J00k06
4900a22K07l39J00J96q1j18K73k9%kK8k36N3J37j20J55P1n23M36p9l6K49k03M59
4924D76l21j11j99J41M04o00K45P5j95P3P6j45J67j78O8k22L97k26j9Qj17L78
4946A75J8k19P7R5l20K82j10j28O0j6J22K09l86L43n20K99j42J55N0k07N3K0P2
4969a8M6j07j29L80o9j22q1K37j39J56k86J06q5J32R1n5Q5k4p0k0l4K71k45l07
4993b87K63%J71j90J81k61K13l9j59L61l99J03q8L38p6k0J8k33O2J42k4m11L03
5016c2M23k96l94K27R5L38m85J15O7J20j45k6K61k14j22P8j5J36k25K5m4r6K19
$$ plain form
5039 10 57 -43 64 40 -174 57 102 106 -9 -29 -15 169 -198 -65 -129 -313 -33 -196 273 74 -9 -163 123
5062 123 317 66 61 -174 -206 -31 -263 -189 -189 -48 -188 -110 -130 289 -137 61 -31 -196 33 276 -54 172 51
5085 51 60 89 37 12 -59 63 132 -190 127 17 38 72 301 -48 -68 403 -47 74 252 -78 -209 -6 -356 42
5109 42 287 105 71 -41 -207 -2 91 -173 190 134 218 -128 -92 233 150 136 26 27 32 -60 18 -306 -54 106 100
5134 100 -128 -172 -261 32 -62 112 -121 71 -386 -9 128 -167 3 -153 -23 30 -77 6 17 -239 -13 90
5156 90 -155 277 14 -67 32 -120 175 -284 29 -95 175 140 -58 7 17 115 89 224 22 12 -62 -177 -64
5179 -64 -96 -41 -4 10 -284 35 -5 142 -1 -198 134 -234 93 104 7 63 155 89 -57 -93 11 96 182 260 -89
5204 -89 65 -160 117 -72 -75 72 204 -39 -305 -105 234 28 78 250 177 103 -32 7 -130 -223 -259 51 -5
$$ packed form
5039A0M7j00J07k4k14K31M5Mj15k0J4J84l67J33o4j84K80j63M69j99q3j54K86
5062A23J94k51nk35l2J75k32P4%J41j40P8k0M19m26J98r2j65K29K43l30K26j21
5085E1RK9n2k5p1J22O9l22L17j10K1L4K29l49k0M71m50J21J78l30j31K03l50L98
5109D2K45j82l4j12j66K05R3k64L63n6Q4l46L6L25q3j4j10JNr2P8l24K52J60o
5134A00k28m4q9K93r4J74k33J92m57L77J37k95J70j56J30N3j07Q3J1k56K26J03
5156I0k45M32k63q1R9j52K95m59L13j24K70l5j98O5J0R8k6J35k02j0p4j15J13
5179f4l2N5L7J4k94L19m0J47j43j97L32l68L27J1r7N6R2o6j46l6J04Q5Q6P8l49
5204h9J54k25K77j89lJ47J32k43k66K00L39k06N0J72p3p4j35L9j37r3l6L10n6
$$ plain form
5227 -5 -159 -115 -121 197 -64 27 -73 -216 83 221 -24 38 -167 -292 131 -130 -128 212 -10 -66 -3 -247 -229 50
5251 50 261 -23 163 36 79 226 14 -218 71 -33 58 -57 131 174 96 6 85 23 -101 139 39 266 -40
5274 -40 180 235 -175 -114 270 -42 92 -123 256 84 102 202 -360 -2 217 -20 101 -180 -147 4 -127 -84
5296 -84 -268 -52 -160 -114 131 74 -61 -125 96 45 -11 42 -44 -159 -2 169 -44 -192 25 -2 32 -144 -26
5319 -26 282 4 -219 6 203 -25 -22 191 324 -31 -159 -19 -194 246 76 -114 188 -119 -156 52 -106
5340 -106 -51 149 75 240 -31 30 28 -65 231 -102 -51 212 77 -162 87 -62 -78 -22 114 35 -72 -220 75
5363 75 -5 120 137 102 49 -106 -44 -258 12 -62 44 75 105 334 32 107 -120 69 97 -173 -179 118 80 -241 22
5388 22 -35 -22 -1 18 111 45 199 4 -106 -105 -54 -18 -134 79 -272 -134 44 -123 -36 -10 -245 25 -119 2
$$ packed form
5227ej54M4oL18k61R1j00j43K99J38k45O2k05j25M23k61KL40k22n6O3k44J8K79
5251E0K11k84J86j27M3J47k12k32K89j04R1j15J88M3p8r0P9o2j24K40j00K27l06
5274d0K20N5m10O1L84l12J34k15L79j72J8J00n62L58K19k37J21k81L3J51j31M3
5296h4j84K16j08M6K45n7j35o4K21n1n6N3q6j15J57J71k13j48K17k7L4j76J18
5319b6L08k78k23K25J97k28LK13J33l55j28J40j75M40j70j90L02l07l7K08j58
5340a06N5K00p4J65k71O1kr3K96l33N1K63j35k39K49j49j6N6J36p9j07j48K95
5363G5q0J25J7l5n3j55O2k14K70p4J06L1L0K29l02P5k27J89K8k70oK97l8l21K63
5388B2n7J3K1J9R3o6J54j95j10JN1L6j16K13l51J38J78j67Q7K6k35K70j44J21
$$ plain form
5412 2 104 0 6 -156 -130 -88 167 -47 178 58 25 -149 -103 -198 -368 -9 -71 -258 20 -126 -112 -102 174 165 131
5437 131 -72 61 -77 -65 25 194 -153 78 188 136 -33 178 18 62 87 -17 -138 -33 42 41 -178 76 -96
5460 -96 121 39 24 208 115 139 -32 -174 229 231 249 38 192 -42 -15 215 184 280 -21 -76 -40 -124 248 -124 -71
5485 -71 -74 -179 94 -8 -75 -92 116 -56 18 25 13 -40 30 167 -12 -44 -9 -45 -113 -94 -26 -33 142 24 -40 -120 -300
5512 -300 -320 238 -90 -40 16 -385 -171 -32 -23 -131 -21 12 72 -28 -34 -33 -100 -334 99 -94 -43 22 -171 -25 -245
5537 -245 13 238 -164 29 -18 136 102 125 31 31 161 -42 102 75 33 290 -173 -31 -41 74 124 225 144 -11
5561 -11 -16 -17 112 82 -246 -25 151 227 235 -144 -19 309 166 74 -212 -70 156 28 -101 -257 13 210 117 -22
5585 -22 -66 -99 -122 -43 -115 138 58 -31 -110 1 68 -237 -177 185 -134 -43 -348 -200 -108 50 -80 -15 -140 -32 -95
$$ packed form
5412BJ02j04Oj62K6M2K55k14K25j20l3j74M6r5j70L59o2j87K78j46J4J0K76rl4
5437A31k03J33j38J2R0J69l47K31J10n2j69K11j60M4K5j04j21J05P5jk19K54j72
5460i6K17q2j5J84r3K4j71j42M03KJ8k11J54k34K7K30l1R6l01n5L6q4L72l72N3
5485g1lj05K73j02o7j7K08j72P4Pj2n3P0J37j79l2L5l6o8J9O8pJ75j18o4q0j80
5512c00k0N58l28N0N6m01K14J39Rj08J10L3O0j00oJo7k34M33j93N1O5j93J46k20
5537b45K58K25m02J93m7J54l4K3r4%J30k03J44k7m2K57m63J42j0J15N0J01q1j55
5561a1njJ29l0l28K21J76P6Ql79J25L28j43r2k86J42K26j28j29j56K70J97r3j39
5585b2m4l3k3P9p2K53q0q9p9J11O7l05O0L62l19R1l05J48R2J58j30O5j25J08o3
$$ plain form
5610 -95 -156 -109 69 -142 135 -51 -167 -20 -84 27 -156 -3 130 83 -58 248 81 -93 -103 -115 -258 168
5632 168 56 198 -24 116 22 -310 -14 -45 104 -15 28 75 -47 91 -68 514 72 107 -130 25 82 -194
5654 -194 138 171 -30 290 59 -10 161 34 -33 211 -95 -202 179 -262 -244 -164 -114 -137 271 -36 -226 -247 -18
5677 -18 -191 -81 19 59 -79 21 -210 96 -52 -214 -105 224 -270 108 48 -129 32 -159 -263 -102 -129
5698 -129 -8 -324 35 -110 -105 443 129 -67 62 31 185 -12 17 189 -112 -149 -297 25 37 214 -27 -182
5720 -182 -55 84 116 -47 0 312 197 131 -75 236 94 94 -296 352 -177 130 48 -239 3 164 390 -171
5742 -171 -131 77 -221 54 -209 -30 -266 -154 198 -76 -134 -35 -214 -68 247 243 -171 -106 104 -78 48 -124
5764 -124 194 195 -117 164 -213 -170 33 -163 112 74 -59 -236 140 -79 -254 -165 -91 -105 67 -19 -134 35 -88
$$ packed form
5610i5o1M7J78k11K77j86j16J47o4J11j83J53J33m7j41L06j67j74j0j2j43M26
5632A68j12J42k22J40r4l32K96l1J49j19M3M7j22J38j59N82m42L5k37J55N7k76
5654a94L32L3k01L20k31o9J71j27o7K44l06j07L81m41J8Q0N0k3M08l07j90k1K29
5677a8j73J10J00M0j38J00k31L06j48j62J09L29m94L78o0j77J61j91j04J61k7
5698a29J21l16L59j45NN48l14j96J29l1J54j97K9J72l01l7j48L22J2J77k41j55
5720a82J27J39L2j63M7L12j15o6k06L11j42%l90O48n29L07q2k87K42J61K26n61
5742a71M0K08k98K75k63J79k36J12L52k74n8R9j79J46L15mm14O5K10j82J26j72
5764a24L18Jl12K81l77M3K03j96K75l8j33j77L76k19j75Q9P4j4J72q6j15J69j23
$$ plain form
5787 -88 178 -127 141 262 231 -197 -97 -100 -151 72 64 68 -56 -70 -42 89 -17 -166 136 138 145 7 -109 135 -186
5812 -186 15 109 77 70 215 -74 79 251 180 110 -189 271 92 -87 163 203 8 250 -136 167 82 113 287
5835 287 56 70 30 -45 83 242 99 199 69 -18 -318 -144 -96 32 -81 -118 46 -269 -71 233 -27 -13
5857 -13 -149 -4 -79 -172 -58 28 -62 -32 97 -180 -149 -23 183 -95 -50 192 -39 -38 -82 -17 267 21 -109 -171
5881 -171 -332 -94 -119 -63 14 24 190 -35 256 -66 92 107 288 55 132 -169 10 -21 -48 47 -24 150 418
5904 418 173 -34 -241 -94 -31 -17 242 -43 83 -4 95 64 93 25 -200 -108 -102 -61 163 -70 43 19 86 -10 -120
5929 -120 -2 121 -123 -159 -116 81 -56 -43 -36 -266 -136 -57 -170 -73 -218 285 90 86 378 -80 527 72 -8
5952 -8 -37 -230 -20 133 -22 -145 34 55 -36 -284 -63 -198 -91 -45 -169 -206 -53 -348 -217 56 -142 22
$$ packed form
5787h8K66l05K68J21l1m28J00ln1K23qMj24j4K8J31j06j49L02KPj38j16K44l21
5812a86K01R4l2pJ45k89J53J72p1p0k99M60j79j79K50M0j95K42l86L03q5L1J74
5835B87k31J4m0p5J28J59j43J00j30q7l00J74M8J28j13l7J64l15J98L04k60J4
5857a3j36J45p5r3J14Q6r0L0J29k77L1J26K06k78M5K42k31Jm4O5K84k46j30o2
5881a71j61K38k5N6P7J0J66k25K91l22J58J5J81k33P7l01J79l1k7R5p1J74K68
5904D18k45k07k07J47O3J4K59k85J26q7R9l1K9o8k25R2OM1K24k33J13k4O7r6j10
5929a20J18J23k44l6M3J97j37J3Pk30J30P9j13R7j45N03j95mK92m58O07m55q0
5952hk9j93K10J53j55j23J79K1r1k48K21j35J07M6j24l7J53k95J31K73j98J64
$$ plain form
5974 22 197 -145 -141 -90 -130 95 44 4 161 184 -36 -76 -47 73 -285 116 13 -137 -101 199 -36 -68 -44 -108 307
5999 307 65 -265 34 55 -170 88 -67 179 72 95 98 289 -88 141 83 -62 -80 122 -48 -195 -23 -133
6021 -133 100 248 -216 175 207 -152 -97 -89 190 -306 -83 65 -62 -103 -38 191 -96 16 181 115 99 66 -345
6044 -345 -45 79 46 10 -116 103 -70 7 113 14 231 19 240 -196 72 52 93 272 -213 26 104 -14
6066 -14 70 -180 -8 35 -187 -168 249 288 19 78 148 -94 -150 -7 59 -210 -96 106 -58 18 -210 119 -227
6089 -227 18 224 211 88 215 239 70 -65 -205 363 -9 117 60 173 42 -108 225 285 207 -103 44 166
6111 166 -4 -57 0 178 79 -94 243 -102 -367 -110 108 -153 -172 110 3 -42 177 115 -146 -4 -48 114
6133 114 36 -282 37 19 -232 133 -105 -38 -280 -130 -180 -33 -3 -81 39 80 109 122 -52 -102 53 -209 -313
$$ packed form
5974B2J75l42MN1m0K25n1m0J57K3k20m0K9J20l58M01j03j50L6L00k35l2K4o4M15
5999C07k42l30K99K1k25K58j55K46j07K3LJ91l77K29n8j45j8K02j70j47J72j10
6021a33K33J48m64L91L2l59N5QK79m96K23J48j27m1O5K29k87J12J65o6j6l3m11
6044c45L00J24l3l6j26K19j73P7J06r9K17k12K21m36K68k0M1J79m85K39P8j18
6066a4Q4k50J72M3k22J9M17L9k69N9P0k42n6J43O6k69J14K02j64P6k28L29l46
6089b27K45K06j3j23J27K4j69j35j40N68l72J26n7J13j31j50L33O0p8l10J47J22
6111A66j70n3N7J78r9j73L37l45k65K57K18k61j9K82j07m5K19o2k61J42m4J62
6133A14p8l18L19j8k51L65k38O7k42J50n0J47L0p8J20M1K9J3j74n0J55k62j04
$$ plain form
6156 -313 89 -21 89 14 -49 95 -23 18 15 252 -126 76 147 -22 168 -43 109 92 -50 81 110 -16 99
6179 99 142 131 209 170 19 122 -111 226 -99 168 -151 -40 27 12 -103 110 -151 13 -152 37 119 36 56
6202 56 -5 73 -101 -55 44 -40 -58 35 37 -172 6 -128 12 -190 -71 6 -115 -144 -177 -128 -125 50 -157 108 29 -247
6228 -247 112 -6 -260 -84 -64 179 -18 14 86 139 113 67 -174 -87 -144 18 -43 249 106 -25 194 44 268
6251 268 -230 -104 196 -84 -189 -60 -83 -158 -47 -10 -62 -140 82 -61 107 407 -118 -22 88 37 119 302 83
6274 83 -35 -21 185 72 65 189 -148 227 53 -1 165 61 -294 130 20 56 158 -270 149 -97 -96 -40 157
6297 157 37 202 -46 144 -211 -39 -17 -84 109 -131 15 -161 428 86 118 -339 -76 121 62 -71 -65 99
6319 99 117 38 30 -112 98 -37 -113 77 -158 -66 131 20 -74 -135 93 216 -8 -7 21 -8 189 -257 48 25 -102
$$ packed form
6156c13M02j10J10p5o3J44j18M1lK37l78K02P1j69J90k11J52j7j42J31K9j26J15
6179I9M3j1P8l9j51J03k33L37l25K67l19J11O7j5j15K13k61J64j65J89Q2q3K0
6202E6o1P8j74M6R9q4j8R3Kk09J78j34J40k02J19P7j21k9l3M9LJ75k07K65p9k76
6228b47L59j18k54J76K0K43j97L2P2N3k6m6k41Q7n7J62o1K92j43j31K19j50K24
6251B68m98J26L00k80j05J29k3p5J11L7n2p8K22j43J68L00n25R6J10n1Q2J83k19
6274H3j18J4K06j13pJ24l37L75j74n4J66j04l55M24j10L6J02m28M19k46JN6J97
6297A57j20J65k48J90l55J72K2o7J93k40J46j76N89l42L2m57K63J97n9j33OJ64
6319I9J8p9qj42K10j35p6J90k35R2J97j11r4o1K28J23k24JK8k9J97m46L05k3j27
$$ plain form
6344 -102 44 -133 -198 -87 5 -68 -106 150 207 -14 -50 -56 151 101 54 85 152 -302 66 -179 331 227 -321 -33
6368 -33 -72 -139 -15 -23 -40 -68 62 -87 -98 47 -208 -158 33 -49 -16 102 -83 -52 115 205 127 -250 -161 178 53
6393 53 -94 -133 -49 -133 -49 114 189 -17 -74 -15 -56 247 29 -214 38 170 88 36 -65 13 -136 -91 105 -136
6417 -136 40 66 5 -91 -67 39 197 -69 14 -143 184 161 -268 -15 -75 187 86 60 69 79 111 -128 109 185
6441 185 12 78 -77 123 50 0 -249 74 -132 41 -158 -154 155 -131 -104 13 -169 10 -300 -20 225 93
6463 93 -3 116 -12 45 77 297 182 56 -247 -244 118 263 111 -60 48 -179 50 44 -110 -73 175 1 -226
6486 -226 -178 156 -287 -167 -212 149 37 10 83 125 87 -165 67 -365 -145 -50 -31 -57 263 -2 100 74 -4 -318
6510 -318 46 -138 -134 15 -328 -259 -101 78 52 -244 -58 -2 -55 91 0 -107 393 -47 185 18 -132 -6
$$ packed form
6344a02J46j77o5J11R2p3l8K56N7k21l6oK07n0m7L1O7m54L68k45N10j04n48K88
6368c3l9o7J24qj7k8J30j49j1J45k55N0J91q2L3J18j85L1J67R0p8l77Q9L39j25
6393E3j47l9Q4q4Q4J63P5k06n7N9m1L03k18k43K52J32q2n2j01P8j49M5J96k41
6417a36J76K6o1r6K4J06J58k66Q3j57L27k3m29K53o0K62j01k6RJ0L2k39K37P6
6441A85j73O6j55K00p3n0k49L23k06J73j99ML09k86K7J17j82J79l10K80K45j32
6463I3r6J19j28N7L2K20j15j26l03LL62J45j52j71J08k27K29oj54L7K48j74k27
6486b26M8L34m43J20m5L61j12k7P3M2l8k52K32m32K20R5J9k6L20k65J02k6p8l14
6510c18L64j84MJ49l43O9J58J79k6k96J86N6n3J46r1j07N00m40K32j67j50J26
$$ plain form
6532 -6 -24 22 -285 -75 -74 150 -2 -24 43 -74 -96 -4 102 122 119 10 -266 -160 -268 46 -87 -169 151 22 200
6557 200 -53 -63 87 -76 -96 87 15 288 86 70 -84 -136 25 -275 -6 0 80 44 -51 168 -30 21 124 -187
6581 -187 -180 -167 -34 -47 151 -109 137 -42 -125 113 91 -168 -121 -30 -123 -11 -72 317 148 -4 3 -379 -78 -192
6605 -192 -83 -72 44 -265 -112 -70 -45 -20 -249 82 86 59 131 -4 -118 84 185 274 153 -80 -315 137 23
6628 23 90 23 -182 -18 20 139 30 227 33 -39 321 -166 -338 118 90 103 121 -3 41 21 103 22 88 -96
6652 -96 84 52 66 -252 -125 -43 13 68 21 -49 71 233 48 -124 -28 1 -173 5 -49 152 41 -124 -74 -47
6676 -47 -359 236 -54 115 -87 -123 28 -79 -266 1 56 -143 -232 -77 -22 -155 -12 110 107 -95 261 -216
6698 -216 40 15 -246 -173 41 11 -75 -185 -97 148 -269 -47 -73 26 17 156 -62 13 52 -134 -90 67 9 83 9
$$ packed form
6532fj8M6l07K10JK24j52k2O7j17k2R2J06K0lj09k76J06j08L14j33q2L20j29J78
6557B00k53j0J50j63k0J83p2K73k02j6j54n2J61l00K69OQ0l6r5K19j98N1J03l11
6581a87PJ3J33j3J98k60K46j79q3K38k2k59M7R1r3J12o1L89j69j52Pl82L01j14
6605a92J09J1J16l09J53M2K5K5k29L31Mk7P2j35j14K02J01Q9j21k33k35M52j14
6628B3O7o7k05J64L8J19j09J97j94p2L60m87j72M56k8J3J8j24M4k0Q2q1O6j84
6652i6J80l2J4l18J27Q2N6N5m7p0J20J62j85j72R6K9j74J78n4K01j11j65N0K7
6676d7l12N95k90J69k02l6J51j07j87K67N5j99q9J55N5j33J43J22lk02L56m77
6698b16K56k5k61P3K14l0q6j10Q8K45m17K22k6R9rJ39k18P5L9j86M4J57n8P4p4
$$ plain form
6723 9 -213 -53 6 -20 -16 -155 -164 -284 101 30 -16 23 104 -203 16 -125 -6 -47 -113 -300 -197 -209 -138 91 53 -51
6749 -51 45 219 -260 201 73 130 6 170 63 205 311 17 -108 115 -23 19 30 83 -211 -54 84 -108
6771 -108 48 -200 87 -83 -109 -60 -91 44 55 180 127 135 -32 -93 209 36 9 138 261 -47 -71 -33 110 7
6795 7 -92 -431 -86 -189 -5 4 -198 -150 -195 -1 248 49 -29 -221 -67 66 131 26 73 107 -111 -42 -101 -206
6819 -206 105 -116 -96 -272 -135 41 2 315 -149 -143 -101 157 64 -73 184 -106 -133 -195 299 -334 120 99 116
6842 116 -55 42 37 -110 215 256 -61 -70 326 -182 -189 -46 -214 38 -103 -31 104 -55 -61 11 165 119 -72 175
6866 175 7 108 17 -191 -29 110 -10 -32 -81 -89 -57 -149 86 130 -26 -232 -138 -4 198 -44 77 158 -65
6889 -65 -51 167 84 27 102 19 -161 331 69 -82 -272 17 -118 7 -101 103 225 -117 110 119 41 31 4 123
$$ packed form
6723Ik22J60N9k6Mj39rj20L85p1m6L9Q1l07K19j41J19m1o6j87J03j2P1K29l8j04
6749e1R6J74m79M61j28N7j24J64j07J42J06k94j25K23j38M2J1N3k94J57J38j92
6771a08J56k48K87j70k6M9l1J35J1J25n3Qj67o1L02j73k7J29J23l08k4L8J43j03
6795Gr9l39L45j03J84Rk02M8m5J94K49j99p8j92J54J33O5j05M7L4k18O9n9j05
6819b06L11k21K0j76J37J76l9L13m64OM2K58r3j37K57k90k7o2M94o33M54k1J7
6842A16j71R7nj47L25M1l17rL96n08pJ43j68K52j41P2J35j59oP2J54m6j91K47
6866A75j68J01r1k08J62J39j20k2m9qL2r2K35M4j56k06R4J34K02k42J21Q1k23
6889f5J4K18q3n7P5q3j80M92k62j51j90K89j35J25j08K04J22l42K27Rp8j0k7J19
$$ plain form
6913 123 125 -111 66 46 102 -1 13 23 55 321 -233 -46 -7 117 13 -31 -194 -19 -144 -110 14 52 -27 -131
6937 -131 -70 1 214 -210 117 -68 -169 -449 -196 -210 186 159 229 150 -29 -269 146 206 -180 27 41 -66 16
6960 16 -20 55 -111 126 -241 -273 19 -121 -165 -138 186 18 -34 -172 -224 -65 84 -48 -96 74 156 -57 42 356
6984 356 7 144 160 24 19 94 -128 -150 -61 73 -41 26 -41 -100 174 67 -92 92 70 -175 -37 -64 56 29
7008 29 -159 -170 -140 -65 159 -243 311 -23 66 -50 59 70 75 37 2 -133 -139 -13 -96 45 50 -54 -149 23 61 -183
7034 -183 -30 11 109 -196 69 -93 -348 -176 -128 -137 -166 92 -109 162 -170 119 -167 -123 105 -18 425 167
7056 167 -45 17 -37 -70 56 -15 -156 -14 -174 -268 178 -51 -29 -32 363 157 -73 -32 -217 -157 98 -137 -146 -131
7080 -131 -157 62 -279 31 101 178 15 115 49 9 127 -156 199 156 52 179 -161 0 195 -64 40 263
$$ packed form
6913A23Kk36J77k0N6j03J4J0L2K66n54J87L9J24j04m4j63J75j25L4J24L8p9j04
6937a31O1P1K13m24L27j85j01k80K53j4L96k7P0p9j79k40M15O0l86K07J4j07Q2
6960A6l6P5j66K37l67l2K92j40m4K7L24j68n2j38n2J59J49j32m8J70Q2k13R9L14
6984C56l49J37J6j36nP5k22k2Q9J34j14O7o7n9K74j07j59J84k2k45J38k7J20k7
7008B9j88j1L0P5K24m02N54l34Q9j16J09J1Nl8l5j35oJ26q3J41Nj04r5J72L8k44
7034a83J53M1R8l05K65j62k55J72M8rk9K58k01K71l32K89k86M4K28j23M43k58
7056A67k12O2n4l3J26p1j41J42j60r4M46k29K2lL95k06k30M1j85O0K55k35rJ5
7080a31k6K19l41L10P0P7j63J00o6m0J18k83L55m3j04J27l40J61J95k59J04K23
$$ plain form
7102 263 -270 112 15 -41 -71 108 257 165 148 -95 64 51 315 325 144 -151 117 -5 234 -72 -90 -74 172
7125 172 135 -58 97 -154 48 78 41 125 30 83 -199 6 64 246 148 98 -190 -54 -73 -51 101 180 -178 170
7149 170 186 148 -58 192 -72 107 75 65 16 -75 6 -72 -207 86 -20 15 180 -96 -15 -217 114 -165 -78 -123
7173 -123 -91 118 42 -123 -105 91 16 44 3 -83 331 12 -19 -123 176 -412 108 194 144 -192 -68 -173 97
7196 97 -268 -104 38 -82 190 -102 -122 191 189 13 190 44 107 -104 -147 257 -112 53 -53 110 -116 -185
7218 -185 150 -22 13 -151 79 67 218 161 -143 -39 -24 -248 149 -7 -88 103 214 -83 -13 196 -14 -71
7240 -71 60 244 70 -7 39 90 -216 18 100 -79 87 103 58 -237 -84 -21 -63 -307 284 104 22 -23 90 270
7264 270 28 -3 183 -218 -207 100 93 61 243 322 187 -35 72 175 -36 -312 56 25 -125 2 -161 -57
$$ packed form
7102B63n33L82r7n6l0J79J49r2j7k43J59j3K64J0j81k95K68j22K39l06j8J6K46
7125A72l7j93J55k51K02L0l7Q4r5N3k82K05N8J82r8n0k88J36j9K2J52P9l58L48
7149A70J6l8k06K50k64J79l2j0m9r1Q1p8j35K93j06L5J65k76Q1k02L31k79Q7m5
7173a23L2K09p6j65J8J96p5K8m1q6M14l19l1j04K99n88N20Q6n0l36J24j05K70
7196I7l65J64J42j20K72k92k0L13kj76J77j46O3k11m3M04l69J65j06J63k26o9
7218a85L35j72L5j64K30j2J51n7l04J04J5k24L97j56q1J91J11k97P0K09k10n7
7240g1J31J84j74p7M6N1l06K34Q2j79J66J6m5k95J53O3m2k44N91j80q2m5J13J80
7264B70k42l1J86m01J1L07pl2J82P9j35k22J07J03k11k76L68l1j50J27j63J04
$$ plain form
7286 -57 -77 59 57 25 4 -206 -21 -148 -142 -111 71 -89 -105 -88 -31 52 164 -165 -38 48 43 -75 -35 194 -180 145
7312 145 -51 -98 -131 -25 105 125 145 -104 -128 19 46 51 -90 237 -72 39 -140 88 90 -99 309 -15 241
7335 241 -60 -98 -31 230 102 -1 7 166 265 -144 70 -80 -5 -15 16 -24 -170 132 102 336 -159 -145 -117 211
7359 211 225 -84 -360 -89 -57 -56 57 53 77 -35 -132 -95 -73 -148 126 -38 -117 -71 140 33 70 207 94 -215 -93
7384 -93 109 -227 117 87 206 448 46 -57 -165 149 -159 -5 -178 112 -88 4 -196 -28 52 16 -177 -114
7406 -114 75 -8 254 87 12 -182 116 116 127 -236 51 19 199 138 -40 287 -123 177 -183 19 -133 26
7428 26 -142 92 132 -4 -169 53 56 -123 56 132 63 94 45 103 -121 43 86 -179 -127 112 113 -104 -12 28 249
7453 249 -40 22 140 -187 -82 -17 8 -196 -86 -188 -157 -45 238 -12 153 -199 -208 -250 -170 119 20 159 -233
$$ packed form
7286e7k0J36kl2k1k10J85j27OL1J82j60j6J7N7Q3J12l29J27Q6nj18M0K29l74L25
7312A45j96m7l3J06J30K0K0k49k4J47K7Nj41L27l09J11j79K28Kj89M08l24K56
7335B41l01l8O7K61j28j03QJ59R9m09K14j50P5j0L1m0j46L02l0K34m95J4K8L28
7359B11J4l09k76K71L2JJ13mK4j12r7L7K2p5K74j64p9M6K11j07L7J37j13l09J22
7384i3K02l36L44l0J19K42m02j03j08L14l08J54j73K90k00R2k00J68Q0l6j93O3
7406a14J89q3K62j67p5j94K98%J1l63K87l2J80o1j78L27m10L00l60K02j52J59
7428B6j68K34M0j36j65K22Lj79J79P6o9L1m9N8k24J64M3k65N2K39Jk17R2M0K21
7453B49k89O2J18l27J05O5K5k04J10j02L1J12K83k50J65l52rm2Q0K89r9J39l92
$$ plain form
7476 -233 165 79 73 -80 107 -338 110 -40 19 160 -6 -118 -46 305 -180 -24 150 -232 55 29 -30 -115 -88
7499 -88 -277 -186 -50 -195 80 -426 -110 293 -32 145 -59 -62 113 -225 58 -184 98 -149 -39 61 -5 120
7521 120 -132 -43 42 -25 24 -53 137 -8 -40 -140 6 -93 -4 28 -129 99 133 44 -45 242 100 -108 137 214
7545 214 36 -13 -97 30 -22 -321 -122 -219 268 47 -68 282 -33 -93 -30 15 100 67 -301 -119 77 42 50 -84
7569 -84 45 -157 -172 64 -66 138 -82 348 137 4 293 103 150 -54 57 -62 -34 -111 158 78 112 151 16
7592 16 -207 182 -21 9 -231 0 -3 -48 -49 159 -245 -259 141 -178 -55 -27 -1 168 -79 308 18 -81 56 -136
7616 -136 202 -132 39 -42 26 -116 49 316 29 -250 -100 13 151 177 -118 -62 139 16 26 14 -253 235
7638 235 -159 -135 -84 3 113 41 87 -100 -29 -132 178 40 86 195 -44 -11 -57 90 216 24 14 -12 65 -15
$$ packed form
7476b33L98q6oj53J87m45M48j50N9J41j66j12P2L51m85J56J74l82K87k6n9q5K7
7499h8j89R1J36j45K75n06L16M03l25J77k04lJ75l38K83k42K82k47J10J00o6J25
7521A20k52Q9Q5o7M9p7J90j45l2j00J46r9Q9L2j57K28L4q9q9K87j42k08K45P7
7545B14j78m9q4J27n2k99J99r7M87k21j15L50l15o0O3M5Q5l3l68J82J96l5Qj34
7569h4J29k02j5K36j30K04k20M30k11j33K89j90M7k04J11j19K8p7K69q0L4L9j35
7592A6k23L89k03L0k40K31lm5jK08m04j4M00l19J23K8K6J69k47L87k90r9J37j92
7616a36L38l34J71q1O8j42J65K67k87k79J50J13J38K6k95N6K01j23J0j2k67M88
7638B35l94K4N1Q7J10p2M6j87P1j03L10j38M6J09k39L3m6J47J26j92j0k6P7q0
$$ plain form
7662 -15 111 -229 53 -168 173 69 -88 128 52 -106 188 -133 -19 94 -287 -8 16 32 41 178 180 131 202
7685 202 -50 -104 188 -160 -9 42 -41 96 80 310 215 -56 -69 64 41 -175 -116 108 -262 102 -9 45 -201
7708 -201 -56 -208 62 76 248 94 -40 -78 73 -141 101 86 -19 -114 83 18 -74 80 -160 -143 -157 -154 36
7731 36 124 10 78 -113 -280 -103 -36 -44 173 -137 -218 102 53 -235 -124 31 -7 6 -237 -1 132 275 145
7754 145 -46 67 -120 295 -108 -177 262 -173 129 105 -84 -131 -113 -142 -277 -66 40 -83 31 128 -10 -176
7776 -176 -73 102 -174 160 101 191 -101 -159 195 -118 -17 -32 16 -130 -192 38 -66 -19 -31 202 -6 71 -79
7799 -79 -14 210 -145 28 -338 197 83 294 42 -17 -128 -134 32 -6 202 -79 -89 -142 18 243 247 -134 52
7822 52 -157 -89 160 -134 232 123 139 -50 237 -154 7 -170 -97 -274 92 -268 173 186 -211 -78 -2 29
$$ packed form
7662a5J26l40K82k21L41j04j57K16p6j58K94l21J14J13l81K79K4J6RJ37Km9P1
7685B02k52n4K92l48J51N1q3J37j6K30r5k71j3J33k3k16N9K24l70L64j11N4k46
7708b01J45j52K70J4J72j54j34l8J51k14K42j5j05r5J97o5r2J54k40J7j4LJ90
7731C6Q8j14O8j91j67J77O7qK17l10q1L20m9k88J11J55l8J3k43K36J33J43j30
7754A45j91J13j87M15m03o9M39m35L02k4j89m7J8k9j35K11J06j23J14R7j38j66
7776a76J03J75k76L34n9R0k92n8L54l13J01j5M8j46o2K30j04M7j2K33k08P7j50
7799g9O5K24l55J73l66N35j14K11k52n9j11oJ66l8K08k81j0n3J60K25Ml81J86
7822E2k09O8K49k94L66j09J6j89K87l91J61j77P3j77L66l60M41J3l97J33P6L1
$$ plain form
7844 29 -5 -326 54 60 197 -77 108 -9 140 168 22 -43 -180 -2 17 86 200 52 -132 -51 -90 19 104 43
7868 43 91 -225 -55 194 372 -71 -168 -208 102 -19 -241 -44 167 -90 93 129 -155 -187 206 -44 -156 131
7890 131 -120 31 -116 -28 -59 -91 -182 -123 -55 155 68 40 -49 340 59 112 11 82 5 -52 51 127 -49 -65 -199
7915 -199 103 65 38 16 3 -46 36 -182 -31 -108 100 -205 -100 22 110 -128 -3 -13 -133 -157 -31 -89 265 -72
7939 -72 204 -156 -123 -15 56 284 -58 173 -24 -126 -102 103 150 191 -172 -6 -108 27 211 257 -36 113
7961 113 -8 -150 197 62 -146 101 199 110 262 83 1 -176 -104 -195 89 31 -164 40 -257 52 257 213
7983 213 15 -152 -9 -11 -80 48 155 294 -5 278 -50 9 42 452 -47 116 70 -174 285 32 83 12 -196
8006 -196 121 -148 -195 -257 31 -124 -300 53 -161 32 140 -197 -120 -65 199 377 38 140 -30 -152 -213 -6
$$ packed form
7844B9l4l21L80OJ37k74J85j17J49K8j46o5j37J78J9O9J14j48j84Q1l9J09Q5o1
7868D3M8l16J70K49J78m43r7m0L10j21k22J97K11k57J83L6k84l2L93k50j12K87
7890A31k51J51j47Q8l1l2r1N9O8K10q7k8q9L89k81N3j01P1p7n7J03P6j76j6j34
7915a99L02l8k7k2j3m9Q2k18J51p7K08l05J05J22Q8k38J25j0j20k4J26n8L54l37
7939g2K76l60L3J08P1K28l42K31j97j02K4K05M7M1l63J66j02J35J84M6k93J49
7961A13j21j42L47j35k08K47R8q9J52j79q2j77P2r1K84n8j95K04k97L09K05m4
7983B13j98j67J43ko9J28J07J39k99K83l28N9L3M10m99J63m6k44M59k53N1p1k08
8006a96L17k69m7o2K88j55j76L53k14J93J08l37P7N5K64J78l39J02j70j22o1K07
$$ plain form
8028 -6 122 -194 -8 -30 -155 -110 -332 30 -169 -164 -146 -64 -41 58 25 260 228 198 142 55 50 12 51 -15 55 -1 264
8055 264 -138 -250 71 25 -142 -51 5 27 -11 93 57 -93 -76 30 120 68 243 -16 186 194 -50 110 159 229
8079 229 13 249 -79 84 123 -12 120 106 118 88 50 -6 25 153 125 -85 55 -108 66 -31 14 -309 160
8102 160 139 -200 71 -12 149 -30 45 116 134 -167 169 72 -178 -257 -74 -32 -9 1 -109 95 -385 39 43 217
8126 217 18 -60 -166 101 -112 237 -27 -86 111 211 31 103 355 -25 195 -23 122 33 157 -189 198
8147 198 55 -99 -176 -101 98 -14 160 -120 -133 176 -157 -139 86 130 -106 155 -15 -89 93 224 -25 31
8169 31 83 -60 -63 -175 -184 151 334 -93 41 -104 -149 159 -3 -53 17 -165 -91 -214 218 -35 -57 75
$$ packed form
8028fJ28l16J86k2j25M5k22L62j99NJ8Q2K3R9l3K35l2l0n6q7nl8L9o6P0n6K65
8055B64m02j12L21m6j67R1N6K2l8J04l6j50J7J06R0n2J75k59K02Qk44J60M9P0
8079B29k16K36l28J63L9j35J32j4J2l0l8n6L1J28k8k10J40j63J74r7M5l23M69
8102A60k1l39K71q3J61j79P5P1J8l01L36r7k50p9J83M2K3J0j10K04m80M24MJ74
8126B17j99p8j06K67k13L49k64n9J97J00j80P2K52l80K20k18J45q9J24l46L87
8147A98j43j54p7P5J99j12J74k80j3L09l33J8K25M4k36K61j70p4J82J31k49N6
8169C1N2j43lj12rL35J83m27J34j45m5L08j62n0P0j82P4j23M32k53k2J32
8191G5
$$ Imaginary data points
##PAGE= N=2
##DATA TABLE= (X++(I..I)), XYDATA
$$ plain form
0 0 0 0 0 0 0 0 0 0 0 0 0 0 0 0 0 0 8 -8 8 -8 8 -8 16 -16 16 -22 24 -25 32 -35 40 -48 55 -59 65 -75 85 -95
38 -95 104 -119 129 -143 159 -176 195 -216 238 -263 289 -319 351 -385 426 -470 521 -577 642 -717
58 -717 805 -911 1039 -1197 1405 -1678 2066 -2649 3629 -5554 10737 -52519 -130302 37110
72 37110 40893 -42383 18865 46842 -45900 -30641 28168 6639 -1555 -3916 -51336 -14980 48266
85 48266 9300 -9727 22455 -34982 -60172 32761 39612 -31092 1486 17130 -42678 -5708
97 -5708 53230 -11251 -38915 7688 -15216 -17604 53473 23818 -49885 -9286 15821 -24788 11406
110 11406 43958 -20028 -30410 19200 5384 959 29673 -13588 -41260 18454 24563 -10311
122 -10311 22540 18553 -42887 -12374 39269 1349 -9253 21776 -10689 -22769 29875 21106
$$ packed form
0@%%%%%%%%%%%%%%%%Qj6J6j6J6j6K4l2L2l8M6m9N7o7P5q8J03j14J24j40J60j80
38i5J99k23K48k72L02l35L71m11M54n01N52o08O70p36Q11q96R91j098J219j359
58g17J522j716J950k236K602l083L744m715O278r183J6291o3256p7783J67412
72C7110L783q3276O1248K7977r2742J5259N8809k1529q194k361m7420L6356O3246
85D8266l8966j9027L2182n7437k5190R2933O851p0704L2578J5644n9808L6970
97e708N8938o4481k7664M6603k2904k388P1077k9655p3703M0599K5107m0609L6194
110A1406L2552o3986j0382M9610j3816m425K8714m3261k7672N9714O109l4874
122a0311L2851l987o1440L0513N1643l7920j0602L1029l2465j2080N2644q769
$$ plain form
134 21106 -16905 3907 1029 -23759 17202 35384 -13865 -10306 16332 -15696 -11594 33478 6578
147 6578 -27358 4093 9713 -9756 13801 13443 -23158 -9000 11421 -8283 3911 22349 -15014
160 -15014 -24297 14293 5750 -14217 9781 3982 -25059 -976 18015 -6688 -5594 4644 -16119
173 -16119 -10335 15892 112 -10925 6464 -6385 -17879 10943 11437 -16909 -5202 7264 -11378
186 -11378 -2766 15320 -4860 -13482 4052 -1747 -6267 11098 3210 -13675 1450 6589 -6964
199 -6964 3702 9927 -9802 -5832 11214 922 -3152 9538 -739 -10416 7263 8746 -4270
212 -4270 3993 6418 -7025 314 11591 -203 -2713 6413 -295 -2640 9055 4757 -4081 3382
226 3382 2890 -3759 5445 7427 -4323 -567 6825 -2282 -1829 8305 153 -6481 3467 3589 -3642
$$ packed form
134B1106l8011K0812k878k4788M0961J8182m9249L559K6638l2028M102M5072k6900
147F578l3936L1451N620j9469K3557l58l6601J4158K0421j9704J2194J8438l7363
160a5014r283L8590q543j9967K3998n799k9041K4083J8991k4703J094J0238k0763
173a6119N784K6227j5780j1037J7389j2849j1494K8822M94k8346J1707J2466j8642
186a1378Q612J8086k0180q622J7534n799m520J7365p888j6885J5125N139j3553
199f964J0666O225j9729L970J7046j0292m074J2690j0277r677J7679J483j3016
212d270Q263K425j3443P339J1277j1794k510R126o708k345J1695m298q838P463
226C382m92o649R204J982j1750L756P392r107M53J0134q152o634R948J22p231
$$ plain form
241 -3642 1918 3524 -4711 -1776 2858 -2018 -938 2317 -3467 -3380 3310 -1434 -4709 1534 -999 -6623
257 -6623 241 2214 -4539 -2662 1425 -4053 -3905 1536 -1634 -4122 -194 -1363 -3665 113 -474 -4078
273 -4078 -1218 156 -3264 -796 1193 -2668 -2534 1396 -1005 -2723 1230 280 -2405 419 1332 -1158
289 -1158 -92 1366 -418 -294 1730 501 535 1983 907 172 2455 1180 118 2284 2258 202 1698
306 1698 2930 655 605 2462 1731 411 2099 2329 924 1364 1586 1357 1375 1438 961 1373 1299 665 1193
325 1193 1402 -32 149 1227 338 -749 712 788 -631 -388 404 -310 -1167 -531 -607 -1062 -1327 -964 -598
344 -598 -1053 -1625 -1341 -1038 -1161 -2099 -1018 -1275 -2090 -1616 -770 -1638 -1656 -1158 -915 -1945 -1678 -1026 -1442 -1585
364 -1585 -1378 -610 -990 -1233 -1133 -220 -453 -1410 -517 55 -620 -696 578 292 -858 54 1154 270 -356
$$ packed form
241c642N560J606q235K935M634m876J080L255n784Q7O690m744l275O243k533n624
257f623O864J973o753J877M087n478J48N441l170k488L928j169k302L778n87l604
273d078K860J374l420K468J989l861J34L930k401j718L953r50k685K824R13k490
289a158J066J458j784J24K024j229L4J448j076p35K283j275j062K166k6k056J496
306A698J232k275n0J857p31j320J688K30j405M40K22k29J8O3m77M12p4o34N28
325A193K09j434J81J078q89j087J461P6j419K43P92p14q57O36p6m55k65L63L66
344e98m55n72K84L03j23r38J081k57q15M74Q46q68j8M98K43j030K67O52m16j43
364a585K07P68l80k43J00R13k33r57Q93N72o75p6J274k86j150R12J100q84o26
$$ plain form
383 -356 884 740 248 429 1146 1289 813 618 980 1566 721 802 2320 1534 420 1583 2202 929 560
402 560 1968 1713 386 1502 1819 597 912 1756 1084 901 959 543 1423 1193 -5 498 1293 20 -624
421 -624 1138 353 -1453 76 880 -762 -614 565 -1007 -1626 64 -339 -1360 -670 -1163 -1394 -781 -1241
439 -1241 -1691 -682 -1166 -2357 -705 43 -2225 -1755 417 -1824 -2671 280 -173 -2082 -1305 -74 -1378
456 -1378 -1095 -326 -1026 -946 -507 -1341 -209 860 -1394 -1233 1055 -307 -1525 1701 1127 -1841 -582
473 -582 2346 325 23 1382 586 -173 1185 1529 949 1340 84 229 2577 1902 -432 1538 2076 -616
491 -616 972 3591 1076 -665 1488 1589 -56 2146 2072 -345 275 1170 423 1292 1641 -574 -276 1078
509 1078 192 408 1339 -870 -1460 612 562 -625 1000 58 -2863 -1136 1665 -490 -1509 -83 -1961
$$ packed form
383c56J240j44m92J81P17J43m76j95L62N86q45Q1J518p86j114J163O19j273l69
402E60J408k55j327J116L17j222L15Q44o72j83N8m16Q80k30j198N03P95j273o44
421f24J762p85j806J529Q04j642J48J179j572o19J690m03j021O90m93k31O13m60
439a241m50J009m84j191J652P48k268M70K172k241q47K951m53j909P77J231j304
456a378K83P69p00Q0M39q34J132J069k254J61K288j362j218L226n74k968J259
473e82K928k021l02J359p96p59J358L44n80L91j256J45K348o75k334J970N38k692
491f16J588K619k515j741K153J01j645K202p4k417O20Q95p47Q69L49k215K98J354
509A078q86K16R31k209n90K072n0j187J625r42k921J727K801k155j019J426j878
$$ plain form
526 -1961 -2582 237 770 -1349 -1836 -1872 -1941 63 -151 -2110 -1238 -890 -2770 -506 1743 -1632 -3092 -747
544 -747 -255 -1417 371 196 -2256 -2052 -327 238 685 -20 -1799 -1129 987 -11 232 1611 -1072 -2366
562 -2366 1124 2330 387 475 446 -1517 347 2780 2135 591 42 -553 695 3357 2047 170 641
579 641 -110 -1 2904 3185 -516 -508 771 737 1687 2958 218 -1436 445 1230 1253 2136 330 -1687 -73
598 -73 860 876 1433 306 -2017 -1197 1212 443 333 513 -1877 -2887 740 1150 -929 -471 -1221 -2551
616 -2551 -415 1371 -223 -1627 -2006 -2352 -424 1398 -868 -2172 -1189 -2067 -1471 1675 459 -3004
632 -3004 -1854 -370 -759 -296 871 -1341 -2735 -574 195 467 792 -1225 -2137 78 638 8 1219
649 1219 671 -2453 -447 2177 870 209 804 -761 -857 1810 2175 607 377 114 -550 1690 2610 444
$$ packed form
526a961o21K819N33k119m87l6o9K004k14j959Q72L48j880K264K249l375j460K345
544g47M92j162J788j75k452K04J725N65M47p05j779O70K116r98K43J379k683j294
562b366L490J206j943Q8k9j963J864K433o45j544n49n95J248K662j310j877M71
579F41p51J09K905K81l701QJ279l4R50J271k740j654J881P85K3Q83j806k017J614
598g3R33J6N57j127k323Q20K409p69j10J80k390j010L627M10k079M58p50j330
616b551K136J786j594j404l79l46J928J822k266j304R83q78N96L146j216l463
632c004J150J484l89M63J167k212j394K161P69K72L25k017r12K215N60o30J211
649A219n48l124K006K624j307o61N95j565r6K667L65j568k30k63o64K240R20k166
$$ plain form
667 444 347 469 -518 1396 3090 988 -973 980 676 424 2647 1771 -1518 -326 1212 611 1098 1806
685 1806 -763 -1222 1173 964 491 982 -238 -1401 640 899 -477 409 -34 -2330 -696 1568 -317
702 -317 -1202 178 -1324 -2237 181 717 -1581 -970 -853 -1814 -92 346 -1381 -1470 -636 -1590 -819 999
720 999 -958 -2339 -486 -433 -1111 380 113 -2100 -1266 480 -309 -163 425 -1052 -1221 632 504 -647
738 -647 578 0 -1334 350 1265 -386 341 945 -432 176 1518 855 -197 1056 588 -133 1376
755 1376 1749 -106 606 1027 132 1198 1827 148 451 1281 644 328 1814 476 -689 847 960 -89
773 -89 530 1076 -429 -142 1247 245 -57 729 -228 -703 372 294 -746 -20 -190 -904 -6 181 -875
792 -875 -718 -30 -720 -905 -142 -343 -1556 -251 -558 -1155 -663 -115 -1014 -1016 -503 -957 -698 -407 -967 -1154
$$ packed form
667D44r7J22r87J914J694k102j961J953l04k52K223q76l289J192J538o01M87P08
685A806k569m59K395k09m73M91j220j163K041K59j376Q86m43k296J634K264j885
702c17q85J380j502r13K418N36k298O11J17r61J722M38j727q9Q34r54P71J818
720I99j957j381J853N3o78J491k67k213Q34J746p89J46N88j477j69J853j28j151
738f47J225n78j334J684R15j651P27O04j377O08J342o63j052J253m68p21J509
755A376L73j855P12M21q95J066O29j679L03Q30o37l16J486j338j165J536J13j049
773h9O19N46j505K87J389j002l02P86r57m75J075p8j040P26j70p14Q98J87j056
792h75J57O88o90j85P63k01j213J305l07n97M92N48q99kN13m54K59K91n60j87
$$ plain form
812 -1154 -249 -891 -943 -16 -357 -1129 -230 -3 -399 -289 298 -268 -633 106 119 -530 143 -124 -399 140 369
833 369 97 485 449 256 475 692 288 278 727 716 287 732 849 468 754 933 363 648 1091 663 709 805
855 805 456 489 836 555 382 745 552 13 413 320 85 199 451 235 -96 221 403 -256 -127 -155 -579
876 -579 -326 -27 -216 -149 -396 -421 -513 -492 -600 -669 -367 -668 -846 -320 -621 -857 -680 -427 -686 -829 -177 -618
898 -618 -843 -807 -301 -585 -617 -525 -445 -470 -494 -387 -251 -440 -472 -59 14 -310 -255 339 -265 -336 93 271 -63 332
922 332 386 381 69 295 551 501 140 462 578 720 439 116 952 656 333 645 987 317 373 625 512 405
944 405 567 559 379 559 477 549 627 368 318 538 207 89 44 363 106 218 388 335 -142 313 -78 -194 -106
967 -106 -274 -390 -274 -4 -403 -323 -531 -548 -377 -240 -613 -990 -452 -598 -628 -436 -610 -867 -784 -364 -505 -785
$$ packed form
812a154R05o42n2R27l41p72Q99K27l96J10N87n66l65P39J3o49O73k67k75N39K29
833C69k72L88l6j93K19K17m04j0M49j1m29M45J17l81K86J79n70K85M43m28M6R6
855H05l49L3L47k81j73L63j93n39M00r3k35J14K52k16l31L17J82o59J29k8m24
876e79K53K99j89O7k47k5r2K1j08o9L02l01j78N26l01k36J77K53k59j43O52m41
898f18k25L6N06k84l2R2Q0k5k4J07J36j89l2M13P3l24N5N94o04p1M29J78l34L95
922C32N4nl12K26K56n0l61L22J16J42k81l23Q36k96l23L12L42o70N6K52j13j07
944D05J62qj80J80q2P2P8k59n0K20l31j18m5L19k57J12J70n3m77M55l91j16Q8
967a06j68j16J16K70l99Q0k08j7J71J37l73l77N38j46l0J92j74k57Q3M20j41k80
$$ plain form
989 -785 -175 -788 -757 -353 -537 -477 -313 -568 -392 -320 -453 -415 133 343 -619 -391 668 -151 -391 485 348
1010 348 -239 784 268 -45 306 660 105 580 597 265 553 632 226 545 1046 630 427 834 860 59 695
1031 695 1021 184 306 847 285 254 1004 342 -108 556 337 -43 687 509 -286 170 620 -84 68 577
1051 577 -665 -403 771 -123 -712 262 -341 -1021 151 381 -595 -368 -6 -834 -202 304 -960 -815 -125
1070 -125 -1215 -917 193 -61 -1271 -631 -10 -1150 -346 244 -1111 -854 300 -472 -684 177 -491 -918
1088 -918 152 84 -649 118 72 -555 -65 547 -790 -185 623 -313 -526 972 414 -594 564 545 -226
1107 -226 629 1365 -162 29 986 -48 310 1250 319 -189 995 718 -191 940 977 -619 251 1249 -322
1126 -322 203 1198 -259 -382 945 469 -101 633 182 -729 690 716 -422 -17 436 -736 -186 1050
$$ packed form
989g85O10o13L1M04j84O0J64k55J76P2j33L8N48K10r62K28J059q19k40Q76j37
1010C48n87J023n16l13L51L54n55M75J7l32K88P9m06L19N01m16k03M07K6q01O36
1031F95L26q37J22N41n62l1P50o62m50O64k19l80P30j78p95M56M50p04J52N09
1051E77j242K62J174q94n89R74o03o80J172K30r76K27L62q28O32N06j264J45O90
1070a25j090K98J110k54j210O40O21j140Q04N90j355K57J154p72k12Q61o68m27
1088i18J070o8p33P67m6o27M90O12j337O05Q08r36k13J498n58j008J158j9p71
1107b26Q55P36j527J91R57j034L58R40r31n08J184k77r09J131L7j596Q70R98j571
1126c22N25R95j457j23J327m76n70P34m51r11J419K6j138M05M53j172N50J236
$$ plain form
1144 1050 -205 -794 414 -417 -898 436 331 -915 -165 65 -857 -342 433 -1002 -837 -86 -460 -787
1162 -787 428 -477 -987 -464 -112 -783 -22 170 -1371 -883 460 -449 -865 164 -630 -1004 134 272
1180 272 -619 72 138 -857 215 779 -462 -76 343 -429 -133 1074 564 -503 619 440 -271 700 847
1199 847 -322 251 849 141 523 931 70 -256 907 538 278 1093 602 -252 634 921 140 502 815
1218 815 -271 -263 1038 142 -13 602 114 -479 484 750 -544 10 5 -527 23 462 -173 -388 230 -123
1238 -123 -693 378 -56 -794 -198 -27 -557 -21 232 -967 -743 60 -474 -451 -114 -248 -949 -2 -222 -615
1258 -615 -115 -245 -982 -444 195 -563 -544 214 -462 -763 236 -1 -836 -61 -120 -533 -8 254 -40 -132 223
1279 223 -195 -64 588 250 -258 273 423 115 530 282 45 374 529 387 267 777 131 -60 563 594
$$ packed form
1144A050j255n89J208q31m81J334j05j246P50K30r22N15P75j435J65P51l74l27
1162g87J215r05n10N23L52o71P61J92j541M88J343r09m16J029p94l74J138J38
1180B72q91O91O6r95J072N64j241L86M19p72K96J207n10j067J122j79p11R71J47
1199H47j169N73N98p08L82M08q61l26J163l69k60Q15m91q54Q86K87p81L62L13
1218H15j086QJ301q96j55O15m88n93R63K66j294N54nn32N50M39o35k15O18l53
1238a23n70J071m34p38N96J71n30N36K53j199K24Q03n34K3L37j34p01R47k20l93
1258f15N00j30p37N38O39p58J9P58o76l01R99k37q35P75n9m13N25K62k94r2L55
1279B23m18J31O52l38n08N31J50l08M15k48k37L29J55j42j20N10o46j91O23L1
$$ plain form
1299 594 444 493 310 307 541 667 231 566 632 156 298 500 -7 -3 414 212 -356 250 306 -324 138 -15
1321 -15 -185 67 88 -161 -215 65 109 -439 -136 -285 -536 -245 -265 -460 -315 -95 -655 -262 -23 -497 -549 -92
1343 -92 -278 -456 -133 -41 -377 -500 -289 -629 -318 -338 -692 -171 -17 -215 -353 211 -2 -255 -365 -320 -97
1364 -97 142 -252 -150 -137 160 -19 145 268 202 102 -112 491 206 334 -10 -22 427 402 483 237 278 323 177
1387 177 454 725 377 395 415 298 345 301 506 301 207 268 476 126 211 118 189 349 -46 -127 271 -83 122
1410 122 53 -24 -178 -82 89 -134 -125 -296 -215 -388 -248 -144 -438 -251 -96 -481 -437 -444 -589 -178 -348 -362 -243
1433 -243 -359 -434 -243 -281 -479 -256 -330 -404 -221 -281 -529 -108 -291 -61 23 -197 -182 -381 -100 -395 80 281
1455 281 -31 24 -112 -27 -25 -37 144 17 503 376 268 406 94 190 131 309 402 288 294 265 416 259 365 397
$$ packed form
1299E94j50M9j83lK34J26m36L35O6m76J42K02n07MM17k02n68O06N6o30M62j53
1321a5j70K52K1k49n4K80M4n48L03j49k51K91k0j95J45K20n60L93K39m74n2M57
1343i2j86j78L23R2l36j23K11l40L11k0l54N21J54j98j38N64k13k53j10M5K23
1364i7K39l94J02J3K97j79J64J23o6j00k14O03k85J28l44j2M49k5Q1k46M1M5j46
1387A77K77K71l48J8K0j17M7m4K05k05r4O1K08l50Q5r3P1J60l95q1L98l54K05
1410A22o9p7j54R6J71k23Rj71Q1j73J40J04k94J87J55l85M4pj45M11j70j4J19
1433b43j16p5J91l8j98K23p4p4J83o0k48M21j83K30Q4k20J5j99K81k95M75K01
1455B81l12N5j36Q5Kj2J81j27M86j27j08J38l12R6n9J78R3j14Ok9J51j57J06L2
$$ plain form
1479 397 471 279 191 442 375 162 508 294 29 -16 61 316 441 282 92 268 296 -85 176 1 134 172
1501 172 -9 -191 153 -106 62 79 -269 -77 -217 -301 -185 -178 -293 -79 -180 -466 -527 -326 -207 -325 -151 -172
1523 -172 -334 -476 -241 -307 -247 -636 -384 -178 -183 -245 -235 -359 -259 -184 -125 -95 -173 -259 -288 -276 -64 61 82 16 101
1548 101 -51 -36 376 125 337 154 170 189 181 507 253 270 356 339 147 500 395 174 212 418 353 323 493 177
1572 177 166 579 249 741 345 255 419 297 124 -2 116 223 4 168 296 139 2 -111 100 -45 -110
1593 -110 -82 -100 44 -359 -121 -28 -54 -217 -417 -462 -220 6 -45 -278 -379 -240 -378 -431 -83 -296 -374 -302 -376
1616 -376 -285 -281 -407 -579 -301 -130 -367 -62 -22 -382 -409 -169 116 -77 118 -42 -252 -1 10 118 -74 259
1638 259 -86 -103 154 140 64 78 -70 39 224 636 110 125 182 39 128 408 110 230 516 254 380 484
$$ packed form
1479C97P4j92q8K51o7k13L46k14k65m5P7K55J25j59j90J76K8l81K61j75J33L8
1501A72j81j82L44k59J68J7l48J92j40q4J16Pj15K14j01k86o1K01J19j18J74k1
1523a72j62j42K35o6O0l89K52K06no2J0j24J00P5N9L0p8q6k9J2K12J25K1o6Q5
1548A01j52J5M12k51K12j83J6J9qL26k54J7Q6j7j92L53j05k21L8K06o5l0J70l16
1572A77j1M13l30M92l96r0J64j22j73j26J18J07k19J64J28j57j37j13K11j45o5
1593a10K8j8J44m03K38R3k6j63k00m5K42K26n1k33j01J39j38n3L48k13p8P2p4
1616c76R1Mj26j72K78J71k37L05M0l60k7K40K85j93J95j60k10K51J1J08j92L33
1638B59l45j7K57j4p6J4j48J09J85M12n26J5N7j43Q9K80k98J20K86k62J26J04
$$ plain form
1660 484 455 182 40 274 324 421 343 158 288 317 244 197 375 -36 20 205 -33 -473 99 30 -166 36 44 -152
1684 -152 -46 337 -204 -298 36 -449 -344 138 -44 -294 -104 191 -258 -274 -89 -470 -204 -269 -105 -255 -63
1705 -63 -371 -348 -93 -187 -110 210 -144 -238 -201 34 -441 -209 -26 -459 32 -2 -434 -301 35 123 -453 61 13
1728 13 -165 132 393 8 -148 119 212 129 282 -68 -171 357 381 117 354 568 28 96 393 173 338 485
1750 485 163 82 357 423 156 412 344 151 382 131 14 111 479 79 -204 446 -165 -228 31 176 115 224
1772 224 206 -38 57 -18 -160 -45 62 -118 -496 -160 -111 -280 -10 -67 -461 -33 -100 -324 -281 22 -705 -502
1794 -502 -211 -474 -219 -96 -368 -285 -71 -165 -329 42 58 -208 -358 120 -321 -292 55 -2 -193 196 110 -246
1816 -246 8 -34 -200 72 72 -106 178 474 85 -155 300 142 189 326 387 48 324 359 -104 64 272 176
$$ packed form
1660D84k9k73j42K34N0R7p8j85J30K9p3m7J78m11N6J85k38m40N72o9j96K02Qj96
1684a52J06L83n41r4L34m85J05M82j82k50J90K95m49j6J85l81K66o5J64j50J92
1705f3l08K3K55r4P7L20l54r4L7K35m75K32J83m33M91l4m32J33L36Q8n76N14m8
1728A3j78K97K61l85j56K67R3q3J53l50j03N28K4k64K37K14n40O8K97k20J65J47
1750D85l22q1K75O6k67K56o8j93K31k51j17R7L68m00k83O50o11o3K59J45o1J09
1772B24j8k44R5p5j42J15J07j80l78L36M9j69K70n7l94M28o7k24M3L03p27K03
1794e02K91k63K55J23k72Q3K14r4j64L71J6k66j50M78m41K9L47n7j91L89q6l56
1816b46K54m2j66K72%j78K84K96l89k40M55j58M7J37O1l39K76L5m63J68K08r6
$$ plain form
1838 176 441 287 271 16 390 290 -17 72 272 85 258 263 -58 207 96 -33 -237 59 426 -42 204
1859 204 102 -225 232 -83 -155 -35 -32 -243 -80 50 -233 -95 213 -305 -295 -102 -128 -319 -298 27 -335 -331 -60
1882 -60 -382 -153 -272 -428 -132 26 -98 -63 47 -219 -241 -152 118 -207 -17 149 -184 -98 -141 63 -55 168
1904 168 -171 -153 46 -176 58 -3 -21 57 -28 201 157 294 307 150 6 205 293 462 257 -13 -205 277 518
1927 518 193 383 371 318 -124 255 127 60 150 188 109 -11 239 60 88 260 209 72 221 164 136 255 -37
1950 -37 -275 127 25 -35 34 215 170 -313 16 -89 -287 -136 -361 -401 -82 -209 -367 13 -101 -121 -319 -243
1972 -243 -288 -298 -132 -287 -189 -377 -210 -414 -164 -35 -330 -308 -177 -226 -272 -65 -82 -151 -10 -73 130 -102 49
1995 49 -34 239 132 -133 207 -47 -91 125 264 364 -87 69 191 -27 374 133 8 248 -86 114 -58
$$ packed form
1838A76K65j54j6k55L74j00l07Q9K00j87J73Nl21K65j11j29k04K96L67m68K46
1859B04j02l27M57l15p2J20Lk11J63J30k83J38L08n18J0J93k6j91K1L25l62MK71
1882f0l22K29j19j56K96J58j24L5J10k66k2Q9K70l25J90J66l33Q6m3K04j18K23
1904A68l39J8J99k22K34o1j8P8q5K29m4J37J3j57j44J99Q8J69k05k70j92M82K41
1927E18l25J90j2n3m42L79j28o7R0L8p9j20K50j79K8J72n1j37J49n7k8J19k92
1950c7k38M02j02o0O9J81m5m83L29j05j98J51k25m0L19j27j58L80j14k0j98P6
1972b43m5j0J66j55R8j88J67k04K50J29k95K2J31m9m6K07j7o9J41o3K03k32J51
1995D9q3K73j07k65L40k54m4K16J39J00m51J56J22k18M01k41j25K40l34K00j72
$$ plain form
2016 -58 255 -24 63 305 -87 240 202 163 382 -35 75 -57 -65 190 48 -95 56 -70 109 181 10 -41 -218
2039 -218 266 98 -51 77 -135 151 -89 -38 -132 -52 -219 -232 -44 -76 -230 -42 56 -284 -204 19 -236 -286 -51
2062 -51 -244 -332 -93 -419 -18 -4 -77 -215 -95 -397 -237 43 -147 -415 -226 135 34 -164 136 -39 -217
2083 -217 -101 -194 -77 -48 101 -71 42 122 176 -28 153 29 -32 -38 -42 113 112 -143 384 405 214 57 299 403
2107 403 263 -27 90 169 172 -63 264 9 183 1 175 421 297 159 -2 191 225 -65 203 261 -41 82
2129 82 -66 227 -65 264 52 -133 99 -16 -140 -42 -368 -307 -114 -213 -262 37 -192 -473 -184 -145 -283 -167
2151 -167 35 -503 -238 -206 -273 -549 -9 -193 -91 -447 99 -201 142 -51 161 -77 -131 -138 -248 -183 -43 -138
2173 -138 105 -26 287 -60 80 106 206 510 41 51 203 -4 43 -81 29 218 115 47 -65 331 78
$$ packed form
2016e8L13k79Q7K42l92L27l8l9K19m17J10j32qK55j42j43J51j26J79P2j71n1j77
2039b18M84j68j49J28k12K86k40N1r4Q0j67j3J88l2j54J88R8l40Q0K23k55n0K35
2062e1j93q8K39l26M01J4p3j38J20l02J60K80j90k68J89L61j01j98L00j75j78
2083b17J16r3J17K9J49j72J13Q0N4k04J81j24o1omJ55jk55N27K1j91j57K42J04
2107D03j40k90J17P9Lk35L27k55J74j82J74K46j24j38j61J93L4k90K68N8l02J23
2129H2j48K93k92L29k12j85K32j15j24R8l26O1J93r9m9K99k29k81K89L9j38J16
2151a67K02n38K65L2o7k76N40j84J02l56N46l00L43j93K12k38n4pj10O5J40r5
2173a38K43j31L13l47J40K6J00L04m69J0J52k07M7j24J10J89j03o8j12L96k53
$$ plain form
2194 78 60 -4 119 83 -135 3 134 24 229 197 310 88 257 83 -71 -121 -48 4 62 311 184 372 176
2217 176 -229 -44 34 -232 83 -86 -7 -167 -293 -153 -119 -150 -142 -188 103 -267 -217 -39 -16 -5 16 -173 -132 -86
2241 -86 -337 -199 -135 -197 -31 -68 -131 -160 -197 58 -7 -91 -127 -280 -133 -120 -29 -380 -3 160 101 15 65 75 -110
2266 -110 -214 -65 -83 125 112 -40 68 323 264 155 -132 247 -88 -101 -51 -1 -92 189 145 376 411 198 220
2289 220 36 187 -35 213 215 43 71 348 36 267 230 215 -52 264 -11 100 215 16 99 35 147 54 -77
2312 -77 -7 81 -60 82 -288 -85 103 -189 -312 -197 -32 -297 -28 -132 38 -367 75 -256 -302 -82 -36 -200
2334 -200 -141 -112 -212 -158 -103 -327 -118 157 -208 -161 60 -137 -28 52 135 100 149 -222 -34 68 94 -118 -40 -175
2358 -175 -212 20 34 -27 179 152 -71 134 105 47 23 378 137 84 206 295 136 439 174 -172 47 78 94 -248
$$ packed form
2194G8j8o4J23l6k18J38J31j10K05l2J13k22J69j74j54n0P3N2N8K49j27J88j96
2217A76m05J85P8k66L15j69P9j60j26J40L4l1Qm6K91l70N0J78K3J1K1j89M1M6
2241h6k51J38O4o2J66l7o3k9l7K55o5q4l6j53J47J3R1l51L77J63n9q6N0J0j85
2266a10j04J49j8K08j3j52J08K55n9j09k87L79l35j3N0N0r1K81m4K31L5k13K2
2289B20j84J51k22K48Kj72K8K77l12K31l7j5k67L16k75J11J15j99Q3o4J12r3j31
2312g7P0Q8j41J42l70K03J88k92j23J15J65k65K69j04J70m05M42l31m6K20M6j64
2334b00N9K9j00N4N5k24K09K75l65M7K21j97J09Q0Q3l5M9l71J88J02K6k12P8j35
2358a75l7K32J4o1K06k7k23K05k9n8k4L55k41n3J22Q9j59L03k65l46K19L1J6l42
$$ plain form
2382 -248 302 65 158 154 209 -15 78 124 37 -69 231 71 186 208 41 60 28 -45 259 321 -74 -49 -9 -159 -43
2407 -43 -126 -40 46 51 146 -45 -28 35 56 228 -187 -18 -151 -320 -161 -243 -381 -47 -64 113 -100 -251 -193 35
2431 35 -381 -212 -6 -86 -39 -89 -56 -82 -169 -75 -37 -256 170 -18 168 -98 -108 134 177 171 167 7 143 -226 -35
2456 -35 -77 -198 -115 152 49 300 111 369 115 116 412 92 76 -21 191 197 217 104 275 125 107 79 -51 261
2480 261 200 -156 298 -20 -232 89 253 1 256 -26 -123 -146 -367 -59 -77 12 42 44 95 -338 -305 -168 -105 -61
2504 -61 159 38 -111 -226 -149 -200 -55 -203 -202 79 -230 -504 58 2 -167 111 -203 -141 -393 -85 129 -130
2526 -130 -72 -81 -19 112 43 -24 250 -107 -168 -223 -72 220 -16 -195 -181 1 -135 108 168 30 460 -136 73
2549 73 45 -61 -195 162 -15 4 -149 -187 137 228 23 191 265 14 96 30 -5 127 -37 32 198 349 -17
$$ packed form
2382b48N50k37R3mN5k24R3M6q7j06L00j60J15K2j67J9l2p3L04O2l95K5M0j50J16
2407d3q3Q6Q6NR5j91J7O3K1J72m15J69j33j69J59q2j38L34j7J77k13j51N8K28
2431C5m16J69K06q0M7n0L3k6q7R4L8k19M26j88J86k66j0K42M3omj60J36l69J91
2456c5m2j21Q3K67j03K51j89K58k54JK96l20j6r7K12OK0j13J71j50j8k8j30L12
2480B61o1l56M54l18k12L21J64k52K55k82r7k3k21L08j8Q9L0KN1m33L3J37O3M4
2504f1K20j21j49j15P7n1J45j48JK81l09k74N62n6j69K78l14O2k52L08K14k59
2526a30N8rO2J31o9o7K74l57o1n5J51K92k36j79J4J82j36K43O0j38M30n96K09
2549G3k8j06j34L57j77J9j53l8L24R1k05J68P4k51Q2o6l5J32j64O9J66J51l66
$$ plain form
2572 -17 86 145 -126 50 136 2 -44 138 39 -15 41 -166 -61 -18 -84 127 65 35 -3 -92 -196 86 -106 -17 242
2597 242 -321 -315 120 -185 19 -270 42 230 -127 33 57 -8 -114 -148 -12 -231 -74 -222 -247 -96 -64 -267
2619 -267 -49 87 -259 -66 24 -210 12 74 163 -187 -117 -144 -188 311 259 200 -137 -88 -21 155 216 108 119 226
2643 226 107 134 68 68 171 131 207 356 257 52 191 66 -94 65 39 174 104 171 132 -51 70 113 149 -143
2667 -143 97 199 59 -23 127 18 -153 -205 -25 22 -220 -93 126 -21 -24 53 -212 98 -166 -99 -68 -60 -210
2690 -210 -157 -55 -103 -156 -118 -63 37 85 90 -38 -84 15 -35 126 -292 -223 -142 -140 -222 53 43 -82 51 159 -96 -195
2716 -195 -131 -9 185 92 -23 -13 61 230 -34 -85 30 -253 2 25 126 83 259 216 -108 184 -50 124 12
2739 12 65 -96 11 -13 62 284 269 -159 216 26 0 252 12 93 246 283 244 -36 -24 103 53 -72 -198 83
$$ packed form
2572a7J03N9k71J76Q6j34m6J82r9n4N6k07J05M3o6K11o2l0l8q9j04K82j92Q9K59
2597B42n63OM35l05K04k89L12J88l57J60K4o5j06l4J36k19J57j48k5J51L2k03
2619b67K18J36l46J93R0k34K22O2Q9l50P0k7m4M99n2n9l37M9O7J76O1j08J1J07
2643B26j19K7o6%J03m0P6J49r9k05J39j25j60J59k6J35p0O7l9j83J21M3L6k92
2667a43K40J02j40q2J50j09j71n2J80M7k42J27K19j47lP7k65L10k64O7L1Qj50
2690b10N3J02m8n3L8N5J00M8Nj28m6R9n0J61m18O9Q1Kq2K75j0j25J33J08k55r9
2716a95O4J22J94r3j15J0P4J69k64n1J15k83K55K3J01m3J76m3l24K92k34J74j12
2739A2N3j61J07k4P5K22j5m28L75j90k6K52k40Q1J53L7l9k80J2J27n0j25j26K81
$$ plain form
2763 83 65 70 359 -122 367 -60 -190 -177 -253 -52 -308 -255 -66 91 -184 -322 -527 -30 -73 20 131 -83 -314
2786 -314 -137 46 -45 -103 -271 11 -34 134 -41 -119 -146 -76 -139 -24 -171 80 -245 -223 -139 -121 109 -48 212
2809 212 -137 -253 -43 148 272 174 330 189 55 30 -20 9 170 81 151 63 410 42 62 265 183 345 154
2832 154 64 -109 55 39 137 236 490 109 -345 -132 -34 -117 159 118 -20 55 29 178 0 74 116 88 112 -40
2856 -40 59 -164 -151 169 179 155 1 -184 84 -120 249 155 -238 -150 62 -127 -131 -34 -213 -256 -57 19 -304 -378
2880 -378 -186 -156 -89 106 -156 -291 -24 -88 -236 12 43 -187 -219 13 127 -206 285 -116 67 151 34 112
2902 112 -12 -48 27 93 1 61 -72 6 135 110 8 104 259 -53 104 209 227 -145 55 99 41 331 290 101
2926 101 27 37 -110 136 192 -128 -50 102 217 -36 247 198 0 -13 243 -157 4 98 -151 -147 -167 276 28
$$ packed form
2763H3j8NK89m81M89m27j30J3p6K01k56N3J89J57k75j38k05M97m3R3J11k14k31
2786c14J77J83r1n8j68K82m5J68j75p8k7P0o3J15j47K51l25K2Q4J8K30j57K60
2809B12l49j16K10J91J24r8J56j41j34k5n0K9J61q9P0q8L47l68K0K03q2J62j91
2832A54r0j73J64j6R8R9K54l81m54K13R8q3K76m1j38P5k6J49j78P4M2k8K4j52
2856d0R9k23J3L20J0k4j54j85K68k04L69r4l93Q8K12j89mR7j79m3J99P6l23p4
2880c78J92L0O7J95k62j35K67o4j48K48L1k30l2K32J14l33M91m01J83Q4j17P8
2902A12j24l6P5O6r2O0j33P8J29k5j02R6J55l12J57J05J8l72K00M4n8K90m1j89
2926A01p4J0j47K46N6l20P8J52J15k53K83m9j98j3K56m00J61R4k49Mk0M43k48
$$ plain form
2949 28 -239 160 -200 16 92 -156 61 -4 -158 171 -227 -180 -126 -12 -125 -64 -259 -75 -142 28 -3 -88 -416
2972 -416 51 67 -128 -132 36 121 -119 87 3 -108 207 -253 -87 157 -136 5 -57 179 -146 45 209 -25
2994 -25 58 213 163 314 3 -109 -9 110 -201 255 50 -41 6 258 -56 -26 254 93 0 119 209 118 -101
3017 -101 -120 71 -78 68 -32 133 -93 40 -27 222 177 37 385 10 -148 -80 3 -284 -103 27 -21 -45
3039 -45 -27 118 -22 -213 -182 -237 117 101 -23 -332 -267 -226 0 -372 -498 -66 72 -114 -127 -8 -158 -130 -52
3062 -52 -159 -305 -84 -114 182 -74 130 -8 152 15 -59 17 -17 59 -303 -3 -131 117 -45 200 -85 -203
3084 -203 15 298 -6 -112 139 -5 -7 160 112 92 101 212 34 85 291 -108 -34 129 197 26 324 -285 -177
3107 -177 -111 -66 292 145 221 -26 -224 160 463 35 -298 13 -191 -68 138 -248 -68 -200 55 -58 72
$$ packed form
2949B8k67L99l60K16P6k48K17o5j54L29l98M7N4J14j13O1j95J84o7J70l1q5l28
2972d16M67J6j95mJ68Q5k40K06q4j11L15m60J66K44k93J41o2K36l25J91J64k34
2994b5Q3J55n0J51l11j12J00J19l11M56k05r1M7K52l14L0K80j61r3J19R0r1k19
3017a01j9J91j49J46j00J65k26J33o7K49m5j40L48l75j58O8Q3k87J81J30m8k4
3039d5J8J45j40j91L1n5L54j6j24l09O5M1K26l72j26M32J38j86j3J19j50K8P8
3062e2j07j46K21l0K96k56K04j38J60j37p4P6l4P6l62L00j28K48j62K45k85j18
3084b03K18K83l04j06K51j44kJ67m8k0RJ11j78N1K06l99P4J63O8j71K98o09J08
3107a77O6M5L58j47P6k47j98L84L03m28l33L11k04J23K06l86J80j32K55j13J30
$$ plain form
3128 72 -72 81 106 -12 -241 165 -219 68 101 -195 -170 -340 -251 -34 -160 -115 -216 -314 83 -27 64 0 -65
3151 -65 -307 -490 90 -135 228 -132 122 -384 -74 -76 9 27 112 -88 -245 21 -104 -62 -104 -13 -32 139 -18
3174 -18 77 178 44 -197 -132 -147 81 -15 -162 97 178 -85 307 -75 28 35 102 12 124 139 29 346 45 25
3198 25 130 -119 159 4 120 129 94 13 -93 228 2 -74 57 55 48 -66 61 60 5 42 -110 -283 71 80 -98
3223 -98 -37 -133 -20 -291 -138 -248 -140 98 -218 -188 -238 34 -117 40 -95 -312 -277 -237 27 -86 -297 37
3245 37 -153 -166 -202 -51 83 -251 21 -79 -35 -202 113 -108 -31 -16 -24 244 326 -176 -19 -100 -115 83 -135 120
3269 120 81 89 124 250 111 55 50 15 -47 82 36 146 238 312 85 98 146 41 174 141 82 152 -147 142 93 -24
3295 -24 -131 -16 34 -39 106 -149 177 246 96 35 -178 -117 27 -128 200 -18 -26 -11 60 -326 -98 -26 -9 64
$$ packed form
3128G2j44J53K5j18k29M06l84K87L3k96K5j70Q9K17j26M5j01r8L97j10R1o4o5
3151f5k42j83N80k25L63l60K54n06L10kQ5J8Q5k00j57K66j25M2m2R1j9J71j57
3174a8R5J01j34k41O5j5K28r6j47K59Q1k63L92l82J03PO7r0J12J5j10L17l01k0
3198B5J05k49K78j55J16Rl5q1j06L21k26p6J31kpj14J27jn5L7j52j73L54Rj78
3223i8O1r6J13k71J53j10J08K38l16L0n0K72j51J57j35k17L5M0K64j13k11L34
3245C7j90j3l6J51J34l34K72j00M4j67L15k21P7J5qK68Q2n02J57q1j5J98k18K55
3269A20l9QL5J26j39n6nl5o2J29m6J10R2P4k27J3M8j05J33l3n9P0k99K89m9j17
3295b4j07J15N0p3J45k55L26O9j50o1k13O1J44j55L28k18qJ5P1l86K28P2J7P3
$$ plain form
3319 64 -82 35 -110 79 -26 -25 -156 93 5 -208 -268 -139 -9 -67 -284 -33 -257 -123 -51 104 -70 103
3341 103 -174 242 119 -77 -250 -26 -170 142 142 60 31 -39 48 -209 181 248 190 94 259 -165 99 99 -27 202
3365 202 91 56 126 -61 170 136 172 40 -54 160 -28 147 29 -134 108 -3 -111 -25 110 27 192 -50
3387 -50 185 18 183 25 135 -102 -108 99 -33 115 -133 -254 98 -205 -137 -251 -76 153 -279 111 -53
3408 -53 297 -121 -206 -162 -120 -48 -270 -260 168 9 -379 -76 128 -178 -66 -240 4 -38 -262 -30 -93 -51 -230
3431 -230 145 -49 37 -118 -108 -254 299 -105 88 -70 -58 -235 -217 121 17 122 206 -214 -86 -51 -44 58 258
3454 258 145 -79 205 -144 146 245 240 22 117 -122 -27 -143 221 -14 51 58 -8 73 -47 126 -55 78 35 -53
3478 -53 -188 -47 92 -229 110 -23 -78 17 -103 158 67 -173 -136 40 -123 -71 158 77 81 -3 -256 -166 133 99
$$ packed form
3319F4j46J17j45J89j05Jj31K49q8k13o0J29J30n8k17K51k24J34P2J55j74J73
3341A03k77M16j23j96j73K24j44L12%q2k9p0Q7k57L90O7n8r6J65m24K64%j26K29
3365B02j11l5P0j87K31l4L6j32r4K14j88J75j18j63K42j11j08Q6J35q3J65k42
3387e0K35j67J65j58J10k37oK07j32J48k48j21L52l03O8j14J75K29m32L90j64
3408e3L50m18q5M4M2P2k22J0M28j59l88L03K04l06J12j74K44m2k24K32o3M2j79
3431b30L75j94Q6j55J0j46N53m04J93j58J2j77J8L38j04J05Q4m20J28L5PJ02K00
3454B58j13k24K84l49K90R9nk18R5k39R5j16L64k35O5Po6Q1j20J73j81J33m3q8
3478e3j35J41J39l21L39j33n5R5j20K61r1k40L7J76j63N2K29q1Mq4k53R0K99l4
$$ plain form
3502 99 -309 -100 -72 -175 -51 -40 -2 -182 -408 -263 18 -444 -90 117 -5 173 88 12 98 -46 -54 -40 -88 -178
3526 -178 158 -30 149 77 -36 63 250 -88 -55 99 58 295 244 81 -171 14 193 -108 -155 50 141 90 113
3549 113 -15 45 50 234 64 140 147 328 -69 21 185 -25 -33 7 189 -37 192 -213 133 -198 66 165 42 -34
3573 -34 133 -32 -207 97 52 -99 279 200 -32 -253 -68 -152 7 67 77 -123 61 280 -44 -217 15 4
3595 4 -103 -12 -37 -142 -261 -48 -77 -64 -278 -245 -178 -50 77 -77 -116 -134 -162 -97 20 4 15 -301 101 121 -131
3620 -131 20 212 -205 -52 -29 9 -117 122 41 -111 -97 178 -43 199 3 13 108 130 -47 -142 -81 141 -104
3643 -104 -175 326 81 69 -51 39 -110 -81 -45 7 229 103 -213 239 9 131 -78 -257 -34 -52 -75 -99 60
3666 60 172 -26 -127 114 -51 105 -105 72 -151 -54 127 -82 94 -112 143 153 17 -83 -325 -24 -21 36
$$ packed form
3502I9m08K09K8j03J24J1L8j80k26J45K81m62L54K07j22J78q5p6Q6j44qJ4m8r0
3526a78L36j88J79p2j13R9J87l38L3J54m1K37n1j63k52J85J79l01m7K05R1n1K3
3549A13j28O0NJ84j70P6PJ81l97R0J64k10qM0J82k26K29m05L46l31K64R9j23p6
3573c4J67j65j75L04m5j51L78p9k32k21J85q4J59O0J0k00J84K19l24j73K32j1
3595Dj07R1k5j05j19K13k9J3k14L3O7J28J27j54l9j8k8O5J17j6J1l16M02K0k52
3620a31J51J92m17J53K3L8j26K39q1j52J4K75k21K42j96J0R5K2j77r5O1K22k45
3643a04p1N01k45j2j20R0j49K9L6N2K22j26l16M52k30J22k09j79K23j8k3k4J59
3666F0J12j98j01K41j65J56k10J77k23R7J81k09J76k06K55J0j36j00k42L01LN7
$$ plain form
3688 36 -231 114 -196 -196 -165 103 -110 -246 -94 -97 -392 -34 -156 -73 -64 123 80 -15 70 -33 -130 221 -41 -1 257
3713 257 -118 -45 41 -1 96 -84 270 193 -82 266 99 115 16 281 42 219 -222 59 194 -36 108 206 -160
3736 -160 71 -106 -55 178 93 72 68 179 274 -92 52 41 263 -137 15 -117 -99 -164 -14 -171 55 -173 253
3759 253 -16 -104 -206 -3 -21 -190 -89 84 -205 -51 -55 -47 -11 121 106 -238 -63 -113 157 71 84 -353 -51 127
3783 127 -150 -124 186 -253 -169 -25 -8 -105 95 43 -283 -57 -108 -67 -164 -80 282 -213 -116 -230 116 90 -76 -40
3807 -40 89 181 239 167 -122 29 -63 13 104 81 -275 138 60 32 50 344 65 186 209 -3 148 1 167 -107
3831 -107 20 -23 201 21 29 26 -68 60 79 28 -51 -152 29 -91 269 -186 -181 107 315 -26 21 19 52 -4 -368
3856 -368 -32 177 -22 -137 -277 180 -26 5 -93 -217 123 -171 -233 -102 -107 42 146 -44 -5 14 5 -112 -43
$$ packed form
3688C6k67L45l10%L1K68k13j36J52lk95L58j22Q3RJ87m3r5Q5j03r7L51k62M0K58
3713B57l75P3Q6m2R7j80L54p7k75L48j67J6r9K65k39J77m41K81J35k30J44R8l66
3736a60K31j77N1K33q5k1mJ11R5l66J44j1K22m00J52j32J8o5J50j57K26k28M26
3759B53k69q8j02K03j8j69J01J73k89J54mQL6J32j5l44J75n0K70q6J3m37L02J78
3783A27k77K6L10m39Q4J44J7r7K00n2l26K26n1M1r7Q4L62m95R7j14L46k6j66L6
3807d0J29R2N8p2k89J51r2P6R1k3l56M13p8k8J8K94k79J21K3k12J51j47J66k74
3831a07J27m3K24j80Qlr4J28J9n1p9j01J81j20L60m55NK88K08l41M7kL3n6l64
3856c68L36K09j99j15j40M57k06L1r8j24L40k94o2J31nJ49J04j90L9J9rj17O9
$$ plain form
3879 -43 0 -98 -69 100 -136 42 236 16 44 7 58 22 192 3 113 -16 -134 14 168 14 -227 30 -252
3902 -252 83 22 6 64 211 -78 108 -3 131 -192 141 72 -52 125 20 185 -12 272 137 -87 13
3923 13 54 83 -41 95 -58 129 18 24 -112 -65 3 71 52 -151 -74 79 -10 68 32 -53 -307 27 6 15 203 -9
3949 -9 4 63 -123 -80 -99 31 -74 -445 20 183 44 85 -37 -74 -108 159 -32 -144 -153 -359 -111 -14 -185 81
3973 81 -53 -1 -12 337 -41 -103 -63 70 -251 -20 45 -68 134 28 -221 13 183 233 -1 84 79 -209 198
3996 198 -86 -4 -16 261 16 4 82 27 -132 163 430 128 104 63 293 -53 258 17 121 -54 73 145 -129
4019 -129 199 306 -100 122 85 -159 210 111 8 43 194 -75 -7 -133 -67 -82 139 -150 -91 164 -69 -120 -229
4042 -229 155 -223 96 -97 -170 192 70 110 -185 -223 -69 -157 -131 -18 -282 100 86 -290 -158 101 -183 71
$$ packed form
3879d3M3r8K9J69k36J78J94k20K8l7N1l6J70j89J10j29j18J48J54j54k41K57k82
3902b52L35o1j6N8J47k89J86j11J34l23L33o9j24J77j05J65j97K84j35k24J00
3923A3M1K9j24J36j53J87j11Oj36M7O8O8j9k03P7J53q9P8l6q5k54L34k1RJ88k12
3949iJ3N9j86M3j9J30j05l71M65J63j39M1j22l7l4K67j91j12rk06K48R7j71K66
3973H1j34N2j1L49l78o2M0J33l21K31O5j13K02j06k49K34J70N0k34Q5nk88M07
3996A98k84Q2j2K77k45j2P8n5j59K95K67l02k4m1K30l46L11k41J04j75J27P2k74
4019a29L28J07m06K22l7k44L69r9j03L5J51k69O8j26O6j5K21k89N9K55k33n1j09
4042b29L84l78L19j93p3L62j22M0k95l8J54q8K6J13k64L82j4l76J32K59k84K54
$$ [...]
8191A27
##END NTUPLES=NMR FID
##END=
