##TITLE=1H_LR-618-R3-CR20
 CDCl3, 8 sc, 
 29.06.2021
##JCAMPDX= 6.0         $$ Bruker NMR JCAMP-DX V2.0
##DATA TYPE= NMR FID
##DATA CLASS= NTUPLES
##ORIGIN= UXNMR, Bruker Analytische Messtechnik GmbH
##OWNER= root
$$ XWIN-NMR		Version 3.5
$$ Tue Jun 29 13:33:34 2021 Russian Standard Time (UT+4h)  she@DPX200
##.OBSERVE FREQUENCY= 200.131506
##.OBSERVE NUCLEUS= ^1H
##.DELAY= (6, 6)
##.ACQUISITION MODE= SIMULTANEOUS
##.ACQUISITION SCHEME= undefined
##.AVERAGES= 8
##.DIGITISER RES= 18
##SPECTROMETER/DATA SYSTEM= spect
##.PULSE SEQUENCE= zg30
##.SOLVENT NAME= CDCl3
##.SHIFT REFERENCE= (INTERNAL, CDCl3, 0, 15.7039)
##AUDIT TRAIL= $$ (NUMBER, WHEN, WHO, WHERE, WHAT)
$$ ##TITLE= Audit trail, XWIN-NMR		Version 3.5
$$ ##JCAMPDX= 5.01
$$ ##ORIGIN= Bruker BioSpin GmbH
$$ ##OWNER= she
$$ F:/spectra/data/she/nmr/H-F/1/audita.txt
$$ ##AUDIT TRAIL=  $$ (NUMBER, WHEN, WHO, WHERE, WHAT)
(   1,<2021-06-29 13:31:49.03 +0400>,<she>,<DPX200>,
      <created by zg, POWCHK disabled, PULCHK disabled
       configuration hash MD5:
       00 E9 B6 7A A2 85 ED C7 34 08 36 98 17 FE 4E 26
       data hash MD5: 16K
       F1 DD C7 7E A9 16 19 24 14 C0 CF 04 6F 51 66 A4>)
$$ ##END=
$$ 
$$ hash MD5
$$ 76 42 0C 43 3D F8 10 D4 38 09 74 28 45 23 F9 D6
##$RELAX= 
##$RELAX= 
##$RELAX= 
##$RELAX= 
##$RELAX= 
##$RELAX= 
$$ Bruker specific parameters
$$ --------------------------
##$DU= <F:/spectra>
##$EXPNO= 1
##$NAME= <H-F>
##$PROCNO= 1
##$TYPE= <nmr>
##$USER= <she>
##$AMP= (0..31)
100 100 100 100 100 100 100 100 100 100 100 100 100 100 100 100 100 100 
100 100 100 100 100 100 100 100 100 100 100 100 100 100 
##$AQSEQ= 0
##$AQ_mod= 1
##$AUNM= <au_zg>
##$AUTOPOS= <>
##$BF1= 200.13
##$BF2= 200.13
##$BF3= 200.13
##$BF4= 200.13
##$BF5= 200.13
##$BF6= 200.13
##$BF7= 200.13
##$BF8= 200.13
##$BYTORDA= 1
##$CFDGTYP= 0
##$CFRGTYP= 5
##$CHEMSTR= <none>
##$CNST= (0..31)
1 1 145 1 1 1 1 1 1 1 1 1 1 1 1 1 1 1 1 1 1 1 1 1 1 1 1 1 1 1 1 1 
##$CPDPRG= <>
##$CPDPRG1= <>
##$CPDPRG2= <>
##$CPDPRG3= <>
##$CPDPRG4= <mlev>
##$CPDPRG5= <mlev>
##$CPDPRG6= <mlev>
##$CPDPRG7= <mlev>
##$CPDPRG8= <mlev>
##$CPDPRGB= <>
##$CPDPRGT= <>
##$D= (0..31)
0 1.2 0 0 0 0 0 0 0 0.06 0 0.03 0 0 0 0 0.0002 0 0 0 0 0 0 0 0 0 0 0 0 
0 0 0 
##$DATE= 1624959108
##$DBL= (0..7)
120 120 120 120 120 120 120 120 
##$DBP= (0..7)
150 150 150 150 150 150 150 150 
##$DBP07= 0
##$DBPNAM0= <>
##$DBPNAM1= <>
##$DBPNAM2= <>
##$DBPNAM3= <>
##$DBPNAM4= <>
##$DBPNAM5= <>
##$DBPNAM6= <>
##$DBPNAM7= <>
##$DBPOAL= (0..7)
0.5 0.5 0.5 0.5 0.5 0.5 0.5 0.5 
##$DBPOFFS= (0..7)
0 0 0 0 0 0 0 0 
##$DE= 6
##$DECBNUC= <off>
##$DECIM= 32
##$DECNUC= <off>
##$DECSTAT= 4
##$DIGMOD= 1
##$DIGTYP= 9
##$DL= (0..7)
0 120 120 120 120 120 120 120 
##$DP= (0..7)
150 150 150 150 150 150 150 150 
##$DP07= 0
##$DPNAME0= <>
##$DPNAME1= <>
##$DPNAME2= <>
##$DPNAME3= <>
##$DPNAME4= <>
##$DPNAME5= <>
##$DPNAME6= <>
##$DPNAME7= <>
##$DPOAL= (0..7)
0.5 0.5 0.5 0.5 0.5 0.5 0.5 0.5 
##$DPOFFS= (0..7)
0 0 0 0 0 0 0 0 
##$DQDMODE= 0
##$DR= 18
##$DS= 0
##$DSLIST= <SSSSSSSSSSSSSSS>
$$ [...]
##$SUBNAM2= <"">
##$SUBNAM3= <"">
##$SUBNAM4= <"">
##$SUBNAM5= <"">
##$SUBNAM6= <"">
##$SUBNAM7= <"">
##$SUBNAM8= <"">
##$SUBNAM9= <"">
##$SW= 20.0188882624521
##$SWIBOX= (0..15)
0 0 2 0 0 0 0 0 0 0 0 0 0 0 0 0 
##$SW_h= 4006.41025641026
##$TD= 16384
##$TD0= 1
##$TE= 0
##$TE2= 300
##$TE3= 300
##$TEG= 300
##$TL= (0..7)
0 120 120 120 120 120 120 120 
##$TP= (0..7)
150 150 150 150 150 150 150 150 
##$TP07= 0
##$TPNAME0= <>
##$TPNAME1= <>
##$TPNAME2= <>
##$TPNAME3= <>
##$TPNAME4= <>
##$TPNAME5= <>
##$TPNAME6= <>
##$TPNAME7= <>
##$TPOAL= (0..7)
0.5 0.5 0.5 0.5 0.5 0.5 0.5 0.5 
##$TPOFFS= (0..7)
0 0 0 0 0 0 0 0 
##$TUNHIN= 0
##$TUNHOUT= 0
##$TUNXOUT= 0
##$USERA1= <user>
##$USERA2= <user>
##$USERA3= <user>
##$USERA4= <user>
##$USERA5= <user>
##$V9= 5
##$VALIST= <valist>
##$VCLIST= <CCCCCCCCCCCCCCC>
##$VD= 0
##$VDLIST= <DDDDDDDDDDDDDDD>
##$VPLIST= <PPPPPPPPPPPPPPP>
##$VTLIST= <TTTTTTTTTTTTTTT>
##$WBST= 1024
##$WBSW= 4
##$XGAIN= (0..3)
0 0 0 0 
##$XL= 0
##$YL= 0
##$YMAX_a= 326731
##$YMIN_a= -618161
##$ZGOPTNS= <>
##$ZL1= 120
##$ZL2= 120
##$ZL3= 120
##$ZL4= 120
##$ABSF1= 10
##$ABSF2= 0
##$ABSG= 5
##$ABSL= 3
##$ALPHA= 0
##$AQORDER= 0
##$ASSFAC= 0
##$ASSFACI= 0
##$ASSFACX= 0
##$ASSWID= 0
##$AUNMP= <proc_1d>
##$AZFE= 0.1
##$AZFW= 0.1
##$BCFW= 1
##$BC_mod= 2
##$BYTORDP= 1
##$COROFFS= 0
##$CY= 11.3945322036743
##$DATMOD= 1
##$DC= 2
##$DFILT= <>
##$DTYPP= 0
##$F1P= 15.9154993809931
##$F2P= -4.1035820241983
##$FCOR= 0.5
##$FTSIZE= 0
##$FT_mod= 4
##$GAMMA= 1
##$GB= 0.15
##$INTBC= 1
##$INTSCL= 1
##$ISEN= 128
##$LB= 0.24
##$LEV0= 0
##$LPBIN= 0
##$MAXI= 10000
##$MC2= 0
##$MEAN= 0
##$ME_mod= 0
##$MI= 1.114404
##$NCOEF= 0
##$NC_proc= 0
##$NLEV= 6
##$NOISF1= 3.799351
##$NOISF2= 2.8
##$NSP= 1
##$NTH_PI= 0
##$NZP= 0
##$OFFSET= 15.70392
##$PC= 1
##$PHC0= -11933.11
##$PHC1= 29.40101
##$PH_mod= 1
##$PKNL= yes
##$PPARMOD= 0
##$PSCAL= 0
##$PSIGN= 0
##$REVERSE= no
##$SF= 200.130013532006
##$SI= 16384
##$SIGF1= 3
##$SIGF2= 2
##$SINO= 400
##$SIOLD= 16384
##$SREGLST= <1H.CDCl3>
##$SSB= 0
##$STSI= 0
##$STSR= 0
##$SW_p= 3612.71676300578
##$SYMM= 0
##$S_DEV= 0
##$TDeff= 0
##$TDoff= 0
##$TI= <>
##$TILT= no
##$TM1= 0
##$TM2= 0
##$TOPLEV= 0
##$USERP1= <user>
##$USERP2= <user>
##$USERP3= <user>
##$USERP4= <user>
##$USERP5= <user>
##$WDW= 1
##$XDIM= 8192
##$YMAX_p= 0
##$YMIN_p= 0
$$ End of Bruker specific parameters
$$ ---------------------------------
##NTUPLES= NMR FID
##VAR_NAME=  TIME,          FID/REAL,        FID/IMAG
##SYMBOL=    X,             R,               I
##VAR_TYPE=  INDEPENDENT,   DEPENDENT,       DEPENDENT
##VAR_FORM=  AFFN,          ASDF,            ASDF
##VAR_DIM=   8192,          8192,            8192
##UNITS=     SECONDS,       ARBITRARY UNITS, ARBITRARY UNITS
##FACTOR=    0.0002496,     1,               1
##FIRST=     0,             0,               0
##LAST=      2.0444736,     0,               0
##MIN=       0,             -618161,         0
##MAX=       2.0444736,     326731,          0
$$ Real data points
##PAGE= N=1
##DATA TABLE= (X++(R..R)), XYDATA
$$ plain form
0 0 0 0 0 0 0 0 0 6 -8 8 -8 8 -16 16 -24 32 -38 45 -56 64 -80 96 -112 134 -158 184 -213 247 -286 327
30 327 -374 428 -486 551 -624 703 -788 883 -987 1103 -1228 1365 -1515 1680 -1859 2054
46 2054 -2266 2501 -2756 3036 -3342 3684 -4061 4479 -4945 5472 -6070 6754 -7544 8472
60 8472 -9582 10930 -12616 14788 -17707 21859 -28268 39545 -65200 249247 -204392 -428549
72 -428549 326731 14342 -155720 214016 151216 -268207 -109204 85773 49295 133249 63576
83 63576 -287230 -55761 170769 -71735 70180 187114 -271628 -177132 238651 62715
93 62715 -84991 119083 -36184 -252224 79534 246644 -102547 -52198 74191 -225561
103 -225561 -31019 320094 -43048 -178192 89273 -46950 -122738 169768 131749 -161850
$$ packed form
0@%%%%%%%Oj4J6j6J6k4L2m0N6p0Q3j01J20j44J76k08K46k92L42l97M60n33O13
30C27p01Q02r14J037j175J327j491J671j870K090k331K593k880L195l539L913
46B054m320M767n257N792o378P026p745Q540r424J0417j1542J2824j4298J6016
60H472j8054K0512k3546K7404l2495L9566n0127O7813j04745L14447m53639k24157
72d28549P55280l12389j70062L69736o2800m19423J59003J94977l6478Q3954o9673
83F3576l50806K31469K26530k42504J41915J16934m58742R4496M15783j75936
93F2715j47706K04074j55267k16040L31758J67110l49191N0349J26389k99752
103b25561J94542L51113l63142j35144K67465j36223p5788K92506l8019k93599
$$ plain form
113 -161850 -84685 55679 -57253 75624 168880 -168436 -125178 141908 -58594 -29104 205969
124 205969 -64873 -211880 72810 99554 -56905 42265 62083 -155498 -54825 166578
134 166578 -8933 -40277 88541 -120050 -91840 175643 23786 -91615 62685 -13977
144 -13977 -117681 67592 140584 -68521 -80890 63809 -41039 -25563 142185 -28673 -106369
155 -106369 64095 -18781 -44606 119395 19332 -119447 1450 69919 -30890 -617 83820
166 83820 -64385 -91354 94721 20792 -48886 69694 -31222 -87780 67104 35878 -41256
177 -41256 26993 7910 -72076 -541 90081 -18518 -63345 52575 -19436 -64558 84533
188 84533 21358 -73343 23311 -118 -39228 43676 28629 -45407 -21461 30159 -12212 -21662
$$ packed form
113a61850P7165J40364j12932J32877R3256l37316M3258K67086k00502K9490K35073
124B05969k70842j47007K84690K6744j56459R9170J9818k17581J00673K21403
134A66578j75511l1344J28818k08591K8210K67483j51857j15401J54300p6662
144a3977j03704J85273P2992k09105j2369J44699j04848J5476J67748j70858p7696
155a06369J70464q2876k5825J64001j00063j38779J20897O8469j00809L0273Q4437
166H3820j48205k6969J86075p3929o9678J18580j00916n6558J54884l1226p7134
177d1256O8249j9083p9986P1535R0622j08599m4827J15920p2011m5122J49091
188H4533o3175r4701R6654k3429l9110Q2904j5047p4036K3946N1620m2371r450
$$ plain form
200 -21662 57923 -12039 -73499 44871 18013 -44590 45018 4330 -58927 18676 25559 -17659
212 -17659 2048 18311 -21422 -30475 41576 14885 -43827 28403 5821 -48730 37509 22379
224 22379 -35126 14544 3322 -22119 14388 19968 -7952 -17711 16474 4537 -26680 33499
236 33499 14916 -46456 21051 19463 -29248 20485 12875 -21680 3185 7716 2205 -1777 6483
249 6483 4240 -20328 14866 16008 -27750 18182 12158 -33406 18330 15598 -20098 7049 4237
262 4237 -6207 -2531 3089 10233 -14068 -289 13990 -20176 8397 13838 -25463 10094 7791
275 7791 -20179 12194 3339 -10856 2172 -2359 3596 -6692 -2899 12166 -16721 -239 15348
288 15348 -19252 4530 9228 -18087 7815 2245 -9445 7019 -4937 -397 1263 -6047 8765
$$ packed form
200b1662P9585o9962o1460J18370k6858o2603Q9608m0688o3257P7603O883m3218
212a7659J9707J6263l9733r053P2051k6691n8712P2230k2582n4551Q6239j5130
224B2379n7505M9670j1222k5441L6507N580k7920r759L4185j1937l1217O0179
236C3499j8583o1372O7507j588m8711M9733p610l4555K4865M531n511l982Q260
249F483k243k4568L5194J142m3758M5932o024m5564N1736k732l5696K7147k812
262D237j0444L676N620P144k4301J3779J4279l4166K8573N441l9301L5557k303
275G791k7970L2373q855j4195J3028m531N955j0288L793J5065k8887J6482J5587
288A5348l4600K3782M698k7315K5902n570j1690J6464j1956M540J660p310J4812
$$ plain form
301 8765 -8221 -3170 13780 -15160 2446 13050 -16192 5680 6255 -9886 7758 -2724 -520
314 -520 5841 -7843 7252 192 -6456 11876 -7711 -684 12764 -12489 5359 8567 -11251
327 -11251 8553 1194 -4149 7643 -5342 5259 3482 -8296 11546 -3160 -5830 12852 -8233
340 -8233 1175 8748 -10554 7838 2603 -8062 9044 -3585 -998 5385 -7428 7600 -1336
353 -1336 -8167 12461 -7117 -4264 10613 -10014 2184 4234 -9009 6904 -2825 -4600 6719
366 6719 -7889 2086 1919 -8792 7973 -4900 -5780 10286 -9999 -1590 7698 -10537 2466 1267
380 1267 -5762 5389 -6290 581 4455 -9700 5778 -530 -7659 9599 -7088 -2866 9931
393 9931 -10449 1632 6027 -7452 4502 -1125 -1270 4585 -7189 5856 2105 -9385 10693
$$ packed form
301H765j6986N051J6950k8940J7606J0604k9242K1872N75j6141J7644j0482K204
314e20O361j3684J5095p060o648J8332j9587P027J3448k5253J7848L208j9818
327a1251J9804p359n343J1792j2985J0601j777j1778J9842j4706k670J8682k1085
340h233R408P573j9302J8392n235j0665J7106j2629K587O383j2813J5028q936
353a336o831K0628j9578K853J4877k0627J2198K050j3243J5913r729j775J1319
366F719j4608R975j67j0711J6765j2873q80J6066k0285Q409R288j8235J3003j199
380A267p029J1151j1679O871L874j4155J5478o308p129J7258j6687M222J2797
393I931k0380J2081M395j3479J1954n627j45N855j1774J3045l751j1490K0078
$$ plain form
406 10693 -2599 -5901 11884 -6094 -433 7857 -7518 4567 2556 -3946 5673 -3070 2764 3183
420 3183 -6850 10337 -1305 -8636 13189 -3914 -4518 10816 -5710 -36 4888 -4153 4916 -1564
434 -1564 -28 3530 -6767 7091 1526 -8766 10469 -3838 -7049 12220 -5641 -3270 7142
447 7142 -6209 222 1595 -676 1917 -7324 3959 2167 -10110 9345 -1014 -10926 9382 -4540
461 -4540 -4816 9091 -7082 -2775 3344 -3267 1666 -2824 1618 192 -10212 8620 1764 -11544
475 -11544 9612 -3236 -9714 10686 -2629 -3419 3996 -5184 728 663 1340 2768 -7803 4168
489 4168 1774 -8810 12405 -7 -12272 9946 -820 -5200 9372 -1560 -2825 256 151
502 151 5028 -2447 3321 1335 -10155 9416 4289 -8682 10831 -2411 -9893 10611 1297 -2446
$$ packed form
406A0693j3292l302J7785j7978N661Q290j5375J2085k011o502R619q743N834M19
420C183j0033J7187j1642p331K1825j7103o04J5334j6526N674M924r041R069o480
434a564J536L558j0297J3858n565j0292J9235j4307l211J9269j7861K371J0412
447G142j3351O431J373k271K593r241J1283j792j2277J9455j0359r912K0308j3922
461d540k76J3907j6173M307O119o611M933m490M442j426j0404J8832o856j3308
475a1544K1156j2848o478K0400j3315p90P415r180N912o5O77J428j0571J1971
489D168k394j0584K1215j2412j2265K2218j0766m380J4572j0932j265L081j05
502A51M877p475N768j986j1490J9571n127j2971J9513j3242p482K0504r314l743
$$ plain form
516 -2446 3766 -2957 -490 -731 5260 4721 -8922 4060 2160 -9612 12259 3259 -11637 6289
530 6289 -1462 -4455 8295 -629 -2616 -2624 -800 4356 -3197 4486 967 -13319 7122 4599 -9397
545 -9397 9193 -1510 -12140 6022 1927 -1113 1377 -3650 -1653 -4597 4447 6053 -9377 2234
559 2234 244 -10999 11158 4078 -11348 4084 -2247 -5565 6438 2405 -1505 -6101 -1651 4757
573 4757 -3429 5281 3042 -13004 4269 4454 -6489 9809 -331 -10864 4135 2570 1019 2471
587 2471 -867 -601 -6220 4661 9423 -7101 2488 2096 -10556 8862 6613 -6647 3709 -2132
601 -2132 -4117 5706 3422 2173 -4526 -1988 4365 -3941 6607 6139 -12400 2508 4510 -6076
615 -6076 8908 2168 -8985 687 685 2469 2124 -199 688 -8368 1704 8873 -6308 2554 1771 -11420
$$ packed form
516b446O212o723K467k41N991n39j3643J2982j900j1772K1871r000j4896J7926
530F289p751k993J2750q924j987qJ824N156p553P683l519j4286K0441k523j3996
545i397J8590j0703j0630J8162m095l040K490n027J997k944R044J606j5430J1611
559B234j990j1243K2157p080j5426J5432o331l318J2003m033l910m596M450O408
573D757q186Q710k239j6046J7273J85j0943J6298j0140j0533J4999j565j551J452
587B471l338K66n619J0881M762j6524R589l92j2652J9418k249j3260J0356n841
601b132j985R823k284j249o699K538O353q306J0548m68j8539J4908K002j0586
615f076J4984o740j1153R672kJ784l45k323Q87r056J0072P169j5181Q862p83j3191
$$ plain form
631 -11420 5275 5312 -5179 3272 -2861 -5716 2295 2732 3189 -5115 -3175 3021 -6055 4368 7114
646 7114 -10267 -296 1962 -6143 6537 2300 -6327 -821 -1972 1531 1298 106 1927 -8147 -947
661 -947 7985 -4818 2834 3120 -10266 3057 4795 -2484 3579 -1448 -3684 788 1357 5541 -2498
676 -2498 -2471 3575 -5691 3520 8035 -7240 991 2425 -5424 5792 3156 -2364 258 -2352 2384
691 2384 1487 603 4662 -5825 -1591 6719 -4064 3231 4145 -7844 1738 3122 -1831 3922 -1068
706 -1068 -1670 -372 -1065 5393 -1740 -2240 3588 -6191 975 6561 -5407 769 1230 -5408 3080 1206
722 1206 -1286 410 -3599 1231 -106 -1413 4615 -5100 -2881 4720 -4851 1808 3693 -6331 873
737 873 847 -2276 2870 -1617 -504 -609 -2902 4200 -1354 -2379 3982 -4952 -303 4802 -4435 1457
$$ packed form
631a1420J6695L7j0491Q451o133k855Q011M37M57q304J940O196r076J0423K746
646G114j7381R971K258q105J2680m237q627N506j151L503k33j192J821j0074P200
661i47Q932j2803P652K86j3386J3323J738p279O063n027k236M472N69M184q039
676b498K7O046r266R211M515j5275Q231J434p849J1216k636n520K622k610M736
691B384q97q84M059j0487M234Q310j0783P295R14j1989R582J384m953N753m990
706a068o02J298o93O458p133n00N828r779P166N586j1968O176M61o638Q488j874
722A206k492J696m009M830j337j307O028r715K219P601r571O659J885j0024P204
737H73k6l123N146m487J113j05k293P102n554j025O361q934M649N105r237N892
$$ plain form
753 1457 1335 -3915 2526 193 -248 1562 -3130 2153 -62 -2107 5050 -2914 -1899 4612 -3696 1907
769 1907 3377 -3808 2001 421 -1252 2928 -1668 1051 787 -2940 4125 -598 -1774 4792 -3420
784 -3420 -197 4185 -3149 1917 1113 -2618 2682 -760 274 2153 -3151 2303 112 -2399 4174
799 4174 -2046 -1742 3550 -3445 1124 2067 -3363 2007 -934 -1299 2541 -2634 1011 703 -3693 3050
815 3050 -966 -2559 3568 -2979 -410 2571 -3305 1602 -104 -2936 2151 -1907 -100 1944 -3826
830 -3826 1747 -81 -2970 3580 -1842 -1582 3142 -3235 784 1198 -2918 2094 -1009 -1370 2457 -2405
846 -2405 950 1445 -3235 2829 -460 -1770 3116 -2214 171 2301 -2572 2370 268 -1944 3372
861 3372 -1780 128 2343 -2950 2161 891 -2337 3072 -1131 -552 2778 -2129 1412 1062 -2140 3250
$$ packed form
753A457j22n250O441k333m41J810m692N283k215k045P157p964J015O511q308N603
769A907J470p185N809j580j673M180m596K719k64l727P065m723j176O566q212
784c420L223M382p334N066q04l731N300l442J034J879n304N454k191k511O573
799D174o220L04N292o995M569R43n430N370k941l65L840n175L645l08m396O743
815C050m016j593O127o547K569K981n876M907j706k832N087m058J807K044n770
830c826N573j828k889O550n422K60M724o377M019M14m116N012l103l61L827m862
846b405L355M95m680O064l289j310M886n330K385K130m873M942k102k212N316
861C372n152J908K215n293N111j270l228N409m203N79L330m907L541l50l202N390
$$ plain form
877 3250 -1212 -990 3233 -2704 908 1600 -2989 2501 -201 -1634 2692 -2195 467 1718 -2777 2371
893 2371 -438 -1933 2904 -2293 -17 2185 -3400 1650 442 -2568 2179 -1746 -651 1877 -3059
908 -3059 1396 393 -2786 2562 -1336 -1144 2370 -3269 473 1013 -2905 1962 -707 -1404 2209 -2394
924 -2394 331 1329 -2533 2183 -534 -2061 2643 -2114 -53 2162 -2565 1509 247 -1760 2881
939 2881 -1465 -416 2134 -2346 1570 618 -2229 2699 -1110 -607 2790 -2518 1482 1191 -2263 2360
955 2360 -537 -726 2605 -2033 835 1659 -2170 2399 -131 -1289 2545 -1953 492 2051 -2390 1822
971 1822 267 -1874 2219 -1789 -225 1940 -2331 1266 285 -2081 2152 -1325 -263 1925 -2725
986 -2725 1000 793 -2600 2083 -781 -1539 2097 -2099 210 904 -2273 1392 -1049 -1414 2142 -1917
$$ packed form
877C250m462K22M223n937L612O92m589N490k702j433M326m887K662J251m495N148
893B371k809j495M837n197K276K202n585N050j208l010M747l925J095K528m936
908c059M455j003l179N348l898J92L514n639L742N40l918M867k669o97L613m603
924b394K725R98l862M716k717j527M704m757K061K215m727M074j262k007M641
939B881m346J049K550m480L916r52k847M928l809N03L397n308M000k91l454M623
955B360k897j89L331m638K868Q24l829M569k530j158L834m498K445J559m441M212
971A822j555k141M093m008J564K165m271L597r81k366M233l477J062K188m650
986b725L725k07l393M683k864p58L636m196K309O94l177L665k441l65L556m059
$$ plain form
1002 -1917 210 1177 -2755 1567 -368 -2307 2255 -1539 -758 1364 -2044 1275 57 -1603 1791
1017 1791 -1685 1 1991 -2720 1201 824 -2299 2062 -635 -1073 2154 -1777 569 961 -1547 1636
1033 1636 -882 -596 2510 -2021 800 1584 -2553 1982 285 -1615 2658 -970 -468 1791 -1345 1501
1049 1501 249 -884 2137 -1730 316 2254 -2420 1460 1167 -2240 2311 39 -1031 1677 -1277
1064 -1277 385 829 -1093 1820 -1173 -796 2183 -2221 892 1412 -2911 1477 451 -1951 1978 -1085
1080 -1085 -800 786 -1477 1272 -747 -1075 1574 -2208 -158 2156 -2470 894 863 -2355 1550 25
1096 25 -1104 1162 -1497 198 -12 -1089 1762 -1392 -973 1968 -2353 689 1667 -2386 963 421
1112 421 -1834 1804 -419 -185 345 -1320 1599 -700 -726 2220 -2266 148 2419 -2057 1109 1082 -2102
$$ packed form
1002a917K127R67l932M322j935j939M562l794P81K122l408L319j218j660L394
1017A791l476J686J990m711L921l77l123M361k697m38L227l931K346L92k508L183
1033A636k518K86L106m531K821P84m137M535j697j900M273l628N02K259l136K846
1049A501j252j133L021l867K046J938m674L880k93l407M551k272j070K708k954
1064a277J662M44j922K913k993L77K979m404L113N20m323M388j026k402L929l063
1080a085K85J586k263K749k019l28K649l782K050K314m626L364l1l218L905j525
1096B5j129K266k659J695k10j077K851l154M19K941m321L042R78m053L349n42
1112D21k255L638k223K34N30j665K919k299k6K946m486K414K271m476L166k7l184
$$ plain form
1129 -2102 1665 303 -349 1131 -1046 1018 280 -577 2272 -1370 -524 2214 -1989 955 1969 -2117
1145 -2117 1177 809 -747 1428 -155 443 119 -1352 1731 -761 -784 2370 -2304 -425 2251 -2170
1161 -2170 832 1017 -2094 730 -48 -125 900 -1260 869 -417 -1128 2099 -1313 -1077 1926 -2375
1177 -2375 137 1525 -1939 166 -117 -857 963 -624 298 -396 -1399 1667 -796 -1079 2066 -2094
1193 -2094 -342 2119 -1776 596 956 -1557 571 -340 -50 731 -1408 1258 -538 -1181 2349 -1000
1209 -1000 -612 1804 -1498 42 1530 -1486 720 98 -450 899 -779 1109 358 -1412 2217 -807
1225 -807 -702 2474 -1286 -140 1655 -1447 857 520 -1241 811 -493 477 809 -1030 1432 -52
1241 -52 -1338 2102 -655 -773 1646 -1610 -68 1088 -1253 639 -345 -452 670 -1248 811 312
$$ packed form
1129b102L767j362o52J480k177K064p38q57K849l642Q46K738m203K944J014m086
1145b117L294l68j556K175j583N98l24j471L083k492k3L154m674J879K676m421
1161b170L002J85l111K824p78p7J025k160K129j286p11L227l412K36L003m301
1177b375K512J388l464K105k83p40J820j587R22o94j003L066k463k83L145m160
1193b094J752K461l895K372L60k513K128r11K90P81k139K666j796o43L530l349
1209a000L88K416l302J540J488l016K206o22n48J349j678J888p51j770L629l024
1225h07J05L176l760J146J795l102K304l37j761K052j304R70L32j839K462j484
1241e2j286L440k757j18K419l256J542J156k341J892r84j07J122j918K059m99
$$ plain form
1257 312 -1822 1540 -536 -1071 1657 -1204 -861 1334 -1272 458 142 -1026 875 -910 186 275
1273 275 -1372 1069 -410 -1302 1802 -924 -770 1329 -1002 2 512 -1011 766 -442 -376 829
1289 829 -1106 840 482 -1441 1440 -478 -773 1482 -1028 -49 867 -1387 587 93 -357 1149 -846
1306 -846 249 918 -1058 1124 417 -1265 1669 -516 -355 1318 -905 518 734 -702 772 -470
1322 -470 -316 1155 -1001 943 670 -1583 1258 -210 -876 1580 -879 154 706 -716 728 -44
1338 -44 -626 749 -715 270 1080 -1328 1013 -158 -1179 1379 -516 -577 796 -1040 299 387 -795
1355 -795 915 -841 -426 954 -1171 389 466 -1293 870 -476 -682 1003 -941 81 567 -1319
1371 -1319 724 -566 -725 963 -863 62 394 -1426 625 -214 -820 989 -570 -77 1160 -1091
$$ packed form
1257C12k134L362k076n35K728k861L43K195k606J730l16j168J901j785J096Q9
1273B75j647K441j479q92L104k726J54K099k331J004N10j523J777j208O6J205
1289H29j935J946l58j923K881j918k95K255k510R79R16k254J974m94m50J506j995
1306h46J095O69j976K182p07j682K934k185J61J673k223J423K16j436J474j242
1322d70J54J471k156J944k73k253K841j468o66K456k459J033N52j422J444p72
1338d4n82J375j464R85Q10k408K341j171j021K558j895o1J373j836J339Q8j182
1355g95J710j756M15J380k125J560P7j759K163j346k06J685j944J022M86j886
1371a319K043j290j59J688j826R25L32j820K051q39o06J809j559M93J237k251
$$ plain form
1387 -1091 730 220 -710 978 -418 -72 976 -867 533 405 -874 1249 -233 -373 837 -583
1403 -583 388 591 -869 939 -133 -252 999 -687 351 471 -656 930 14 -554 988 -647 -64
1420 -64 740 -957 342 183 -679 805 -495 -65 968 -915 279 429 -1079 726 -411 -630 495
1437 495 -646 527 200 -1085 555 -331 -456 731 -797 -50 348 -971 478 -400 -749 893 -824
1454 -824 -254 577 -1029 274 142 -935 678 -498 -342 695 -961 469 57 -831 615 -350 -380
1471 -380 796 -712 224 255 -569 775 -341 -285 756 -697 69 475 -637 977 -19 -315 856 -533
1489 -533 64 779 -670 788 55 -620 956 -630 110 555 -691 892 199 -626 807 -317 -214
1506 -214 770 -646 54 569 -866 724 -276 -214 950 -640 45 297 -831 493 -106 -522 604
$$ packed form
1387a091J821n10r30J688j396L46J048j843J400j28j279K123j482j40J210j420
1403e83R71K03j460J808j072j19J251j686J038J20j127J586r16n68J542j635N83
1420f4Q04j697J299j59q62J484j300M30J033j883J194J50j508J805j137k19J125
1437D95j141J173l27j285J640q86j25J187j528P47L98j319J449q78l49J642j717
1454h24N70Q31j606J303j32j077J613j176J56J037j656J430m12q88J446r65l0
1471c80J176j508R36L1q24J344j116N6J041j453P66M06j112J614r96k96J171j389
1489e33N97P15j449J458p33o75J576j586P40M45j246J583o93q25J433j124J03
1506b14R84j416P00N15j435J590j000O2J164j590O85K52j128J324n99m16J126
$$ plain form
1523 604 -684 -137 661 -832 453 -100 -676 674 -641 26 566 -822 345 -83 -497 682 -333
1540 -333 -39 526 -871 -45 229 -869 740 -361 -353 576 -868 172 372 -688 834 -67 -213 540
1558 540 -359 84 139 -634 645 193 -346 724 -553 116 351 -510 326 227 -451 885 -229 -229 718 -541
1578 -541 187 52 -568 844 -67 -301 819 -593 208 374 -625 686 -66 -396 453 -487 48 253 -666
1597 -666 582 23 -484 758 -416 -112 617 -711 434 330 -734 648 -151 -166 345 -504 355 142
1615 142 -588 799 -310 -316 456 -751 66 312 -829 136 -145 -458 359 -191 -168 316 -645 388 -414
1634 -414 -572 567 -518 -166 393 -714 223 85 -357 194 -58 -56 353 -376 547 -166 -374 781 -217
1653 -217 -177 299 -418 0 436 -434 130 -151 233 220 -465 333 285 -490 450 -39 -413 851 -232 -104
$$ packed form
1523F04j288N47P98j493J285n53n76J350j315O67N40j388J167m28m14J179j015
1540c33K94N65j397Q26K74j098J609j101QR29j444J040K00j060J522r01j46P53
1558E40q99M43N5p73J279m52n39J070j277O69K35q61Q36r9o78J336j114%R47j259
1578e41P28j35o20J412r11k34J120j412Q01J66r99J311p52l30Q49r40N35K05r19
1597f66J248n59n07J242j174L04P29j328J145j04j064J382p99j5N11q49Q59k13
1615A42p30J387j109oP72j207Q17K46j141R65k81l13Q17n50K3M84r61J033q02
1634d14j58J139j085L52N59j107R37j38m42N51k52KM09p29R23p13k08J155r98
1653b17M0M76p17M18M36q70N64k81L84j3o85P98m8p75R40m89l74J264j083J28
$$ plain form
1673 -104 440 -538 332 272 -217 343 -599 92 198 -552 589 205 -704 710 -337 -311 694 -421 300
1692 300 390 -418 419 99 -161 369 -620 506 -198 -714 467 -17 -536 695 -161 -157 388 -438 133 245
1712 245 -372 506 -623 13 168 -617 311 -22 -267 355 -232 -408 465 -559 72 221 -215 292 -269
1731 -269 -171 355 -332 335 360 -487 351 -387 -483 703 -204 -106 459 -122 51 147 -126 321 -589 123 493
1752 493 -481 486 208 -566 351 -10 -99 413 -400 17 60 -326 377 -16 -57 319 -333 516 247 -617 415
1773 415 85 -533 394 -247 171 202 -170 310 24 -111 470 -192 -33 179 -390 197 -51 -346 357 -234
1793 -234 -238 388 -361 101 65 -351 288 -542 74 142 -400 338 39 -551 167 -134 -367 228 -288 -135 66
1814 66 -153 137 -249 -351 311 -373 50 264 -604 332 279 -408 488 -318 -71 158 -31 -28 61 -211 265 -37
$$ packed form
1673a04N44r78Q70o0m89N60r42O91J06p50J141l84r09J414j047K6J005j115P21
1692C00R0q08Q37l20k60N30r89J126p04n16J181m84n19J231q56MN45q26N71J12
1712B45o17Q78j129O36J55p85R28l33k45O22n87j76Q73j024O31J49m36N07n61
1731b69R8N26o87O67K5q47Q38p38r6J186r07R8N65n81J73R6k73M47r10P12L70
1752D93r74R67k78p74R17l61q9N12q13M17M3l86P03l93m1L76o52Q49k69q64J032
1773D15l30o18R27o41M18L1l72M80k86j35N81o62J59K12n69N87k48k95P03n91
1793b34mO26p49M62l6m16O39q30O16O8n42P38k99n90P18l01k33N95n16J53K01
1814F6k19K90l86j02O62o84M23K14q68R36n3o87Q96q06K47K29j89LQ9k72M76l02
$$ plain form
1836 -37 -78 555 -419 265 281 -202 306 118 -422 268 -513 171 195 -181 420 -106 -117 421 -323 -127 241 -326
1858 -326 312 213 -116 271 -191 -88 268 -94 198 109 -324 513 -283 191 298 -418 274 183 -205 405 349
1879 349 -69 30 -308 41 29 -265 231 63 -347 325 -393 3 60 -478 -92 270 -120 121 -30 132 291
1900 291 -463 183 -98 -356 349 -131 22 489 -143 237 -179 -403 208 -114 -12 208 -375 -154 9 -227
1920 -227 125 -163 95 397 -352 97 251 -356 244 -248 -239 320 -25 -189 227 3 156 -89 -212 254 -176
1941 -176 -15 551 -172 287 71 -337 147 59 -41 257 -125 179 357 -327 167 -76 -28 365 88 -13 299
1962 299 -54 539 -76 -363 78 -107 50 129 -265 226 -133 -249 245 -230 116 132 -416 37 31 -205 -14
1983 -14 -188 -108 74 -184 11 -43 -362 -39 -282 -28 152 -465 206 99 -99 449 -110 -106 101 -240 201 84
$$ packed form
1836c7m1O33r74O84J6m83N08j88n40O90p81O84K4l76O01n26j1N38p44J96L68n67
1858c26O38r9l29L87m62J03L56l62K92q9m33Q37p96M74J07p16O92r1l88O10n6
1879C49m18R9l38L49j2k94M96j68m10O72p18L96N7n38L86L62l90K41j51J62J59
1900B91p54O46k81k58P05m80J53M67o32L80m16k24O11l22J02K20n83K21J63k36
1920b27L52k88K58L02p49M49J54o07O00m92RN59l45j64M16k24J53k45j23M66m30
1941a76J61N66p23M59k16m08M84q8j00K98l82L04J78o84M94k43M8L93k77j01L12
1962B99l53N93o15k87M41j85J57P9l94M91l59j16M94m75L46J6n48M53ok36J91
1983a4j74Q0J82k58J95n4l19L23k43K54J80o17O71j07j98N48n59MK07l41M41j17
$$ plain form
2005 84 -242 409 181 32 394 64 313 292 -657 270 206 -119 249 116 317 371 -302 237 80 -25 248
2026 248 78 -96 373 -208 -35 114 -245 -18 -199 63 416 -214 18 429 -472 281 169 -170 160 -207
2046 -207 47 215 -368 245 -37 -137 54 -209 -321 367 138 174 198 -127 329 60 7 381 -48 156 -32
2067 -32 -369 216 50 -329 151 -251 -213 -127 -232 -59 -222 -325 -54 -130 55 594 -314 192 220 -131 -39 -190
2089 -190 -194 -103 -16 -16 51 -274 171 38 -190 150 16 -99 68 62 82 -217 -133 -80 -166 -8 45 -285 168 3 -279
2114 -279 70 -143 -110 133 -281 14 -86 37 322 -40 -51 185 44 146 118 -190 269 187 203 170 -234 62
2136 62 190 -144 147 -64 -103 96 -198 -204 21 -227 -44 62 -7 40 66 -220 -51 30 139 -160 -210 -32 -91
2159 -91 75 -73 -141 276 123 -253 -145 -148 -241 91 -367 274 -395 -358 22 252 0 -3 -94 81 -101 27 72
$$ packed form
2005H4l26O51k28j49L62l30K49k1r49R27o4l25L68j33K01N4o73N39j57j05K73
2026B48j70j74M69n81J73J49l59K27j81K62L53o30K32M11r01P53j12l39L30l67
2046b07K54J68n83O13k82j00J91k63j12O88k29L6K4l25M56k69n3L74m29K04j88
2067c2l37N85j66l79M80m02L8Q6j05J73j63j03K71p6J85N39r08N06K8l51R2j51
2089a90mR1Q7%O7l25M45j33k28L40j34j15J67oK0k99Q4N3q6J58N3l30M53j65k82
2114b79L49k13L3K43m14K95j00J23K85l62j1K36j41J02k8l08M59q2J6l3m04K96
2136F2J28l34K91k11l9J99k94oK25k48J83J06o9M7K6k86J69Q1J09k99n0J78n9
2159i1J66j48o8M17j53l76J08lr3L32m58O41o69L7L80K30k52lr1J75j82J28M5
$$ plain form
2182 72 -26 19 260 85 -132 20 -97 31 -66 -114 295 67 43 209 109 147 133 -105 77 32 -26 34 -13 444
2206 444 362 -105 201 -8 -249 217 -88 -251 -140 -73 -137 118 73 127 -11 16 -47 27 -81 -11 -3 135 83 101
2230 101 -82 -146 -113 -139 -125 108 -92 30 9 -197 88 0 38 50 -129 -235 397 -25 199 137 -332 -8 63
2253 63 -61 117 20 -61 210 -53 17 74 61 155 -155 27 76 -282 180 -162 -134 182 25 -76 47 -46 -82 -115
2277 -115 -140 -227 -19 -7 -14 38 89 110 -251 -38 104 -59 189 -115 276 265 -52 35 238 -97 -21 -162 34 -56
2301 -56 -83 33 -178 11 526 95 85 63 -181 -81 -198 199 215 -115 -212 254 -331 234 427 -213 -6 -99
2323 -99 167 217 47 84 64 -203 273 128 -6 143 64 -72 239 -286 -110 -151 208 -39 -10 -118 76 -212
2345 -212 -98 11 -344 220 4 -25 148 9 -11 217 -112 228 -290 41 -62 -73 182 24 68 162 -87 214
$$ packed form
2182G2r8M5K41j75k17J52j17J28r7m8M09k28k4J66j00L8j4k38J82m5n8O0m7M57
2206D44q2m67L06k09k41M66l05j63J11O7o4K55m5N4j38K7o3P4j08P0QJ38n2J8
2230A01j83o4L3k6J4K33k00J22k1k06K85q8L8J2j79j06O32m22K24o2m69L24P1
2253F3j24J78r7q1K71k63P0N7j3R4l10J82M9l58M62l42K8L16j57j01J23r3l6l3
2277a15k5q7K08J2pN2N1K1l61K13J42j63K48l04L91j1l17Q7K03l35P6j41J96r0
2301e6k7J16k11J89N15m31j0k2k44J00j17L97J6l30r7M66n85N65J93o40K07r3
2323i9K66N0j70L7k0k67M76j45j34J49p9j36L11n25J76m1L59k47K9j08J94k88
2345b12J14J09l55N64k16k9J73j39k0K28l29L40n18L31j03j1K55j58M4R4k49L01
$$ plain form
2367 214 242 -176 -99 223 10 108 -177 -120 -123 151 -98 -133 60 210 -37 332 13 -8 -233 2 -357 39 -144
2390 -144 -117 83 -131 10 -135 269 15 -17 74 217 -149 -51 203 -313 -243 73 100 -49 -28 137 285 -216
2412 -216 -190 -83 -316 3 248 -164 87 16 -261 -22 -293 266 0 -212 -199 161 34 -54 55 -211 151
2433 151 -31 180 86 84 213 -108 288 239 34 150 11 -115 -25 -277 13 152 -42 215 -160 107 -141 27
2455 27 -16 107 -208 -290 -115 -10 102 -199 -52 -11 -29 -183 62 -96 130 175 -408 133 237 -100 178 41
2477 41 137 -139 37 169 24 219 216 -229 -151 -103 -29 -270 143 11 151 -27 176 -108 -105 155 -43 -96 161
2500 161 -22 -218 234 -18 -22 -44 7 225 -170 -92 214 56 95 -5 -112 -167 -79 -147 209 -99 211 129 -19
2523 -19 135 -248 140 84 -197 92 256 95 28 -40 -329 164 66 234 100 -63 161 29 110 96 45 -210 17
$$ packed form
2367B14K8m18P7L22k13R8k85N7lK74k49l5J93J50k47L69l19k1k25K35l59L96j83
2390a44K7K00k14J41j45M04k54l2R1J43l66R8K54n16P0L16K7j49K1J65J48n01
2412b16K6J07k33L19K45m12K51p1k77K39k71N59k66k12J3L60j27q8J09k66L62
2433A51j82K11r4kJ29l21L96m9k05J16j39j26R0k52K90J39j94K57l75K67k48J68
2455B7m3J23l15q2J75J05J12l01J47M1j8j54K45j58K26M5n83N41J04l37K78j37
2477D1R6k76J76J32j45J95lm45P8M8P4k41M13j32J40j78K03k84LK60j98n3K57
2500A61j83j96M52k52mk2N1K18l95P8L06j58L9j00j07n5Q8o8L56l08L10q2j48
2523a9J54l83L88n6k81K89J64j61o7o8k89M93r8J68j34j63K24j32Q1j4n1k55K27
$$ plain form
2546 17 -86 -344 18 -79 79 -71 58 121 64 2 -129 -163 -105 -103 -19 99 -108 -17 -201 -346 -266 44 153 118
2570 118 236 66 50 -16 77 191 -142 -227 77 80 49 -6 -35 25 -80 -74 -95 -17 221 -24 -63 120 -87 142 -50
2595 -50 -130 117 11 -200 -114 27 -145 -342 -225 -3 -38 150 -279 157 144 79 65 38 -26 -111 109 -154 -112 -62
2619 -62 -274 -71 -171 191 148 50 -31 -179 115 -29 10 14 150 -24 175 13 10 87 178 -11 91 83 -173 241
2643 241 -177 -62 60 -118 -88 62 -34 114 -185 106 101 -48 -158 -463 -76 22 290 -1 217 -35 -139 -71
2665 -71 -29 92 -133 -31 52 194 -11 136 144 55 22 210 -67 164 -170 -39 -165 120 -9 -410 15 -38 161
2688 161 26 26 20 -268 -1 -285 4 47 34 -90 -197 -66 13 -1 -187 -9 -36 -213 -144 35 95 20 52 4 39
2713 39 -232 -147 83 -106 15 -60 -118 4 13 96 329 -6 148 -115 11 -14 3 -251 -91 -119 131 -46 167
$$ packed form
2546A7j03k58L62r7J58j50J29O3n7o2j31l4N8KQ4J18k07R1j84j45Q0L10J09l5
2570A18J18j70j6o6R3J14l33q5L04Ll1n5k9O0j05Ok1P8K38k45l9J83k07K29j92
2595e0q0K47j06k11Q6J41j72j97J17K22l5J88m29M36j3o5j4k7o4q5K20k63M2N0
2619f2k12K03j00L62m3r8q1j48K94j44L9MJ36j74J99j62lP7R1j89J02qk56M14
2643B41m18J15J22j78L0J50r6J48k99K91nj49j10l05L87R8K68k91K18k52j04O8
2665g1M2J21k25J02Q3J42k05J47Qq9l3J88k77K31l34J31j26K85j29m01M25n3J99
2688A61j35%ok88K67k84K89M3j3j24j07J31P9j4j86J78k7j77O9J79O0p5L2m8L5
2713C9k71Q5K30j89J21p5n8J22RQ3K33l35J54k63J26k5J7k54J60k8K50j77K13
$$ plain form
2736 167 8 -17 -222 -182 -261 111 -22 -4 112 117 -16 253 91 -284 -212 35 11 62 128 280 33 -94 -76 128
2760 128 66 135 -71 -49 300 118 -98 -222 -13 10 -183 226 -105 -189 178 -136 70 108 -265 -29 -53 -21 143
2783 143 -14 -127 121 -237 -229 1 -112 118 -73 -120 -33 -184 80 315 -70 198 -63 -171 298 -102 -120 92
2805 92 99 -128 -124 -154 87 -102 26 -79 -168 53 31 31 199 -98 -20 2 -148 -86 273 -123 102 -93 40 95 262
2830 262 71 -194 167 38 -114 -103 105 -127 -174 -101 -247 110 -62 307 -261 -147 -38 -182 17 41 21 -51
2852 -51 59 -147 -5 64 42 -51 -93 -22 12 164 36 -44 213 173 125 -24 151 32 30 356 87 -149 115 -113
2876 -113 36 -59 125 543 9 58 -34 -111 -85 -170 -44 168 9 269 -7 5 -257 45 172 -160 -120 12 225
2899 225 -10 -257 -182 54 272 154 -41 74 -6 108 -5 -40 -10 -4 179 -63 -161 126 -2 -151 180 39
$$ packed form
2736A67j59k5k05M0p9L72j33J8J16Nj33K69j62l75P2K47k4N1O6J52k47j27J8K04
2760A28o2O9k06K2L49j82k16j24K09K3j93M09l31q4L67l14K06L8l73K36k4L2J64
2783A43j57j13K48l58QK30j13K30j91m7Q7j51K64K35l85K68k61j08M69m00j8K12
2805I2Pk27Ml0K41j89J28j05q9K21k2%J68k97P8K2j50O2L59l96K25j95J33N5J67
2830B62j91k65L61j29j52J1K08k32m7P3j46L57j72L69n68J14J09j44J99K4k0p2
2852e1J10k06J42O9k2r3m2P1L4J52j28q0K57m0m8j49J75j19kL26k69k36K64k28
2876a13J49r5J84M18n34M9r2p7K6q5J26K12j59K60k76J2k62L02J27l32M0J32K13
2899B25k35k47P5K36K18j18j95J15q0J14j13l5L0OJ83k42r8K87j28j49L31j41
$$ plain form
2921 39 87 92 -72 67 49 106 -122 -8 36 111 45 -288 165 -195 -295 -48 -118 279 89 178 93 126 8 -57 51
2946 51 -282 175 -156 192 -36 -82 240 72 112 374 182 47 85 80 111 -17 -54 -340 -227 169 -305 -95 185
2969 185 -187 -176 388 -13 179 34 -153 -124 18 -45 202 16 -90 -10 46 -25 -359 247 105 -182 38 -67
2991 -67 2 -25 -93 141 68 184 -40 49 34 -149 6 229 -2 -69 143 43 29 36 -24 8 165 62 -221 -84
3015 -84 -48 9 -62 68 56 -88 120 52 -37 83 57 93 -17 -68 174 109 -172 125 -110 -159 55 -136 -250 -91
3039 -91 105 245 73 -117 319 -132 -126 -76 90 -36 147 291 7 -102 -41 232 233 -5 -281 -227 -15 121 99
3062 99 205 -65 -293 -83 138 -93 -206 -6 198 296 121 267 -15 301 42 -2 269 48 302 119 1
3083 1 162 -56 50 -71 -170 -201 319 97 179 -82 -87 195 276 -283 -95 40 -64 93 -215 173 -281 -51 243
$$ packed form
2921C9M8Nj64J39j8N7k28J14M4P5o6l33M53l60j00K47p0L97j90Q9q5L3j18o5J08
2946E1l33M57l31L48k28m6L22j68M0K62j92j35L8nL1j28l7k86J13L96m74K10K80
2969A85l72J1N64m01J92j45j87K9J42o3K47j86j06Q0N6p1l34O06j42k87K20j05
2991f7O9k7o8K34p3J16k24Q9j5j83J55K23k31o7K12j00j4Po0L2J57j03k83J37
3015h4L6N7p1J30j2j44K08o8q9J20k6L6j10n1K42o5k81K97k35m9K14j91j14J59
3039i1J96J40j72j90M36m51ON0J66j26J83J44k84j09O1K73Jk38k76N4K12J36k2
3062I9J06k70k28K10K21k31j13K00K04R8j75J46k82L16k59m4K71k21K54j83j18
3083AJ61k18J06j21r9l1N20k22Q2k61nK82Q1n59J88J35j04J57l08L88m54K30K94
$$ plain form
3106 243 -116 -55 177 -331 1 -182 2 1 -70 -150 -43 -131 -117 -6 -311 25 -20 -115 124 130 58 40 0 123 -5
3131 -5 -28 18 84 -103 43 -103 352 85 -206 4 62 -75 44 8 128 -32 -50 242 85 89 100 -16 -76 87
3155 87 3 136 -178 66 284 -97 113 72 -48 -312 -147 -67 372 9 29 -6 89 161 -59 429 -289 -30 -132
3178 -132 0 130 -25 -40 -174 -239 136 149 161 76 -208 -25 160 -161 66 -97 22 -99 51 -397 -154 265
3200 265 -212 -155 -47 -162 -47 159 -36 -126 -153 -27 22 -105 -68 -128 -220 -155 143 203 185 -116 -82 320 -2 67
3224 67 8 -154 127 77 -95 97 -109 178 -97 -309 76 -198 -96 -60 2 85 35 188 102 81 -44 43 -48 -96
3248 -96 -236 54 178 -84 -186 -67 -172 -1 235 154 92 117 -175 -89 -55 49 2 -292 215 133 68 148 -164
3271 -164 -13 -47 44 319 -179 66 188 -45 33 -57 -26 -65 -187 -100 243 134 -216 52 -116 -102 117 73 -19
$$ packed form
3106B43l59O1K32n08L32j83J84jp1q0J07q8J4J11l05L36m5r5K39Op2j8m0J23j28
3131ek3M6O6j87J46j46M55k67k91K10N8j37J19l6J20j60j8K92j57MJ1j16o0J63
3155H7q4J33l14K44K18l81K10m1j20k64J65Q0M39l63K0l5R5P2k20M88p18K59j02
3178a32J32J30j55j5j34o5L75J3J2q5k84J83J85l21K27j63J19j21J50m48K43M19
3200B65m77N7J08j15J15K06j95r0k7J26M9j27L7o0r2O5K98O0j8l01L4M02l22O9
3224F7n9j62K81n0j72J92k06K87k75k12L85k74J02L6O2Q3n0J53q6k1j25Q7r1m8
3248i6j40K90J24k62j02J19j05J71K36q1o2K5k92Q6L4J04m7k94N07q2o5Q0l12
3271a64J51l4R1K75m98K45J22k33P8r0L1l9j22Q7L43j09l50K68j68J4K19m4r2
$$ plain form
3294 -19 -61 8 -302 11 35 98 59 -113 -67 -208 50 36 -110 -84 -94 29 -65 8 183 -64 21 62 147 166 107 -141
3320 -141 102 -47 218 142 -50 26 -288 15 4 -80 78 80 71 50 -109 -173 -54 -10 53 197 81 123 76 -79 -121
3345 -121 48 -39 147 -24 37 16 -125 60 89 -41 293 -278 -154 -20 36 177 87 27 231 75 -85 314
3367 314 -61 -91 118 25 115 -4 -220 103 86 74 -9 -180 63 12 -184 129 111 20 189 -120 -33 -177 -281
3390 -281 104 -176 -39 18 -264 -10 102 -37 35 186 -20 73 -79 253 207 34 27 126 -205 162 -79 4 -2
3413 -2 -238 -27 219 -40 91 140 -33 128 -182 -203 -154 -362 -236 -79 12 -20 -366 161 -106 -194 337 50 -330
3436 -330 244 24 -175 -51 37 -22 58 -125 137 109 -45 295 74 -80 -183 50 102 58 -64 251 -197 -51
3458 -51 38 -59 117 -2 -119 -29 -248 200 247 162 88 -100 30 -167 -603 -198 155 100 249 -52 -23 178 17
$$ packed form
3294a9m2O9l10L13K4O3l9j72M6j41K58j4j46K6j0J23r4P3J75k47Q5M1Q5J9n9k48
3320a41K43j49K65p6j92P6l14L03j1q4J58Krk1j59o4J19M4O3J44j16M2m7j55m2
3345a21J69q7J86j71O1k1j41J85K9j30L34n71J24J34N6J41r0o0K04j56j60L99
3367C14l75l0K09r3R0j19k16L23j7j2q3j71K43n1j96L13j8r1J69l09Q7j44j04
3390b81L85k80J37N7k82K54J12j39P2J51k06R3j52L32m6j73pR9l31L67k41Q3o
3413bk36K11K46k59J31M9j73J61l10k1M9k08J26J57R1l2l46N27k67q8N31k87l80
3436c30N74k20j99J24Q8n9Q0j83K62k8j54L40k21j54j03K33N2m4j22L15m48J46
3458e1Q9r7J76j19j17R0k19M48M7q5p4j88J30j97m36M05L53n5J49l01K9K01j61
$$ plain form
3481 17 -86 147 -271 27 22 -46 100 -153 90 338 100 98 137 124 1 227 96 58 89 -93 102 35 145 -227
3505 -227 106 137 -81 65 123 -68 -161 -88 -34 26 -127 -118 134 -389 -34 -94 -90 167 -79 -21 29 50 90 39 -265
3530 -265 53 54 -194 104 10 189 -100 35 110 304 18 155 -70 -127 214 -26 110 29 157 38 102 177 122
3553 122 25 40 -136 -50 -99 57 148 -63 -127 107 -83 -60 53 22 -4 101 -27 126 57 -129 22 -115 -14
3576 -14 74 -129 -11 98 72 46 126 140 126 109 -65 -129 -178 253 20 -2 -84 118 124 -92 -104 -18 235 -221 7
3601 7 51 64 4 88 67 42 -121 157 -52 24 -74 -246 231 -268 -282 -37 -9 -58 100 -44 0 10 -268 40 97
3626 97 -44 -12 -60 -118 284 0 -32 53 173 23 -69 -52 -128 301 -117 87 -45 -32 -9 -55 -181 -299 145 185
3650 185 38 5 -165 -303 63 -7 15 -38 239 -41 -10 191 160 -103 213 46 59 69 -229 -122 53 37 -98
$$ packed form
3481A7j03K33m18K98no8J46k53K43K48k38kL9j3j23K26j31l8L1j82J95o7J10l72
3505b27L33L1k18J46N8j91r3P3N4O0j53RK52n23L55o0MK57k46N8N0K1M0n1l04
3530b65L18Jk48K98r4J79k89J35P5J94k86J37k25n7L41k40J36q1J28j19O4P5n5
3553A22r7J5j76Q6m9J56R1k11o4K34j90K3J13l1k6J05j28J53o9j86J51j37J01
3576a4Q8k03J18J09k6k6Q0J4j4j7j74o4m9M31k33k2q2K02Ok16j2Q6K53m56K28
3601GM4J3o0Q4k1k5j63K78k09P6r8j72M77m99j4K45K8m9J58j44M4J0k78L08N7
3626I7j41L2m8n8M02k84l2Q5J20j50r2J7p6M29m18K04j32J3K3m6j26j18M44M0
3650A85j47l3j70j38L66p0K2n3K77k80L1K01l1k63L16j67J3J0k98J07J75j6j35
$$ plain form
3673 -98 125 -48 -10 -54 -13 251 -54 99 -23 15 118 136 77 165 -384 47 120 -145 217 -57 27 49 -23 2
3697 2 -44 -136 -110 -64 -73 -278 37 70 153 79 112 41 108 -82 20 320 160 -215 -213 -18 -8 -67 -23 -46 -132 35 69
3724 69 -131 156 -66 -67 86 257 204 -100 128 39 22 30 -243 52 -18 70 58 -208 -20 -30 -133 19 171 -128
3748 -128 116 -273 91 72 -202 61 176 -87 -48 208 -49 240 -32 128 -59 -137 95 26 -261 163 -215
3769 -215 83 339 -278 137 -200 -37 181 60 77 227 72 -95 91 -99 237 -269 -41 282 -6 -207
3789 -207 50 -151 -30 36 -180 95 4 -194 433 -3 113 -211 95 -24 90 -87 281 14 182 134 70
3810 70 39 -104 38 16 221 -129 66 -189 50 -189 -17 64 104 316 -32 -60 -278 -304 -71 19 21 -29 440 26
3834 26 -66 -109 136 124 90 138 232 144 116 182 3 -30 11 -7 302 29 -254 14 70 362 -149 52 179 -105 169
$$ packed form
3673i8K23j73L8m4M1K64l05J53j22L8J03J8n9Q8n49M31P3k65L62k74Q4K2p2K5
3697Bm6r2K6M6rk05L15L3Q3p4L3p1O7j90J02L00j60l75KJ95J0n9M4k3q6J67L4
3724F9k00K87k22jJ53J71n3l04K28q9j7Qk73K95p0Q8j2k66J88j0j03J52J52k99
3748a28K44l89L64j9k74K63J15k63L9K56k57K89k72J60j87p8K32o9k87M24l78
3769b15K98K56o17M15l37J63K18j21J7J50j55j67J86j90L36n06K28L23k88k01
3789b07K57k01J21O6k16K75r1j98O27m36J16l24L06j19J14j77L68k67J68m8o4
3810G0l1j43J42k2K05l50J95k55K39k39J72Q1M0K12l48k8k18k6K33R0Kn0M69m14
3834B6r2m3K45j2l4M8R4q8k8O6j79l3M1j8L09k73k83K68N6K92n11K01J27k84K74
$$ plain form
3859 169 183 -168 101 -65 58 113 -27 -221 58 31 228 53 -50 32 -114 7 100 -138 306 -75 13 -16
3881 -16 -136 140 36 2 -159 182 -41 -1 46 100 160 -301 -56 6 -150 -112 34 -108 260 -235 -17 2 279
3904 279 199 66 43 -1 -98 -5 18 -163 41 90 194 157 22 14 252 21 233 -277 -310 147 -39 -167 257 73
3928 73 261 -54 -110 41 -101 39 -8 -39 131 117 -173 215 113 139 -208 123 23 -204 41 146 255 -135
3950 -135 -90 -173 -49 15 85 -12 83 -32 121 13 -98 -148 -103 22 285 -63 -170 -113 -24 170 -129 -109 -96 -99 -23
3975 -23 144 245 19 -284 -102 90 -37 -142 -256 76 -32 109 115 -11 24 0 -60 -71 -136 70 -142 285 -110
3998 -110 -68 -421 -45 105 145 42 127 -31 -41 123 15 -39 -121 -139 -2 85 261 149 -85 142 64 -262 42
4021 42 -70 36 123 111 62 -98 -76 -86 -88 -256 190 27 169 100 26 95 104 -173 -113 -7 -273 -78 -228 110 -124
$$ packed form
3859A69J4l51K69j66J23N5j40j94K79k7J97j75j03Q2j46J21R3k38M44l81Q8k9
3881a6j20K76j04l4j61L41k23M0M7N4O0m61K45O2j56L8J46j42L68m95K18J9K77
3904B79q0j33k3m4r7R3K3j81K04M9J04l7j35qK38k31K12n10l3M57j86j28M24j84
3928G3J88l15n6J51j42J40m7l1J70j4k90L88j02K6l47L31j00k27K45J05J09l90
3950a35M5q3J24O4P0r7R5j15J53j08j11n0M5J25K63l48j07N7Q9J94k99K0J3lP6
3975b3J67J01k26l03J82J92j27j05j14L32j08J41Oj26L5k4o0j1o5K06k12M27l95
3998a10M2l53L76J50M0j03Q5j58j0J64j08n4q2j8J37Q7J76j12k34K27p8l26L04
4021D2j12J06Q7j2m9j60K2j0kj68M46j63J42o9p4O9Rk77O0J06k66J95j50L38k34
$$ plain form
4046 -124 -61 205 -23 175 -148 74 120 -165 -93 -145 -55 -51 190 -120 90 6 -135 -172 -84 167 15 -68 17 105
4070 105 -52 70 -62 130 86 4 -59 284 80 42 -246 -166 -50 17 -76 40 217 -26 313 -30 29 3 166
4093 166 28 4 226 20 -4 -95 -45 7 88 -321 -110 95 -109 4 -64 -152 153 -184 27 -117 -69 -257 -125
4116 -125 211 -98 -160 -188 78 7 189 -123 -222 136 133 -17 31 -300 -228 203 -230 -260 155 230 -148 -97 195 225
4140 225 -233 120 -115 147 223 -218 -61 -40 -51 -54 -71 -262 136 293 57 108 -7 70 -132 18 98 -135 233
4163 233 120 -93 -139 273 -14 181 -19 74 237 -16 -54 76 80 127 204 -200 -66 -138 12 -31 -34 64 -236 29
4187 29 57 41 31 -77 30 144 96 43 -210 -93 94 167 -72 248 -16 6 -14 -56 58 123 128 140 -90 -4 114
4212 114 23 25 2 -114 106 -54 -19 359 -94 104 -159 68 2 -224 -30 -147 -77 27 128 70 3 76 -120
$$ packed form
4046a24O3K66k28J98l23K22M6k85P2n2R0MK41l10K10q4j41l7Q8K51j52q3Q5Q8
4070A05j57J22j32J92m4q2o3L43k04l8k88Q0J16O7r3J16J77k43L39l43N9k6J63
4093A66j38k4K22k06k4r1N0N2Q1m09K11K05k04J13o8q8L05l37K11j44M8j88J32
4116a25L36l09o2k8K66p1J82l12r9L58lj50M8l31P2M31m33l0M15P5l78N1K92L0
4140B25m58L53k35K62P6m41J57K1j1lj7j91L98J57k36N1j15P7k02J50Q0k33L68
4163B33j13k13m6M12k87J95k00R3J63k53l8J30MM7P7m04J34p2J50m3lR8l00K65
4187B9K8j6j0j08J07J14m8n3k53J17J87P3k39L20k64K2k0m2J14O5NJ2k30Q6J18
4212A14r1Kk3j16K20j60L5L78m53J98k63K27o6k26J94j17P0J04J01n8o7P3j96
$$ plain form
4235 -120 -173 35 -191 -5 -8 -207 -235 -13 -30 -69 16 -145 -110 174 81 -118 58 -78 66 177 -50 -137 92
4258 92 -75 83 166 95 -30 290 -6 -197 80 -115 167 166 -78 -23 24 131 -136 61 228 -246 170 111 -32
4281 -32 -6 -69 125 179 -34 75 -74 6 94 186 -95 22 41 130 138 49 114 162 127 -69 211 147 92 13 -45 -280
4307 -280 -159 -140 -256 135 -55 105 -38 269 -56 -87 18 88 107 -31 18 89 -24 -9 -19 -93 -196 24 18 134
4331 134 101 52 55 -313 -49 -120 -227 -87 -17 -208 -88 59 288 42 201 397 -111 -130 38 103 35 315 189
4354 189 -72 -267 205 183 -163 8 -113 -69 66 11 -245 -40 139 82 158 -268 -57 79 251 -65 1 -28
4376 -28 90 -229 9 -60 -8 279 6 -144 -109 14 61 -177 231 83 -4 -56 -110 343 96 99 -97 -23 -94 39
4400 39 198 82 393 28 -50 74 19 67 232 129 -130 15 -139 -142 -142 25 188 109 122 -309 20 -31 164 72
$$ packed form
4235a20n3K08k26J86lj99k8K22j7l9Q5j61L5K84r3j99J76j36J44J11k27q7K29
4258I2j67J58Q3p1j25L20k96j91K77j95K82jk44N5M7J07k67J97J67m74M16n9j43
4281c2K6o3J94N4k13J09j49Q0Q8R2k81J17J9Q9Qq9O5M8l5j96K80o4n5p9n8k35
4307b80J21J9j16L91j90J60j43L07l25l1J05P0J9j38M9P1j13J5j0p4j03K20oJ16
4331A34l3m9Ll68K64p1j07J40P0j91J20J47K29k46J59J96n08j9J68O5o8K80j26
4354A89k61j95M72k2l46J71j21M4J35n5k56K05J79n7P6m26K11J36J72l16O6k9
4376b8J18l19K38o9N2K87k73j50L5J23M7k38M08j48q7n2n4M53k47Lj96P4p1J33
4400C9J59j16L11l65p8J24n5M8J65j03k59J45j54l%J67J63p9J3m31L29n1J95r2
$$ plain form
4424 72 -125 202 22 -33 118 36 -159 -57 14 -18 143 -297 93 81 -194 -206 45 -84 144 263 -74 -116 -241
4447 -241 111 -31 49 -14 95 -41 200 216 -70 350 -64 93 42 -212 163 -144 -87 1 97 -195 -11 -191
4469 -191 -190 16 68 28 22 40 156 218 -46 189 -69 115 -92 -110 -189 203 193 -49 83 -16 154 137 35 -26 233
4494 233 -25 309 -144 159 -126 94 17 41 325 -55 -33 -88 -24 148 22 95 -126 5 135 203 -371 -34
4516 -34 -205 145 278 -75 293 322 -108 148 119 -15 241 150 -153 -35 -95 -100 19 -15 250 -145 -184 -13 -51
4539 -51 215 222 -88 22 -81 -46 52 -111 -397 33 166 360 118 -125 257 -55 185 -301 89 162 20 101
4561 101 -11 -18 441 -284 -61 -199 -188 16 181 13 216 -153 147 183 -106 -23 5 -36 45 167 -173 251 -67
4584 -67 -314 242 53 -192 -28 -104 11 126 -57 -171 190 72 -28 159 -218 -186 -257 -248 245 130 13 235
$$ packed form
4424G2j97L27j80n5J51q2j95J02P1l2J61m40L90j2k75j2K51j29K28J19l37m2j25
4447b41L52j42Q0o3J09j36K41J6k86M20m14J57n1k54L75l07N7Q8R6k92J84j80
4469a91JK06N2m0oJ8J16O2k64K35k58J84k07j8p9L92j0k42J32r9J70j7j02o1K59
4494B33k58L34m53L03k85K20p7K4K84l80K2n5O4J72j26P3k21J31J30O8n74L37
4516c4j71L50J33l53L68K9m30K56k9j34K56r1l03J18o0nJ19l4K65l95l9J71l8
4539e1K66Pl10J10j03L5R8j63k86M30J33J94k42k43L82l12K40m86L90P3j42Q1
4561A01j12pM59p25K23j38J1K04J65j68K03l69L00L6k89Q3K8m1Q1J22l40M24l18
4584f7k47N56j89k45J64p6J15J15j83j14L61j18j00J87l77L2p1RM93j15j17K22
$$ plain form
4606 235 -195 -128 36 -344 -15 -326 8 -140 -70 140 -39 23 -128 214 185 -201 -177 -147 -65 281 -10 -73 -112
4629 -112 -75 -89 68 48 -115 35 -105 141 45 2 238 -16 85 106 -58 201 -76 77 -116 -251 116 144
4651 144 74 266 189 232 -280 -89 -38 205 -42 -95 35 -85 20 -94 -25 76 -34 230 290 -345 178 -283
4673 -283 -300 -8 -93 185 -123 -32 102 -218 100 -198 -161 -166 13 14 22 -7 51 -90 -62 14 -329 -20 -47 71 -115
4698 -115 -30 14 214 -31 25 -146 67 40 52 55 -66 -102 -13 155 128 79 46 -414 -59 -137 17 -222 -107 69
4722 69 -31 -303 4 136 -7 226 102 -67 -15 -56 -229 -27 46 157 -133 22 -138 -55 -115 -127 -166 -176 179
4745 179 -14 26 322 -181 234 192 67 284 25 -123 170 28 -28 -76 75 47 14 -45 203 -171 311 168
4767 168 25 204 -305 -38 8 221 142 -131 56 -105 -128 -47 -171 -144 160 -95 16 217 197 121 -169 -195 -83
$$ packed form
4606B35m30O7J64l80L29l11L34j48P0K10j79O2j51L42k9l86K4L0Q2L46k91o3l9
4629a12L7j4J57k0j63J50j40K46r6m3K36k54J01K1j64K59k77J53j93j35L67K8
4651A44p0J92p7M3n12J91N1K43k47n3J30j20J05j14O9J01j10K64O0o35N23m61
4673b83j7K92q5K78l08R1J34l20L18k98L7nJ79JQk9N8j41K8P6l43L09k7J18j86
4698a15Q5M4K00k45N6j71K13k7J2Lj21l6Q9J68k7m9l3m60L55p8J54k39J15J76
4722F9j00k72L07J32j43K33j24j69N2m1j73K02P3J11k90J55j60Q3o0j2l9j0L55
4745A79j93M0K96n03M15m2j25K17k59j48K93j42n6m8J51k8l3n9K48l74M82j43
4767A68j43J79n09K67M6K13p9k73J87j61k3Q1j24K7L04k55J11K01k0p6k90k6J12
$$ plain form
4790 -83 -25 -41 22 -40 -327 107 5 -8 -123 -175 263 19 -114 50 221 135 299 -162 105 28 -37 122 30 109
4814 109 114 -99 4 3 -2 82 -78 10 138 -22 244 287 -25 166 90 19 101 57 63 97 100 307 -100 -119 303 124
4840 124 193 -124 -17 87 -27 58 170 -131 157 67 28 72 -56 68 141 -60 107 137 158 -125 -250 14 -131
4863 -131 -103 40 -16 164 -150 -364 -165 -53 -18 -60 -82 -97 106 -176 8 -176 -136 85 19 33 -29 -147 -123 52
4887 52 264 11 148 107 277 328 -101 130 -6 -172 14 44 -151 163 -44 -27 76 -178 168 -94 42 -100
4909 -100 -16 63 -338 -161 89 -134 -112 -54 46 89 -188 162 1 69 50 -79 161 -137 -203 -329 -192 -98 59
4932 59 79 -8 -71 286 65 163 130 1 -66 208 -5 -126 1 -34 1 -66 56 53 -35 -10 -32 -117 -173 -97 86 65
4958 65 134 -75 78 -123 -61 -19 42 165 -102 -150 -102 241 -74 -11 217 -61 -54 -40 -24 252 -51 135 -202 -98
$$ packed form
4790h3N8j6O3o2k87M34j02j3j15n2M38k44j33J64J71q6J64m61K67p7o5J59r2P9
4814A09Nk13J03jnQ4j60Q8J28j60K66M3l12J91p6p1Q2m4OL4LK07m07j9M22j79
4840A24O9l17J07J04j14Q5J12l01K88r0l9M4j28J24P3k01J67L0K1k83j25K64j45
4863a31K8J43n6J80l14k14J99J12L5m2k2j5K03k82J84j84M0K21o6J4o2j18K4J75
4887E2K12k53J37m1J70N1m29K31j36j66J86L0j95L14k07J7J03k54L46k62J36j42
4909a00Q4P9m01J77K50k23K2N8J00M3k77L50j61O8j9j29K40k98o6j26J37R4J57
4932E9K0q7o3L57k21R8l3j29o7K74k13j21J27l5L5o7J22lq8K5k2q5n6P6J83k1
4958F5O9k09J53k01O2M2O1J23k67m8M8L43l15O3K28k78PJ4J6K76l03J86l37J04
$$ plain form
4982 -98 42 -13 131 135 -59 74 123 22 -37 58 -164 -39 84 -173 84 11 -104 105 -129 -175 148 207 -19
5005 -19 -102 -242 10 -165 -133 -190 -72 169 -187 -24 -204 -98 -162 -15 -171 -128 -68 -111 114 85 50 111 95 129
5029 129 -139 -254 114 63 74 -62 77 210 -23 75 6 113 -68 21 -118 81 81 78 62 157 -170 -48 90 -121
5053 -121 -306 -124 233 -21 80 -42 11 -35 -218 74 -206 171 -175 -98 266 164 73 102 -128 34 12 -81
5075 -81 -64 -6 -126 92 4 -164 59 324 75 -1 4 78 -34 261 -197 80 176 -132 -6 127 -66 5 -127
5098 -127 -73 -158 -52 -94 -122 -48 1 268 -56 -237 -128 -254 -52 42 -93 177 -6 281 -123 -166 72 4 122
5121 122 190 -140 6 319 15 -9 85 62 117 -64 9 51 -11 -9 -88 -304 49 11 -120 -263 -93 141 -36 -181
5145 -181 40 -100 63 -193 -73 394 -44 10 -90 -31 -76 -129 -199 125 -149 -172 136 97 -254 164 31 44 -93
$$ packed form
4982i8J40n5J44Mj94J33M9j01n9R5k22J25J23k57K57p3j15K09k34m6L23N9k26
5005a9q3j40K52j75L2n7J18K41l56J63j80J06o4J47j56M3O0m3K25k9l5O1j6L4
5029A29k68j15L68n1J1j36J39J33k33R8o9J07j81Q9j39J99%lj6R5l27J22J38k11
5053a21j85J82L57k54J01j22N3m6j83K92k80L77l46P7L64j02r1K9k30J62k2r3
5075h1J7N8j20K18q8j68K23K65k49p6NP4j12K95m58K77R6l08J26J33j93P1j32
5098a27N4q5J06m2k8P4M9K67l24j81J09j26K02R4j35K70j83K87m04m3K38o8J18
5121A22O8l30J46L13l04k4R4k3N5j81P3M2o2Kp9k16L53l8j31j43J70K34j77j45
5145a81K21j40J63k56J20M67m38N4j00N9m5n3p0L24k74k3L08l9l51M18j33J3j37
$$ plain form
5168 -93 -283 92 -170 -12 90 8 -67 -36 145 153 -78 5 34 32 -69 -169 92 66 -155 346 336 217 88 -135
5192 -135 126 -165 -62 48 176 98 -24 -33 134 108 116 206 -256 97 -157 -209 196 102 -137 120 254 112 70
5215 70 -11 -31 204 -51 37 -67 57 140 -97 13 126 185 214 -277 127 -12 119 56 107 -93 -104 -33 190 -149
5239 -149 -49 -70 -241 -119 65 89 -164 22 -157 -216 260 188 8 50 239 257 23 -89 -125 38 -46 -3 -88
5262 -88 -163 -91 75 224 -173 312 315 -113 174 42 151 -109 -118 277 -77 163 -44 137 -46 -303 109 -36
5284 -36 18 281 -94 -35 275 132 -94 -134 -17 164 -23 68 39 238 163 107 -2 181 -107 -263 142 74 -102
5307 -102 -51 210 191 -124 66 -106 75 46 348 -78 -166 -37 -136 41 -127 105 137 -24 38 -84 97 -96
5329 -96 -68 149 25 55 -257 -111 2 184 46 -49 -46 -121 -13 193 11 121 167 344 -35 -88 -108 -106 -38 157
$$ packed form
5168i3j90L75k62J58J02q2p5L1J81Qk31Q3K9kj01j00K61k6k21N01j0j19j29k23
5192a35K61k91J03J10J28p8j22rJ67k6QR0m62L53k54n2M05r4k39K57J34j42m2
5215G0q1k0K35k55Q8j04J24Q3k37J10J13N9K9m91M04j39J31o3N1k00j1P1K23l39
5239a49J00k1j71J22J84K4k53J86j79n9M76p2j80M2J89J8k34j12l6J63q4M3q5
5262h8p5P2J66J49l97M85Lm28K87j32J09k60rL95l54K40k07J81j83k57M12j45
5284c6N4K63l75N9L10j43k26m0J17J81j87R1k9J99p5n6j09J83k88j56M05o8j76
5307a02N1K61j9l15J90j72J81k9L02m26q8J29r9J77j68K32L2j61O2j22J81j93
5329i6K8K17j24L0l12J46J13J82j38r5Lp5J08K06j82J10M6J77l79n3k0KO8J95
$$ plain form
5353 157 114 46 -179 -139 50 -173 5 37 -28 -79 5 -50 103 -91 15 9 -120 -147 109 -96 163 135 -106 -176
5377 -176 -206 0 -40 -210 -207 207 -82 264 -12 -59 135 121 -91 147 -41 -65 61 -129 141 -114 23 -37 -213
5400 -213 275 -27 -24 100 75 24 -84 44 -33 314 103 29 -129 -40 244 75 68 213 -205 -104 69 -197 -127
5423 -127 100 -29 67 7 -24 -133 -102 384 100 23 93 14 -22 -52 219 -165 48 -169 -372 53 -152 -8 71
5446 71 156 33 -3 -22 16 166 37 57 201 -113 -78 113 85 -85 -243 146 -217 6 287 22 347 -40 23
5469 23 104 203 97 -79 -98 202 188 13 96 -12 2 -15 89 117 -33 -107 -118 178 116 -14 177 2 104 -142
5493 -142 -15 68 78 -201 -205 -126 249 -123 -260 -93 173 -134 154 -33 29 -263 -31 -301 -230 -270 -147 -147 161
5516 161 128 16 -76 78 138 8 17 -57 186 75 210 43 52 -182 59 -108 243 -81 -251 94 215 86 65
$$ packed form
5353A57m3o8k25M0J89k23J78L2o5n1Q4n5J53j94J06oj29k7K56k05K59k8k41p0
5377a76l0K06m0j70LM14k89L46k76m7J94j4k12K38j88k4J26j90K70k55J37o0j76
5400b13M88l02LJ24k5n1j08J28p7L47k11p4j58Q9K84j69pJ45m18J01J73k66P0
5423a27K27j29R6o0l1j09L1M86k84p7P0p9l6l0K71l84K13k17k03M25k05J44P9
5446G1Q5j23l6j9L8J50j29K0J44l14L5J91k8j70j58L89l63K23K81k65L25l87O3
5469B3Q1R9j06j76j9L00j4j75Q3j08J4j7J04K8j50p4j1K96o2j30J91j75J02k46
5493a42J27Q3J0k79mP9L75l72j37J67K66l07K88j87O2k92K32k70P1m0J23%L08
5516A61l3j12r2J54O0j30Rp4K43j11J35j67Rk34K41j67L51l24j70L45J21j29k1
$$ plain form
5539 65 156 125 -145 -148 -38 174 -74 111 -46 160 21 28 -43 105 -93 -51 23 80 98 -98 -14 -43 -145 -2 295
5564 295 32 -23 -106 56 10 -347 67 -57 35 69 -50 -152 -283 122 -313 -5 -331 -150 -171 -90 324 392 -154
5587 -154 -204 -94 6 53 -170 236 24 -126 -314 205 120 30 -236 11 -73 50 -170 -42 137 -97 80 110
5609 110 222 281 41 55 79 36 108 15 148 -213 -84 -234 -62 44 103 -62 -6 1 -12 -207 13 384 14 22
5633 22 144 105 143 -25 36 -79 185 53 -156 50 179 93 -7 -85 -112 302 -51 22 -53 -326 141 80 -321
5656 -321 -64 329 27 300 333 -63 42 -1 -182 45 49 227 36 253 -256 16 -102 2 71 -94 -118 -217
5678 -217 -119 -356 52 238 21 -16 236 153 103 31 -47 161 -194 71 -160 82 -222 91 81 111 103 0 16 181
5702 181 -128 -224 -401 -43 -387 -95 28 -9 197 -41 71 -169 168 86 43 240 177 42 -27 12 -125 -104 28
$$ packed form
5539F5R1l1k70lJ10K12k48J85j57K06j39Pp1J48j98M2P4N7J8j96Q4k9j02J43K97
5564B95k63n5q3J62m6l57M14j24R2L4j19j02j31M05m35L08l26J81k1Q1M14O8n46
5587a54n0J10J00M7k23M06k12j50j88N19q5r0k66K47q4J23k20J28J79k34J77L0
5609A10J12N9k40J4K4m3P2r3J33l61J29j50J72J06N9j65N6Pj3j95K20L71l70Q
5633B2J22l9L8j68O1j15K64j32k09K06J29q6j00p8k7M14l53P3p5k73M67o1m01
5656c21K57L93l02K73L3l96J05m3j81K27MJ78j91K17n09K72j18J04O9j65k4r9
5678b17R8k37M08J86k17l7K52q3n0p2p8K08l55K65k31K42l04L13j0L0qj03J6J65
5702A81l09r6j77L58l44K92J23l7K06k38J12k40L37q2m3J97o3j35o9L9j37K1J32
$$ plain form
5725 28 31 -3 -44 -217 -113 -222 -193 -72 -41 -96 -148 -36 -9 -323 -10 -234 11 98 -72 -210 74 61 -123 179
5749 179 -277 8 108 119 33 -295 -14 19 -240 152 175 -85 62 -153 58 3 232 78 122 -64 309 -9
5771 -9 -136 29 56 86 -49 -199 2 -276 -20 29 137 -27 -22 -111 39 -13 189 170 -56 -97 -52 8 -306 251
5795 251 -228 -37 4 -20 -174 -182 85 -133 -200 -49 -135 137 70 -94 96 90 -163 -388 -74 36 -23 -83 60 127
5819 127 -171 -33 -265 -141 120 -172 89 127 282 -37 -161 116 -200 111 123 -63 62 -200 -71 -92 -27
5840 -27 -137 -137 241 -94 -77 295 173 -24 166 9 -117 -68 208 -171 -82 227 -86 -2 32 152 4 113 57
5863 57 -117 100 238 66 33 -77 30 -19 22 -11 -222 -9 110 -110 92 -243 219 164 177 223 210 -125 -52
5886 -52 -98 -183 29 -198 109 -107 167 130 -155 127 -216 162 9 -82 37 -184 87 -25 -77 -203 -33 104
$$ packed form
5725B8Ll4m1j73J04j09K9J21L1n5n2J12K7l14L13k24K45Q7j70j38K84j3j84L02
5749A79m56K85J00J1q6l28K81L3k59L92K3k60J47k15K11n5K29j54M4j86L73l18
5771ij27J65K7L0j35j50K01k78K56M9J08j64Nq9J50n2K02j9k26m1M5O0l14N57
5795B51m79J91M1k4j54qK67k18o7J51q6K72o7j64J90ok53k25L14J10n9o0J43O7
5819A27k98J38k32J24K61k92K61L8J55l19j24K77l16L11J2j86J25k62J29k1O5
5840b7j10%L78l35J7L72j22j97J90j57j26M9K76l79Q9L09l13Q4L4J20j48J09n6
5863E7j74K17J38j72l3j10J07m9M1l3k11K13J19k20K02l35M62n5J3M6j3l35P3
5886e2m6q5K12k27L07k16K74l7k85K82l43L78j53r1J19k21K71j12n2j26J70J37
$$ plain form
5908 104 -61 -162 11 97 130 -178 -34 6 -79 -86 65 78 -150 -103 23 -60 34 385 159 101 154 122 -99 -88 -195
5933 -195 47 49 103 -72 41 35 -102 -1 118 -101 -66 -49 -116 -49 239 107 61 -176 16 104 84 199 30 -135
5957 -135 -40 -1 -5 149 -115 -65 -80 -30 130 -15 50 -26 -26 -49 132 54 100 -396 114 24 -132 -202 -174 -6 -123 49
5983 49 -41 -133 55 -84 -39 96 -99 -182 -86 -7 306 247 90 -13 59 207 -105 59 54 68 -220 308 79 166
6007 166 196 242 98 -83 101 -27 43 -41 110 84 -172 96 -24 166 90 132 62 269 -10 -22 13 267 14
6030 14 13 -70 -102 196 -130 106 92 -173 104 -18 114 -60 -35 -124 -89 -34 -68 -34 28 25 69 -100 108 46 32 188
6056 188 32 62 14 -137 89 -168 -30 -132 6 -26 -59 -91 40 -9 43 133 109 272 156 285 182 -67 -64 225
6080 225 -105 -139 28 4 -96 -73 143 211 -128 -351 99 77 -71 158 271 14 -106 244 -153 274 -109 -260
$$ packed form
5908A04j65j01J73Q6L3l08J44M0q5pJ51J3k28M7J26q3R4L51k26n8N3l2k21J1j07
5933a95K42KN4j75J13oj37J01J19k19L5J7o7O7K88j32m6k37J92Q8k0J15j69j65
5957a35R5L9mJ54k64N0j5N0J60j45O5p6%k3J81p8M6m96N10r0j56p0K8J68j17J72
5983D9r0r2J88j39M5J35j95q3R6P9L13n9j57j03P2J48l12J64nJ4k88N28k29Q7
6007A66L0M6j44j81J84j28P0q4J51k6k56K68j20J90p6M2p0K07k79j2L5K54k53
6030A4jq3l2K98l26K36j4k65K77j22J32j74K5q9L5N5l4L4O2lM4j69K08o2j4J56
6056A88j56L0m8j51K26k57J38j02J38l2l3l2J31m9N2R0k4J63j16J29j03k49LK89
6080B25l30l4J67k4j00K3K16O8l39k23M50k2j48K29J13k57j20L50l97M27l83j51
$$ plain form
6102 -260 -78 -89 175 66 71 -124 -81 -230 -199 -90 -159 14 -97 43 -18 -263 15 -171 43 221 -141 114
6124 114 -95 18 187 -100 68 -35 -175 -66 -34 69 9 -99 -398 -156 13 49 -82 225 126 44 455 9
6146 9 -146 78 137 -153 -129 79 -58 -191 67 172 -108 -176 -227 34 -65 14 12 117 193 -71 39 -238 170 -226
6170 -226 192 94 72 247 16 80 120 142 -25 33 125 42 -185 146 -102 48 92 188 142 -55 157 -31 -94 235
6194 235 153 -238 -145 141 80 -324 11 -112 11 -83 -33 82 94 -140 -104 13 99 274 45 100 -5 -151 -125
6217 -125 41 -17 -96 103 -25 14 -32 169 39 -48 53 -106 -23 94 68 80 56 -75 113 -8 12 5 -3 -37 -303
6242 -303 -60 -34 195 14 73 121 -111 -129 75 57 20 -216 91 75 -92 125 -169 -28 -96 38 116 51 -123
6265 -123 144 41 40 -147 0 75 -22 74 12 37 159 -44 168 90 -2 -250 -120 -57 96 -56 -140 -179 77 -29
$$ packed form
6102b60J82j1K64j09Nj95M3j49L1J09o9J73j11J40o1k45K78j86K14J78l62K55
6124A14k09J13J69k87J68j03j40J09L2J03o0j08k99K42J69L6j31L07r9q2M11m46
6146Ij55K24N9k90K4K08j37j33K58J05k80o8n1K61r9P9kJ05P6k64J10k77M08l96
6170b26M18r8k2J75k31O4M0K2j67N8R2q3k27L31k48J50M4R6m6j97K12j88o3L29
6194B35q2l91R3K86o1m04L35j23J23r4N0J15J2k34L6J17Q6J75k29N5j05j46K6
6217a25J66n8p9J99j28L9m6K01j30q7J01j59Q3J17k6J2k4j31J88j21K0pql4k66
6242c03K43K6K29j81N9M8k32j8K04j8l7k36L07j6j67K17k94J41o8J34P8o5j74
6265a23K67j03jj87J47P5r7R6o2K5J22k03K12p8r2k48J30O3J53j52q4l9K56j06
$$ plain form
6289 -29 146 -16 -150 293 180 -193 47 -43 -203 -280 47 77 -130 157 -3 19 -60 -160 66 126 -183 -167 -85
6312 -85 -163 -56 49 17 -69 -56 -87 -77 125 314 -123 -90 68 29 225 -112 -126 -152 63 182 49 74 61 224
6336 224 -52 142 -66 85 -41 -27 189 -47 186 -80 -259 78 -41 -282 -132 -60 -103 86 103 60 -12 4
6358 4 126 101 254 -8 -24 -124 133 -39 -56 40 -170 -152 158 168 4 -98 -30 -80 82 238 -80 -57 7 74
6382 74 -266 124 -62 27 71 3 85 193 17 -122 15 47 -199 -83 154 19 367 -37 -74 -15 -53 180 230
6405 230 26 -19 -118 220 130 67 -47 62 -21 117 -18 -209 80 -109 -106 -41 161 -35 -37 -79 120 8 -154 -199
6429 -199 -70 -80 49 -62 57 123 45 163 -114 -203 44 112 -100 -52 176 -229 126 -105 9 -84 300 12
6451 12 -36 13 -37 -38 124 -26 63 102 244 -5 -34 -59 -231 -19 -11 163 46 201 68 -112 -173 -197 -311 179 -194
$$ packed form
6289b9J75j62j34M43j13l73K40r0j60p7L27L0k07K87j60K2p9j00K26O0l09J6Q2
6312h5p8J07J05l2q6J3l1J0K02J89m37L3J58l9J96l37j4k6K15J19j33K5j3J63
6336B24k76J94k08J51j26J4K16k36K33k66j79L37j19k41J50P2m3J89J7m3p2J6
6358DJ22k5J53k62j6j00K57j72j7R6k10J8L10J0j64j02O8n0J62J56l18K3O4O7
6382G4l40L90j86Q9M4o8Q2J08j76j39J37L2k46J16K37j35L48m04l7N9l8K33N0
6405B30k04m5r9L38r0o3j14J09q3J38j35j91K89j89LO5K02j96km2J99j12j62m5
6429a99J29j0J29j11J19O6p8J18k77q9K47O8k12M8K28m05L55k31J14r3L84k88
6451A2m8M9n0jJ62j50Q9L9J42k49k9k5j72K12QJ74j17J55j33j80o1k4j14M90l73
$$ plain form
6476 -194 27 -38 24 143 20 79 95 -90 -52 -5 20 336 16 136 32 -109 89 136 -78 149 176 -18 254
6499 254 -101 -54 83 -194 38 -302 62 -79 23 18 13 56 -43 -73 47 -225 331 -16 24 131 -23 -71 -149 -12
6523 -12 2 77 -56 7 66 -48 214 0 126 -154 -391 98 159 -87 -116 -54 33 179 49 -6 -118 21 -68 225
6547 225 137 -29 -289 -66 247 136 77 -159 61 -126 -114 15 -24 -57 -133 251 -18 82 57 -63 -77 242 -106
6570 -106 -70 -24 142 49 3 -281 -107 181 -159 -17 -117 -66 41 4 -68 -134 -78 50 180 -40 60 398 -119
6593 -119 92 173 -12 127 51 126 158 -6 96 -42 41 351 -13 11 101 -86 -93 97 21 -126 -233 7 -38 47
6617 47 113 171 87 164 -16 -340 31 -18 5 -200 198 -110 -100 -71 156 -231 131 -158 -97 15 -206 18 -107
6640 -107 63 -141 61 214 201 -115 230 -17 -21 -135 -102 164 145 220 80 84 -98 -78 -62 10 -156 -17 -1 42
$$ packed form
6476a94K21o5O2J19j23N9J6j85L8M7K5L16l20J20j04j41J98M7k14K27K7j94K72
6499B54l55M7J37k77K32l40L64j41J02nnM3r9l0J20k72N56l47M0J07j54m8p8J37
6523a2J4P5j33O3N9j14K62k14J26k80k37M89O1k46k9O2Q7J46j30n5j12J39q9K93
6547B25q8j66k60K23L13j11n9k36K20j87J2J29l9l3p6L84k69J00k5j20j4L19l48
6570a06L6M6J66r3m6k84J74K88l40J42j00N1J07l7p2o6N6J28J30k20J00L38n17
6593a19K11Q1j85J39p6P5L2j64J02j38Q3L10l64K4R0j87pJ90p6j47j07K40m5Q5
6617D7O6N8q4P7j80l24L71m9K3k05L98l08J0K9K27l87L62k89O1J12k21K24j25
6640a07J70k04K02J53j3l16L45k47mj14L3K66j9P5j40Mj82K0J6P2j66J39J6M3
$$ plain form
6664 42 -16 -19 -51 48 129 -52 -144 -18 -18 -142 -46 -173 115 206 -50 56 133 90 44 4 -141 107 158 -141 67 -364
6690 -364 -1 197 108 -109 -127 188 31 -34 -111 76 -76 -49 72 -308 -266 -53 -90 -361 -28 -111 -76 -10 -113
6713 -113 148 -18 143 159 -139 72 64 -90 -2 53 10 -144 -108 -118 95 -47 32 279 -3 99 2 -246 82
6736 82 139 148 -49 -233 86 94 -265 124 17 411 -203 -169 -110 -107 61 -4 98 -46 -35 85 -93 32 -22 21 -337
6761 -337 -19 -32 31 -81 106 -187 96 -214 2 110 -73 130 36 566 164 -275 -85 -35 -103 -241 -198 -52
6783 -52 350 -18 239 65 -25 -91 62 -140 -72 51 -131 15 43 -61 -245 248 97 8 -4 189 30 -26 87
6806 87 80 180 -41 -229 -232 44 47 80 -215 45 258 358 -237 -5 184 43 120 76 119 -52 -176 -5 383 -112
6830 -112 -55 -65 -235 29 135 -143 -219 314 -33 20 161 -116 66 147 13 271 -42 -148 129 -111 -52 64
$$ packed form
6664D2n8ll2R9Q1j81r2J26%j24R6j27K88R1k56J06P7m3m6m0j45K48N1k99K08m31
6690c64L63J98q9k17j8L15j57o5p7J87j52K7J21l80M2K13l7k71L33q3L5O6j03
6713a13K61j66J61J6k98K11qj54Q8N5m3j54L6j0K13j42P9K47k82J02r7k48L28
6736H2N7Rj97j84L19Ql59L89j07L94o14L4N9LJ68o5J02j44J1J20j78J25n4M3l58
6761c37L18j3O3j12J87k93K83l10K16J08j83K03r4N30m02m39J90N0o8j38M3J46
6783e2M02l68K57j74r0o6J53k02O8J23j82J46K8j04j84M93j51q9j2J93j59n6J13
6806H7pJ00k21j88lK76LL3k95K60K13J00n95K32J89j41P7m4M3j71j24J71L88m95
6830a12N7j0j70K64J06k78p6N33l47N3J41k77J82Q1j34K58l13j06K77k40N9J16
$$ plain form
6852 64 -30 138 -222 -406 -4 80 25 96 182 4 -285 -144 -125 267 -51 -74 -240 28 -205 -15 -70 -97 7
6875 7 122 -161 1 -111 -118 106 -23 -85 -130 14 133 -58 -117 125 18 83 11 102 -158 136 101 240 -178 22
6899 22 -176 -162 -180 -145 224 6 -41 -108 -149 52 -201 126 116 -117 -114 98 157 271 28 -13 -147 207 -54 -10
6923 -10 12 -96 73 85 426 -199 -122 192 194 35 161 124 154 19 -395 -32 223 221 150 -113 100 -109 -261 25
6947 25 44 62 -96 -234 92 -334 43 -66 82 336 -126 110 -35 118 149 -39 144 31 131 -44 -142 -272
6969 -272 301 118 -61 192 -85 25 -61 -140 106 130 -272 -48 2 -224 -67 2 -78 -79 -294 20 179 286 -274
6992 -274 10 -246 34 -126 -142 30 187 266 147 55 -180 20 -121 110 32 10 60 46 52 101 265 -18 -52 -31
7016 -31 -59 181 57 -77 170 83 -26 337 210 13 4 15 288 -189 -49 -6 -171 -209 273 55 32 -142 95
$$ packed form
6852F4r4J68l60j84M02Q4n5P1Q6j78k89J41J9L92l18k3j66K68k33J90n5k7J04
6875GJ15k83J62j12pK24j29o2m5J44J19j91n9K42j07O5p2R1k60K94l5J39m18K00
6899B2j98J4j8L5L69k18m7o7m1K01k53L27j0k33LK12N9J14k43m1j34L54k61M4
6923a0K2j08J69J2L41o25P7L14Kj59J26l7L0j35m14L63K55kp1k63K13k09j52K86
6947B5J9J8j58j38L26m26L77j09J48K54m62K36j45J53L1j88J83j13J00j75r8j30
6969b72N73j83j79K53k77J10q6p9K46K4m02K24N0k26J57O9q0jk15L14J59J07n60
6992b74K84k56K80j60j6J72J57P9j19r2k35K00j41K31p8k2N0j4OM9J64k83l4K1
7016c1k8K40j24j34K47q7j09L63j27j97rJ1K73m77J40M3j65l8M82k18k3j74K37
$$ plain form
7039 95 -23 -201 -93 -181 19 209 161 -118 -25 -53 -14 88 -226 -87 -192 -122 32 49 -11 -88 -97 -97 79 125 116 -39
7065 -39 278 -114 -40 107 -177 66 22 103 1 -60 -30 -167 -122 313 -138 126 -188 15 77 -152 -88 -106 -159 -58
7089 -58 -12 -329 -111 -90 152 -71 -236 -23 -82 14 -276 52 -42 -36 62 228 -41 39 48 -189 -125 -146 -288 -60 96
7114 96 -69 311 -65 334 181 -27 -113 197 55 62 -5 124 -23 200 -25 184 108 -257 321 -149 -2 33
7136 33 -83 -92 -177 -45 119 -18 95 -21 -11 58 35 -51 -273 107 185 249 58 -3 -237 -254 288 -126 30 -146
7160 -146 -58 81 31 -33 -119 -228 48 55 71 159 196 -127 -120 -28 -122 67 123 -407 -248 64 174 -160 -159 -7 219
7185 219 395 -52 96 117 -361 -246 -135 -15 -168 -14 6 -208 -104 -96 77 141 -181 -272 406 138 116 223
7207 223 69 -90 -214 72 44 61 -28 -197 -233 -13 173 -28 156 32 -136 -77 19 57 77 60 23 51 -138 245
$$ packed form
7039I5j18j78J08q8K00J90m8k79R3k8L9J02l14J39j05P0J54J7o0p7r%J76M6rj55
7065c9L17l92P4J47k84K43m4Q1j02o1L0j37M5M35m51K64l14K03O2k29O4j8n3J01
7089e8M6l17K18K1K42k23j65K13n9R6k90L28r4OR8J66k69Q0Rk37O4k1j42K28J56
7114I6j65L80l76L99j53k08q6L10j42Po7J29j47K23k25K09p6l65N78m70J47L5
7136C3j16rq5J32J64j37J13j16J0O9k3q6k22L80P8O4j91o1k34j7N42m14J56j76
7160a46Q8J39n0o4q6j09K76PJ6Q8L7l23PR2r4J89N6n30J59L12J10l34JJ52K26
7185B19J76m47J48K1m78J15J11J20j53J54K0k14J04QJ73O4l22r1O78k68k2J07
7207B23j54j59j24K86k8J7q9j69l6K20J86k01J84j24j68N9R6L8K0j7l7K8j89L83
$$ plain form
7231 245 10 154 -5 -218 -114 48 111 72 103 -42 -291 -2 -60 -71 41 9 -230 29 -265 -151 240 27
7253 27 -129 158 -40 -62 240 -36 -87 -40 -26 204 -274 151 -68 -169 255 -64 82 -97 -29 -41 350 -32
7275 -32 88 -6 32 -45 -120 -180 -41 292 -174 -16 -112 -63 -189 -45 -87 -197 -159 -23 -74 -316 -268 -55 -90 -153 -112
7300 -112 -24 -6 -88 168 -291 -169 -117 267 60 7 -241 -76 38 115 -102 -234 -287 -185 -178 -36 -25 -8 11 -27
7324 -27 -76 20 -136 -201 -137 189 23 35 -145 -197 126 63 -8 -341 -47 -71 -53 -28 46 -78 2 39 1 179 -101
7349 -101 -85 12 -34 -168 25 157 -43 176 174 -129 69 73 38 19 -198 -84 -207 116 -55 94 -57 68 -20
7372 -20 -307 185 26 66 396 53 41 55 36 44 -17 -41 -41 148 -94 -57 -111 2 93 54 58 -75 -35 -223 -142 -146 -198
7399 -198 44 -72 -24 105 21 180 78 -342 -80 73 -446 247 125 88 151 167 -86 -139 285 2 -39 224
$$ packed form
7231B45k35J44j59k13J04J62O3l9L1j45k49K89n8j1J12l2k39K59k94J14L91k13
7253B7j56K87j98k2L02k76n1M7J4K30m78M25k19j01M24l19J46j79O8j2L91l82
7275c2J20r4L8p7p5o0J39L33m66J58r6M9j26J44m2j10L8J36n1k42M8K13l5o3M1
7300a12Q8J8q2K56m59J22N2L84k07n3k48J65J14P7k17j32n3J02PJ42J1J7J9l8
7324b7m9R6j56o5O4L26j66J2j80n2L23o3p1l33K94k4J8K5P4j24Q0L7l8J78k80
7349a01J6R7m6j34J93J32k00K19kl03J98Ml5j9k17J14j23L23j71J49j51J25q8
7372b0k87M92j59M0L30l43j2J4j9Qo1k4%J89k42L7n4J13R1l9Mj33M0j88Q1mn2
7399a98K42j16M8J29q4J59j02m20K62J53n19O93j22l7O3J6k53n3M24k83m1K63
$$ plain form
7421 224 74 244 102 114 20 -215 -106 56 299 53 -14 3 -10 -68 -34 -124 -35 47 148 -146 -63 -158 -87 -75 27
7446 27 -41 -10 128 -65 154 -87 33 -105 -44 -144 67 55 272 33 123 -82 29 229 -3 -167 -85 -31 -97
7469 -97 -6 158 121 172 -57 100 54 -51 72 -89 -36 -13 -68 88 262 -119 -156 19 19 173 100 129 283 72
7493 72 11 -275 -85 23 148 22 -83 82 130 279 -30 173 30 -308 255 230 126 194 337 35 -61 -2
7515 -2 116 -238 -55 133 32 -60 180 18 19 141 -32 -30 -23 128 99 -135 -133 9 23 -57 -54 292 58 183 269 42
7541 42 -22 -86 -77 -102 267 98 -114 -60 -173 71 58 146 -6 -142 262 -135 72 70 -147 -275 33 -112 7 65
7565 65 7 -106 -157 3 -57 -3 173 26 89 -57 -127 59 3 78 26 -114 74 9 88 -89 -106 64 3 87 90 38
7591 38 -37 -35 62 99 -131 -164 -89 -225 -149 47 168 -89 81 216 -123 -321 112 239 -71 -15 422 124 29 -7
$$ packed form
7421B24j50J70j42J2r4k35J09J62K43k46o7J7j3n8L4r0Q9Q2J01k94Q3r5P1J2J02
7446B7o8L1J38j93K19k41J20j38O1j00K11j2K17k39R0k05J11K00k32j64Q2N4o6
7469i7R1J64l7N1k29J57m6j05J23j61N3K3n5J56J74l81l7J75%J54p3K9J54k11
7493G2o1k86J90J08J25j26j05J65M8J49l09K03j43l38N63k5j04O8J43l02r6N9
7515bJ18l54J83J88j01r2K40j62JJ22j73KPJ51k9k34KJ42J4q0LL46k34J25Q6k27
7541D2o4o4Rk5L69j69k12N4j13K44j3Q8j52j36M04l97K07kk17j28L08j45J19N8
7565F5n8j13n1J60o0N4J76j47O3j46p0J86n6P5n2j40J88o5P9j77j7J70o1Q4Ln2
7591C8p5KR7L7k30l3P5j36P6J96J21k57J70J35l39j98M33J27l10N6M37k98r5l6
$$ plain form
7615 -7 -22 301 170 -184 -1 -9 68 54 123 80 -269 48 -173 199 26 15 139 54 164 -21 261 20 21 -269
7639 -269 264 190 -43 -158 96 -28 87 -179 -17 168 -73 -36 36 246 -103 49 60 -218 202 171 54 48
7661 48 -142 -171 157 1 -110 -66 -128 -208 -12 -105 74 -91 -100 -41 66 -2 228 142 -102 -44 70 -23 8 -34 130
7686 130 -126 202 2 0 61 -48 -8 -106 -85 -18 -165 -53 -72 -255 -40 -93 219 86 127 3 142 -83 -39 -52
7710 -52 61 298 94 221 -77 -115 -261 6 56 -84 -52 -159 57 109 150 98 141 -164 -184 14 -130 -52 -235
7733 -235 -30 7 -4 105 -262 -33 127 82 12 -29 -91 -82 50 -13 -271 166 94 -350 136 294 -300 -119 51
7756 51 16 -135 56 106 -166 -20 266 64 -107 12 -260 142 -166 204 6 58 130 -30 65 -19 106 -16
7778 -16 1 48 29 21 103 28 9 65 41 -67 -64 -91 -31 -209 54 42 -175 -100 -262 -108 88 26 120 38 -13 -175 -285
$$ packed form
7615gj5L23j31l54J83qP7j4O9m3l49L17k21L72j73j1J24q5J10j85K82k41Jk90
7639b69N33p4k33j15K54j24J15k66J62J85k41L7P2K10l49J52J1k78M20l1j17o
7661D8j90k9L28j56j11M4o2q0J96r3J79j65rN9J07o8K30q6k44N8J14r3L1m2J64
7686A30k56L28k00kO1j09M0r8K1O7j47J12j9j83K15n3L12j33M1j24J39k25M4j3
7710e2J13K37k04J27k98l8j46K67N0j40L2j07K16N2M1n2M3l05k0J98j44P8j83
7733b35K05L7j1J09l67K29J60m5p0m1o2RJ32o3k58M37p2m44M86J58n94J81J70
7756E1l5j51J91N0k72J46K86k02j71J19k72M02l08L70j98N2P2j60R5q4J25j22
7778a6J7M7j9qQ2p5j9N6k4j08Lk7O0j78K63j2k17P5j62J54J96o2R4q2n1j62j10
$$ plain form
7805 -285 9 -44 78 -137 102 -297 -24 133 -117 -123 -69 -46 172 125 29 -118 -119 -102 126 -67 -67 -85 -66 -251 -186
7830 -186 143 -147 21 143 77 -24 50 -71 39 305 237 244 -39 -84 -132 127 -137 -153 147 35 76 -162 -52
7853 -52 -123 -112 -23 -241 -124 22 -181 66 61 75 -5 34 -83 -190 122 289 -229 -63 -168 -98 -15 77 -159 -113
7877 -113 24 -70 11 -182 -7 140 -132 -68 -125 -154 -79 -107 200 26 -33 2 88 172 119 116 -117 186 234 36 -126
7902 -126 233 102 43 69 94 -21 -31 -205 -57 -49 116 -96 23 -77 299 355 97 62 -71 4 -262 -169 -90 206
7926 206 34 -9 35 35 -197 -65 12 -54 -145 245 6 -186 85 -285 44 -24 -366 -337 -31 11 -112 21 -26 199
7950 199 42 11 180 11 52 246 201 -7 -199 -98 -67 -198 -199 14 3 29 4 -71 226 -122 -98 5 16 185
7974 185 -204 26 41 -83 -167 27 94 -118 186 218 -17 -69 122 242 109 -189 -149 56 286 -77 180 -204
$$ packed form
7805b85K94n3J22k15K39l99K73J57k50oN4K3K18m7r6j47jJ7K28j93%j8J9j85O5
7830a86L29k90J68J22o6j01P4j21J10K66o8Pk83m5m8K59k64j6L00j12M1k38J10
7853e2p1J1Q9k18J17J46k03K47nJ4q0L9j17j07L12J67n18J66j05P0Q3R2k36M6
7877a13J37r4Q1j93J75J47k72O4n7k9P5k8L07j74n9L5Q6Q4n3lk33L03M8j98j62
7902a26L59j31n9K6K5j15j0j74J48QJ65k12J19j00L76N6k58l5j33P5k66R3P9K96
7926B06j72m3M4%k32J32P7o6r1L90k39j92K71l70L29o8l42K9L06M2j23J33m7K25
7950A99j57l1J69j69M1J94m5k08j92J01L1j31jK13j1K6k5p5K97l48K4J03J1J69
7974A85l89K30J5j24q4J94O7k12L04L2k35n2J91J20j33k98M0K05K30l63K57l84
$$ plain form
7996 -204 -105 27 -254 5 139 64 276 -47 -61 19 -126 123 54 170 -84 101 -189 -8 -97 31 -257 189
8018 189 -80 23 55 128 49 -87 -42 -188 97 202 -1 -29 94 -72 -72 -75 241 -21 118 2 -55 -121 -164 66
8042 66 -112 -103 114 -37 -4 109 -26 94 57 -184 104 19 -115 0 93 -18 -111 -14 181 -99 -79 27 255
8065 255 124 26 -21 45 65 112 323 -104 -237 -26 134 -193 117 -321 264 297 74 -32 -104 -95 13 -18 138
8088 138 44 -57 -12 137 29 217 -275 -317 27 -19 48 9 67 178 47 -28 127 71 180 92 42 -51 170 -13
8112 -13 184 -60 17 -178 -48 85 180 94 38 220 108 154 -266 152 296 -90 21 -186 -122 -48 90 -28 6
8135 6 19 5 -190 52 48 -101 77 -48 228 -50 -191 200 81 -22 -114 -138 376 136 35 -196 251 74 -21
8158 -21 120 41 -122 -79 -38 133 -171 -335 13 4 297 -8 -211 -246 77 18 9 49 -3 -110 -318 52 -5 -286
$$ packed form
7996b04R9J32k81K59J34p5K12l23j4Q0j45K49o9J16k54J85k90J81q9J28k88M46
8018A89k69J03L2P3p9j36M5j46K85J05k03k8J23j66%lL16k62J39j16n7o6m3K30
8042F6j78RK17j51L3J13j35J20l7k41K88q5j34J15R3j11r3R7J95k80K0J06K28
8065B55j31r8m7O6K0M7K11m27j33K11J60l27L10m38N85L3k23j06p2RJ08l1J56
8088A38r4j01M5J49j08J88m92m2L44m6O7l9N8J11j31p5J55n6J09q8n0r3K21j83
8112a3J97k44P7j95J30J33R5q6n6J82j12M6m20M18J44l86J11k07O4P4J38j18L4
8135FJ3j4j95K42mj49J78j25K76k78j41L91j19j03r2k4N14k40j01k31M47j77r5
8158b1J41p9j63M3M1J71l04j64L48rK93l05k03l5L23n9rM0n2j07k08L70n7k81
$$ plain form
8182 -286 133 123 -135 148 -3 193 17 151 238
$$ packed form
8182b86M19j0k58K83j51J96j76J34Q7
8191B38
$$ Imaginary data points
##PAGE= N=2
##DATA TABLE= (X++(I..I)), XYDATA
$$ plain form
0 0 0 0 0 0 0 0 0 0 0 0 8 -8 8 -8 16 -16 24 -32 34 -40 48 -61 72 -83 96 -112 130 -152 173 -197 226 -257
32 -257 291 -329 370 -415 464 -520 582 -648 719 -797 884 -979 1079 -1192 1314 -1449 1596
49 1596 -1757 1936 -2132 2353 -2597 2874 -3188 3546 -3964 4452 -5034 5742 -6627 7760 -9276
64 -9276 11406 -14614 19958 -30412 58175 -277913 -618161 307961 195781 -217115 125014
75 125014 167320 -264503 -114588 198986 100927 24319 17635 -239228 -78842 252249 -1333
86 -1333 -64268 139239 -198133 -198615 279476 132659 -167154 26974 11226 -198164 60561
97 60561 271184 -97726 -172884 90673 -93901 -57463 306161 -6993 -272665 69435 62028
108 62028 -106861 127006 131935 -179176 -118650 118438 22355 12071 128451 -130820 -168806
$$ packed form
0@%%%%%%%%%%Qj6J6j6K4l2M0n6O6p4Q8j09J33j55J79k08K42k82L25l70M23m83
32b57N48o20O99p85Q79r84J102j230J367j516J681j863K058k271K506k763L045
49A596l353L693m068M485m950N471o062O734p510Q416r486J0776j2369J4387j7036
64i276K0682k6020L4572n0370Q8587l36088l40248R26122j12180m12896L42129
75A25014M2306m31823J49915L13574r8059p6608o684k56863J60386L31091k53582
86a333o2935K03507l37372m82M78091j46817k99813J94128j5748k09390K58725
97F0561K10623l68910p5158K63557j84574L6438L63624l13154k65672L42100p407
108F2028j68889K33867M929l11111O0526K37088r6083j0284J16380k59271l7986
$$ plain form
119 -168806 172507 42178 -89468 147717 -26199 -226429 79266 166213 -61292 -26588
129 -26588 59083 -105118 -62620 180209 31698 -115580 54927 -43908 -100895 168823 65223
140 65223 -143856 22736 35757 -92862 50178 136633 -70436 -121878 68171 24736 -48964
151 -48964 103593 -1509 -142613 52705 48278 -59180 79755 29806 -131150 -9174 96949
162 96949 -13853 -37340 56328 -35306 -98961 86016 63048 -82281 27368 6506 -91794
173 -91794 56586 65134 -60905 -4289 20230 -53567 -3802 83959 -6965 -86070 33902 24888
185 24888 -65884 58540 47099 -91059 2720 37901 -36027 28041 34396 -48777 -26201 37215
197 37215 8366 -26758 35730 7930 -73287 31647 52936 -50303 17621 27013 -58943 12276
$$ packed form
119a68806L41313j30329j31646K37185j73916k00230L05695Q6947k27505L4704
129b6588Q5671j64201M2498K42829j48511j47278J70507r8835n6987K69718j03600
140F5223k09079J66592J3021j28619J43040Q6455k07069n1442J90049m3435p3700
151d8964J52557j05102j41104J95318m427j07458J38935m9949j60956J21976J06123
162I6949j10802k3487R3668r1634o3655J84977k2968j45329J09649k0862r8300
173i1794J48380Q548j26039N6616K4519p3797M9765Q7761r0924p9105J19972r014
185B4888r0772J24424j1441j38158R3779L5181p3928O4068O355q3173K2576O3416
197C7215k8849l5124O2488k7800q1217J04934K1289j03239O7924R392q5956P1219
$$ plain form
209 12276 45325 -18558 -8579 16866 -10731 -23992 33043 29009 -46027 6859 30477 -43196
221 -43196 20551 41293 -41717 -345 21169 -20939 10314 21998 -10696 -17858 10805 15222
233 15222 -22674 14113 25847 -45217 3310 38080 -29616 3127 22732 -26260 -2439 14301
245 14301 -1568 -3079 -1023 3983 -14511 2827 21932 -25337 -1029 23086 -31334 3381 26818
258 26818 -24593 -3117 11221 -10429 -1761 1840 5827 -8750 -9292 16051 -12049 -5921 20407
271 20407 -21302 -2740 19018 -19865 3747 12105 -15212 1385 2663 61 -326 -6536 11422
284 11422 -6888 -9130 19941 -11377 -6445 18268 -14113 621 12561 -11108 5373 2372 -4537
297 -4537 6045 -4487 5635 1159 -7981 14500 -5728 -6086 18883 -10778 -2811 14547 -9617
$$ packed form
209A2276L3049o3883R979K5445k7597j3261N7035m034p5036N2886K3618p3673
221d3196O3747K0742q3010M1372K1514m2108L1253J1684l2694p162K8663M417
233A5222l7896L6787J1734p1064M8527L4770o7696L2743J9605m8992K3821J6740
245A4301j5869j511K056N006j8494J7338J9105m7269K4308K4115n4420L4715K3437
258B6818n1411K1476J4338k1650Q668L601L987j4577n42K5343k8100O128K6328
271B0407m1709J8562K1758l8883K3612Q358k7317J6597J278k602l87o210J7958
284A1422j8310k242K9071l1318M932K4713l2381J4734J1940k3669J6481l001o909
297d537J0582j0532J0122m476r140K2481k0228l58K4969k9661P967J7358k4164
$$ plain form
310 -9617 3614 4959 -4969 8054 -4493 1037 7057 -8666 8418 545 -8127 13900 -6983
323 -6983 -4399 13972 -10476 1245 7624 -8830 5528 -1656 -2511 6748 -9325 4543 3702 -11868
337 -11868 9855 -2172 -8190 10841 -8879 -1017 8044 -11358 4241 1701 -8007 5901 -5703
350 -5703 277 4420 -11846 7638 277 -11561 10326 -5022 -5969 8583 -8939 1637 3172
363 3172 -8835 6437 -3118 -3960 6787 -8160 3274 2667 -10097 9523 -2554 -7762 11642
376 11642 -6380 -2753 8002 -6322 3811 -14 -3732 8467 -6184 1149 7048 -8679 7237
389 7237 1767 -7719 11574 -4253 -4335 11305 -5951 920 5169 -4095 5547 -2771 636 7619 -8991
404 -8991 5937 5361 -9922 10203 298 -7359 9888 -4579 -1118 7234 -5943 3012 390 -2430
$$ packed form
310i617J3231J345r928J3023j2547N530O020j5723J7084p873q672K2027k0883
323f983K584J8371k4448J1721O379j6454J4358p184q55R259j6073J3868q41j5570
337a1868K1723j2027o018J9031j9720P862R061j9402J5599k540r708J3908j1604
350e703N980M143j6266J9484p361j1838K1887j5348r47J4552j7522J0576J535
363C172j2007J5272r555q42J0747j4947J1434o07j2764J9620j2077n208J9404
376A1642j8022L627J0755j4324J0133l825l718J2199j4651P333N899j5727J5916
389G237n470r486J9293j5827q2J5640j7256O871M249r264R642q318L407O983j6610
404h991J4928n76j5283K0125r905p657J7247j4467L461Q352j3177Q955k622k820
$$ plain form
418 -2430 5497 -6388 3862 4243 -12011 8678 2574 -10866 9473 -2080 -6666 6723 -4416
431 -4416 380 1169 -4491 3699 -5051 613 5327 -10975 4693 2630 -12037 9426 -88 -10214
445 -10214 7687 -3613 -4213 4703 -2643 703 -4065 -421 6136 -8860 3349 5500 -12916 6363
459 6363 3310 -9497 8733 -2019 -7287 6876 -1749 53 588 -1343 3213 -7218 4454 8380
473 8380 -12141 5329 5591 -11428 9196 3961 -7909 5632 -1670 -992 4718 -132 3033 -4402
487 -4402 530 7010 -7693 6496 6387 -14267 6883 6963 -8812 7607 1718 -6608 2457 798
501 798 3906 -953 -1955 3740 -7601 4164 9329 -10857 3758 4111 -12593 8105 5732 -8069
515 -8069 2483 -1722 -2415 1699 1422 3687 -8471 -1786 6825 -9045 4944 7020 -14929 2072
$$ packed form
418b430P927j1885J0250L81j6254K0689o104j3440K0339j1553m586J3389j1139
431d416M796P89n660Q190q750N664M714j6302J5668k063j4667K1463r514j0126
445a0214J7901j1300o00Q916p346L346m768L644O557j4996J2209K151j8416J9279
459F363l053j2807J8230j0752n268J4163q625J802N35j931M556j0431J1672L926
473H380k0521J7470K62j7019K0624n235j1870J3541p302O78N710m850L165p435
487d402M932O480j4703J4189j09k0654K1150Q0j5775J6419n889q326R065j659
501G98L108m859j002N695j1341J1765N165k0186J4615L53j6704K0698k373j3801
515h069J0552m205o93M114k77K265j2158O685Q611j5870J3989K076k1949J7001
$$ plain form
529 2072 5233 -7358 5976 199 -7129 -634 -649 4241 -1618 -1825 2912 -10827 2137 10847 -10651
544 -10651 2266 3809 -12820 5293 6900 -4618 577 -2851 -1441 131 1908 7062 -7621 -3023
558 -3023 6587 -7400 6333 8931 -13021 1245 5090 -5848 6506 4103 -4142 -3230 -750 7014
572 7014 -146 -140 5167 -9651 759 11159 -6124 4015 3899 -11761 4094 7770 -1246 1664
586 1664 -1903 -909 -1642 2331 9864 -6378 -4042 6316 -7872 4157 10551 -9613 -982 2092
600 2092 -4939 5483 3314 -2293 -4070 -3844 5373 -740 -242 6081 -11370 -2515 9597 -5844 2579
615 2579 4308 -11426 -351 4512 143 1277 -3127 -1124 -4167 -640 9615 -4874 -4850 4801 -8816
630 -8816 2112 9748 -6983 -993 853 -5852 3404 3711 189 -3504 -4733 4667 -1529 -34 8262
$$ packed form
529B072L161j2591J3334n777p328O495j5M890n859k07M737j3739J2964Q710k1498
544a0651J2917J543j6629J8113J607j1518N195l428J410J572J777N154j4683M598
558c023R610j3987J3733K598k1952J4266L845j0938J2354k403q245R12K480P764
572G014p160ON307j4818J0410J0400j7283J0139j16j5660J5855L676r016K910
586A664l567R94p33L973P533j6242K336J0358j4188J2029O394k0164Q631L074
600B092p031J0422k169n607j777K26R217o113M98O323j7451Q855J2112j5441Q423
615B579J729j5734J1075M863m369J134m404K003l043L527J0255j4489K4R651j3617
630h816J0928P636j6731N990J846o705R256L07l522l693j229R400o196J495Q296
$$ plain form
645 8262 -8522 -4127 7714 -3858 3225 5017 -7932 -551 2112 1026 3191 -1581 894 -4088
659 -4088 -2235 10015 -2304 -3022 5517 -7607 756 9170 -3160 238 853 -4284 3045 2439 3051
674 3051 -788 -5203 4016 -1355 -333 9016 -6430 -3977 6169 -4292 2607 5278 -5096 -720
688 -720 -413 1002 2956 -1972 1703 -3184 -4406 7511 -1788 -2502 5095 -6907 -1367 6156 -3041
703 -3041 829 -128 -4040 1082 -707 2959 -322 -5365 2926 -2249 -2803 7318 -4484 -4096 4095
718 4095 -4526 1260 3578 -3298 -208 -2185 -169 2359 -2396 2724 -1860 -4831 5836 -1442 -2154
733 -2154 5477 -5223 -1076 4476 -2443 2079 132 -2121 1608 -1768 3007 1695 -4000 3565 -1235
748 -1235 -2498 6634 -2503 -1782 3937 -3502 1471 3042 -1453 1786 -1790 275 2788 -2301 3189
$$ packed form
645H262j6784M395J1841j1572P083J792j2949P381K663j086K165m772K475m982
659d088J853J2250j2319p18Q539j3124Q363Q414j2330L398O15n137P329o06O12
674C051l839m415R219n371J022R349j5446K453J0146j0461O899K671j0374M376
688g20L07J415J954m928L675m887j222J1917r299p14P597j2002N540P523r197
703c041L870r57l912N122j789L666l281n043Q291n175n54J0121j1802L88Q191
718D095q621N786K318o876L090j977K016K528m755N120m584k971J0667p278p12
733b154P631j0700M147N552o919M522j947k253L729l376M775j312n695P565m800
748a235j263R132r137P21N719p439M973J571m495L239l576K065K513n089N490
$$ plain form
763 3189 175 -4486 5180 -563 -1719 4867 -3609 -982 2936 -2191 2348 -240 -1431 2167 -2834
778 -2834 2269 1759 -4100 3013 -991 -3229 4496 -2351 -1476 2690 -3757 1116 885 -2301 2246 -2608
794 -2608 -407 2069 -3718 2224 145 -4266 3336 -1523 -2128 3355 -3305 -65 1183 -2725 2092
809 2092 -980 -1701 2468 -3364 1267 1797 -3917 2941 -562 -2960 3596 -1837 -779 2491 -2997 1910
825 1910 186 -1855 2923 -1995 42 2624 -3474 2327 946 -3248 3333 -1159 -961 3015 -2458
840 -2458 1140 1515 -2421 3030 -785 -881 2945 -2874 1301 2021 -3008 2828 -261 -1515 3262 -1790
856 -1790 271 2252 -2682 2209 183 -2161 3273 -1939 -231 2494 -3015 1439 794 -2730 2685
871 2685 -1393 -818 2292 -2727 1103 674 -3078 2675 -1466 -1633 3029 -2925 477 1292 -3068 1917
$$ packed form
763C189l014m661R666n743j156O586q476K627L918n127M539k588j191L598n001
778b834N103n10n859P113m004k238P725o847Q75M166o447M873k31l186M547m854
794b608K201K476n787N942k079m411P602m859o05N483o660L240J248l908M817
809B092l072p21M169n832M631N30n714O858l503k398O556n433J058L270n488M907
825A910j724k041M778m918K037K582o098N801j381m194O581m492J98L976n473
840b458L598L75l936N451l815r6L826n819M175P20n029N836l089j254M777n052
856a790K061J981m934M891k026k344N434n212J708K725n509M454o45l524N415
871B685m078N75L110n019L830m29l752N753m141j67M662n954L402Q15m360M985
$$ plain form
887 1917 -797 -2038 2749 -2476 115 1553 -2944 2148 -260 -2375 2745 -2194 -420 2088 -2857
902 -2857 1489 594 -2551 2508 -1666 -542 2235 -2748 1512 1231 -2445 2816 -1168 -1079 2960 -2375
918 -2375 896 1615 -2341 1993 -402 -778 2415 -2000 840 1638 -2774 2389 64 -1553 2842 -1699
934 -1699 234 2481 -2297 1757 687 -1977 2917 -1138 -226 2584 -2367 1601 577 -1988 2526
949 2526 -1264 -982 2693 -2035 598 867 -2371 2154 -784 -1251 2529 -2231 410 1412 -2282 1956
965 1956 -678 -1839 2357 -2142 -231 1881 -2464 1317 -16 -1846 1882 -1728 -730 1688 -2544
980 -2544 1239 176 -2253 2074 -1683 -912 2013 -2697 508 716 -2737 1702 -550 -1302 2070 -1955
996 -1955 489 940 -2312 2085 -400 -1126 2388 -1920 112 1783 -2527 1793 473 -1807 2322 -772
$$ packed form
887A917k714j241M787n225K591J438m497N092k408k115N120m939J774K508m945
902b857M346q95l145N059m174J124K777m983M260k81l676N261l984Q9M039n335
918b375L271P19l956M334k395l76L193m415K840P98m412N163k325j617M395m541
934a699J933K247m778M054j070k664M894m055R12K810m951L968j024k565M514
949B526l790K82L675m728K633K69l238M525k938m67L780m760K641J002l694M238
965A956k634j161M196m499J911K112m345L781j333j830L728l610R98K418m232
980b544L783j063k429M327l757P71K925m710L205K08l453M439k252p52L372m025
996a955K444M51l252M397k485p26L514m308K032J671m310M320j320k280M129l094
$$ plain form
1012 -772 -172 1852 -1795 1482 412 -1293 2514 -1505 -413 2539 -2103 1159 1503 -2255 2025 -348
1028 -348 -746 2287 -1263 542 671 -1699 2581 -633 -957 2567 -2151 297 2147 -2054 1591 501
1044 501 -1872 1653 -846 -189 927 -2166 1275 -159 -1365 2492 -1885 -868 1925 -2562 854
1059 854 1301 -2571 1240 -504 -987 1066 -1420 581 -14 -2209 2094 -1037 -1173 2366 -2348 -284
1075 -284 1687 -2519 1119 610 -1724 1118 -683 223 644 -1965 1497 -698 -1434 2661 -1504 -758
1091 -758 2232 -2199 525 1367 -1731 1143 -528 -529 1374 -1065 1500 169 -1868 2518 -641 -794
1107 -794 2540 -2241 -289 1797 -1435 1218 569 -1125 985 -695 940 970 -1627 2120 -530 -1270
1123 -1270 3070 -1266 -472 2302 -1984 423 1303 -1322 817 -524 -296 952 -1085 1432 -302 -2218
$$ packed form
1012g72O00K024l647L277j070j705L807m019J092K952m642L262L44l758M280k373
1028c48l98L033l550J805J29k370M280l214l24L524m718K448J850m201L645j090
1044E01k373L525k499O57J116l093L441j434j206L857m377J017K793m487L416
1059H54M47l872L811j744m83K053k486K001n95k195M303l131j36L539m714K064
1075b84J971m206L638n09k334K842j801R06M21k609L462k195p36M095m165P46
1091g58K990m431K724Q42l098K874j671jJ903k439K565j331k037M386l159j53
1107g94L334m781J952K086l232K653o49j694K110j680J635L0k597L747k650p40
1123a270M340m336P94K774m286K407Q80k625K139j341K28J248k037K517j734j916
$$ plain form
1139 -2218 2136 -998 -1296 2488 -2029 -709 1335 -1395 895 -46 -1106 560 -1153 799 369 -1827
1155 -1827 1698 -708 -1852 2513 -1305 -880 1671 -1893 -93 676 -830 377 -933 -11 776 -1325
1171 -1325 1449 -405 -2123 2043 -679 -1168 2395 -1295 -427 1330 -1056 959 -165 -395 775 -1241
1187 -1241 853 633 -1768 2070 -425 -1630 2399 -731 -600 1753 -953 354 917 -324 981 -784
1203 -784 456 1056 -1355 1657 392 -1797 2399 -657 -1079 2325 -872 -380 975 -881 950 -333
1219 -333 -211 712 -1297 785 525 -1952 1988 -443 -1823 2307 -1127 -699 1247 -1101 142 148 -472
1236 -472 623 -1151 168 522 -1687 1643 378 -1879 1507 -773 -879 1690 -1119 -107 367 -959
1252 -959 479 -303 -32 669 -1537 698 558 -1855 1318 -141 -1663 1586 -502 -277 749 -1059
$$ packed form
1139b218M354l134k98L784m517J320K044k730K290r41j060J666j713J952m30k196
1155a827L525k406j144M365l818M25K551l564J800P69j506J207j310R22P87k101
1171a325K774j854j718M166k722m89L563l690Q68J757k386K015j124k30J170k016
1187a241K094k20k401L838k495j205M029l130J31K353k706J307N63j241J305j765
1203g84J240O00k411L012j265k189M196l056m22L404l197M92J355j856J831j283
1219c33J22R23k009K082k60k477L940k431j380M130l434M28J946k348J243Oo20
1236d72J095j774J319L54k209L330j265k257L386k280j06K569k809J012M74j326
1252i59J438p82K71P01k206K235j40k413L173j459j522L249k088K25J026j808
$$ plain form
1268 -1059 411 -204 -452 1138 -1114 -55 1010 -1344 948 760 -1407 1768 -77 -683 1676 -751
1284 -751 154 284 -806 1060 -475 -106 1253 -1446 766 1055 -1491 1601 86 -1183 1546 -657
1300 -657 -58 1067 -737 914 -147 -469 1386 -765 326 833 -1432 890 357 -913 1090 -349
1316 -349 -344 1095 -829 439 465 -927 990 -480 -393 1154 -1770 244 590 -1715 873 -73 -1050 1033
1334 1033 -679 180 602 -1049 799 -230 -851 1144 -961 52 714 -1502 789 -101 -757 989
1350 989 -670 -593 909 -1155 422 217 -1279 971 -661 -187 1041 -927 412 752 -1333 1183
1366 1183 -13 -491 724 -756 513 516 -895 991 -171 -623 1181 -854 277 784 -842 726
1382 726 359 -791 1058 -555 -437 883 -1028 755 394 -801 1036 -319 -218 983 -1143 286
$$ packed form
1268a059J470o15k48J590k252J059J065k354K292j88k167L175j845o06K359k427
1284g51R05J30j090J866j535L69J359k699K212K89k546L092j515j269K729k203
1300f57N99J125j804J651j061l22J855k151J091N07k265K322n33j270K003j439
1316c49NJ439j924J268K6j392J917j470Q7J547k924K014L46k305K588r46r77K083
1334A033j712Q59M22j651J848j029o21J995k105J013O62k216K291q90o56J746
1350I89j659P7J502k064J577k05j496K250j632M74J228j968J339L40k085K516
1366A183j196m78J215j480J269Lj411J886j162m52J804k035J131N07j626J568
1382G26l67j150J849j613J18J320j911J783l61j195J837j355J01J201k126J429
$$ plain form
1398 286 482 -861 1247 -253 -583 742 -907 280 438 -1148 696 19 -595 773 -734 56 154
1415 154 -1024 456 -107 -893 918 -752 -402 729 -1236 567 43 -956 1033 -428 -222 645 -930
1432 -930 229 327 -1109 866 -294 -557 849 -1036 197 408 -880 776 -191 -437 700 -684 198
1449 198 270 -758 789 -137 -743 984 -663 -219 923 -535 749 195 -446 683 -457 52 730
1466 730 -683 350 341 -752 758 -40 -493 919 -676 272 355 -789 804 -73 -310 645 -600 94
1484 94 613 -855 837 -96 -618 1000 -700 -44 633 -931 355 -17 -791 712 -704 129 747 -782
1502 -782 566 135 -937 871 -289 -462 546 -725 113 563 -755 715 -472 -324 331 -851 259
1519 259 468 -958 889 -138 -603 1000 -704 -173 296 -585 428 -51 -686 905 -493 171 570
$$ packed form
1398B86J96j343K108j500l30J325j649J187J58j586J844o77o14J368j507P90R8
1415A54j178J480n63p86J811j670L50J131j965J803n24r99J989j461K06Q67j575
1432i30J159R8j436J975j160k63J406j885J233K11j288J656r67k46J137j384Q82
1449A98P2j028J547r26o06J727j647M44J142j458J284n54o41J129j140N09O78
1466G30j413J033rj093J510p98m53J412j595R48Q3j144J593q77k37R55j245O94
1484I4N19j468J692r33n22J618j700O56O77j564J286l72p74J503j416Q33O18j529
1502g82J348m31j072J808j160j73J008j271Q38M50j318J470j187J48O55j182J110
1519B59K09j426J847j027m65J603j704N31M69q81J013m79o35J591j398O64L99
$$ plain form
1536 570 -605 362 81 -617 791 -233 -301 517 -496 401 353 -723 796 -214 -92 532 -753 341
1554 341 357 -741 554 183 -275 699 -479 20 336 -653 637 98 -571 733 -640 48 587 -739
1572 -739 323 252 -527 635 -356 -171 478 -392 644 141 -822 753 -111 -339 788 -594 32 377
1590 377 -895 500 -167 -154 196 -594 -45 -12 -767 407 -377 -658 655 -317 -331 500 -736 99 75 -535
1610 -535 472 -458 -84 423 -728 493 282 -658 597 -277 -445 695 -711 359 380 -553 422 -134
1628 -134 -338 606 -571 285 216 -684 714 4 -699 855 -94 -227 360 -757 218 194 -439 474 -241
1647 -241 40 480 -591 342 421 -583 551 -4 -237 577 -301 77 259 -15 358 -220 -230 479 -502 -144
1667 -144 194 -658 643 22 -338 553 -207 -94 272 -728 79 10 -146 299 -283 -43 468 -571 309
$$ packed form
1536E70j175R67k81o98J408j024o8Q18j013Q97m8j076J519j010J22O24j285J094
1554C41J6j098J295l71m58R74j178M99L16r89J290n39o69J304j373O88N39j326
1572g39J062p1p79J162r91J85O49q70J036n03r63J575q64k28J127j382O26L45
1590C77j272J395o67J3L50p90N49L3p55J174p84k81J313r72j4Q31j236Q35k4o10
1610e35J007r30L74N07j151J221k11r40J255q74j68J140j406J070K1r33R75n56
1628a34k04R44j177Q56o9r00J398p10p03J554r49j33N87j117R75k4o33R13p15
1647b41K81M40j071R33P9j004J134n55k33Q14q78L78J82k74L73n78j0P09r81L58
1667a44L38q52J301o21l60Q91p60J13L66j000Q07o9j56M45n82K40N11j039Q80
$$ plain form
1686 309 258 -576 643 -188 -436 473 -574 -232 201 -511 222 -288 43 430 -587 -52 190 -696 677
1705 677 -18 -237 334 -323 -56 63 -529 138 41 -105 637 -370 -102 288 -757 486 546 -586 580
1724 580 250 -324 101 -475 291 212 -442 404 -60 -35 798 -502 396 405 -245 402 -17 -313 453 -174 -64
1745 -64 204 -204 378 -14 -291 394 -467 24 499 -600 379 275 -354 384 25 -542 172 -78 215 85
1765 85 -470 144 -239 60 46 -784 223 347 -577 310 76 -404 193 -57 154 157 -274 143 -117 -312 475
1786 475 -266 -144 356 -507 49 -64 -238 236 -133 6 245 -276 344 -138 -197 257 -314 6 84 -507 81
1807 81 319 -450 336 -99 -134 254 -518 84 23 -207 535 72 25 621 -259 -46 284 -500 328 34 -250
1828 -250 403 -184 -44 115 -341 356 78 -256 497 -200 -344 171 -520 73 528 -431 404 21 -30 -25 -142
$$ packed form
1686C09n1q34J219q31k48R09j047L42M33p12P33n10L31L87j017N35K42q86J373
1705F77o95k19N71o57K67J19n92O67r7j46P42j007K68L90j045J243O0j132J166
1724E80l30n74M25n76P66p9o54Q46m64K5Q33j300Q98Ro50O47m19k96P66o27J10
1745f4K68m08N82l92k77O85q61M91M75j099R79j04o29P38l59n67P14k50K93j30
1765H5n55O14l83K99j4q30J007J24r24Q87k34m80N97k50K11Lm31M17k60j95P87
1786D75p41J22N00q63N56j13j74M74l69J39K39n21O20m82n9M54n71L20P8n91N88
1807H1K38p69P86m35l5L88p72O02o1k30P42m63m7N96q80K13L30p84Q28k94k84
1828b50O53n87J40J59m56O97k78l34P53o97j44N15o91N93M55r59Q35l83n1Nj17
$$ plain form
1849 -142 282 67 -358 367 -24 -142 491 -206 -66 167 -469 223 14 -73 207 -201 -452 280 -249 50
1869 50 122 -475 230 -247 -119 303 -192 -210 290 -377 -21 -166 -481 197 -565 51 147 -261 151 -181 -156 207
1891 207 -465 -94 -197 -478 -28 30 -329 271 -77 -113 155 -123 261 20 -103 448 -292 -43 491 -180 420
1912 420 155 -226 255 -198 91 190 -238 264 258 -69 390 68 -41 396 -204 203 143 -149 416 9 -209
1933 -209 158 34 -84 41 -265 -126 -111 -269 551 -486 74 678 -333 73 48 -139 292 -79 -154 454
1953 454 -365 155 9 -400 279 -121 -206 350 -122 -12 76 -233 376 -199 -291 334 -236 -316 175 -281 -25
1974 -25 -19 -12 192 -31 -154 110 65 228 208 -224 173 28 -189 208 -150 424 209 -318 138 -329 -217 249
1996 249 -354 53 145 -281 0 92 -191 333 -121 55 157 -669 440 54 -278 108 -114 -16 245 -208 156
$$ packed form
1849a42M24k15m25P25l91j18O33o97J40K33o36O92k09q7K80m08k51P32n29K99
1869E0P2n97P05m77J28M22m95j8N00o67L56j45l15O78p62O16R6m08M12l32K5L63
1891B07o72L71j03k81M50N8l59O00l48l6K68k78L84k41j23N51p40K49N34o71O00
1912D20k65l81M81m53K89R9m28N02ol27M59l22j09M37o00M07o0k92N65m07k18
1933b09L67j24j18J25l06J39J5j58Q20j037N60O04j011M06k5j87M31l71p5O08
1953D54q19N20j46m09O79m00q5N56m72J10Q8l09O09n75r2O25n70q0M91m56K56
1974b5OPK04k23j23K64m5J63k0m32L97j45k17L97l58N74k15n27M56m67J12M66
1996B49o03M07R2m26K81R2k83N24m54J76J02q26J109l86l32L86k22R8K61m53L64
$$ plain form
2017 156 118 -288 63 21 -31 -37 -136 63 189 -256 130 98 -192 157 -220 -169 75 -47 32 -170 54 196 -409
2040 -409 -96 244 -105 165 19 -191 113 -98 -60 -107 -335 -153 45 -349 -96 49 -273 224 -409 28 -11
2061 -11 -516 132 -20 -122 314 -210 197 33 -323 131 -202 -141 96 -402 101 261 -3 401 1 -133 196
2082 196 -27 74 -14 -129 25 -10 -170 224 109 116 47 -306 205 279 -54 31 -283 -104 198 -380 111 -68
2104 -68 -160 202 -17 58 44 -62 141 123 -68 -243 32 -5 -4 -356 161 141 -99 134 112 19 -87 26 123 148
2128 148 -144 144 199 -37 250 -12 79 29 -432 79 23 -334 182 -21 -88 -12 -339 -316 153 -158 105 -82
2150 -82 -107 142 -152 8 201 -340 221 -60 -230 167 -120 -54 150 -154 127 217 -172 -155 201 -81 192 -97
2172 -97 -166 44 -81 65 -248 6 -19 -55 95 -68 -311 137 -177 84 303 33 -69 -81 -135 90 155 -106
$$ packed form
2017A56l8m06L51m2n2or9J99J26m45L86l2k90L49l77N1K44j22P9k02K24J42o05
2040d09L13L40l49K70j46k10L04k11L8m7k28J82J98l94K53J45l22M97o33M37l9
2061a1n05O48j52j02M36n24M07j64l56M54l33O1K37m98N03J60k64M04m00j34L29
2082A96k23J01q8j15J54l5j60L94j15Po9l53N11P4l33Q5l14J79L02n78M91j79
2104f8r2L62k19P5j4j06K03j8j91j75K75l7Jl52N17k0k40K33k2r3j06J13R7K5
2128A48k92K88N5k36K87k62R1n0m61N11n6l57N16k03o7P6l27K3M69l11K63j87
2150h2k5K49k94J60J93n41N61k81j70L97k87O6K04l04K81R0l89J7L56k82K73k89
2172i7o9K10j25J46l13K54k5l6J50j63k43M48l14K61K19k70j02j2n4K25O5k61
$$ plain form
2194 -106 169 -55 187 259 -181 -145 -22 -253 176 65 152 -87 98 -103 -148 -201 198 -15 -278 279 -138 11
2216 11 266 -239 277 -97 19 185 -324 189 -319 54 -36 -26 118 9 59 -225 -22 -138 26 109 -245 143
2238 143 -177 -182 144 -17 175 -212 -402 34 -105 -109 37 -66 -310 -153 -162 135 6 70 -27 -203 -78 105 -275
2261 -275 -84 -54 -4 27 -273 201 185 -259 134 23 -91 371 -84 -128 -65 59 20 -5 -168 -168 -235 -58 -4 -92
2285 -92 -2 -157 -194 230 129 -200 -20 -304 26 122 168 45 -60 -274 -41 -364 -51 -73 -187 -13 -155 -124
2307 -124 238 12 -38 -69 3 198 115 -229 -102 -263 -135 241 -1 181 -342 -211 376 -76 70 -37 -7 73
2329 73 -168 24 18 -114 -130 118 134 -334 -14 13 -173 -257 55 91 -8 -138 -164 -187 -53 50 275 529 -48 -41
2353 -41 -104 -189 -135 -5 26 87 167 -31 413 -246 135 102 -368 -10 73 105 100 201 -156 181 -89 -21 240 43
$$ packed form
2194a06K75k24K42P2m40L6J23k31M29j11Q7k39J85k01m5n3L99k13k63N57m17J49
2216A1K55n05N16l74J16J66n09N13n08L73r0J0J44j09N0k84K03j16J64Q3l54L88
2238A43l20nL26j61J92l87j90M36j39mJ46j03k44J57rK97j29O4r7j76J25J83l80
2261b75J91L0N0L1l00M74j6m44L93j11j14M62m55m4O3J24l9k5j63%o7J77N4q8
2285i2R0j55l7M24j01l29J80k84L30R6M6j23j05k14K33l23L13k2j14J74j42L1
2307a24L62k26n0l1P2J95q3l44J27j61J28L76k42J82n23J31N87m52J46j07L0Q0
2329G3k41J92oj32j6K48J6m68L20K7j86q4L12L6r9j30k6k3J34J03K25K54n77P
2353d1o3q5N4J30L1O1Q0j98M44o59L81l3m70L58Q3L2nJ01l57L37k70O8K61j97
$$ plain form
2377 43 97 -44 173 7 220 -128 -61 35 -14 -194 -30 133 23 -39 29 -85 52 -108 -364 40 -7 112 4
2400 4 -80 41 -91 -121 296 90 251 171 -28 128 143 101 -93 -89 -206 138 -126 111 19 -376 310 -378 77
2423 77 260 82 42 -15 160 -49 58 -175 110 117 73 151 -17 60 173 117 189 169 226 24 -325 48 -238 -39
2447 -39 35 -31 132 310 -140 -92 -48 -245 51 26 90 -122 8 180 367 111 170 -104 -230 224 -225 56 75
2470 75 -31 39 50 -173 160 13 397 77 -157 112 -30 -99 193 40 -24 188 -229 -331 47 3 320 50
2492 50 158 219 -154 -26 180 -147 115 -2 -238 47 -72 16 -74 -245 -180 229 -7 -8 189 72 8 -19 43
2515 43 -93 -105 192 -41 -23 93 -60 -92 202 -51 31 156 -126 3 -10 138 106 82 28 -106 -45 200 137 -348
2539 -348 26 -58 -151 98 -47 -151 65 79 87 66 236 164 175 155 -55 147 175 -116 20 108 -360 178 -36 -92
$$ packed form
2377D3N4j41K17j66K13l48O7R6m9j80J64J63j10o2O8j14J37j60k56M04m7J19j08
2400Dq4J21j32l0M17k06J61q0j99J56J5m2j94Mj17L44k64K37r2l95O86o88M55
2423G7J83j78m0n7J75k09J07k33K85Pm4P8j68P7J13n6P2k0N7k02l49L73k86J99
2447c9P4o6J63J78m50M8M4j97K96k5O4k12J30J72J87k56N9k74j26M54m49K81J9
2470G5j06P0J1k23L33j47L84l20k34K69j42o9K92j53o4K12m17j02L78m4L17k70
2492E0J08O1l73J28K06l27K62j17k36K85j19Q8r0j71O5M09k36jJ97j17o4k7O2
2515D3j36j2K97k33J8J16j53l2K94k53Q2J25k82J29j3J48l2k4n4j34O1K45o3m85
2539c48L74q4r3K49j45j04K16J4Qk1J70p2J1k0k10K02K8k91J36Q8m68N38k14n6
$$ plain form
2563 -92 208 -125 163 113 -71 -248 149 -101 70 -143 -100 190 -6 -181 144 -55 165 15 -75 -117 -74 -25
2585 -25 121 -122 216 77 -100 -9 177 -249 -55 -115 -109 -123 142 23 -13 78 -107 -230 175 65 162 205 91
2608 91 -154 151 -262 53 114 -62 -72 37 -201 119 -117 -66 -38 26 -108 -79 -105 325 145 -16 237 -142 -94
2631 -94 -119 -36 -31 31 -14 -75 -110 37 136 133 -105 114 69 163 -160 144 -131 -78 258 -16 -167 -61 -90 69 12 -59
2657 -59 178 -193 82 107 -231 -101 -290 -4 140 194 -128 148 -60 -81 30 -43 140 -31 -96 101 174 -75
2679 -75 238 14 240 86 81 127 -110 -103 -19 -255 101 -125 44 -89 -220 -91 -57 -258 7 -19 -112 197 -19
2702 -19 -120 261 -4 191 -79 -42 49 -9 -193 103 -223 -93 242 -269 13 -188 -3 138 56 -180 -64 -137
2724 -137 2 -167 -4 -62 11 -236 -52 -12 -59 250 15 184 264 -279 111 186 -52 69 203 -74 28 -70
$$ packed form
2563i2L00l33K88n0j84j77L97k50J71k13M3K90j96j75L25j99K20j50r0m2M3M9
2585b5J46k43L38j39j77R1J86m26J94o0Oj4K65j19l6R1j85j23M05j10R7M3j14
2608I1k45L05m13L15O1j76j0J09k38L20k36N1K8O4j34K9k6M30j80j61K53l79M8
2631i4k5Q3NO2m5o1l5J47R9lk38K19m5R4l23L04k75N3L36k74j51J06k9J59n7p1
2657e9K37l71K75K5l38J30j89K86J44N4l22K76k08k1J11p3J83j71o5J97P3k49
2679g5L13k24K26j54nM6k37PQ4k36L56k26J69j33j31J29L4k01K65k6r3L09k16
2702a9j01L81k65J95k70L7R1n8j84K96l26J30L35n11K82k01J85J41q2k36J16p3
2724a37J39j69J63n8P3k47J84M0m7L09k35J69Q0n43L90P5k38J21J34k77J02r8
$$ plain form
2746 -70 80 -102 -177 -57 -93 -29 109 -106 290 194 195 235 96 -75 44 -5 -7 124 -120 44 5 46 -131 -149 -146
2771 -146 -166 -90 39 -143 -222 103 -23 -162 84 -108 104 -288 -159 1 21 -163 -109 -64 110 -1 38 -93
2793 -93 -98 -58 -90 83 -180 -53 -149 25 -31 -40 302 243 249 132 134 298 64 -214 108 118 -72 -275 8 -28 217
2818 217 -54 65 100 97 -85 -157 -42 32 -123 -47 61 -279 -110 234 23 -39 283 74 121 -132 -89 -21 -20 -56
2842 -56 131 -152 20 55 -92 -451 -7 -82 -8 170 -268 -96 39 -261 68 210 -85 -30 -11 -37 7 51 121
2865 121 48 -182 -221 -232 -43 63 -168 -94 166 30 139 -110 51 -76 -42 99 173 68 -1 -273 -94 14
2887 14 27 -27 -65 88 143 -33 137 46 -62 108 98 -202 4 148 -147 -10 -225 114 111 92 -207 269 67
2910 67 178 173 -54 335 -63 96 -182 77 -52 -42 -155 227 39 -226 290 159 53 66 149 146 -16 19 64
$$ packed form
2746g0J50j82p5J20l6O4J38k15L96r6JM0j39j71J19m9kJ31k44J64l9M1j77j8L
2771a46k0P6J29j82p9L25j26j39K46j92K12l92J29J60K0j84N4M5J74j11L9j31
2793i3nM0l2J73k63J27r6J74n6rL42n9Oj17KJ64k34k78L22J0j90k03K83l6K45
2818B17k71J19L5lj82p2J15P4j55P6J08l40J69L44k11o2L22k09M7k53M3O8Jl6
2842e6J87k83J72L5j47l59M44p5P4J78m38J72J35l00L29J42k95N5J9k6M4M4P0
2865A21p3k30l9j1J89J06k31P4K60j36J09k49J61j27L4J41P4j05o9k72J79J08
2887A4J3n4l8J53N5j76J70r1j08J70j0l00K06J44k95J37k15L39lj9k99M76k02
2910F7J11nk27L89l98J59k78K59j29J0j13L82j88k65N16j31j06J3Q3lj62L5M5
$$ plain form
2933 64 27 64 -110 -216 16 -7 5 -67 -78 -154 103 54 82 36 -154 231 -183 30 -147 -78 141 296 204 192 -95
2958 -95 -82 -52 -261 -149 10 -80 -33 99 -44 135 -1 19 -5 19 83 109 -37 416 35 6 405 -55 54 -10
2982 -10 169 98 241 -86 -301 212 81 -23 131 -150 174 -101 155 -231 -108 109 -42 -99 -96 129 298 16
3004 16 257 275 -225 134 255 -163 70 -60 -30 82 105 -251 -148 -257 97 227 -34 114 213 -149 189 -62
3026 -62 128 -209 -8 93 85 -29 265 112 85 78 -108 81 38 -43 -168 79 246 -60 32 -89 -123 -30 160 168
3050 168 85 66 -242 116 -167 -258 -14 -199 -93 -49 -162 -182 -297 139 43 -93 80 173 50 -231 151 -120
3072 -120 71 -307 -103 166 33 149 -278 79 -136 152 -309 -217 4 -220 -128 -11 72 109 -1 282 -45
3093 -45 -52 8 -217 -15 -146 -42 10 -38 63 -166 -123 334 -29 131 100 -85 289 348 -55 90 132 -111 -106 -13
$$ packed form
2933F4l7L7j74j06K32k3J2p2j1p6K57m9K8m6j90L85m14K13j77O9K19J55r2j2k87
2958i5J3L0k09J12J59r0M7J32j43J79j36K0k4K4O4K6j46M53l81k9L99m60J09o4
2982a0J79p1J43l27k15N13j31j04J54k81L24k75K56l86J23K17j51n7LK25J69k82
3004A6K41J8n00L59J21m18K33j30L0J12K3l56J03j09L54J30k61J48R9l62L38k51
3026f2J90l37K01J01qj14K94j53k7pj86J89m3q1j25K47J67l06R2j21l4R3J90Q
3050A68q3j9l08L58k83r1K44j85J06M4j13k0j15M36r6j36J73R3j23k81L82k71
3072a20J91l78K04K69j33J16m27L57k15K88m61R2K21k24R2J17Q3L7j10K83l27
3093d5pO0k25K02j31J04N2m8J01k29M3M57l63J60l1j85L74N9m03J45M2k43NR3
$$ plain form
3117 -13 0 246 -49 231 4 -98 -269 -136 179 139 -50 61 -202 -70 311 245 133 -50 -27 205 161 -151
3139 -151 -55 70 -6 17 151 3 46 -283 -97 -219 11 425 -170 -47 200 -57 181 81 -242 99 -155
3160 -155 124 299 -146 88 80 281 202 -163 117 40 -281 43 -189 54 114 209 -239 31 -32 6 -85 -246 -41
3183 -41 -134 8 42 -216 65 103 -274 -156 -118 -20 15 -48 148 98 -63 9 97 -196 7 -50 25 77 -409 125 47
3208 47 16 92 131 -249 -40 -139 -245 78 -188 69 100 -51 -83 -161 157 71 -80 14 15 -187 -142 -108 96 13 -46
3233 -46 -38 -58 -211 289 -18 -67 96 222 185 20 151 -25 85 83 14 -158 37 60 -127 -145 100 -260 244 -22
$$ packed form
3117a3J3K46k95K80k27j02j71J33L15m0j89J11k63J32L81o6j12j83K3K32m4l12
3139a51R6J25p6K3J34j48M3l29J86j22K30M14n95J23K47k57K38j00l23L41k54
3160a55K79J75m45K34qK01p9l65K80p7l21L24k32K43O0R5m48K70o3L8r1j61K05
3183d1r3J42L4k58K81L8l77J18L8R8L5o3J96n0j61P2Q8k93K03n7P5N2m86N34p8
3208D7l1P6L9l80K09r9j06L23k66K57L1j51l2p8L18q6j51R4Jk02M5L4K04q3n9
3233d6Qk0j53N00l07m9J63J26l7j65J31j76J10ko9j72J95K3j87j8K45l60N04k66
$$ [...]
8191a1
##END NTUPLES=NMR FID
##END=
