##TITLE=1H_LR-618-R3-CR19
 CDCl3, 8 sc, 
 28.06.2021
##JCAMPDX= 6.0         $$ Bruker NMR JCAMP-DX V2.0
##DATA TYPE= NMR FID
##DATA CLASS= NTUPLES
##ORIGIN= UXNMR, Bruker Analytische Messtechnik GmbH
##OWNER= root
$$ XWIN-NMR		Version 3.5
$$ Mon Jun 28 13:31:56 2021 Russian Standard Time (UT+4h)  she@DPX200
##.OBSERVE FREQUENCY= 200.131506
##.OBSERVE NUCLEUS= ^1H
##.DELAY= (6, 6)
##.ACQUISITION MODE= SIMULTANEOUS
##.ACQUISITION SCHEME= undefined
##.AVERAGES= 8
##.DIGITISER RES= 18
##SPECTROMETER/DATA SYSTEM= spect
##.PULSE SEQUENCE= zg30
##.SOLVENT NAME= CDCl3
##.SHIFT REFERENCE= (INTERNAL, CDCl3, 0, 15.7039)
##AUDIT TRAIL= $$ (NUMBER, WHEN, WHO, WHERE, WHAT)
$$ ##TITLE= Audit trail, XWIN-NMR		Version 3.5
$$ ##JCAMPDX= 5.01
$$ ##ORIGIN= Bruker BioSpin GmbH
$$ ##OWNER= she
$$ F:/spectra/data/she/nmr/H-F/1/audita.txt
$$ ##AUDIT TRAIL=  $$ (NUMBER, WHEN, WHO, WHERE, WHAT)
(   1,<2021-06-28 13:30:42.65 +0400>,<she>,<DPX200>,
      <created by zg, POWCHK disabled, PULCHK disabled
       configuration hash MD5:
       00 E9 B6 7A A2 85 ED C7 34 08 36 98 17 FE 4E 26
       data hash MD5: 16K
       60 D4 A4 6E E8 E3 98 8F 0A DC B2 A3 22 42 6F 15>)
$$ ##END=
$$ 
$$ hash MD5
$$ C4 EE FA B1 2C E4 2D 33 D0 3E CD 60 51 25 51 C6
##$RELAX= 
##$RELAX= 
##$RELAX= 
##$RELAX= 
##$RELAX= 
##$RELAX= 
$$ Bruker specific parameters
$$ --------------------------
##$DU= <F:/spectra>
##$EXPNO= 1
##$NAME= <H-F>
##$PROCNO= 1
##$TYPE= <nmr>
##$USER= <she>
##$AMP= (0..31)
100 100 100 100 100 100 100 100 100 100 100 100 100 100 100 100 100 100 
100 100 100 100 100 100 100 100 100 100 100 100 100 100 
##$AQSEQ= 0
##$AQ_mod= 1
##$AUNM= <au_zg>
##$AUTOPOS= <>
##$BF1= 200.13
##$BF2= 200.13
##$BF3= 200.13
##$BF4= 200.13
##$BF5= 200.13
##$BF6= 200.13
##$BF7= 200.13
##$BF8= 200.13
##$BYTORDA= 1
##$CFDGTYP= 0
##$CFRGTYP= 5
##$CHEMSTR= <none>
##$CNST= (0..31)
1 1 145 1 1 1 1 1 1 1 1 1 1 1 1 1 1 1 1 1 1 1 1 1 1 1 1 1 1 1 1 1 
##$CPDPRG= <>
##$CPDPRG1= <>
##$CPDPRG2= <>
##$CPDPRG3= <>
##$CPDPRG4= <mlev>
##$CPDPRG5= <mlev>
##$CPDPRG6= <mlev>
##$CPDPRG7= <mlev>
##$CPDPRG8= <mlev>
##$CPDPRGB= <>
##$CPDPRGT= <>
##$D= (0..31)
0 1.2 0 0 0 0 0 0 0 0.06 0 0.03 0 0 0 0 0.0002 0 0 0 0 0 0 0 0 0 0 0 0 
0 0 0 
##$DATE= 1624872642
##$DBL= (0..7)
120 120 120 120 120 120 120 120 
##$DBP= (0..7)
150 150 150 150 150 150 150 150 
##$DBP07= 0
##$DBPNAM0= <>
##$DBPNAM1= <>
##$DBPNAM2= <>
##$DBPNAM3= <>
##$DBPNAM4= <>
##$DBPNAM5= <>
##$DBPNAM6= <>
##$DBPNAM7= <>
##$DBPOAL= (0..7)
0.5 0.5 0.5 0.5 0.5 0.5 0.5 0.5 
##$DBPOFFS= (0..7)
0 0 0 0 0 0 0 0 
##$DE= 6
##$DECBNUC= <off>
##$DECIM= 32
##$DECNUC= <off>
##$DECSTAT= 4
##$DIGMOD= 1
##$DIGTYP= 9
##$DL= (0..7)
0 120 120 120 120 120 120 120 
##$DP= (0..7)
150 150 150 150 150 150 150 150 
##$DP07= 0
##$DPNAME0= <>
##$DPNAME1= <>
##$DPNAME2= <>
##$DPNAME3= <>
##$DPNAME4= <>
##$DPNAME5= <>
##$DPNAME6= <>
##$DPNAME7= <>
##$DPOAL= (0..7)
0.5 0.5 0.5 0.5 0.5 0.5 0.5 0.5 
##$DPOFFS= (0..7)
0 0 0 0 0 0 0 0 
##$DQDMODE= 0
##$DR= 18
##$DS= 0
##$DSLIST= <SSSSSSSSSSSSSSS>
$$ [...]
##$SUBNAM2= <"">
##$SUBNAM3= <"">
##$SUBNAM4= <"">
##$SUBNAM5= <"">
##$SUBNAM6= <"">
##$SUBNAM7= <"">
##$SUBNAM8= <"">
##$SUBNAM9= <"">
##$SW= 20.0188882624521
##$SWIBOX= (0..15)
0 0 2 0 0 0 0 0 0 0 0 0 0 0 0 0 
##$SW_h= 4006.41025641026
##$TD= 16384
##$TD0= 1
##$TE= 0
##$TE2= 300
##$TE3= 300
##$TEG= 300
##$TL= (0..7)
0 120 120 120 120 120 120 120 
##$TP= (0..7)
150 150 150 150 150 150 150 150 
##$TP07= 0
##$TPNAME0= <>
##$TPNAME1= <>
##$TPNAME2= <>
##$TPNAME3= <>
##$TPNAME4= <>
##$TPNAME5= <>
##$TPNAME6= <>
##$TPNAME7= <>
##$TPOAL= (0..7)
0.5 0.5 0.5 0.5 0.5 0.5 0.5 0.5 
##$TPOFFS= (0..7)
0 0 0 0 0 0 0 0 
##$TUNHIN= 0
##$TUNHOUT= 0
##$TUNXOUT= 0
##$USERA1= <user>
##$USERA2= <user>
##$USERA3= <user>
##$USERA4= <user>
##$USERA5= <user>
##$V9= 5
##$VALIST= <valist>
##$VCLIST= <CCCCCCCCCCCCCCC>
##$VD= 0
##$VDLIST= <DDDDDDDDDDDDDDD>
##$VPLIST= <PPPPPPPPPPPPPPP>
##$VTLIST= <TTTTTTTTTTTTTTT>
##$WBST= 1024
##$WBSW= 4
##$XGAIN= (0..3)
0 0 0 0 
##$XL= 0
##$YL= 0
##$YMAX_a= 190782
##$YMIN_a= -343099
##$ZGOPTNS= <>
##$ZL1= 120
##$ZL2= 120
##$ZL3= 120
##$ZL4= 120
##$ABSF1= 10
##$ABSF2= 0
##$ABSG= 5
##$ABSL= 3
##$ALPHA= 0
##$AQORDER= 0
##$ASSFAC= 0
##$ASSFACI= 0
##$ASSFACX= 0
##$ASSWID= 0
##$AUNMP= <proc_1d>
##$AZFE= 0.1
##$AZFW= 0.1
##$BCFW= 1
##$BC_mod= 2
##$BYTORDP= 1
##$COROFFS= 0
##$CY= 11.3945322036743
##$DATMOD= 1
##$DC= 2
##$DFILT= <>
##$DTYPP= 0
##$F1P= 15.9154993809931
##$F2P= -4.1035820241983
##$FCOR= 0.5
##$FTSIZE= 0
##$FT_mod= 4
##$GAMMA= 1
##$GB= 0.15
##$INTBC= 1
##$INTSCL= 1
##$ISEN= 128
##$LB= 0.24
##$LEV0= 0
##$LPBIN= 0
##$MAXI= 10000
##$MC2= 0
##$MEAN= 0
##$ME_mod= 0
##$MI= 1.114404
##$NCOEF= 0
##$NC_proc= 0
##$NLEV= 6
##$NOISF1= 3.799351
##$NOISF2= 2.8
##$NSP= 1
##$NTH_PI= 0
##$NZP= 0
##$OFFSET= 15.70392
##$PC= 1
##$PHC0= -11558.01
##$PHC1= 5.001012
##$PH_mod= 1
##$PKNL= yes
##$PPARMOD= 0
##$PSCAL= 0
##$PSIGN= 0
##$REVERSE= no
##$SF= 200.130013532006
##$SI= 16384
##$SIGF1= 3
##$SIGF2= 2
##$SINO= 400
##$SIOLD= 16384
##$SREGLST= <1H.CDCl3>
##$SSB= 0
##$STSI= 0
##$STSR= 0
##$SW_p= 3612.71676300578
##$SYMM= 0
##$S_DEV= 0
##$TDeff= 0
##$TDoff= 0
##$TI= <>
##$TILT= no
##$TM1= 0
##$TM2= 0
##$TOPLEV= 0
##$USERP1= <user>
##$USERP2= <user>
##$USERP3= <user>
##$USERP4= <user>
##$USERP5= <user>
##$WDW= 1
##$XDIM= 8192
##$YMAX_p= 0
##$YMIN_p= 0
$$ End of Bruker specific parameters
$$ ---------------------------------
##NTUPLES= NMR FID
##VAR_NAME=  TIME,          FID/REAL,        FID/IMAG
##SYMBOL=    X,             R,               I
##VAR_TYPE=  INDEPENDENT,   DEPENDENT,       DEPENDENT
##VAR_FORM=  AFFN,          ASDF,            ASDF
##VAR_DIM=   8192,          8192,            8192
##UNITS=     SECONDS,       ARBITRARY UNITS, ARBITRARY UNITS
##FACTOR=    0.0002496,     1,               1
##FIRST=     0,             0,               0
##LAST=      2.0444736,     0,               0
##MIN=       0,             -343099,         0
##MAX=       2.0444736,     190782,          0
$$ Real data points
##PAGE= N=1
##DATA TABLE= (X++(R..R)), XYDATA
$$ plain form
0 0 0 0 0 0 0 0 0 0 0 0 0 8 -8 8 -8 16 -16 24 -31 32 -40 48 -56 72 -80 96 -112 128 -148 169 -194 223 -252
33 -252 287 -324 364 -409 459 -513 574 -640 709 -788 872 -967 1068 -1178 1301 -1431 1578
50 1578 -1739 1916 -2111 2328 -2572 2844 -3153 3510 -3922 4404 -4980 5682 -6556 7686 -9202
65 -9202 11360 -14694 20554 -33891 132420 -121255 -232710 190782 27171 -89830 136214
76 136214 94540 -158823 -42534 51144 29421 92114 16970 -161557 -23575 77057 -31733
87 -31733 38754 91300 -145066 -115135 131973 43951 -66483 71510 -19905 -160235 49101
98 49101 133425 -57952 -24319 27853 -123315 -24706 169851 -3289 -113779 38471 -11053
109 -11053 -90320 88935 89977 -98232 -50640 23641 -38667 47624 90980 -85853 -76138 61767
$$ packed form
0@%%%%%%%%%%%Qj6J6j6K4l2M0n5O3p2Q8j04J28j52J76k08K40k76L17l63M17m75
33b52N39o11O88p73Q68r72J087j214J349j497J660j839K035k246K479k732L009
50A578l317L655m027M439m900N416n997O663p432Q326r384J0662j2238J4242j6888
65i202K0562k6054L5248n4445J66311k53675j11455M23492j63611j17001K26044
76A36214m1674k53363J16289R3678k1723O2693p5144j78527J37982J00632j08790
87c1733P0487N2546k36366K9931K47108q8022j10434J37993r1415j40330K09336
98D9101Q4324j91377L3633N2172j51168R8609J94557j73140j10490J52250m9524
109a1053p9267J79255J042j88209M7592P4281o2308Q6291M3356j76833R715J37905
$$ plain form
121 61767 -20417 -25949 110560 -8934 -136149 26712 72595 -41617 26334 49191 -93020
132 -93020 -38283 88001 7579 -15730 43376 -52252 -62924 83138 41762 -53784 29015 14904
144 14904 -80722 27558 98744 -31628 -44646 32154 -22622 -13424 76505 5928 -57256 20067
156 20067 5765 -33258 57753 42828 -71111 -16507 50512 -19020 -1565 56783 -29759 -55757
168 -55757 38358 21807 -20602 29830 -352 -55669 15530 37986 -24778 5452 22258 -49670
180 -49670 -17043 57189 -3613 -36654 21998 -6983 -40379 28950 28344 -34532 -7347 9146
192 9146 -27825 7465 33582 -25696 -24592 20321 -12087 -17507 32562 -9 -41442 7530 15681
205 15681 -20775 10281 17651 -30989 -10871 24184 -8712 -8459 20926 -12343 -24610 21403 11856
$$ packed form
121F1767q2184n532J36509j19494j27215J62861M5883j14212O7951K2857j42211
132i3020N4737J26284q0422k3309N9106r5628j0672J46062m1376r5546Q2799j4111
144A4904r5626J08280P1186j30372j3018P6800n4776R198Q9929p0577o3184P7323
156B0067j4302l9023R1011j4925j13939N4604O7019o9532J7455N8348q6542k5998
168e5757R4115j6551m2409N0432l0182n5317P1199K2456o2764L0230J6806p1928
180d9670L2627P4232o0802l3041N8652k8981l3396O9329o06o2876K7185J6493
192I146l6971L5290K6117n9278J104M4913l2408n420N0069l2571m1433M8972Q151
205A5681l6456L1056P370m8640K0118L5055l2896K53K9385l3269j2267M6013r547
$$ plain form
218 11856 -18663 8984 8269 -22377 5000 22742 -9621 -4054 12365 -10933 -3841 23478 -637
231 -637 -12942 13932 2974 -13822 16072 15558 -16607 -342 16208 -6452 -297 17426 -3463
244 -3463 -8668 10985 2969 -4268 11056 2865 -10734 7745 9338 -8443 4143 9957 -10693
257 -10693 -3002 13658 -2642 -6895 8215 -772 -9393 5557 4516 -7969 -96 3248 -7328
270 -7328 -133 5073 -6852 -4015 3871 -6002 -5047 5540 -2621 -8684 2106 396 -7782 -761 2247
285 2247 -7348 -3526 2783 -4451 -3593 1814 -3670 -5327 1250 -1486 -4347 832 -496 -4244 325
300 325 1393 -3998 -669 2743 -3440 -1961 4180 -587 -3027 3129 1755 -1690 1265 2436 97
315 97 1159 2317 651 1791 2625 261 1448 4129 686 648 4303 1788 360 3629 2883 589 2142
$$ packed form
218A1856l0519K7647p15l0646K7377J7742l2363N567J6419k3298P092K7319k4115
231f37j2305K6874j0958j6796K9894n14l2165J6265J6550k2660O155J7723k0889
244c463n205J9653q016p237J5324q191j3599J8479J593j7781J2586N814k0650
257a0693P691J6660j6300m253J5110q987q621J4950j041j2485P873L344j0576
270g328P195N206j1925K837P886r873R55J0587q161o063J0790j710q178P021L008
285B247r595L822O309p234Q58N407n484j657O577k736k861N179j328l748M569
300C25J068n391L329L412o183J479O141m767k440O156j374l445K955J171k339
315I7J062J158j666J140Q34k364J187K681l443l8L655k515j428L269p46k294J553
$$ plain form
332 2142 3598 1171 1093 3509 1677 120 2430 1707 555 1782 1079 967 1891 440 -328 1556 1122
349 1122 -1339 -160 1636 -818 -1578 1162 249 -2279 -297 -150 -1660 -881 -1022 -1898 -1008 -1215 -1924
366 -1924 -1792 -1386 -2469 -2321 -1069 -2540 -3045 -206 -2116 -3720 -619 -903 -3512 -2088 -71 -1955
382 -1955 -2717 -650 -1140 -1853 -775 -1079 -1329 -208 -1388 -2077 1132 196 -2423 567 1980 -1800 -755
399 -755 2572 119 -1606 2566 1246 -898 2119 2076 -740 1669 2711 97 1695 2749 366 1873
415 1873 3335 569 623 3994 1127 -946 4163 3043 -1867 1886 4354 -599 1100 3732 -97 -508
431 -508 2882 662 -290 2745 330 -2191 2438 1987 -2491 1134 2167 -3311 -174 3019 -2320 -1835
447 -1835 2510 -2356 -3320 2787 143 -4722 -228 652 -4462 -723 1865 -3534 -2880 570 -2990 -1727
$$ packed form
332B142J456k427p8K416j832j557K310p23j152J227p03j12R24j451p68J884m34
349A122k461J179J796k454p60K740r13k528J982J47j510P79j41q76Q90k07p09
366a924J32M06j083J48J252j471n05K839j910j604L101k84k609J424K017j884
382a955p62K067m90p13J078l04k50J121j180o89L209r36k619K990J413l780J045
399g55L327k453j725M172j320k144L017m3k816K409J042k614J598J054k383J507
415A873J462k766N4L371k867k073N109j120m910L753K468m953J699K632l829m11
431e08L390k220r52L035k415k521M629m51m478L625J033n478L137L193n339M85
447a835M345m866r64O107k644m865M494Q80n114L739K588n399O54L450l560J263
$$ plain form
463 -1727 1268 -3718 -4585 1463 -1320 -4417 1805 681 -6524 -1206 3034 -3417 -2020 2406 -3178
478 -3178 -3486 2863 163 -2587 1095 -931 -3475 2620 2677 -3076 930 2256 -3609 897 6492 -1835
494 -1835 -2679 4129 325 -1837 5266 2951 -3332 1102 3275 -666 3484 4170 -2909 -332 5414 215
510 215 842 5735 -1276 -3854 4942 4038 -1086 2865 1796 -4073 1717 5883 -681 -480 3075 -3294
526 -3294 -1511 6592 1307 -4105 872 -323 -2815 3818 3162 -4310 -2297 654 -2707 1093 4382
541 4382 -4459 -5345 1830 -1131 -2348 3730 -1565 -7818 -667 2462 -2068 179 -97 -6390 -3294 3479
557 3479 -399 -1905 660 -5353 -5180 4462 1967 -3724 -175 -1280 -5517 1532 5558 -2100 -3941
572 -3941 193 -1839 282 5201 -186 -4312 218 -592 -156 5838 2197 -5505 -745 3409 103 2676
$$ packed form
463a727K995m986q67O048k783l097O222j124p205N318M240o451J397M426n584
478c178l08O349k700k750L682k026k544O095N7n753M006J326n865M506N595q327
494a835q44O808l804k162P103k315o283M434K173l941M150O86p079K577N746n199
510B15O27M893p011k578Q796r04n124L951j069n869N790M166o564K01L555o369
526c294J783Q103n285n412M977j195k492O633o56p472K013K951l361L800L289
541D382q841q86P175k961j217O078n295o253P151L129m530K247k76o293L096O773
557C479l878j506K565o013J73R642k495n691L549j105m237P049M026p658j841
572c941M134k032K121M919n387m126M530q10M36N994l641p702M760M154l306K573
$$ plain form
588 2676 4549 -2960 -4054 3837 3605 1196 3292 -1006 -3925 3403 5007 987 1862 373 -3910 1419
604 1419 6708 1550 -730 836 -2028 -842 6071 3098 -2835 -180 -350 -1681 4485 4326 -3478 -2879
620 -2879 887 -872 1477 4299 -2184 -5354 28 944 34 2557 -956 -6008 -1333 1849 -556 912
636 912 -252 -5843 -3220 3015 722 -1865 -299 -3635 -4864 1950 2872 -2220 -1814 -2343 -3857 1340
652 1340 3183 -1734 -2692 -862 -2951 -642 4288 529 -4719 -1231 118 -544 2968 1853 -3390 -1841
668 -1841 974 312 2290 2835 -2492 -2500 2172 1884 922 2946 -328 -3052 2052 3990 979 1281 518
685 518 -2255 684 4455 1686 144 1049 -1043 -3 4153 2473 -982 238 426 -665 2913 3100
701 3100 -1417 -1278 851 -235 1296 2882 -739 -2442 357 907 -115 1961 -126 -3306 -813 1637
$$ packed form
588B676J873p509j094P891k32k409K096m298k919P328J604m020Q75j489m283N329
604A419N289n158k280J566k864J186O913k973n933K655j70j331O166j59p804N99
620b879L766j759K349K822o483l170N382R16r10K523l513n052M675L182k405J468
636I12j164n591K623O235k293k587J566l336j229O814R22n092M06n29j514N197
652A340J843m917r58J830k089K309M930l759n248L488J349o62L512j115n243J549
668a841K815o62J978N45n327qM672k88r62K024l274k724N104J938l011L02p63
685E18k773K939L771k769j542R05k092J040M156j680l455J220J88j091L578J87
701C100m517J39K129j086J531J586l621j703K799N50j022K076k087l180K493K450
$$ plain form
717 1637 -487 2 70 -3117 -1924 1170 571 -1066 -344 -2232 -2770 963 491 -1829 -763 -780 -2635
734 -2635 -616 1366 -1415 -1892 -548 -1621 -1009 1382 -427 -2686 -813 -346 -1432 708 522 -2049
750 -2049 -968 651 -370 241 1348 -1213 -1139 821 693 76 1158 392 -1108 854 1469 221 658
767 658 1193 -569 496 2221 838 305 1256 405 88 1557 1589 -17 649 1269 -23 1135 1867 179
785 179 361 1476 349 234 1512 291 -693 804 751 -58 629 642 -598 98 520 -185 -453 134 -928
804 -928 -724 323 -192 -616 -330 -520 -1259 -341 -26 -1115 -969 -69 -1222 -1062 36 -730 -1309 -506 -560
823 -560 -1260 -391 -716 -1014 -693 -592 -958 -586 95 -975 -760 -212 -616 -588 -132 -445 -508 -36 -172 -322 266
844 266 62 -284 -214 721 156 -310 451 539 272 396 681 406 532 571 565 691 745 538 462 1085 702 340 660
$$ packed form
717A637k124M89O8l187J193L094n99j637P22j888n38L733m72k320J066j7j855
734b635K019J982k781m77J344j073O12K391j809k259J873M67j086K140j86k571
750b049J081J619j021O11J107k561P4J960j28o17J082p66j500J962O15j248M37
767F58N35j762J065J725j383n33R51q51l17J469L2j606O66O20j292J158P32j688
785A79J82J115j127j15J278j221r84J497n3q09O87J3j240O96M22p05k68N87j062
804i28K04J047n15m24K86j90p39R18L15j089J46R00j153J60J098p66n79Q03n4
823e60p00Q69l25k98L21J01l66L72O81j070K15N48m04K8M56l13o3M72j36j50N88
844B66k04l46P0R35n65m66P61Q8k67J24K85k75J26L9oJ26N4k07p6O23l83l62L20
$$ plain form
867 660 881 527 830 905 455 885 341 733 780 604 684 629 645 683 505 621 149 272 451 362 103 169 198
890 198 -105 -175 -192 -127 -578 -230 -145 -543 -561 -318 -332 -504 -588 -431 -424 -738 -496 -733 -861 -608 -717 -901 -592
913 -592 -945 -776 -558 -798 -663 -615 -631 -866 -360 -411 -599 -447 -386 -263 -313 -108 -70 -431 -326 -66 -218 231
935 231 -244 184 620 28 267 580 318 311 292 568 423 384 667 484 464 722 503 620 682 748 809 601 684
958 684 1006 716 348 432 715 643 288 391 621 139 320 506 320 354 265 65 476 447 206 244 311 310 -121
981 -121 342 48 -668 -110 51 -833 -245 -64 -620 -423 -90 -528 -333 -73 -588 -956 -600 -496 -694 -454
1001 -454 -274 -1022 -497 118 -1113 -734 43 -773 -666 -19 -423 -1053 -48 -96 -817 43 197 -951 -393
1020 -393 414 -327 52 657 -325 -262 683 39 -119 428 565 -399 574 763 -134 360 1040 -146 372 1382
$$ packed form
867F60K21l54L03P5m50M30n44L92M7j76Q0n5J6L8j78J16m72J23J79q9k59O6K9
890A98l03p0j7O5m51L48Q5l98j8K43j4j72q4J57Pl14K42k37j28K53j09j84L09
913e92l53J69K18k40J35M8j6k35N06n1j88J52O1J23n0K05L8l61J05K60j52M49
935B31m75M28M36n92K39L13k62pj9K76j45l9K83j83k0K58k19J17O2O6O1k08Q3
958F84L22k90l68Q4K83p2l55J03K30m82J81J86j86L4q9k00M11k9k41L8O7jm31
981a21M63k94p16N58J61q84N88J81n56J97L33m38J95K60n15l68L56J04j98K40
1001d54J80p48N25O15j231L79P77q16J07O47m04o30J005m8p21Q60J54j148N58
1020c93Q07p41L79O05r82O3R45o44j58N47J37r64R73J89q97M94O80j186N18J010
$$ plain form
1040 1382 541 -28 1192 520 10 896 890 225 621 1073 173 599 1564 -98 -131 1295 133 -215 1375
1059 1375 413 -839 643 598 -381 474 566 -778 -243 774 -555 -174 848 -609 -1176 893 51 -753
1077 -753 310 -197 -1450 0 525 -1411 -982 341 -1272 -971 873 -897 -1395 290 -580 -1026 361
1094 361 -5 -1587 -417 186 -1114 -375 639 -1198 -1074 536 -396 -909 606 -472 -1520 474 755
1111 755 -871 129 561 -1028 -192 1398 -115 -470 1046 -285 -593 1460 892 -740 577 721 -863
1128 -863 913 1717 -656 -116 1520 -243 78 1921 426 -935 1075 863 -505 1149 826 -877
1144 -877 286 1215 -128 473 1022 -466 -332 1335 325 -728 909 137 -1306 774 901 -990 -140
1161 -140 399 -1092 -221 1037 -589 -1270 477 -391 -1283 894 25 -1689 -68 -6 -1260 -96 597
$$ packed form
1040A382q41n69J220o72n10Q86oo65L96M52r00M26R65j662l3J426j162l48J590
1059A375r62j252J482m5r79Q55R2j344N35J017j329L81J022j457n67K069q42q04
1077g53J063n07j253J450N25j936M29J323j613L01J844j770m98J685q70m46J387
1094C61l66j582J170O03j300P39J014j837J24J610r32n13J515j078j048J994K81
1111G55j626J000M32j589Q36J590j513l55J516j331l08K053n68j632J317J44j584
1128h63J776Q04k373N40J636j763L21J843j495j361K010k12j368J654l23j703
1144h77J163R29j343O01N49j488J34J667j010j053J637p72j443K080J27j891Q50
1161a40N39j491Q71J258j626o81J747q68q92K177q69j714J621O2j254J164O93
$$ plain form
1178 597 -1446 -888 413 -801 -1042 425 -852 -1690 358 205 -1048 -17 114 -1544 -386 743
1194 743 -914 -582 339 -854 -821 890 19 -1091 475 51 -974 847 1010 -704 -63 913 -594
1211 -594 576 1471 -141 -534 916 210 -292 1164 941 -480 736 920 -202 797 1177 -417 -6
1228 -6 1567 156 -88 1052 274 -602 1022 780 -416 399 655 -311 73 1043 -405 -271 794 -281
1246 -281 -262 614 -49 -976 400 249 -876 306 460 -625 -477 768 -705 -565 239 -919 -1196 28
1264 28 -508 -791 -6 -298 -1207 -31 217 -651 -665 295 -974 -758 513 -490 -635 252 -458 -684 177
1283 177 16 -864 -21 330 -407 -52 59 -168 -447 432 159 -40 473 -33 -438 376 365 6 182 453
1303 453 23 312 590 302 -187 687 148 113 765 542 -43 634 543 -141 746 903 60 162 604 156 11
$$ packed form
1178E97k043N58J301j214k41J467j277q38K048j53j253J031J31j658J158J129
1194G43j657L32R21j193L3J711q71j110J566m24j025J821J63j714O41R76j507
1211e94J170Q95j612l93J450p06n02J456k23j421J216J84j122R99L80j594M11
1228fJ573j411k44J140p78q76J624k42j196Q15K56r66L84R70j448J34J065j075
1246b81J9Q76o63r27J376j51j125J182J54j085J48J245j473J40Q04j158k77J224
1264B8n36k83P85k92r09J176K48q68j4R60j269K16J271j003j45Q87p10k26Q61
1283A77j61q80Q43L51p37L55J11k27k79Q79k73j99N13n06m05Q14j1l59J76K71
1303D53m30K89K78k88m89Q74n39l5O52k23n85O77r1o84Q87J57q43J02M42m48j45
$$ plain form
1324 11 993 184 218 455 305 -181 240 433 -356 263 47 -133 130 330 -216 -473 197 134 -302 38 -82
1345 -82 -420 -48 -204 -498 -379 -424 -580 -241 -5 -542 -504 -313 -301 -394 1 -467 -695 -194 -225 -361 105 -36
1367 -36 -440 -436 -143 -305 -445 -147 -135 -203 160 -258 -43 31 129 -125 49 -61 -172 248 316 38 -186 421 -16
1390 -16 -315 337 337 83 152 601 237 429 153 181 376 433 312 334 215 507 115 341 418 285 1 293 286
1413 286 229 145 100 0 -127 7 -9 35 314 -45 -143 391 8 -29 218 -95 -223 -76 -189 -196 -170 80 29 -276
1437 -276 -201 -171 -133 -153 -182 -111 -215 -384 -422 -429 -255 -135 -251 -319 -256 -399 -447 -384 -296 112 -332 -339 -112 -66 -185 -194
1463 -194 -246 -109 -42 40 -432 251 154 -53 -24 56 86 -91 195 9 -18 18 110 321 310 -117 379 550 250 584
1487 584 391 241 263 378 236 346 460 185 97 276 360 222 370 203 232 134 61 90 238 418 134 166 92
$$ packed form
1324A1R82q09L4K37j50m86M21J93p89O19k16j80K63K00n46k57O70o3m36L40j20
1345h2l38L72j56k94J19m5j56L39K36n37L8J91J2r3L95m68k28N01l1j36M66j41
1367c6m04MK93j62j40K98J2o8L63m18K15P4R8k54J74j10j11M20O8k78k24O07m37
1390a6k99O52%k54O9M49l64J92k76K8J95N7j21K2j19K92l92K26P7j33k84K92p
1413B86n7q4m5j00j27J34j6M4K79l59r8N34l83l7K47l13j28J47j13pK6K50n1l05
1437b76P5L0L8k0k9P1j04j69l8pJ74J20j16o8O3j43m8O3Q8M08m44pK27M6j19r
1463a94n2J37O7Q2m72O83r7k07K9Q0L0j77K86j86k7L6R2K11j1m27M96J71l00L34
1487E84j93j50K2J15j42J10J14k75q8J79Q4j38J48j67K9r8p3K9J48J80k84L2p4
$$ plain form
1510 92 109 365 154 187 -72 102 129 -123 130 -156 -111 183 38 -202 -311 -314 -261 -273 -316 -257 -252 -450 -177 -199 -189
1535 -189 -98 -310 -319 -287 -344 -382 -286 -156 -235 -269 -85 93 -24 -123 -147 -36 56 -174 -497 26 -157 -189 58 21 -113
1560 -113 -29 -96 -57 10 296 -111 167 319 -200 -77 360 349 37 222 164 186 -52 344 -15 -26 446 -100 147
1583 147 318 12 119 270 51 76 139 518 -61 250 334 505 68 67 44 -115 66 -40 263 293 86 37 90
1606 90 68 -160 170 -237 -85 -213 -96 -89 -366 157 -181 -574 -301 -325 -382 -175 -30 -165 -336 -63 -367 -367 -126
1629 -126 -157 -473 -7 -258 -326 -9 -156 -211 -456 148 -404 -242 12 -326 -218 -38 -137 -205 128 -202 -102 -317
1651 -317 148 152 25 166 -51 4 -19 -158 6 133 30 -132 124 415 -90 289 529 63 430 380 -183 166
1673 166 454 -2 96 566 393 265 397 186 -98 -8 301 -281 28 324 -45 10 372 -54 -118 105 -97
$$ packed form
1510I2J7K56k11L3k59J74K7k52K53k86M5K94j45k40j09lN3j2m3N9Nj98K73k2J0
1535a89R1k12rL2n7l8R6J30p9l4J84J78j17r9k4J11R2k30l23N23j83l2K47l7j34
1560a13Q4o7L9O7K86m07K78J52n19J23M37j1l12J85n8K2k38L96l59j1M72n46K47
1583A47J71l06J07J51k19K5O3L79n79L11Q4J71m37jk3j59J81j06L03L0k07m9N3
1606I0k2k28L30m07J52j28J17Pk77N23l38l93K73k4n7K07J45j35j71K73l04%K41
1629a26l1l16M66k51o8L17j47n5k45O04n52J62K54l38J08J80r9o8L33l30J00k15
1651c17M65Mj27J41k17N5k3j39J64J27j03j62K56K91n05L79K40m66L67n0n63L49
1673A66K88m56R8M70j73j28J32k11k84R0L09n82L09K96l69N5L62m26o4K23k02
$$ plain form
1694 -97 -480 408 10 -289 -15 257 -343 -259 51 -252 -165 108 102 -386 43 -368 -383 -150 78 -428 4 -53
1716 -53 -192 -114 110 -299 -330 300 -216 -381 180 -335 -319 -18 55 -349 -201 -75 -50 -177 237 -165 -241 -50
1738 -50 -174 -212 199 203 -70 308 34 126 497 -27 -225 117 378 59 -251 529 62 74 451 244 58 354
1760 354 361 156 406 252 29 184 513 51 18 651 -172 25 35 -81 -280 251 371 26 420 129 4
1781 4 246 193 -85 54 -61 -69 -86 360 123 -283 -162 -134 -410 -23 -116 -34 -516 26 -204 -248 -60 -314 -443
1804 -443 218 -184 -89 85 172 -376 -245 -112 -326 -367 -128 -315 -284 175 -136 -103 28 -80 -335 -192 115 -413
1826 -413 -11 -155 14 177 136 34 -22 24 69 129 388 61 -77 52 405 131 169 239 321 -8 291 252 338
1849 338 350 -154 27 444 305 -112 12 363 -119 220 335 106 13 267 105 -62 262 15 12 206 -35
$$ packed form
1694i7l83Q88l98k99K74K72o00Q4L10l03Q7K73om88M29m11j5K33K28n06M32n7
1716e3j39P8K24m09l1O30n16j65N61n15J6L01P3m04J48J26K5j27M14m02p6J91
1738e0j24l8M11Mk73L78k74R2L71n24j98L42K61l19l10P80m67J2L77k07j86K96
1760C54Pk05K50j54k23J55L29m62l3O33q23J97J0j16j99N31J20l45L94k91j25
1781DK42n3k78J39j15qj7M46k37m06J21K8k76L87r3Q2m82N42k30m4J88k54j29
1804d43O61m02R5J74Q7n48J31J33k14m1K39j87L1M59l11L3J31j08k55J43L07n28
1826d13M02j44J69J63m1j02n6M6M5O0K59l27j38J29L53k74L8P0Q2l29K99l9Q6
1849C38J2n04J81M17j39m17J24L51m82L39J15k29r3K54j62j67L24k47lJ94k41
$$ plain form
1870 -35 48 -116 -25 16 39 139 -175 45 -54 -45 -62 25 7 38 -28 101 -314 57 -302 -194 -237 133 -131 -217 -316
1895 -316 -132 -132 -287 -185 -153 -128 202 147 -143 -187 -326 -191 -119 -368 -81 24 -291 -203 143 -185 30 -97 -174
1918 -174 -142 -125 244 35 167 -199 59 -103 149 183 -71 249 134 149 291 228 -128 51 420 289 296 125
1940 125 5 60 -6 -26 78 -6 -145 113 275 88 92 249 -44 293 224 205 -93 59 385 19 43 -85 121
1963 121 129 -7 -25 -216 -268 -134 -121 -167 -172 -242 -39 -385 49 -123 16 72 -134 -169 -114 118 -417 -224 -10 49
1987 49 -116 -269 -58 121 114 -309 46 -108 -193 -319 189 -49 -595 -69 -335 65 237 -44 -55 171 -123 -231
2009 -231 54 77 -171 233 -34 59 90 -97 146 -22 60 332 197 -60 373 23 46 218 185 236 261 231 44
2032 44 12 149 180 211 148 -5 266 -8 -81 86 26 -42 125 -32 53 191 219 -84 209 -138 13 -56 -34 -167
$$ packed form
1870c5Q3j64R1M1K3J00l14K20r9Rj7Q7j8L1o6J29m15L71l59J08m3L70k64q6r9
1895c16J84%j55J02L2K5L30n5k90m4j39J35P2k49K87J05l15Q8L46l28K15j27p7
1918a74L2J7L69k09J32l66K58j62K52L4k54L20j15J5J42o3l56J79L69j31Pj71
1940A25j20N5o6k0J04q4j39K58J62j87MJ57k93L37o9j9k98J52L26l66K4j28K06
1963A21Qj36j8j91n2J34J3m6np0K03l46M34j72J39N6k06l5N5K32n35J93K14N9
1987D9j65j53K11J79pm23L55j54q5j26N08k38n46N26k66M00J72k81j1K26k94j08
2009b31K85K3k48M04k67R3L1j87K43j68Q2K72j35k57M33l50K3J72l3N1K5l0j87
2032D4l2J37L1L1o3j53K71k74p3J67o0o8J67j57Q5J38K8l03K93l47J51o9K2j33
$$ plain form
2056 -167 -258 94 -8 -73 -132 -133 -206 244 223 75 -96 129 -296 -138 -270 -25 -34 -4 -233 33 -299 -258 -66 -241
2080 -241 -32 -178 -356 -335 99 -244 -97 -231 -47 3 146 -132 -196 69 -60 -295 7 239 150 140 -85 -97
2102 -97 -40 268 0 188 -14 102 131 99 169 27 148 220 113 86 217 6 263 187 153 242 87 91 176 153 201
2127 201 155 48 198 238 -57 348 172 46 287 -125 43 -104 86 56 94 -103 60 -161 25 -68 -30 78
2149 78 89 -170 -361 -13 -63 -27 33 -404 -280 -127 -26 -23 -223 -54 -120 139 -309 -119 -162 23 -269 -100 -91 -184
2173 -184 -143 -359 -6 -159 46 -135 -118 -149 -151 49 90 73 96 -49 -135 -20 -89 279 68 -87 -54 30 -66 106
2197 106 -19 279 185 175 117 37 -7 -337 147 -23 335 128 191 266 102 62 44 -6 117 167 192 -134 161 300
2221 300 -31 160 -64 134 -83 -40 -129 172 96 30 -138 -32 189 -163 -279 -49 -109 -87 324 23 -66 -7 49
$$ packed form
2056a67r1L52j02o5n9jp3M50k1j48j71K25m25J58j32K45rL0k29K66l32M1J92j75
2080b41K09j46j78K1M34l43J47j34J84N0J43k78o4K65j29k35L02K32q9j0k25j2
2102i7N7L08k68J88k02J16K9l2P0j42J21P2j07k7J31k11K57p6l4Q9j55MQ5k3M8
2127B01m6j07J50M0k95M05j76j26K41m12J68j47J90l0L8j97J63k21J86r3L8J08
2149G8J1k59j91L48n0L6O0m37J24J53J01Lk00J69o6K59m48J90m3J85k92J69Rr3
2173a84M1k16L53j53K05j81J7l1kK00M1j7K3j45q6J15o9L68k11j55L3Q4r6J72
2197A06j25K98r4j0n8q0m4l30M84j70L58k07O3P5j64m0j8n0J23N0K5l26K95J39
2221C00l31J91k24J98k17M3q9L01p6o6j68J06K21l52j16K30o0K2M11l01q9N9N6
$$ plain form
2244 49 -169 -110 -197 -352 -126 -42 28 -274 -175 -67 30 -288 -140 -209 -611 -121 -160 -187 -104 -131 2 -17 -50 -57 -70 102
2270 102 -90 -3 100 57 145 87 -62 -296 -281 -172 -128 74 -46 -90 116 -47 101 -17 87 -35 -30 -65 68
2293 68 298 254 -66 120 83 122 -125 142 174 92 19 124 10 94 67 71 31 174 128 24 237 153 65 -37 -29 -32
2319 -32 -32 32 341 -97 -121 -288 -42 97 -190 0 -21 -164 -294 -75 -124 -170 -117 -120 74 -163 -1 -36 -131 -207 -55
2344 -55 -91 -245 -32 -517 -101 -141 -200 -74 12 -165 -32 175 -287 151 -157 -259 77 126 72 -101 -98 -155 -124 135
2368 135 -84 7 68 96 -118 95 232 91 121 430 -31 -51 37 186 -111 13 211 197 45 -38 221 202 41
2391 41 12 -52 129 -9 -31 129 149 -2 166 4 226 158 178 -41 -60 250 273 145 16 244 119 -1 -7 -183
2415 -183 -20 138 30 -141 -1 -99 -240 95 -110 45 -46 -201 -364 -119 -179 -165 11 -358 168 -31 219
$$ packed form
2244D9k18N9q7j55K26Q4P0l02R9J08R7l18J48o9m02M90l9k7Q3k7J33j9l3pj3J72
2270A02j92Q7J03m3Q8n8j49k34J5J09M4K02j20m4K06j63J48j18J04j22Nl5J33
2293F8K30m4l20J86l7L9k47K67L2q2p3J05j14Q4k7Mm0J43m6j04K13q4q8j02Ql
2319c2%O4L09m38k4j67K46J39k87J90k1j43j30K19m9m6N3lJ94k37J62l5r5p6J52
2344e5l6j54K13m85M16m0n9J26Q6j77J33K07m62M38l08j02L36M9n4j73Ln7L1K59
2368A35k19R1O1K8k14K13J37j41L0L09m61k0Q8J49k97J24J98j4j52q3K59j9j61
2391D1k9o4J81j38k2J60K0j51J68j62K22o8K0k19j9L10K3j28j29K28j25j20oj76
2415a83J63J58j08j71J40r8j41L35k05J55r1j55j63K45o0J4J76l69N26j99K50
$$ plain form
2436 219 -178 -52 -214 -146 99 156 31 -66 216 -80 132 59 23 -122 226 42 -168 -137 -83 -8 -44 150 37
2459 37 -19 187 1 267 147 -109 -346 -16 -131 38 -28 -87 107 189 443 278 -230 -191 388 167 257 124
2481 124 -117 -75 -53 -97 52 80 61 358 43 -168 125 215 89 -161 -97 109 -217 -27 221 15 209 63
2503 63 78 -30 8 -10 -105 -27 -141 -192 56 48 289 -268 -360 4 -256 288 -82 -223 -6 64 -336 -410 -34 16
2527 16 -158 -59 -105 227 108 -9 -127 -183 -454 -285 51 -176 100 27 -131 -40 -108 103 63 146 74 -65 -34 -257
2551 -257 38 24 98 -20 19 40 -126 6 74 -55 94 20 188 8 340 62 88 63 129 46 -51 127 -44 -21
2575 -21 218 141 -119 14 17 3 196 72 170 -20 370 -62 -145 172 8 32 -15 79 22 69 -136 -178 -40 147
2599 147 147 -274 -94 -30 -195 -323 -91 -34 194 44 8 60 -83 -247 2 -39 12 -14 51 168 -51 18 -19 -27 21
$$ packed form
2436B19l97J26j62O8K45N7j25r7K82k96K12p3l6j45L48j84k10L1N4P5l6J94j13
2459C7n6K06j86K66j20k56k37L30j15J69o6n9J94Q2K54j65n08L9N79k21R0j33
2481A24k41M2K2m4J49K8j9K97l15k11K93R0j26k50O4K06l26J90K48k06J94j46
2503F3J5j08L8j8r5P8j14n1K48qK41n57r2L64k60N44l70j41K17P0m00p4L76N0
2527A6j74R9m6L32j19j17j18n6k71J69L36k27K76p3j58R1o8K11m0Q3p2j39L1k23
2551b57K95j4P4j18L9K1j66J32O8j29J49p4J68j80L32k78K6k5O6q3r7J78j71K3
2575b1K39p7k60J33Lj4J93j24R8j90L90m32q3L17j64K4m7R4n7M7k05m2J38J87
2599A47%m21J80O4j65j28K32N7K28j50l6N2j43j64K49m1N1k6O5J17k19O9l7qM8
$$ plain form
2624 21 -49 -13 -78 182 -77 -75 -55 -137 118 -203 -120 -69 268 9 172 -23 156 16 18 308 -76 317 66 10
2648 10 -162 285 11 -61 103 -130 131 322 -222 6 -31 15 128 150 52 315 120 -45 -1 80 185 14 -183
2671 -183 192 226 101 161 65 148 199 115 -43 16 -31 248 122 112 14 -145 -29 34 39 147 -66 -50 -234 -137 179
2696 179 -223 -157 -39 67 57 -187 115 -1 22 -125 -202 89 114 -47 -104 -23 279 226 -169 -49 -217 216 16
2719 16 -292 410 7 -305 -52 200 57 27 -9 34 -125 116 30 -224 244 22 93 249 80 98 100 -33 10
2742 10 58 288 3 122 242 29 98 98 -282 11 -17 3 6 51 37 95 104 -6 137 7 53 -47 416 180 13
2767 13 116 12 -90 -126 -239 1 -119 44 -34 -82 24 34 -100 -65 -118 -31 -61 105 -319 60 -11 31 -136 -223
2791 -223 -175 72 121 -215 259 279 -164 167 -46 -205 -74 -40 36 -96 -91 -189 -73 -25 162 47 3 248 3
$$ packed form
2624B1p0L6o5K60k59KK0q2K55l21Q3N1L37k59J63j95J79j40KK90l84L93k51n6
2648A0j72M47k74p2J64k33K61J91n44K28l7M6J13K2r8K63j95j65M4Q1J05j71j97
2671a83L75L4j25O0r6Q3N1q4j58N9m7K79j26j0r8j59J16O3NJ08k13J6j84R7L16
2696A79m02O6J18J06j0k44L02j16K3j47p7K91K5j61n7Q1L02n3l95J20j68M33k00
2719A6l08P02m03l12K53K52j43l0l6M3j59K41q6k54M68k22P1J56j69J8Kj33M3
2742A0M8K30k85J19J20k13O9%l80K93k8K0LM5j4N8Rj10J43j30M6j00M63k36j67
2767A3J03j04j02l6j13K40j20J63p8m8J06J0j34L5n3Q7l0J66m24L79p1M2j67q7
2791b23M8K47M9l36M74K0m43L31k13j59J31L4P6j32Nr8J16M8J87j15m4K45k45
$$ plain form
2814 3 -16 -25 -122 -10 109 363 -63 147 32 -37 -96 212 211 32 8 -120 40 -26 -39 -124 220 168 235 88 -36
2839 -36 25 99 42 -10 153 47 196 281 -278 215 168 25 149 36 174 18 33 76 111 -19 191 97 144 -141
2863 -141 -182 194 43 -88 -111 -12 35 -4 -72 -81 -13 339 117 -157 -220 31 -26 -53 -63 -289 13 -178 -18 7 -185
2888 -185 -106 -217 141 -94 -23 -136 -147 -93 112 227 35 -88 -95 -20 21 140 -35 -29 -110 104 254 -221 327 232
2912 232 -111 -212 -22 -29 -57 -266 -55 -68 -290 -136 148 -136 116 54 -20 95 -206 -13 -32 34 61 249 -126
2935 -126 -50 26 -448 244 246 66 -39 112 8 -144 -22 130 67 155 -230 134 218 181 54 -82 53 -138 34
2958 34 212 -10 24 207 -100 180 -372 -105 -273 101 -215 -26 238 -116 -120 -167 169 40 -164 58 -37 -162
2980 -162 -74 -208 -84 -313 -243 -112 377 -57 -172 -81 290 -109 -80 -26 -19 -102 261 -75 0 208 76 54 71 110
$$ packed form
2814Cj9rr7J12J19K54m26K10j15o9n9L08jj79k4j28J60o6j3q5L44n2O7j47j24
2839c6O1P4n7n2J63j06J49Q5n59M93m7j43J24j13J38j56J5M3L5j30K10r4M7k85
2863a41m1L76j51j31k3R9M7l9o8rO8L52k22k74o3K51n7k7j0k26L02j91J60K5j92
2888a85P9j11L58k35P1j13j1N4K05J15j92j23pP5M1J19j75Oq1K14J50m75N48r5
2912B32l43j01J90pk8k09K11j3k22J54K84k84K52o2p4J15l01J93j9O6K7J88l75
2935a26P6P6m74O92Kj80j05J51j04j52J22J52o3Q8l85L64Q4l7j27j36J35j91J72
2958C4J78k22L4J83l07K80n52K67j68L74l16J89K64l54mm7L36j29k04K22r5j25
2980a62Q8j34J24k29P0J31M89m34j15R1L71l99K9N4Pq3L63l36P5K08j32k2J7L9
$$ plain form
3004 110 86 -111 220 -147 101 231 4 149 142 -65 409 88 35 329 30 168 33 63 -10 56 -121 123
3026 123 55 230 200 -4 91 105 133 23 30 220 248 169 77 179 -29 74 -200 -103 304 -150 44 140 -57 99
3050 99 -67 182 -30 -165 17 -256 -4 -136 -117 -91 -144 5 -88 -67 -17 -156 -43 -105 166 -207 55 -49 -83
3073 -83 -54 -179 -7 -148 19 32 -6 -447 -211 -42 127 -14 133 128 131 35 -22 13 -41 -62 -222 -7 -230 -13
3097 -13 -134 -66 -42 -144 -50 179 32 -176 -104 205 -104 197 303 115 -78 77 -90 11 104 -107 202 361
3119 361 127 -52 -141 48 -66 332 23 -223 -27 182 -81 200 61 -58 -161 -41 -1 180 -19 92 -9
3140 -9 -147 122 -47 -93 -309 113 58 -65 -114 -5 -77 -41 -289 72 69 -83 128 -232 -218 -248 104 -183 -139 -61
3164 -61 -143 1 7 68 60 -76 99 29 -53 -155 188 88 -189 96 -2 310 -49 -32 -186 252 310 25 213 142
$$ packed form
3004A10k4j97L31l67K48J30k27J45pk07M74l21n3K94k99J38j35L0p3O6j77K44
3026A23o8J75l0k04R5J4K8j10PJ90K8p9r2J02k08J03k74R7M07m54J94R6j97J56
3050I9j66K49k12j35J82k73K52j32J9K6n3J49r3K1N0j39J13o2K71l73K62j04l4
3073h3K9j25J72j41J67J3l8m41K36J69J69j41J47nLr6n7L5n4k1j60K15k23K17
3097a3j21O8K4j02R4K29j47k08P2L09l09L01J06j88j93J55j67J01R3k11L09J59
3119C61k34j79q9J89j14L98l09k46J96K09k63K81j39j19j03J20M0J81j99J11j01
3140ij38K69j69m6k16M22n5j23m9J09p2L6k48L61lj52K11l60J4l0L52k87M4P8
3164f1q2J44OO1qj36J75p0q2j02L43j00k77K85r8L12l59J7j54M38N8k85J88p1
$$ plain form
3188 142 -8 174 119 -276 135 -71 291 320 -78 -121 131 -90 235 38 134 97 -98 53 -139 -7 -28 221
3210 221 -106 280 -104 55 18 116 -179 304 -11 -160 -156 111 173 -100 -142 36 -173 -96 211 50 -37 -269 -158
3233 -158 -60 -42 115 -120 -60 -38 188 -84 -5 164 -82 -203 27 242 234 -144 199 107 -294 -225 -77 -43 -19 -5
3257 -5 -40 162 -146 80 23 -249 -150 51 -143 68 -150 -157 -69 0 148 81 6 79 -55 -115 -177 -27 128 113 91
3282 91 24 83 -25 168 -285 140 -191 85 88 83 1 84 91 -38 -47 -418 12 -22 22 94 107 -19 186 82 5 108
3308 108 112 136 -103 -8 -8 202 -52 -1 14 -266 33 -63 -96 163 27 -11 -27 -47 144 -85 31 -35 45 37 122 3
3334 3 146 -142 -261 31 -47 -74 114 -78 -126 130 123 -242 -2 190 46 -51 -26 112 94 -153 68 -54 -20 177
3358 177 47 187 62 -239 -30 69 124 87 -4 244 80 -214 133 173 -72 426 -114 97 105 110 130 5 -70 200
$$ packed form
3188A42j50J82n5l95M11k06L62K9l98m3K52k21L25j97R6l7j95J51j92J32k1K49
3210B21l27L86l84J59l7R8k95M83l15j49MK67O2k73m2J78k09P7L07j61q7k32J11
3233a58R8J8J57k35O0K2K26k72P9J69k46j21K30K15ql78L43r2m01O9J48L4K4J4
3257el5K02l08K26n7k72R9K01j94K11k18pQ8O9J48o7p5P3j34o0o2J50J55j5k2
3282I1o7N9j08J93m53M25l31K76Lnq2Q3Pj29rl71M30l4M4P2J3j26K05j04p7J03
3308A08MK4k39R5%K10k54N1J5k80K99r6l3K59j36l8j6k0J91k29J16o6Q0qQ5j19
3334CJ43k88j19K92p8k7J88j92m8K56pl65K40J92j44r7K5J38j8k47K21j22L4J97
3358A77j30J40j25l01K09R9N5l7r1K48j64k94L47M0k45M98n40K11QNK0j25p5K70
$$ plain form
3382 200 -14 31 197 -171 126 142 260 12 -2 -68 158 81 94 -133 185 -73 -25 61 -91 45 -186 41 -174
3405 -174 152 41 -104 -68 229 -164 228 46 -103 14 46 314 307 -154 -28 38 158 80 -19 -74 -68 -118 64 87
3429 87 -240 18 88 23 93 111 -131 -7 13 -190 7 31 -18 -86 118 -164 102 141 190 204 6 -95 113 10
3453 10 -185 -11 182 257 69 124 -166 8 96 -177 158 347 38 -35 165 51 -42 -61 -172 207 -144 -121 14
3476 14 -41 37 -54 -166 146 58 105 -137 -189 171 82 78 142 54 59 -186 119 -33 271 270 -90 218 -242 -96 -116 -231
3502 -231 -200 -386 -48 -211 -79 -112 -176 84 -38 218 85 -97 -35 206 -151 36 16 187 -147 153 -123 -54
3524 -54 15 -73 -162 76 16 -3 11 -56 41 188 33 188 33 -40 133 28 193 155 -140 54 16 15 84 64 -208
3549 -208 99 -112 322 115 -21 -106 77 118 9 13 71 -37 39 189 -174 166 -166 46 139 -63 61 73 54
$$ packed form
3382B00k14M5J66l68K97J6J18k48j4o6K26p7J3k27L18k58M8Q6j52J36k31K27k15
3405a74L26j11j45L6K97l93L92j82j49J17L2K68pm61J26O6J20p8r9n5On0J82K3
3429H7l27K58P0o5P0J8k42J24K0k03J97K4m9o8K04k82K66L9M9J4j98j01K08j03
3453A0j95J74J93P5j88N5k90J74Q8k73L35J89l09p3K00j14r3j9j11L79l51K3J35
3476A4n5P8r1j12L12q8M7k42n2L60q9mO4q8Nk45L05j52L04jl60L08m60J46k0j15
3502b31L1j86L38j63J32l3o4K60j22K56j33j82O2K41l57J87k0J71l34L00k76O9
3524e4O9q8q9K38o0j9J4o7R7J47j55J55j55p3J73j05J65l8k95J94l8jO9k0k72
3549b08L07k11M34k07j36q5J83M1j09MN8j08P6J50l63L40l32K12R3k02J24J2j9
$$ plain form
3572 54 -239 -112 -81 124 -236 55 41 -8 336 -1 64 54 90 244 -176 -3 10 -177 107 93 -100 -64 269
3595 269 -186 -97 -188 118 66 -259 -188 -90 -35 -53 0 78 131 13 -102 131 -56 -7 -45 171 50 34 46 -23 -207
3620 -207 -258 -87 -84 -243 -148 -3 -196 110 -100 117 -166 27 79 -123 15 112 50 47 69 171 -104 13 -38 98
3644 98 204 -4 283 -6 172 92 29 48 57 -4 170 -163 -85 -72 122 -14 37 71 108 183 45 123 38 -208 -100
3669 -100 -166 -108 134 282 -268 126 -159 -39 8 58 6 -78 144 -184 227 -3 -47 -424 -10 360 201 -41
3691 -41 74 -250 200 232 -154 -114 -67 -94 -343 -253 -262 -36 -41 -73 124 -524 -7 -116 -55 161 -199 -127 269 149
3715 149 17 146 -85 180 273 -19 -23 -97 -82 36 247 103 -89 90 90 110 69 -87 17 -65 190 174 -243 48
3739 48 162 105 -13 -149 151 78 199 -162 34 47 116 88 151 226 -146 149 -153 16 27 17 -20 -253 -75 229
$$ packed form
3572E4k93J27L1K05l60K91j4m9L44l37O5j0L6J54m20J73J3j87K84j4j93L6L33
3595B69m55Q9r1L06n2l25P1R8N5j8N3P8N3j18j15K33j87M9l8K16j21j6J2o9j84
3620b07n1J71Lj59R5J45j93L06k10K17k83J93N2k02J38R7o2lK2J02k75J17n1J36
3644I8J06k08K87k89J78q0o3J9Ro1J74l33P8J3J94j36N1L4L7P5j38P8q5k46J08
3669a00o6N8K42J48n50L94k85J20M7N0n2q4K22l28M11k30m4l77M14L70j59k42
3691d1J15l24M50L2l86M0M7k7k49R0rK26nl2J97o48N17j09O1K16l60P2L96j20
3715A49j32J29k31K65R3k92mp4J5J18K11j44j92J79%K0m1j56J04q2K55j6m17K91
3739D8J14n7j18j36L00p3J21l61J96J3O9k8O3P5l72K95l02J69J1j0l7k33J78L04
$$ plain form
3763 229 -1 75 -155 -106 117 28 -93 18 -32 206 -30 -125 -78 257 -293 -110 31 -125 -174 -190 -97 -33 192
3786 192 -51 165 105 6 113 -38 -55 159 -59 -77 -103 -25 -71 -134 17 -115 -283 -276 -59 10 429 40 174 0
3810 0 105 363 267 12 -63 300 35 118 -150 -90 -20 23 404 -65 -93 63 237 -79 -30 6 -11 62 -259 285
3834 285 46 -92 262 -23 88 6 157 -31 73 176 58 -11 -233 -120 237 47 -16 -66 -107 -182 -395 45
3856 45 145 51 93 -207 -7 -60 220 39 -36 -15 -271 -5 -428 106 -56 -58 5 -12 -92 -114 45 -342 88 174
3880 174 -82 142 -99 -142 -20 -93 -143 -321 49 15 401 -14 -23 215 -22 68 98 91 -66 32 -34 -105 0 56 18
3905 18 120 102 -301 212 286 38 -44 -3 -223 35 -25 35 317 334 11 -24 206 -57 -1 103 31 224 -44 -107
3929 -107 308 -92 98 117 230 157 103 155 -46 -135 -189 263 90 -174 -90 -82 -182 131 75 -265 112 -59 -217
$$ packed form
3763B29k30P6k30M9K23q9j21J11n0K38k36r5M7L35n50J83J41j56m9j6R3O4K25
3786A92k43K16o0r9J07j51j7K14k18j8k6P8m6o3J51j32j68PK17O9M19l89J34j74
3810@J05K58r6k55p5L63k65Q3k68O0P0M3L81m69k8J56J74l16M9L6j7P3l21N44
3834B85k39j38L54k85J11q2J51j88J04J03j18o9k22J13L57j90o3n0m1p5k13M40
3856D5J00r4M2l00K00n3K80j81p5K1k56K66m23N34j62kO3j7q0k2J59l87M30Q6
3880A74k56K24k41m3J22p3n0j78L70l4L86m15rK38k37R0L0pj57R8o6p1J05N6l8
3905A8J02j8m03N13P4k48q2M1k20K58o0O0K82J7l23l5K30k63N6J04p2J93k68o3
3929a07M15m00J90J9J13p3n4N2k01q9n4M52j73k64Q4Qj00L13n6l40L77j71j58
$$ plain form
3952 -217 23 -165 42 -95 -38 8 -116 60 -88 -94 -93 -187 33 18 -91 224 -109 -256 -40 -125 -14 65 19 -112
3976 -112 53 -61 -60 -226 -68 -26 222 -90 -33 124 87 36 172 43 -66 -76 286 49 -22 115 291 -72 -96
3999 -96 183 243 12 49 147 -149 19 -95 -168 -154 -5 -158 36 70 206 120 13 -57 -97 -82 191 -184 -69 190
4023 190 40 -237 -63 165 -127 -151 -35 52 84 -7 34 106 -127 -182 87 -236 -109 23 -162 -241 -57 -134 216
4046 216 -96 -130 135 -4 180 80 10 -195 -166 -90 78 46 -9 -36 -169 90 109 -53 69 170 -79 114 -122
4069 -122 -84 -101 81 -51 240 38 248 95 128 -9 -58 227 133 -9 87 -39 -212 164 66 -129 222 -184
4091 -184 -61 60 148 59 399 -56 -203 -11 -212 -71 123 159 -179 -51 -163 -232 -98 53 -112 -143 393 -99
4113 -99 237 -45 28 -20 -148 -15 -165 25 -222 -102 94 -125 167 -59 -110 31 -65 -238 -152 -62 -93 -74 -75 -19
$$ packed form
3952b17K40j88K07j37N7M6j24J76j48oJr4K20j5j09L15l33j47K16q5J11P9m6j31
3976a12J65j14Jj66J58M2K48l12N7J57l7n1J36j29j09j0L62k37p1J37J76l63k4
3999i6K79O0k31L7R8k96J68j14p3J4J49j53J94L4J36q6j07p0m0J5K73l75J15K59
4023A90j50k77J74K28k92k4J16Q7L2r1M1P2k33n5K69l23J27J32j85p9J84p7L50
4046B16l12l4K65j39J84j00p0k05K9P6J68l2n5k7j33K59J9j62J22J01k49J93k36
4069a22L8j7J82j32K91k02K10j53L3j37m9K85r4j42R6j26j73L76r8j95L51m06
4091a84J23J21Q8q9L40m55j47J92k01J41J94L6l38J28j12o9J34J51j65l1N36m92
4113i9L36k82P3m8j28J33j50J90k47J20J96k19K92k26n1J41r6j73Q6R0l1J9jN6
$$ plain form
4137 -19 123 -90 165 343 -115 24 22 104 -113 -115 371 -41 -34 79 -120 -86 -188 110 -2 129 93 58 -209 182
4161 182 19 -255 -55 77 37 -94 63 13 199 -97 145 -198 -108 184 83 99 172 -28 76 -58 19 150
4183 150 -129 28 -58 57 141 -207 -75 78 64 -98 -154 -68 -128 179 57 -223 -92 -49 -76 79 -148 61 -89
4206 -89 175 -121 -36 -44 197 -32 -78 -63 -121 91 -197 246 138 -158 -130 -42 -136 19 -169 58 164 180 128 210
4230 210 -40 -148 157 -159 59 -209 -69 -30 -51 89 -126 315 -1 222 93 -62 -219 -94 144 181 -335
4251 -335 89 285 44 48 -24 -71 118 -74 -215 -190 -51 217 -146 94 99 -173 57 72 74 -2 -42 84 222 108
4275 108 -35 382 159 20 113 -82 124 381 -106 90 -126 -134 -150 43 -111 137 45 19 241 -58 73 -220
4297 -220 -128 -128 21 15 283 -5 -79 -103 -54 -78 -102 -11 -87 -166 -34 -15 -260 105 -3 -234 -96 -80 -15 123 -317
$$ packed form
4137a9J42k13K55J78m58J39kQ2k17kM86m12PJ13j99L4j02K98j12J31l6l5k67L91
4161A82j63k74K00J32m0j31J57n0J86k96K42l43R0K92j01J6P3k00J04j34P7J31
4183A50k79J57q6J15Q4l48J32J53j4j62n6Q6o0L07j22k80J31M3k7J55k27K09j50
4206h9K64k96Q5qK41k29m6J5n8K12k88M43j08k96K8Q8r4J55j88K27J06J6n2Q2
4230B10k50j08L05l16K18k68J40L9k1J40k15M41l16K23j29j55j57J25K38L7n16
4251c35M24J96k41Mp2m7J89j92j41K5J39K68l63K40Nk72K30J5Kp6m0J26J38j14
4275A08j43M17k23j39R3j95K06K57m87J96k16qj6J93j54K48r2k6K22k99J31k93
4297b20R2%J49oK68k88p4k4M9k4k4R1p6p9J32J9k45L65j08k31J38J6O5J38m40
$$ plain form
4322 -317 112 -12 -63 217 -50 -3 -162 31 -169 40 -33 -153 -168 -116 -193 -189 -6 -132 -199 159 108 48 -94 -69
4346 -69 34 29 106 -118 35 -306 -48 60 66 67 -22 233 80 123 -103 31 69 295 260 52 24 78 -28 -217 -226
4371 -226 118 64 201 50 -115 -6 199 -191 -249 -171 169 -62 -114 -47 -157 -71 30 116 212 104 -38 -150 -58
4394 -58 -84 37 146 -81 -468 -13 -309 144 60 29 -35 -18 -21 -106 10 -178 80 -168 -267 -8 53 75 -282 198
4418 198 -95 -29 13 -176 -51 44 -14 80 -42 268 -22 -249 8 121 -14 11 209 -96 -96 175 141 35 11
4441 11 -110 -91 -5 55 -122 235 10 3 116 17 275 -107 137 -24 -101 143 137 -75 -61 -118 -173 -93 -116 215 90
4466 90 -100 122 -282 98 -71 -226 29 -78 27 60 12 -110 58 -1 -118 58 98 120 -54 33 -164 -64
4488 -64 -31 -168 78 -111 -261 68 75 -208 -35 192 193 -111 63 326 37 63 34 21 56 -43 -15 -60 341 67
$$ packed form
4322c17M29j24n1K80k67M7j59J93k00K09p3j20j5N2p7MJ83j26o7L58n1o0j42K5
4346f9J03nP7k24J53l41K58J08OJq9K55j53M3k26J34L8K26l5k08k8N4j06j89r
4371b26L44n4J37j51j65J09K05l90n8P8L40k31n2O7j10Q6J01Q6R6j08j42j12R2
4394e8k6J21J09k27l87M55k96M53q4l1o4J7lq5J16j88K58k48r9K59O1K2l57M80
4418A98k93O6M2j89J25R5n8R4j22L10k90k27K57J13j35K5J98l05%K71l4j06k4
4441A1j21J9Q6O0j77L57k25pJ13r9K58l82K44j61p7K44ok12J4n7n5Q0k3L31j25
4466I0j90K22m04L80j69j55K55j07J05L3m8j22J68n9j17J76M0K2j74Q7j97J00
4488f4L3j37K46j89j50L29Pk83J73K27Jl04J74K63k89K6k9j3L5r9K8m5M01k74
$$ plain form
4512 67 -93 -40 -132 -13 62 118 70 307 26 185 103 -98 108 -114 313 18 186 -426 29 -130 41 -92
4534 -92 167 49 36 -43 -76 -44 277 -147 202 196 -37 -50 -78 52 208 135 133 45 227 -75 -245 -37 80 209
4558 209 -1 -80 -36 128 64 -5 -75 -154 -7 25 86 -144 7 311 -246 -129 -51 121 -74 -93 -225 -153 -17 -261
4582 -261 50 142 -31 -30 -6 -193 -375 22 -34 88 27 66 76 247 -23 -112 75 -47 -134 -261 80 -116 85
4605 85 -189 76 -40 74 -28 -133 -124 32 93 26 32 -254 130 -17 123 -312 -122 33 308 58 70 -99 174
4628 174 -34 93 26 -55 8 121 -78 126 -53 -70 29 -112 -99 -53 -194 67 97 -209 -71 -60 44 -24 -84 32
4652 32 79 -305 -50 -65 -33 130 -184 105 97 -37 40 -101 93 139 -126 -122 -17 -22 -1 -80 -211 -60 193 -74 0
4677 0 -9 -18 -5 107 70 103 -132 -11 -163 20 192 -71 -245 52 191 -10 33 97 -85 192 68 -129 -79 31
$$ packed form
4512F7j60N3r2J19P5N6m8K37k81J59q2k01K06k22M27k95J68o12M55j59J71j33
4534i2K59j18j3p9l3L2L21m24L49ok33j3k8J30J56p3kq8J82l02j70K08J17J29
4558B09k10p9M4J64o4o9p0p9J47L2O1k30J51L04n57J17P8J72j95j9j32P2J36k44
4582b61L11R2j73JK4j87j82L97n6J22o1L9J0J71k70q9J87j22q7j27L41j96K01
4605H5k74K65j16J14j02j05RJ56O1o7Ok86L84j47J40m35J90J55K75k50J2j69K73
4628A74k08J27o7q1O3J13j99K04j79j7R9j41J3M6j41K61L0l06J38J1J04o8o0J16
4652C2M7l84K55j5L2J63l14K89qj34P7j41J94M6k65MJ05nK1p9j31J51K53k67P4
4677@rrJ3J12l7L3k35J21j52J83J72k63j74K97J39k01M3O4j82K77j24j97N0J10
$$ plain form
4701 31 -47 274 27 -148 26 100 -124 10 -116 171 -29 37 -20 -48 -22 -24 354 40 18 -5 -122 58 63 196
4725 196 -71 86 66 -24 -73 -59 -33 65 -23 -58 -7 183 93 -19 105 -39 -78 10 -118 54 218 172 -90 -146 307
4750 307 -111 -122 59 -194 -36 -17 -39 -82 23 193 201 39 -79 21 -127 -184 15 8 261 85 92 109 125 75 10
4775 10 34 -198 -191 154 148 -100 -124 82 4 55 51 -15 -76 266 171 -44 227 -33 6 203 21 -186 64 107 72 122
4801 122 266 1 -152 270 -21 15 -50 -238 77 -54 -140 -104 18 -211 23 8 96 -43 -79 236 -99 -241
4823 -241 -109 -45 7 -219 -206 -183 337 -42 -377 39 -8 -13 146 -18 43 185 29 -68 -145 42 153 184 80 -40
4847 -40 -162 -57 -331 -53 -53 -155 45 -98 102 153 -250 101 4 -28 -83 -196 181 151 -229 30 -10 -14 265 101
4871 101 -137 40 -109 -471 -171 50 -57 -12 215 34 197 177 -103 -27 203 -50 351 -128 137 -209 45
$$ packed form
4701C1p8L21k47j75J74P4k24J34j26K87k00O6n7k8K6kL78l14k2k3j17J80NJ33
4725A96k67J57k0r0m9J4K6R8q8l5N1J90r0j12J24j44l9Q8j28J72J64m6k62n6M53
4750C07m18j1J81k53J58J9k2m3J05J70Qj62j18J00j48n7J99pK53j76PJ7J6n0o5
4775A0K4k32PL45ok48k4K06p8N1mo6o1L42r5k15K71k60L9J97j82k07K50M3l5N0
4801A22J44k65j53M22k91L6o5j88L15j31q6L6J22k29K34j5Q8j39l6L15l35j42
4823b41J32O4N2k26J3K3N20l79l35M16m7nJ59j64O1J42j56r7p7J87J11L1j04j20
4847d0j22J05k74K78%j02K00j43K00N1m03L51r7l2n5j13L77l0l80K59m0mK79j64
4871A01k38J77j49l62L00K21j07M5K27j81J63k0k80P6K30k53M01m79K65l46K54
$$ plain form
4892 45 -116 44 -88 -207 -73 127 -41 69 194 188 32 -101 -61 -148 59 -159 54 13 120 -161 119 42
4914 42 -17 -191 -50 6 -66 -94 -37 232 -278 -8 -21 -88 11 -219 151 -66 124 128 82 -4 106 -117 -74 -76 10 146
4940 146 45 -123 85 -137 -145 85 -26 73 -292 -49 93 -269 -262 48 21 64 174 174 -61 -6 155 -17 -26 -84
4964 -84 -150 51 33 36 -30 22 58 95 156 -210 -85 -14 68 65 -54 173 81 214 33 -37 -68 -199 -77 -75 -278 127
4990 127 377 203 -110 19 -102 207 -65 -77 12 -251 -237 -172 -219 66 234 38 -265 77 -62 51 64 53
5012 53 153 -124 52 -48 -188 -128 108 -247 221 -5 -105 -180 -85 -277 21 -242 188 50 -47 -97 -197 -12
5034 -12 -342 -7 -10 -114 -72 -324 -195 -63 -112 -171 -255 -119 -37 189 -320 99 119 -87 17 -203 313 1 207
5057 207 -85 -241 -53 96 -110 93 254 91 245 -7 169 -30 -9 48 -255 -39 -48 55 -99 -18 -53 -51 73
$$ packed form
4892D5j61J60j32j19J34K00j68J10J25oj56j33M0q7K07k18K13m1J07k81K80p7
4914D2n9j74J41N6p2k8N7K69n10K70j3o7R9k30L70k17J90Mm6q6J10k23M3kQ6J36
4940A46j01j68K08k22qK30j11R9l65K43J42l62PL10k7M3J10%k35N5J61j72rn8
4964h4o6K01j8Lo6N2L6L7O1l66J25P1Q2lj19K27r2J33j81p0l1j31J22Kk03M05
4990A27K50j74l13J29j21L09k72j2Q9k63J4O5m7K85J68j96l03L42j39J13J3j1
5012E3J00k77J76j00j40O0K36l55M68k26j00p5R5j92K98k63M30j38r7n0j00J85
5034a2l30L35lj04M2k52J29J32m9n9q4J36Q2K26n09M19K0k06J04k20N16l12K06
5057B07k92j56J88J49k06K03J61j63J54k52J76j99K1N7l03K16rJ03j54Q1l5KJ24
$$ plain form
5080 73 -34 -161 -126 82 -19 92 -66 -193 -7 97 147 159 177 107 128 53 52 115 -195 -30 -238 21 -139 -164
5104 -164 -74 -202 19 41 -60 -172 -61 42 18 -109 -106 -93 -101 209 3 14 -83 131 -25 -155 39 110 -277 17
5128 17 -108 56 174 -231 -37 157 -23 -114 -62 183 157 -100 182 -131 -257 -40 133 15 -47 167 -18 -62
5150 -62 -233 259 -158 -284 1 -260 -172 213 -65 78 -9 54 120 59 40 -41 -168 -203 -212 38 71 100 49 -10 -109
5175 -109 -72 -24 53 61 18 187 105 89 137 47 84 -127 -66 -5 38 -113 35 -75 34 -8 -50 39 -7 277 -65 -79
5201 -79 -134 -85 -17 11 -16 -91 -86 -221 -58 -43 120 -76 17 15 -66 -21 45 -154 12 118 -95 -359 -72 161 -34
5226 -34 -44 -5 -5 182 108 58 -111 -225 192 427 68 151 -36 65 -219 60 5 -291 -1 -77 -55 230 77 401
5250 401 149 178 12 36 187 16 -14 -21 1 58 17 -61 -32 -191 -15 -96 48 -113 120 2 -8 -137 -144 -53 81
$$ packed form
5080G3j07j27L5K08j01J11j58j27J86J04N0J2J8p0K1p5jO3l10J65k08K59j60k5
5104a64R0j28K21K2j01j12J11J03k4j27LJ3qL10k06J1r7K14j56j30J94P1l87K94
5128A7j25J64J18m05J94J94j80r1N2K45k6k57K82l13j26K17J73j18o2K14j85m4
5150f2j71M92m17j26K85k61Q8L85k78J43q7O3O6o1j9q1j27l5rK50L3K9n1n9r9
5175a09L7M8P7Qm3J69q2j6M8r0L7k11O1O1M3j51J48j10J09m2m2Q9m6K84l42j4
5201g9n5M9O8K8k7p5Nj35J63J5J63j96R3kq1M5O6j99J66J06k13k64K87K33j95
5226c4j0L9%J87p4n0j69j14M17K35l59Q3j87J01k84K79n5k96K90p6K2K85j53L24
5250D01k52K9j66K4J51j71l0pK2N7m1p8K9j59J76q1J44j61K33j18j0j29pR1J34
$$ plain form
5275 81 -58 -50 -203 -166 399 115 -118 -114 33 97 -325 22 124 -51 -71 -75 222 194 33 48 88 -188 166 230 119
5300 119 16 47 140 77 103 -213 -8 127 -190 157 34 -42 -93 -81 212 0 57 175 24 86 -62 -59 57 40
5324 40 63 98 352 -26 11 42 -188 7 49 -69 50 -222 215 -139 68 114 73 189 189 -15 -220 38 -130
5347 -130 222 66 -76 -3 -88 -95 -28 -128 118 233 18 233 9 102 -67 92 150 114 97 144 189 -9 99 108
5371 108 6 67 -2 -199 151 -116 32 -143 -20 21 -52 -56 -112 33 113 -106 -23 25 -1 -61 -272 626 79 286
5395 286 -131 -98 -121 -216 -219 5 -128 212 40 17 167 -63 -102 280 146 40 71 -36 147 -192 98 66 -108
5418 -108 -97 246 -63 160 93 -101 -45 -91 104 -157 -245 -98 -141 106 -93 -99 -59 -25 -2 -8 -41 -207 -98 -293 -122
5443 -122 -150 -35 -84 -52 88 -129 -90 83 -50 114 -18 -38 -65 34 174 158 45 -157 -221 -20 -24 -12 -117 130
$$ packed form
5275H1j39Qj53L7N65k84k33MJ47O4m22L47J02j75k0mK97k8j61J5M0k76L54O4j11
5300A19j03L1R3o3K6l16K05J35l17L47j23p6n1J2K93k12N7J18j51O2j48LJ16j7
5324D0K3L5K54l78L7L1k30J95M2j18J19k72M37l54K07M6m1J16%k04k05K58j68
5347a30L52j56j42P3q5pO7j00K46J15k15K15k24R3j69J59N8l6j7M7M5j98J08R
5371A08j02O1o9j97L50k67J48j75J23M1p3mn6J45Q0k19Q3M8k6o0k11Q98n47K07
5395B86m17L3k3r5lK24j33L40j72k3J50k30l9L82j34j06L1j07J83l39K90l2j74
5418a08J1L43l09K23o7j94N6m6J95k61q8J47m3K47j99oM0L4K3ol3j66J09j95J71
5443a22k8J15m9L2J40k17L9J73j33J64j32k0k7R9J40j6j13k02o4K01mJ2j05K47
$$ plain form
5467 130 -112 -413 -35 -219 -210 20 -89 -181 164 67 -141 -118 -229 -118 -141 -194 -23 -33 97 177 -49 -144 86
5490 86 64 -45 -71 -69 -17 231 -72 -74 319 -5 7 14 363 135 135 327 -113 255 185 -204 76 210 15 -115 -143
5515 -143 94 275 5 261 147 79 -251 -116 46 -201 -137 -165 -8 63 26 132 63 165 -189 -59 10 197
5537 197 12 31 -164 12 -20 62 63 61 1 -153 181 124 74 70 246 101 5 73 -277 3 68 37 90 97 -270 115
5563 115 -199 -189 219 -187 -82 -258 181 46 -297 -21 -85 170 -113 83 -114 -147 299 -24 -37 52 -38 165
5585 165 -71 162 41 -279 96 -61 -32 81 -6 153 227 269 237 -32 130 56 -154 114 -58 -16 197 4
5607 4 24 30 255 182 46 215 205 -117 82 36 163 -122 -59 126 166 -16 -221 104 -65 -5 -211 134 -6 97
5631 97 -51 -4 -104 57 -53 -109 75 -4 -37 -87 165 189 -450 -101 -20 161 130 156 139 118 -266 25 43 -238
$$ packed form
5467A30k42l01L78j84RK30j09r2L45r7k08K3j11J11k3n3J71j0J30Q0k26r5K30
5490H6k2j09k6KN2K48l03kL93l24J2PL49k28%J92m40L68p0l89K80J34j95j30k8
5515a43K37J81k70K56j14o8l30J35J62k47O4k8J57P1l7J06o9J02l54J30O9J87
5537A97j85J9j95J76l2Q2Jko0j54L34n7n0mJ76j45r6O8l50K80O5l1N3Pl67L85
5563A15l14J0M08m06J05j76M39j35l43K76o4K55k83J96j97l3M46l23j3Q9r0K03
5585A65k36K33j21l20L75j57K9J13q7J59P4M2l2k69J62p4k10K68j72M2K13j93
5607DK0OK25p3j36J69j0l22J99m6J27k85O3J85M0j82k05L25j69O0k06L45j40J03
5631I7j48M7j00J61j10n6J84p9l3n0K52K4o39L49Q1J81l1K6j7k1l84K91J8k81
$$ plain form
5655 -238 -48 12 2 228 24 78 -162 110 46 -170 -84 218 14 -48 -11 131 -15 -2 436 124 352 -133 164
5678 164 -367 -3 -69 197 -23 282 35 171 -86 15 188 -92 23 -6 -1 -73 293 169 -265 122 41 194
5700 194 58 -39 -107 -49 16 83 -242 -63 -84 61 120 -120 -99 44 200 -438 92 32 -73 117 -209 -92 203
5723 203 -99 -31 -194 187 209 -173 -225 271 61 -5 86 109 -94 -247 -146 -161 32 75 138 -177 -107 -52 138 -162
5747 -162 6 -35 -66 153 31 -173 -97 50 -197 -80 100 -41 -117 69 -230 56 55 29 5 40 36 -104 -129 28
5771 28 -65 -44 11 -196 121 95 193 111 177 44 15 21 154 76 -97 210 45 -125 90 62 86 -165 60 -19 -8
5796 -8 223 -100 -152 116 -97 -172 -27 85 -188 343 -16 -5 217 140 -44 -84 -134 161 81 163 86 -26 170 12
5820 12 -172 -9 -352 -126 -24 -5 -113 23 111 -25 62 57 -84 9 -47 -191 -83 -50 -68 155 -138 107 -224
$$ packed form
5655b38J90O0j0K26k04N4k40K72o4k16Q6L02k04o2L7J42j46J3M38l12K28m85K97
5678A64n31L64o6K66k20L05k47J36k57J01J73k80J15k9Np2L66j24m34L87q1J53
5700A94j36r7o8N8O5O7l25J79k1J45N9k40K1J43J56o38N30o0j05J90l26J17K95
5723B03l02O8j63L81K2l82n2M96k10o6R1K3k03j53J01j5J93M3O3l15P0N5J90l00
5747a62J68m1l1K19j22k04P6J47k47J17J80j41p6J86k99K86jk6k4L5mj40k5J57
5771B8r3K1N5k07L17k6R8q2O6j33k9OJ33p8j73L07j65j70K15k8K4k51K25p9J1
5796hK31l23n2K68k13p5J45J12k73N31l59J1K22p7j84m0n0K95q0Q2p7j12J96j58
5820A2j84J63l43K26J02J9j08J36Q8j36Q7nj41R3n6j44J08L3j8K23k93K45l31
$$ plain form
5843 -224 -97 95 -98 48 248 -46 -53 -156 74 -159 -90 -181 19 139 10 -113 -5 29 -187 105 -108 30
5865 30 80 14 -82 187 -126 -83 375 -54 -8 -267 325 25 -134 39 -39 121 -252 -83 337 50 65 42 -122
5888 -122 57 -118 -47 15 12 -2 -63 113 -300 -115 -68 -61 4 69 -412 139 250 34 -19 104 -32 191 -99 18
5912 18 21 47 69 3 45 -18 68 171 -234 41 84 12 -2 156 -80 -79 -103 131 31 -12 -34 -98 -79 -243 130 -3
5938 -3 -32 -157 14 -76 292 179 103 -146 42 16 -100 -176 119 24 -62 265 -19 32 178 -251 75 -113 41
5961 41 -6 340 27 -162 -159 19 -31 47 -58 137 -63 71 199 -108 216 -263 252 -139 -49 -100 135 -14 37
5984 37 42 -142 -10 -159 -51 205 239 16 -75 117 -203 -25 -81 -91 -55 14 -240 236 -280 -104 -100 -93 15 11 87
6009 87 141 13 134 -37 -49 181 114 -94 -157 -29 -61 26 -37 -154 239 -194 -154 -92 118 39 175 113 57 35 -162
$$ packed form
5843b24J27J92j93J46K00k94pj03K30k33O9r1K00J20j29j23J08L4k16K92k13J38
5865C0N0o6r6K69l13M3M58m29M6k59N92l00j59J73p8J60l73J69M20k87J5k3j64
5888a22J79j75P1O2lj4o1J76m13J85M7PO5O5m81N51J11k16n3J23j36K23k90J17
5912A8LK6K2o6M2o3Q6J03m05K75M3p2j4J58k36Jk4K34j00m3k2o4J9j64L73j33
5938ck9j25J71r0L68j13p6k49J88k6j16p6K95r5q6L27k84N1J46m29L26j88J54
5961D1m7L46l13j89LJ78n0P8j05J95k00J34J28l07L24m79N15l91R0n1K35j49N1
5984C7Nj84J32j49J08K56L4k23r1J92l20J78n6j0L6O9k54M76n16J76MPJ08mP6
6009H7N4j28J21j71j2K30o7k08o3J28l2Q7o3j17L93m33M0O2K10p9J36o2n6k2j97
$$ plain form
6034 -162 -326 112 119 -55 59 -38 -237 -93 -135 -32 -29 -222 -163 93 86 28 -51 157 70 -100 15 -221 20 45
6058 45 82 -173 -35 -136 101 -91 -45 -149 -190 215 -67 -26 131 238 196 183 -42 105 -124 -165 128 55 -21
6081 -21 23 94 61 -126 120 62 -252 -74 -82 6 125 -118 -4 198 31 56 224 -37 431 96 165 62 100 -52
6105 -52 268 -94 272 198 134 -72 -91 151 -82 160 174 -3 -145 134 92 -135 95 -212 -113 153 30 -75
6127 -75 83 -7 -233 62 -60 -126 2 -18 -194 74 139 -93 61 157 -31 199 8 -27 -62 -100 27 -83 -41
6150 -41 129 -309 -25 210 -284 -15 -193 36 74 -117 122 -71 -70 -138 0 27 -107 75 -196 -141 -23 -60 -46
6173 -46 -4 -13 -62 -109 37 72 -18 -28 -28 203 128 4 -269 106 118 -18 219 12 -237 171 110 135 65 -175 60
6198 60 -115 189 58 -45 12 17 -140 -558 -22 -57 -150 -279 158 -198 63 15 -59 -69 41 96 0 -71 -4 29 74
$$ packed form
6034a62j64M38Pj74J14r7j99J44m2J03Lj93N9K56pn8p9K08q7j70J15k36K41K5
6058D5L7k55J38j01K37j92M6j04m1M05k82M1J57J07m2j3k25J47k29m1K93p3p6
6081b1M4P1l3j87K46n8l14J78qQ8J19k43J14K02j67K5J68k61M68l35O9j03L8j52
6105e2L20l62L66p4o4k06j9K42k33K42J4j77j42K79m2k27K30l07R9K66j23j05
6127g5J58r0k26K95j22o6J28k0j76K68O5k32J54R6j88K30j91l5l5l8J27j10M2
6150d1J70m38K84K35m94K69j78K29L8j91K39j93Jo8J38K7j34J82k71N5J18l7J4
6173d6M2rm9m7J46L5r0j0%K31p5j24k73L75J2j36K37k07k49M08o1K5p0k40K35
6198F0j75L04j31j03N7Nj57m18N36l5r3j29M37l56K61m8p4j0J10N5r6p1O7L3M5
$$ plain form
6223 74 42 133 39 19 41 49 127 -288 28 198 48 -145 97 113 -74 -56 13 445 244 146 1 -69 -57 -86 92
6248 92 21 -17 75 25 -351 -51 59 -90 110 -31 53 -125 -66 -82 33 17 -229 69 -50 -15 121 46 21 106
6272 106 100 20 -159 -94 65 -108 -2 -75 83 383 -117 23 -179 -225 112 -120 -117 101 61 246 -49 -328 -72
6295 -72 -315 115 -336 97 -88 121 -82 -135 16 259 -10 -150 60 83 237 113 109 192 86 -131 93 -90
6317 -90 -59 -128 -34 -7 227 27 214 -129 -14 31 2 271 159 -65 -100 107 -27 -29 141 131 -35 26 262 73
6341 73 0 113 100 -98 -146 25 -128 92 171 -154 -189 90 15 -188 45 22 39 -250 -135 -112 261 74 98 83
6365 83 -105 -154 40 50 -227 66 -112 101 -112 -150 365 125 144 -63 39 118 32 -20 -180 268 -36 130 417
6388 417 -13 243 13 138 -21 141 8 -113 57 216 -152 347 77 42 39 175 88 -80 46 298 -20
$$ packed form
6223G4l2R1r4k0K2QP8m15L16J70j50j93K42J6j87J8O9M32k01r8j45p0J2k9J78
6248I2p1l8R2n0l76L00J10j49K00j41Q4j78N9j6J15j6k46K98j19L5J36p5k5Q5
6272A06oq0j79O5J59j73J06p3J58L00n00J40k02m6L37k32LK18m0J85k95k79K56
6295g2k43M30m51M33j85K09k03n3J51K43k69j40K10K3J54j24mQ3j06k17K24j83
6317i0L1o9R4K7K34k00J87l43J15M5k9K69j12k24l5K07j34kJ70j0j66O1K36j89
6341G3p3J13j3j98m8J71j53K20P9l25l5K79p5k03K33k3J7k89J15K3L73j87K4j5
6365H3j88m9J94J0k77K93j78K13k13l8N15k40J9k07J02P9q6n2j60M48l04J66K87
6388D17m30K56k30J25j59J62j33j21J70J59l68M99k70l5lJ36q7j68J26K52l18
$$ plain form
6409 -20 35 19 -107 -6 -32 0 -153 -223 33 17 30 128 -50 -127 180 148 -7 -36 171 -319 -166 -89 -138 -87 -15
6434 -15 -146 -139 356 165 197 11 72 55 15 -173 -36 -101 169 -106 123 9 -101 226 171 35 25 -79 -35 -296
6458 -296 201 88 80 74 -43 -69 228 38 -71 -55 -65 48 -30 -186 -106 102 -160 -203 -42 21 24 215 79 -103
6482 -103 -259 159 118 15 168 54 54 -307 99 -265 41 -24 -14 -57 -213 -40 -23 258 12 -135 -152 -214 -80
6505 -80 -146 214 45 -166 167 -166 -123 245 442 -69 -42 -29 136 -42 183 -48 202 -45 128 5 -173 -114
6527 -114 -107 274 -109 14 80 -24 -56 -48 108 10 -4 23 -275 -215 -105 -285 -21 -123 83 26 -123 -4 -152 -45
6551 -45 146 125 -26 128 17 -162 -4 198 280 391 -124 5 90 51 48 105 -26 90 -22 -168 143 -51 -71
6574 -71 95 289 -51 -22 48 50 -95 32 27 44 253 131 16 53 -117 -165 3 25 -76 -201 124 100 -171 138
$$ packed form
6409b0N5j6j26J01k6L2j53p0K56j6J3R8j78p7L07l2j55k9K07m90J53P7m9N1P2
6434a5j31PM95j91L2j86O1j7m0j88J37o5K70k75K29j14j10L27n5j36j0j04M4k61
6458b96M97j13qoj17k6K97j90j09J6j0J13p8j56Q0K08k62m3J61O3LJ91j36j82
6482a03j56M18m1j03J53j14%l61M06l64L06o5J0m3j56J73J7K81k46j47j7o2J34
6505h0o6L60j69k11L33l33M3L68J97n11K7J3J65j78K25k31K50k47J73j23j78N9
6527a14PL81l83J23O6j04l2QJ56r8j4K7k98O0J10j80K64j02K06n7j49J19j48J07
6551d5J91k1j51J54j11j79J58K02Q2J11n15J29Q5l9lN7j31J16j12j46L11j94k0
6574g1J66J94l40K9P0Kj45J27nJ7K09j22j15L7j70m8J68K2j01j25L25k4k71L09
$$ plain form
6598 138 9 20 -117 -114 -101 65 173 64 43 -197 78 74 -12 -120 33 -317 20 -304 -100 -93 -265 -62 -253
6621 -253 -273 146 -21 -96 -63 64 -165 -115 62 120 159 -51 -109 -36 -35 331 147 -152 13 -220 -64 -70 -343 104
6645 104 26 157 278 49 123 35 -89 143 -22 -159 -112 254 27 116 227 -137 -43 265 -188 -270 51 -141
6667 -141 -197 -203 133 262 60 -107 -97 98 -183 63 107 -108 -134 -163 100 -172 223 -108 112 60 -186 92 58
6690 58 37 24 189 59 -63 248 242 -147 120 -240 -90 41 123 -143 253 112 275 -122 264 8 82 -184
6712 -184 -23 67 87 -5 89 93 -131 -105 67 158 -39 72 -230 -155 139 -10 58 32 159 -242 -81 -48 -286 -7
6736 -7 -79 -40 -160 116 306 168 77 -236 -5 -45 36 -148 -193 28 66 74 -6 -268 -72 -47 -145 127 -122 31 -37
6761 -37 154 -35 73 -24 -92 -39 129 -343 -16 64 -53 43 61 21 -74 -77 -123 29 221 152 -139 299 -120 104
$$ packed form
6598A38j29J1j37LJ3J66J08j09k1k40K75mq6j08J53l50L37l24K04Pj72K03j91
6621b53k0M19j67p5L3J27k29N0J77N8L9k10n8P3JL66j84k99J65k33J56ok73M47
6645A04p8J31J21k29P4q8j24K32j65j37M7L66k27Q9J11l64R4L08m53q2L21j92
6667a41n6oL36J29k02j67J0J95k81K46M4k15k6k9K63k72L95l31K20n2k46K78l4
6690E8k1j3J65j30j22L11ol89K67l60J50J31Q2k66L96j41J63l97L86k56P4k66
6712a84J61R0K0r2R4Mk24K6J72R1j97J11l02P5K94j49O8k6J27m01J61L3k38K79
6736gp2L9j20K76J90j38r1l13K31m0Q1j84m5K21L8Qq0k62J96K5r8K72k49J53o8
6761c7J91j89J08r7o8N3J68m72L27Q0j17R6J8m0r5lm6J52J92o9k91M38m19K24
$$ plain form
6785 104 182 -48 11 282 98 -90 -21 -155 207 -42 223 -103 76 167 63 192 -73 -103 -131 -121 -180 -55 237
6808 237 310 50 84 72 -155 208 -32 -51 -23 -97 227 12 56 -53 106 -174 64 -82 143 1 256 130
6830 130 -190 -75 21 97 83 163 -68 116 -34 160 43 45 234 -186 7 -2 -11 -85 32 -18 -106 221 139 3 51
6855 51 -275 -23 104 42 -90 -21 -39 -106 68 113 8 36 -68 53 153 -65 -114 208 94 206 27 132 -231
6878 -231 79 -138 50 -46 -102 98 127 -16 -19 263 -235 88 84 -40 -102 115 -320 102 13 -96 19 67 217
6901 217 98 200 -67 -44 -306 147 138 31 -54 -107 -71 12 -16 -66 168 -19 59 -18 99 -95 12 -194 -1 244
6925 244 105 -193 -273 -19 130 -193 -163 -43 -229 -204 -101 -56 -144 -92 155 -111 -1 14 29 45 -180 -143 -377
6948 -377 -27 38 -90 40 185 130 -156 109 89 296 -6 191 -205 70 143 80 88 -153 -75 24 232 -19 43
$$ packed form
6785A04P8k30N9K71j84j88O9j34L62k49K65l26J79R1j04J29k65l0k8J0n9J25K92
6808B37P3k60L4j2k27L63k40j9K8p4L24k15M4j09J59k80K38j46K25j42K55j26
6830A30l20J15R6P6j4Q0k31J84j50J94j17KJ89m20J93rrp4J17n0q8L27q2j36M8
6855E1l26K52J27o2j32O9j8o7J74M5j05K8j04J21J00k18m9L22j14J12j79J05l63
6878b31L10k17J88r6n6K00K9j43lK82m98L23mj24o2K17m35M22q9j09J15M8J50
6901B17j19J02k67K3k62M53rj07q5n3L6Q3k8n0K34j87P8p7J17j94J07k06J93K45
6925B44j39k98q0K54J49l23L0J20j86K5J03M5q8N2K47k66J10J5J5J6k25L7k34
6948c77L50O5j28J30J45n5k86K65k0K07l02J97l96K75P3o3Qk41P8R9K08k51O2
$$ plain form
6971 43 -38 -277 460 155 -21 -149 -153 -189 263 -150 280 -64 211 201 106 -272 4 70 -145 277 12 53 -81
6994 -81 58 -2 -89 133 -20 124 178 -65 -16 124 95 -194 -38 116 -227 -27 86 -60 -31 38 -157 -223 -83
7017 -83 -200 57 2 65 134 -73 -77 -201 -29 178 204 122 -43 -99 152 49 51 91 -209 246 242 226 82 -137 41
7042 41 -63 -73 267 -237 -52 -81 9 -190 -262 -134 351 -258 133 -50 -63 -127 25 -10 -98 26 202 -126 -19
7065 -19 1 55 95 101 39 140 -10 61 167 -180 -114 -141 -186 -284 -62 -176 -101 -327 -4 -127 164 71 21 -132 -3
7090 -3 -225 33 110 -191 9 144 -95 -133 -138 11 41 99 -66 -138 245 -151 127 -253 128 136 -57 258 476 -128
7114 -128 94 -304 173 34 169 -163 -256 166 -56 -118 -252 143 -168 -39 -46 285 -90 -125 -72 5 121 87 -181
7137 -181 -55 42 242 37 -237 -63 -80 -66 -11 150 1 20 50 41 -231 102 7 23 148 73 -223 -26 25 -10
$$ packed form
6971D3q1k39P37l05j76j28ml6M52m13M30l44K75j0r5l78K76O6k15M22k65M1j34
6994h1J39o0q7K22j53J44N4k43M9J40k9k89J56J54l43K00J13j46K9O9j95o6J40
7017h3j17K57n5O3O9k07mj24J72K07K6q2j65n6K51j03KM0l00M55mj6j44k19J78
7042D1j04j0L40n04J85k9R0j99p2J28M85o09L91j83j3o4J52l5q8J24J76l28J07
7065a9K0N4M0Oo2J01j50P1J06l47O6k7m5r8K22j14P5k26L23j23K91r3n0j53J29
7090ck22K58P7l01K00J35k39l8nJ49L0N8j65p2L83l96K78l80L81Qj93L15K18o04
7114a28K22l98M77j39J35l32r3M22k22o2j34L95l11J29pL31l75l5N3P7J16l4k68
7137a81J26R7K00k05k74J74j7J4N5J61j49J9L0rk72L33r5J6J25p5k96J97N1l5
$$ plain form
7161 -10 -71 93 -130 142 -46 -169 -92 310 165 -79 -28 54 -129 -88 -26 66 120 -447 198 -54 -109 127 -57
7184 -57 -218 170 -43 114 15 82 239 245 -28 -104 211 30 2 175 -30 -104 -50 1 173 -35 165 55 201
7207 201 219 81 278 -38 -147 -85 82 0 -101 17 -152 -82 0 2 25 102 45 105 -123 -130 -89 -113 210 -117 -260
7232 -260 173 -70 -110 315 -56 -155 22 61 -169 -35 -126 90 159 108 8 -95 50 -187 228 -13 -10 -70 57
7255 57 -47 -217 60 -17 -16 506 2 -40 -51 66 196 -262 -115 35 -96 130 -130 104 -111 55 172 -47
7277 -47 133 -51 -24 -118 52 -30 215 -158 -2 -2 74 -143 -129 -50 -140 3 15 27 -56 34 40 -80 -138 -179 -179 41 156
7304 156 -262 55 81 -41 9 -118 8 19 113 -113 150 -341 75 -16 -15 -29 -191 -149 172 162 124 -110 -121 -90
7328 -90 172 -72 -41 -147 -196 -2 216 -75 74 -9 249 52 28 190 213 -153 -57 257 -147 -229 30 -101 -116
$$ packed form
7161a0o1J64k23K72j88j23P7M02j45k44N1Q2j83M1O2R2N4n67O45k52n5K36j84
7184e7j61L88k13J57r9O7J57Ok73p6L15j81k8J73k05p4N4N1J72k08K00j10J46
7207B01J8j38J97l16j09O2J67q2j01J18j69P0Q2KK3P7n7O0k28pM1k4L23l27j43
7232b60M33k43m0M25l71r9J77L9k30J34r1K16O9n1j00j03J45k37M15k41Lo0J27
7255E7j04j70K77p7JN22n04m2j1J17J30m58J47J50j31K26k60K34k15J66J17k19
7277d7J80j84K7r4J70q2K45l73J56%P6k17J4P9r0J43J2J2q3R0Oj20n8m1%K20J15
7304A56m18L17K6j22N0j27J26J1R4k26K63m91M16r1Jj4j62M2L21j0l8k34j1L1
7328i0K62k44L1j06m9J94K18k91J49q3K58j97k4J62K3l66R6L14m04q2K59j31j5
$$ plain form
7351 -116 -243 -2 -94 11 102 -308 217 -180 38 269 -88 110 14 221 -157 -266 -24 105 125 66 61 -194
7373 -194 -12 -292 -167 0 -218 -28 63 -38 -83 137 -11 42 -92 -225 9 -7 262 89 6 72 45 318
7395 318 70 120 -57 -150 271 -33 28 -95 -112 -93 69 290 182 -241 38 -150 64 118 -98 56 70 113 -265
7418 -265 -181 278 96 -162 -12 89 24 71 -145 132 -34 185 62 122 87 29 -140 -13 134 57 32 -141 281
7441 281 -60 168 96 -7 8 -161 30 237 136 -72 -278 41 93 103 172 -123 -23 -17 85 -44 -245 -41
7463 -41 97 -252 -60 -61 -46 -82 199 -206 52 -255 87 -130 244 59 53 32 80 -452 71 34 -130 -101 -12 153
7487 153 -3 -474 1 -81 -119 -98 -472 69 12 -73 -162 -126 69 106 -109 270 -63 -35 13 -123 -7 -150 0
7510 0 70 -61 254 6 183 44 -98 203 137 230 -38 244 35 -387 99 332 -111 53 -78 -12 143 -531
$$ packed form
7351a16j27K41r2J05R1m10N25l97K18K31l57J98r6K07l78j09K42J29K0n9nk55
7373a94J82k80J25J67k18J90R1j01m5K20j48N3j34j33K34j6K69j73q3O6k7K73
7395C18k48N0j77r3M21l04O1j23j7J9J62K21j08m23K79j88K14N4k16J54J4M3l78
7418b65Q4M59j82k58J50J01o5M7k16K77j66K19j23O0l5n8j69J27J47p7k5j73M22
7441B81l41K28p2j03J5j69J91K07j01k08k06L19N2J0O9k95J00OJ02j29k01K04
7463d1J38l49J92jJ5l6K81m05K58l07L42k17L74j85ok1M8n32N23l7j64K9Q9J65
7487A53j56m71M75q2l8K1l74N41n7q5q9L6J95L7k15L79l33K8M8j36J16j43J50
7510@P0j31L15k48J77j39j42L01o6R3k68K82k09m22M86K33m43J64j31O6J55o74
$$ plain form
7532 -531 -38 -105 -235 155 58 81 13 17 -66 -100 -35 -40 -17 180 26 12 -66 180 -187 -239 -59 -83 -214 -100 89
7557 89 38 -184 -93 23 -61 -152 8 -14 123 226 11 -118 264 -14 183 -213 73 -101 11 -170 -52 -228
7579 -228 5 -126 -55 -236 175 114 -149 252 32 136 -80 64 -67 123 89 -86 -3 -146 25 122 135 112
7601 112 35 100 22 31 69 44 46 -103 197 55 -129 -182 -7 106 133 -33 145 49 -7 53 -55 -145 19 341 -94
7626 -94 80 -172 168 4 -87 204 188 72 -331 119 70 230 -18 -64 -137 113 90 -126 -42 -50 178 55 30 138
7650 138 112 -165 226 23 36 -148 -14 65 132 -157 -19 -186 -83 7 66 42 116 86 -239 -4 -9 37 61 -122
7674 -122 171 157 -166 167 120 -192 217 7 -76 -54 82 64 74 37 -78 -22 -124 14 37 119 50 -180 -297 118
7698 118 -110 115 163 36 107 97 182 122 -73 56 30 44 2 7 18 106 -73 101 -83 82 -233 -24 145 93
$$ packed form
7532e31M93o7j30L90r7K3o8Mq3l4O5nK3J97j54j4p8K46l67n2J80k4j31J14J89
7557H9n1k22R1J16q4r1J60k2J37J03k15j29L82k78J97l96K86j74J12j81J18j76
7579b28K33j31P1j81M11o1k63M01k20J04k16J44j31J90l4j75Q3j43J71R7J3k3
7601A12p7O5p8RL8k5Kj49L00j42j84n3J75J13K7j66J78r6n6O0j08r0J64L22m35
7626i4J74k52L40j64r1K91j6j16m03M50m9J60k48m6p3K50k3k16Q4qK28j23k5J08
7650A38k6k77L91k03J3j84J34P9O7k89J38j67J03R0N9k4P4l0l25K35nM6K4j83
7674a22K93j4l23L33m7l12M09k10q3K2J36j8J0l7j15N6j02J38K3Q2o9k30j17M15
7698A18k28K25M8j27P1j0Q5o0j95J29k6J4m2NJ1Q8j79J74j84J65l15K09J69n2
$$ plain form
7722 93 -71 -110 -121 -131 -145 97 42 -133 0 -52 -61 -222 -11 -104 -182 -167 58 8 -282 -80 42 75 148 78 197
7747 197 197 115 141 11 -39 44 52 282 241 33 34 36 243 -224 114 -123 -313 100 -251 -167 -168 12 -159 150 23
7772 23 180 225 206 -91 -134 -31 -311 212 298 -119 2 -120 -223 196 -79 -15 -90 47 -71 261 -115 48
7794 48 219 99 43 31 159 -82 -190 189 22 175 117 -62 -54 -25 -213 -74 149 130 -33 238 -16 -191 292
7817 292 21 -190 -123 61 -253 -202 -182 -198 -46 -81 488 -225 -135 -12 11 203 170 92 -59 -55 347 169 -69 213
7841 213 157 54 -76 160 -5 60 -96 113 -114 -75 33 -253 3 34 -87 -200 -99 46 43 52 55 -6 -138 40
7865 40 -20 132 180 171 97 -138 49 -34 -73 39 -36 -108 -78 -207 -262 -38 63 233 91 169 40 -88 -58 -49 -11 198
7891 198 55 37 63 141 124 177 -56 -5 126 -51 50 -145 -50 87 3 -95 185 -145 17 116 115 -19 70 -131
$$ packed form
7722I3j64l9j1j0j4K42n5j75J33n2rj61K11r3p8J5K25n0k90K02J22L3P3p0J19
7747A97%q2K6j30n0Q3QK30m1k08JKK07m67L38k37j90M13l51Q4jJ80j71L09j27
7772B3J57M5j9k97m3J03k80N23Q6m17J21j22j03M19k75O4p5J37j18L32l76J63
7794D8J71j20n6j2J28k41j08L79j67J53n8j79QK9j88J39K23j9j63K71k54j75M83
7817B92k71k11O7J84l14N1K0j6J52l5N69p13R0J23K3J92l3p8j51MM02j78k38K82
7841B13n6j03j30K36j65O5j56K09k27L9J08k86K56L1j21j13J01J45lRLo1j32J78
7865D0o0J52M8rp4k35J87q3l9J12p5p2L0j29n5K24J01J70j42P8j29j28L0RL8K09
7891A98j43j8K6P8j7N3k33N1J31j77J01j95R5J37q4r8K80l30J62R9jj34Q9k01
$$ plain form
7915 -131 -28 -158 -189 -73 -263 -179 115 -182 89 109 -250 -330 -23 151 169 85 190 -214 29 -43 -345 212
7937 212 408 71 244 21 204 31 -104 275 364 163 264 -102 177 -161 -205 124 243 61 186 -45 10
7958 10 -40 56 65 -155 119 -189 -427 2 -35 -60 100 -132 44 -23 -170 -39 43 -27 147 67 33 246 108 85
7982 85 101 -45 264 -21 14 63 60 -182 -78 77 -301 -151 -51 110 -41 106 53 322 78 134 16 61 -60
8005 -60 133 -18 155 -43 -33 -3 -175 16 -252 -147 -130 8 -14 7 -197 -52 -145 68 -71 -95 -160 -155 -184 -68
8029 -68 68 -418 -122 -201 9 -51 19 -117 -65 81 -11 -117 219 38 -38 54 33 36 -28 12 59 21 -156 -221 138
8054 138 267 66 30 0 -219 -35 -76 -40 -112 -183 179 106 55 -48 220 -41 -52 -2 -16 -143 236 -235 -2 237
8078 237 80 3 28 -34 2 198 -238 -159 20 -44 -20 -24 -207 -77 84 9 -142 -29 113 -154 81 -81 -160 201
$$ packed form
7915a31J03j30l1J16j90Q4K94k97K71K0l59q0L07J74J8q4J05m04K43p2l02N57
7937B12J96l37J73k23J83j73j35L79Q9k01J01l66K79l38m4L29J19j82J25k31N5
7958A0n0R6Rk20K74l08k38M29l7k5J60k32J76o7j47J31Q2p0J74q0l4K13j38k3
7982H5J6j46L09k85L5M9lk42J04J55l78J50J00J61j51J47n3K69k44N6j18M5j21
8005f0J93j51J73j98J0L0j72J91k68J05J7J38k2K1k04J45r3K13j39k4o5Nk9J16
8029f8J36m86K96p9K10o0P0j36N2J46r2j06L36j81p6R2k1Lo4M0M7l8j77o5L59
8054A38J29k01l6l0k19J84m1L6p2p1L62p3n1j03K68k61j1N0j4j27L79m71K33K39
8078B37j57p7K5o2L6J96m36P9J79o4K4mj83J30J61p5j51J13J42k67K35j62p9L61
$$ plain form
8102 201 -72 -63 -96 108 246 132 -137 124 44 -69 6 -95 18 70 190 -27 -146 -110 160 116 -129 73 -147
8125 -147 -164 -28 -47 -132 -16 -61 -90 11 -80 8 -248 -207 129 -476 124 -172 36 53 103 82 172 -82 -75 -169 102
8150 102 -64 42 142 203 22 103 271 -62 -123 228 66 104 -114 -23 -17 -39 107 116 41 -34 -94 -62 -6 -97 50
8175 50 123 -6 84 -133 -132 -161 32 -94 40 -135 10 66 192 217 -144 198
$$ packed form
8102B01k73Rl3K04J38j14k69K61q0j13P5j01J13N2J20k17j19L6K70m4k45K02k20
8125a47j7J36j9q5J16m5k9J01r1Q8k56M1L36o05O00k96K08J7N0k1R0k54Pr4K71
8150A02j66J06J00O1j81Q1J68l33o1L51j62L8k18R1Ok2J46Rp5p5o0L2N6r1J47
8175E0P3j29R0k17Jk9J93j26J34j75J45N6J26K5l61L42
8191A98
$$ Imaginary data points
##PAGE= N=2
##DATA TABLE= (X++(I..I)), XYDATA
$$ plain form
0 0 0 0 0 0 0 0 0 0 0 0 0 -8 8 -8 8 -8 16 -16 24 -24 32 -39 40 -48 57 -69 80 -93 105 -120 137 -157 177 -201
34 -201 225 -256 287 -320 358 -398 441 -490 544 -602 666 -733 808 -891 982 -1081 1191 -1313
52 -1313 1447 -1599 1768 -1961 2179 -2435 2732 -3087 3516 -4050 4735 -5648 6920 -8829 11993
67 11993 -18142 34372 -165015 -343099 171326 112244 -131226 62866 102267 -163808 -56279
78 -56279 121486 47500 25989 217 -144034 -24767 130285 1373 -24372 61709 -105937
89 -105937 -114578 146465 87868 -108516 8629 15017 -130094 34896 157299 -62039 -90754
100 -90754 39451 -55969 -27606 160894 12332 -154113 18386 53510 -65400 60072 98499
111 98499 -102417 -74612 69528 10089 18424 74814 -70949 -91498 81449 36054 -40687
$$ packed form
0@%%%%%%%%%%%qJ6j6J6j6K4l2M0m8N6p1P9q8J05j26J49j73J98k25K57k94L34l78
34b01M26m81N43o07O78p56Q39r31J034j146J268j399J541j699J873k063K272k504
52a313K760l046L367l729M140m614N167n819O603p566Q785j0383J2568j5749K0822
67A1993l0135N2514j99387j78084N14425n9082k43470J94092L9401k66075J07529
78e6279J77765p3986k1511k5772j44251J19267J55052j28912k5745Q6081j67646
89a05937q641K61043n8597j96384J17145O388j45111J64990J22403k19338k8715
100i0754J30205r5420K8363J88500j48562j66445J72499L5124j18910J25472L8427
111I8499k00916K7805J44140n9439Q335N6390j45763k0549J72947m5395p6741
$$ plain form
122 -40687 73397 9827 -131591 22076 116184 -31141 -19989 50007 -63940 -42815 103707
133 103707 28929 -53122 21498 -18887 -55855 77165 61703 -70871 -6917 36721 -56700
144 -56700 10265 98519 -31483 -77328 33601 11078 -22893 55809 9824 -75154 5816 33546
156 33546 -28374 27905 39405 -71901 -34993 62823 -2615 -28702 37674 -19883 -64132 34790
168 34790 39785 -34089 1838 6913 -50855 6036 49145 -23940 -20735 21999 -32815 -23316 55833
181 55833 5379 -53104 10609 12871 -34761 19318 35788 -36468 -20538 22354 -12061 -651
193 -651 33725 -18017 -32362 24871 7464 -19462 25107 9711 -39415 5365 32410 -13130
205 -13130 -823 22239 -21046 -13304 32298 3811 -15012 18228 -286 -22605 21173 22539
$$ packed form
122d0687J14084o3570j41418J53667R4108j47325J1152O9996j13947K1125J46522
133A03707p4778q2051P4620m0385l6968J33020j5462j32574O3954M3638r3421
144e6700O6965Q8254j30002m5845J10929k2523l3971P8702m5985q4978Q0970K7730
156C3546o1920N6279J1500j11306L6908R7816o5438k6087O6376n7557m4249R8922
168C4790M995p3874L5927N075n7768N6891M3109p3085L205M2734n4814R499P9149
181E5833n0454n8483O3713K262m7632N4079J6470p2256J5930M2892l4415J1410
193f51L4376n1742j4345N7233j7407k6926M4569j5396m9126M4780K7045m5540
205a3130J2307K3062m3285P742M5602k8487j8823L3240j8514k2319M3778J366
$$ plain form
217 22539 -18953 728 16455 -14976 1256 26854 -5859 -12567 13613 -1886 -6748 20758
229 20758 3517 -17973 8810 9631 -13771 8017 16523 -17037 -8237 17883 -3336 -8481 12725
242 12725 -3034 -14743 7504 5293 -9390 3690 2628 -13332 998 9188 -10431 -4901 7733
255 7733 -10042 -9347 10855 -2103 -13041 3556 1151 -11861 1383 5132 -9483 -4290 3892
268 3892 -6531 -3717 5273 -5606 -6643 4477 -2370 -6264 4908 410 -8529 1590 4158 -5449
282 -5449 -796 5200 -3383 -2825 5920 75 -2996 4368 716 -2985 4144 3394 -1944 2773 3801 -946
298 -946 1965 4791 -516 935 5674 580 -290 5881 2693 -1688 3685 4339 -673 1786 4182 976
314 976 1216 2877 1517 986 2657 398 -23 3214 686 -1118 2828 1231 -1858 1073 1571 -1784
$$ packed form
217B2539m1492J9681J5727l1431J6232K5598l2713o708K6180j5499m862K7506
229B0758j7241k1490K6783Q21k3402K1788Q506l3560Q800K6120k1219n145K1206
242A2725j5759j1709K2247k211j4683J3080j062j5960J4330Q190j9619N530J2634
255G733j7775O95K0202j2958j0938J6597k405j3012J3244L749j4615N193Q182
268C892j0423K814Q990j0879j037J1120o847l894J1172m498q939J0119K568r607
282e449M653N996q583N58Q745n845l071P364l652l701P129p50n338M717J028m747
298i46K911K826n307J451M739n094q70O171l188m381N373O54n012K459K396l206
314I76K40J661j360n31J671k259m21L237k528j804L946j597l089K931M98l355
$$ plain form
330 -1784 -531 1213 -970 -1792 460 -522 -2582 -556 -462 -2326 -1085 -1327 -1957 -727 -1937 -2949 -1136
347 -1136 -1277 -3603 -2330 -152 -2512 -4004 -686 -888 -3431 -1992 -653 -2595 -2016 -1221 -1827 -1281 -856
364 -856 -1740 -1031 -317 -1245 -1459 254 -448 -1582 1150 547 -1855 872 1738 -1428 -65 2564 595
381 595 -554 1881 1885 202 1162 1868 678 1789 1758 362 2897 3055 -283 1799 4020 265 202 3703
399 3703 1662 -422 2927 3405 -239 1768 2802 -109 758 2950 371 616 2258 60 -82 2272
415 2272 -455 -1245 2142 477 -2568 1685 1955 -3698 -1139 2620 -2069 -2677 1714 -1313 -3098 453
431 453 -518 -2963 -138 -1018 -4256 -322 755 -4306 -1741 892 -3979 -2776 1950 -2883 -3915 1002
447 1002 -1562 -4549 1503 590 -4964 -1252 1875 -3272 -1671 2701 -2533 -3072 2021 -631 -1680 2401
$$ packed form
330a784J253J744k183q22K252r82k060K026R4j864J241k42o30J230j210j012J813
347a136j41k326J273K178k360j492L318k02k543J439J339j942N79P95o06N46M25
364h56q84P09P14r28k14J713p02j134K732o03k402K727Q66l166J363K629j969
381E95j149K435Mj683R60P06j190J111l1j396K535J58l338K082K221l755o3L501
399C703k041k084L349M78l644K007J034k911Q67K192k579K45J642k198j42K354
415B272k727p90L387j665l045M253K70n653K559L759m689o08M391l027j785L551
431D53r71k445K825q80l238L934J077n061K565K633m871J203M726m833j032M917
447A002k564k987O052r13n554L712L127n147J601M372n234n39N093k652j049M081
$$ plain form
463 2401 -1151 -3299 2755 1974 -2784 1938 3285 -4016 -393 5864 -485 -2024 4372 386 -2211
478 -2211 4624 3358 -1532 1789 2247 -1027 3364 4607 -1751 753 4212 -1305 722 7084 -277
493 -277 -4118 4627 3052 -1905 3698 3366 -3888 -361 4098 104 811 3078 -3015 -2108 4777 532
509 532 -2417 2859 -1623 -5375 2912 3699 -3905 -1479 463 -4420 -754 4325 -2391 -4524 732 -2719
525 -2719 -3631 3944 343 -6924 -1566 569 -3283 839 2111 -5560 -4307 1400 -1342 -776 2601 -3998
541 -3998 -6056 2420 1729 -3013 1688 -530 -6612 -13 5267 -719 -1450 925 -3754 -1823 5576 1698
557 1698 -2678 862 -1088 -2431 5699 4564 -3757 -555 2200 -1756 2937 7159 -1104 -3841 2082
572 2082 2174 1562 5315 876 -4270 1636 3235 899 4694 2498 -5185 -700 6046 1464 671 3379
$$ packed form
463B401l552k148O054p81m758M722J347p301L623O257o349j539O396l986k597
478b211O835j266m890L321M58l274M391J243o358K504L459n517K027O362p361
493b77l841Q745j575m957N603l32p254L527M459l994P07K267o093R07O885m245
509E32k949N276m482l752Q287P87p604K426J942m883L666N079o716k133N256l451
525b719r12P575l601p267N358K135l852M122J272p671J253N707k742N66L377o599
541c998k058Q476o91m742M701k218o082O599N280n986p31K375m679J931P399l878
557A698m376L540j950j343Q130j135q321L202K755l956M693M222q263k737N923
572B082R2o12L753m439n146N906J599k336L795k196p683M485O746m582p93K708
$$ plain form
588 3379 -2575 -3995 4736 4819 -1008 151 -1025 -4060 2644 4786 -852 -1777 -269 -3628 358 5439
604 5439 -65 -4870 -1107 -1411 -1463 4194 1234 -5842 -2849 39 -1804 1757 2307 -5337 -5333 1184 329
621 329 -661 1663 -3061 -6488 -150 2371 -874 -36 -1398 -5786 -703 3706 -272 -984 -597 -4395
637 -4395 -2101 4697 1987 -2751 -740 -951 -2184 3242 3975 -1999 -2036 160 -493 2696 4733 -1267
653 -1267 -2893 1295 1087 1119 4351 1445 -4104 -229 3347 1672 2472 2058 -2727 -901 3631 2357
669 2357 1880 1691 -1750 -2054 3535 3508 -262 726 -59 -2760 1757 4254 -222 -1254 102 -1550 345
686 345 3586 514 -2325 -726 -751 -835 2571 1386 -3156 -1906 200 -1042 1053 1252 -3001 -3135 442
703 442 -400 -444 815 -2047 -3807 -318 1246 -974 -172 -789 -3659 -1544 1825 -443 -1513 -750 -2440
$$ packed form
588C379n954j420Q731Q3n827J159j176l035O704K142n638r25J508l359L986N081
604E439n504m805L763l04n2N657k960p076K993K888j843L561N50p644MO517q55
621C29r90K324m724l427O338K521l245Q38j362m388N083M409l978p12L87l798
637d395K294O798k710m738K011k11j233N426P33n974l7K196o53L189K037o000
653a267j626M188k08L2L232k906n549L875L576j675Q00m14m785J826M532j274
669B357m77j89l441l04N589k7l770R88p85k701M517K497m476j032J356j652J895
686C45L241l072k839J599k5q4L406j185m542J250K106j242K095J99m253j34L577
703D42q42m4J259k862j760L489J564k220Q02o17k870K115L369k268j070P63j690
$$ plain form
720 -2440 -1718 1659 618 -1734 -866 -1239 -1590 1275 1491 -1620 -1080 361 -911 448 2184 -410 -1725
737 -1725 661 157 323 1921 798 -1500 434 1598 592 1316 1792 -844 -287 2179 907 1046 1824
754 1824 114 -503 1997 1892 404 1016 755 -598 812 2395 561 76 1191 -71 385 1975 315
771 315 -776 499 66 -461 873 780 -841 -470 468 -400 29 471 -987 -1504 387 -581 -1096 95
789 95 -699 -1851 -229 0 -1423 -723 -327 -1488 -1087 1 -927 -1363 -233 -1103 -1250 127 -745 -1215
807 -1215 -619 -704 -1091 -416 -176 -1271 -1146 89 -506 -836 408 -254 -798 74 202 -322 321 416 -316 -67
827 -67 607 416 272 1000 73 166 872 824 306 703 720 372 895 855 604 851 949 824 655 911 669 423
849 423 966 811 401 739 719 781 533 549 460 616 580 294 119 341 445 46 174 180 -259 -241 101 -156 -166
$$ packed form
720b440P22L377j041k352Q68l73l51K865K16l111N40J441j272J359J736k594j315
737a725K386n04J66J598j123k298J934J164j006P24M76k636N57K466j272J39P78
754A824j710o17K500j05j488O12k61j353J410J583j834m85J115j262M56J590j660
771C15j091J275m33n27J334r3j621L71R38q68M29M42j458n17J891r68n15J191
789I5p94j152J622K29j423P00L96j161M01J088r28m36J130q70j47J377q72m70
807a215N96q5l87O75K40j095J25J235n95l30J244o62n44Q72J28n24O43R5p32K49
827f7O74j91j44P28r27R3P06m8n18L97J7l48N23m0k51K47R8j25j69K56k42k46
849D23N43j55m10L38k0O2k48J6q9J56l6k86j75K22J04l99J28Om39J8L42k57j0
$$ plain form
872 -166 -216 -380 -524 -319 -466 -805 -524 -390 -705 -462 -474 -709 -668 -607 -894 -559 -565 -779 -677 -717 -683 -780 -713 -468
896 -468 -908 -737 -287 -721 -614 -595 -319 -570 -390 -459 -141 -151 -271 -405 -111 119 -165 -6 491 50 101 633
918 633 192 187 454 722 517 302 832 658 424 464 565 656 818 620 530 857 642 772 783 426 578 518 760
941 760 248 739 809 514 462 583 451 239 225 333 253 282 32 -72 224 98 -180 22 -273 -332 -169 -156 -430
964 -430 -516 -19 -725 -413 -335 -491 -1144 -204 -573 -860 -498 -747 -845 -527 -512 -719 -660 -472 -975 -972 -51 -504 -757
987 -757 -197 -778 -893 196 -488 -794 -240 -203 -672 -335 188 -461 -289 182 -499 -168 624 -100 -105 466 -18
1008 -18 -239 967 536 -426 477 844 156 517 945 255 218 1104 259 51 1304 526 163 1047 1076 41
1028 41 927 710 138 445 1198 109 193 1200 274 -429 1087 384 -950 490 483 -369 522 496 -845 -317
$$ packed form
872a66n0j64j44K05j47l39K81J34l15K43j2k35M1O1k87L35ok14J02m0L4r7O7K45
896d68m40J71M50m34J07J9K76k51J80o9L18j0j20j34K94K30k84J59M97m41N1N32
918F33m41nK67K68k05k15N30j74k34M0J01R1J62j98r0L27k15J30J1l57J52o0K42
941G60n12M91P0k95n2J21j32k12j4J08q0K9k50j04K96j26k78K02k95n9J63J3k74
964d30q6M97p06L12P8j56o53R40l69k87L62k49r8L18J5k07N9J88n03LR21m53k53
987g57N60n81j15J089o84l06N54L7m69L37N23o49J72M71o81L31P92p24nN71m84
1008a8k21J206m31r62R03L67o88L61M28o90l7Q86q45k08J253p78l63Q84K9j035
1028D1Q86k17n72L07P53j089Q4J007r26p03J516p03j334J440pq52Q91k6j341N28
$$ plain form
1048 -317 780 -560 -460 666 -703 -990 539 -53 -1018 136 -348 -1259 -284 355 -1136 -575 116 -1400
1066 -1400 -987 426 -591 -1412 91 -716 -1478 300 86 -1458 -405 -157 -1292 -220 954 -936
1082 -936 -1040 412 -528 -690 1079 19 -1360 454 602 -693 552 733 -1103 -2 1264 -229
1098 -229 -32 1087 -167 -613 1433 979 -346 806 634 -724 776 1802 -333 -27 1349 -384
1114 -384 -106 1728 331 -550 940 446 -265 1387 1056 -818 269 1007 -457 434 1365 -638 -870
1131 -870 1207 18 -583 963 130 -1456 522 1067 -1093 160 775 -1552 -597 1048 -654 -1093 381
1148 381 -1182 -1381 672 -18 -1655 -79 36 -1689 -175 669 -1126 -1022 445 -806 -883 661 -607
1165 -607 -1658 328 30 -992 442 619 -1398 -280 837 -867 -470 697 -661 -766 947 41
$$ packed form
1048c17J097j340J00J126j369k87J529n92r65J154m84r11R75O39j491N61O91j516
1066a400M13J413j017q21J503q07p62J778k14j544J053K48j135J072J174j890
1082i36j04J452r40j62J769j060j379J814J48j295J245J81j836J101J266j493
1098b29J97J119j254m46K046m54j325J152j72j358J500J026k135L06J376j733
1114c84K78J834j397q81J490m94p11J652l31j874J087P38j464Q91R31k003k32
1131h70K077j189o01J546q33j586J978N45k160J253O15k327R55J645j702m39J474
1148C81j563j99K053o90j637J576J15j725J514Q44j795J04J467j251p7J544j268
1165f07j051J986k98j022J434J77k017J118J117j704L97J167j358j05J713r06
$$ plain form
1181 41 -532 588 50 -1469 704 1379 -792 13 1093 -908 -7 1788 -129 -523 1120 405 -269
1198 -269 1539 810 -438 875 1136 -317 575 1473 -444 -118 1678 -142 -59 1454 87 -719 779
1215 779 650 -448 752 614 -785 -8 861 -308 -131 653 -657 -613 933 -188 -1091 348 84 -921
1233 -921 10 460 -816 -227 116 -868 -485 511 -691 -1128 312 -245 -791 244 -439 -1151 -388 87 -891
1252 -891 -269 369 -984 -1054 539 -235 -549 290 -477 -945 341 273 -766 31 84 -624 272 1024 -396
1271 -396 -407 621 -111 -147 913 80 -561 363 454 -359 657 551 -2 327 483 236 156 798 183 120 789
1292 789 519 242 732 540 -89 544 484 86 402 610 -367 -54 702 167 -81 576 237 -288 451 50
1312 50 -265 218 160 -241 -26 337 -460 -332 101 -246 -398 69 -94 -549 -99 -248 -742 -449 -52 -722 -352
$$ packed form
1181D1n73J120n38j519K173O75k171Q05J080k001R01J795j917l94J643p15o74
1198b69J808p29j248J313K61j453Q92Q98j917L26J796j820Q3J513j367q06J498
1215G79j29j098J200j38j399P77Q69j169J77P84j310M4J546j121r03J439k64j005
1233i21R31M50j276N89L43r84L83R96j202m37J440n57n46J035o83p12P63M75r78
1252h91O22O38j353p0J593p74l14Q39p67m68J286o8j039P97N3p08Q96P52j420
1271c96j1J028p32l6J060q33o41R24R1q13J016j06n53L29J56k47q0O42o15o3O69
1292G89k70k77M90j92o29O33o0l98L16K08r77L13P56n35k48O57l39n25P39m01
1312E0l15M83n8m01K15L63p97J28M33l47j52M67j63m55M50j49m94K93L97o70L70
$$ plain form
1333 -352 -35 -383 -113 -198 -355 -829 -256 -223 -613 10 -192 -596 -231 208 -449 -178 -260 -281 -189 251 -197 -166
1355 -166 -35 -213 -94 44 213 -202 -118 250 -3 103 561 -105 252 20 222 306 120 454 -48 390 446
1376 446 288 269 399 202 534 497 229 409 491 444 279 494 209 205 99 302 282 141 291 161 7 67 -8
1399 -8 39 198 -203 -8 -150 10 -53 83 -161 -276 -158 32 -258 -97 -139 -252 -346 -228 -356 -507 -264 -350
1421 -350 -129 -338 -316 -456 -61 -361 -336 -271 -201 -151 -341 -305 -288 -220 -330 -286 -282 -192 -199 -1 -18 -106 -338 2 67 -153
1447 -153 -67 285 129 189 -50 196 18 -117 102 28 108 430 -47 345 282 130 53 283 344 352 248 349 334
1470 334 308 346 319 77 271 255 333 525 333 259 232 398 173 15 -92 142 35 208 203 261 83 48 -92 -20
1494 -20 250 124 -276 -194 -326 124 -37 -85 170 -385 89 -103 -317 -234 124 -407 -210 -301 -15 -540 -282 -326
$$ packed form
1333c52L17l48K70q5j57m74N73L3l90O23k02m04L65M39o57K71q2k1R2M40m48L1
1355a66J31j78J19J38J69m15Q4L68k53J06M58o66L57k32K02Q4j86L34n02M38N6
1376D46j58j9J30j97L32l7k68J80Q2m7j65K15k85mj06K03k0j41J50j30j54O0p5
1399hM7J59m01J95j42J60o3J36k44j15J18J90k90J61m2j13r4J18j28j51K43q6
1421c50K21k09K2j40L95l00K5O5P0N0j90L6J7O8j10M4MR0pJ98j7q8k32L40O5k20
1447a53Q6L52j56O0k39K46j78j35K19p4Q0L22m77L92o3j52p7K30O1Qj04J01j5
1470C34k6L8k7k42J94j6P8J92j92p4k7J66k25j58j07K34j07J73nN8j78l5j40P2
1494b0K70j26m00Q2j32M50j61m8K55n55M74j92k14Q3L58n31J97r1K86n25K58m4
$$ plain form
1516 -326 -328 -389 -273 -375 -324 -198 -456 -120 -102 -322 -254 -43 -156 -150 -85 -141 19 -20 -19 -50 -64 -95 6 121 -12
1541 -12 -8 234 53 78 59 44 283 152 130 558 447 62 384 333 359 225 398 141 311 239 347 194 105 68
1565 68 -37 343 224 169 223 368 128 262 117 173 203 260 111 22 183 117 -319 -129 48 -339 131 161 -213
1588 -213 34 -116 -217 -129 -191 -244 -221 -95 -265 -139 -91 -181 -601 -253 -493 -454 -260 120 -409 -337 36 -213 -244
1611 -244 -211 -151 -444 -470 -216 -563 -66 -246 -343 211 46 -287 -241 202 -50 -402 -96 -48 -157 180 155 -129
1633 -129 210 336 -87 6 204 105 82 330 87 -21 238 135 130 552 324 154 111 283 -22 218 609 -17
1655 -17 -14 486 58 -250 231 351 -142 335 408 -145 105 211 -152 -52 270 -51 103 250 -134 -273 91
1676 91 93 -265 -12 -101 -293 17 109 -680 1 -69 -350 -381 10 -429 -606 -108 -96 -472 -296 -169 -384 -312 198
$$ packed form
1516c26ko1J16j02N1J26k58L36J8k20O8K11j13OO5n6J60l9Jl1j4l1J01J15j33
1541a2MK42j81K5j9j5K39j31k2M28j11l85L22n1K6j34J73k57J70p2J08j53q9l7
1565F8j05L80j19n5N4J45k40J34j45N6L0N7j49q9J61o6m36J90J77l87M70L0l74
1588b13K47j50j01Q8o2n3K3J26j70J26M8r0m20L48k40L9J94L80n29P2L73k49l1
1611b44L3O0k93k6K54l47M97j80r7N54j65l33M6M43k52l52L06M8j09L37k5k84
1633a29L39J26m23R3J98r9k3K48k43j08K59j03nM22k28j70m3J72l05K40L91o26
1655a7LN00m28l08M81J20m93M77P3n53K50J06l63J00L22l21J54J47l84j39L64
1676I1Kl58K53q9j92L10R2p89O81p0k81l1L91m39j77M98J2l76J76J27k15P2N10
$$ plain form
1699 198 -363 -475 -4 -308 -65 275 -99 -476 37 -326 -421 32 -50 -384 -146 282 -42 32 147 -157 217
1720 217 318 53 -155 216 314 -84 380 355 -24 11 30 63 -141 308 27 -8 403 69 -132 320 336 -46
1742 -46 13 280 14 164 308 159 -18 499 30 -4 422 393 -318 185 480 -430 57 104 -117 51 284 -154
1764 -154 81 147 -80 -145 -149 -171 -313 115 -47 -625 -35 44 -566 -138 31 -196 -69 -22 -215 -408 272 -125
1786 -125 -255 29 -181 -417 -260 -42 -525 -264 3 -329 -280 295 -280 -353 48 -82 -245 90 -74 -307 -11
1807 -11 -8 -14 7 31 -164 -61 201 -167 -251 413 67 -195 337 158 -55 302 306 -2 328 173 -79 180 184 -104
1831 -104 -67 235 97 89 160 560 -3 178 138 139 157 337 -82 -254 97 -93 88 120 -31 -165 55 204 -43
1854 -43 397 208 -311 -298 76 -291 52 41 -305 -148 5 -37 -147 -115 -15 -109 -340 12 -204 76 -160 -416
$$ packed form
1699A98n61j12M71l04K43L40l74l77N13l63r5M53q2l34K38M28l24P4J15l04L74
1720B17J01k65k08L71R8l98M64k5l79L5J9L3k04M49k81l5M11l34k01M52J6l82
1742d6N9K67k66J50J44j49j77N17m69l4M26k9p11N03K95r10M87M7k21J68K33m38
1764a54K35O6k27o5mk2j42M28j62n78N90P9o10M28J69k27J27M7j93j93O80l97
1786a25j30K84k10k36J57K18m83K61K67l32M9N75n75p3M01j30j63L35j64k33K96
1807a1LoK1K4j95J03K62l68q4O64l46k62N32j79k13L57Ml08L30j55k52K59Mk88
1831a04L7L02j38qP1M00n63J81m0JJ8J80m19j72L51j90J81L2j51j34K20J49k47
1854d3M40j89n19J3L74l67L43j1l46J57J53m2j10L2J00r4k31L52k16K80k36k56
$$ plain form
1876 -416 -187 76 -277 -338 -359 24 -96 -357 -99 -417 -146 5 -165 -212 -158 -57 -59 463 -109 -15 -40 40 -146
1899 -146 213 209 189 -98 128 265 210 206 130 203 -46 123 99 137 237 233 111 159 -170 244 172 -25 -47 173 203
1924 203 -177 -28 0 388 93 121 289 218 266 -8 42 81 205 -30 -203 -143 -396 268 -27 -34 -193 -174 -241 8
1948 8 247 -18 -10 15 52 9 247 -204 -117 135 -23 -299 -210 -113 -104 -394 -79 -358 -75 -70 -22 -297 -215 -377 -180
1973 -180 -43 25 -193 172 -207 60 -38 -67 -48 -176 205 192 -81 16 -93 119 -57 323 9 143 203 -104
1995 -104 328 -32 186 279 422 191 228 185 85 323 329 23 176 498 57 -25 -180 -142 25 31 200 43 213
2018 213 244 207 -11 116 156 -17 86 6 -156 47 135 72 136 32 -204 -202 85 -176 -41 12 -85 -49 -151 -97
2042 -97 41 -100 -197 -254 -98 -390 -122 -33 -322 123 -174 -112 -182 82 -136 -505 -248 141 -52 -153 -15 134
$$ packed form
1876d16K29K63l53o1k1L83j20k61K58l18K71J51j70m7N4J01kN22n72R4k5Q0j86
1899a46L59mk0k87K26J37n5mp6P3k49J69k4L8J00mj22M8l29M14p2j97k2K20L0
1924B03l80J49K8L88k95K8J68p1M8k74N0L9J24k35j73O0k53O64k95pj59J9o7K49
1948HK39k65QK5L7m3K38m51Q7K52j58k76Q9R7Rk90L15k79K83NM8k75Q2j62J97
1973a80J37O8k18L65l79K67r8k9J9j28L81j3k73R7j09K12j76L80l14J34O0l07
1995a04M32l60K18R3J43k31L7m3j00K38Ol06J53L22m41q2j55L8J67OJ69j57J70
2018B13L1l7k18J27M0j73J03q0j62K03Q8o3O4j04k36KK87k61J35N3r7L6j02N4
2042i7J38j41r7n7J56k92K68Q9k89M45k97O2p0K64k18l69K57L89j93j01J38J49
$$ plain form
2064 134 42 55 23 139 -207 -334 -230 -85 87 -119 84 -4 29 46 -299 14 -28 56 -43 181 162 362 286 131
2088 131 68 6 199 105 23 243 220 25 116 222 -74 152 126 44 327 156 9 140 -72 30 196 -81 -31
2111 -31 12 297 -15 326 66 -25 122 -152 191 -102 263 -82 -153 92 -32 225 -181 -1 -420 -26 -70 224
2133 224 31 -67 61 -198 -157 -286 -188 -198 -119 -242 -206 -116 -58 294 243 -218 -48 -260 -277 -2 -197 -42 -213
2156 -213 -42 124 29 -75 -215 -82 -129 -189 323 -126 -181 -93 -68 -25 203 -58 277 184 44 90 4 186 209 132
2180 132 111 -42 54 86 387 35 235 205 79 148 37 54 320 -14 -13 -194 -90 257 60 114 206 15 109 161
2204 161 127 -111 -140 303 -73 -152 25 193 -19 73 -35 85 -65 88 -51 -340 -191 -149 33 31 -130 -195 -233
2227 -233 -79 77 -69 -188 -148 -73 -85 56 -73 -96 -152 -58 -18 -263 -49 -23 -115 -169 144 -237 153 130 -154 63
$$ packed form
2064A34r2J3l2J16l46j27J04J45J72k06K03q8L3J7l45L13m2Q4r9K24j9K00p6j55
2088A31o3o2J93r4q2K20k3j95R1J06k96K26k6q2K83j71j47J31k12J02J66k77N0
2111c1M3K85l12L41k60r1J47k74L43k93L65l45p1K45j24K57m06J80m19L94m4K94
2133B24j93r8J28k59M1j29R8j0P9j23L6R0N8L52n1m61J70k12j7K75j95J55j71
2156b13J71J66r5j04j40J33m7o0N12m49n5Q8K5M3K28k61L35r3j40M6q6J82K3p7
2180A32k1j53R6L2L01l52K00l0j26O9j11J7K66l34Jj81J04L47j97N4R2j91R4N2
2204A61l4k38k9M43l76p9J77J68k12R2j08J20j50J53j39k89J49M2J82kj61o5l8
2227b33J54J56j46j19M0P5j2J41j29k3n6R4M0k45K14K6r2n4L13l81L90k3k84K17
$$ plain form
2251 63 -45 -30 -80 -23 -199 -2 -169 -278 0 -28 -124 307 36 126 120 -65 -8 155 289 -12 65 122 0 18
2275 18 -14 114 -2 65 58 99 29 284 10 -76 119 229 21 146 442 503 71 264 119 113 162 -22 41 -238
2299 -238 53 40 -129 60 29 -49 -87 35 165 -205 -112 12 50 -163 162 -278 -310 -215 -229 100 5 -71 -64 71
2323 71 -183 -75 -423 -39 -119 1 -154 -382 -96 -165 -117 105 -261 -146 83 241 -15 -36 63 230 27 -35
2345 -35 -29 84 4 51 -57 -23 188 338 282 230 -172 -177 -25 114 288 197 -73 -18 25 -180 240 109 -202 59
2369 59 -91 125 105 233 189 194 28 -19 44 139 186 -7 -49 242 -78 110 66 191 -73 -168 -294 -94 -175 -280
2393 -280 64 197 -113 -246 -68 -69 93 -128 32 67 165 -77 -165 -215 -21 -43 -143 -302 -73 -120 -326 -86 -70
2416 -70 -49 -377 -337 -138 -184 -130 -176 -212 -34 -248 39 33 83 -38 122 160 166 -32 -202 4 -330 -147 -7 -25 109
$$ packed form
2251F3j08J5n0N7j76J97j67j09K78k8r6M31k71R0oj85N7J63J34l01P7N7j22J8
2275A8l2J28j16O7pM1p0K55k74q6J95J10k08J25K96O1m32J93j45oM9j84O3k79
2299b38K91j3j69J89l1p8l8J22J30l70R3J24L8k13L25m40l2R5j4L29r5p6PJ35
2323G1k54J08l48L84q0J20j55k28K86o9M8K22l66J15K29J58k56k1R9J67k03o2
2345c5OJ13q0M7j08L4K11J50n6n2m02nJ52J39J74r1k70N5M3k05M20j31l11K61
2369E9j50K16k0J28m4Nj66m7O3R5M7j93m2K91l20J88m4J25k64r5j26K00q1j05
2393b80L44J33l10j33J78jJ62k21J60L5R8k42q8n0J94k2j00j59K29m7k06K40J6
2416g0K1l28M0J99m6N4m6l6J78k14K87oN0j21J60L8Oj98j70K06l34J83J40j8J34
$$ plain form
2441 109 -226 -57 193 -5 87 13 -126 108 108 205 -119 119 32 -41 206 159 -2 -31 106 287 269 256 -34 -78
2465 -78 162 41 -198 85 -7 129 102 216 120 309 -74 -269 36 -85 -247 -49 -78 303 227 -163 -12 -137
2487 -137 51 -54 -87 9 0 -152 64 32 -38 -34 -148 -44 48 -36 42 -257 81 69 -1 12 50 105 78 -64 45 -98
2513 -98 24 -65 -101 3 -159 -171 -142 -94 -70 -74 101 164 111 -29 60 -244 234 29 80 25 116 94 -71 -33 23 118
2539 118 -54 -147 34 85 -84 232 226 244 69 204 -316 42 -29 158 142 -28 106 -12 136 72 -254 -82 -87
2562 -87 -93 145 223 148 64 38 -78 -99 -157 -120 167 89 170 -84 5 -15 -63 24 -179 50 -407 -77 -8 -89 -79 -99 -122
2589 -122 -94 25 -182 -97 -59 -50 117 -181 -196 0 -141 -59 107 -158 -140 -9 -110 61 43 -30 -78 118 81 144
2613 144 166 30 85 31 125 197 -74 218 65 -356 -196 -137 -221 -22 -73 -171 97 76 168 -206 121 -122 122 125
$$ packed form
2441A09l35J69K50j98R2p4j39K34%R7l24K38q7p3K47m7j61k9J37J81j8j3k90m4
2465g8K40j21k39K83r2J36k7J14r6J89l83j95L05j21j62J98k9L81p6l90J51j25
2487a37J88j05l3R6rj52K16l2p0Mj14J04R2q4P8k99L38j2p0J3L8N5k7j42J09j43
2513i8J22q9l6J04j62j2K9M8K4mJ75O3n3j40Q9l04M78k05N1n5R1k2j65L8N6R5
2539A18j72r3J81N1j69L16oJ8j75J35n20L58p1J87j6j70J34j18J48o4l26J72n
2562h7oK38P8p5q4k6j16k1n8L7K87p8Q1k54Q9k0m8Q7k03K29m57L30O9q1J0k0k3
2589a22K8J19k07Q5L8RJ67k98j5J96j41Q2J66k65J8J31j01J71j8p3m8J96l7O3
2613A44K2j36N5n4R4P2k71K92j53m21J60N9q4J99n1r8K68k1R2l74L27k43K44L
$$ plain form
2637 125 -173 314 133 306 105 192 5 -85 76 269 28 35 -32 56 52 71 -81 119 56 128 -81 -253 -168 -95
2661 -95 45 3 37 -9 74 62 -214 -16 80 -78 169 -246 -14 -159 -119 -84 288 -47 46 39 36 70 -36 19 248
2686 248 -91 57 -126 28 11 -84 -9 190 26 -70 173 24 24 56 -67 -21 -74 51 -115 -26 103 -156 -98 13
2710 13 -1 86 340 -72 -172 291 189 -102 219 421 82 -173 203 189 61 -66 -25 -191 369 18 -8 12
2732 12 364 61 90 148 -5 8 -16 -48 27 230 -117 -164 100 -81 -294 -13 11 187 17 -74 -29 39 -240 -154
2756 -154 47 -72 -21 -104 136 -2 -204 -383 37 289 -8 -100 -277 -13 -6 327 -92 78 -173 -247 131 -3
2778 -3 -105 -80 -60 -98 -79 -34 163 -31 175 23 -255 -101 130 -194 -222 279 23 5 25 -136 88 372 186
2801 186 193 30 -176 424 49 286 -224 96 -261 134 -17 36 175 111 109 -23 245 201 242 144 178 4 60 -45
$$ packed form
2637A25k98M87j81J73k01Q7j87r0J61J93k41Po7Q8mJ9j52K00o3P2k09j72Q5P3
2661i5J40m2L4m6Q3j2k76J98R6j58K47m15K32j45M0L5L72l35R3plL4j06N5K29
2686B48l39J48j83J54j7r5P5J99j64r6K43j49%L2j23M6n3J25j66Q9J29k59N8J11
2710A3j4Q7K54m12j00M63j02k91L21K02l39k55L76j4j28j27M1j66N60l51k6K0
2732A2L52l03K9N8j53J3k4l2P5K03l47m7K64j81k13K81K4J76j70r1M5O8k79Q6
2756a54K01j19N1q3K40j38k02j79M20K52k97r2j77K64PL33m19J70k51p4L78j34
2778cj02K5K0l8J9M5J97j94K06j52k78J54K31l24k8N01k56j8K0j61K24K84j86
2801A86Pj63k06O00l75K37n10L20l57L95j51N3J39o4kj32K68m4M1r8L4j74N6j05
$$ plain form
2825 -45 -56 193 46 56 28 -73 -116 121 8 99 -148 8 -31 -88 -139 69 18 176 -6 123 -133 -10 -316
2848 -316 -70 -233 -48 -179 -182 1 -17 -218 30 259 80 17 -10 -126 -44 -25 -333 -65 54 8 214 -176 112
2871 112 -56 -124 -202 136 -24 45 -164 192 -125 -47 120 -156 316 -81 -227 20 -24 123 123 -140 -135 32 16
2894 16 -139 221 19 -35 -11 113 182 216 61 91 77 -21 -77 -9 160 129 138 57 215 70 221 67 147 237 -146
2919 -146 -46 -206 220 155 16 -174 -75 212 219 -35 194 -315 -13 -205 228 16 -207 -195 -104 109 159 -81
2941 -81 -61 151 -76 86 8 -142 -73 -267 -254 -158 -55 82 44 -112 52 -245 -82 -207 -247 -85 -264 -30 -335
2964 -335 -12 -107 -100 -195 -132 -88 -255 -330 132 -5 -74 -253 265 138 145 140 226 62 -53 52 -26 -11 191 256 -58
2989 -58 106 181 152 212 -14 -44 131 -33 11 73 2 63 -65 281 67 125 95 -4 26 107 -6 54 99 -39 -44 -130
$$ packed form
2825d5j1K49j47J0k8j01m3K37j13R1k47J56l9n7n1K08n1J58j82J29k56J23l06
2848c16K46j63J85j31lJ83j8k01K48K29j79o3k7j16Q2J9l08K68J19m6K06l90K88
2871A12j68o8p8L38j60O9k09L56l17P8J67k76M72l97j46K47m4J47%k63NJ67j6
2894A6j55L60k02n4K4J24O9L4j55L0j4r8n6O8J69l1Rq1J58j45J51j54Q0R0l83
2919a46J00j60M26o5j39j90R9K87Pk54K29n09L02j92M33k12k23J2R1K13N0k40
2941h1K0K12k27J62p8j50O9j94J3R6J03J37l8j56J64k97J63j25m0J62j79K34l05
2964c35L23r5Pr5O3M4j67p5M62j37o9j79N18j27PnQ6j64j15J05p8J5K02O5l14
2989e8J64P5k9O0k26l0J75j64M4O2p1O1j28L46k14N8l0r9L0Q1j13O0M5j38nq6
$$ plain form
3015 -130 -30 -134 18 54 279 5 -80 1 -9 -2 -18 -258 -118 -13 127 -55 146 -75 51 118 0 -12 12
3038 12 -62 -118 -2 -246 -88 196 123 -264 86 -193 220 80 129 -77 -32 79 -58 181 -93 -104 -27 -26 69 -280
3062 -280 -324 -262 -77 9 -109 -73 315 -26 124 141 -63 130 202 130 154 109 198 -118 321 196 131 63 46 142 -34
3087 -34 1 26 22 -50 21 177 -84 -111 -44 287 364 67 207 118 -4 -263 -138 -36 -84 161 -102 -47 121 152 38
3112 38 -75 5 -6 27 -4 -85 -122 157 14 -215 -119 44 -186 -288 111 90 61 83 63 148 25 26 82 -78 -123 -49
3138 -49 7 -140 -13 170 42 -29 42 305 247 -127 168 -29 13 210 -71 -353 5 76 -200 -187 -90 298 -4
3161 -4 -61 89 222 -92 51 26 340 110 72 270 125 75 -336 113 108 13 -189 -83 -93 -84 27 -85 25 12
3185 12 154 -3 -326 130 32 -71 -186 161 -9 186 -172 134 193 -54 -79 -27 -284 -148 -3 137 242 -104
$$ packed form
3015a30J00j04J52L6K25k74q5Q1j0Pj6k40J40J05J40j82K01k21J26O7j18j2K4
3038A2p4n6J16k44J58K84p3l87L50k79M13j40M9k06M5J11j37K39k74j1P7JR5l49
3062b80m4O2J85Q6j18L6L88l41J50J7k04J93P2p2K4m5Q9l16M39j25o5o8j7R6j76
3087c4L5K5mp2P1J56k61k7O7L31P7k97J40q9j22k59J25J02m8K45k63N5J68L1j14
3112C8j13Q0j1L3l1q1l7K79j43k29R6J63k30j02L99k1k9K2k0Q5j23JN6j60m5P4
3138d9N6j47J27J83j28p1P1K63n8l74K95j97M2J97k81k82L58P1k76J3R7L88l02
3161dn7J50J33l14J43k5L14k30l8J98j45n0m11M49nr5k02J06j0RJ11j12J10j3
3185A2J42j57l23M56r8j03j15L47j70J95l58L06N9k47k5N2k57J36J45J40J05l46
$$ plain form
3207 -104 -70 152 -218 -102 -55 -22 137 -30 -101 230 177 127 33 -279 -226 151 -68 -221 -92 -62 11 15 -95 -359
3231 -359 159 244 -188 123 171 30 -190 44 -179 -58 67 -103 12 -37 -73 121 84 230 90 -44 -28 42
3253 42 -75 61 236 65 -198 -81 75 -15 132 -171 -137 -142 -50 66 236 -406 -207 -48 218 80 -44 -101
3275 -101 -39 -266 203 11 119 195 -155 157 -131 -8 42 -135 61 127 103 -27 -23 43 2 -63 139 -102 -56 -41
3299 -41 -54 -83 41 91 -175 -187 -38 -70 -122 -34 -220 -101 -36 -258 -50 -193 -231 -85 3 -44 -84 -161 -122 263 -161
3324 -161 -184 121 -62 -224 -75 21 -76 229 104 101 88 -116 -49 -80 61 -108 95 81 210 92 -48 -6 -114
3347 -114 -49 18 60 -67 54 111 27 262 28 61 -18 249 -10 10 187 110 118 -107 -113 113 178 -17 142 -54 14
3372 14 93 -182 47 -19 6 176 -302 137 -47 -71 111 -84 -14 -177 89 -202 -62 27 145 -66 -22 224 -20
$$ packed form
3207a04L4K22l70J16M7L3J59j67p1L31n3n0r4l12N3L77k19j53J29L0P3Mj10k64
3231c59N18Q5m32L11M8j41k20K34k23J21J25j70J15m9l6J94l7J46j40j34J6P0
3253D2j17J36J75j71k63J17J56r0J47l03L4nR2J16J70o42J99J59K66j38j24n7
3275a01O2k27M69j92J08P6l50L12k88J23N0j77J96O6k4j30MO6m1o5K02k41M6J5
3299d1j3k9J24N0k66j2J49l2n2Q8j86J19O5k22K08j43l8J46Q8m7m0p7L9L85m24
3324a61k3L05j83j62J49R6r7L05j25lj3k04O7l1J41j69K03j4J29j18j40M2j08
3347a14O5O7M2j27J21N7q4K35k34L3p9K67k59K0J77p7Qk25oK26O5j95J59j96O8
3372A4P9k75K29o6K5J70m78M39j84k4J82j95P0j63K66k91J40Q9J18k11M4K46k44
$$ plain form
3395 -20 -46 -12 65 -87 80 -120 86 44 17 -138 -128 15 -122 -112 -78 -7 -35 -62 315 257 113 62 80 124 -211
3420 -211 202 -144 162 -22 -23 -7 -111 157 208 76 -17 6 131 -46 271 165 39 142 125 -30 62 -270 -24
3443 -24 70 -89 37 123 -9 -169 -27 -85 204 121 331 -109 -47 -31 7 76 192 -20 275 -104 -29 -148 58
3466 58 81 220 -160 -82 30 -251 -54 83 -25 -112 -134 32 -71 203 -208 5 -122 -51 -82 -184 106 -45
3488 -45 109 -190 86 -121 -107 -129 -108 -207 -155 -3 -105 -40 -416 36 -100 -124 -19 20 31 -78 40 15 22 -43 218
3513 218 -73 -232 -147 0 94 172 -70 -100 -94 113 120 -153 237 35 146 -163 -214 55 69 122 -140 87 104 173
3537 173 95 -3 149 202 -91 173 90 258 -141 -68 110 -69 168 -296 200 -106 -52 -3 -114 24 -97 -46 65
3560 65 106 -181 10 51 -37 -278 -375 -160 -75 31 -284 171 91 -55 116 -199 147 -107 -188 -257 9 -196 9
$$ packed form
3395b0k6L4P7j52J67k00K06m2k7j55J0J43j37J0L4P1k8k7L77n8j44n1J8M4l35
3420b11M13l46L06j84jJ6j04K68N1j32r3K3J25j77L17j06j26J03j7j55R2l32K46
3443b4R4j59J26Q6j32j60J42n8K89q3K10m40O2J6L8O9J16k12K95l79P5j19K06
3466E8K3J39l80P8J12k81J97J37j08q7k2J66j03K74m11K13j27P1l1j02K90j51
3488d5J54k99K76k07J4k2K1r9N2J52j02O5l76M52j36k4J05L9J1j09J18k5Po5K61
3513B18k91j59Q5J47R4P8k42l0OK07Pk73L90k02J11l09n1K69J4N3k62K27J7O9
3537A73p8r8J52N3k93K64q3J68l99P3J78j79K37m64M96l06N4M9j11J38j21N1J11
3560F5M1k87J91M1q8k41r7K15Q5J06l15M55q0j46J71l15L46k54q1o9K66k05K05
$$ plain form
3583 9 -71 -29 -55 58 89 -158 -107 -124 -78 -9 131 -186 -77 -233 -164 163 -239 412 234 151 -172 -169 106 -57 45
3608 45 147 209 140 23 -243 113 -16 -117 238 -73 201 59 77 101 36 31 50 25 97 178 -111 93 -19 -125
3632 -125 -43 184 166 -254 72 27 61 303 61 29 27 -166 208 -129 298 -76 12 -60 -167 117 120 190 24 -162
3656 -162 -14 -122 124 -109 -133 -109 -97 166 184 -37 -278 69 -61 139 243 -89 201 -175 -35 -8 -25 204
3678 204 253 200 -149 -48 102 -75 81 -77 -66 88 -20 106 -15 -192 -224 -238 -109 -6 15 107 8 -41 8
3701 8 -142 -64 27 140 146 235 79 100 30 36 -71 -228 232 162 80 195 -110 16 -9 -81 -37 61 186 -179 302 91
3727 91 -123 5 -34 192 71 -250 -102 12 -86 156 -309 -116 -66 61 287 161 -143 163 -359 -152 -88 -109
3749 -109 -54 53 -19 -221 70 -31 63 -114 -276 -44 -151 -156 -36 52 -183 264 290 -22 -26 -28 -166 -115 -504 -131
$$ packed form
3583Iq0M2k6J13L1k47N1j7M6O9J40l17J09j56O9L27m02O51j78q3l23LK75j63J02
3608D5J02O2o9j17k66L56j29j01L55l11K74j42J8K4o5nJ9k5P2Q1k89K04j12j06
3632a25Q2K27j8m20L26m5L4K42k42l2kj93L74l37M27l74Q8p2j07K84LP0j66j86
3656a62J48j08K46k33k4K4J2K63J8k21k41L47j30K00J04l32K90l76J40K7j7K29
3678B04M9n3l49J01J50j77J56j58J1J54j08J26j21j77l2j4J29J03K1R2r9m9M9
3701Hj50P8R1J13OQ9j56K1p0Oj07j57M60p0q2J15l05J26k5p2M4R8J25l65M81k11
3727I1k14J28l9K26j21l21J48J14r8K42m65J93N0J27K26j26l04L06n22K07O4k1
3749a09N5J07p2k02K91j01R4j77j62K32j07nJ20Q8k35M47K6l12mkj38N1l89L73
$$ plain form
3773 -131 -216 327 60 128 -101 299 -100 -181 48 -101 -43 99 64 74 -50 48 123 6 30 83 61 -112 339 142
3797 142 -89 -88 248 128 90 -41 22 -2 88 281 141 -150 36 -79 224 -13 187 89 232 -113 -163 62 282
3820 282 -3 -108 19 -30 -99 1 178 23 -46 -269 33 -272 28 -7 -81 63 8 136 52 -87 151 -511
3842 -511 -147 94 85 10 -167 -140 -1 16 188 -33 -80 163 116 -305 61 21 -88 258 -231 -62 -22 221 -214
3865 -214 242 184 -323 155 -74 62 277 33 9 0 -5 -30 -262 -156 205 -17 -42 421 137 -129 84 64 58 -73
3889 -73 322 -105 90 322 -38 76 300 4 -208 -38 121 -321 96 418 2 -71 40 -77 -5 -298 49
$$ packed form
3773a31q5N43k67O8k29M00l99q1K29j49N8J42l5J0j24R8P5j17K4N3k2j73M51j97
3797A42k31JL36j20l8j31O3k4R0J93j40k91J86j15L03k37K00r8J43l45n0K25K20
3820B82k85j05J27m9o9J00J77j55o9k23L02l05L00l5p4J44n5J28q4j39K38o62
3842e11L64K41rp5j77K7J39J7J72k21m7K43m7m21L66m0j09L46m89J69M0K43m35
3865b14M56n8n07M78k29J36K15k44k4rnk5k32J06L61k22k5M63k84k66K13k0oj31
3889g3L95m27J95K32l60J14K24k96k12J70J59m42M17L22m16p3J11j17P2k93L47
$$ [...]
8191a05
##END NTUPLES=NMR FID
##END=
