##TITLE=1H_LR-618-R3-CR18
 CDCl3, 8 sc, 
 28.06.2021
##JCAMPDX= 6.0         $$ Bruker NMR JCAMP-DX V2.0
##DATA TYPE= NMR FID
##DATA CLASS= NTUPLES
##ORIGIN= UXNMR, Bruker Analytische Messtechnik GmbH
##OWNER= root
$$ XWIN-NMR		Version 3.5
$$ Mon Jun 28 12:02:34 2021 Russian Standard Time (UT+4h)  she@DPX200
##.OBSERVE FREQUENCY= 200.131506
##.OBSERVE NUCLEUS= ^1H
##.DELAY= (6, 6)
##.ACQUISITION MODE= SIMULTANEOUS
##.ACQUISITION SCHEME= undefined
##.AVERAGES= 8
##.DIGITISER RES= 18
##SPECTROMETER/DATA SYSTEM= spect
##.PULSE SEQUENCE= zg30
##.SOLVENT NAME= CDCl3
##.SHIFT REFERENCE= (INTERNAL, CDCl3, 0, 15.7039)
##AUDIT TRAIL= $$ (NUMBER, WHEN, WHO, WHERE, WHAT)
$$ ##TITLE= Audit trail, XWIN-NMR		Version 3.5
$$ ##JCAMPDX= 5.01
$$ ##ORIGIN= Bruker BioSpin GmbH
$$ ##OWNER= she
$$ F:/spectra/data/she/nmr/H-F/1/audita.txt
$$ ##AUDIT TRAIL=  $$ (NUMBER, WHEN, WHO, WHERE, WHAT)
(   1,<2021-06-28 12:01:22.35 +0400>,<she>,<DPX200>,
      <created by zg, POWCHK disabled, PULCHK disabled
       configuration hash MD5:
       00 E9 B6 7A A2 85 ED C7 34 08 36 98 17 FE 4E 26
       data hash MD5: 16K
       89 16 6D 4C 0D 22 DD 19 47 5E C5 8A 18 E7 AA 7A>)
$$ ##END=
$$ 
$$ hash MD5
$$ AC 4A CD A8 F4 2E 78 6F 4E BD 75 5A F8 4E 2B 3D
##$RELAX= 
##$RELAX= 
##$RELAX= 
##$RELAX= 
##$RELAX= 
##$RELAX= 
$$ Bruker specific parameters
$$ --------------------------
##$DU= <F:/spectra>
##$EXPNO= 1
##$NAME= <H-F>
##$PROCNO= 1
##$TYPE= <nmr>
##$USER= <she>
##$AMP= (0..31)
100 100 100 100 100 100 100 100 100 100 100 100 100 100 100 100 100 100 
100 100 100 100 100 100 100 100 100 100 100 100 100 100 
##$AQSEQ= 0
##$AQ_mod= 1
##$AUNM= <au_zg>
##$AUTOPOS= <>
##$BF1= 200.13
##$BF2= 200.13
##$BF3= 200.13
##$BF4= 200.13
##$BF5= 200.13
##$BF6= 200.13
##$BF7= 200.13
##$BF8= 200.13
##$BYTORDA= 1
##$CFDGTYP= 0
##$CFRGTYP= 5
##$CHEMSTR= <none>
##$CNST= (0..31)
1 1 145 1 1 1 1 1 1 1 1 1 1 1 1 1 1 1 1 1 1 1 1 1 1 1 1 1 1 1 1 1 
##$CPDPRG= <>
##$CPDPRG1= <>
##$CPDPRG2= <>
##$CPDPRG3= <>
##$CPDPRG4= <mlev>
##$CPDPRG5= <mlev>
##$CPDPRG6= <mlev>
##$CPDPRG7= <mlev>
##$CPDPRG8= <mlev>
##$CPDPRGB= <>
##$CPDPRGT= <>
##$D= (0..31)
0 1.2 0 0 0 0 0 0 0 0.06 0 0.03 0 0 0 0 0.0002 0 0 0 0 0 0 0 0 0 0 0 0 
0 0 0 
##$DATE= 1624867281
##$DBL= (0..7)
120 120 120 120 120 120 120 120 
##$DBP= (0..7)
150 150 150 150 150 150 150 150 
##$DBP07= 0
##$DBPNAM0= <>
##$DBPNAM1= <>
##$DBPNAM2= <>
##$DBPNAM3= <>
##$DBPNAM4= <>
##$DBPNAM5= <>
##$DBPNAM6= <>
##$DBPNAM7= <>
##$DBPOAL= (0..7)
0.5 0.5 0.5 0.5 0.5 0.5 0.5 0.5 
##$DBPOFFS= (0..7)
0 0 0 0 0 0 0 0 
##$DE= 6
##$DECBNUC= <off>
##$DECIM= 32
##$DECNUC= <off>
##$DECSTAT= 4
##$DIGMOD= 1
##$DIGTYP= 9
##$DL= (0..7)
0 120 120 120 120 120 120 120 
##$DP= (0..7)
150 150 150 150 150 150 150 150 
##$DP07= 0
##$DPNAME0= <>
##$DPNAME1= <>
##$DPNAME2= <>
##$DPNAME3= <>
##$DPNAME4= <>
##$DPNAME5= <>
##$DPNAME6= <>
##$DPNAME7= <>
##$DPOAL= (0..7)
0.5 0.5 0.5 0.5 0.5 0.5 0.5 0.5 
##$DPOFFS= (0..7)
0 0 0 0 0 0 0 0 
##$DQDMODE= 0
##$DR= 18
##$DS= 0
##$DSLIST= <SSSSSSSSSSSSSSS>
$$ [...]
##$SUBNAM2= <"">
##$SUBNAM3= <"">
##$SUBNAM4= <"">
##$SUBNAM5= <"">
##$SUBNAM6= <"">
##$SUBNAM7= <"">
##$SUBNAM8= <"">
##$SUBNAM9= <"">
##$SW= 20.0188882624521
##$SWIBOX= (0..15)
0 0 2 0 0 0 0 0 0 0 0 0 0 0 0 0 
##$SW_h= 4006.41025641026
##$TD= 16384
##$TD0= 1
##$TE= 0
##$TE2= 300
##$TE3= 300
##$TEG= 300
##$TL= (0..7)
0 120 120 120 120 120 120 120 
##$TP= (0..7)
150 150 150 150 150 150 150 150 
##$TP07= 0
##$TPNAME0= <>
##$TPNAME1= <>
##$TPNAME2= <>
##$TPNAME3= <>
##$TPNAME4= <>
##$TPNAME5= <>
##$TPNAME6= <>
##$TPNAME7= <>
##$TPOAL= (0..7)
0.5 0.5 0.5 0.5 0.5 0.5 0.5 0.5 
##$TPOFFS= (0..7)
0 0 0 0 0 0 0 0 
##$TUNHIN= 0
##$TUNHOUT= 0
##$TUNXOUT= 0
##$USERA1= <user>
##$USERA2= <user>
##$USERA3= <user>
##$USERA4= <user>
##$USERA5= <user>
##$V9= 5
##$VALIST= <valist>
##$VCLIST= <CCCCCCCCCCCCCCC>
##$VD= 0
##$VDLIST= <DDDDDDDDDDDDDDD>
##$VPLIST= <PPPPPPPPPPPPPPP>
##$VTLIST= <TTTTTTTTTTTTTTT>
##$WBST= 1024
##$WBSW= 4
##$XGAIN= (0..3)
0 0 0 0 
##$XL= 0
##$YL= 0
##$YMAX_a= 155571
##$YMIN_a= -273309
##$ZGOPTNS= <>
##$ZL1= 120
##$ZL2= 120
##$ZL3= 120
##$ZL4= 120
##$ABSF1= 10
##$ABSF2= 0
##$ABSG= 5
##$ABSL= 3
##$ALPHA= 0
##$AQORDER= 0
##$ASSFAC= 0
##$ASSFACI= 0
##$ASSFACX= 0
##$ASSWID= 0
##$AUNMP= <proc_1d>
##$AZFE= 0.1
##$AZFW= 0.1
##$BCFW= 1
##$BC_mod= 2
##$BYTORDP= 1
##$COROFFS= 0
##$CY= 11.3945322036743
##$DATMOD= 1
##$DC= 2
##$DFILT= <>
##$DTYPP= 0
##$F1P= 15.9154993809931
##$F2P= -4.1035820241983
##$FCOR= 0.5
##$FTSIZE= 0
##$FT_mod= 4
##$GAMMA= 1
##$GB= 0.15
##$INTBC= 1
##$INTSCL= 1
##$ISEN= 128
##$LB= 0.24
##$LEV0= 0
##$LPBIN= 0
##$MAXI= 10000
##$MC2= 0
##$MEAN= 0
##$ME_mod= 0
##$MI= 1.114404
##$NCOEF= 0
##$NC_proc= 0
##$NLEV= 6
##$NOISF1= 3.799351
##$NOISF2= 2.8
##$NSP= 1
##$NTH_PI= 0
##$NZP= 0
##$OFFSET= 15.70392
##$PC= 1
##$PHC0= -11583.95
##$PHC1= 25.80101
##$PH_mod= 1
##$PKNL= yes
##$PPARMOD= 0
##$PSCAL= 0
##$PSIGN= 0
##$REVERSE= no
##$SF= 200.130013532006
##$SI= 16384
##$SIGF1= 3
##$SIGF2= 2
##$SINO= 400
##$SIOLD= 16384
##$SREGLST= <1H.CDCl3>
##$SSB= 0
##$STSI= 0
##$STSR= 0
##$SW_p= 3612.71676300578
##$SYMM= 0
##$S_DEV= 0
##$TDeff= 0
##$TDoff= 0
##$TI= <>
##$TILT= no
##$TM1= 0
##$TM2= 0
##$TOPLEV= 0
##$USERP1= <user>
##$USERP2= <user>
##$USERP3= <user>
##$USERP4= <user>
##$USERP5= <user>
##$WDW= 1
##$XDIM= 8192
##$YMAX_p= 0
##$YMIN_p= 0
$$ End of Bruker specific parameters
$$ ---------------------------------
##NTUPLES= NMR FID
##VAR_NAME=  TIME,          FID/REAL,        FID/IMAG
##SYMBOL=    X,             R,               I
##VAR_TYPE=  INDEPENDENT,   DEPENDENT,       DEPENDENT
##VAR_FORM=  AFFN,          ASDF,            ASDF
##VAR_DIM=   8192,          8192,            8192
##UNITS=     SECONDS,       ARBITRARY UNITS, ARBITRARY UNITS
##FACTOR=    0.0002496,     1,               1
##FIRST=     0,             0,               0
##LAST=      2.0444736,     0,               0
##MIN=       0,             -273309,         0
##MAX=       2.0444736,     155571,          0
$$ Real data points
##PAGE= N=1
##DATA TABLE= (X++(R..R)), XYDATA
0@%%%%%%%%%%%%qJ6j6J6k4L2l8M6n6O5p3Q8j05J27j50J72j97K26k61L01l43L88
34B06m39M96n58O28p04P85q75R76j086J202j330J471j625J792j975K178k399K642
52A385k910L207l540L914m336M816n367O007o765P678q802J0228j2099J4676j8486
67a0394K4767l7509J08499k30123l3134L32990j61422p2963J86363o4267j93285
78a50478J13933P2854j5449M5266q0167j26148J33500O5981q8813P1691K2727
89F4897j96781N7196J99187r6549p8111J16475r3745r8328J88583M4516j61028
100e3688M1003K7927j19510J06112J42831j61200p1780J23986n4717m5467J51167
111H6664k5634j50001N6578N0440m6683Q2843J4250j50868K8796J08310p5805
$$ plain form
0 0 0 0 0 0 0 0 0 0 0 0 0 0 -8 8 -8 8 -16 16 -22 24 -32 33 -40 48 -57 70 -80 92 -105 121 -140 161 -182 206
34 206 -233 263 -295 333 -371 414 -461 515 -571 631 -699 772 -853 939 -1036 1142 -1257 1385
52 1385 -1525 1682 -1858 2056 -2280 2536 -2831 3176 -3589 4089 -4713 5515 -6584 8092 -10394
67 -10394 14373 -23136 85363 -144760 -177894 155096 -6326 -79289 107074 42807 -150478
78 -150478 -36545 36309 20860 66126 -14041 -140189 -6689 59292 -29521 42170 64897
89 64897 -131884 -74688 124499 27950 -50161 66314 -27431 -125759 62824 107340 -53688
100 -53688 -12685 15242 -104268 1844 144675 -16525 -88305 35681 -19036 -64503 86664
111 86664 61030 -88971 -32393 18047 -28636 54207 68457 -82411 -53615 54695 -21110
122b1110Q978J05987j14562q9924J45025K3591r3863O2757O448j15230O1129R5782
134G5008p4718j0009M3472q5094M759J21316m7698p3557P4044k1506p4899J00089
146C1207M7769j13921L1O0653m9580J7911P0628o7728m4556O5621j8641k5812
158b6418P8057k2918r1966N4935M9217o1099K2922M3346p7469j3804P8890j8570
170A5123l1537M1548k8927m1630O1434J3346n0706K8866R280o0788L3622N9798
182D9429n5330k2972M8720k7897k3779N9223m809n1202K5324J1373l1220L2110
194H970K0174n1498L725L6789k8439j566M0815l0656l0938M1507K919k8339K7824
207A1287L651m1331J9535K8025k9210K040K4385k9203r078L8369r015k4095K2137
$$ plain form
122 -21110 -12132 93855 -20707 -110631 34394 57985 -35878 26879 33327 -81903 -20774 75008
134 75008 290 -9719 33753 -51341 -46582 74734 27036 -46521 27523 6017 -68882 31207
146 31207 78976 -34945 -34914 25739 -23841 -5930 64698 -3030 -47586 18035 -606 -26418
158 -26418 51639 28721 -63245 -8310 40907 -20192 2730 46076 -31393 -45197 33693 15123
170 15123 -16414 25134 -3793 -45423 16011 29357 -21349 7517 16797 -43991 -10369 49429
182 49429 -5901 -28873 19847 -8050 -31829 27394 22585 -28617 -3293 8080 -23140 8970
194 8970 29144 -22354 -18629 18160 -10279 -11845 28970 -1686 -32624 8883 11802 -16537 11287
207 11287 14938 -26393 -6858 21167 -8043 -6003 18382 -10821 -19899 18470 9455 -14640 7497
220G497j766k4110K2696J3294k5636N118J2235j9483P032K2354k1306r260K3135
233A1800j0838j3305K5323o80k7182J3407J4363j8413L756J5098j6259m821J5480
246G729o419n250J2250p597r979J5422J45j4127J0871N070j7449O015J4052j2512
260a779m393J2931o901p440J1671n60r520O285K221p766N474M123q803J785N998
275C326p256K39Q517o018n257Q883q84p484N961K788p705K237N251m638m18M190
291A732l310j593M077j541j982L612r90k828L785M90m477K935K454m601R42M311
307C016k678k416L636M1l121J820J345j225K1O60m56M18K44j592J299J276k352
324f4K93K440j770j241K082J21k218R16J633j320q22J479n78o46j93P83J40p06
$$ plain form
220 7497 5731 -18379 4317 17611 -8025 -2907 9328 -10155 -3123 19231 -2075 -11335 11800
233 11800 962 -12343 12980 12300 -14882 -1475 12888 -5525 -1769 13329 -2930 -7751 7729
246 7729 1310 -3940 8310 713 -9266 6156 6301 -7826 3045 8115 -9334 -3319 10733 -1779
260 -1779 -6172 6759 -142 -7582 4089 3529 -5991 294 2515 -5251 223 4346 -4457 -2672 3326
275 3326 -3930 -3691 4826 -1192 -6449 2434 1550 -5934 27 2815 -4890 -2653 2598 -2040 -2458 1732
291 1732 -1578 -3171 906 -635 -2617 995 5 -2823 962 1452 -3025 -90 2364 -2237 -1295 3016
307 3016 338 -2078 1558 1599 -1522 298 1643 418 439 1099 643 1061 1305 -287 1012 2288 -64
324 -64 229 2669 899 -342 1740 1861 -357 559 2192 872 50 1529 951 305 112 895 1035 329
342C29p6N87K48j448L6J451n05k174J315J592j716j155K105L3k010O06J183r51
360e50p00P44K93n46n46J87Q11l79p74Q47P30j931L27J797j189j342J638Q63k097
379a817L75J792q58j088Q03Q65n37k79J68K11N96j114j48J927p86k015K547R07
397A549k727Q16K485j850j792K699J73k118J468R72j647O48O58j194P19K01j303
414b43J514J238l045M25K986k485k017L854q1l780K220K507l290j72K710k543
430b02p95K354r23n37J882j563k033L163m11k641K813l7l711K139K984m066j86
447a770L804l135k300N472q35m598K909J535l409J681K151l614L64K021k167J165
463g26K932m352j288M682j453l046N149k42o389L353M566m684m16L587l308j187
$$ plain form
342 329 253 840 1088 -360 -324 1127 622 -1552 -237 1355 -361 -1516 589 622 -1388 -782 401 -550
360 -550 -1250 -506 -213 -759 -1305 -1118 -307 -686 -1460 -613 117 -1814 -1487 310 -879 -2221 -583 280 -1817
379 -1817 -1442 350 -508 -1596 -793 72 -465 -744 -576 -365 231 -883 -1031 896 110 -1905 642 1549
397 1549 -1178 -362 2123 273 -1519 1180 1353 -765 703 1675 28 676 1334 140 859 1060 -243
414 -243 1271 2509 -536 -111 2875 390 -1627 2227 2146 -1634 586 3093 -197 -369 2341 -202
430 -202 -997 1357 434 -103 1779 216 -1817 1346 935 -1706 1107 1070 -2641 -502 2482 -1584 -1770
447 -1770 2034 -1101 -3401 2071 1236 -3362 -453 1082 -2327 -646 1505 -2109 -1745 276 -1891 -726
463 -726 2206 -2146 -3434 1248 -205 -3251 1898 1656 -4733 -1380 3186 -1498 -1914 1673 -1635 -2822
479b822M327n92j972J865k169j143M995l44m672L003J263n058L299N881o053l270
495c462N523j482k016N168j126n050K254J786j935K963K63n814J404M907k896
510D87J65L580n286l046O814P07l850K262p76m975M243M436m802n00K374n069
526c236J048O920k285n156K408o09j713N371N50o056P84J827k720M137L362p093
542b461k412N629j032o80M595l342o111L595M074j832J415p79n614K164N049j854
558D04m05J745o044p72Q100M99n436J709p59l816N136M482m500k380N00j171L031
575C23M677l833l906K410j404Q52O541k501p587K226L801j830K708J967o414k452
591d422N289J555j41J107m464l206N344K233j846J095k063n141L706N841k790
$$ plain form
479 -2822 1505 913 -1059 806 -1363 -2506 2489 2145 -2527 476 1739 -3319 -20 5861 -192 -3462
495 -3462 2061 579 -1437 3731 2605 -2445 -191 1595 -340 2623 2886 -2928 -1524 3383 487
510 487 652 4232 -1054 -4100 2714 3421 -429 1833 1057 -3918 325 4761 -41 -541 1833 -3236
526 -3236 -2188 4732 2447 -2709 -301 -910 -2623 2748 3298 -2758 -1974 -147 -2867 1270 4632 -2461
542 -2461 -4873 756 -276 -956 3639 297 -5814 -2219 1855 23 1438 659 -4955 -2791 2258 404
558 404 -1 1744 -4300 -5072 3028 3527 -1909 -200 -959 -4775 361 4843 343 -2037 -1537 -2708 323
575 323 5000 1167 -2739 -329 -1733 -881 5660 3159 -4428 -2202 1599 -231 2477 4444 -1970 -4422
591 -4422 867 2422 2281 3388 -1076 -4282 1062 3295 1449 2544 481 -4660 -954 4887 2097
606B097j687K09m211J595O588j078m600Q38j499j260O363J660o190j441J786r60
622a790K914L398m908l491K511L96J439L498l847n259L216K912j429K538l34o330
638d566P18N565n44j015P17l744j353N059J212k025K99k190k869N097L584m161
654b16j316J226k810J443O017k486m370J286N2Q4M418o64m937O06J587p84L002
671B138J554n480j507M295j96k33K760l053l772L576K813k231J147n70m238K109
687h88M068j645j148J246l289l93N049o42k833J118r81j904L800J855l660q58
703a105J603j730J503L269l268k708K374M5r88L241q45m103J362K111j330J214
719F45J077l859l54L435p90p31J980k316k252L408J071k413J242r3k364J367K842
$$ plain form
606 2097 410 619 -3592 -1997 4591 3513 -1087 -249 -1748 -3008 3355 5015 -1175 -2616 -830 -1790
622 -1790 1124 4522 -386 -3877 -1366 -970 469 3967 120 -5139 -1923 989 -440 2098 1764 -4566
638 -4566 -3848 1717 1173 158 875 -2869 -4222 837 2049 24 323 -1867 -4736 361 3945 -216
654 -216 -1532 -306 -3116 -1673 4344 1858 -2512 -1226 -1174 -1090 3328 2664 -2273 -1667 -80 -864 2138
671 2138 3692 -1788 -3295 1000 804 571 3331 278 -3494 82 2895 664 1811 1241 -2997 -888
687 -888 3180 1535 387 1633 -1656 -2049 3000 2358 -475 643 -338 -2242 1558 3413 -247 -1105
703 -1105 498 -1232 271 3540 272 -2436 -62 -17 -1005 2236 1391 -2712 -1350 761 -569 645
719 645 1722 -2137 -2491 944 154 -577 1403 -913 -3165 243 1314 -1099 143 50 -2314 -947 1895
736A895k287o17J377k014p7L597j322k433J878J1j800K250J441l211N7K010j416
753f61M50K148k534r85K000n3q88J660m78k218J446J859k127P51J093k333m8K765
771A847j029j292J628p56j367J887M63j555O30L70j236O21J376j560l3J222j503
788b87k60J914n52j775J382L62j548R99Q33j711q7J386q86j86R93o42q01J004
806A38j14o64P33J2j254J234M23j242j80J232j029j27J125n45p34Q12k30o33P68
825b75M07r90L86J46m27N84N19j066k13J209l18m83R04Pj270J145N4o93L03N27
845D56r18K27N40j34j61K90M2k49J36j63o5N37l74j98O66P6n99J18J74j37n16
866b52O90J23l67Q5L53k06j18L3J33k16K36k90J31m5j76r6L24l23m07O65l37l80
$$ plain form
736 1895 -392 -1009 368 -1646 -1723 1874 552 -1881 -3 8 -1792 458 1899 -1312 -1255 755 -661
753 -661 -211 1937 -597 -1582 418 365 -523 1137 659 -1559 -113 1746 -381 370 1463 -870 -918 1847
771 1847 818 -474 1154 398 -969 918 1381 -174 456 826 -410 211 1587 27 -6 1216 -287
788 -287 -547 1367 815 -960 422 784 -764 235 1068 -643 -730 656 -230 -416 577 -65 -866 138
806 138 24 -640 93 105 -1149 85 508 -734 -914 318 -711 -838 287 -258 -992 -180 -410 -1043 -275
825 -275 132 -858 -472 -326 -753 -169 350 -716 -929 280 -38 -521 383 390 -880 265 319 -374 -71 456
845 456 -462 -235 305 171 10 300 342 93 229 66 1 538 164 -34 632 708 109 227 401 264 -252
866 -252 438 561 194 279 632 426 308 341 474 258 494 204 335 290 114 18 342 19 -388 277 -60 -440
888d40M85J23l69P5J06J44n98K07K28k52k39L44J11k77J27k4Jk1J34j33M4l89
910f13oM11q0j70J92M4j81J00j07K84m28M61j52J01j38J09P3l09L10K5R9o6r3
933a34J98J82o22N56j06q7J67K5J02l38L65j08j04LK24k31K27q3J66J02l53OL14
956D71P8k92k98P86n69j84M33J47m31K07j3j70j75N50m72j32K75k01J09Q6k88
977h3m07Q19l01l36L31K58q19J27O26n22P3N20m96l62M20R6l58M71m35l67N86
998a59L0o73M88J94o67K70P50m90l90P34n11m78R40R0n68L11K47q34M20P74o29
1019a51l48P20l50k47J105o42n87J025j96p39O86N31j391O31J072r53l14J217
1037A069q50p74J090j38o57O66K26r23N41P78j261M89Q25j423K15J451j157o96
$$ plain form
888 -440 45 168 -201 -126 -20 124 -474 -267 -39 -291 -530 -186 -75 -352 -225 -249 -248 -269 -135 -268 -224 -613
910 -613 -619 -208 -288 -458 -266 -222 -403 -303 -410 -126 -554 -93 -245 -144 -282 -173 -100 -409 -99 -74 25 -41 -134
933 -134 64 246 -376 180 74 -13 154 179 281 -57 308 200 96 99 323 92 319 236 402 504 151 157 471
956 471 549 257 -41 745 176 -8 425 572 141 348 335 165 -10 540 68 -64 211 10 119 205 -83
977 -83 -490 329 28 -308 23 281 -538 -411 215 -307 -234 286 -210 -572 -152 -56 -414 57 -378 -745 -159
998 -159 -129 -802 -314 -120 -787 -517 233 -257 -647 87 -424 -902 38 128 -440 -129 118 -716 -296 478 -151
1019 -151 -499 221 -129 -376 729 87 -500 525 329 -410 276 807 -584 47 1119 166 -148 1069
1037 1069 219 -555 535 397 -260 406 632 -291 250 1028 -233 256 1081 -342 -127 1324 167 -529
1055e29J226Rj046J059J99j494N28O16q48L05R73j436k63J399m86q87J612p94
1073A43j585J632M57j575Q86O33j647K88J525j077m43J309q14j083J798m5j674
1090a272J279K78j522J054J079j918R5J419j128p9J538q96j481J671R3j182J409
1107D37M63j985O85J365j322K68J150j474p00K279n75j181J412l45j484J327J048
1124A368j669N58Q28j720K15K161j527q26J554p84q18J937m6k012P43R38j529
1141f29J078R97j913l93J760q60l70J570q84j680J786L12j495J199M01j908M99
1158e30J725j491k23J329j125r46K223m13j469R76L06j531J153J062j591l16J417
1175E56j235m5J769j241j020J373k78q73J540k60j532Q65J117j487M93J002j729
$$ plain form
1055 -529 697 706 -340 719 918 -576 -48 568 -280 25 998 -438 -701 698 212 -675 937 143
1073 143 -1442 190 647 -928 -42 591 -1056 -768 757 -320 -763 546 -268 -1351 447 402 -1272
1090 -1272 7 285 -1237 -183 896 -1022 -927 492 -636 -715 823 -73 -1554 117 210 -972 437
1107 437 900 -1085 -400 965 -357 -89 1061 -413 -1113 1166 591 -590 822 477 -1007 320 1368
1124 1368 -301 257 1085 -635 -420 1741 214 -612 942 158 -660 1277 1231 -781 -38 900 -629
1141 -629 449 1446 -467 -860 900 40 -330 1240 356 -1324 462 774 -721 478 879 -1029 -530
1158 -530 1195 -296 -519 810 -315 -1261 962 549 -920 56 362 -1169 -16 1046 -545 -861 556
1175 556 -679 -724 1045 -196 -1216 157 -121 -994 546 286 -1246 -381 736 -751 -258 744 -985
1192i85j35J965o54q98J467o38j555J537R11j432O04O46j773L89J712j101m97
1209d37J181q57n69J473L4j589J203j33p09P64Q56j544J76P66o50p7J345j017
1227B16j015J318K82r39P53K11j588O29Q80p82k13R46q70m90J318k94q91Q85j85
1246A71r24Q89M95j138L63M64j006K51J075r19l73P42j85n02R52K9j262M42P07
1265B71n99K74M70j021J9P00m44r5P39m84n91J033J1r12N73J88q49N03Q08o56
1285f2m95Q93n97j12P17k84n18O61q2l22M91J24o05K20L73m58K69K93n95k80Q35
1306D66q6n84R50j39p02K96M18l91k24O45p37L6L65p6k93L87k18k15L95R7n21
1327a31J41K75o32L66K51k65J1K47j91l98N16j37m50N88m51j16K25K2l8m9J35
$$ plain form
1192 -985 -1120 845 191 -707 760 122 -1433 104 1015 -417 187 833 -940 -551 1161 60 -437
1209 -437 744 -113 -682 791 825 -764 439 306 -403 361 1217 -327 -151 615 -35 -112 1233 216
1227 216 -799 519 801 -138 615 826 -762 -133 747 -35 -248 698 -172 -662 656 362 -529 356 171
1246 171 -753 136 631 -507 -144 320 -686 -435 640 -279 -652 90 -95 -597 355 384 -878 -436 271
1265 271 -328 -54 416 -605 -586 114 -330 -425 314 -170 -761 272 283 -629 -56 132 -717 -214 594 -62
1285 -62 -557 336 -261 -373 344 60 -458 203 121 -201 290 414 -191 29 402 -56 213 506 -89 -369 466
1306 466 380 -204 746 607 -95 201 619 228 4 649 -88 -52 313 237 -56 331 113 -102 293 390 -131
1327 -131 10 285 -347 19 270 5 16 263 72 -326 190 53 -397 191 -260 -376 -151 -129 -167 -216 -81
1348h1j07j9K70l04j76M16J03l28K71q2m47L58M20n39J70k3j86J83k1k04k9M23
1370F8j39l01K46N4j39N6K28o1j69L52j05r8O4J55l21K87M1j42r8L55l90J92J32
1393B67l54K70Kl05K40o2k4n8M48k80R0k55L24k66K17r6J75l21J06j12K21M0j88
1416G9R3k7k89K66K25n2k94K25k69J2K18k56j70J01J73n2J23k00J44k36J60J36
1438A10j29k86J96Ol2J64k80J34j4r3J63j11K19j99K45k25J84j41n7P9p6J30J18
1461A05k87l4L68k66O1j2j04L31k5j71O7p5L8K7M2q6L32j99j88L4J49k76K80L7
1485A48L7J56m95K47J38m5k0J49k37K53k4Km9q3J47k22j8m9J03N3j54j29J69J26
1509B03m2k09P4P9k1k96J80J14j13J57k31l50M50k16l1o5J54J48j18M1O8M2Jk39
$$ plain form
1348 -81 -188 -207 63 -241 -417 -1 102 -226 45 -37 -484 -126 294 -245 -75 -98 -284 -101 -122 -326 -355 68
1370 68 -71 -372 -126 -72 -211 -155 73 12 -157 195 90 -8 56 211 -110 177 218 76 -22 333 -57 135 267
1393 267 -87 183 185 -120 120 58 34 -24 424 144 234 -21 303 37 254 158 333 12 118 6 227 267 79
1416 79 172 145 -144 122 347 295 1 226 -43 -31 187 -69 -239 -138 35 -17 106 -94 50 -186 -26 110
1438 110 -19 -305 -109 -103 -135 29 -251 -117 -131 -224 -61 -172 47 -152 93 -132 52 -89 -146 -67 -143 -13 105
1461 105 -182 -216 152 -114 -53 -65 -169 162 137 -34 33 -42 -4 23 65 -21 311 112 -76 -42 107 -169 111 148
1485 148 185 341 -154 93 231 186 166 315 78 331 307 309 260 177 324 102 84 35 138 191 37 -92 77 203
1509 203 161 -48 26 105 84 -212 -32 82 -31 126 -105 -455 -5 -221 -252 -317 -163 -15 -133 -92 -24 18 19 -220
1533b20pK00m05L83k42O1J53k08K39J75l01N6J54l69j7N26k98j01M75j51k26R7
1555b6j92J98K1L32k44j4ok15K23j45L5K33l24J25J72j65M32n68K45L3l7j45L95
1578C63l32j1p3J48r9J09K16l89J6Q1q7L04J12l67Q7o7R8j40L34j31Nj98r2O1
1602e2N6J51j93j12L35k57k07L64m7l46K71J04j00j51K55l49N4L36n22M03n4j93
1624b54j07L37M3l17J10R5K49k46J40k05j14K77j66J7K86k33l20N64j03l55K08
1645i4O3k08K71J17r7KJ80l06j57L86k21o8L55j89N8K25J18n93K81J87l62j21
1667a73N98k52n05P28k16l25L81L6l88M82k40k10K97L9k94R6K54k48l15N08k80
1688b7j15M35m8m47K04K21l49K84K08n65l7N32m25k61O04j27m54L05K27l72K24
$$ plain form
1533 -220 -227 -27 -432 -49 -291 -230 -77 -285 -46 129 -172 -116 38 -331 -348 178 -120 -221 254 103 -123 -26
1555 -26 -218 -20 1 333 89 75 69 -146 77 -68 -33 200 -124 1 173 8 440 -128 117 150 113 -32 363
1578 363 31 20 -53 95 -4 105 321 -68 -52 29 -58 246 358 -9 78 11 109 -31 303 172 177 -21 -113 -52
1602 -52 4 155 -38 -150 185 -72 -279 85 38 -308 -37 67 -33 -184 71 -278 -224 112 -410 -7 -61 -254
1624 -254 -361 -24 19 -298 -188 -93 156 -90 50 -155 -269 8 -158 -141 145 -88 -408 156 53 -302 -94
1645 -94 -31 -239 32 149 52 54 234 -72 -229 157 -64 -132 223 34 92 317 435 -158 123 310 -52 -173
1667 -173 425 173 -332 396 180 -145 236 272 -116 366 126 -84 213 252 -42 54 308 60 -255 253 -27
1688 -27 -142 293 245 -202 2 223 -126 158 366 -199 -236 296 -129 -390 214 87 -367 -62 165 -207 17
1709A7K79p16L5O38m46j91O20m54j68N63p9m63M45m9m49K82M22n77M7M15m34m0
1731c03M99k25l58M68q4j73L66O4o31M32N3j20J06L3j54k56P59n98R3J35o3m59
1753d16P01R0n85L96Mm20k2O80m84j8N04k01l97M77k73j06J21J82m48L30K83n48
1775a50J1M53o83L65L20m58j90M67j54j40L93J2m30M9J79p0k86O30o72rO47j74
1797A10l75L41q9k66Q1L91m32L2L46l88NN15m00j80N70l85k79N17K07p04M38j04
1819d9l46L63K45l38K19L42k89m53O54l44l25N31j05k82K10J92l22L5M56k14k67
1840h7K46l47Q0L86k29j13J60M20p05O0N47l69q3L13j00l30N13j17k40K74j68
1861A11l99O41k76k39K48J49n01K94J19l7j32K11j31k95L61J63o67L35K62l56
$$ plain form
1709 17 296 -420 -385 253 -193 -384 236 -218 -386 177 98 -365 80 31 -418 -136 286 -291 -244 171 -263 -303
1731 -303 196 -29 -387 81 -3 -176 190 254 -377 55 108 -12 94 127 -27 -283 476 -122 -29 106 43 -416
1753 -416 285 375 -210 186 190 -230 -252 428 -56 -74 430 229 -168 309 36 -70 51 233 -215 115 398 -150
1775 -150 -139 314 -369 -4 316 -142 -332 135 -19 -159 234 246 -184 -135 44 -26 -312 318 -354 -363 284 110
1797 110 -265 76 -13 -279 -198 193 -239 -207 139 -249 -244 271 -129 -309 261 -124 -403 114 321 -383 55 -49
1819 -49 -395 -32 213 -125 94 436 147 -306 348 4 -321 210 105 -177 33 225 -97 -62 394 180 -87
1840 -87 159 -188 -108 278 49 -64 96 516 -189 -129 418 49 -34 279 179 -151 362 245 5 279 111
1861 111 -288 353 77 -162 86 235 -266 28 147 110 -22 189 58 -237 124 287 -380 -45 217 -139
1881a39J11q7jp9M03l74j77M52k02j98J50Q1Rm5O1r2j94N15p4k05j37K50p6O3
1905A5k70O1O7K54n8M9k08J29j90K16r3r3M75k53k33J04p6M8L25l17l7J42k54
1928a97K77o4J88k87K43j43J53k55K82j37jJ59Lk0j91J3R5J53p5j78n1J85m3q9
1952B0lJ41QO1j01j37J59k8j01p3K0M7m7J01j05j88J11J1LK9L8J70j80rj26K49
1978G0M8k81j13L19o58M13J01P7o3m5L5j0l4K49l28Q3L5l2K30k2k4o4j68K01J35
2003A54k10J99l39J68q2o3K09K88l78J88K4j92N0O5ml52L11K4j36K14j71k47J49
2026a31K57rk31K88P8j42O0Mj85K22qk22j5K6r8O2J60k80L51j8k19J88j07l02
2050b71M5K75Nj42J69k61J60J3k1J94l41J92k65J77P9Q2l94K42O8M3j51K03l14
$$ plain form
1881 -139 -28 -115 -116 -195 208 -166 -343 109 -93 -291 -141 -60 -51 -96 -35 -127 -321 194 120 -85 -222 28 -48 15
1905 15 -255 -194 -127 127 69 118 -90 39 -151 65 -28 -121 354 101 -132 -28 -104 -56 269 -48 -85 57 -197
1928 -197 80 16 204 -83 160 17 170 -85 197 60 59 218 221 201 10 23 118 271 196 18 -33 152 109 20
1952 20 17 158 166 227 126 -11 148 120 19 -54 -34 13 -34 67 -38 -226 -115 -104 -101 -72 -34 136 -44 -53 -179 70
1978 70 118 -163 -276 43 -615 -202 -101 -24 -87 -132 -97 -107 -141 108 -220 -137 -102 -134 96 74 50 -14 -182 19 154
2003 154 -56 143 -196 -28 -110 -173 36 324 -54 134 158 -34 16 81 77 -275 36 60 -76 138 -33 -280 -131
2026 -131 126 117 -114 174 252 110 170 174 -11 211 203 -19 -34 -8 -106 -44 116 -164 187 169 -50 138 31 -271
2050 -271 -226 49 54 -88 81 -180 -20 -7 -28 166 -175 17 -248 -71 8 90 -304 -62 6 49 -102 101 -213
2073b13j25L74J7N1J00k78mN8j5j60J40j74K9J19j71L55j86j6R9N7p7k41K17m3
2097h7L11l0j56j98J41J9J14O2k1k61N2J34l9R7j51l2n3L7JQ5J12r7J76j58P8
2122A36N9j20q4J5j8P0r8k2J24j9O8L9K9j73K06l13K72j76k18K21O1j%J99l38
2147h1p0K97p2l94N36k61k12M60k32J2l3j78k4K03Q1l00L2J16j24K52l32L32j93
2170a85M0J16k50K64R1j95J24P5j91J17O1J6l44N2K08N0q1M0mq0P3J47j22K16
2194B38l36J42p1o2K10j58N7O5N4n1K35l03jL07l14J52O4l70L51n0l34K83J54
2217B62l7q5j9j59N4O1j23J18nk9j60J04O5Q4p7Q1o4J1J00k2n55L20L34k07M4
2242I6j38J53j55J26j13Kk1qK8M2rl8k65M56j92P9p0L4o5K9l78M37O6j15p3J82
$$ plain form
2073 -213 -338 36 53 104 204 -74 -78 -20 -35 -195 -55 -229 -200 -81 -252 103 -83 -99 0 57 -20 -261 -44 -87
2097 -87 224 194 38 -160 -19 0 114 176 155 -106 -54 80 41 138 -13 -45 -98 -61 -60 25 137 40 216 58 136
2122 136 195 75 -9 6 -12 58 -40 -62 62 43 111 150 179 6 212 -101 171 -5 -223 -2 59 58 58 257 -81
2147 -81 -151 146 74 -320 216 -45 -257 203 -29 -17 -50 -228 -252 -49 32 -268 -236 -120 -244 8 -324 8 -185
2170 -185 -145 -29 -279 -15 76 -119 5 80 -111 6 67 83 -261 -209 -1 49 -32 8 4 -76 -3 144 22 238
2194 238 -98 44 -27 -89 121 -37 20 85 139 88 323 20 19 326 12 164 228 -142 209 159 -175 108 262
2217 262 225 140 121 -38 16 77 -46 72 67 38 -122 -18 47 131 54 135 71 82 182 160 -395 -75 259 52 96
2242 96 -42 111 -44 82 -31 -29 -50 -58 -30 12 3 -35 -300 156 -36 43 -27 7 -58 -29 -407 30 96 -19 -92 90
2268I0k65J70n4j34K25J22J8k45J85l43J70O4rJ53m08L89j01n9j69K85l65J41
2290a40K22o4J35r5j07J85J0r7K32k60qj46K87j29J31k65R9mm8m0J05K80m52J87
2314A8n5j7J46J26j96K7L9m0J2k7K58l63k06L42P6l4j49q0K78k11K38k1L7l42
2338a44J79O4k09n1J23pJ21r2l8o4l2N2K30K1k08k1K58j76l5K65j30j78j3L1M1
2363a3j77J50N4kj4J05p5p2j58l6K72k20L2q4L62j15J17L3j95K25j47J44p8j49
2387d1R4O1k79RO5K06j2q0n8J04M8m7K8O2j73N1j43J39M2n5J34j27j34J32m6J61
2413A41j37O3k05N6Oj34J83LQ7q9j01J16J22n6j09L8R0R5k15m5r1K84j53j46J56
2438d1j69J30P0Q7J26l87J38n2L7O2j1J44m17J07J14p2j50N13j46q1j20K38j78
$$ plain form
2268 90 -175 -5 -59 -193 32 154 172 -73 112 -231 -61 3 -6 147 -261 128 27 -32 -201 84 -281 -140
2290 -140 82 18 153 58 -49 136 146 49 281 21 13 -133 154 25 156 -109 -10 -14 -62 -102 3 283 -169 18
2314 18 -37 -54 92 218 22 49 88 48 60 33 291 -72 -278 64 140 106 -43 -123 155 -56 182 161 198 -144
2338 -144 35 99 -110 -161 -38 -45 76 -16 -54 -118 -150 -98 132 153 -55 -76 182 6 -29 236 106 -72 -85 -54 -13
2363 -13 -190 -40 14 12 -2 103 28 -44 -202 -238 34 -186 -154 -238 124 9 126 159 -36 189 42 186 108 -41
2387 -41 53 114 -165 -156 -91 115 103 23 -35 69 117 70 98 160 -13 38 -105 34 76 21 155 28 -106 26 -20 141
2413 141 4 67 -138 -82 -76 -210 -27 -24 63 -26 -127 -11 111 55 -54 -16 74 169 -46 -91 -182 102 -51 -197 -41
2438 -41 -210 -80 -10 77 203 -184 -46 -98 -61 1 -10 134 -283 -176 -62 -134 -284 229 83 2 -118 120 -58
2461e8J14j7l8n3p1Q7K1j57L18k14J49j0J15k10J9J0mKL16j48l33L08k7j89J59
2486H9J00l9k30J00n2O0o1Q6K23l06o8J24M5j12l8J50K8j9M4j06J94j94j74J37
2510a9Kp4N2j63J64j0J2n8M4K15r7Jj52Q7j67K92l99K12L3J6p4P2J5k15K78j61
2536i4J07n2n5J35k41kJ57l8o9K56k1Pp6M3q0J2K34k98K65k08K06j99j7P9r5j35
2562a79J53j91K39J67j29M0k50J94j33O9K51j76J0o1j09L5L96k52q7J48L3k68
2584a00J18o7Q5J78m8pj69j61K14K05l89K62k17L84j74k83L61j58K5j41K32m3
2606A07J11j36mJ46j06l1j10j83O8J88Q9k14J09l41O8j4K45Lj01m8J40P3p6J7
2630@p4K19N5k49J22k4k14M7L2J61j7k5j6J5J70o1k33Q3J83l64L25j13P6j12M6
$$ plain form
2461 -58 56 39 1 -52 -123 -36 -15 -172 146 -68 81 71 186 -24 -5 5 1 3 319 171 -162 146 119 -70 89
2486 89 189 150 -80 20 -32 28 -33 53 276 -30 -98 26 71 -41 -79 71 99 80 124 18 212 18 -156 -19
2510 -19 -17 -91 -39 -202 -38 -48 -36 -94 -50 165 68 69 -83 4 -163 129 -270 -58 -25 -9 -83 -11 4 -211 67 -94
2536 -94 13 -39 -94 41 -200 -202 -45 -83 -152 104 83 90 14 57 -23 -11 223 -75 190 -18 188 -11 -28 51 -44 -179
2562 -179 -26 -217 22 189 60 100 -150 44 -89 -20 231 55 65 4 -105 -70 326 74 -13 135 168 -100
2584 -100 18 -49 36 214 166 159 -10 -171 43 248 -141 121 -96 288 114 -169 192 34 59 -82 150 107
2606 107 218 82 78 224 118 87 -23 -206 -138 50 139 -75 34 -307 -239 -253 -8 -5 -106 -154 -14 59 -17 0
2630 0 -74 145 200 -49 73 49 -165 -118 -86 75 58 33 17 32 202 141 -92 -9 174 -190 135 22 98 -14 32
2655C2J55m09J53j40J77J06o4j04J5k7J73k59J62L02k89j65K90J7p9j03K36n5
2677A24p6L1j60L1J05n0l1J34M2j11j02j05K83p7J78p5Kk33J82l31K63O8J39J4
2701B45k64J10k94J51k68L00M6k41J84L43l24J54j03m9m9Q5K6j44L0R5j59K61
2723A35j19p8L18k61J45l68L47k80R0K62k15j25J56k2N6k86J62J88k48J82j3j85
2745a59J01L85l40K56l66J38j61M17k03m3L1p9L7J44k3j79j49K42l4J49k30R9
2767C3J79j8k41p9J98k1l83L68M9O8k33j32R2K1J77R5Q0k18k4j62P1J70oj06P
2792a5J30m6q2K04l46K84k15j31J09K19j04J2j80J01J40j25Q4N3k66M05k37r1
2814i7J79KL2o4k03n4K41k65N1K47K32m26Q4k3J54o3J89l43J57J36j25k7M8J7
$$ plain form
2655 32 187 -222 -69 -209 -32 74 10 -94 -79 -106 67 -192 -30 272 -17 -182 108 125 46 -57 179 124
2677 124 48 79 -81 -50 55 5 -26 108 150 39 -63 -168 115 38 216 141 143 -90 92 -239 24 92 231 245
2701 245 -19 91 -203 -52 -320 -20 26 -215 -31 312 -12 142 39 -10 -59 26 52 -92 -62 33 -126 135
2723 135 16 -62 256 -5 140 -228 119 -161 -71 191 -24 -149 7 -15 41 -245 -83 105 -143 39 26 -159
2745 -159 -58 327 -13 243 -123 15 -146 271 68 25 56 -23 14 158 135 -44 -193 49 15 164 -66 33
2767 33 212 194 -47 -126 72 51 -332 36 85 153 -80 -212 -120 -99 78 173 253 35 11 -151 -80 90 84 -22 -15
2792 -15 115 69 -13 191 -155 129 -86 -217 -108 111 7 19 -161 -60 80 -45 39 92 -174 231 -6 -97
2814 -97 82 84 116 52 -151 -205 36 -229 -178 69 301 -125 -41 -64 90 27 216 -127 30 166 41 14 62 79
2838G9R4j8j51j22J3K82j81k18J8L64k39J54j5JJ4l6o4j26J10k0L0O9j06k39L21
2863A4K11o7j42L1r3ql8L05j15J64l85L45k85K4Q4k8J00r3m6L71m09L0Q1j6m1
2888fM1J00m9Kk8n2lo9K35l21K70Q2j40n6j07l5L5j30J06M19m13J63l5K22k99
2913f8J31k22K94Qk74J60j0K48k78Q9n2J39l14O3K92k99j5O7K46r0n5n5K2Kj9
2938A0m4j71J4K53q1MQ7k85M26l00L22j99j89N0l1K42j53o5p7J35n7Q4KK05m98
2963c16K99q5J13P8m1k01J69j77L25N5m07j8j1L45q1j47J91l0r8j04L77j00L1
2986A67j98j18J44pJ26j80Q6R5p3n9m3J21k09O0P6M7j82K8J04l3P2o7L07m12K79
3011A31k79J45j81O0L04k03p0n8oj25K49r1R5on5k0K32M0k8k52L08k72K57j77
$$ plain form
2838 79 173 155 4 -118 -105 177 -4 -222 -204 160 -79 75 60 61 75 39 -25 -151 -41 -61 -31 38 -68 -307 14
2863 14 225 158 16 47 -46 -54 -92 213 98 262 -123 222 -63 -39 45 17 117 24 -22 349 -60 -30 51 35 -6
2888 -6 35 135 86 88 60 8 5 -64 171 -150 120 202 62 6 -101 -136 -101 -231 -125 294 -119 44 9 231 -68
2913 -68 63 -159 135 143 -131 29 19 267 -11 78 26 165 -149 -86 206 -93 -108 -41 205 115 60 5 27 29 10
2938 10 -34 -205 -191 62 -19 -15 72 -213 213 -87 235 36 -153 -103 -134 108 -45 -110 -187 -52 -109 -25 -23 182 -316
2963 -316 -17 -102 11 89 48 -153 16 -161 164 219 -188 -206 -217 128 47 -100 91 61 -37 -141 236 136 167
2986 167 -31 -149 -5 -12 114 -66 20 115 42 -17 -60 61 -148 -88 -12 35 -147 -119 -15 -48 24 -43 264 -148 131
3011 131 -148 -3 -184 -124 180 -23 -93 -151 -157 -282 -33 -124 -29 -35 -90 -110 122 162 134 -118 190 -82 175 -2
3035bK0n8j52J41K34j49j60L00j85l8J02j18M6J22j02r4J38k70L85j72lJ43j74
3058d6K73j93J51j42J01k52L35k44K3j02p8Q8Q0k04j4K76R2k78m6J18J0J80j88
3081f0j04J05J69Pl70K98J87j99N0j03j96P3N3J34M6j38K2k30J86P0j12K2K09
3104A19k47J45L2n7K15l35L5j41J82K3K85l57j5N3r1J47O5j6J94l12M24l68J10
3127I0l3m4L3j29J6J02n7r7o5o0L2K48j1j89J93k6N5m1k44K56PJ88l18j41N09
3152B74l82L10k69R1K10m59N31m02m2K51k42jn0J41j27L08j77J90j26j03J86j89
3174g7J01N8k17J4K50q0ml91K32J25p0L02j30j9Mk68J51k19K80J5L8k76J25J2
3198d4L4P1j30J89k01K6j29K96k88J68J57j01M5J81l26J22omj77O5K54j68p6m6
$$ plain form
3035 -2 18 -40 -192 -51 183 34 -126 174 -11 -49 53 -65 -19 103 1 -93 45 -225 160 -12 -15 128 -46
3058 -46 227 34 185 43 144 -108 227 -17 6 -96 -174 -86 -6 -210 -224 52 144 -134 -180 -62 -52 128 -60
3081 -60 -164 -59 110 117 -253 45 232 33 83 -20 -216 -143 -90 44 90 -48 -26 -256 -70 0 -112 -90 119
3104 119 -128 17 49 -8 207 -128 -93 -234 -52 -29 256 -101 -116 -63 -154 -7 58 42 236 -76 348 -20 90
3127 90 57 13 46 -83 -67 35 -22 -119 -184 -244 -212 36 25 -164 29 3 58 17 -227 29 36 224 -94 -235 274
3152 274 -108 202 -67 24 234 -225 306 -96 -138 113 -129 -130 -180 -39 -166 142 -35 155 29 -74 112 -77
3174 -77 24 82 -135 -121 129 49 45 -346 -114 11 -59 243 113 94 98 -170 -19 -238 42 57 95 -181 -56 -44
3198 -44 -10 61 -69 120 -81 -55 -184 112 -176 -8 149 48 93 274 -52 70 64 60 -117 -52 202 34 -42 -88
3222h8K1L98k81O4j19j9K6Q4o1j51K94j57j46J39oo7j35J59p7K53l16J80j28J38
3246EP5l3o15O09j18j9M5J09P0n2k74j27L92k26J58j34J20J01j57k0m8N1J16p4
3270d6K62l35K32j23K5R0k47J49J28Q3k31r7J83q0J10j72J94j98k3K73k62J96
3292A11n8k52M39l26J68l4J94j68r6n2L9n7K8J12J06k42j3K30k09L5J53L4k39
3315i7K08k1k5L6q9j45o1O6L07k65K17j3L8j68j17J17%L15l59r5J65j14K90n70
3339c80N73k31n5J29J16o0j61J06j79p2N4J35j94j4L11l4O2j27j17o8K35j53L43
3362B19n0j03q7K11k41o7J86J13j12n8K0qj7j02J7J10j52k0MO2K03j10j01J81
3386I8P4j35L0j75M25l05J05j46M8L05o3l7l7k00j33L68p9j33L4R3k05M8K57k47
$$ plain form
3222 -88 -67 331 50 114 -5 -24 2 86 25 -126 168 11 -135 4 -2 -69 -204 -45 -122 131 -185 -5 -133 5
3246 5 80 47 -568 41 -77 -96 -51 58 128 76 -198 -325 67 -159 -1 -135 -15 86 -71 -91 -139 -88 28 -46
3270 -46 216 -119 113 -10 15 105 -142 7 135 218 -13 -110 73 -7 103 -69 125 -73 -96 177 -85 111
3292 111 53 -199 240 -86 82 48 242 74 -22 -74 -35 -92 -64 48 154 -88 -101 129 -80 -45 108 142 -97
3315 -97 111 90 65 101 12 -133 -194 -128 179 -86 131 118 156 -12 -129 -12 -12 303 -56 -151 14 -100 190 -380
3339 -380 193 -38 -93 36 152 92 -69 37 -142 -214 -160 -25 -219 -233 78 44 106 -21 -138 -206 29 -124 219
3362 219 169 66 -21 190 -51 -118 68 181 69 11 31 23 6 -96 -79 31 -121 -141 -137 -75 128 18 -83 98
3386 98 172 37 67 -108 317 12 117 -29 19 324 261 224 187 -13 -146 222 143 10 44 137 -68 -20 237 -10
3410a0K32k24j85K26L2l07L43j8J83k05j09J20m6J15j55j33O2J7K05j83n4k0L8
3433g6K4qK52k28J62O8j01l34L76j67J46k61n3L44j43k99K84j16M15k68k5K50
3455B42m92J26Q9m6k9n0K91k65k4J8J27n6P0P2k15K01nP0L9J4k41K1Rl3p8j07
3481b52J25R9o9k2J00l4N6o4K44k54o8K72qJ18l03L3N5Lj64n0J54r1J00O9k74
3506b25K11j2J54p5Qq1k7J3nJ70r8N6k36Q0K18k42J11m2%K8J35k22P0Q8P9k82
3532a26K42Pj04P9q4m6J64p4k33L63l05M3J43P8l45J79j02M3N2n8R3N3j66M9j42
3557a97J20L2p6J87r3p0J03QO0q1j21K92Q9l75K99l91J39K16k78J63k10K58k51
3580a77J92P6j06J68j97N1rK05j97p5j5l8J21k7q1K10j24k7m9J45Q2J49j95l62
$$ plain form
3410 -10 222 -2 -187 39 71 -236 107 89 272 67 -42 78 32 147 -8 -141 -79 -62 143 -40 -94 -114 -76
3433 -76 -52 -60 192 -36 126 194 93 -241 135 -32 114 -147 -200 144 1 -298 -14 -130 285 17 -8 242
3455 242 -250 -124 -35 -81 -110 -160 131 -134 -158 -140 -13 -69 1 73 -142 59 54 124 163 177 -64 -43 -34 -67 -145 -252
3481 -252 -127 -28 -97 -119 -19 -53 3 -61 183 -71 -139 133 125 243 -60 -27 28 31 -133 -183 -29 -120 -20 49 -225
3506 -225 -14 -26 128 53 61 -20 -47 -34 -39 131 33 89 -147 -67 151 -91 20 -22 -22 6 141 -81 -11 77 156 -126
3532 -126 116 123 19 98 14 -32 132 58 -175 188 -117 -74 69 147 -198 -19 -121 -78 -26 -84 9 62 -104 -55 -197
3557 -197 -77 -45 -121 66 -27 -97 6 14 74 -7 -128 164 253 -122 177 -214 -75 141 -137 26 -184 74 -177
3580 -177 15 91 -15 153 -44 7 -2 203 6 -69 -84 -122 -1 -28 -109 101 -23 -50 -99 46 128 277 82 -280
3604b80K85k32L6J73r2J00j26o3RJ49o7k9K1J03J12J8o1k51J69M2o8q8K81k73
3628a32J53k18L58l27J97j92M0L47k59L4O1n5J04j02J83k68J63j4j54J17J38l73
3650a99L31r0l54L23R7k99J89m15L56J14j86L04k54o6Q7k26J60K23j22L0J14j4
3672A03N3J09l78J52Q0k18n7L40j33J91r2q9j22Q5J08j11J21Ll21J69k37K65m3
3695b2L17m20K7L4K6p2O8j00K07q6J7L93m30K0r1J19o1l4M7O0j04J19k06k2J82
3720a2q7m5J72k2m5o2jK83n19N19j39j71K57j41L43m39l1J30l7L5r6K78JR0j71
3745I0k41j8K18k03o4J58J84j61J66j8j75N7j50J5N6j5J25L13l47N0Q4J5J6k2
3769A33p9Rk0j41K31k82K8N6K8K71l11J66j40J8J35j46J05k72J98J39r8M9m6p7
$$ plain form
3604 -280 5 -227 -191 -18 -110 -10 -136 -199 -190 -41 -108 -137 -116 -13 99 117 56 -195 -26 16 -52 -140 141 -132
3628 -132 21 -197 161 -166 31 -161 -121 226 -33 1 62 7 111 9 192 -76 87 73 -81 36 174 -199
3650 -199 132 42 -312 11 108 -191 -2 -417 -61 53 -133 171 -83 -149 -62 -288 -128 95 -27 3 117 103
3672 103 156 265 -113 39 119 -99 -156 184 51 242 150 61 -61 24 132 21 142 145 -176 -7 -244 21 -22
3695 -22 295 -125 -98 -64 -38 -110 -42 -142 65 -21 -4 389 -41 -21 -112 7 -54 -88 -41 19 -85 34 -172 -194 -12
3720 -12 -99 -144 28 6 -39 -101 -102 181 -338 181 42 -129 128 -13 330 -109 -140 -10 -47 -12 -108 170 171 261 90
3745 90 -151 -169 49 -154 -218 -60 124 -37 129 111 -64 -7 -157 -142 -86 -101 24 337 -10 40 124 139 155 133
3769 133 54 63 43 -98 133 -149 -121 -65 -37 234 -77 89 -51 -33 102 -44 61 -211 -13 126 28 77 31 -46
3793d6J0R8k81Q1K28o4j73J22O0J88j13j69J64j14n4Q4m3J09j78k9J55j73R7j18
3817a59J8K06k23K04K59l38R0j46j40K44m8L7J15M2J03O4k55l4Q5J69j27m49K73
3840a0m4l65M39J28n2K34m35K16k18l3K7J77j11J17j66R2N3J5p5PL1j28K61j46
3864A4L5R0o2j02Q0k33L26j86J44K13k50j30j67R7j10L64j27j57K16q1l8J80j90
3887g4M5J11J06j28lk26J11M1P3j9j13JN2m2q5o5J17J33K29l00n4K41l0j36k6
3912d1K80j99O4k6k5j70K68j11K02j01o1j86j9Q8P9qJ48k84o5J79p6J43k94N4
3936a61r7L98j19j53J96k4p3Q3o9P2J21N1k22j6J10J39k88J30k74L82k50OJ28
3959G0k47K38J37o17O28p8L7P0k69J41k07j7m4K42j07J5j00O2l1L1Oj93J59O4
$$ plain form
3793 -46 -36 62 -219 -138 90 26 -147 -25 35 223 110 -59 105 -9 -63 21 -22 87 -91 -120 35 -138 -41 -159
3817 -159 -141 65 -158 46 305 -33 57 -89 -229 15 -33 4 119 161 264 328 73 39 124 293 166 -283 -10
3840 -10 -54 -419 20 148 96 330 -105 111 -107 -140 -113 64 -47 70 -96 -4 49 64 -11 -4 27 -101 160 14
3864 14 49 139 77 -25 55 -178 148 -38 106 319 69 -61 -228 -131 -241 123 -4 -161 55 -26 -64 116 -74
3887 -74 -29 82 188 60 57 -169 -58 -17 56 37 -76 -75 -23 -65 -150 -215 -98 35 264 -36 -90 151 121 -15 -41
3912 -41 239 40 104 78 53 -117 151 40 242 141 80 -106 -125 -37 42 34 182 -102 -167 12 -64 79 -215 -161
3936 -161 -258 140 21 -132 64 40 -33 50 -19 53 174 225 3 -13 97 236 -52 78 -196 186 -64 -58 70
3959 70 -177 61 198 -419 209 131 168 238 -31 110 -97 -114 -158 84 -23 -8 -108 -46 -77 -46 -40 -233 -74 -10
3983a0j05Q4J53M8l20J96j53N2p0L6J0J06l2qm7K17j88kn7J61o5J99k02m7o9P
4009a06K06Pj41n0n6k4K37J40k96J49J00j09m5J06ql3j33J42j98l6K32k52P8J34
4033D4L0j19P8j31J33K41p4k07J67j41J3nk94M11j00J49l39R9P5Q8l04J62k18
4056b42L01j32L8j98R1JM4N4K81k82J02k23O7P0L18j98j08j9j7k0P4J59j79Q9
4080G1j28J47m6kj43pO5R1k51J84M33m64k0QK7o1K01j64J78p8k42Q2j4K24j20
4105b9P3n2R6m3k5j34p4K83K0j87p2J61m1j75J46K72k41J97k91J60q9J26l43O6
4129a96K21R1n3r8K81k80j02K51n1k24K82j04j41K85n2jp9j76J48kk27J57j16
4152a86K44J62m15P9J37q1l2o7K72O0l87J59M4L5o7lj82J68J18r2k07K99j81J04
$$ plain form
3983 -10 -115 -31 122 170 -150 46 -107 -55 -125 -89 -79 27 -5 -13 -60 157 -31 -33 -90 71 6 205 3 -44 -113 -106
4009 -106 100 107 -34 -84 -140 -164 73 213 -83 66 166 57 12 118 110 77 -56 86 -112 -148 84 -168 -90 44
4033 44 74 -45 33 -98 35 276 202 -5 162 21 34 29 -265 146 46 195 -144 -45 30 118 -186 -24 -242
4056 -242 59 -73 -35 -233 -142 -141 -97 -43 238 -44 58 -165 -98 -28 290 92 -16 -35 -52 -72 2 161 -18 71
4080 71 -57 90 44 42 -101 -108 -43 48 -203 -19 414 -50 -70 -62 -35 -96 105 -59 119 41 -201 -119 -133 91 -29
4105 -29 44 -8 88 45 20 -114 -188 95 115 -72 -144 17 -24 -199 -53 219 -22 175 -116 44 -45 81 -262 -196
4129 -196 25 116 63 -35 246 -34 -136 115 64 -160 122 18 -123 162 110 109 30 -146 2 0 -227 -70 -186
4152 -186 58 220 -195 -116 21 -60 -92 -159 113 173 -214 -55 -11 24 -43 -46 -228 -60 58 -34 -241 58 -123 -19
4176a9j11K19M8j17m1k7r8J85R8k03N7m0l4j26K82j91jJ64j32P9P0J68k14k04
4200a88K90j35rJ05q7J01l0k2j83O6K44k16n9J51k1M04l38J3q3j67J26J57j53
4223c4J70k75r6J62j22K83j12l31K64jJ96k14J55r7L47k35J65j47k09O9K72j45
4245F5j69K03j50N6P5l06J92K8j44J17k16J97o5K46l61J92M9q3J48j28J83j39
4267a0j21j70K91o7L2K00j78k08M03j46j98K51R7k13N0K23l09K12m7j27n2N8j4
4290d3m0N6m7M74l6l18J66j73j63L08l69N4K30p1l1j06K3N1N1Ql84K51K35N0L4
4315B10k50j51M30j87n2q8j41j8J94L4J11j48L7n8J10j94L46j30l4K8k66L41j50
4338b6j00ok02L10KJ24j69J30l43L19N7j96O6K9N6J2J04k41j15K42m1J17m1j17
$$ plain form
4176 -19 -130 89 137 20 -21 -48 -146 39 137 -66 -9 -49 -83 -209 73 -118 -119 45 -87 -8 62 230 16 -188
4200 -188 102 -33 -42 63 -24 77 47 25 -158 -92 152 -64 -123 28 7 411 73 86 3 -164 -38 119 -34
4223 -34 136 -139 -235 -73 -195 88 -24 -355 -91 -92 104 -110 45 -52 295 60 225 78 -131 -62 210 65
4245 65 -104 99 -51 5 80 -226 -34 -6 -150 -33 -249 -52 -117 129 -232 -40 9 -74 74 -54 129 -10
4267 -10 -131 -301 -10 -77 -45 155 -23 -231 172 26 -172 79 176 -37 13 236 -73 139 92 -35 -87 -29 -43
4290 -43 -83 -27 -74 400 364 46 212 39 -124 184 -185 -131 99 28 -3 -109 -86 -35 16 24 -360 -109 126 176 210
4315 210 -40 -191 239 52 0 -88 -229 -247 -53 -19 92 -56 -19 -77 33 -161 185 55 21 49 -217 124 -26
4338 -26 -126 -132 -334 -24 -22 102 -67 63 -280 39 96 -100 -34 -5 51 63 167 -74 -189 53 12 129 88 -29
4362b9k09J67m1N9J53j32p1K49j14l7j19l2J6K42o3j82K39k02J6L23n03K04L75
4385C09k23J0n2r4qk29L82l8l46M93l45J78p8K62o08L49J5j51N2J21K48k94K22
4408A75k81n6J08Op0J61q9J64R6l30J70Q7j55K2o4QK08k44K33p5m5JL66n28lL06
4434A71k21M8K28k65r7J24O1l1K23l41M0J26j34J38j61R4o0J72j09r2J30R7k30
4457h9j30L14j82P0J54p7m7R8r8pj26K19o5J37j55J46J9j66K05o5J01j22k80K04
4481E8j12M4J07j41q6K87j11j1q5M1L4n8n4K17n8j99J12J32j06K40q0k11L0J12
4505A02J5p7q7K9M4j59P6J87l91J65q9L44k44N5J21Q2r2k3o4j60J94j5k5p5L0
4530e7q8rL03j60J16n9On9K8q5J46J79k28j11k8K09k00L7M0P2j67J65J59m05J3
$$ plain form
4362 -29 -238 -71 -112 -53 100 -32 -103 146 32 -5 -124 -156 -140 102 39 -143 96 -106 -90 233 -270 -66 309
4385 309 86 96 44 -50 -58 -287 95 57 -289 204 -141 37 -41 221 -387 -38 -23 -174 -122 -1 247 -47 175
4408 175 -106 -162 -54 -48 -118 43 -46 118 214 -116 54 141 -14 8 -56 -48 160 -84 149 74 29 30 396 -132 -135 171
4434 171 -50 -2 226 -39 -136 -12 49 18 241 -100 -60 66 -68 70 -91 3 -57 115 6 -86 44 141 -89
4457 -89 -219 95 -87 -17 137 60 13 111 13 6 -120 99 34 171 16 162 181 15 220 155 256 134 -146 58
4481 58 -54 -10 97 -44 -130 157 46 35 -50 -9 25 -33 -87 130 72 -127 -15 117 11 251 171 -40 -10 102
4505 102 117 40 -47 -18 26 -133 -57 130 -261 -96 -185 159 -85 -30 91 173 81 58 -6 -166 28 13 -12 -87 -57
4530 -57 -145 -154 149 -11 105 46 52 -7 21 -64 82 261 33 -78 -106 103 -97 -60 -20 52 -115 50 209 -196 -183
4555a83L13l7j65N9j04K09l7q3pNJ89k28j20J49O3K26m32L5K99m46K74M4J49j12
4579F0k4j8J30k45J68J6k43J06K2j67L8K10J10j46P3k34O9K7P8q2j14o8K1K01
4603a2QJ71R3j24j08O0p5q4q8K62k7j6j64P7P2J10K5j35J78k57Q1nL5j23L6L2
4629B2Q8k60j7L71j53j2j07PJ55j15n5J69j64M9N4O8q0l12L84j32J10j3j04Oo3
4654a04K46KJ23l69j6Q1p4J78j5k42J27k3J21j07L59j09q9k25Q8k0n1J64j41j14
4678b10L58n2l48M00j45l7K4K0O4k8k53L4oJ3K5K47j87k09K40kJ44J07o2l5j43
4703d1J42l15K76j14j43K46j20l4R2L5j25J39K81m14l5L58l31j16L77p8n6j78
4725a54K92l47K27j02j88K98K34k78Q4L04k50r4K8j19L0j6j86M15k91O5K40j70
$$ plain form
4555 -183 130 93 -72 -13 -117 92 55 -28 -35 -30 159 -69 -189 -40 23 249 -183 -148 151 -295 -21 23 172 60
4579 60 36 18 148 -97 71 87 -156 -50 -28 -195 -157 53 163 17 90 -144 -75 -48 30 -52 -166 -234 -213 -12
4603 -12 -4 167 260 136 28 88 13 -71 -159 103 76 60 -104 -27 45 155 180 45 223 -34 47 42 77 -46 -10 22
4629 22 110 -150 -167 204 51 39 -68 -61 94 -21 -76 93 -71 -22 32 100 20 -292 92 -40 70 57 -47 -41 -104
4654 -104 142 144 267 -102 -118 -37 -111 67 52 -190 -63 -86 35 -72 287 178 89 -136 -48 -68 -119 45 -96 -210
4678 -210 148 96 -252 148 3 -34 -10 10 74 46 -207 -173 -179 -166 -141 106 -81 -290 -50 -52 92 199 137 102 -41
4703 -41 101 -214 62 -52 -195 51 -69 -103 -11 24 -101 38 319 -95 -130 228 -103 -219 158 80 24 -154
4725 -154 138 -209 18 -84 -272 26 260 -18 66 370 120 26 54 -65 -35 -51 -237 178 -113 -48 192 22
4747B2L05k75J01j50k0n3J49p5J49p3K6Q5j70J07j12M6J47l34j20%L46o9LJ43
4771A78j43j62J95k80Q2K52o0r9n2K36k97L71m13K21k9j05J42m9J3k54O7K22l5
4794AL52k28k59J33Q1o5K1j77K91kl24J72L4M7k16J45L9Q3k92O3L30l39q6K30
4818C4j67k9J22j74Q2K50j75J9J55r0q8L7m2ppJ60j47q8m9L86J08l17M8Pj32K71
4844A67j22j04N2O4j46J38j43PR0r2R8M6n8j3K34n1k16R2J41j17j45K11k69Q8
4868d8J3k82M16O4k54L3j76L56l35K40o3q0LR8jj72K72j66K71n14K66oK47r8j37
4893e3K46J1j22j79qL05k9j91p0K9j18J21J05ML9l4O8k50J58o8J85k78J63k9M6
4918E1p8l47L19L4J69k53L03k25J53j30k93L67j37q1N6L8O7Qr2L9l97M86M5o3
$$ plain form
4747 22 327 52 153 3 -17 -70 79 4 153 80 106 191 21 128 16 62 209 -125 -245 -245 101 32 35 178
4771 178 35 -127 68 -212 -130 122 62 -37 -89 147 -150 221 -192 29 0 -105 37 -12 1 -253 -186 36 1
4794 1 353 125 -134 -1 80 15 36 -141 150 148 -176 -4 30 77 -139 6 45 128 -164 -101 229 -110 -196 34
4818 34 -133 -162 -40 -214 -132 118 -57 -38 117 27 -61 -24 -66 -73 -80 80 -67 -155 -204 182 290 -27 21 28 -104 167
4844 167 45 -59 -7 57 -89 49 -94 -87 3 -89 9 55 -3 -16 218 167 -49 43 184 67 -78 133 -136 -48
4868 -48 -35 -317 99 163 -91 -58 -234 122 -213 27 -36 -116 -113 -15 -16 -188 84 -82 189 -325 -59 -65 182 84 -53
4893 -53 193 204 82 -97 -105 200 171 -20 -90 -61 -179 -58 47 51 90 56 124 -126 32 -36 149 -129 34 5 51
4918 51 -27 -374 -55 -21 148 -105 198 -27 126 -4 -297 70 -67 -148 -92 -54 13 21 -71 -32 -429 57 102 39
4942C9N2q8q7L02j24j43k43K43K1r1J99J04j26M4j03R2M9K1o8k41P1j40K62K03
4966B48m72K67J53k20J7k14J98k8o9K33k50J6J57J19j15k9j39K34k11N2P4j30
4988a09O0L00j50j69K88j23j28J72J11k30j22J08K69l69k8O6J53l7n3L0O5j65
5010f1K03j34j05J52n2k6J44k54K49k12J28LJ40j75p5K05j00r3O6%q6M0K37j61
5034C3R4k57J12j7J0L4k77L11P4k35j49M42k00j49L43j89Jn6L2K1n0m0J17q7j73
5059b55L6L49j12o9r5J74n0J00j57J26J50q6r6J72k31J26J75l94K27rJ84j31j60
5082b6P4k30K50m3k99K71m6J86m5l76N14j15k85M6J98j6J2j5j0m7K0l4J30j9j19
5107b4L2M4j47R7P9l6k13J73j0l7M9p5m2o6K62r9m6J69k07k3L25k67N0J08N2o7
$$ plain form
4942 39 91 3 -84 218 94 -49 -292 -49 -28 -119 80 184 58 102 -1 91 140 161 93 -148 -77 -217 45 248
4966 248 -224 43 196 -24 -7 -221 -23 -51 -120 113 -137 -121 36 155 40 11 -128 106 -105 -53 21 -109
4988 -109 -49 251 101 -68 220 97 -31 141 252 22 -100 8 277 -92 -120 -54 99 62 9 39 104 -61
5010 -61 142 8 -97 55 3 -23 121 -133 116 -96 32 35 175 0 -75 130 30 -63 3 3 -83 -43 194 33
5034 33 127 -130 -18 -35 -25 9 -268 43 117 -118 -267 175 -25 -174 169 -20 -19 -75 -43 -22 -72 -112 5 -82 -255
5059 -255 -219 130 18 -51 -146 28 -22 78 -79 47 197 111 15 187 -44 82 257 -137 90 81 265 134 -26
5082 -26 48 -182 68 25 -274 -3 -49 137 92 -284 230 115 -170 -124 74 58 70 55 45 -2 18 -16 114 95 -24
5107 -24 8 52 -95 2 81 45 -168 5 -5 -42 7 -68 -110 -176 86 -13 -59 110 -97 -120 205 -62 -12 96 148 81
5133H1r5r8K52J38m76O9K10j5k25P0R2j52J34J49Q0l17J56N2j53J91j80K5J55
5156A43j17p1RP2J34m7L5o3L6j98J12M9l4j68J05J37j50k7M8M1j91J42j63L79
5180B13j30J5k00K01j70R9j52J66J06j45J43j54j93J80J17j31J33j96J92MJ03
5201B01j97N5J27m02J41mK01Lj87m6K05K7l1R7k51j5j44J77j80O8J63l9J9M4k3
5226IJ54k66J45K4j73P6j87J25N5k5P4J77k23L9m7J84j08J05l11J13P3q7r1J55
5250a0l0J7K81l20j16K03J94j79J30j23O1j08J27k04J14K33j12k76J25m2j14N2
5272i7O9lJ24J20l31K38k65L53k05J01j8k5J09k53L97k28P7j32j57J83k3J18k11
5295e9J11j58J12M1J93l35J01J46j83j26K65k28K50o8K4J41l46J37n1QK34j07
$$ plain form
5133 81 -14 -112 140 278 -198 -129 81 66 -159 -89 3 -149 -15 134 214 -103 53 105 -48 143 -37 -12 143
5156 143 26 -45 -36 36 170 123 158 95 131 -67 45 94 60 -108 -3 134 -16 -43 5 46 -145 -3 -166 213
5180 213 83 98 -102 99 -71 28 -124 42 148 3 146 -8 -201 -21 96 -35 98 -98 94 98 201
5201 201 4 59 186 -216 -75 -79 122 125 -62 -108 97 124 93 190 -61 -76 -220 -43 -223 -155 8 -31 -12 32 9
5226 9 163 -103 42 66 -107 -31 -218 -93 -38 -63 11 188 -35 4 -43 141 33 138 -173 -60 13 -74 -165 -10
5250 -10 -40 -23 258 -62 -178 25 219 40 170 47 108 0 127 -77 37 270 158 -118 7 -35 -149 -97
5272 -97 -28 -31 93 213 -118 120 -145 208 3 104 86 61 170 -83 314 86 163 31 -126 57 34 152 -59
5295 -59 52 -106 6 47 240 -95 6 152 -31 -157 108 -120 130 62 86 227 -119 18 -33 -25 209 102
5317A02J30k68Q9j95N5n4j09M46n0q5q1L4J4j46M3K58k89K03j71M6J01L0j92L3
5341e6J29p5k12J25L35k26j8J2J76k82o0PP0l5K51r8o9j30K61p7k2k0n5P1k11
5366b09J05M3J2K98j55l51M50k40J11J40j4l18J14n9K48l00n5j00L03p1J20K3
5388I5m7j56K76l17J6L92j69j71Q4N9J96l07p9P8q3K11PMj18m2P6kr5J6J35P3
5414A32k78J1J05j12J7j70L13M4K7k51K52j64j25L02q4J60P3k85J71l87L47n1
5436D7J42l01K16Lj34p4n6J50k9J75j74Q5l9J86k2l00J7k8J30Q8j45L5j2L8n6
5461e8J70r4K6Q4j49j5K3pK49k68K3j19K35j84L07k66L0N9K1J8k17R8j7j27N25
5486C47l13l03k6L65J80k02k61K23J69q6j27j63K08J7j07k2O4K45k08l32K74J88
$$ plain form
5317 102 232 -36 53 -142 -87 -141 -250 196 146 61 -20 14 28 -118 -75 183 -106 97 -74 -28 73 103 -89 -56
5341 -56 73 -2 -214 -89 246 20 2 14 190 -92 -152 -145 -75 -110 141 43 -26 -156 105 28 6 -14 -69 2 -209
5366 -209 -104 -61 -49 249 94 -257 193 -47 64 204 190 -128 -14 -73 175 -125 -180 -280 23 -48 72 95
5388 95 48 -108 168 -149 -133 259 90 -81 3 62 258 -49 -128 -50 -133 78 85 89 -29 -71 5 3 -92 -76 59 132
5414 132 -146 -135 -30 -142 -125 -295 18 62 89 -162 90 -74 -199 103 19 179 252 -33 138 -249 98 47
5436 47 189 -112 104 107 -27 -101 -157 -7 -36 139 -35 50 11 197 175 -125 -108 -136 -6 82 -63 -28 -40 -2 -58
5461 -58 112 18 44 128 -21 -36 -13 -20 229 -39 -16 -135 100 -84 223 -43 -13 46 67 85 -132 -34 -51 -178 347
5486 347 34 -269 -295 70 250 48 -213 10 179 93 -34 -197 11 28 -79 -101 -37 208 0 -332 -58 130
5508A30j06L10k95J05j46O1j83J11q4K9j15J37k2j4K51l44J95q7L57m53K10J05
5530A52M2k53J2K32q8j37Oj00J27k07n8M95j93r4J35o0n8j03k5K43q2j25P5o8
5554a32p4L89j60o6p2K21j39q7N2j24M8K32J86k81k78K45q0J23k3J41p5k83L96
5577A59j24j77q6J99q4q6Q6J38O5J3l3nQ3o4j4j46q9K92r5j5J43j66j08L5p7O
5603a50K85m5j24K2N8j06O6n0O1l31N14k86J9J92l03J92j83K55j59J12O1j88J14
5626B6J0J39r4o6j13J98j66K5j6J53J1r9L26m68Q0K81l1k07j52J18j31J21l0K18
5650A33j47L0J7q8M4J08k37K27r1J06l83J25Q7%L05l36L0J12n8J71N3l66M9m1
5674a50K56o2K62j1k00j10l5P3j28J36J51j04l89K51J44rk28M30l06p8J04L0n7
$$ plain form
5508 130 24 334 39 144 -2 59 -124 -13 -97 -68 -183 -46 -68 -82 169 -175 20 -67 290 -163 47 152
5530 152 194 -59 -47 185 97 -40 -34 -134 -7 -214 -272 223 30 -64 71 11 -47 -150 -175 68 -14 -139 -64 -132
5554 -132 -206 183 23 -43 -115 106 -33 -120 -68 -192 -144 88 274 -7 -285 -40 -120 3 -20 121 46 -237 159
5577 159 35 -142 -228 -29 -113 -199 -113 25 90 103 70 65 148 84 70 -76 -165 127 32 17 160 -6 -114 -79 -156 -150
5603 -150 135 90 -34 -12 46 -60 6 -44 17 -314 200 -86 -67 125 -178 14 -169 86 -73 39 100 -88 26
5626 26 36 175 81 15 -98 100 -66 -41 -57 96 107 8 334 -134 -54 227 196 -11 -163 -45 -176 -55 -85 133
5650 133 -14 16 33 -55 -11 97 -140 87 -4 102 -281 -156 -69 -69 236 -100 -70 42 -16 155 208 -158 -109 -150
5674 -150 106 44 306 295 95 -15 -50 23 -105 31 182 78 -311 -60 84 75 -153 277 -29 -107 -3 27 -30
5697c0K3j5J56j76k7Q5k53J47J39l7q5J3m9J60J1P6l34K42RO5m22N45k40j2Q5
5722G6P9m4q6J68j98J10jr0J47k90J60J70l27K03l08pK28J5J40r1k28P7n5N0J33
5747C1N4m3J29k22J2l12L08O9k04L14k82K01Q6j3r1k6N9J60l75J92j5l1m0j35
5771a74K02K08j41j89J18Poo3J56j93K96K2l39K30k95K2K49o6k54k5K44n1K44
5794B02r8j1j87J82j77J66K8j41J11k40K86L2k22q9P2K39m08J57o8J74J10L8j22
5817C4J92k88j4K53j14K9k01J03m4J01J76l14K49j81N2K7L5n5j94K08j50q7K37
5840E4q9J9J7J05j87J81j29J54Ql54K39k03K31j95r2L69j13j99J03J27k8k63K01
5863d4j09K86K0k99L8J85p1j29K43j31J41j02j26k6K58j28R7j87L6j99K0M19N0
$$ plain form
5697 -30 -7 -22 134 -42 -69 16 -237 -90 49 12 -73 -60 -109 51 62 138 -196 46 55 120 -302 243 3 -9 76
5722 76 155 111 25 193 -5 105 104 14 161 -129 31 201 -126 77 -231 -238 -10 5 145 54 -174 -97 -152 -102 31
5747 31 85 42 171 -51 -39 -351 -43 26 -178 136 -146 55 141 128 37 11 70 230 -145 47 32 1 -39 -174
5771 -174 28 236 95 -94 24 31 25 -38 118 -75 221 243 -96 134 -161 -139 110 44 -210 -235 9 -42 202
5794 202 104 93 -94 88 -89 77 105 -36 75 -165 121 153 -69 -158 -86 153 -255 -98 -166 8 118 156 34
5817 34 226 -62 -76 177 63 92 -109 -6 -50 51 227 -87 162 -19 33 60 95 40 -154 54 -96 -183 54
5840 54 -35 -16 1 106 -81 100 -29 125 133 -221 18 -185 46 -149 -241 128 15 -184 -81 46 18 -245 -44
5863 -44 -153 133 153 -146 -108 77 6 -123 120 -11 130 28 -98 -124 134 6 103 -84 -48 -247 -227 192 242
5886B42j57J2k62L06nJ5j46j88J69J5j01R8K35p9j65J44o9j18J57k07P3J29l98
5909c00M53k9q3j13J48o6l1K21j80K65l69j11M08k83l8j7o8L31k61K07k0j31J5
5932e2J20J34n2j83J01j48m9L12j03j26k7p0j1j9J68k4J57k64R8J18j37j41K73
5955G5l16K52J9m7J85l33J83l9Q5o2J52k05J41Q2K11n6m52N4OJJ43k16J27K8R
5980B7j09K66k51j1j00M31l28J01j7k65J90K99k87J05l59K70m6J21j95K94j40
6001dn2K46k16J87k22J90k88L9K02R4k18j62K31M1ml76N07k49J66j4R5j01N4k13
6025f7K53n6m2O0k31N9m6n3L4J87mj88K92k56k41M26k1j64M3r8l3n6M65l52P7
6050a2j26N1J7K8J2QQ2j30M4J3Q4r0K24k08R4k78L20J7k80Q6J90q1k26R6K90q4
$$ plain form
5886 242 85 97 -165 141 136 151 5 -183 -14 1 -100 -2 233 154 -11 133 64 -54 103 -104 -31 98 -300
5909 -300 153 124 41 -72 76 10 -21 200 20 285 -84 -195 213 -70 -108 -125 -193 138 -123 84 64 -67 -52
5932 -52 68 202 150 -33 68 -80 -129 183 80 -46 -73 -143 -154 -173 -5 -29 128 -136 -38 80 -57 -198 75
5955 75 -241 11 30 -17 168 -165 18 -21 64 2 154 -51 90 172 383 327 -125 -71 -65 -64 79 -137 -10 18 27
5980 27 -82 184 -67 -78 -178 253 -75 26 9 -256 -66 233 -54 51 -308 -38 -84 37 -158 136 -4
6001 -4 -56 190 -26 161 -61 129 -159 -120 82 176 -42 -204 27 68 64 -312 195 -54 112 98 193 92 146 -67
6025 -67 186 130 88 148 -83 -24 -70 -123 -89 98 94 -94 198 -58 -299 127 106 -58 -15 -113 -146 -202 263 -89 -12
6050 -12 -138 -87 -70 -42 -30 -22 60 -70 -26 -13 71 -19 205 -3 91 -187 133 150 -130 -44 146 65 -161 -65 225 141
6076A41l87N75m67K54j11j75K39j63N1J56Qk95J3oQ7K96j84O5j12q7J49l52M16
6099A11o7J14l05J15lJ75j30J30j96L5R0k09L15o8j79R2R2mj33r8J43Q3k21J38
6123B0m8l7J65M1l42O9J90K47m31J16K48j99J75j41j0k57K09j71n6K68q5k34K30
6146c3J15l87K36j18K93j01rK1L0J40k83J49j32j01L24k05J38p7P2O4n3j57k2
6169i6K41j89j26J50o8K05k14K74k07m1Q2k86K33Oj24R3J25j16K52k93M1L76n42
6192b24J67M2k30M00j60o0K64k11p5JK75k50j26J20J17n2K04j91n5P9kk66K81
6215D8o2p2N7l5J78j07N1k45L06j08K0r0J06J04K4j49q6j41Q5J09J49r4R4k28
6239h6R0m4J28n5P6K03k59Ll7j52K08Pj14j08J49j88M45n42K46o6M3k0q7J91J8
$$ plain form
6076 141 -246 329 -138 116 5 -170 69 -94 -43 113 121 -174 -161 -167 -80 216 32 97 -15 -102 47 -305 111
6099 111 44 158 -147 -32 -35 140 10 140 -56 -21 69 -140 175 107 -72 20 112 108 -25 -123 20 103 -118 20
6123 20 -28 -65 100 141 -201 -132 58 305 -126 -10 238 39 214 73 63 -194 15 -156 -212 56 -29 -263 -33
6146 -33 82 -305 -69 -187 106 5 -4 17 47 187 -96 53 -79 -180 144 -61 77 0 72 136 83 -74 -96
6169 -96 145 -44 -170 -20 -88 117 -97 177 -30 -71 11 -275 -42 -36 -160 -67 58 -58 194 -99 -58 318 -224
6192 -224 -57 -15 -245 155 -5 -65 199 -12 -87 -86 189 -61 -187 -67 50 -2 202 11 -44 35 33 -233 48
6215 48 -14 -86 -29 -64 114 7 58 -187 119 11 31 -59 47 151 175 26 -60 -201 -116 -7 142 48 142 -86
6239 -86 4 -40 88 33 109 312 53 56 19 -133 75 82 -32 -140 9 -179 266 -276 -30 -96 -53 -73 -160 31 49
6264D9L35m95K71j70K5m2Q7l03J29M6l2J75j06q2L08l01Q7J19k85q3J65j06Q6
6287a23K34Or5j9l9K70j54lj36k57K38J00M2k8m2P9o6k29L13j32p8Q0j26L24j41
6312A8q5k4O8J71j65Q9k62L19j14L4r5K34k93Q0j08Q0K82l00L5q8O5L85k79N7
6336A04M8l88K68k2n9pM28l52K5L8l0N1M2k15j65Q7J23L5R7j91P2R4J78m85J16
6361a08J56J43nk89K64j46J36O3k31j02j11K06J96j21m5J1O7l09Q2M06l91j15
6383b43M3K92p3N1j66J57j44Q4K6j64K63j08o1J6k1j20K89O9k60l4O8M0n7n8J21
6408A0j95J07J36J30r5k24P0k3j35J93m0L09j8l64J57Q7p9j1M6j20K18j00k90
6431b31Q7J42R4j14k8Q7J01j94j74OL00j83L17k16K3m3J5Q7R1l65M8L95j07l29
$$ plain form
6264 49 384 -111 160 -10 15 -27 60 -243 -114 -68 -100 75 -31 -113 195 -106 -19 100 -185 -268 -103 -209 -123
6287 -123 111 117 22 3 -36 234 80 77 -59 -316 -78 22 64 36 -6 73 7 -222 91 -41 -119 -39 -165 159 18
6312 18 -67 -91 -23 148 -17 72 -190 129 15 49 -46 188 -105 -25 -133 -53 229 -71 -36 -124 -59 326 47 104
6336 104 152 -236 32 10 -49 -56 372 20 45 83 53 104 146 -69 -234 -147 -24 11 108 -83 -11 83 261 -224 -108
6361 -108 48 191 186 -103 161 15 151 214 -17 -119 -230 -24 172 51 6 17 84 -225 -143 263 -128 -243
6383 -243 -200 92 19 70 -96 61 -83 1 27 -137 126 18 -43 -27 -48 -168 121 190 -70 -104 -36 4 -53 -111 10
6408 10 -185 -78 58 188 93 -131 -61 -84 -219 -26 -66 243 225 -139 18 105 26 15 61 -59 159 59 -231
6431 -231 -144 -2 92 -22 -50 37 138 -56 -230 -224 76 -107 210 -6 17 -26 -11 76 167 -198 -150 245 138 -191
6455a91QK51j48NP9O4K3Q4k09J6n6K28J52l64n6K02j67J15m3o4J93No3k03R3R1
6481D5O6j77K27j06k5M4J95l51K22l68J86l9L74j88j99J35k0k77J85J22j46R1
6503dJ4j94J12P2J28k97J10OJ04r0J34p8J9J77k30o6K41j92J83l17J31KJ46r7
6527A4q6Q7%M0n1n1J10P9k89J49j01L26j73M2q1K80k67n1j12J45n1k30L08k81
6551b44J9N7K68j02m2J16j96K91k68L18k07o6J15j73k7J52n7j01N5J06L9J92l60
6574a15N1j04K25Q2k99J22J05j1j23J89j39J43l06L43k48Q6k3J45j0p0ok57K73
6597E3j34j79P7L22j8j19o4J14o4l8q5o6J18n4P0m5o0M32j57l10L35p4m3j64J61
6622Hj11R3O9L5k08j8o2J99Nk4QJ50m1K5l2o4R1l46J58o7J5J55K34j30j92R5j73
$$ plain form
6455 -191 -183 68 -80 -75 4 68 91 175 -34 -18 -74 154 306 -58 -114 88 -79 36 -7 -71 122 127 64 -139 -46 45
6481 45 111 -66 161 55 30 74 269 -82 140 -228 -42 -81 293 105 -94 41 21 -256 -71 51 -95 -4
6503 -4 10 -184 -72 0 128 -169 -59 -53 51 -39 95 17 36 213 -17 -83 158 -34 149 -168 -37 -35 111 14
6527 14 -72 15 15 55 4 -47 63 142 -147 2 -99 227 54 96 15 295 28 -23 -135 10 -41 -271 37 -244
6551 -244 -225 -168 100 -2 -44 72 -124 167 -101 217 10 -56 59 -114 -141 11 -46 -147 -92 14 53 245 -115
6574 -115 -64 -168 57 139 -160 -38 67 56 -67 122 -17 126 -180 163 -85 1 -22 123 113 43 37 -220 53
6597 53 -81 -260 -183 139 121 2 -62 52 -12 -50 -135 -201 -83 -137 -67 -112 -172 260 103 -207 128 54 11 -153 8
6622 8 -103 -10 59 94 -114 -132 -194 5 10 -14 -6 144 103 128 96 32 123 -223 -65 -132 -117 38 272 142 -50 45 -128
6649a28m0K96k02l0J64q0J77l37lJ46mj46K08K6j04lJ14N6p8K4N9j76r7p4K63
6674C1j56L9K86j09k30K41j48j67J43Q4M1j29j00J38J34k63O6j4J69k1p1j4Q7
6697C7N1l5r4q5Q4R0K4p5K1J51l40K8L03k79M09m88L12j37j5N9j63K17j4J6L8
6722A15K40l79K86k70j6J33k5o1j00J10o1J19Q2k07q4jL78l87K5O6q3n7K08j1
6746B0j04J26M7P6k58N2K06j64j19L7K8J68l8k17Q6M8l7J07r4P0J35k61J5K11
6770A40j86q5J62rq7n4m0j72J28L08Oj18j34R1P3Rj23J20J45k57Q9moj67j1J97
6796A5K30l29J32r0o4K4K95k72J26j54k46L11J81k64J86k36q0L65k34n7L32k04
6818c3J4K62k78J35ql82J66K0J68r3J7p0L2l13L21J28k0R7k50j0J41J90k62K7
$$ plain form
6649 -128 -168 128 -74 -104 60 -20 157 -180 -183 -37 -41 -187 21 47 -57 -60 54 110 32 56 115 -61 -158 -232 31
6674 31 -125 -86 200 91 -139 102 -46 -213 -70 14 55 -74 -174 -36 98 -165 -99 -113 56 35 -36 -50 37
6697 37 88 53 -41 -126 -42 48 72 -3 18 169 -171 -143 160 -119 290 -198 114 -23 -38 21 -142 75 61 77 115
6722 115 355 -24 262 -8 -24 109 84 23 -77 33 -28 91 173 -34 -118 -119 259 -128 -103 -37 -120 -177 31 20
6746 20 -84 42 89 165 -93 -41 165 1 -118 -81 -53 115 77 -140 -54 -6 -43 64 -30 40 175 -86 -71 140
6770 140 -46 -131 31 22 -65 -119 -159 -331 -203 105 111 -7 -141 -50 23 32 -91 29 174 -83 6 2 -4 -171 -182 15
6796 15 245 -84 48 -42 -106 -82 213 -59 67 -87 -333 -22 159 -105 81 -155 -235 130 -104 -161 171 -33
6818 -33 -19 243 -35 100 92 -290 -124 -104 64 -29 -12 -82 -50 -363 -42 86 66 163 -87 -97 44 234 -28 -1
6842aQ8k52L18j41JJ18j51K24l62L35j96k8kJ47j19o3J41j25j17J80K8m0J56j05
6866C4J46j93j3l2J7J45k79J91K6j98K83K3k92J51k47L52j51q9k00K70J49Pl47
6889b47J18J0Q0o3m1K28n6Q0o4m27M94j79P4L23m22MO5J27j37P2k03J14j24K95
6913A21r5J24j42k57K16J30J57m91K43M7j01r3J8N4J93j45p9J21lJ65l27J34J42
6936A32J14k55J03n5j02J05k10R4j5o1J24J19j88K43Rl18q3J83L68m01K39k61
6958a16L34j07l0j05j42J73j20R7q9K52L1k08N8j57K62l15nN0J49q6J41j61J20
6981B6J85j48l5n0j66J12K80j15K2j10k48nK9K85k2q4J27pl07O7K7L5O6R4M3N8
7007A59M9j38L5j9j05oJ25%l58MM41p1K7k29J62o0J46j22J04j44r9J92q0j83J60
$$ plain form
6842 -1 87 -165 153 12 13 131 -20 204 -158 177 -19 -47 -49 98 -21 -84 57 -68 -185 -5 23 -17 139 34
6866 34 180 -13 -26 -58 -41 104 -175 16 42 -156 127 150 -142 9 -238 114 -37 -126 -326 -56 93 100 -247
6889 -247 -129 -119 -39 -102 -143 85 29 109 45 -382 112 -67 7 330 -92 -88 -23 104 -33 39 -164 -50 -174 121
6913 121 26 150 8 -249 -33 97 254 -237 6 53 -48 -141 -123 -69 124 -21 -100 21 18 183 -144 -10 132
6936 132 246 -9 94 39 -63 42 -168 -74 -89 -150 -26 93 -95 148 157 -161 -244 -61 307 -94 145 -116
6958 -116 218 111 81 -24 -166 7 -113 -16 -105 147 178 -30 28 -129 133 -182 -187 -137 12 -74 67 -94 26
6981 26 211 63 28 -22 -188 -76 204 89 111 1 -247 -252 -223 62 40 -44 83 76 -231 -164 -137 -102 -36 58 101 159
7007 159 208 70 105 86 -19 -25 100 100 -258 -254 187 116 143 -86 76 16 162 40 144 0 -99 93 13 -170 -10
7032a0J64j06m5J22R1r2k57J83j38P4J22k49K66l76J20M2J80p0j77J77n3J36M1
7055A45j50J7j24L6k08N10l16K43k51k42L55K6j65Q6J11k50R2J29j41L1J4p7O1
7078f8J65O9m70K42p6K52m0p9O0j3j28p4K26q0l9K88j54j07M5O0m8p1l4J39o2
7103Cj78M59m07J45O4k1J48m66K71J30k90K75l94J41K21j84j1j87J84O5k7P9j65
7126a45J44j92R9R6j0p0R6j28P2Q6l83M09M5p8l02K54p7m2PJ25l6k11L78p5k9
7151C3Q4k62J19J4m2k6Q7j06M44l04j3l18L32j62LL09j96j47j34m9N39k52l43
7174c90L50N8j10J7L8M1M0l3j54J33P9j5O7Oj97J17r2J39j86J82k8J06j93o5K1
7199f9J8J14q7R6k00Q8j14K12n17L66J92j04j58Q9O4j41J66O1Jj18J36k08N7p3
$$ plain form
7032 -10 154 48 3 125 216 124 -133 50 -88 -14 108 -141 125 -251 -131 -89 91 21 -156 21 -32 104 145
7055 145 -5 12 -112 -76 -284 226 -90 153 -98 -340 15 41 -124 -38 73 -177 -85 44 -97 -66 -52 -129 -68
7078 -68 97 166 -304 -62 -138 114 74 -5 55 42 -86 -160 66 -14 -53 235 81 -26 19 79 31 -40 -74 65 3
7103 3 -175 284 -123 22 86 65 213 -253 18 148 -142 133 -261 -120 101 -83 -94 -281 -97 -32 -59 20 -145
7126 -145 -1 -193 -94 2 -8 -78 18 -110 -38 48 -335 74 119 41 -261 -7 -84 -126 -119 6 -30 -241 137 62 33
7151 33 117 -145 -26 -12 -54 -80 7 -99 345 41 28 -290 42 -120 -117 192 -4 -151 -285 -334 205 -47 -390
7174 -390 -40 18 -92 -75 -37 4 44 11 -143 -10 69 54 121 127 -70 47 -45 94 -92 90 62 168 -25 -90 -69
7199 -69 -51 63 -24 72 -128 -40 -154 58 -459 -93 99 -5 -163 -74 -10 -151 15 76 77 -41 95 -113 -56 -129
7223a29Q9J18j95K30r1j36Q8K15k84k0J9K54l23J18J24l25K02j22Q1o9K15j46
7245h7R4j53K25L5l41J10L99m81K49J05J91l25l4Pr1n1p0L72j84K61m47L02M3
7268A29j03r5K69j86Kk9O7m0j33J76J5n7j09N7K02l00L51p8o7k99K06m7L7Q6j76
7293a22L42l13K70m89L45j56R2N1o4JJ44p8l8j27K28O3l0j58j02K43j35J38n6
7316D9J42j82Lj53K68j51J48k13L9J46Nj70K34k21o1N0qJ43r3o9O7K1k8m4K80
7341B02j57J3r8k23L3K73jM1L1k1j43J56R7j72J45k48K86k57j4M1n3n6l7J14R
7366c9N5r1J03j62r3K19M1K63j25k52P8j21R5O4k40L60l91J95j02J64k1J55q4
7389G1lK8j37oJ68k51j52P7P2J01jK65l12K7J52J11j24p3o4M0J72j11k6m1p1J45
$$ plain form
7223 -129 -40 78 -117 113 22 -114 -26 189 -95 -115 -96 158 -165 -47 77 -248 -46 -168 -87 -156 59 -87
7245 -87 7 -146 79 114 -227 -117 282 -199 50 155 346 21 -13 -6 -97 -148 -218 154 -30 231 -216 86 129
7268 129 26 -69 200 14 16 -13 54 14 -119 57 72 15 -94 -37 165 -135 216 138 71 -228 -22 -69 -32 54 -122
7293 -122 220 -93 177 -312 33 -123 -31 20 -44 -43 101 23 -15 -142 86 149 119 -39 -141 102 -33 105 49
7316 49 191 9 12 -141 127 -24 124 -89 -50 96 101 -69 165 -56 -117 -67 -75 68 -25 -94 -27 -6 -34 -78 202
7341 202 45 58 -40 -263 -230 43 42 83 114 93 -50 106 203 31 176 -72 214 -43 -57 -16 -69 -125 -162 -48 -39
7366 -39 16 -75 28 -134 -227 -8 33 296 171 -81 -3 -124 -29 35 -205 155 -236 -41 -143 21 0 155 71
7389 71 68 96 -41 -47 121 -130 -282 -205 -133 -32 -33 232 -80 -53 99 210 86 13 -51 -11 161 50 24 -17 -88 57
7415E7j42J01L08j32k40O3n0O1k5P8j27l4j22L08K2K0j9J17j49p2J17j31N6k14
7439a49Q8j29J97J61j91P6L6k45J15r1L5O4J40L5j73Q3q3K45j93j4J6j04J60O7
7463A46J3k54J16l23J90J03j8l3R5l56M44r5J22l6L5n9k40m3N54m15p8M20k3k95
7487c0j6LJ75k24J34p1j02m1K14L2k20J44j46K7r6P5M22j78j30J86j47j46K64
7510A29k69k59N28l20K26l65K44K08k07L8J55j01r7K32j75j92L49k27J77p0m0
7531c6o5j4J79Lj44k02M33k04P8R2j77k2J6K44j53j13K24j69J43L9j13j95L52
7554A96j37j24J27J1J72l25K10j50j02K19J0N8j77J53j94J29O5j15L7q8O9P8j74
7577e2Q4J37j98N8M3j02n1kJ75j56MJ06p4NM9J35K5m52O6K22k60M7J90J26m0k71
$$ plain form
7415 57 -85 16 324 192 -48 15 -35 26 1 79 -48 -82 -204 104 126 146 127 244 95 23 140 9 65 -149
7439 -149 -61 -190 7 168 -23 53 89 -156 -41 -132 -97 -33 107 142 -31 52 -31 214 21 7 23 -81 79 146
7463 146 159 -95 21 -302 -112 -9 -27 -60 35 -321 123 28 150 114 149 90 -150 -193 361 -54 -132 288 265 -30
7487 -30 -46 -43 132 -92 42 -29 -131 -172 42 74 -146 -2 -148 -121 -217 -142 280 102 -28 158 11 -135 129
7510 129 -140 -399 129 -191 35 -330 -86 122 -85 -47 108 7 -90 142 -33 -225 124 -103 74 4 -36
7531 -36 -101 -115 64 67 -77 -279 154 -50 28 120 -57 -79 -63 181 28 -85 139 -30 113 152 39 -156 196
7554 196 59 -65 62 73 245 -80 130 -20 -122 97 107 165 -12 141 -53 76 141 26 63 -25 44 122 -52
7577 -52 32 169 -29 29 72 -30 -81 -83 92 -64 -60 46 -28 -23 26 161 186 -266 -200 22 -238 -191 -1 125 85 -186
7603a86K34m6m8K06K2j19j70K43k87J41k70K50P2po1P3J59k91K40k43L5J04j14
7626f3k4K40k55L0J63k30J12p1K31k36K43o6m7J66k68n7J3O2o5K8J91k4j43P0
7650@o5J52j1K4j35kK18l8k34K02l3J47j12l0l4k1N1l74K99k00M56k33m9j07J57
7675B8j10K73k00j03K92j81L84m28l9J57Ol80L00o5k9Q6j39K68M2j82Q9j34K08
7698A43k58LQ7O5J79Ol27J61j08L2m5K4J45k3J7J76j65n4m00K71L38k78J63l14
7722a62J1J24l9K25j2j84K2j97J4Q3K46l24K33j67J67Mj47K92l8l01K4l2J69L8
7746D9K7k01L84m78L64kj18R1L2q7j85o6K45j79L85k33lk14R0M0L7L19l27J85
7770A55j46k62M43m24K75J66q5j91N6Q4k02J23J40l99R9L10j17mo9J6J75j5q7
$$ plain form
7603 -186 48 2 -46 160 182 63 -107 136 -151 -10 -280 -30 42 35 -26 47 206 -85 155 -88 -53 51 -63
7626 -63 -87 153 -102 -72 91 -139 -27 -98 133 -103 140 74 27 193 -75 -132 -119 -57 -122 -94 97 73 -70 0
7650 0 -65 87 76 100 -35 -37 181 143 -91 111 78 225 113 83 49 28 79 -295 4 -196 260 27 -22 -129 28
7675 28 -82 191 -9 -112 180 -1 383 -45 -84 73 79 -301 -1 -66 -95 -9 -148 120 162 -20 69 -65 143
7698 143 -115 -112 -25 40 219 225 -102 59 -49 -17 -62 -38 107 84 101 277 112 58 -342 -71 267 -11 152 -162
7722 -162 -151 -27 -66 159 147 -37 -15 -212 -198 -115 131 -193 40 -127 40 44 -103 189 151 -150 -126 -158 11 49
7746 49 76 -125 259 -219 145 143 25 116 148 61 -124 -190 55 -124 261 28 25 -189 -99 -59 -22 297 -30 155
7770 155 9 -253 190 -234 41 207 122 -69 -13 71 -131 -8 132 -267 -168 142 25 21 -48 -32 143 128 41
7793D1k6q2J71j14k01J02M18j93j40Km4K33l05J38P3j25K11j73p1J30Lr7K7Q0
7817E8q6r6J06L6j98K57l8k39J68M5j57oJ44Pq9O7qPQ4j88J61J64j06r5J30k4
7843A04l3j33J77m3j50J42l10L09m6Q4m8j53LK65l39J17J08Q2L7j57k1j40pR5
7867e7L44K7k86R7j86j9K07o3k55K07J33l29R9J14J6q7J9k43M36l01J50K19j07
7890A35kl11Lq4R8K0K59j05j38K67J63l07Q0K6Q9k24J43p5l6j94J54j95L28K2
7914A16k13j89L02j06J7M7J40J8o7p6M7j91J41l1j30J21RkL5mK75k32n7m9J15
7939C6J87r7p6k05K64k95K71O5j61m0j37J73J43R5k70L3n8K1j6M1O7o1Oo7J0J72
7965A01k40k5K03k99K26J16j66p9O3Pj16K04%K18k77J03l8J11k7j53r4J41M7k
$$ plain form
7793 41 15 -67 104 -10 -211 -109 309 116 -24 -22 -66 167 -138 0 73 -52 159 -14 -85 45 48 -49 -22 58
7817 58 -28 -124 -18 18 -180 77 39 -200 -32 13 -144 -150 -6 1 -88 -21 -29 -22 62 -126 35 199 93 -2 128 104
7843 104 71 -62 115 72 -78 64 -246 63 17 101 53 -100 -97 168 -171 -54 54 136 173 16 -5 -145 -152 -57
7867 -57 287 314 28 125 -61 -80 127 64 -191 16 149 -180 -81 33 49 -38 -19 -262 174 -127 23 242 135
7890 135 133 -178 -175 -259 -161 -141 118 13 -125 142 305 -2 78 104 193 -31 112 37 1 -193 -39 -234 94 116
7914 116 -97 -286 16 -90 -73 -26 114 132 65 -11 36 -155 -14 -45 -175 -54 -45 -47 -12 -16 259 27 -30 -79 36
7939 36 223 126 50 -155 109 -186 85 150 -11 -51 -188 -15 128 223 -47 -14 -72 -51 -67 -26 41 -20 -14 -81 -71 101
7965 101 -139 -164 39 -260 -34 82 -84 -163 -100 -93 -209 -5 -5 213 -64 39 1 112 85 -68 -162 -21 26 24
7989B4L3j25m5L3K39o7k08J22k53K12J53l13J12j81K52K4R7k4rj45oK8O3pM8O8
8015A25k51J11q2O3L6j05L29k25Q0J14Qk60O9l6J04l89M49j17j34J41Q1l59J49
8038i9J59O8k20l4K4K87k51q3J62m5K83j58p3O6kj00k27K76j89O0k3J41q1L4R8
8063G3j8j7j08J01j39J30j27j00O8J11k49J57J37p8o6L54l34P1l9j6J21O1M4j50
8087a3k06l7L90l63O8J18K22l00J94m2k1q5P8m9N2Q6k07J87j65N9N8j56L56j00
8111A24m03K68K22k95M9j4K2L08k27M9j4o8k18K79k20M8J26k7j80K93kk22Q6J38
8135A22RN8j27j31J08K8j67j1K74k50J94J6k0r8Lj02O6N3J57l89J33Po9K75l41
8160b02K68K37l12K8j99R6K93k92l3K49k52j94K53p3K78j43L8k20j07M39J11l20
$$ plain form
7989 24 57 -68 -113 -80 159 92 -116 6 -247 -35 118 -195 -83 -264 -12 12 109 85 76 -69 -75 -47 16 9 57 125
8015 125 -126 -15 -97 -34 2 -103 226 1 81 195 203 -57 12 -24 80 -309 140 23 -111 30 111 -248 -99
8038 -99 60 128 -92 -126 -102 185 -66 -149 13 -32 251 93 20 86 84 -16 -243 33 -156 -96 -119 22 -59 -25 73
8063 73 55 38 -70 31 -108 22 -105 -205 -137 -26 -275 -118 19 -59 -125 229 -105 -34 -73 -89 32 93 137 -13
8087 -13 -219 -256 134 -229 -161 -43 179 -121 73 31 10 -75 3 -46 6 92 -115 72 -93 -34 24 -132 224 124
8111 124 -279 -11 211 -84 -35 -49 -27 281 54 103 89 21 -197 82 -138 -90 36 9 -171 122 120 -102 -16 122
8135 122 131 189 62 -69 39 67 -100 -111 163 -87 107 123 103 5 8 -94 -28 25 182 -207 -74 -67 -136 139 -202
8160 -202 66 303 -9 19 -180 -84 209 -83 -116 133 -119 -313 -60 -133 145 2 40 -180 -287 152 263 -57
8182e7K4l6J15k38J05M6K3l1o
$$ plain form
8182 -57 -33 -69 46 -192 -87 -41 -18 -49 -55
8191e5
$$ Imaginary data points
##PAGE= N=2
##DATA TABLE= (X++(I..I)), XYDATA
0@%%%%%%%%%%%qJ6j6J6j6K4l2M0m8N6p2Q1r0J08j30J51j73J98k26K60k99L39l82
34b03M32m88N50o15O87p67Q52r46J051j163J283j418J567j728J904k098K310k546
52a336K808l096L420l787M203m681N239n895O680p642Q855j0433J2579j5684K0583
67A1813k9464N0439j86662j19435M28880j00086j77640J68076O532k11420J17543
78d1424J34805o6214j7206k9089j03307J23172J08725j15108m435O1145j46240
89i5176K2275K14079p8787j53701J10838j1728j11560J54221P7370j92481k708
100f7358J00951q3200M4571J42214j46836j17695J51566J1301q7081J12599O725
111F7757j64471M6738J10040n5403J8471L1943j29212O116J42957n2953n3714
$$ plain form
0 0 0 0 0 0 0 0 0 0 0 0 0 -8 8 -8 8 -8 16 -16 24 -24 32 -40 41 -49 59 -71 80 -93 105 -121 139 -160 179 -203
34 -203 229 -259 291 -324 363 -404 448 -498 553 -610 673 -745 822 -906 998 -1100 1210 -1336
52 -1336 1472 -1624 1796 -1991 2212 -2469 2770 -3125 3555 -4087 4768 -5665 6914 -8770 11813
67 11813 -17651 32788 -153874 -273309 155571 55485 -122155 45921 52453 -158967 -41424
78 -41424 93381 27167 9961 -19128 -122435 737 109462 -5646 -10081 51064 -95176
89 -95176 -72901 141178 62391 -91310 19528 7800 -103760 50461 127831 -64650 -67358
100 -67358 33593 -49607 -5036 137178 -9658 -127353 24213 35514 -51567 61032 67757
111 67757 -96714 -49976 60064 4661 23132 55075 -74137 -68021 74936 21983 -31731
122c1731R5131o8383j04756J41287O1549j27416K0256N0914r6410L2958J15368
133H8767p4853n8618O2800m1205k0155J13657k7967j06769O3803K7846p8323O6935
145A5918O4214j16620k5558R3664k6140k1052O4947m8642o3941P2558J5467m8649
157b3834N1879N84r2322M1854P6622o1353j3896N4133n5406k9601Q6002k674n9751
170b7763L2291j54m5037N0111L0829o1486P542L2307m7904J4164O4949m7975m5156
183d3282N5574k829l7455M7937R166o0255J6644L4042l0379J1781K7887m5793
195a6962r398M8293j6912j9953L6915j6432l8529L9499J8458l7300J3682J6194
207A7555l7240R049L7746k6280j4197K8743j7369j7759L7006J01l3765J6743J1218
$$ plain form
122 -31731 63400 -4983 -109739 31548 93097 -34319 -14063 36851 -59559 -26601 88767
133 88767 13914 -44704 18096 -23109 -43264 70393 42426 -64343 -540 27306 -51017 15918
145 15918 80132 -36488 -62046 31618 5478 -15574 49373 731 -63210 9348 24815 -23834
157 -23834 28045 28629 -63693 -21839 54783 -6570 -20466 33667 -21739 -51340 34662 31988 -27763
170 -27763 4528 4374 -40663 9448 40277 -21209 -13667 18640 -29264 -15100 49849 1874 -43282
183 -43282 12292 9463 -27992 19945 29111 -31144 -14500 19542 -10837 944 28831 -16962
195 -16962 -26360 21933 5021 -14932 21983 5551 -32978 6521 24979 -12321 1361 17555
207 17555 -19685 -10636 27110 830 -13367 15376 -1993 -19752 17254 17355 -16410 333 11551
220A1551k4721J4307J9326k6381m166K0306j3552k488K2567j5140j7414K3566
232G761j059j9306J9564O386k8352P684K1896j7176n021J7605j1138j0748J7398
245E494j263j0886J0334j828j2137J2580N590j6192N437R923j4799M95J6903r616
259C5r948J3421j902j0418J0076L898j1789L751O603p503J421O428p783r23Q091
274C458m908k742Q703l694p259Q094K234q291L886N204p450K01P039l654l193
289b372M601j376k919M085j47l017K945K97l333K777J657m403J542L395l804r21
305i93M880j981l821L722J101l806R63K615j836p15J052k11l83J96j275Q35J306
322A649j740m16K209r31k277J810R54k401J67J842r18j327J372J25j370K92N82
$$ plain form
220 11551 -13170 1137 20463 -5918 -10084 10222 -3330 -5818 16749 1609 -15805 7761
232 7761 6702 -12604 6960 13346 -15006 -7322 14574 -2602 -7623 9982 -1156 -11904 5494
245 5494 4231 -6655 3679 1851 -10286 2294 7884 -8308 -2871 7052 -7747 -7252 9651 35
259 35 -9913 3508 1606 -8812 1264 5162 -6627 -2876 3727 -3776 -2355 4073 -3710 -4633 3458
274 3458 -1450 -4192 4511 817 -6442 1652 3886 -4405 -519 4685 -2765 -2564 4475 821 -2372
289 -2372 2229 853 -2066 2019 1872 -1145 1800 2097 -1236 1541 3198 -1205 337 3732 -72 -993
305 -993 3887 1906 -1915 1807 2908 -898 65 2680 844 129 1181 970 587 783 -492 343 1649
322 1649 -91 -507 1702 771 -1506 304 1258 -1143 -976 866 -52 -1379 -7 118 -1252 -960 -378
339c78K3n98k71P93L13j186p11J884J03k138R44J480j311j320J947M77j711R5
357a565J618p33p33O93M95m82k91M28O77m30p01Q67Q05j456j7J853n89j655J673
376D57J311k234o5K064o95j583J150J129r63j71M48J58M42j285k05K057o45k108
394g38J888J584k730n73L178j422k140K338O74k318M44J710j575j63J091j203
410D5J70P85j319N18J464k347n94K986j483k493L305P71m329J292L431l070j255
427b123K900j325j712K300l3j739J870n43k230K345J149l298J545J819l518J019
443a574L947l542j953M407j913k613M566K49n061K039L083l237N95K867l021j081
459b242L423j287n87K832l042j843M976l41m054L518J597o134K071N738m152k643
$$ plain form
339 -378 -355 -953 -1224 -431 -118 -1304 -2015 -131 -28 -2166 -1222 258 -1053 -2373 -426 51 -1660 -1565
357 -1565 53 -680 -1413 -720 -225 -707 -998 -570 107 -323 -1024 -157 648 -808 -825 1028 439 -1216 457
376 457 1768 -466 -531 1533 838 -745 405 1534 571 400 848 1006 1448 163 -42 2015 1370 -738
394 -738 1150 2734 4 -569 2609 1187 -953 1385 2059 -259 185 1895 320 157 1248 45
410 45 215 1000 -319 199 1663 -684 -1278 1708 225 -2268 1037 1808 -2521 -1229 2202 -868 -2123
427 -2123 777 -548 -2260 40 7 -1732 138 -405 -2635 -290 859 -2439 -894 925 -2593 -1574
443 -1574 2373 -1169 -3122 1285 -628 -3241 1325 1574 -3487 -1448 1635 -1602 -1007 1860 -1161 -2242
459 -2242 1181 -106 -693 2139 -903 -2746 2230 1889 -2165 1353 2950 -3184 -1113 4625 473 -2170
475b170M250j464k705M704K16l757J469M20k273L896Q30n271J613L007m027R32
491c30N891n153m743O193Q70l887L218M13n519J426M246k235K69J281m704J82
507b582N791k193k500L159k858l406O158K223n659J059J065l969K936N247m975
522e04k936L632k216m89O055j912o246K673K135j892L182J384o448l0L985j182
538h09J392K749n945k899O512J098l141K809j535n827L898N962l168j523O31l846
554c642J711O192k203k978J573l137r14P664J021p254N17K336k796L293M606n193
570G96m303K669J091J294L387l894m850L295J693q14M383j965p717K224O444k164
586A569n52J948n005k732O576K105l076M1k669k270N099L300m233l24o65l292
$$ plain form
475 -2170 2080 616 -2089 2615 2831 -926 543 963 -1310 2586 3416 -1855 -242 2765 -1262 -330
491 -330 5561 408 -4335 1858 2728 -1159 2059 2472 -3047 -1621 2625 390 659 1940 -2764 -2582
507 -2582 3209 1016 -1484 1675 -1183 -4589 1569 3792 -1867 -808 257 -3712 -776 4471 -504
522 -504 -3440 192 -2024 -2513 3542 1630 -4616 -1943 192 -1700 1482 2866 -3582 -3612 373 -809
538 -809 583 3332 -2613 -5512 1000 2098 -1043 1766 231 -5596 -1698 4264 1096 -427 204 -3642
554 -3642 -1931 4261 2058 -920 653 -2484 -3398 4266 5287 -1967 -1450 886 -1910 1383 5989 796
570 796 -3507 -838 253 1547 4934 1040 -3810 -515 1178 364 4747 2782 -4935 -2711 3733 1569
586 1569 1017 2965 -2040 -4772 1804 3909 833 874 -1795 -4065 1034 4334 101 -223 -888 -4180
602d180L731N786m066l833J407j290P15N422q20o099N27J883j028M267J206o646
618c018j585M299J59P99K522m627m055M591K326q83J927k886n060L759M846k397
634G17l55L27m776P73O683n91l530O16j790j198N279J741m336l95l8k158M702
651A671L617n194k821K755p59O56M652k261n234J424K740o13K204m63m963N12
667b077L877o36Q44Q88m770j329M836Q65k421J690j824l454L826L437l346n56
683a50P53l124J441M384j974k768J158r80q18M421Rm622Q03J236j757K844K009
700B865m415j315L063p63J34K698k638l082K623J659j646J677N8l856J080L536
716A678j747l74J249l250j93L984j47k374J598q03k150K986J903l142l12J609
$$ plain form
602 -4180 -449 5337 1271 -2562 -1155 -2445 -1730 3692 2872 -3227 -2700 -817 -1845 2422 3628 -3018
618 -3018 -4603 -304 -145 654 3176 -1451 -5506 -915 1411 528 2455 -431 -5491 -1732 3114 717
634 717 362 689 -4087 -3314 3369 2778 -752 -136 -1926 -3124 2155 3896 -440 -835 -873 -3031 1671
651 1671 5288 94 -2727 28 -731 -75 4577 2316 -2918 -1494 1246 633 2837 2374 -2589 -2077
667 -2077 1800 1164 2008 2896 -1874 -3203 1633 2498 77 1767 -57 -3511 315 3752 406 -150
683 -150 603 -2521 -1080 3304 1330 -1438 -280 -1260 -2078 2343 2352 -2270 -1467 -231 -1988 856 2865
700 2865 -1550 -2865 198 -565 -431 2267 -371 -3453 -830 829 -817 860 918 -2938 -1858 1678
716 1678 -69 -443 806 -2444 -2637 1347 1200 -1174 424 -379 -2529 457 2360 -782 -1094 515
732E15j705P51K970k055j963J963o95o28L198q30k951J332J560j820J122J526
748B290k607j109K910n14j150J899j560j727K312Q66j859J177J78k275J159K244
764B234k098m31J634j979l77K707r46j752J371P6j198J228Q54k054l2J407j198
781e54K27J328j302j186J947n26r73J598k42k091J345J199j750M63Q68j244k57
798a150J392k86q52R61m63j180J617N2r02M07N23j451P95J271j489k42J365n43
816a75q52J510o3r97N09M26p45N00M52o84Q7N02l81l95R78q27R4O47p1o36P40
837F19l60o04N54Q28p61o6N06m44j96M89j5l69K35K23n84N62K5p11M46j9l71J93
859A80N23q85NO69l83m16O79k2n83JL81l69m4J21j49q5K64k66K43k49j92L77R0
$$ plain form
732 515 -1190 -439 2531 476 -1487 476 -219 -847 2351 1521 -1430 -98 1462 -358 764 2290
748 2290 -317 -1426 1484 970 -180 1719 159 -1568 744 1610 -249 928 1106 -1169 -10 2234
764 2234 136 -295 1339 -640 -1017 1690 744 -1008 363 439 -759 469 1323 -731 -763 644 -554
781 -554 -327 1001 -301 -1487 460 -66 -1039 559 317 -1774 -429 770 -980 -517 351 -893 -1150
798 -1150 242 -44 -896 65 -398 -1578 39 91 -811 -404 119 -1332 -537 734 -755 -997 368 -175
816 -175 -1027 483 420 -577 -68 358 -387 113 565 -119 -32 470 89 -306 672 -155 -61 586 515 -121 619
837 619 259 -345 209 1037 276 210 716 272 76 565 550 181 416 639 55 617 642 -69 377 358 -13 180
859 180 703 -182 -177 492 109 -307 372 350 -233 -232 149 -220 -264 -143 -292 -377 -113 -379 -136 -385 -577 -200 -110
882a10k57k04M50J73n24J96L7l5m69L11K08m07J46K50J06l62J98NJ15k45K48J07
904f3l35rM09M6l39K5N12j35l19L03o3l6N8L18Qn15K78j7R0k36k5O46m03j02J66
929B62J02m8m51O10J36o04K22K01j09j09K30q1k88K47M01o24m7K43k22Q5n4Q6
951A88q5K11l66Q1M0j65j02L59j80m06M54on89N9N15j60q9K81k17p6L5l65P1L69
975a43l5p24P16J75q78N03P63j021K43O39m59m96O64j85m81O34P2n20J82L09m05
996d47M72L81p59J24P81n72k12P95m33p58R00K20p42O53N32j151J43P80n61j9
1016A27M43m24l57J017k18p67Q44k81q22O99Q65j256N92N69j243J60R75m20q29
1035c26Q03j90r07J231q6j069O37K95j037O68J051j426j82Q79n56m26J513o82
$$ plain form
882 -110 -367 -571 -121 52 -472 -276 -239 -274 -743 -432 -224 -631 -485 -235 -129 -491 -293 -288 -173 -418 -170 -63
904 -63 -398 -407 2 48 -291 -266 246 111 -208 95 32 -4 54 372 380 -135 143 126 216 -20 -45 601 198 96 262
929 262 364 316 -135 475 611 7 229 430 321 212 442 361 73 320 721 97 50 293 71 156 102 188
951 188 103 314 -52 29 69 -96 -198 161 -19 -425 29 23 -566 -507 8 -152 -241 40 -177 -253 -218 -583 -512 -143
975 -143 -178 -902 -186 -11 -889 -386 377 -644 -401 238 -221 -717 -53 -238 -719 -85 -13 -533 -351 -42 -447
996 -447 25 406 -353 -229 552 -20 -232 563 130 -628 272 492 -250 403 935 -216 -73 707 146 127
1016 127 570 146 -211 806 588 -179 665 384 -438 261 1126 -130 462 1031 -212 -52 923 503 -326
1035 -326 477 287 -620 611 525 -544 93 388 -649 19 1070 -356 -538 341 -215 -641 872 190
1053A90j361J274L04j363R79L82j182j33J573j001k16R39r23n20J369m0j276J241
1071B36Kj625J021J287j493O4J175j361k87J988j014j017J075k1j391J915K27
1088G81j612M88J116j438O48J089j421n30J646m38j091J897r47j215J401P09j418
1105c35P18P50j781p0K001j015o14J240j012o38J700K57j778P38P44j785J080
1122B00J447j907m20J553j162l84K177j019j729J528K33j242J327K79k058N07
1138f70J558j181N4J194j283j184K389n47j161J263j34j847J228J246j731N46
1154b60Q35j739J26K074j048j086J291n03j145K098O7j891P77R13j483P80J340
1171A146j861l26J389o24m73J541o63j407J456N97j505J106M40j656N44J418j241
$$ plain form
1053 190 -1171 103 407 -956 23 405 -777 -910 663 -338 -554 385 -538 -1058 311 271 -1005 236
1071 236 238 -1387 -366 921 -572 -508 667 -694 -981 1007 -7 -1024 51 30 -1361 554 781
1088 781 -831 -343 773 -665 -17 1072 -349 -879 767 329 -762 1135 188 -1027 374 1083 -335
1105 -335 383 1133 -648 -718 1283 268 -346 894 -118 -756 944 1201 -577 161 905 -880 200
1122 200 1647 -260 -680 873 -289 -673 1504 485 -1244 284 517 -725 602 881 -1177 -670
1138 -670 888 -293 -239 955 -328 -1512 877 330 -831 432 298 -1549 -321 925 -806 -260
1154 -260 575 -1164 -1038 1036 -12 -1098 193 -310 -1455 643 710 -1181 -404 509 -974 -194 1146
1171 1146 -715 -1041 348 -276 -749 792 129 -1278 178 775 -730 376 816 -840 -296 1122 -119
1188a19l10J229r15q75J955j14j621J364M3j555J389P92j397k2J027j200L2J562
1206A265r31j066J202j63r84J401M24j919O59J043j242N09P91j277m52J317l60
1223B17o06J207p00j169J219L32j101N62M44j059J33J264r62m38R03n69p79J530
1241D28o0r28L08L18q06P01M72r67j07J080n39m06R67o59p93P81N41j007R44K01
1261D69j257L53J107q89R8O47p81l21R81r7p87R30j32q00P73K40q76K46Q11r36
1281b21J20Q13m84k57N23l83n22Q81j30n05L02L56n08K84K69n57k9M18k16J06
1301B60L84o06j26M54J41o30K90K80o58L81p3r4j18L69k24m43O94j85m63J93J02
1322g2n12N80K61o27N1L53l63nO63m01l59L35j67l7L22j48o8k69K77k28K31l1
$$ plain form
1188 -119 -429 800 -115 -990 965 851 -770 594 637 -918 471 1263 -134 -156 871 -329 -297 1265
1206 1265 334 -732 470 307 -677 724 1148 -771 -112 931 -311 198 989 -288 -740 577 217
1223 217 -389 818 118 -1051 168 500 -601 -39 405 -654 -521 743 -219 -657 246 -323 -1102 428
1241 428 368 -560 -252 66 -740 -39 433 -534 -641 439 -100 -506 461 -198 -991 -210 331 -676 268 469
1261 469 -788 -435 672 -217 -119 528 -253 -574 407 310 -477 453 321 -479 294 534 -342 -96 715 -221
1281 -221 -101 712 228 -29 494 111 -411 470 340 -165 137 493 -15 269 538 -19 -48 370 154 260
1301 260 644 38 -88 366 507 -123 167 447 -211 170 97 3 -115 254 30 -413 281 96 -367 -174 -72
1322 -72 -584 -4 257 -370 -319 34 -329 -334 329 -72 -431 -96 -263 -300 22 -126 -194 -463 -186 -414 -183 -214
1344b14n8j87K28O7j76M43j26j06J18J69jq1Q9j60j16M21l35m4J94o3L2R6J47
1367C37n52M64L6j00R7j45l45O50l96L2K54j35K03m46L24k81K43j73K34l20J74
1388A55j69M07n95M12o3j34J44M0j58J8l6k9n1r3K01N6j24j2j5kj53o7J93J85
1412A10l17Q5n5q6N2K7J03m6j08l9M6K08j96K19J94n20L64J36j65m22L49L1j96
1435b26J11M1k1N1j0K07k15pL6O6k95J65r0K48o7R9J02k5k49L2J65J01k04k37
1459b22L37J83k35J46R1k54J20j15L60k59p0M5n8R1Q6j13p7K5jQ7l5k24K6J66
1483A00J8m8Jo8MO8K9Q3p5O9J8k09P4j36k32L46j99J77j40J5o1L40m94M22k84
1508a82J92k03J26k3Q4j03mk05M27o12M24k60J90J96j5p6j79K12q0m6l1L77l71
$$ plain form
1344 -214 -272 -459 -231 -164 -340 103 -23 -129 -11 158 157 76 165 5 -111 310 -25 -69 125 62 94 190 337
1367 337 -215 249 285 185 282 137 -208 442 46 78 332 197 400 -46 278 -3 240 67 301 -19 155
1388 155 -14 393 -202 210 147 13 157 197 39 57 21 -8 -59 -152 49 105 -19 -31 -46 -48 -201 -268 -75 110
1412 110 -207 -122 -177 -263 -211 -184 -81 -127 -235 -274 -228 -20 -216 3 197 -323 41 177 12 -410 -61 -30 -226
1435 -226 -115 -74 -95 -44 -54 153 -62 -69 -33 33 -262 -97 -187 61 -6 93 195 170 -79 -47 118 219 15 -222
1459 -222 115 298 63 209 300 46 166 51 411 152 82 127 69 160 246 133 56 81 80 167 132 -92 -66 100
1483 100 118 70 71 3 7 75 104 187 112 181 199 -10 64 -72 -304 42 -157 20 -120 -105 -166 174 -320 102 -182
1508 -182 10 -193 -67 -90 -6 -109 -113 -318 109 -503 -79 -339 -149 47 32 -44 -223 -11 -91 -137 -168 209 -162
1531a62Q2J08r5k7L07k48N7K6R3j72L6N4J39j50j13K45m4N9j46m2J69j47K17j55
1555I1K02j05k8M5m05L12l9J0J88J1j55R0k67k63L07J23R7j64L5J60k85M36j56
1578B40k16k5J72L9k68L09m08k7K70j28j69Q5L3q4N1L47p01N22J7k82K36j76M
1601a59J6J04l28qL46j34j75L51j99p4M40j66l26L06Q4l57K34K40j49k20K35k04
1623a43j16K70j5k47J84J76l66O6L98l25p9L71k50oK56j9j34p0M16n18M04O5l58
1646d0N8L94l30j49M60k56k5K72k68k18J38M0p2j0O27p02J02O4n8J0M50l94k27
1669a34M27k45r4M90n21j68N09j21l74KK23k44o2P21l76m20N86l39j70M12kk58
1691a58N4J68l42n9O65n69l06N95m7j57K42n7m03K96J86j92K00J02n22j25M85
$$ plain form
1531 -162 -80 28 -67 -94 213 -35 22 48 141 -31 5 59 198 48 -65 180 136 195 49 7 176 29 246 91
1555 91 293 188 160 205 -200 112 73 83 271 282 127 217 -50 -313 -6 117 214 50 85 245 -40 396 240
1578 240 24 -1 171 210 -58 251 -157 -184 86 -42 -211 -126 -93 -177 -126 221 -480 42 59 -223 13 -163 -159
1601 -159 -143 -39 -367 -375 -29 -163 -338 13 -186 -260 180 14 -312 -6 78 -279 -45 195 46 -174 61 -143
1623 -143 -259 11 -4 -251 -67 109 -257 -191 207 -118 -197 174 -76 -82 174 155 21 -49 367 -151 253 318 -40
1646 -40 18 412 82 -67 393 137 112 384 116 -102 36 76 4 -6 621 -81 21 85 27 37 487 93 -134
1669 -134 293 48 -46 444 -77 -245 264 143 -231 -229 -6 -250 -312 409 33 -387 199 -140 -310 102 100 -158
1691 -158 -104 64 -278 -337 328 -241 -547 48 1 -156 86 29 -374 -78 108 -84 116 218 -304 -429 56
1712E6k27n6L74l49J8L11k09k33L57P3n09L25M91m37j45P69o54j57P71m07m08
1733b46L46k0j70L43Pm15L18K48l26o4O44o47m34O79j64l62M99k36k33K81J47
1754A95k76J35J62j73m3L21j70k03L47k17k47J79K71o89M11Q1l36P2N09n21k39
1775d31O04l43j48M77k9o45N43N4m65L29M69m92k28M90m39Q7L66l05k94O03k18
1796a5l14L97J64n95L28L04l79K48Q8j18k34K53k11r2J53K34l12M64k73k96J47
1817e9K83k93p6L64k84l03P51k43k27K0J82k9J85M3l23j11K24j12K11K73n74l6
1839a34K53P4q5J34j56k03p0N16k87J2J07k89J16Kj35O6K45Kn26M68r1j53M4K23
1863A33m98K80K95l08j07M32m54M1J09J71l58J13J69j51j4J37J8n42O64l58N6
$$ plain form
1712 56 -171 -227 147 -202 -184 127 -82 -315 42 115 -394 -69 422 -15 -160 609 -45 -202 569 162 -246
1733 -246 100 80 -90 253 260 -155 163 411 85 21 665 18 -416 263 99 -263 236 0 -233 48 195
1754 195 -81 54 216 43 0 321 151 -52 295 78 -169 10 281 -408 3 84 -252 -180 329 -192 -431
1775 -431 173 -170 -318 159 130 -515 28 82 -383 -54 415 -77 -305 185 -254 -167 199 -106 -400 203 -15
1796 -15 -329 68 232 -363 -35 269 -110 138 226 108 -126 127 -84 -176 -23 211 -101 363 90 -206 -59
1817 -59 224 -69 -145 219 -65 -368 383 140 -87 -67 115 86 271 314 -9 -120 104 -8 203 476 -98 -134
1839 -134 119 193 108 242 86 -117 -187 329 42 54 161 -128 -12 -10 -145 -79 166 168 -358 110 19 -134 -90 133
1863 133 -365 -85 210 -98 -205 227 -227 -186 -77 94 -264 -151 18 -133 -147 -10 8 -534 130 -228 -172
1884a72L82j77p6J60J49l76J10J2l25J88L45k21k67N44k33k66K68J19l80L73j74
1905a7j8j2K57l32K29Qjj22K39k35J17K9Qk47J31K96l31J8j18M5K90O1j28j90
1929b3O1p0Q9o8J80mM0k65l0K87j10j62P4L4k15J89l96M25q8L0k9p3j85M33k94
1954a70K3N5j56J43J71l43K35j6R1k74J90Q5j09N3J32l80K78p4Q3k94K52o7NP1
1978a6j21J38O1R3k28Q7L18l48j5r2L32K2k5r8N2k38O2k8j55L59p3r1K82k56k28
2003b06J30K22j93J85j9j8J17j49K1k06L24nk34K06kj84J87k04J9L53k73N5p8
2026D8rL5j01J52j39p7P3NJ48q8P4j01J60m40J77p2J16p0K60j95J71k18j60K4
2050b27K11J9q4J62j27j2k01L50l10K75j03p8P4J2N4j65L1J06J19l76N5K09j42
$$ plain form
1884 -172 210 33 -43 117 266 -110 0 12 -313 -125 220 -1 -268 276 43 -223 45 164 -216 157 -17
1905 -17 -35 -47 210 -122 107 115 114 -8 231 -4 113 142 150 -97 34 330 -1 17 -101 -56 234 295 167 -23
1929 -23 38 -32 57 -11 169 165 205 -60 -90 197 87 -75 -1 33 -182 7 -389 36 -52 -22 -51 -124 -309 124 -170
1954 -170 -147 -92 -248 -105 66 -277 -42 -58 33 -241 -51 34 -75 -22 110 -270 8 -66 17 -277 -25 -92 -87 -16
1978 -16 -137 1 62 155 -73 14 332 -16 -31 -123 209 231 206 108 160 -78 -16 -44 -199 160 87 -4 278 22 -206
2003 -206 -76 146 -47 138 119 101 218 69 90 -116 208 203 -31 175 173 -11 176 -28 -9 344 71 126 48
2026 48 39 74 -27 125 -14 -91 -18 -13 135 47 121 20 180 -260 -83 -155 -39 -109 151 -44 127 -91 -251 -227
2050 -227 -16 3 -81 81 -46 -58 -259 91 -219 56 -47 -125 -51 -39 15 -150 -119 -13 106 -270 -215 -6 -148
2073a48J64j15N1j09L54K2j8L1l35K55j62q6Q7L2J00j47K22q8R3j11n5J59l15
2096a19L63k99l9n7J55j09J73nj39O8Q0j43J74R0k4Mr2l2j05J79Nj18Q6k5j71
2121a00L23j22j50J54n7p1k55Q5P8k8k3J32j09N3J88m7l0J30k27J92k70J35l4
2144e3J6J5k61K36J38k43O8o9R2l03N06k12M1J0k37J02R0r2j3K82j4j6j25K82
2168B40l43J61P5j53J0K40j17j45R5J1n6N8o6j50J86J02j50j03K20j88p1K75L1
2191A62l62M5K45l1L54k48k1P4ol01L69j25Q8n7o4q0k06L58q7k24N6LJ60k46N46
2216D02l84K04k41OJ89j77j5k70J56j1K68j42j83N01p3j97p2L7m2l5k54K62n7
2239a28J09m6Q7j38J88Nj32N9N5j95L20Ql39J68K6j57P2K30l18L1l7J89Nk33K48
$$ plain form
2073 -148 16 -99 -48 -157 197 219 201 232 -103 152 -10 -96 -9 23 123 -24 198 110 203 92 37 196 -119
2096 -119 244 -55 -94 -151 4 -105 68 63 -76 -8 72 -71 103 193 169 173 81 49 -56 123 128 10 96 71 -100
2121 -100 223 101 -49 105 48 -23 -278 -193 -115 -143 -166 -34 -143 -90 98 51 21 151 -76 116 -154 -19 -53
2144 -53 -37 -22 -283 -47 91 -152 -84 -153 -61 -364 142 -70 -29 -19 -256 -154 -64 -156 -169 113 99 83 -42 240
2168 240 -103 58 133 -20 -10 230 113 -32 63 74 18 76 10 -140 46 148 -2 -105 115 -73 -144 131 162
2191 162 -200 -155 90 59 413 165 144 218 212 -89 280 155 243 186 122 42 -164 194 107 -117 -61 -58 102 -144 402
2216 402 18 222 -19 -13 176 -1 -16 -286 -130 -141 127 -15 -198 303 230 33 -39 -2 -44 -79 -333 -71 -128
2239 -128 -19 -65 22 -116 72 77 -55 4 59 -136 184 192 -147 21 47 -110 -38 192 -126 -95 -132 57 62 -171 77
2264G7q8n1J93q5rP5J9j73K58Rj10r3N6N3J48j72R0j70oJ29j50L55k23n7J84l31
2290g2J87J97l15L3M2N8j13j9Q3n2p0j69L66m26K08k9rq9J07k45M25q3j8r0O3
2315c0J24j39j33J70J66j74r4j11p6L40j50k8J29k90K58L19j38M9j53j4K24k71
2337b2J41q6p0n3M5J38k3j6j96J09l1K02j39R4j25R3K3k06L3k7J09J3J98k81J63
2362H6J36j86J25p8Lo2O9Q8j27J90k50O1k18M34p9j73r4K38o9j99K15k60L14j01
2386F3M2K5r5o1J57j05J8k76J91R0j05J74k7j05Q9lj35q6M6R5p6j59J50K6P6J9
2412B8k97J24K76p3n9n9K26o6j63p1N4l37M83k16R4q6J19K7j39L70j63j79O3K46
2436B02j45j05Q2j4j0kJ4J9M5m1k0L1j01m5J29O7Q5j18K32k11o8J16p5o0j21K11
$$ plain form
2264 77 -11 -62 131 46 37 112 131 -42 216 225 115 22 78 131 279 107 197 27 21 150 0 355 132 75 259 -72
2290 -72 115 312 -3 30 72 130 17 -2 81 29 -41 -210 156 -270 -62 -91 -100 -189 -82 -327 98 15 -3 -93 -30
2315 -30 94 -45 -178 -8 158 -16 -110 -221 -297 43 -107 -135 -6 -296 -38 281 143 192 39 25 249 -22
2337 -22 119 33 -37 -90 -45 93 70 54 -142 -33 -64 138 -1 93 -32 61 84 -122 -89 -116 -7 6 204 -77 86
2362 86 222 36 161 83 86 24 93 181 54 244 -6 55 -163 271 192 19 -75 163 94 -105 110 -150 164 63
2386 63 105 130 35 -26 131 26 44 -232 -41 49 -56 118 91 -14 75 72 -63 -149 -103 -8 -84 -243 -93 -67 9 28
2412 28 -269 -145 131 58 -1 -60 166 100 -63 -134 -80 -417 66 -150 -56 -142 -23 4 -135 235 72 -107 -44 202
2436 202 57 -48 34 20 10 8 22 41 86 45 25 56 -45 -90 39 106 191 73 305 94 26 142 67 7 -114 97
2462I7P3p2j87K9o2Q4J02j77NO3K42L6p9l1L9k4k49M7J8r0R2J76j74n1O3PJ37
2489A14k15J72k19J27MR0L7l9j97J42K1n9J85k19q7K98r3j61L05j62j28n8O6Q0
2513DK27j37j12m7N1j77K46j19Qj3J04k67L49j16k19L74l3J1o5j03L1O4m1o5j07
2538a52L00J10k85j35J25jJ24j97J23Q8R1k86J04R9j63q5K10R0r1M7j03J74j48
2561C9j3J53o4j64J89j34J18j9j37J08o6J13l8k06K8J52j19J80P8nk68K34q5M2
2585A16jk07J6n4OJ1j3L8J94m0j34j7J52j36q5K50m8J59p0l09J33k25M69k46J9
2610b2Q8Jl63M04K29k13k10K03l00K34r9q6j02J27M9J50n2J2k57L19m8j06MJ19
2634H1j04J55o7k4J15k65K42PK5p0j91N0K08p1m0J19l9j9O8l36K29J78j20j83
$$ plain form
2462 97 170 98 -89 -60 -122 -38 64 -113 -108 -45 197 233 154 123 162 138 -111 -64 -46 -136 -44 132 -42 -93 -30 -23 114
2489 114 -101 71 -148 -21 -17 73 110 71 -126 16 37 -22 163 -56 -143 155 62 -99 206 44 -84 -142 -76 4
2513 4 231 94 -18 -65 -14 -191 55 -64 -56 -69 35 -232 117 1 -218 156 123 134 69 -34 -3 61 20 -45 -152
2538 -152 148 258 -27 -162 -37 -38 86 -111 12 100 191 -95 9 108 -55 -140 70 160 69 116 13 187 39
2561 39 26 179 115 -49 140 6 124 105 -32 76 10 123 85 -121 -93 59 -60 120 198 193 -75 159 74 116
2585 116 115 -92 -76 -130 -124 -113 -126 -88 106 66 -68 -85 67 -69 -154 96 48 207 137 -172 -39 -264 205 -41 -22
2610 -22 66 67 -296 108 337 124 -86 117 -183 51 -48 -134 -236 -109 -60 90 38 50 -207 112 64 -42 -38 81
2634 81 -23 132 65 41 156 -109 133 140 165 95 -96 -46 162 91 51 170 131 112 180 -156 73 251 131 -52
2658e2J68j91J41p2J57k92Q9m6M36j08r9k46p5j38K19j50L8m0J51K08l7jq9o4
2682i3J25n3m2P1J41k24O2o1Rj42K89k48J61j1J16j03K26k95M1j79L49J6l95N3
2706a87J36j33p4Q8K17N2k5K54k04L0k01J52K6j3j97J88k37j9K85j69K09m93J97
2729a18K73l27mL3j2n7J50J39J59k92K3J61r8P6m4p6k31N00k79J82k49L1o7Q0
2753d7n6K72o8P2l41L09P0m8k39J24l2k1M6n6j17K08m2k33L46k58k1J69J4j14
2777f3k9J00k06K08m4P8M9l18O9J84lj32M5P9p8K30k39K16q2n6j29J06O8q3n7
2802h7lJ33oj59K55j40j85J47J37l2O1j81j64L71j97L2Q8j31j7J38J89k85N2k03
2826a87J29K50k24O6m9N8K87k31k71m8L73r1k18Q0k67M50j52J8n7j52L07j56J11
$$ plain form
2658 -52 116 -75 66 -6 151 -141 -52 -98 338 230 131 -115 -190 -328 -109 -259 -221 -261 -110 98 61 60 -29 -93
2682 -93 32 -21 -63 8 149 -75 -13 -74 -65 -207 82 -166 -5 -16 100 -3 223 -72 -31 -210 139 155 -240 -187
2706 -187 -51 -184 -258 -170 47 99 74 328 124 154 -47 105 131 118 -79 109 -128 -147 138 -31 178 -315 -118
2729 -118 155 -172 -176 -143 -155 -212 -62 77 236 -56 -33 128 30 106 62 -14 -245 255 -24 158 -91 -60 -127 -47
2753 -47 -103 169 101 173 -168 141 211 163 -76 48 16 -5 41 -15 -132 76 34 -199 147 -111 -132 37 51 -63
2777 -63 -92 8 -198 10 -34 44 93 -225 -156 28 25 -107 -62 17 -61 169 -70 146 64 8 -121 -15 53 -30 -87
2802 -87 -90 43 37 -122 133 -7 -192 -45 92 60 121 -60 -224 147 -50 -18 70 -61 -78 60 249 -36 16 -187
2826 -187 -58 192 -32 34 -15 43 330 99 -172 -220 153 62 -156 -76 -343 107 -45 -27 -84 -236 71 -85 26
2849B6n4k18L70j10m8J38k2j45j02K01j46J68n7o3j77L13j60j8k0M62l16j2nP0
2873G5k35K76l18Q8K18n0r4j41K83j42J19j14N9K2J77k48R1L0j21j01L13j26q
2896E3J21k05J86l61K81k10J56j74L43Mr7P4k49K55p3j0M0j21K13j40K2lN2l45
2920a88j25M13O8k95J93J5PP3j00J5l32J48JJ40N5r7j20K71k62K08j56r3J96j33
2944i8j8J68j07K02j03k18K7K7O0p2J66J13m7Rl30L10j02J5K08j5k69q4J18L1
2968iJ52l87J94L48l12J3J12l54J55n9J48j41Q8o1M28k13k22J88M9j96o5J09P7
2991D2k9K6r1R1j81O7J3M0j68L77L3j24Q3k68K8J72m2l8J47k04P9j3r1j0o2K13
3017I0j76L5K52k30o3K18j45Q0L0O9k81J32P7k4m29L02J27k73K21O9l14J67n3
$$ plain form
2849 26 -28 -246 124 14 -34 104 82 -63 -165 36 -110 58 1 -62 -239 74 -86 -104 -124 338 22 10 5 75
2873 75 -160 116 -202 -114 104 54 -40 -181 102 -40 79 -35 24 46 223 -25 66 96 -25 -126 187 61 53
2896 53 174 -31 155 -206 75 -135 21 -153 190 194 97 171 -78 177 104 94 134 13 226 86 108 105 157 -188
2920 -188 -313 100 168 -127 66 81 88 161 61 76 -256 -108 -107 33 88 -9 -129 142 -120 88 -68 -161 35 -98
2944 -98 -116 52 -55 147 44 -174 -147 -120 -60 -132 34 147 100 109 -221 89 -13 2 210 195 -74 -158 -40 -9
2968 -9 143 -244 -50 298 -14 -1 111 -243 -88 -147 1 -140 -52 -113 315 102 -120 68 117 -79 -144 -35 42
2991 42 13 39 -52 39 -142 -75 -62 -22 -190 187 220 96 179 -89 -61 111 69 31 178 -26 53 40 -51 -61 -123 90
3017 90 -86 -51 201 -29 -92 126 -19 61 91 160 -121 11 88 64 -365 -63 64 -209 12 81 -233 -66 -119
3040a19rK01m5j68J24j30j4J28oR0j82j3L5L65l32J89l75M4K69o6j12j72K71J50
3064A23j05P9p9J5M3J14m74K98q7N5q6K00l38L40J2q8P5q1P5k67J91m6J8K4j33
3089a22j06J83K2J6l3O0J79j20j60J06R5N5k78J10j46J28O7n4l01L49k08Q1n8
3112a35K60k87Q8R3K8n8N1k3m7K51k92N7K6r3J49p7L3M3l35L23Q2j2j72L4J01
3137H8k27J75O3o2j28j1n7J82O9J27j98J69r5l25L34k59J15J06r5R0J91k51J4
3160A5M9j30M3l4J18j61Q6N8j74R1J55k00m3J00J33p8J13l9l2l6p2l4L18J22k26
3185A42k49L74l90O2j40J80O1j95M23k74Q9j05m7J6L03o0k69J58j14J4j12J88
3207E5r8K73m55R1J40q2J67n6R5k17M4L25l35j60K82q4j47J17Pr2M6J76k40J73
$$ plain form
3040 -119 -128 73 28 -140 -16 -146 -160 -32 -38 52 -130 -143 -108 257 -75 114 -261 -217 52 -14 -126 -298 -27 123
3064 123 18 97 18 33 76 190 -284 14 -73 -18 -104 96 -242 98 110 22 97 16 91 -176 15 -31 -13 11 -122
3089 -122 -228 -45 -23 -7 -40 20 199 79 -81 25 120 175 -103 7 -139 -11 56 2 -299 50 -158 -77 -135
3112 -135 125 -162 -74 19 47 -11 40 17 -30 221 -71 -14 12 -81 68 -9 24 67 -268 55 137 125 -47 -13 88
3137 88 -139 36 99 37 -91 -102 -159 23 92 219 21 190 95 -230 104 -155 -40 66 -29 61 252 1 15
3160 15 64 -66 -23 -57 61 -100 -14 44 -130 -39 116 -84 -127 -27 106 28 141 102 70 34 -38 -72 246 368 142
3185 142 -107 267 -123 -61 -201 -21 40 -155 268 -6 83 -22 -69 -53 250 190 -79 79 -35 -21 -133 55
3207 55 -43 230 -225 -134 6 -76 91 35 130 -87 -43 282 -53 -213 69 -15 -162 -45 -38 -130 -84 92 -148 25
3231B5o7L7j05M4J8j23L20j02l6J89l03K68l48K54j39O8j6J5k6j33J32k61K48
3254d1j83L03j74K26j62p0O0j13j2j2P5J12K70k21m0l4L4J82j66K03j51P6M5l00
3278i3J53l2l7k66L27K28l06n9k2mK58k41K30j6j63N6J12j76J45K6k54L8LK92
3302A99k20%j0n5r7J65P8k4j3j30O1m5o1J1mK01pj4Q7k91K12J48l10q0K83j41
3328e7Oj8Q5p2P9j24P9J95j67j02K23L5l42L8Q0L52m76K81J44n2J5k41l5J27j61
3353a08J42K3r0K75l78J67j09ML2M9l6qj6Q7l9Q7k4n7K64j30j40J6j01P5n3K6
3379d2P7%j45Q6L4R5k08R9on5k9J48n7J19nk50Q0j7K01j17j80K5L17m8k61q8K45
3406A8j52J28J19r3J90k00j5J01P2k61nK3J58j06Q6kJ2J4k16N4K98n0k23j69J04
$$ plain form
3231 25 -42 -5 -110 -66 -48 -171 149 47 11 200 -103 165 -183 71 -68 0 -16 -1 -27 -160 -28 -289 -41
3254 -41 -224 79 -95 131 -31 -101 -41 -154 -166 -178 -103 9 279 58 18 -16 18 200 34 237 86 162 207 -93
3278 -93 60 28 -9 -275 52 280 -26 -85 -107 -111 147 -94 136 120 -43 13 125 -51 94 120 -134 -96 -93 199
3302 199 -21 -21 -31 -86 -183 -18 60 36 23 -107 -46 -91 -152 -141 -145 56 49 35 122 -169 43 191 -119 -199 84 -57
3328 -57 -51 -69 16 -56 23 -101 -22 173 6 -96 127 162 -180 -142 -62 290 -186 95 239 187 202 -39 -74 53 -108
3353 -108 34 57 -33 242 -136 31 -78 -74 -42 7 -29 -37 -53 34 -5 82 58 1 265 135 -5 11 -90 -15 -68 -42
3379 -42 35 35 -110 -24 10 105 -103 -4 -10 -65 -94 54 -3 116 111 -139 -59 -76 125 8 -172 -147 170 122 -139 -227 18
3406 18 -134 -6 113 20 210 10 -5 96 168 -93 -98 -75 83 -23 63 61 73 87 -129 -75 223 173 -50 -219 -115
3431a15J39qo7O0k61K50O2p0j2Jo1j6J8J94L5J17k82L4K51l52J13J5M6l11L48
3456A28j56j64k9K75j19Q1P0K22k46k20J77J56j85k1Rq5J02J96l9l61J19Q0J31
3479A21r3j88j05K34N9K5q1J01r7R2mO4l9l14J07K28J69m75K29J52k06k09K37
3502Gk00L09Q1j29l4J16j83K14l02L02k48K36k44Q8R9J11j16j93K91k61Lj12L07
3525A42R1k89K29k89M2K63j88j32j3O7K92l53J21K37k04J9j07R8j01L5J40lj63
3548f6J06j66j7j37N01q8m7k7J44k25l7q0K15o1J11k24J17R2J1N5m01N76l85J53
3572A20j14J63k76Q9L02l16j1P3N9j40p2j24M1J54R0O4N3k57J6J93O5q2ok89L25
3597A20j16P3l9J64j99n9K3k93L07J18m41K40J33N5l59L27j91J84j18j98L85L4
$$ plain form
3431 -115 24 16 -51 9 -252 -2 60 -10 -22 -21 -82 -98 -80 114 149 266 -16 18 269 -83 30 45 91 -220 128
3456 128 -28 -192 -221 54 -65 16 86 308 62 -158 19 175 -10 -31 -22 -107 -5 191 152 -209 -90 -10 121
3479 121 28 -160 -265 -31 28 53 -28 73 -24 68 64 128 89 -225 -118 110 279 -196 33 185 -21 -230 7
3502 7 -193 116 197 68 34 150 -33 181 -121 181 -67 169 -75 13 112 223 107 -86 205 -56 -53 -165 142
3525 142 233 -56 173 -116 -74 189 1 -131 -144 -77 215 -138 -17 220 16 35 -72 26 -75 -40 100 97 -66
3548 -66 40 -126 -143 -280 221 133 86 59 203 -22 -59 -139 76 15 126 -98 19 111 122 177 -224 352 -33 120
3572 120 6 169 -107 -18 284 -32 -43 30 89 -51 -123 -247 -206 -52 38 102 155 -102 -86 107 172 90 84 -205 120
3597 120 4 77 38 202 3 -56 -33 -326 -19 99 -342 -102 31 86 -273 54 -137 47 -71 -269 116 150
3619A50j06j52J17ljJ47M2k12m0L1l4R4o4J73J01k81K17j64j03N1J0j94J38J21
3643C8Q9j44K38J0j21o5j14j9J58R7Kl09J95K22k74R2k67K12J74j31J1j15k2R5
3667E2J4m51L37J83k55j28K9J81J41l86L37j42k8O0M3P9N9j70p4J47k3M1o5N8
3691C9j86J34J61j79J39n4j01p8Q2q8K46k78K80j15JL0j38L58j51m6j90J76l4
3714HK54j77j46J92N7j28o9j95J23R8j23n5N8j34L01j2j34j31J61J75o7j21j25
3737a90L08L9j41J19q6J04j67j17K50l84M82J7k91j13P9M0J05R0j81n8j29L17
3759I3o0j21Q3j51K04k9j36J05q1L00k23QJ39j85J21o5j61K66j30J97m08M1Q4
3782a09M7n8P2o0l8K25l14L22k31K13k59J58j2L4O7k13K67j38J19rj9k22J96J86
$$ plain form
3619 150 44 -108 9 6 5 152 194 -18 -58 -27 -61 33 -31 142 243 -38 179 15 -88 -37 -27 -221 -83 38
3643 38 127 -17 221 231 110 45 -69 -88 70 167 169 -140 55 277 3 95 -172 40 214 83 94 -21 -43 52
3667 52 66 -385 -48 135 -120 -248 -219 -38 103 -283 54 -88 -116 -56 -13 66 125 -45 -119 28 5 46 -19 39
3691 39 -147 -13 148 -31 108 54 -47 -125 -43 -131 115 -163 117 2 3 33 -105 253 102 56 -134 42 8
3714 8 262 85 -61 131 188 60 -9 -204 -81 17 -106 -161 -103 -237 64 52 -82 -213 -52 123 56 -65 -190
3737 -190 118 157 16 135 49 153 -14 -131 119 -265 217 234 -57 -170 -91 -51 54 144 -37 -95 -224 93
3759 93 33 -88 -5 -156 48 19 -117 -12 -93 207 -16 -8 131 -54 67 2 -159 107 -23 174 -234 -193 -109
3782 -109 -62 -120 -48 -108 -146 79 -235 87 -144 69 -190 -32 -44 -10 57 -156 111 -27 92 83 64 -158 38 224
3806B24j62l05L94r4l1P3J0r8Nm8l2P5M8K03l36J07m3P4j29p1J39Q3ko9ko3r5
3833a45K58j04q2O0O2k3oj62J56R9k00O2J74l30J33m4J74qj94j28K63k3P9q8M
3858a3J23J08k09L5K9j31P5O0j76K31K5k24J44K00m07J83l7j71kR8J88q1j28J22
3882D2j37l4L49k06O3o3J00J01o6K6q0l6q9j25K16l13K41J25k64K22o0r9k61K31
3906a17K48l33jJ66J08M6J26k37J20R6l48J43J68m5n7r1K7J92l19J41j85K80k80
3929a52J60n2p6j13K32m0k78J54J24J4j11M31k92K2j05j27K90j80j26M00l7k15
3951g7M7J24o6j4j34N5P7j34J65j40J00O6k24K17P6l00MJ67N0q8j51N3J05M3K68
3976B89k25N7k14K95J06l71j8j27K37J37k2j58K55k58q7J7K42n0l9j97L64M8k57
$$ plain form
3806 224 62 -243 151 57 26 99 109 11 16 -32 -64 11 59 262 -74 33 -10 64 -65 -136 3 86 84 15 13 -50 -145
3833 -145 113 9 -73 -13 49 26 20 -142 14 113 -87 -25 149 -181 -48 -92 82 74 -120 -248 15 -8 71 -17 -13
3858 -13 110 218 9 44 73 -58 17 77 -99 132 157 -67 77 277 -130 53 16 -155 -157 -59 129 48 -80 42
3882 42 -95 -129 220 14 77 14 114 215 149 175 95 59 -30 -155 61 -252 -11 114 -150 72 12 -87 -348 -117
3906 -117 131 -202 -203 -37 71 117 243 6 126 222 -126 17 185 140 83 -8 19 211 -108 33 -152 128 -152
3929 -152 8 -44 -120 -233 -1 -41 -319 -165 -41 -27 -138 293 1 23 -82 -209 81 -99 -225 175 138 -77
3951 -77 -30 94 28 14 -120 -65 12 -122 43 -97 3 69 -155 62 138 -162 -158 9 59 -29 -180 -127 -22 21 289
3976 289 64 121 -93 202 308 -63 -81 -208 29 166 144 -14 241 -17 -104 -87 155 105 66 -131 233 281 24
3999B4L7J13j34l06R0K21q6j2J44l33J54J54l24N13k30N9J30l56J23K35r3j70
4021d7k3N2%n1K44j79m9J18O3m44N43j33l06K72j17J9o6j95J82O4JP0j51J61N5
$$ plain form
3999 24 61 174 40 -266 -176 45 -41 -53 91 -242 -88 66 -258 255 25 84 214 -142 -19 216 123 -47
4021 -47 -70 -18 -18 -69 175 -4 -53 65 128 -316 227 94 -212 60 -57 -38 -104 -299 -117 -53 -52 18 -133 28 83
$$ [...]
8191d0
##END NTUPLES=NMR FID
##END=
