##TITLE=1H_LR-618-R3-CR18-TFA
 CDCl3, 8 sc, 
 28.06.2021
##JCAMPDX= 6.0         $$ Bruker NMR JCAMP-DX V2.0
##DATA TYPE= NMR FID
##DATA CLASS= NTUPLES
##ORIGIN= UXNMR, Bruker Analytische Messtechnik GmbH
##OWNER= root
$$ XWIN-NMR		Version 3.5
$$ Mon Jun 28 12:26:01 2021 Russian Standard Time (UT+4h)  she@DPX200
##.OBSERVE FREQUENCY= 200.131506
##.OBSERVE NUCLEUS= ^1H
##.DELAY= (6, 6)
##.ACQUISITION MODE= SIMULTANEOUS
##.ACQUISITION SCHEME= undefined
##.AVERAGES= 8
##.DIGITISER RES= 18
##SPECTROMETER/DATA SYSTEM= spect
##.PULSE SEQUENCE= zg30
##.SOLVENT NAME= CDCl3
##.SHIFT REFERENCE= (INTERNAL, CDCl3, 0, 15.7039)
##AUDIT TRAIL= $$ (NUMBER, WHEN, WHO, WHERE, WHAT)
$$ ##TITLE= Audit trail, XWIN-NMR		Version 3.5
$$ ##JCAMPDX= 5.01
$$ ##ORIGIN= Bruker BioSpin GmbH
$$ ##OWNER= she
$$ F:/spectra/data/she/nmr/H-F/1/audita.txt
$$ ##AUDIT TRAIL=  $$ (NUMBER, WHEN, WHO, WHERE, WHAT)
(   1,<2021-06-28 12:24:52.07 +0400>,<she>,<DPX200>,
      <created by zg, POWCHK disabled, PULCHK disabled
       configuration hash MD5:
       00 E9 B6 7A A2 85 ED C7 34 08 36 98 17 FE 4E 26
       data hash MD5: 16K
       83 A6 1B 94 43 49 4F 7D 99 54 B9 2A C8 26 B3 EC>)
$$ ##END=
$$ 
$$ hash MD5
$$ 8F 1B D3 E8 87 0B D4 81 A0 CF 7B 58 E2 E4 80 C9
##$RELAX= 
##$RELAX= 
##$RELAX= 
##$RELAX= 
##$RELAX= 
##$RELAX= 
$$ Bruker specific parameters
$$ --------------------------
##$DU= <F:/spectra>
##$EXPNO= 1
##$NAME= <H-F>
##$PROCNO= 1
##$TYPE= <nmr>
##$USER= <she>
##$AMP= (0..31)
100 100 100 100 100 100 100 100 100 100 100 100 100 100 100 100 100 100 
100 100 100 100 100 100 100 100 100 100 100 100 100 100 
##$AQSEQ= 0
##$AQ_mod= 1
##$AUNM= <au_zg>
##$AUTOPOS= <>
##$BF1= 200.13
##$BF2= 200.13
##$BF3= 200.13
##$BF4= 200.13
##$BF5= 200.13
##$BF6= 200.13
##$BF7= 200.13
##$BF8= 200.13
##$BYTORDA= 1
##$CFDGTYP= 0
##$CFRGTYP= 5
##$CHEMSTR= <none>
##$CNST= (0..31)
1 1 145 1 1 1 1 1 1 1 1 1 1 1 1 1 1 1 1 1 1 1 1 1 1 1 1 1 1 1 1 1 
##$CPDPRG= <>
##$CPDPRG1= <>
##$CPDPRG2= <>
##$CPDPRG3= <>
##$CPDPRG4= <mlev>
##$CPDPRG5= <mlev>
##$CPDPRG6= <mlev>
##$CPDPRG7= <mlev>
##$CPDPRG8= <mlev>
##$CPDPRGB= <>
##$CPDPRGT= <>
##$D= (0..31)
0 1.2 0 0 0 0 0 0 0 0.06 0 0.03 0 0 0 0 0.0002 0 0 0 0 0 0 0 0 0 0 0 0 
0 0 0 
##$DATE= 1624868691
##$DBL= (0..7)
120 120 120 120 120 120 120 120 
##$DBP= (0..7)
150 150 150 150 150 150 150 150 
##$DBP07= 0
##$DBPNAM0= <>
##$DBPNAM1= <>
##$DBPNAM2= <>
##$DBPNAM3= <>
##$DBPNAM4= <>
##$DBPNAM5= <>
##$DBPNAM6= <>
##$DBPNAM7= <>
##$DBPOAL= (0..7)
0.5 0.5 0.5 0.5 0.5 0.5 0.5 0.5 
##$DBPOFFS= (0..7)
0 0 0 0 0 0 0 0 
##$DE= 6
##$DECBNUC= <off>
##$DECIM= 32
##$DECNUC= <off>
##$DECSTAT= 4
##$DIGMOD= 1
##$DIGTYP= 9
##$DL= (0..7)
0 120 120 120 120 120 120 120 
##$DP= (0..7)
150 150 150 150 150 150 150 150 
##$DP07= 0
##$DPNAME0= <>
##$DPNAME1= <>
##$DPNAME2= <>
##$DPNAME3= <>
##$DPNAME4= <>
##$DPNAME5= <>
##$DPNAME6= <>
##$DPNAME7= <>
##$DPOAL= (0..7)
0.5 0.5 0.5 0.5 0.5 0.5 0.5 0.5 
##$DPOFFS= (0..7)
0 0 0 0 0 0 0 0 
##$DQDMODE= 0
##$DR= 18
##$DS= 0
$$ [...]
##$SUBNAM2= <"">
##$SUBNAM3= <"">
##$SUBNAM4= <"">
##$SUBNAM5= <"">
##$SUBNAM6= <"">
##$SUBNAM7= <"">
##$SUBNAM8= <"">
##$SUBNAM9= <"">
##$SW= 20.0188882624521
##$SWIBOX= (0..15)
0 0 2 0 0 0 0 0 0 0 0 0 0 0 0 0 
##$SW_h= 4006.41025641026
##$TD= 16384
##$TD0= 1
##$TE= 0
##$TE2= 300
##$TE3= 300
##$TEG= 300
##$TL= (0..7)
0 120 120 120 120 120 120 120 
##$TP= (0..7)
150 150 150 150 150 150 150 150 
##$TP07= 0
##$TPNAME0= <>
##$TPNAME1= <>
##$TPNAME2= <>
##$TPNAME3= <>
##$TPNAME4= <>
##$TPNAME5= <>
##$TPNAME6= <>
##$TPNAME7= <>
##$TPOAL= (0..7)
0.5 0.5 0.5 0.5 0.5 0.5 0.5 0.5 
##$TPOFFS= (0..7)
0 0 0 0 0 0 0 0 
##$TUNHIN= 0
##$TUNHOUT= 0
##$TUNXOUT= 0
##$USERA1= <user>
##$USERA2= <user>
##$USERA3= <user>
##$USERA4= <user>
##$USERA5= <user>
##$V9= 5
##$VALIST= <valist>
##$VCLIST= <CCCCCCCCCCCCCCC>
##$VD= 0
##$VDLIST= <DDDDDDDDDDDDDDD>
##$VPLIST= <PPPPPPPPPPPPPPP>
##$VTLIST= <TTTTTTTTTTTTTTT>
##$WBST= 1024
##$WBSW= 4
##$XGAIN= (0..3)
0 0 0 0 
##$XL= 0
##$YL= 0
##$YMAX_a= 220797
##$YMIN_a= -251639
##$ZGOPTNS= <>
##$ZL1= 120
##$ZL2= 120
##$ZL3= 120
##$ZL4= 120
##$ABSF1= 10
##$ABSF2= 0
##$ABSG= 5
##$ABSL= 3
##$ALPHA= 0
##$AQORDER= 0
##$ASSFAC= 0
##$ASSFACI= 0
##$ASSFACX= 0
##$ASSWID= 0
##$AUNMP= <proc_1d>
##$AZFE= 0.1
##$AZFW= 0.1
##$BCFW= 1
##$BC_mod= 2
##$BYTORDP= 1
##$COROFFS= 0
##$CY= 11.3945322036743
##$DATMOD= 1
##$DC= 2
##$DFILT= <>
##$DTYPP= 0
##$F1P= 15.9154993809931
##$F2P= -4.1035820241983
##$FCOR= 0.5
##$FTSIZE= 0
##$FT_mod= 4
##$GAMMA= 1
##$GB= 0.15
##$INTBC= 1
##$INTSCL= 1
##$ISEN= 128
##$LB= 0.24
##$LEV0= 0
##$LPBIN= 0
##$MAXI= 10000
##$MC2= 0
##$MEAN= 0
##$ME_mod= 0
##$MI= 1.114404
##$NCOEF= 0
##$NC_proc= 0
##$NLEV= 6
##$NOISF1= 3.799351
##$NOISF2= 2.8
##$NSP= 1
##$NTH_PI= 0
##$NZP= 0
##$OFFSET= 15.70392
##$PC= 1
##$PHC0= -11576.89
##$PHC1= 17.00101
##$PH_mod= 1
##$PKNL= yes
##$PPARMOD= 0
##$PSCAL= 0
##$PSIGN= 0
##$REVERSE= no
##$SF= 200.130013532006
##$SI= 16384
##$SIGF1= 3
##$SIGF2= 2
##$SINO= 400
##$SIOLD= 16384
##$SREGLST= <1H.CDCl3>
##$SSB= 0
##$STSI= 0
##$STSR= 0
##$SW_p= 3612.71676300578
##$SYMM= 0
##$S_DEV= 0
##$TDeff= 0
##$TDoff= 0
##$TI= <>
##$TILT= no
##$TM1= 0
##$TM2= 0
##$TOPLEV= 0
##$USERP1= <user>
##$USERP2= <user>
##$USERP3= <user>
##$USERP4= <user>
##$USERP5= <user>
##$WDW= 1
##$XDIM= 8192
##$YMAX_p= 0
##$YMIN_p= 0
$$ End of Bruker specific parameters
$$ ---------------------------------
##NTUPLES= NMR FID
##VAR_NAME=  TIME,          FID/REAL,        FID/IMAG
##SYMBOL=    X,             R,               I
##VAR_TYPE=  INDEPENDENT,   DEPENDENT,       DEPENDENT
##VAR_FORM=  AFFN,          ASDF,            ASDF
##VAR_DIM=   8192,          8192,            8192
##UNITS=     SECONDS,       ARBITRARY UNITS, ARBITRARY UNITS
##FACTOR=    0.0002496,     1,               1
##FIRST=     0,             0,               0
##LAST=      2.0444736,     0,               0
##MIN=       0,             -251639,         0
##MAX=       2.0444736,     220797,          0
$$ Real data points
##PAGE= N=1
##DATA TABLE= (X++(R..R)), XYDATA
$$ [...]
1734f3p2J34L6j90p4M26n6k7k23j29K50k2J99j68j5p9P3j3N3J12j28J16j20J58
$$ -63 -135 -1 35 -155 -229 197 141 114 -109 -238 12 -10 189 21 6 -73 0 -13 40 152 24 140 20 178
1758A78%r6j52K08p2J70k41K75j35L0k17l8J40P2J38k85K3rNJ68L0j83K2k7M0
$$ 178 178 82 -70 138 66 236 -5 270 135 165 -52 -90 50 122 260 -25 -2 -11 -6 162 192 9 31 4 44
1783D4nJ60l3k46J52k6Mm70M64k86J67O0J80j76J12k85l8M5K16j86l0q7r7K4L16
$$ 44 39 199 166 -80 72 46 50 -420 44 -242 -75 -15 165 -11 101 -184 -222 -177 39 -147 -177 -264 -361 -337 -21
1808b1n0j8p3q9R6R6K01k27j38J58j22P6J59K8l62J69J00q5J62j01qn7J34M5K22
$$ -21 -71 -89 -162 -251 -155 -59 142 -85 -223 -65 -187 -111 48 76 -286 -117 -17 -102 60 -41 -49 -106 28 73 295
1833B95k96j74L09O7j52j79nN6K78j83NK6KJ26k86Q7J64l9J02j84J5O6j96J96
$$ 295 -1 -175 134 201 49 -130 -135 -79 199 16 21 47 49 175 -111 -24 140 101 203 19 34 100 -96 100
1857A00J41j63J95k04J5O0n7k6J34j02k06K50j9k52L52j70k03J45q1P9r4J99n3
$$ 100 241 78 273 69 84 144 87 61 195 93 -113 137 118 -134 218 48 -155 -10 -91 -12 -106 93 40
1880D0K46k95j14N3n0j6j63K50N1k18Q4J79l30J96j1J73k64o7K15j38J12K27n48
$$ 40 286 -9 -123 -70 -120 -136 -299 -49 2 -216 -132 47 -283 -87 -98 75 -189 -256 -41 -179 -67 160 -388
1903c88N29k60L6j82K42J83l92L24j66K00Nj22NJ35j39R1l79K05J77j19Q5L00
$$ -388 141 -119 -83 -265 -23 160 -232 92 -74 126 131 9 14 149 10 101 -278 -73 104 -15 70 370
1925C70n75J18J11j33M6L07j14j60O5J20j13K50j03o2j82J52K3n6n0J41j51K56
$$ 370 -205 -87 24 -109 -63 244 130 -30 35 155 42 292 189 127 -55 97 120 64 14 155 4 260
1947B60Qk69J43Q6M4l01J79J4N3p2j3j55K75l53j3J57m6K7J0mk1O7j42K9K16k06
$$ 260 268 -1 142 228 272 -29 150 164 217 145 132 -23 252 -101 -114 43 -3 24 34 30 9 76 -66 -37 179 -27
1973b7O3j43N0K92l45J08k58K35j27Q4j6K10l05Nk3K52J2j64j3q9K29K96m17p5
$$ -27 36 -107 -57 235 -110 -2 -260 -25 -152 -68 -84 126 -179 -174 -197 55 67 -97 -110 -199 30 326 -91 -166
1997a66m2j4L45j63M4n9np9J90j13O7j04p1J99K49j65j58J08k03K53L7j84M4M5
$$ -166 -208 -222 123 -40 4 -55 -60 -139 51 -62 5 -99 -170 29 278 113 -45 63 -140 113 150 -34 10 55
2021E5J84j81o6J27o6j27K11n0N8k18L02k11P6j50L03o8O5m7o3p3j62J92K6l3
$$ 55 239 58 -8 119 53 -74 137 87 145 -73 229 18 94 -56 247 179 244 197 134 61 -101 91 117 84
2045H4j50L59k2l22J76n2m3m8J3j86K97J80j04k92k18O45m62O5N2n2K18j80pj43
$$ 84 -66 293 271 -51 125 73 30 -18 -5 -191 106 286 182 -110 -328 317 -145 -80 -28 -80 138 -42 -49 -192
2069a92L37m11L41q1K47m08J48j78P6J77k76R4R1m02K95P5o2J15J24k57k9k8j02
$$ -192 145 -266 75 -6 241 -167 -19 -197 -121 56 -220 -126 -35 -437 -142 -67 -129 -14 110 -147 -176 -204 -306
2092c06L37j94J54O7l20K56Qj88J92J75R8k90m4L09k09J23k94J71Q8k05J02j09
$$ -306 31 -163 -9 58 -262 -6 2 -186 6 181 279 -11 -55 254 45 168 -126 45 133 -72 30 -79
2114g9K27j58J2L48n9l75J88J94n1j77K21l08J23m33M06J58m99J94Q2k1J73r6
$$ -79 148 -10 2 350 291 -84 104 298 247 70 291 -17 106 -327 79 237 -262 -68 14 -7 166 70
2136G0R7j87J16J33J28k89l8M0N8j5k12J21j10J45k62j28K69J0j07K50l37r4R9
$$ 70 167 -20 96 229 357 68 30 70 128 113 -99 22 -88 57 -205 -333 -64 -54 -161 89 -248 -342 -243
2159b43J29l20L12J88j35l1J43Kj54L7j46L46k62j39K32o8J23m77K61R1K9Q0M7
$$ -243 -114 -434 -122 66 -69 -100 43 45 -109 -72 -218 128 -134 -273 -41 -109 14 -463 -202 -111 -82 -2 45
2182D5m07K24J00l2N6M9q2k2J48j19K04j29j30J02r2L58j17M6k36R8J01k15O6
$$ 45 -362 -138 -38 -70 -14 35 -47 -69 79 -40 164 35 -95 7 -85 273 156 202 -34 64 165 -50 16
2205A6o6J50j14m1K86k06P0p3j2mk0J79n5l8q2Q0M4k89Q9K45j0q2o6k25J75r6
$$ 16 -50 100 -14 -55 231 25 95 22 10 6 -14 165 110 72 -10 70 114 -175 -86 159 149 67 1 -224 -49 -145
2231a45p4L8J4J18J97o5n4o6J79m5J42j02k27J49k99K33o3o3J97k60j33M03j21
$$ -145 -219 -181 -167 -49 148 83 29 -37 142 97 239 137 -90 59 -240 -7 -70 -133 64 -196 -329 74 -47
2254d7R1j89K89k08p2J41J9j97K4Q6j42L52j32q6k35L20r6L7k61K96j90M1J5N0
$$ -47 44 -145 144 -64 -136 5 24 -173 -149 -63 -205 147 15 -71 -306 14 -82 -45 -306 -10 -200 -159 -144 -94
2278i4K45o3m17K06J96p6P8%J15m32K40J19rlj22oK09j74J2mN0M7m1J80j41j64
$$ -94 151 88 -329 -123 73 -3 75 75 190 -242 -2 117 108 105 -17 -23 186 12 24 20 70 117 76 256 115 -49
2304d9K91J16m47M09k35m4M8J7j29K29j49j08k3O0J46m2J56l09P0j18J05r2jM00
$$ -49 242 358 -89 320 85 41 89 106 -23 206 57 -51 -74 -14 132 90 246 -63 7 -111 -6 -98 -99 301
2328C01k34j22r8L1K2J67J28m07K10j71J2L7J47p0k96M17j79L1j66o5J79o5l6
$$ 301 67 -55 -153 -122 -100 67 195 -212 -2 -173 -161 -124 23 -47 -343 74 -105 -74 -240 -305 -126 -191 -227
2351b27K31k87N15l76J4K26R9j05J42j83k90L62l20K28O5J67m26J00L31l39k1
$$ -227 4 -283 232 -144 -130 96 195 90 232 49 -241 121 -199 29 94 261 -165 -65 266 -73 -94
2372i4L90l94J28r2K42k97K30o5o1L5Q1j87j7L06j65r4J31o2j06K30q4P6j03k9
$$ -94 296 -98 30 -62 180 -117 113 48 -13 22 103 -84 -101 205 40 -54 77 15 -91 139 55 131 28 -1
2396aO6O8l5k8k2K2J05j33J84r1J2j4k79J20R4Q6j89N9k4k88K53q8R4M3o6j54
$$ -1 65 133 98 70 48 70 175 42 226 135 147 133 -146 -26 68 154 -35 24 0 -288 -35 -123 -29 14 -52 -206
2422b06K73Qj80K4J11Q0l89J84M56m54J10j80PL00k61O5j84j78J24L24k22K65
$$ -206 67 75 -105 -81 30 110 -279 -95 361 -93 17 -163 -156 144 -117 -52 -236 -414 -290 34 -188 77
2444G7j49k28L52p9j77K81j04j31K51m1k43R7K9K4J14j93j04K55j37k1L34k15
$$ 77 -72 -300 52 -27 -204 77 -27 -158 93 52 -191 -94 -65 -41 73 -120 -224 31 -106 -127 207 -8
2466hrK6J13j41L5J30p0p5J69j36Mp1J12J82n8k05k4lj2J03Lj88K9J36j8j68q5
$$ -8 -17 9 122 -19 16 146 76 1 170 34 38 -33 79 261 203 -2 -26 -29 -41 62 65 -123 -94 42 24 -144 -229
2493b29J60l1K6j01K58k71M3K59j17p4K47j33%j41J47j25N0m5R7k2j33O7q6J91
$$ -229 -69 -100 -74 -175 83 -188 -145 114 -3 -77 170 37 37 -104 43 -82 -32 -77 20 -2 -135 -68 -154 37
2517C7o1j3j62J11o4J19L9j74J7O1K25k88K8l3N6L8J03l01K75j8n0M1n6j0L71
$$ 37 -24 -37 -199 -88 -152 -33 6 -168 -151 -90 135 -153 -125 -158 -102 -64 39 -262 13 -5 -55 -14 -70 -80 291
2542B91k08l09M44k94K51j84Q6O8k04J78j70K60j94j98L1J46o7M5R3J14j88J23
$$ 291 83 -226 218 -76 175 -9 77 145 -59 119 -51 209 15 -183 -152 -6 -73 -28 65 179 -9 114
2564A14o5K72j71j89N64k93j31j78R1k08M50l53P4O7k8M5m6J42j55J26N6Q1k96
$$ 114 49 321 150 -39 525 232 101 -77 14 -194 256 -97 -23 44 16 61 15 157 2 128 184 265 -31
2587c1Q8k4j67J85j2r9LJ19K2K00m69J56q8%K39j8J39j62j27r9K18j47k25R2J23
$$ -31 57 33 -134 51 39 -60 -57 62 84 284 -185 -29 -117 -117 122 104 243 81 -46 -145 73 -74 -299 -207 -84
2612h4o5J20j9O4n9n7O6J6j6qO6k53J49K6M3O8k4k32N6m9Q2R0p3O4j52R5J51j20
$$ -84 -149 -29 -48 16 -43 -100 -34 -18 -34 -42 24 -229 -80 -54 -11 57 33 -199 -143 -192 -110 -20 -93 -29 -181 -86 65 -55
2640e5M5J84q5K8o3o7M2r0N8l3j71L74o4J17k17Oj06Q9O0n8o1J35q9K46K4l4L0
$$ -55 -10 174 89 117 54 -13 29 -61 -3 -36 -207 167 103 220 3 9 -97 -8 52 -6 -67 68 -21 225 249 215 245
2667B45o6nj53J54l7j89K15l36K24j33j4J08J8j63k1L30j59K70j25k80L21n32
$$ 245 179 174 21 175 138 -51 164 -172 52 -81 -95 13 31 -132 -153 177 18 288 163 -117 204 -328
2689c28L42j4o4K9J59j74j77m7M99k90J48K2j35L3l6l4L7O6p4R5P5k32J29J26
$$ -328 14 0 -64 -35 124 -50 -227 -274 225 -65 83 105 -30 3 -33 -67 -30 36 -38 57 132 -100 29 155
2713A55k83J5M6K14j24J28j37L5p7j5j50M48k45M8m20L35j06K41q2r8K05k52Q1
$$ 155 -128 -113 -67 147 23 151 14 49 -28 -43 -193 255 10 58 -362 -27 -133 108 26 -72 133 -119 -38
2736c8K94k39j12J37l37L21p8K89j53rj27K43k94L60k59M1j20K56R7p7k29L4O7
$$ -38 256 17 -95 42 -295 26 -52 237 84 75 -52 191 -103 257 -2 39 -81 175 272 195 -34 0 67
2759F7o5j38N10l28J46k20L26j01l55K45o9k67K14J08m9j15n0K34l8L10l43J27
$$ 67 2 -136 374 46 192 -28 298 197 -158 87 18 -249 -35 73 24 -91 -141 93 55 365 22 149
2781A49l15K11j78l9l7M49k04k86NK4L66l41Q4J25j19J47j02O4j79kJ96k79J98
$$ 149 -166 45 -133 -172 -209 240 36 -250 -245 -221 145 -196 -112 13 -106 41 -61 3 -176 -178 18 -261 -63
2804f3n3J30l5J94k14J6pN4k9j8j9O2k1j9N8J58k78J81j76L45l30J35j00lK46
$$ -63 -116 14 -21 173 -41 -25 -32 22 -7 -25 -44 18 -3 -22 36 194 -84 97 -79 266 -64 71 -29 -32 214
2829B14k85J59K02k33j18L11p2q3k7j50J72Q5J13k02k1j07R5N7j50L3l1R9N5j04
$$ 214 -71 88 290 57 -61 250 178 95 68 -82 90 175 288 86 65 -42 53 110 -40 -7 -38 61 116 12
2853A2J67k64r7M29J21j79J13j60l29M30l07j03LJ17q9J08K84l23l6P6j0N9MJ02
$$ 12 179 -85 -182 247 368 189 302 142 -187 243 -64 -167 -164 -47 -136 -28 256 -67 -103 -27 -37 22 26 128
2877A28k11K3j41K98l39K10j27J28j05J24R7j12o4J55k10oJ26k01J36r3O1K32
$$ 128 -83 -60 -201 97 -242 -32 -159 -31 -136 -12 85 -27 -91 64 -146 -152 -26 -227 -91 -184 -123 109
2899A09k84K01R8l09P2L7q2K3j51K61K15k28J62j68M4q5K13m6R1m43J64J30k17
$$ 109 -175 26 124 -185 -113 -76 -158 -135 -286 -25 190 -38 124 -44 0 -85 128 82 173 -270 -106 24 -193
2922a93J96M3l8P9k40K84l3j41K43j38r1K09j7J27l47J35o3K77l29K29k51L40
$$ -193 3 46 8 87 -153 131 98 -43 200 62 -29 180 163 290 -57 78 15 292 -37 192 -59 281
2944B81j39j70L47k33k08J45K30k74m4J20J75k66P3r5K19q4k12K10k77P4J64n4
$$ 281 142 -28 319 86 -122 23 253 -21 -65 55 230 -36 37 -58 161 77 -135 75 -202 -128 36 -18
2966a8J25j32l2j19J74o7K77k91J06j41K84Lj07k14m4M5O5O8KR0j58J60Kk38J59
$$ -18 107 -25 -57 -176 -2 -69 208 -83 23 -118 166 169 62 -152 -196 -151 -86 -18 -16 74 -84 76 78 -160 -1
2991aR9k92R7K7j5J49k23L34l4l25K81r2j59o1J18J10j85R2J65J5jk01r1J87L41
$$ -1 98 -194 -97 -70 -85 64 -159 175 141 -184 97 5 -154 -215 -97 13 -172 -80 85 100 99 -102 -193 -6 335
3016C35k18k89M39k9m2j01K62p0k59q6K7k23M96l74J55K26j17j46R3r2L5J40l0
$$ 335 117 -172 267 238 196 95 357 287 28 -58 -31 -254 242 -132 23 249 132 -14 79 -13 22 162 132
3039A32J55l39N5J08n5M8j19l3J13lk34J68m9N0m3K03r5k57K16o2O8k41J11J62
$$ 132 287 -52 3 111 56 104 -15 -48 65 62 -172 -4 -53 -3 -46 157 62 -195 21 -41 27 -214 -103 59
3063E9k00J59r9j98K35Lo3Q4K19Q7l00l3k03K34j9m2K55j61J3%p7J21J11k27m3
$$ 59 -141 18 -81 -279 -44 -41 -104 -20 199 286 -14 -47 -250 -16 -35 -77 178 17 30 30 -47 74 185 -42 -85
3088h5K93m9m12Q7J86k19J30rmJ88j99P0J9M5R1N3k57O6J08r8J3l0R4P5K7j65
$$ -85 208 159 -253 -166 20 -199 -69 -78 -82 106 -93 -23 -4 41 132 185 -72 -6 102 4 17 -13 81 156 183 18
3114A8J06k82J66K2k6J62j27J00k2j28k4J35k44L05Qj86n7K10Ml7Q7j10j23J4
$$ 18 124 -158 8 30 4 166 39 139 117 -11 -35 100 -144 161 169 -17 -74 136 140 103 190 80 -43 -29
3138b9Ko2J16q5j37R1J22r8j29J4J36r9K26j44k19L14j91M7L9q4J63O6l00L48
$$ -29 -27 -89 27 -58 -195 -104 18 -80 -209 -195 -59 -158 68 -76 -295 19 -172 -125 -86 -170 -7 59 -241 107
3162A07k33%j07J39Q2r5l8P6L34k78J53j72o3K31O5j36l01L52j87l3J65j39q0
$$ 107 -126 -126 -233 -94 -12 -107 -145 -69 265 -13 140 -32 -95 136 201 65 -236 116 -71 -104 61 -78 -158
3185a58J72R0j25J02K54l30N8k94L03j11p1j3K28j74q3p3m5K56p0l0J17J04K79
$$ -158 14 104 -21 81 335 5 63 -231 72 -39 -110 -123 105 -69 -152 -225 -270 -14 -84 -114 3 107 386
3208C86k54m1j79J97N9k29R8R6j0j55Q6p8L0J57k16O9O8n5K8K3j94J54k8K17k49
$$ 386 132 91 -88 109 168 -61 37 133 123 -32 54 -24 6 163 -53 16 84 29 57 80 -114 40 12 229 -20
3233b0j9p7K60m68M16n2j98K43l05J56O6O5k80J55j9K8jQ6j76J38%J86k88Q6N5
$$ -20 -39 -116 144 -324 92 40 -158 85 -220 -64 2 67 -213 -58 -77 -49 -50 36 -140 -2 -2 184 -104 -18 37
3258C7k9J80j59j1k66M92p1l07K68j31j55J46j25J24J5Q0k36M3M2p3l8J59N1k47
$$ 37 8 188 29 18 -248 244 173 -134 134 3 -152 -6 -131 -7 8 88 -148 -105 -63 -136 -174 -15 36 -211
3282b11L75q1k2m9j98J87q1L00k43K5pl7j65K79m0j05j86J9L62k35J20R1L4k06
$$ -211 164 83 61 12 -186 1 -80 220 -23 2 -5 -42 -207 72 32 -73 -259 -240 122 -113 7 98 132 -74
3306g4L03r4r2j82L04k41k4J11J69L3l12J49k5n3r5PK58k16J28j36K17l73J92
$$ -74 229 135 43 -139 165 -76 -100 11 180 213 -99 50 25 -28 -123 -116 142 -74 54 -82 135 -238 -46
3329d6j55J00l6k26L51l6M0O6q5l1N8oQ9n5n3r1J73j1Q4j61J67k43P4l7P3M8L4
$$ -46 -201 -101 -137 -363 -12 -48 -8 58 -27 -58 0 -6 83 28 -25 -116 57 46 130 -31 136 -107 -33 -70 3 51 85
3356H5n6J10m3J15k11j99K78J5j05L35l19o6K60p4j40K19Q9k20O3o0j8l3k9K9
$$ 85 29 139 96 211 0 -199 79 94 -11 324 5 -61 199 125 -15 204 293 73 136 76 58 25 -4 25
3380B5J01m3j19K66j65j6j70k4J87KK00l44J01J23k78L12k06j4K42k19P3k2l7
$$ 25 126 83 -36 230 65 49 -121 -145 42 44 244 -100 1 124 -154 158 -48 -62 180 -39 34 12 -25
3403b5jj08M6K02k69RR3J7o2R2J38q1j00J40L1j82r5K37l00K18j56L27k85J54
$$ -25 -26 -134 -88 114 -155 -146 -53 -36 -98 -6 132 51 -49 91 122 -60 -155 82 -218 0 -156 171 -114 40
3427D0L4j36k3R1M8k08K51k24j96J94Q5J86j82m5K8K25o8j58O6Q5J95k52M3j12
$$ 40 74 -62 -85 6 54 -154 97 -127 -323 -129 -44 142 -40 -85 -57 168 100 -58 8 93 288 36 79 -33
3451c3J2J59j10J40j7o7j8Q6j59j76J34K68k42j45J91k33L08j95J87j90K16l2
$$ -33 -21 138 28 168 151 84 66 152 -7 -183 -49 219 -23 -168 23 -210 98 -97 90 -100 116 84
3473H4j99L78k09L79l91o6R2J11k67K9J82k61K08o0N8j70jL14k14R5j4j23J73
$$ 84 -115 263 54 433 42 -24 68 179 -88 -59 123 -138 70 10 68 -102 -103 211 -3 92 78 -45 128
3496A28j38l6K5l2j89%K03P3j10n1J44J99k60L4k19J11L8J14k37J16O6J18j20
$$ 128 -10 -46 -21 -53 -242 -242 -39 34 -76 -127 17 216 -44 -10 -229 -118 -80 34 -203 -87 -21 97 -23
3519b3O7m7j43K14p5j8N5KM9m21J98J54j23k5J43J47r6P6k52R6K55k35p4K75q8
$$ -23 44 -3 -146 68 -7 -25 30 32 81 -340 -142 12 -111 -136 7 154 58 134 -118 -22 233 -2 -76 199 111
3544A11N1l3j16N5l29J09J24Q4j06R0M9rl7j10pM46m11l7J69k32J85K28k00ro4
$$ 111 162 129 13 68 -261 -152 -28 56 -50 40 89 80 43 -67 -74 372 -39 -76 93 -139 46 274 74 65 1
3569Aj19J7O6K44p7J70j82j35J11j33K15m14J99O3l7j53Q8L34j22r4j72N4O9K0
$$ 1 -118 -101 -35 209 132 302 120 -15 96 -37 178 -236 -37 26 -11 -164 -76 258 136 42 -130 -76 -7 13
3593A3k7j49K88lj96J9o7J57j03J39R3r1l21J46qj59K62O3j83Q3Oq1J04m7K39
$$ 13 -14 -163 125 122 -74 -55 -122 35 -68 71 164 73 -248 -102 -110 -269 -7 56 -127 -44 -38 -119 -15 -62 177
3618A77l11K37N3j30%j13j6M5R1k0m2M5P4l30K74J8j98K65j70M4r7M8N5j09J22
$$ 177 -134 103 156 26 26 -87 -103 -58 33 13 -29 16 90 -240 34 52 -146 119 -51 -7 -104 -56 -1 -110 12
3643A2p7J27q1M9j28J31j05J18r8k24K60K08j57Q9O6n2j71K35k88N8J48k72J10
$$ 12 -65 62 -19 30 -98 33 -72 46 -52 -276 -16 192 35 124 190 138 -33 202 -86 -28 120 -152 -42
3666d2R6j11K43J97o04J23N8K4J61j77nL71k98j46N9k06M05l09J75N0K23l58L3
$$ -42 54 -57 186 383 -221 -98 -40 -16 145 -32 -37 334 36 -110 -51 -257 148 -161 14 64 287 -71 -38
3689c8l4j31L04r0j30j05K7K65j3l35K13Q9J19k19m6K05jn33K18K68J97l88J98
$$ -38 -72 -203 101 11 -119 -224 -197 68 55 -280 -67 22 141 -78 -124 81 80 -453 -235 33 230 -158 40
3712D0j94J4O6j15J00M5P4j97K90Rj18K4J29q3o2J32j48L5o1J22J4n8R1k88L48
$$ 40 -154 -140 -74 -189 -89 -44 30 -167 123 132 14 38 167 84 22 154 6 41 -20 102 116 58 149 -139 209
3737B09n1j1m4L6l0O4K4k02J07p9M2k25K19j97J62o5R4Q3l87K00Q6lM7k03J10
$$ 209 158 147 103 139 109 173 197 -5 102 23 65 -160 59 -138 24 -41 53 136 -251 -51 35 32 79 -124 -14
3762a4j53K77j65N8J28k1j64P6P9j57n7J6R3Mk35L72j13j41J53N7J54j80o1r8
$$ -14 -167 110 -55 3 131 110 -54 22 101 -56 -113 -97 -4 0 -235 137 24 -117 36 93 247 67 6 -92
3786i2M9r1j3j41K82j15J58k47J97M5j04J52j41J54k25R3J75k71J23K1J73k29
$$ -92 -43 -134 -147 -288 -6 -121 37 -210 -13 32 -72 80 -61 93 -132 -39 136 -135 -12 9 182 -47
3808d7O6k8n4O8n3k2N5K75k42L2j96L16j60K18j59j94K00j54J00m0M0j69K32J40
$$ -47 19 -9 -63 5 -48 -70 -15 260 18 50 -146 170 10 228 69 -125 75 -79 21 -19 21 -148 84 224
3832B24m2n4p3K53k90l4o6R0L3J97j19L7j68k12J13L56j95j25J71j28J18j04l5
$$ 224 182 128 55 308 18 -16 -82 8 41 238 119 156 -12 -224 -111 245 50 -75 96 -32 86 -18 -53
3855e3m9K11k84J69j55L90r5j90k18J22K83k57J66K0p1k0J85p7k89J66L0Rn2J4
$$ -53 -102 109 -175 -6 -161 229 134 -56 -274 -152 131 -126 40 60 -11 -31 154 77 -212 -46 -16 -7 -59 -45
3879d5Nm4K36k05J79j25N9n8l8J33j63J04J75k0k57J50j02l4J87o2n11L31P8K01
$$ -45 -40 -84 152 -53 126 1 60 2 -36 97 -66 38 213 193 -64 86 -16 -50 137 75 -436 -105 -27 174
3903A74m0q0P2k8l0Kj31J03J69K1l58k3P0M0J60k44K15P0k58L03j2r7j9P8l20
$$ 174 134 54 126 98 68 70 -61 42 211 232 -126 -149 -79 -39 121 -123 92 162 -96 207 195 98 79 157 -163
3928a63J53j25n4k9K72j04L07n6l23L50k82o6K48J29j72M0j55O7o3m1J74j52j66
$$ -163 -10 -135 -189 -218 54 -50 257 201 -122 228 -54 -120 128 257 85 125 -30 37 -26 -67 107 -45 -211
3951b11L76j62k17L63k4k64J76O6K4p0k24M31j44j35j06J51n2L57l87k9Q9Rn9
$$ -211 165 3 -214 149 125 -139 37 103 127 57 -167 264 120 -15 -121 30 -22 335 -52 -81 8 17 -42
3974d2j13K81j31p2p6R7pK29m3m02L55j18j40J07Q4o3K33Jk44j71L11O9k28L72
$$ -42 -155 126 -5 -77 -153 -56 -63 166 123 -279 76 -42 -182 -75 9 -54 179 180 -64 -235 76 145 -83 289
3998B89l08J60j08R3k10n7L09k12J51J17k62J64J6r5J38k24J48l5j1j8j64J01
$$ 289 -19 141 33 126 -84 -141 168 -44 107 224 -38 126 142 47 185 -39 109 74 63 45 -119 -18
4020a8J93k45j90M75k87j83K00K25k01J07n7p8J76j15K6p7P3l0o6Q1j3q0K19K7
$$ -18 175 -70 -260 215 -72 -255 -55 170 -31 76 19 -59 117 2 28 -49 24 -6 -72 9 -4 -84 135 162
4044A62l46J32o9J06P3j43R5j44j62M35l42K55k41J74j99L32kk92L28o1k4l01
$$ 162 -184 -52 -121 -15 58 -85 10 -134 -296 139 -203 52 -189 -15 -214 118 116 -176 152 91 67 -234
4066b34K18l56J40L65j94j04J89K20k41L0L1j49q2J84O3N7m2jk01J31P1j6J53
$$ -234 -16 -372 -232 133 -61 -165 24 244 3 33 64 -85 -167 17 80 137 95 94 -107 24 95 79 232
4089B32l79K42j79J48k07J83j5J16j27J79r3j41J99j28j7k48J99k8k8J27Rj83
$$ 232 -147 95 -84 64 -143 40 25 141 14 193 100 -41 158 30 13 -235 -36 -64 -92 35 44 -139
4111a39J40o6R4j43R2K30j19O4J01k19j77K20k13J15r4O3P0j81L9J4M9J47%K43
$$ -139 1 -65 29 -114 -22 208 89 153 254 35 -142 78 -135 -20 -114 -51 19 -162 -123 -109 -60 87 87 330
4135C30m75J82j64J86k55K31j91J70L6k82K25K5J1MP6j8n4r2l9J5J48K5O2j44
$$ 330 -145 37 -127 59 -196 35 -156 14 50 -232 -7 18 29 33 109 91 37 -55 -94 -79 69 94 156 12
4159A2k43J77M4k02J28P4j88K3L63j54J07j17l9M1L4m9p3L7J26k1j00j04J07K07
$$ 12 -231 -54 -10 -212 -84 -10 -198 -175 188 34 141 24 -15 26 60 11 -62 -25 101 80 -20 -124 -17 190
4183A90j15o8K14j90j1J06j62l7L09j57j13lK95k65J72j18Lj34o7J59K7Q0k59
$$ 190 75 7 221 31 20 126 -36 -73 236 79 -34 -37 258 -7 165 47 50 -84 -151 8 35 115 -144
4206a44K9J06L9o9p7K85Nl54P8q8L44n01L52K7J23l1k39J59J15k66L21j10k22
$$ -144 -115 -9 30 -39 -116 169 174 -180 -102 -190 154 -347 5 32 155 124 -115 44 159 -107 214 104 -118
4229a18K9L51j10l16J85m8p6L6l8Q2KQ8qk89J30J08j06K63j59j3J24k36Q7p0J24
$$ -118 -89 262 152 -164 21 -27 -103 -67 -105 -23 -21 67 59 -230 -100 8 -98 165 6 -7 117 -119 -32 -102 22
4254B2j45R9R6q0j25J75q1p3K46K23k87l1k65J14j34J85L61m44Q1l6K35j35J45
$$ 22 -123 -24 72 -8 -133 42 -39 -112 134 357 70 39 -226 -112 -246 -61 300 -144 -63 -99 136 1 146
4277A46N6l84N4L48k93n6J56J54j64k23K36j15n3K49m5q6M6n5K1J33k9q5n4j39
$$ 146 202 -182 -128 220 -73 -129 27 181 17 -206 30 -85 -138 111 66 -20 26 -29 -8 125 96 11 -43 -182
4301a82K69j48k5k1J02J15N6j84J59J1k31J12J5N6k0J37j78N4k63J50n4K16k31
$$ -182 87 -61 -86 -107 -5 110 166 -18 141 152 -79 33 48 104 84 221 43 97 -166 -16 -70 146 -85
4324h5n3O1K67k95O5J51o1k69J70q0J40j82J56J30j19o6k5K50l29N7L70l32K44
$$ -85 -138 -77 190 -105 -40 111 50 -219 -49 -129 11 -171 -15 115 -4 -70 -95 155 -174 -117 253 -79 165
4347A65k90J43J98l13L02l08J39j82K28K77k28j66q8M7L33k17J06j74j7M00m20
$$ 165 -125 18 216 -97 205 -103 36 -146 82 359 131 -35 -123 -76 257 40 146 -28 -45 355 -65
4368f5OM3Q3k26K74Ok60L21m8l5o6P2k28J68R0m7m94L73P4j24R6j10K70M8j82
$$ -65 -59 -16 67 -159 115 121 -139 182 134 99 33 105 -123 45 135 88 -406 -33 41 -83 13 -97 173 221 39
4393C9N9J28l6j32N4j25K5Q9J13j07k26J58P0J13k01o4J94k43J61j08J12K37j9
$$ 39 98 226 190 58 112 -13 12 101 214 107 -119 39 109 222 21 -43 151 -92 69 -39 73 310 291
4416B91k34j83J75K2n8l9L9MJ24k15J41j20n5p0J41r0k1N6J8R9%J37R6k75k6k0
$$ 291 57 -126 49 71 13 -26 13 17 141 -74 67 -53 -108 -178 -37 -127 -148 -92 -74 25 25 162 258 -17 -43 -63
4442f3K9J74j3j86J92k22Q0J75k64K3j59L11j41O1l6o1K2k0J69r1J21j5j48K21
$$ -63 -34 140 127 -59 133 -89 -9 166 -98 -75 -234 77 -64 -3 -39 -100 -78 -98 71 -20 101 86 -62 159
4466A59j18J8k48L36mk13K23p7J2J69k68M9J04k46P7Q9j25J07J08n00M82j51J13
$$ 159 41 59 -189 147 143 -70 153 76 88 257 -11 38 142 -104 -27 62 -63 44 152 -348 134 -17 96
4489I6kj8Mj82L04j11N8j15K04l46P5k0Q5k05K12l27J94J50q3J62k53K67j04J35
$$ 96 94 76 80 -102 202 91 149 34 238 -108 -33 -53 32 -173 39 -288 -94 56 -27 135 -118 149 45 180
4513A80J5l12L3J0K34l10m1j39K96R2j78j2J53O4J02j74J77j84j93J86J2J43m36
$$ 180 195 -117 -84 -74 160 -150 -191 -330 -34 58 -120 -132 21 85 187 13 190 6 -187 -1 11 154 -282
4536b82K23J74k52J44p6kJ23n6P9j36L2JQ1j9Jk26J89Q3j77p1L67J15n59J30L05
$$ -282 -59 115 -137 7 -69 -71 52 -4 75 -61 -29 -28 53 34 35 -191 -2 81 -96 -167 200 315 -244 -114 191
4561A91m65L59N6k39j90J22K2L0M94m96L7K61k45K1K58R5m64K74m6o1m54M01l0
$$ 191 -274 85 141 -98 -288 -166 -144 -114 380 -116 -79 182 -63 -42 216 311 -153 121 75 14 -440 -39 -69
4584f9Q2j35K12k69K81j28K89j08k47J96r9j8J34J50k28j30P2O9J21k76l42N81
$$ -69 13 -122 90 -179 102 -26 263 155 -92 104 5 -13 121 271 43 -87 -15 54 175 -101 -443 138
4606A38k84J52R2l42P4K16l1L3j27N7j47J5L0j48K7p3J08J27%k4n8J71j77J70
$$ 138 -146 6 98 -244 -170 46 15 48 -79 -22 -169 -154 -124 -272 -245 -318 -210 -83 -83 -107 -165 6 -171 -1
4630aJ28j19l8J38J53l67o6l4L46j68k59K92J74k28J13k00O7K55j20k9p1R8j99
$$ -1 127 8 -30 108 261 -106 -172 -206 140 -28 -287 5 179 -49 64 -136 -69 186 66 37 -34 64 -135
4653a35n9K46n8p0J11j94J91j74K64l79K22k9K57k5k17q9K03k30P0Kr8L69l10
$$ -135 -194 52 -6 -76 35 -159 32 -142 122 -257 -35 -64 193 168 -49 -138 65 -165 -95 -93 -191 178 -132
4676a32K05j29j5m8J22r4K32k24K40J24m28K2oJ14O6j6k7K1P0J3k05P0j30j12
$$ -132 73 -56 -71 -119 3 -91 141 -83 157 281 -147 -125 -131 -17 49 33 6 27 97 110 -95 -25 -155 -267
4700b67K20j87K11o4J09j69L13k59J37R4k37l9m8J20K5J23j24K41k00k09l9J98
$$ -267 -47 -234 -23 -87 22 -147 166 -93 44 138 -99 -138 -186 -66 -41 82 -42 199 -1 -210 -249 -51
4722e1K92k70N5J73n15L11k1N2q9k6j47K03O4q3Q1j36oJ57l5j14J34o3j20J92
$$ -51 241 -29 26 199 -316 -5 -26 26 -63 -89 -236 -33 31 -52 29 -107 -113 44 9 -105 29 -34 -154 38
4746C8K2n9j15J88j22j81J1K12o3j35P4j12L36j92J34j22N3q3K78l7k52K08N9
$$ 38 60 1 -114 74 -48 -229 -218 -6 -69 -204 -130 -242 94 -98 36 -86 -33 -116 162 125 -127 81 140
4769A40k7k47J16J15k17J86P6j83J51K12Rl57K8j03J36j67R3r4L7P1k6J1k40L65
$$ 140 113 -134 -18 97 -120 66 142 -41 110 322 331 -26 2 -101 35 -132 -39 -133 -96 -25 -51 -40 -280 85
4793H5j78J45j20k6o5K12nL9qo3n4K04M4R2l45k4m7J38P6o2o7j81M07l73J96k18
$$ 85 -93 52 -68 -94 -159 53 48 87 79 16 -38 166 210 302 -43 -67 -114 24 100 38 -29 -210 197 -176 20 -198
4819a98J27J47j14J7L2m4q9K96m6l65K25j87kK70q1MJ83k70P0J20o5O6j87J7L68
$$ -198 -71 76 -38 -21 11 -33 -122 174 128 -237 -12 -199 -201 69 -12 -8 175 -95 -25 95 30 96 -91 -74 294
4844B94j85j6k8j32j17J54qj34K63j38K15k99J13k44M29l64L47j6m61K97K49k33
$$ 294 109 93 65 -67 -184 -30 -38 -172 91 -47 168 -131 -18 -262 167 -197 150 134 -327 -30 219 -14
4866a4K44Kj35j02k5J42k46K08J07j38r6P5L9l6Kj08k09K32j03J4J72m5p0K07
$$ -14 230 232 97 -5 -30 112 -134 74 181 43 -53 22 61 25 27 -81 -290 -58 -161 -147 25 -20 -90 117
4890A17K9k69J50Q9k30K47j27K9j79J75J03q0k12J13K47k23J63K4Q4l98K86j6
$$ 117 146 -123 27 116 -114 133 6 35 -144 31 134 54 -158 -45 202 -21 142 166 250 -148 138 122
4912A22k31K31nl8R8j67j76M1L51k50p6J32%Q3j8m6j40J66O5j17J82l46J39k5
$$ 122 -109 122 117 79 177 10 -166 -125 226 -24 -100 32 32 115 97 51 -89 77 142 25 207 -139 0 -25
4936b5l3J2L3J11k20l25L44K6R0r4J78r7j77K38r1p7L30k26o3J16L6k57J95L9
$$ -25 -58 -46 -13 98 -122 -447 -103 -77 13 -81 97 0 -177 61 -30 -107 223 -3 -66 50 86 -171 24 63
4960F3K7l8kk5n7L8j41K08M7q1l8K16k33pq7J90l50L19N3j2N8k36r0oN6L20l07
$$ 63 90 52 50 25 -32 6 -135 73 120 39 1 217 -16 -23 -110 80 -270 49 102 90 148 -88 -178 -184 -128 192 -115
4987a15J53M3k36j07M21k18J16j33J54j75j15K50j42J74j15J71k80L22m11L53
$$ -115 38 81 -155 -262 159 -59 57 -76 78 -97 -212 38 -104 70 -45 126 -154 168 -243 110
5007A10lj66j17%j15K19K20j04M7o6J19k12J78Jk36J50lJ97j08k65K67j34J74
$$ 110 107 -59 -176 -176 -291 -72 148 44 91 25 144 -68 110 111 -125 25 22 219 111 -154 113 -21 153
5030A53mJ05k31M8k25LO1qo7K02J2j7j60K45k90J95R4k3L9p3l53K92M3j63J11
$$ 153 149 254 23 71 -154 -151 -90 -98 -165 37 49 32 -128 117 -173 22 116 93 132 59 -294 -2 41 -122 -11
5055a1j09K54lpj98J84k36K01j37J60J17j1l73K14q9l0K78k01l0M2Q2j71J51l64
$$ -11 -120 134 131 124 -74 110 -126 75 -62 98 215 204 -169 45 -44 -74 204 3 -27 15 97 -74 77 -287
5079b87L20k69K69j47J35j41J92l5J8J54j56k90J36J93k9N7n0J57q1k82J52J13
$$ -287 33 -236 33 -114 21 -120 72 37 55 209 53 -237 -101 92 63 120 70 227 146 -136 16 129
5101A29j62N6k7L3O8kk3j84J72j55l6K22j28k7j01N1jN5M6j75L31o9k00j05L02
$$ 129 -33 23 -4 29 97 95 72 -112 60 -95 -131 91 -37 -64 -165 -114 -115 -60 -14 -189 142 73 -127 -232 70
5126G0r3j63J88O0m1rl51K87K36j41mj67K21n7O7j66J0q2J58j30nj8P3j66J71
$$ 70 -23 -186 2 62 21 12 -339 -52 184 43 39 -128 93 36 103 -63 -53 -135 23 -107 -112 -130 -57 -223 -52
5151e2J07J43j95k31l1K69k28K01n4J38J74k14j38N8M1J41j56j4K34k98K70k23
$$ -52 55 198 3 -228 -259 10 -218 -17 -71 67 241 27 -111 -53 -12 129 -27 -41 193 -105 165 -58
5173e8k1K84l85K5R3lK8J07l02L95K9j99o5KP5J5j92K01q9J16RM6J07k79J71j32
$$ -58 -79 205 -180 -155 -62 -65 -37 70 -232 163 192 -7 -72 -70 5 20 -172 29 -60 56 65 111 218 -61 110 -22
5199b2M4m0O4K4o9k5j3K1N2PR8k55P2l1M7Q6n4j12J0K52j3j69k65K9K67r9L6l0
$$ -22 22 -18 46 70 1 -24 -37 -16 36 43 141 -114 -42 -73 -26 60 6 -106 -96 156 143 -26 -291 -262 5 -94 -58 -88
5227h8Q3m0L5o2N9Q7k70Q9Q8j64K21l48N23m41J31Q0K13k28K99j46j89L3l0J82
$$ -88 -5 -45 -10 -72 -13 74 -196 -107 -19 -183 38 -310 213 -228 -97 -17 196 -32 267 121 -68 -35 -65 117
5251A17J04j52j43l8p9J28R1k8O3K8Kk24m8K21j70L07j76j52J07K66j66k6N4r6
$$ 117 221 69 -74 -112 -191 -63 28 0 63 91 93 -131 -179 42 -128 179 3 -149 -42 224 58 32 86 -10
5275a0J52l32J89j53Q6o2J95j28Q3Q1o6K01l18K23j98J05l0J24L9k58R1p3R2p6
$$ -10 142 -190 -1 -154 -68 -130 65 -63 20 101 35 236 -82 141 -57 48 18 142 181 -77 14 -59 33 -43
5299d3Q5jk3j27J25j32K11J9q0j68L05j66o1J75J42p9k63J24q7L2j04P4K08j28
$$ -43 42 41 18 -109 16 -116 95 114 34 -134 171 5 -56 119 261 182 -81 43 -44 -12 -116 -42 166 38
5323C8j39J95k8j15M9l6k2j8p8M6Q4j4J32k07J20j34R7l8m4qL07m9k76J15O9J14
$$ 38 -101 94 66 -49 0 -36 -58 -76 -154 -108 -24 -38 94 -113 7 -127 -30 -68 -112 -120 187 138 -138 -23 46 160
5349A60k67j03L07j01j26J52l4J21j42k0K78k60j13L33j44J15Ql40J68J9J20k76
$$ 160 -107 -210 97 -4 -130 22 -12 109 -33 -53 225 -35 -148 185 41 156 164 -176 -8 11 131 -145
5371a45R5R7K3r4J29p9k9j68L18k73J7nokL9L4K4J1J84j19j01Oj40PL09J22j46
$$ -145 -50 47 70 -24 105 26 -3 -171 147 -126 -109 -114 -120 -122 -83 -49 -25 -14 170 51 -50 -44 -184 -177 132 254 108
5398A08j80J48n5j64J59l6K2n3r8K16j24Q8Mn6K20k26L7Q3k17m0m3J41q8J22J3
$$ 108 -72 76 21 -143 16 -20 2 -51 -149 67 -57 31 35 -21 199 -27 10 93 -124 -164 -207 -66 -154 -32 -19
5423a9J63k30J03J06l64N54m39J22O3j30L6J98o4oJ7k66J74P0R0J31l85M2p6J93
$$ -19 144 -86 17 123 -241 313 -126 -4 59 -71 -35 163 99 93 110 -156 18 88 178 309 -76 -34 -110 83
5447H3j62o0K09j07M3k29L45l37L36j93o7l1L18j35J21P0q5q7j38J34k8l2K00
$$ 83 -79 -139 70 -37 6 -223 122 -215 121 -72 -139 -170 148 13 134 204 119 32 -106 28 0 -32 168
5470A68k15m3K15p2N2q6k44J83J76j77r3J09m7J05R6k71K04r3n0J99j34O6M4j92
$$ 168 -47 -90 125 53 105 19 -225 -42 134 -43 -136 -27 -74 31 127 -144 60 -33 -83 116 -18 48 92 -100
5494a00J59j0O5m33L03J7K99m14j16J79o8K07l42L28j10j29K83k0jm6k3j32q5
$$ -100 59 49 114 -319 -16 1 300 -114 -230 -51 -119 88 -254 74 -36 -165 118 98 97 51 28 -104 -189
5517a89O9Q6k0J81j5K1Rk08j24K15N0p4k04L11Qq6k6k5O3j4j09l1j1L27j50L0
$$ -189 -120 -34 -54 127 112 133 142 -66 -190 25 75 1 -203 108 116 30 4 -21 42 28 -81 -112 -123 204 54 84
5543H4J13O5k08j39jK75m00K55J9n9n4o5J73l06L44j85J72P6L1j96P4j19j05N6
$$ 84 197 262 54 -85 -86 189 -211 44 63 4 -50 -115 58 -248 96 -89 83 159 190 -6 68 -51 -156 -100
5567a00K96k98J28j53K02j16j16P1K26J49k81l54L92P9k18j0o0r7J96K38k86k3
$$ -100 196 -102 26 -127 75 -41 -157 -86 140 289 8 -346 46 125 -93 -103 -163 -260 -64 174 -112 -135
5589a35J49K09N2k91K70r2k02j15K85k72P9J22j05j7N0j81K79l96M46j11j04L11
$$ -135 14 223 275 -16 254 162 -40 -155 130 -142 -63 59 -46 -63 -13 -194 85 -311 135 24 -80 231
5611B31l02K05j23R7l7J74k23j1j55L46l06p8p1M38o12L62J64rj43j76K23J33
$$ 231 -71 134 11 108 71 245 22 11 -144 202 -104 -182 -253 185 -427 -65 99 90 -53 -229 -6 127
5633A27p6k97J80J84j04n4J2j35K97nr6k05J52r5J5K09r5k76K47q1R8j07K18j83
$$ 127 51 -246 -66 118 14 -40 -28 -163 134 129 33 -172 -20 -115 -100 109 14 -262 -15 -96 2 -105 113 -70
5657g0K1j0J98o4k1j88R7J18k8L7m7k05J04Pk4K67k26pK4J8K1j22L1K54j23j96
$$ -70 -49 -59 139 75 54 -134 -37 81 53 90 43 -162 -58 -51 -75 192 -34 -41 -17 1 22 -100 -69 185 62 -134
5683a34N3o7J83J1M2k2M8k21L83k47J30q6k26N1r9J77L0k4M1R5L5j97m0J65k77
$$ -134 -81 -148 35 46 88 66 114 -107 276 29 159 73 -153 -102 -201 -24 6 -18 23 118 153 -44 -84 81 -196
5708a96L08j88K5O2j24K34l10K19j04J30Q5R4k73O4L2P4k10J34ql05K31o9N1J1
$$ -196 112 -76 -51 11 -113 121 -189 30 -74 56 141 235 -38 26 58 132 -78 56 48 -257 -26 -95 -44 -33
5732c3J5O7J37k73J66Jo3R3m3k18J84j1j41L5M1M9J86N9k81J10n5j05j33K10j28
$$ -33 -18 49 186 -87 79 80 17 110 67 -151 33 22 -119 -84 -43 6 192 251 -30 80 25 -80 -213 -3 -131
5757a31K23q9J5p1J83k87R0K29r7l46L66o1j57K43N7k58k5N4J53M7j19K7j04J12
$$ -131 92 3 18 -53 130 -157 -67 162 65 -281 85 24 -133 110 167 -91 -116 -62 91 138 19 46 -58 54
5781E4m34M32K2M9j10N1j64j65N33j06l29L48k27J87o9j40J80r3Mj53L82m7k84
$$ 54 -380 52 74 123 13 64 -100 -265 268 162 -167 181 -46 141 72 -68 112 19 23 -130 252 205 -79
5804g9j08K84j46K01k68K01k23JL05l35K52k81K5K2K83k37K68k07j21K88k17K27
$$ -79 -187 97 -49 152 -116 85 -138 -137 168 -167 85 -196 -171 -149 134 -103 165 -42 -163 125 -92 135
5826A35j32J47k87K08j11R0o3r4K29o5j09j25J25K4K6J48qk05K03p8l33K52j52
$$ 135 3 150 -137 71 -40 50 -13 -107 122 57 -52 -177 -52 -28 -2 146 138 -67 136 58 -275 -23 -175
5849a75K61p0j97L53k55NP2J48k76K82o3O9J54n4k98m7J19l7R3k02K02L5r8k7
$$ -175 86 16 -181 172 -83 -78 -6 142 -134 148 85 154 308 254 -44 -91 28 -9 84 -118 84 119 21 -6
5873fM0J64n9o5o8N8j00J47l96N47k67p4m9J32J39j02J97j77j02J4j98L00j36
$$ -6 34 198 139 74 6 64 -36 111 -285 262 -5 -79 -128 4 143 41 238 61 -41 -27 -225 75 -61
5896f1L13n1l00l8J27N9R9k14O7J25o8J33l26LJ60j49j66J82n3L9M9j2r3K23J03
$$ -61 252 201 -99 -137 -10 49 148 -66 1 126 58 191 -135 -132 28 -121 -287 -105 -158 -119 -70 -82 -175 48 151
5921A51j20k96K88n9k0P9l9M4K2j75J16J26j25J06k30K06l82M33M7j05j77q8K52
$$ 151 31 -265 23 -36 -56 23 -16 28 50 -125 -9 117 -8 98 -132 74 -308 125 172 67 -110 -198 54
5944E4j56N3n8J84j9j4J68j11m25J74K70k27M8L3M7j47kj9j63L55r4mO3r1j17
$$ 54 -102 -49 -107 77 58 44 212 101 -324 -150 120 -107 -59 -26 21 -126 -128 -147 -310 45 -49 -53 10 -81 -198
5969a98J81k07O9J23O0j02O4p3kk11K32J07k64K80j19J45N1j75m1K27L15n94R6
$$ -198 -17 -224 -155 -32 28 -74 -10 -83 -85 -296 -64 43 -221 59 -60 85 136 -39 -80 147 462 -132 -36
5992c6J2k1K68k48K26j23o6J29j3j53PJ25r6r1K38j51m1J9K5j02J06J53l47K06
$$ -36 -24 -45 223 -25 201 78 12 141 128 -25 -18 107 11 -80 158 7 -34 -15 10 -92 14 167 -180 26
6016B6J7r0Q1M8M1l3j66l5P1R2j42K38j40j83N0j81M56J9l9j69K22j34q5J34r4
$$ 26 43 -47 34 82 123 90 -76 -111 -40 52 -90 148 8 -175 -125 -306 150 169 130 -39 183 49 -36 98 4
6041Dr2Q3n3P1Q0J73k42k2K2N0R5m10J98m8J99q9p7J40j7k44N0J43L2J14j67m1
$$ 4 -88 -5 -58 13 93 266 24 2 24 74 169 -241 -43 -91 108 19 -58 82 65 -179 -129 14 46 160 -7 -48
6067d8L4J80k00om2K87k54L88k12k35J82n0j09P8OJ43j89J12pq8M5j51J1M0j66
$$ -48 -14 166 -34 -40 -82 205 -49 339 127 -108 74 24 -85 -7 -1 142 -47 65 58 -30 15 -136 -125 -85 -251
6092b51J94K94j40j87J57o5l5J46m36L64q7O9L7l71J37L1J22J92k12n5J34o7j4
$$ -251 -57 237 97 -90 67 2 -33 113 -323 41 -46 23 60 -311 -174 -143 -21 171 -41 -96 38 -29 -43
6115d3J00k7p9Nj78L20k42L08l0j46R1m9J01o0J57j38j98r0J25J53l33M95k32
$$ -43 57 30 -49 -44 -222 98 -144 164 134 -12 79 30 131 71 228 90 -108 -198 -73 80 -253 242 10
6138A0o5J57j27O4p0Q0o3k14M09l64J89k22J93k3j13J73j9J71j98J20l56L47j00
$$ 10 -55 102 -25 39 -31 49 -14 -228 181 -183 6 -216 -23 -46 -159 14 -5 166 -32 88 -268 79 -21
6161b1JpL8P1m8J88m22K44L8j53J56p4J46j91P6j91J38n8L7n9mJ54m4o1l3K31
$$ -21 -20 -27 11 82 34 222 -200 44 82 -71 85 11 157 -34 42 -149 -11 -69 -32 -91 -95 59 15 -46 -79 152
6187A52j20k3K08j87J4n1k3l8O2N1m3M9l77K75J29J08k43N8qj07L59k63J85j43
$$ 152 32 9 217 30 44 -7 -30 -68 -6 45 2 51 -326 -51 78 186 -57 1 -7 -114 245 -18 167 24
6211B4J20o4n0P1K8n2J71q4j05m8j31K52l63K80j15o8R0l5J65j7lj32J60P0j66
$$ 24 144 80 30 101 129 77 248 164 59 11 -120 132 -231 49 -66 -134 -44 -79 86 69 66 -66 94 164 -2
6236bj46K88k28J39J4j96J41j07J67j5j01J16J11K8%k90J40Nl4j71J43K05q9J21
$$ -2 -148 140 -88 51 65 -131 10 -97 70 55 -46 70 181 209 209 -81 59 64 30 -141 2 207 118 239
6260B39k52n8p9O1J51m6m5J63j10l9k40P6L18k97P9J83k64K85K2k74Q4J21l7l48
$$ 239 -13 -71 -150 -89 62 16 -29 134 24 -15 -255 -179 139 -158 -79 104 -160 125 147 -127 -43 78 41 -307
6284c07K66k09K28r2J75J13k39P7J85m33J38J35k62P1k8O4J41n0J9K9nJ06m9N4
$$ -307 -41 -250 -22 -114 61 174 -65 12 197 -236 -98 37 -225 -154 -182 -118 23 -27 -8 21 16 122 73 127
6308A27j65j36K25j76K62l33J45J04RL6k40K58n4j44K14n9j65L44k58P8n9j06
$$ 127 -38 -174 51 -125 137 -196 -51 53 62 98 -142 116 62 -82 132 73 -92 252 -6 72 13 -93
6330i3k63M14J9j41L5J0l7M4QJ8n4pK10k84K03l0M8k63L68j93j61J0M00m1k30
$$ -93 -356 58 77 -64 -29 -19 -56 -12 -4 14 -40 -47 163 -121 82 52 100 -163 205 12 -149 -139 261 220 -10
6355a0K5m3m2jr6M58j24k45M13r8k90j62K71k85K70K24k36l71M26r1j07J17o5
$$ -10 15 -28 -70 -71 -167 291 167 -78 335 237 -53 -215 56 -229 41 265 29 -342 84 -7 -114 3 -62
6378f2j64o7M10k17O7j3Q8m9Q1j51Ol9N8m2R6j52mp8R2K76j40N5n7J91K5l83K50
$$ -62 -226 -293 117 -100 -33 -46 42 -7 74 -77 -71 -110 -52 -94 2 -150 -154 -232 -140 136 -4 51 -6 185 210 -173 77
6405G7j52J68j82J21n4j05L8J78j46O9L2j06J38n8j23J16j67L4Q7l4P5o5J48k39
$$ 77 -75 93 -89 32 -22 -127 -89 89 -57 12 44 -62 76 18 -105 11 -156 -122 -35 -69 6 -59 89 -150
6429a50K36n1N5j09MJm2J2J40j08j86J24J27k8m6J92l28J86q7j1J35k7q0K57R
$$ -150 86 35 90 -19 -15 -14 -56 -44 96 -12 -198 -74 53 25 -21 171 -157 29 -58 -69 66 39 -41 216 225
6454B25l02R7j64O1k9K0J34j02J28j7o0K84k78L11k28k80K41j21p1K6O0p9K04
$$ 225 -77 20 -144 -83 -112 -92 42 -60 68 51 -9 275 -3 308 80 -200 41 -80 -151 -125 -65 -144 60
6477F0K6N4k02k43K83q9p6J03O6K87p1k34J33Qk12N4J07k19J99j94N1K20j62o3
$$ 60 86 140 -62 -305 -22 -111 -187 -84 -18 269 198 -36 97 105 -107 -53 54 -165 34 -160 -109 111 -51 -114
6501a14J57K1k58j06K23j42K13J50J05k47P8p3O1Jn1J38k02N8jM4P1k6j60J03
$$ -114 43 64 -194 -300 -77 -219 -6 144 249 2 80 7 68 69 18 156 -46 12 11 55 126 100 -60 43
6525D3p6J44m4l5k7q7l5K14k94J61N3r9K42j40M0k36K33J43j78l6mK10k01J29
$$ 43 -33 111 67 32 5 -82 -117 97 -197 -36 17 -82 160 20 60 -176 57 200 22 -14 -18 192 -9 120
6549A20j16J65m6j94N3p4l7L12l33K70k29O6L2J7j11n9L9J18J30o2k39R6r1K38
$$ 120 4 169 123 -71 -18 -92 -129 183 -150 120 -109 -43 -11 6 -105 -164 -125 -7 123 61 -178 -82 -173 65
6573F5K81l69J44k17R7m8j77M39r1r2M4nk45K35n6R0k58J23J24j62j01J19j1J64
$$ 65 346 -23 121 -96 1 -47 -224 215 124 32 76 71 -174 61 5 95 -163 -40 84 -78 -179 -60 -71 93
6597I3j41L27m25L07J30l44q8J16N5L5j68K82o0j54N2q8M11l54Q3p2J9k7J79l10
$$ 93 -48 279 -146 161 291 -53 -141 -25 30 65 -103 179 119 -35 17 -71 340 -14 69 -3 16 -11 168 -142
6621a42K72j76kJ7N6J16j57j4M5k9J50k1m15L82J25k88j51L74L2J4J18l20L7K7
$$ -142 130 -46 -48 -31 25 141 -16 -30 15 -14 136 115 -300 82 207 -81 -232 142 174 188 306 -14 23 50
6645E0j41L29l66J12K89l47MJ89j43k05K45O9k37J70j03j03J58O1j79J88k3M5
$$ 50 -91 238 -128 -16 273 -74 -70 119 -24 -229 16 85 -152 18 -85 -188 -30 31 -148 40 17 62
6667F2kj56M2o2J74j9K72j72k16P0K0l6j33J42p6J59o1O5L7K7j27L2J28J92m10
$$ 62 60 -96 -54 -116 58 39 311 139 -77 -7 13 -23 -156 -14 -90 69 8 73 110 137 10 42 170 362 -48
6692d8Kj66M26j69j95J60l1r2J77j62J68j46L6L7l6J68k21Q6M3j90M38o00L86
$$ -48 -46 -212 214 45 -150 10 -21 -113 64 -98 70 -76 -40 -3 -39 129 -92 -6 37 -153 285 -315 71
6715G1r0J18j14J45N4l37J20l8j0J13j90J42J69j12n7o6Q9l15J43Q9P1O5o7J70
$$ 71 -19 99 -15 130 184 -153 -33 -71 -81 32 -158 -16 153 41 -16 -82 7 -308 -165 -76 -5 60 -7 163
6739A63l03J59n2l28J46K41J44P7k65J46j47N8l1q0L2nO4P4j00L9m6j11J37q1
$$ 163 -140 19 -33 -361 -215 26 170 247 -18 128 -19 39 8 -72 -40 -45 19 93 -7 32 -14 -125 12 -69
6763f9J39q1R1j49j6K0J52O6j03L2k01o2K05K5k48l8K39l6J21k26K08R3m54N27
$$ -69 70 -11 80 -69 -85 -65 87 153 50 82 -119 -181 24 49 -199 -237 2 -34 87 -139 69 162 -292 235
6787B35k48K8j2L6jJ5j35P1J07L2j57J22n8Q4q3k01L98j97j33J61j71J46o7j10
$$ 235 -13 15 3 39 38 53 -82 -11 96 128 -29 93 35 119 36 -165 233 36 -97 64 -107 39 -28 -138
6811a38J58p9J45k02J54P9M6j35J76q9J44k20k32J49j16L26j79N0Q4j63R9j09
$$ -138 20 -59 86 -116 38 117 163 28 204 115 259 39 -193 -44 -160 166 -13 37 121 -42 57 -52
6833e2J73j76J75r9l6j00L49k56j57KO1K31rj1j94J12j48K1R3J31j50K05k3j07
$$ -52 121 -55 120 21 -15 -115 234 -22 -179 -177 -116 115 106 95 -99 13 -135 -114 -21 110 -40 165 142 35
6857C5l7K8L87m95J04KK25l15J34N7j93J76m42K75K41P2j50J29j98oj16j10K34
$$ 35 -2 26 413 -82 22 24 249 -66 68 125 -68 108 -334 -59 182 254 104 233 35 29 -87 -197 37
6880C7j56N7KP5K2O7k21K24k88K76k69O4J63L3j82J39k47K42mj82J44J25j67q7
$$ 37 -119 -62 -60 15 37 104 -117 107 -181 95 -174 -110 53 86 -96 43 -204 38 34 -148 -4 121 -46 -133
6904a33J89M2J24m42K33P9k62J41j06J51L08l07j50K63o8O0j03j00L13l19N2M0
$$ -133 56 98 222 -220 13 92 -170 -29 -135 16 324 17 -133 130 62 122 19 -81 232 -87 -35 5
6926EJ2K33l19K58j91J69j34J73l15K20j23J05j7k13N9J00j14K17l43J99J43O
$$ 5 17 250 -69 189 -2 167 33 206 -109 111 -12 93 76 -137 -78 22 -92 125 -218 -19 124 130
6948A30o3L8k50K69l07O4J55j78K20pK5k45K48j59J46j63L4J56m1pL3k66J85O3
$$ 130 67 105 -145 124 -183 -119 36 -142 78 71 96 -149 99 -60 86 -77 -43 113 72 65 98 -168 17 80
6972H0j47K02L8jk49K69k42K27m65K37j27O9J72j00N3J3J12j8j8k47J15J74j23
$$ 80 -67 135 173 172 -77 192 -50 177 -288 -51 -178 -109 63 -37 16 29 141 123 105 -142 -27 147 24
6995B4l5K0J15j53K8J56k14N5N1j5Lj13r8L59k65M9Q3j27K0p2J21m01N61j4k59
$$ 24 -11 9 124 -29 -1 155 -59 -4 47 32 35 -78 -176 183 -82 -33 50 -77 -57 -129 -8 -409 152 138 -121
7020a21J90K1M1l68J6J25O4M5K21l69PJ53q8J64j35J06k7nr6Q8j61n2O6K21Q0
$$ -121 69 90 131 -237 -221 -96 -32 13 234 -135 -128 25 -63 101 -34 72 45 40 -56 32 -129 -181 -115 106 186
7045A86j42m0j99K75j12j70K39j2l00K51L2O0j08J66K3j03L7j30P0q0J03%K4M
$$ 186 44 4 -195 80 -32 -202 37 25 -275 -24 8 68 -40 126 149 46 83 -47 23 -57 46 46 70 74
7069G4m6j7J9l1Q4o5l3MN4j50K75m07K80R7k13m8Q0J06k30J80j31m7L43j00R2
$$ 74 28 11 30 -1 83 18 -15 -11 43 -107 168 -239 41 138 -75 -123 -43 63 -167 13 -118 -165 178 78 170
7094A70P0k44J58K7p6j02Q3p8l1j67J90J8k07M5R4k9K22k13q4J64j73j48J55J64
$$ 170 240 -4 154 181 105 3 86 8 -23 -190 0 18 -189 -144 -50 -79 143 -70 -154 10 -163 -311 -156 8
7118HM4L4n5m5k54K64j15K04l03N5RJ92j7J6P0j54o1J92L1k47RK36j76k9J65K3
$$ 8 52 86 31 -14 -268 -4 -119 85 -218 -163 -154 38 21 37 107 -47 -108 84 115 -132 -123 113 -63 -92 73 96
7144I6j43o7K52m09J69J25J21k30L48k27n5M5j69K25M9p6L4k81J05ln1J34M3k03
$$ 96 -47 -114 138 -271 -102 23 144 -86 262 35 -20 25 -144 81 130 54 88 -193 -88 -91 -142 -8 35 -168
7168a68J59j9J77k71J85j3Mk62J65K0J14M6k33J22q0p4L45l23RJ35l3j76Q8J53
$$ -168 -9 -28 149 -122 63 50 54 -208 -43 -23 91 137 -96 26 -54 -128 217 -106 -97 38 5 -171 -83 70
7192G0O7K60l69j68J64k20K73J34k08N0n2M9Q7r3J44k10J93Rjm9k53K37j87Q2
$$ 70 137 397 28 -140 24 -196 77 211 3 53 1 50 137 44 188 -22 171 180 179 130 -123 114 -73 9
7216IJ11j47j39K95m17K55m6nr2K03K5J34l66K66j19nNp9J86L8kq0N7J4q8j3J21
$$ 9 120 -27 -166 129 -288 -33 -79 -84 -176 27 52 186 -180 86 -33 -38 -33 -112 74 112 110 30 87 101 13 0 121
7243A21j67K35l25K11o3r4J79j69o7J34k20J55L16k48J72j84k5O0r5j4J11j49
$$ 121 -46 189 -136 75 12 -82 97 -72 -139 -5 -225 -70 246 -2 170 -14 -39 21 -74 -88 23 -126
7265a26J00o4m0K21k68K21N4R0k11Nj4K05N9j6k78r4K68j77l3N2J33o1n3P3Kq
$$ -126 -26 -90 -130 91 -177 44 98 188 -23 -18 -32 173 232 216 -62 -156 112 -65 -98 -46 87 26 -27 46 48 40
7291D0O9j65K12k02j3J84m6j16M8P6K2j47M5j13q5K83k45J05J69l51Q6j02L30
$$ 40 109 -56 156 -46 -59 125 79 -37 11 87 109 -38 7 -106 -191 92 -153 -48 121 -230 -144 -246 84
7314H4r9OL8r9Qq7q3L47pk86L20L5K8l19K44k1M3k8q0L6K1p5j35K51j82L7J69
$$ 84 -15 -9 29 -70 -62 -149 -232 115 108 -178 142 177 205 -114 130 109 152 124 44 80 101 26 -109 142 -40 -3 166
7341A66j6j98J19n3l4M1J16J15j72KQ6p1p4j34P2m1J9o3JM1J50k69K79r7N%M8
$$ 166 150 -48 71 18 -16 25 141 256 84 86 172 101 27 -107 -35 -76 -57 -120 -119 -78 72 -197 82 -15 -10 -10 38
7368C8L5NN9j96J38m1K50k80j15J77J05j65J85l09J63j26L3n6n6L48m4k15o0K48
$$ 38 73 78 137 -59 79 38 288 8 -107 70 175 10 195 -114 49 -77 -44 -100 -156 192 148 -67 -127 121
7392A21k36J25k1k54J71J84j49l6K68k76N2J90j91K0J85Kk0l07M7n4K21l0Jj36
$$ 121 -115 10 -11 -265 -94 90 -59 -95 173 -103 -51 139 -52 -32 153 155 135 -172 -125 -179 42 12 13 -123
7416a23R3J92n5J7m2kK32l2j57l9j77K28j92L03k14j7J43o4j49j37K56o0M5j23
$$ -123 -30 162 107 124 82 80 312 280 123 84 -93 135 -57 246 32 15 158 94 -55 -192 64 4 49 -74
7440g4M9l4J58P7j68J27m0j78J33R6m0k73L35k23J07K54l38Q5k4K9k57J60L1K
$$ -74 -25 -59 99 176 8 135 95 -83 50 146 106 -167 168 -55 52 306 -32 53 29 58 -199 -39 -8 -6
7464fJ58l21K32j06j5K92k93L11k12M1K8or2p3k4J48j26J35j27N9J04l3O5k17
$$ -6 152 -169 63 -43 -58 234 -59 252 40 81 109 103 11 -62 -86 62 -64 71 -56 3 107 74 139 -78
7488g8Q4N3j75p2K43Q0J12k33J4j57o6J31J24R8k69N7k1J58K01P9l39J47j57r8
$$ -78 6 59 -116 -188 55 135 247 14 28 -129 -195 -64 60 158 -111 -54 -75 83 284 363 24 171 14 -84
7512h4P5J73l17K17m7M1p5k6j21J18K33m3l01J48J66j80j12Q4m6k04L63k11P5
$$ -84 -9 164 -153 64 17 58 -17 -43 -164 -46 187 144 -157 -9 157 -23 -135 -51 -97 -301 62 -149 -74
7535g4J88n8Qk4k24j26K04O9P8q7Q3q3O1OJ06k32R9o8K52k99O5J08j68K48l50
$$ -74 114 56 64 40 -184 -310 -106 -37 41 -46 37 -46 15 21 127 -105 -6 -74 178 -121 -56 52 -116 132 -218
7560b18J39J32j9K6J98k00j88J71Qo1J54j23N0J32l67K38j3N3L8j60l1j83K10
$$ -218 -79 53 34 60 258 58 -130 41 49 -12 142 19 69 201 -166 72 59 112 150 -10 -41 -224 -14
7583a4J29k59m2J48J54Q3k50J58j25J34q0j42K75j93k9O6K82l44R6J10l70O2j10
$$ -14 115 -144 -186 -38 116 199 -51 107 -18 116 36 -106 169 -24 -53 13 295 -49 47 157 -213 -151 -261
7606b61K40l9m2J92m1j08K41l75L24j76L69k44L4j10R2k20J32K95j65j4j41r6
$$ -261 -21 -60 -102 90 49 -59 182 -193 131 -45 324 80 114 4 96 -124 8 303 138 124 -17 -113
7628a13p6J10k1R9M8J7r4p7Q5j32K11p8p7J52Kk03N1K4N4J98j30j04K36k52J36
$$ -113 -189 -79 -100 -1 47 64 -30 -107 -22 -154 57 -21 -98 54 56 -147 -96 -72 -18 180 50 -54 182 -70 66
7653F6K8k22mJ82Mj39P3pr0K86k34lm7J58k76L32k30J57j91J21L5k18N4P4K54
$$ 66 94 -128 -132 50 54 -85 -12 -19 -109 177 -57 -60 -107 51 -225 107 -123 34 -157 -36 -1 -219 -165 -91 163
7678A63j34j25O3R0j70K48l2j78j29M38j71l6K3J06k01l1j29K57k29J34J11k49
$$ 163 29 -96 -33 57 -113 135 103 -75 -204 234 63 27 50 156 -45 -76 -205 52 -177 -43 68 -181
7700a81L05j94Qk00N39k26O3j59N3p8j05J18K35k9j82J43n2l4l46L76j69K15R4
$$ -181 124 -70 -62 -262 277 51 114 -45 8 -70 -175 -57 178 149 -33 110 58 24 -322 54 -115 100 194
7723A94l58J45Q3l9k7J24j08j10J49P7j53M6j73K10K3r1k30J82J69Nk01k1K41
$$ 194 -164 -19 64 25 -2 122 14 -96 53 130 -23 23 -150 60 83 -8 -238 -56 113 118 -83 -104 137
7746A37m3l8Q8k73k5M2K31m7kq1m7K75l22J20K0j88K68j61j10K28jl6k9mj9M6
$$ 137 94 56 144 -129 -154 -112 119 72 70 -11 -58 217 -105 15 35 -153 115 -46 -156 72 71 35 6 2 -17 29
7772B9l5J9J00j79K41o2K12l20J11j69L50k81P6j5j6mK4qj69p0J26j51J55o6J76
$$ 29 -6 13 113 -66 175 113 325 5 116 -53 297 16 92 77 61 57 81 73 -96 -166 -40 -191 -36 -102 74
7797G4p0J43k26lk9J85j78L30j90q6J27j49o1L68k82K26o3n18J08N0L64K0j95
$$ 74 4 147 -79 -82 -111 74 -104 226 36 -50 77 -72 -133 235 -47 179 116 -402 -294 -244 120 140 -55
7820e5j6J55J93m19L41m3k69O5K22j07J78k58j76K42l9j84K73j37L9LK17j41k60
$$ -55 -71 84 277 -142 199 156 -113 -48 174 67 245 -13 -189 53 14 -170 103 -34 5 8 225 84 -176
7843a76K05K14l4k47K8K33n00Q1P1K41j79N2J06J4K1k13N3K22k56L53m84J63j6
$$ -176 29 243 209 -38 -10 223 -277 -196 -125 116 -63 -11 95 109 130 -83 -30 192 -64 289 -195 -32 -48
7866d8j08J47J21o4j09K26l87J21mP5r5K6J33k16M3L51j31k51K27lp9q6K09q3
$$ -48 -156 -9 112 48 -61 165 -222 -101 -105 -30 -125 -99 34 -182 -139 212 81 -170 57 54 -25 -111 98 15
7890A5j56J15J2K51l21J16j44K55j73mPn0k20J91P8jN6J28j52J07j22K13KKj99
$$ 15 -141 -26 -14 237 -84 32 -112 143 -30 -34 -27 -77 -297 -106 -28 -29 27 155 3 110 -12 201 203 205 6
7915Fm9J85j45PJ18O7j47j84L0K60k42K29k29j0N4n3K77k91P7K38k54J18o1O2
$$ 6 -43 142 -3 4 122 189 42 -142 -112 148 -94 135 -94 -104 -50 -103 174 -117 -40 198 -56 62 1 63
7939F3m1p0j77J52L8j21Q4P8j16L74l67J19l1O0Q9k11J2J2O7j67Q3J98k78K93
$$ 63 22 -48 -225 -73 -35 -156 -72 6 -110 264 -103 16 -15 45 134 -77 -65 -53 14 -153 -70 128 -150 143
7963A43j31k0r1K06q3J52k10J40j46J96j08q2j73J30K05m6j84L6J03M4o3Q3R6
$$ 143 12 -8 -99 107 24 176 -34 106 -40 156 48 -34 -207 -77 128 82 -102 -66 37 81 18 101 197
7986A97n58J79K35o5J1J78j64n9N6j51P5lJ36j83M5j2m9Q7K27r4k91N10m01L24
$$ 197 -361 -182 53 -12 -1 177 13 -46 10 -141 -66 -69 67 -116 -71 -83 -132 -45 182 88 -203 307 -94 230
8010B30k28j4PJ8j56J22K99k16r3j06q4m0M46j07j44Q3j71L10k77J24P2p6j8N9
$$ 230 2 -12 -5 13 -143 -21 278 62 -31 -137 -221 -261 185 78 -66 17 -154 156 -121 3 75 -1 -19 40
8034D0j51K89q2j11r1o4J00J56Q4k7j13j09Q9J22j57O3k13L14j69j32K01o4J56
$$ 40 -111 178 96 -15 -106 -170 -70 86 170 143 30 -79 10 132 -25 38 -175 139 -30 -162 39 -25 131
8057A31j34n7J42j6j79J3O7K0R1O5m7q8O9k43R4J21j34m2J77J41k84J94l30Q0
$$ 131 -3 -60 82 66 -113 -100 -33 -13 78 143 96 8 77 -166 -72 49 -85 -127 50 191 -93 101 -229 -149
8081a49K35j77J80l08L88j54K39l25j3J56J1J2rr1K33m54L81r2Q6j58Pj57QK01
$$ -149 86 -91 89 -219 169 15 254 -71 -84 72 83 95 86 -5 228 -226 155 63 149 -9 -2 -159 -151 50
8105E0m7O9jm3j33K07j64L0J02l5n9j49K19k11n1Q9J95M3j97J59l9j08J48Q7l10
$$ 50 3 72 71 28 -105 102 -62 -32 70 35 -24 -173 46 -165 -216 -127 68 111 -86 73 34 -74 74 161 -149
8130a49K98j22kM2j9r7JP0j9J0O5j2j20J46j21Q4j31mj17Q8K37j00j5mJ9j80J17
$$ -149 149 27 25 67 48 -49 -48 22 3 13 78 66 -54 92 -29 55 -76 -80 -197 -109 128 28 13 9 28 -152 -35
8157c5l7J03J94j21l04Q4Q0O2N1j41n3m7L26J0j77L4j53R9J9J3j9L4M4o7n3J1
$$ -35 -72 31 225 104 -200 -116 -36 26 77 -64 -117 -164 162 172 -5 29 -124 -25 -6 7 -12 22 66 -1 -54 -43
8183d3J76Q0j00j62k62N29l54J27
$$ -43 133 213 113 -49 -311 218 -136 -9
8191i
$$ Imaginary data points
##PAGE= N=2
##DATA TABLE= (X++(I..I)), XYDATA
0@%%%%%%%%%%%qJ6j6J6k4L2l2M0m8N6p2Q8j04J20j36J60j90K18k50K86l25L68
$$ 0 0 0 0 0 0 0 0 0 0 0 0 -8 8 -8 8 -16 16 -16 24 -24 32 -40 48 -56 64 -72 88 -102 116 -134 152 -173 195
33A95m17M71n28N94o66P45q33R26j029J143j266J401j546J705j880K072k284K516
$$ 195 -222 249 -279 315 -351 394 -439 487 -542 601 -665 736 -810 895 -985 1087 -1197 1319
51A319k772L055l371L724m121M571n090N696o406P256q295R599j1295J3597j6912
$$ 1319 -1453 1602 -1769 1955 -2166 2405 -2685 3011 -3395 3861 -4434 5165 -6130 7467 -9445
66i445K2121l1510N3517j95476r0846M72436o5676j99952P9164l3763k05091J25569
$$ -9445 12676 -18834 34683 -160793 -251639 220797 155121 -44831 34333 570 -204521 -78952
78g8952J75301K446K420p6143j82296O9728J28360n9017M1275J07229j61052p5009
$$ -78952 96349 98795 101215 25072 -157224 -87496 40864 -18153 23122 130351 -30701 -105710
90a05710J67297l6274j35782J26646M4079j19333R6576Q5724j89408m4912J23608
$$ -105710 61587 25313 -110469 16177 60256 -59077 37499 123223 -66185 -111097 12511
101A2511m9537J8457J83248q0044k03897N2797N8599m6016J06062O9567j30020
$$ 12511 -37026 -18569 164679 84635 -119262 -66465 -7866 -53882 52180 121747 -8273
112h273l7725L6072n9309O1444J20121j09751p2693J28540k9798j14541J04027
$$ -8273 -45998 -9926 -69235 -7791 112330 2579 -70114 58426 28628 -85913 18114
123A8114M0702j32891N1156J21542q0559m6562M8442p1487k1584J27528Q373o1128
$$ 18114 58816 -74075 -22919 98623 18064 -28498 19944 -51543 -73127 54401 62774 1646
135A646L6325n1519r4697J02136Q6503q2225N324M8747r7539k2811J09922j7847
$$ 1646 37971 -13548 -108245 -6109 80394 -1831 3493 52240 -45299 -68110 41812 23965
147B3965n5839O1537j1999o4602O3640K2193q8776K4368O5032n0266M912O2475
$$ 23965 -31874 29663 17664 -46938 16702 38895 -49881 -25513 39519 -10747 -5835 56640
159E6640o5753n7570O5114J0779k0930N9799j2290q7457K2985L9973l9473L4212
$$ 56640 -9113 -66683 -1569 9210 -11720 48079 35789 -51668 -28683 11290 -28183 6029
171F029N4588p0747l5622O3015j4693l5675N3943J920n4403L1977K6856m6397
$$ 6029 60617 -10130 -45752 17263 2570 -33105 20838 22758 -31645 332 27188 -19209
183a9209Q470K6590m0282J0397N5563l1451l4022L2975j8021k9556N6761K1917
$$ -19209 -10739 15851 -24431 -14034 41529 10078 -23944 9031 -8990 -38546 18215 40132
195D0132m9584N446J4286l9590J3197M8382k4826j8555K8397j9825k2885L8628
$$ 40132 -9452 -4006 10280 -29310 -16113 32269 7443 -11112 17285 -2540 -25425 13203
207A3203K145l4813K3325J7574l1760P296K1766l0640n629L3449q824j1540K2909
$$ 13203 15348 -19465 3860 21434 -10326 -3030 18736 -11904 -17533 15916 7092 -4448 18461
220A8461j5790k9215K5564J5266j9493J3561J0930l1577l440K4209r577l388K0722
$$ 18461 2671 -26544 -980 14286 -5207 8354 19284 -12293 -15733 8476 -1101 -4489 16233
233A6233j2291j7395J8658M70j9243J5111R865k0013O275J6222j8680p605J7211
$$ 16233 3942 -13453 5205 5675 -13568 1543 11408 -8605 -2330 13892 -4788 -12393 4818
246D818o225o115J7787k443j7627O297L055r676J1779R862j4733j403Q684j2002
$$ 4818 -1407 -7522 10265 7822 -9805 -3508 -453 -10129 1650 11512 -3221 -4624 4060 -7942
260g942k151J7361l742j0530J0083P81j2178N896O244r221L041Q832p593l414
$$ -7942 -10093 7268 3526 -7004 3079 3860 -8318 -2422 3822 -5399 -2358 6474 -1119 -4533
274d533P127n239l831R411J128n573L323j088p412M951O042n131J952M973p437
$$ -4533 2594 -2645 -6476 2935 4063 -1510 1813 725 -6687 -1736 4306 -825 1127 6100 -1337
289a337m129P120m89l521N435J697n301Q69J369l646J275L748j804J21J757l002
$$ -1337 -5466 1654 1165 -2356 3079 4776 -525 344 1713 -1933 -658 3090 1286 1407 3164 162
305A62j454K905m43j415L812m66m841R98K853k674L77L647j018k655N81o51q12
$$ 162 -1292 1613 1170 -245 3567 3101 -1740 -742 2111 -563 -186 3461 2443 -212 369 -282 -1094
322a094J428N85K66N20j161j957N07N54o78J221J592j647j287R93p78j140J826
$$ -1094 334 919 1185 1705 544 -1413 -906 -352 -1030 191 1783 136 -1151 -158 -936 -2076 -250
339b50P44q55p59O4N9l89L19M74O63n22j233j42N11j97L55J531l6j219P3m28n80
$$ -250 494 -361 -1120 -1056 -997 -1386 -1067 -593 70 -452 -1685 -1827 -1316 -1513 -1158 373 337 -882 -809 -1237 -1817
360a817O15J167k68J09K81k20p47j02M01O40L11j38m32L52j89l69O40R40o76o03
$$ -1817 -1202 -35 -303 -194 87 -133 -880 -982 -581 59 370 232 -200 152 -37 -406 234 1174 498 -105
380a05O20o5q36R83Q61p14J89N12j489k41J413k64l34J269k46j309O99J51j302
$$ -105 515 450 -386 597 1458 744 933 1445 -44 -285 1128 864 530 1799 1553 244 943 1094 -208
399b08Q46J167j604K58J457j547p13J534n12j304K108K03k533Q74J282k007M18
$$ -208 638 1805 201 459 1916 369 -344 1190 678 -626 1482 1685 -848 26 1308 -699 -281
416b81K530k513j463K254m62j603K379J68l115J907J605l612Q47K748k834q47
$$ -281 2249 -264 -1727 527 65 -1538 841 1009 -2106 -199 1406 -2206 -1359 1389 -1445 -2292
432b292L746j615k164K807q11k937L264Q46l704K001K456m096m04N205k734k589
$$ -2292 1454 -161 -2325 482 -329 -3266 -2 844 -2860 -859 1597 -2499 -2903 2302 -432 -3021
448c021L981j237l271L987J289m515K391K459m768J506M487m892j159N427k364
$$ -3021 960 -277 -3548 439 1728 -2787 -396 2063 -2705 -1199 3288 -1604 -2763 2664 300
463C00l189N754n24o205M068K845n050J923M189n314j076N936k912k852N905k244
$$ 300 -2889 2865 2341 -3864 204 3049 -2001 -78 4111 -1203 -2279 3657 745 -2107 3798 1554
479A554n458N947J658n910L028L459o564Q28O489m937k643O441l136m649P259
$$ 1554 -3904 2043 3701 -2209 819 4278 -2286 -1458 5031 94 -2549 3892 756 -3893 3366
494C366N40p268L728L397p061K458O268o180k306O682m112l261Q040j929p495
$$ 3366 3906 -3362 366 3763 -3298 -840 5428 -752 -3058 3624 -488 -3749 4291 2362 -5133
509e133O091K079p507M366N184q323n18P707m774l282Q004l136p085P154K094
$$ -5133 958 3037 -4470 -104 5080 -3243 -3761 3946 -828 -4110 3894 758 -6327 827 2921
524B921p268M789K909q669K159P494o129j539P227n276n212R515j75p887N934
$$ 2921 -4347 442 3351 -5318 -3159 4335 -1794 -3333 3894 -1382 -6594 2921 2746 -5141 793
539G93J975q173L666P118p529j522P611n371l183Q953k038p370O204J674p258
$$ 793 2768 -5405 -1739 5379 -2150 -3672 3939 -1432 -4615 4338 2300 -5070 1134 2808 -4450
554d450N599M578r124N76P627o327j370R094m947o882Q272R54p664O255L380r848
$$ -4450 1149 5727 -3397 -2821 4806 -1521 -2891 6203 1256 -5626 2646 3600 -4064 2191 5571 -4277
570d277K476P466o496p57P060n958m395R095j275o562O571N39q900N493O172p964
$$ -4277 -1801 5665 -831 -1588 5472 -486 -4881 4214 2939 -3623 2948 3487 -5413 80 6252 -1712
586a712Q7O359p038k079R764k938o667O428j78p244O433M303q675P68N487n616
$$ -1712 -1625 4734 -2304 -4383 5381 2443 -4224 2204 2026 -5218 1215 5518 -3157 -2389 3098 -2518
602b518l29P994n011n493P171p95n552O752J497r206L275N583o156R53O699o663
$$ -2518 -2847 5147 136 -5357 1814 1019 -4533 2219 3716 -5490 -2215 3368 -2788 -1835 4864 -1799
618a799l702P868j200n252O202l67p546M910M426o295J626M813o930q82Q120l180
$$ -1799 -5501 2367 1167 -4085 2117 1750 -5796 -886 3540 -2755 -1129 3684 -3246 -4128 3992 812
634H12m509O118j586o171O461L066o885J561M160n936R35O604l968l650N250j742
$$ 812 -3697 2421 835 -5336 1125 4191 -2694 -1133 3027 -2909 -1974 4630 662 -2988 2262 520
650E20m017O227R85o548K637L057n349K246N334n794k151N879k250k881N887j236
$$ 520 -3497 2730 3715 -2833 -196 2861 -2488 -242 5092 -702 -2853 3026 776 -2105 3782 2546
666B546o094L847L072m980J983L529n997o2N119k397k144M573k224m224M949J298
$$ 2546 -3548 299 3371 -1609 374 3903 -2094 -2156 2963 566 -1578 2995 771 -3453 1496 2794
682B794m776K703J873n489J129N418l824k139M445k332l084M680O57m241K108
$$ 2794 -1982 721 2594 -2895 -1766 3652 -172 -2311 2134 -198 -3282 1398 2055 -2186 -78
697g8J222l642K130L087m188p07L761k986j234M657j223m040L267Q62l528K494
$$ -78 1144 -2498 -368 2719 -1469 -2176 1585 -1401 -2635 2022 799 -3241 26 888 -2640 -146
713a46K377m317Q7L464k384j012L806j754k763L066L74k605K435P66l282R63K550
$$ -146 2231 -2086 -1999 1465 -919 -1931 1875 121 -2642 424 798 -1807 628 1394 -1888 -925 1625
730A625k369j15K865k550j544L609k26k657K062N69l059J456K593k599j6J876
$$ 1625 -744 -859 2006 -544 -2088 1521 1295 -1362 700 1269 -1790 -334 2259 -340 -356 1520
746A520j567o46K440r17j649K040j28k253K156R84k623P85J571j768o08K422j051
$$ 1520 -47 -693 1747 830 -819 1221 1093 -1160 996 1980 -643 142 1713 -55 -663 1759 708
763G08j707K041j75j636J615M59k094P57J187j664K73J696j827l86J407n03j205
$$ 708 -999 1042 867 -769 846 1305 -789 -32 1155 -509 -236 1460 -367 -753 654 151 -1054
780a054J685J1j873J006R81j509J86J255j593k69J552m62r17J008L2j465J274
$$ -1054 631 642 -1231 -225 756 -753 -567 688 -905 -1174 378 -84 -1001 7 39 -1426 -152
797a52M8p40M16O78j241K21J247q45o41J145m17p99J036L18j423R45N40j110L13
$$ -152 -104 -844 -428 250 -991 -770 477 -368 -1009 136 -281 -1080 -44 274 -1149 -204 336 -774 -461
816d61P08n86k45P61j05m69P48j03n07Q21k91o39Q72J54q14n7J051l97n95P66
$$ -461 247 -339 -584 177 72 -397 351 248 -259 562 271 -368 504 658 -156 -213 838 441 -154 612
836F12O3r16M30O05o47J55L58n99J02O02k82QJ07n78J48L76ql61J40K47o24L20
$$ 612 675 -241 189 794 147 302 660 61 163 765 483 491 598 20 168 544 536 175 315 562 -62 258
858B58J71k53k49L20j68l59M95k16j08j84N08k17r9k3M4J30k90j75J09k6P7j36
$$ 258 429 176 -73 247 79 -280 215 -1 -109 -293 215 -2 -101 -124 -80 50 -240 -415 -306 -332 -255 -391
880c91K84j19n07L82J27l05Q8L05j82k47R4m6Q9N7l7N7K26l50M71p4k72n4K16
$$ -391 -107 -226 -733 -351 -224 -529 -441 -136 -318 -565 -471 -517 -428 -371 -408 -351 -125 -475 -4 -78 -350 -404 -188
903a88J94l15o0M16l1k98L86P6l08N7k6L05l22L1L18r1n3j26L23P6L6k76L15K2
$$ -188 6 -309 -369 47 16 -282 104 180 -128 -71 -97 208 -114 -83 235 144 91 -35 288 364 400 124 439 461
927D61j92J8J87m12L22K08l75j09K57J52l70j9L36P6k65j82K20J37k29N0q2J7
$$ 461 269 287 474 62 384 592 217 108 365 517 147 128 464 540 275 93 313 450 221 271 189 206
949B06j06J25J33k47l70O32j44k03j39J44j09j88Q6J49q6m6K06k04j15K0l7J50
$$ 206 100 225 358 111 -259 373 229 26 -113 31 -78 -266 -180 -31 -117 -163 43 -161 -276 -256 -293 -143
971a43l20J41J04p1k47M6L49m47q2N13L1m21J76M54n34K14Qn4J1n9J85O8L5l05
$$ -143 -463 -322 -218 -289 -536 -490 -141 -588 -670 -157 -126 -547 -371 83 -451 -237 -229 -283 -272 -331 -146 -78 -43 -348
995c48J40M33n51n4N83Pl32R4L72k54m95O41o1J4j02K41j47p0K12%r2L07n54L28
$$ -348 -208 225 -326 -380 203 210 -122 -28 344 90 -405 236 175 189 87 328 181 111 323 323 231 538 -16 312
1019C12K83n36M20m1l96j90O12p1k76J77L37n49j40M82J4n92J79L06k56K90j58
$$ 312 595 59 479 438 42 -148 464 393 117 294 631 82 -58 424 438 -154 25 331 75 365 207
1040B07k07K76l27l51P57n9m31MK18k11k14M64k78n41L11M83m32L73j93l19k21
$$ 207 0 276 -51 -402 355 296 -135 -131 87 -124 -338 126 -152 -693 -382 101 -331 42 -151 -470 -691
1061f91L69J5R2Ok60l24P07l9m54M68j02o82M24L55j97m0M34o62j1L54L07k58
$$ -691 -322 -307 -215 -209 -469 -793 -86 -125 -579 -111 -213 -895 -471 -116 -313 -353 81 -581 -592 -238 69 -189
1083a89L26k31k39J47L97k54J01J54o30N07L52k67k45L17j15k20P46k40n64J1
$$ -189 137 -94 -333 -186 211 -43 58 212 -418 89 441 174 -71 246 131 -89 657 417 -147 -136
1103a36N15j85K46N4k12j40l3K17J09K63m59l66M61J95k01J67j71l75M2O03k2
$$ -136 379 194 440 494 282 142 109 326 435 698 239 -127 334 529 328 495 324 -51 -9 594 572
1124E72n44K41m31j89R49k80k07j79J13l15J91L05l6l55J59m87M49L75j28m76
$$ 572 28 269 -162 -351 598 318 111 -68 45 -270 -79 226 190 -165 -6 -493 -44 331 203 -273
1144b73R1j32k27L89M18p15P1K26k66K30K69j80p40K08J70L53L6J82o38J92O4
$$ -273 -182 -314 -541 -152 266 -449 -378 -152 -418 -188 81 -99 -839 -631 -461 -108 -72 110 -528 -336 -272
1165b72j22J02M50p06p0O27P7j75J62j00o35M03M11Rl8k44j49l9O17m1l16K28
$$ -272 -394 -292 158 -548 -618 9 86 -89 73 -27 -662 -259 152 161 123 -121 -270 -309 308 267 -49 179
1187A79j42k98N86J84o73L93k08J3O9O15m42p8o5j2q4O70j68l71k26L32k84L68
$$ 179 37 -261 325 509 -164 229 21 34 103 718 276 198 133 121 37 707 539 168 -58 274 -10 358
1209C58J53l67l0j13K55KM41l52q92N03M72l38K49J27o84j82M27O4k57J56j45
$$ 358 511 144 114 1 256 258 699 347 -545 -42 430 92 341 468 -216 -398 29 93 -164 -8 -153
1230a53l49M61%j96K18j63l98N44K33l44m66N44m03P2L02K89n84J42Q0j52qK96
$$ -153 -502 -41 -41 -237 -19 -182 -580 -36 197 -147 -613 -69 -472 -400 -98 191 -393 -251 -171 -323 -331 -35
1252c5L1l40J44K8J72J6j79l01L64k96K93K38M9o03K74K16j43KK28k29m1N7J10
$$ -35 -4 -344 -200 -172 0 16 -163 -464 -100 -396 -103 135 184 -419 -145 71 -72 -70 158 -71 -112 -55 55
1275E5J02K8J72l97R8J31j76L28ok81l45R66l77j21l7P9k76PM96n8k87Q1n9J03
$$ 55 157 185 357 -40 58 189 13 341 335 54 -291 675 298 177 140 219 -57 -50 446 388 101 182 123 226
1299B26L4J62j31n5j63N9K13k4m59J67K45j37J56r9m01N3M9J54p0N8k31K3n1K31
$$ 226 260 422 291 236 73 132 345 321 -138 29 274 137 293 194 -207 -154 -105 49 -21 37 -194 -171 -222 9
1323Ij48K90k76q6J53k33J85k22n8l5K47j23o3J66q3l7N8o5L94j30j50k2nK7J04
$$ 9 -139 151 -125 -211 -58 -291 -106 -328 -386 -421 -174 -297 -360 -194 -277 -314 -256 -321 73 -57 -207 -229 -234 -207 -103
1348a03Nl57K03qN9K92j31j72O5o2J96r9J53j93L5L01j05o8R3O8k85L08j88R9
$$ -103 -98 -455 -252 -260 -201 91 -40 -212 -147 -209 -13 -112 41 -152 -117 184 79 11 104 172 -113 195 7 106
1372A06R6j6j64N3P1J39j81J3k7J32j80K41o4k9l4M1P7k66J9K88j93o0Kjo7L67
$$ 106 202 186 22 75 146 285 104 117 90 222 42 283 219 190 156 197 274 8 27 315 122 62 64 63 -4 363
1398C63j37l10nJ23J33p9j02j2n6m9J84j4RJ7j27l1K03m06M4M2l7j1m1L2Q5k54
$$ 363 226 -84 -89 34 167 88 -14 -26 -82 -131 53 39 48 65 -62 -93 110 -296 -252 -210 -247 -258 -299 -267 -182 -436
1424d36J13m3J14K35j38J4oj26j78L49j91M6K95j25j20MJ00m1q1J04P3N7mq2j2
$$ -436 -323 -366 -252 -17 -155 -141 -147 -273 -451 -102 -293 -247 48 -77 -197 -193 -93 -134 -215 -111 -38 19 15 -67 -79
1449g9l9L3m3L06j76o4K49j86J98j06L49l74n8J47K9J60j97L06m12j03J76N6J0
$$ -79 -118 -85 -128 178 2 -62 187 1 199 93 442 68 10 157 186 346 149 455 43 -60 116 172 182
1472A82R2R6k9j23K9j00Nj58K05N8j37L9j01N9k05J25L01j99k56L93k13j60J33
$$ 182 274 370 341 218 247 147 152 -6 199 257 120 159 58 117 -88 37 338 139 -117 276 63 -97 36
1495C6k90K45j92R0J17Qj39p1J52M6r8Q7k23J94n6j65L2j5K44K8j19J00l40J19
$$ 36 -254 -9 -201 -111 6 14 -125 -196 -44 2 -96 -9 -232 -38 -94 -259 -227 -242 2 30 -89 11 -329 -210
1519b10O1j47K16m3J57k7J00o6Om2j76O0j35K74J32l65K15L3n6j33K71k49K97
$$ -210 -149 -296 -80 -123 34 7 107 41 47 5 -171 -111 -246 28 160 -205 10 43 -13 -146 125 -124 173
1542A73j43j9J38J88j26k3k37l9J66Q4p5l5N2Mj80N43m72K16j8j0L17m55M50k86
$$ 173 30 11 149 337 211 188 -49 -88 78 162 87 52 104 108 -72 471 -1 215 197 187 504 49 499 213
1566B13j37L96l69r9J65Q9j29K05r7j83j68K1K42l27o0M28j41o1j21q1K15J40
$$ 213 76 472 103 4 169 258 129 334 237 54 -114 -93 149 -178 -238 190 49 -12 -133 -214 1 141
1588A41k58j72J17M5J47l4n9j5n0r5K9M5O0O7k63K50l08L79k64J15L7rN3j64L4
$$ 141 -117 -289 -172 -127 20 -14 -73 -88 -138 -233 -204 -159 -99 -32 -295 -45 -353 26 -238 -123 -86 -95 -42 -206 -172
1613a72j1qj14M08j51r0L44l39j11J19K69k25N4o8R4J3k4J72j51J20j47J41J77
$$ -172 -183 -191 -305 103 -48 -138 206 -133 -244 -125 144 -81 -27 -95 -1 12 -12 160 9 129 -18 123 300
1636C00k00K0p1J56q8K05k28J17r2J83k00q1L94o1j37j90L07j97p1J42o6q2L42
$$ 300 100 120 49 205 117 322 94 211 119 302 102 21 415 354 217 27 334 137 66 208 142 60 402
1659D02k28j69N4%n0j9P1k4pM7k64J20K87k72J24m3o4j78P0K16k00R4j68L58N
$$ 402 174 5 59 59 9 -10 61 37 30 77 -187 -67 220 -52 72 29 -35 -213 -143 73 -127 -33 -201 157 162
1684A62J60n55J55j66O7J72Q2l47J37J53k50oN2M7o6k3J41OJ9K20k58n0j07K62
$$ 162 322 -233 -78 -244 -177 -5 77 -270 -133 20 -230 -236 -184 -137 -203 -226 -85 -79 -60 160 -98 -148 -255 7
1708Gq1J97l17p5K35j60j5R4J5R3J6J2K53k52l4J90l63L23l2K0R1k44O8K03j65
$$ 7 -74 123 -194 -269 -34 -194 -209 -115 -100 -7 9 21 274 22 -12 178 -185 138 106 126 217 -27 41 244 79
1733G9l2Q5m6Q4m04M53J00l21K88K2m24J09K09k29J03J55k01R8L06j09l16k6J43
$$ 79 47 132 86 170 -234 219 319 -2 286 308 -116 -7 202 -27 76 231 30 128 434 325 9 -17 126
1756A26k73K89m6k02j4L11o2j32M5j7m42N52M3k49J17j17j7q5K97j75k7r7N2j61
$$ 126 -147 142 96 -106 -120 191 129 -3 42 25 -417 135 178 -71 46 -71 -88 -173 124 -51 -78 -175 -123 -284
1780b84J11O7j15J96J45m56K69K06k85o3k5K09Q7j10po7mQ4p1K37j70j19qOPj58
$$ -284 -173 -106 -221 -25 120 -336 -67 139 -146 -209 -234 -25 62 -48 -55 -122 -126 -42 -113 124 -46 -165 -173 -167 -160 -318
1806c18L89ll63K06LJ72k6o4q9L54r5k82K32O5n6j83J07q2J10M10l25J5kJ7m7
$$ -318 71 68 -295 -89 -86 86 60 -4 -93 261 166 -116 116 181 125 -58 49 -33 77 487 162 177 175 192 145
1831A45P0Q3j95n3K35k78j5J80j37p3O6K21k66L39j79l45P4K61P6k46p2J79j1
$$ 145 215 298 103 50 285 7 -8 172 35 -38 28 249 -17 322 143 -202 -128 133 209 -37 -109 70 59
1854E9J8N7j79O4J0j53J77p8j03J67r8l9j15p5O6j3p5L54k55j2MK8L8R0M3j18
$$ 59 77 134 -45 19 29 -124 53 -25 -128 39 -59 -98 -213 -288 -222 -235 -310 44 -211 -223 -219 -191 -153 -63 -20 -138
1880a38k72K90K25j63Q4j10L5p7j67L19q6q3J78j61J57j15o6K20p3n9k0q6L22
$$ -138 -410 -120 105 -58 26 -84 -49 -126 -293 26 -60 -143 35 -126 31 -84 -150 70 -3 -62 -82 -168 154
1903A54r9L3q7o2J65J5J30k52j8K44k56J29j21mM60k69r4K44l86J34j19Q0J58
$$ 154 55 88 1 -61 104 119 249 -3 -21 223 -33 96 -25 -29 431 162 68 312 -74 60 -59 21 179
1926A79k7j84L14m9k99J72J6p4k4p6JO9nP2j89R6kJ01o2O5m5r4j40L00k14o0K64
$$ 179 152 -32 282 233 -66 106 122 48 24 -52 -51 18 13 85 -104 -8 -10 91 29 94 49 -45 -185 115 -99 -159 105
1953A05k76l4K28o3o7Q9k46m0J84j84J11J22J3N4j99Oj41Q3J11j00J07J28k61
$$ 105 -171 -205 23 -40 -107 -18 -264 -304 -120 -304 -193 -71 -58 -4 -203 -197 -338 -255 -144 -244 -137 -9 -270
1976b70J55K1m6J50m7j14o1J37M9j68J19J53m6j67K63j5J55m6k32K37k73R6JR
$$ -270 -115 -94 -140 10 -37 -151 -212 -75 -26 -194 -75 78 32 -135 128 113 268 222 -10 227 -46 50 51 60
2000F0R4j06j37J57M9J82k44pJ22rj12n1P5k41M58l75M69j56k53J91M5j23l0M3
$$ 60 154 48 -89 68 117 299 55 48 170 161 49 -2 73 -168 290 -85 384 228 -25 166 211 88 58 101
2024A01j27j41L80k50k8J47k95K68jm4j19j54K50k62K10K57l69r3J83K55l53J18
$$ 101 -26 -167 213 -37 -65 82 -213 55 54 10 -109 -263 -13 -275 -65 192 -177 -270 -87 168 -185 -67
2046f7N2R4k24K55l71P3ml3j07K66P0p9J92o7j90J53j19n2j01J87pJ97j32j2k12
$$ -67 -15 79 -145 110 -261 -188 -192 -225 -332 -66 4 -75 117 50 -140 13 -106 -158 -259 -72 -79 118 -14 -26 -238
2071b38K64k08J21J17l58M39q6O7k33J9K15j25J31K45j56M2j97o3P3K36j93l52
$$ -238 26 -182 -61 56 -302 137 51 118 -115 -96 119 -6 125 370 214 256 59 -4 69 305 112 -240
2093b40M33j34p8JK90l42K50o2k26J27O1k1j06N11o11K44l2q8N4K05k97Q1o4O2
$$ -240 193 59 -19 -18 272 -70 180 118 -108 19 80 59 -47 464 -147 97 65 -23 31 236 -61 20 -44 18
2117A8J5k36J96m5Q3J22m0M9n2j69k1n4K12k10M9k11K54l40M36Qn5Nk92p3M75
$$ 18 33 -203 -7 -52 31 153 113 162 110 -59 -80 -134 78 -132 -83 -294 -40 -380 56 64 9 14 -278 -351 124
2142A24j93k18p3J26J38K19j62J5Q3j02j84K64j31J54n8k26J73M2R0j70J66Q7
$$ 124 -69 -287 -360 -234 -96 123 -39 -24 59 -43 -227 37 -94 60 2 -224 -51 -9 81 -89 77 164
2164A64k70j12K06j16L10M6p5P1r7r3J38j84R4k09J08J3j9k8J04k9K11m1j87J67
$$ 164 -106 -218 -12 -128 182 228 153 224 127 34 172 -12 82 -127 -19 -6 -25 -53 51 22 233 192 5 172
2188A72k40J38p2N3q0J49L4o6n4L0K24k90K22j92L3j04L95k94J67j67j23L6J33
$$ 172 -68 70 -2 51 -29 120 154 88 34 64 288 -2 220 28 61 -43 352 58 225 58 -65 -29 104
2211A04j07q5K59k69J98j0L08n34J44j21N8N8L4j61R2j23O9j08K43k67j5L66k45
$$ 104 -3 -88 171 -98 100 90 398 -136 8 -113 -55 3 37 -124 -32 -155 -86 -194 49 -218 -233 133 -112
2234a12m1K62j85j07q0J85K38l61n6n7K61j4P6m08M38l0Q3l42J75N5N3j8l3j32
$$ -112 -153 109 -76 -183 -263 -78 160 -201 -257 -314 -53 -67 9 -399 39 9 92 -250 -75 -20 33 15 -18 -150
2258a50L04j64k4j6M3Q7K81j31n26L14j7Lj0K49j97p7J17J41k40K62j70j15J33
$$ -150 154 -10 -34 -50 -7 80 361 230 -296 18 1 4 -6 243 46 -31 86 227 -13 249 79 -36 97
2281I7j15J8R3L6l01J36L37l14OK33j16l58N23l87J0M7K37l5j79L43k40l7L3O1
$$ 97 -18 0 93 129 -172 -36 301 -13 -7 226 110 -248 275 -112 -102 -55 182 147 -32 311 71 34 67 128
2305A28r0j46L65j26j87J44lr4K20n11J48J07K5m6K0j14M6N3o0Q4L25m62q2O2
$$ 128 38 -108 257 131 -56 88 85 -9 211 -300 -152 -45 -20 -66 -46 -160 -114 -61 -121 -37 288 -174 -256 -194
2329a94J6Q6L7J1q1KK60P8m00L24j09j46N2R1Mj00j18J58q9K77l2j92N0J9L6J21
$$ -194 -178 -92 -55 -44 -125 -123 137 215 -185 139 30 -116 -64 27 31 -69 -187 -29 -118 159 127 -65 -15 4 40 161
2355A61R3j61J29k73L60k24r8J81n3Qjl16R9J97N6J18k12K00l18K25Q3j72k29
$$ 161 254 93 222 -51 309 85 -13 168 115 123 122 -194 -95 102 158 276 64 264 -54 171 254 82 -147
2378a47K41j88J77o3k7J40n0n8j48Q6J98l41K87j17O7j34q1J4N5K69k79P8k1n9
$$ -147 94 -94 83 20 -7 133 83 25 -123 -37 161 -180 107 -10 57 -77 -158 -144 -89 180 -99 -21 -42 -101
2402a01o9J66n4M3j8Q3k13N9J27Q5j47o3Q8L8J11j72J40k25Q3K7p8O1J5j50J42
$$ -101 -170 -4 -58 -15 -33 50 -163 -104 23 108 -39 -102 -14 24 135 -37 103 -122 -39 -12 -90 -29 -14 -164 -22
2427b2m4J81l6m6l5n7K80l30J77m9O9j16k4J22PJ43j52l46J3O10k89p1J08k07
$$ -22 -66 115 79 33 -2 -59 221 -109 68 19 88 -28 -52 70 77 220 68 -278 -265 345 56 -15 93 -114
2451a14J02J29k17K17j22P0Q2J18q0j85J78j20q5m1J56K2j07k2j16R2k1K13p6
$$ -114 -12 117 -100 117 -5 65 147 265 185 0 178 58 -27 -68 88 110 3 -19 -135 -43 -64 149 73
2474G3o8R0j43K77k4j98%m4J29P3j67J16l7k26K20k29J92k09L30o0j56k6J3p2
$$ 73 5 95 -48 229 205 7 7 -37 92 165 -2 114 77 -149 71 -158 34 -175 155 95 -61 -87 -74 -146
2498a46J62k51K78j53J09O0o9K13k6k9k02P6M3j72J97k28L43k04O6j28Q8O7j72
$$ -146 16 -235 43 -110 -1 59 -10 203 177 148 -54 22 65 -107 90 -138 205 1 67 -61 27 94 -78
2521g8K32k39L04l02jK26Pl40J29J41q2O4j46J82o2n3j34L14k79J76j26J11pJ06
$$ -78 154 -85 219 -83 -84 142 149 -191 -62 79 -3 61 -85 97 35 -18 -152 162 -117 59 -67 44 37 143
2545A43j08Q6q4KOm9K07j71N6n8j46K63j37N5K01k09l6O6L2q6k5j5k6J36j31j42
$$ 143 35 121 37 39 45 -4 203 32 88 30 -116 147 10 65 266 57 21 87 119 33 8 -7 -33 103 -28 -170
2571a70M13j32k37J65j35Q0l5j61M03q6O0j72OL8j71J00R6or2Q3m9j51J83k15
$$ -170 243 111 -126 39 -96 -16 -51 -212 191 105 165 -7 -1 37 -134 -34 62 56 -36 47 -2 -153 30 -185
2595a85J42q1K09j52K22k27q9K05K1m3J54j24q9l4M2P2p9J55j41J37k73P2%P2
$$ -185 -43 -124 85 -67 155 -72 -161 44 65 22 176 52 -37 -71 -29 43 -36 119 -22 115 -158 -86 -86 -14
2619a4l84K70K9R8j15J66q8L6j09L76j79J78j35J24l77M7K51j53j50J73jr8J26
$$ -14 -398 -128 -99 -1 -116 50 -38 -2 -111 265 86 264 129 253 -124 -77 174 21 -129 44 43 -55 71
2642G1k19M22j69n0J20l11J03l7r0J02P7j9P7n6k82L13J14q0p0j7m9M3k28K19
$$ 71 -148 274 105 55 175 -136 -33 -70 -160 -58 19 0 77 21 -261 52 166 86 16 -1 -50 -7 -235 -16
2666a6R5M2j66j65K98l85L03K2k30J50O3k03%J23Ol34J51K0J46q2J4P2q3J73j34
$$ -16 79 121 -45 -210 88 -297 6 28 -202 -52 11 -192 -192 -69 -63 -397 -246 -226 -80 -162 -148 -76 -159 14 -120
2691a20J00Lk9P3k20J58m3JJ25O9j76Q8j58j26K26m7R2J56k09N6j85j2K61N8j88
$$ -120 -20 -17 -46 27 -193 -35 -78 -77 48 117 -59 29 -129 -255 -29 -76 16 172 -37 19 -166 -178 83 141 -47
2716d7J55q7q6J29J54j01L2j57n6K95j16p2L19l16m4r8M3J53j36J15k5K80l89
$$ -47 108 21 -65 64 218 117 149 -8 -64 231 115 43 362 46 2 -96 -53 100 -36 79 54 334 -55
2739e5K52n8p7J50j74O5p4o5K9j70P7N8j9o0J81l1K9m7j76N1K91j62P9j8j89J47
$$ -55 197 139 62 212 38 103 29 -36 -7 -177 -100 -42 -61 -121 60 29 58 11 -165 -114 177 15 94 76 -113 34
2765C4P9j72P9n8J48j40j8P5l07K04K59j19m2j80R6M9j09J28k18J58n8J42J11
$$ 34 113 -59 20 -38 110 -30 -48 27 -280 -76 183 64 22 -158 -62 -13 -122 6 -212 -54 -112 30 141
2788A41m21L64j23J12J8j45J02O4k80J01K12j77R3j04P3N1M7J32l33m7K60r4K79
$$ 141 -280 84 -39 73 91 -54 48 112 -168 -67 145 -32 61 -43 30 81 128 260 -73 -120 140 46 325
2811C25k52j17K29j42L8j59K5l2J7J90M1j76J28o4p3R6P6j62J1J83k20K39j45
$$ 325 73 -44 185 43 81 -78 -53 -85 -68 122 163 -13 115 51 -22 74 150 -12 -1 182 -38 201 56
2834E6J21j57j87M10j74r2J06k2r9L09l68k0N2J08J06q7j96j25J99j27J06J67
$$ 56 177 20 -167 243 69 -23 83 61 -38 271 -97 -117 -65 43 149 62 -134 -259 -60 -187 -81 86
2856H6j59J13M6r8j01Q3r5M30j91l77K77j0l87J79l6K34k90N42Mn34K18J5j48
$$ 86 -73 40 86 -12 -113 -30 -125 305 114 -263 14 4 -383 -204 -240 -6 -296 246 250 -284 -66 -51 -199
2879a99K45m0L7l7J8N2j42J99k52J8P2n6J80jk12K6L8M4Q0r2n4J80K2q3K09L3
$$ -199 46 6 43 6 24 76 -66 133 -119 -101 -29 -85 95 94 -118 -92 -54 -10 70 -22 -76 104 126 43 252 285
2905B85m06J43j2N5K0k11M27k12Nk15J37J32J1Oj96J31k93M08j52M0M6L9k1K6
$$ 285 -121 22 10 65 85 -126 301 89 94 -121 16 148 159 165 -31 100 -193 215 63 103 149 188 167 193
2929A93k29Q6k7j16J66k80J50j09j23J30K60j30p7J97kk01j05K69l14J86m7K38
$$ 193 -36 50 23 -93 73 -207 -57 -166 -289 -159 101 -29 -106 91 89 -112 -217 52 -262 -76 -123 115
2951A15k51O6M3k17K73k93L63j55J01j70P2J1p7J1J38K56j40p5oj16J57l71L07
$$ 115 -136 -70 -27 -244 29 -264 99 -56 45 -125 -53 -42 -119 -108 30 286 146 71 65 -51 106 -265 42
2974D2l00J09J29j02P3M4L9J80m16K10j44K85j64J07l5J98l26J60j5M3K16m18
$$ 42 -258 -149 -20 -122 -49 -5 34 214 -202 8 -136 149 -15 92 57 255 -71 89 74 117 333 -85
2996h5J34J9R1q8K18k72J4J77o7l05mL02p4J40lj28m4j1K25j65k28K97p8pP6j79
$$ -85 49 68 159 71 289 17 31 208 141 -164 -168 134 60 200 197 69 25 14 239 74 -154 143 65 58 134 -45
3022d5k08K55j32M0J69p5M6l67J80J76R7k61J84j04K6q2K92j91j24M96n79K80
$$ -45 -253 2 -130 -90 79 4 50 -317 -137 39 136 -125 59 -45 -19 -101 191 0 -124 372 -207 73
3044G3j45m7J30k79K19K5p9J84l6J66k46K15L5m1j63l87L52k8K0q8j9J12QJ30
$$ 73 -72 -119 11 -268 -49 -24 -103 81 45 211 -35 180 215 174 11 -376 -24 -52 -32 -120 -139 -27 -19 111
3068A11O4n6jl1o1j0j86K06Q2J65j78j84J83k3j25j18L03l06K75L0k77J67l8J63
$$ 111 175 119 118 87 26 16 -170 36 118 283 105 -79 104 81 -44 -162 141 -165 110 140 -137 30 -8 155
3092A55k81Q7R0J32J0p7q5j00l6j11J25M09j53k45J20j47L6O8ln1j59L11J0m3
$$ 155 -126 -39 51 183 193 116 31 -69 -105 -216 -91 318 165 -80 40 -107 -71 -3 -6 -57 -216 95 105 62
3116F2j59J33j43j5K29Ll62K05R4j47L7P3j9P0Q5k56K14k04m6J21j09J19j8l2
$$ 62 -97 36 -107 -122 107 110 -252 -47 47 -100 -63 10 -9 61 146 -110 104 -100 -146 -25 -134 -15 -33 -65
3140f5k6Q8n3lJ22k7j57J93Oj65L05j87J08j9l51K27j7Q5J47j10k05J42J14k06
$$ -65 -91 -3 -56 -59 63 36 -121 72 78 -87 218 31 139 120 -231 -4 -21 64 211 101 -104 38 152 -54
3164e4P0O3Knj75J9J1J92O3j50Lm3QJ40j86J15j83J6J23k58L19k7k36J40J27K9
$$ -54 16 79 81 76 -99 -80 -69 123 186 36 39 -4 4 144 -42 73 -110 -94 29 -229 90 63 -173 -33 94 123
3190A23j85J47J96k63L8J06j71j07j8j9J51J01j89Jj36K90N9r3j30j18J70j40
$$ 123 -62 85 281 18 56 162 -9 -116 -134 -153 -2 99 -90 -89 -225 65 124 31 -99 -217 -47 -187
3212a87J39J4j04j4K47k39J01l5j19o9K46j6k06lJ38K5J25j12P4j05K17r4K7k74
$$ -187 -48 -34 -138 -152 95 -144 -43 -78 -197 -266 -20 -36 -242 -245 -107 -82 43 -69 5 -100 117 23 50 -224
3236b24q3K38J36j80L3j35Q3K29l7j4J25k86K46p4k40K70j79n3np2J33J37m4Q4
$$ -224 -307 -69 67 -113 -80 -215 -132 97 60 46 171 -115 131 57 -183 87 -92 -145 -150 -222 -89 48 4 88
3260H8j04Qr6P4j04KQ5O6L14k39o8j87N0K00J78k40q5L27k26P7j4j02R9l38L46
$$ 88 -16 -8 -104 -30 -134 -132 -47 19 333 94 26 -161 -111 89 267 27 -58 269 43 120 106 4 103 -235 111
3285A11j13l3p5O0K15j10P8j02J41j53r9J05N2j04j36K65k0%J4JJ1k87O9J26k00
$$ 111 -2 -35 -110 -50 165 55 133 31 172 19 -80 25 77 -27 -163 102 82 82 96 97 108 -179 -110 16 -184
3310a84J40k36J52Q1N7rmj20K42k32Q6J91j96R4k4J65r8k4l8k5j0J45k69K47j35
$$ -184 -44 -280 -128 -47 10 1 -3 -123 119 -113 -27 164 -32 62 38 203 105 81 43 18 8 153 -116 131 -4
3335dJ3M1k55K19J47j45j08J25J49r4O9j52J9J52k39J84j85K10k16J69J8k04k8
$$ -4 9 50 -205 14 161 16 -92 33 182 88 157 5 24 176 -63 121 -64 146 -70 99 117 -87 -115
3358a15K5m0L4J44Q2n6K5j1j39M3r0M5MJ70k17J53o8L88m51k7Q3m5J14JJ04l20
$$ -115 -90 -130 -96 48 130 74 99 88 -51 -8 -98 -53 -49 121 -96 57 -11 377 -74 -101 -18 -63 51 52 156 -164
3384a64oJ44J94j80J64k25K50k28k50J36j3J99r6j39lK62n0j14O1J58l47Q2K06
$$ -164 -170 -26 168 -12 152 -73 177 -51 -301 -165 -178 21 -75 -214 -217 45 -5 -119 -58 100 -247 -165 41
3407D1k34L6J62j93K03j52J4R9K14r3m1k0j12Q6J45j9l3j48J04j6k25K77n4j62
$$ 41 -193 -157 5 -188 15 -137 -123 -24 190 97 56 36 -76 10 155 136 103 -45 59 43 -182 95 41 -121
3431a21Q7J60J0PJ8j92J09L3o7o8L7M5N7j1o9N8J8%j87J25k1k19K57j64J63o8
$$ -121 -34 126 136 143 161 -31 78 111 44 -24 13 58 115 104 35 93 111 111 -76 49 28 -191 66 -98 65 -3
3457cQ6k59N7J15RJ01o7q3K01k95M5K92l20J09L8j68P1J18J88k32K14k36L0L7
$$ -3 83 -176 -119 -4 5 106 39 -44 157 -138 -93 199 -121 -12 26 -142 -71 47 235 3 217 -19 11 48
3481D8rj40j01J04J96k8n6q9o6lMj7O0L32n89L07J15N2k99L06k08P6m0k22J44
$$ 48 39 -101 -202 -98 98 70 14 -75 -141 -144 -140 -157 -97 235 -354 -47 68 120 -179 127 -81 -5 -45 -267 -123
3506a23K46j41K29n7k25k0Q9N5r5M8M3j62q5P9K73j68J32l30J25K40k27R3J03
$$ -123 123 -18 211 154 -71 -91 -2 53 -42 6 49 -113 -198 -119 154 -14 118 -212 -87 153 -74 19 122
3529A22j91N9J04n2o9O3j24K4J37n6j07K16q4P6k40L42o0L8m2m6j55J21J69p5
$$ 122 -69 -10 94 42 -27 36 -88 -64 73 17 -90 126 42 118 -122 220 160 198 156 110 -45 76 245 170
3553A70Pk57q5K92JJ5j26Ll24L64j39K93k05N7k04L32Qj5k39p0L3J4J95o1l75
$$ 170 177 -80 -165 127 128 143 17 20 -304 60 -79 214 9 66 -138 194 202 187 -52 -122 -89 -75 120 59 -316
3578c16r2L62M1q7k02L5K91J04k8j71R5J01k09N5j47MK06MJ40j86r8K00r9q4J05
$$ -316 -408 -46 -5 -92 -294 -259 32 136 108 -63 32 133 -76 -21 -168 -164 42 46 186 0 -98 102 3 -81 24
3603B4J75k53OJ54j90q1J47J11J4K9L6j68k1R8j52J72j78P1N6P1k04L1R3j78J43
$$ 24 199 -54 -48 106 -84 -165 -18 93 107 136 172 4 -17 81 -71 101 -77 -6 50 121 -83 -52 41 -137 6
3628FO9K56n02R5K1J28p7o2J36q3R5J3l02J47J50k1k08L0m3L69Q8l21j10K20J4
$$ 6 75 331 -171 -76 -55 73 -4 -66 70 -13 82 95 -207 -60 90 69 -139 -109 -152 217 305 -16 -126 94 108
3653A08K9j97J5J75l96J84J15L21l71k21J47J42n6r0R0l9l8j81K55j28J87l01
$$ 108 137 -60 -45 130 -266 -82 33 354 -17 -238 -91 51 -5 -95 -5 -44 -82 -263 -8 -136 51 -250
3675b50J18R8k2k2K1j06J88k8j18O1J71L6l24J27j64Q4L4o8L31K4j85j82K2J33
$$ -250 -132 -34 -56 -78 -57 -163 25 -3 -121 -60 111 147 -177 -50 -214 -130 -96 -164 167 191 6 -176 -154 -21
3699b1l8m2J53K15l42K28k93L70m57M55l79Q6k0J79l42L91r3j36J55J6Lk05L14
$$ -21 -59 -101 52 267 -75 153 -140 230 -227 228 -151 -65 -85 94 -248 143 50 -86 69 85 88 -117 197
3722A97l66K37j02k5J19Q9k5j42J12J67l42K55k52K84n34M42j18l8J01j29P5l9
$$ 197 -169 68 -34 -59 60 149 124 -18 94 261 -81 174 -78 206 -328 114 -4 -42 59 -70 5 -34
3744c4J04r1J24j37j74J05J08K58l82J87J5j88J56N4J31l55J40j46Q3P1k66M5
$$ -34 70 -21 103 -34 -208 -103 5 263 -119 68 83 -105 51 105 236 -119 21 -125 -42 29 -237 -192
3766a92J26K09k00J37j64J31oq2l7M3J4k8j62L11K8k00K36j71j10J79j64J44J8
$$ -192 -66 143 -57 80 -84 47 41 -41 -78 -35 -21 -49 -211 100 128 -72 164 -7 -117 62 -102 42 60
3789F0m7L3J63j80L9K4j26O4j04J90n4J01k31J3j28M09k11J42k61J35o3J14J93
$$ 60 13 46 209 29 68 92 -34 30 -74 116 62 163 -68 -55 -183 226 15 157 -104 31 -32 82 275
3812B75j07Ql27K58k28Q2Q9q6n9J39O4J78j74j10j14K5J28L4o7J10l7j27K59k13
$$ 275 168 176 -151 107 -121 -39 50 -36 -95 44 108 286 112 2 -112 -87 41 75 8 118 81 -46 213 0
3836@j39O9j28M0J67q8K00k05J01j30Q2K3N6j00J18n8k1K6r5j00J12Q3lM4M0p1
$$ 0 -139 -70 -198 -158 9 -79 121 -84 17 -113 -31 -8 48 -52 66 8 -13 13 -82 -182 -70 13 10 54 94 23
3862B3j68J16R4j02r9r7K60P3r1J28m8K8k64J04J67n64L58J39MKl3M6K5M6l23
$$ 23 -145 -29 65 -37 -136 -233 27 100 9 137 89 117 -147 -43 124 -440 -82 57 61 63 30 76 101 147 -176
3887a76O0J35j7l05l7M06k9k18M88j11l89jK79j12O2j57L7P5J54k94J05n1N9K8
$$ -176 -116 19 2 -303 -340 66 37 -181 307 196 -193 -194 85 -27 35 -122 -85 -10 144 -150 -45 -96 -37 -9
3911io9j70K51J03K37n28K31N2k26J17P0j93J98K0J2k17M21m49J37J30J66k33
$$ -9 -78 -248 3 106 343 -185 46 98 -128 -11 59 -134 64 84 96 -121 300 -149 -12 118 284 51
3933E1m6Pk95K05J38k06J6Q6j54L66j80J27k35K77m24N33m23K50O9j41L1j35K12
$$ 51 5 12 -283 -78 60 -146 -130 -44 -198 168 -12 115 -120 157 -267 266 -157 93 162 21 52 -83 129
3956A29j51j85J41N4j04N9l8O3J03n2j84J13m0j82N76m97J56j38J19L3QJ4j77
$$ 129 -22 -207 -66 -12 -116 -57 -95 -32 71 19 -165 -52 -92 -274 302 -195 -39 -177 -58 -25 -17 -3 -180
3979a80J70K2j01o7K66k6P6l77K59J8k28K20p9J00J22Q1j18J00k10j19j6j63K58
$$ -180 -10 12 -89 -156 110 84 160 -217 42 60 -168 52 -27 73 195 276 158 258 48 -71 -87 -250 8
4002Hq5J19P7l85R1J06N7j12K19n6n6Q9j59J13J3n6L2Q8l02J16qK42l07K44j51
$$ 8 -77 42 119 -266 -175 -69 -12 -124 95 39 -17 72 -87 26 39 -17 15 103 -199 -83 -91 151 -156 88 -63
4027f3OK7K05j89j65J93K7l1l1q4J00l35K59p8K36j23j24n2r0M50j75j63K98r2
$$ -63 -57 -30 175 -14 -179 14 41 10 -21 -105 -5 -340 -81 -159 77 -46 -170 -222 -312 138 -37 -200 98 6
4051Fj21J29j37Q3N9j58o8J77j1J60k08J13q1j3O8j86K72p6%j06P6q5J10J06k3
$$ 6 -115 14 -123 -40 19 -139 -207 -30 -41 119 -89 24 -57 -70 -2 -188 84 8 8 -98 -22 -107 3 109 86
4076H6J2l83M26l58K73R7M7j24m5j20K90j76j7j5j7O0Q5j43P7J57l71K21j57l6
$$ 86 98 -285 141 -217 56 153 200 76 31 -89 201 25 8 -7 -24 36 121 -22 55 212 -159 62 -95 -131
4100a31J12j40K73J23l35M8K2J33k2jk62J32l6JQ6j76j79J37L19k11P9j47R6Q4
$$ -131 -19 -159 114 237 -98 -50 -28 105 83 82 -180 -48 -84 -83 3 -173 -352 -215 104 -107 -28 -175 -79 5
4124EJ03j64K0J18O7j19k03J98Jj09l6Q8p2R6p9N8M28l11k02j7J54lq2J69m4J20
$$ 5 108 -56 -36 82 149 30 -173 25 26 -83 -119 -31 -103 -7 -86 -28 400 89 -113 -130 24 21 -61 108 64 184
4150A84k88MJ46j50K1K6K07M6j83J65j20l6l9J55j80P5On7J9M3J63j66Rn8m6Q7
$$ 184 -104 -100 46 -104 -83 -57 150 196 13 178 58 22 -17 138 -42 33 39 -18 1 44 207 41 50 -8 -54 33
4176C3j92J05o6L30p2m72M58k71K45k37J79j24K95k19j62L83l01N1R1n1L3r4L0
$$ 33 -159 -54 -120 210 138 -334 124 -147 98 -139 40 -84 211 -8 -170 213 -88 -37 54 3 36 -58 -28
4199b8J6K14j68j87K57k64P9O0J20k15L97k37k73L11k45J13nJ23J29j91j17J01
$$ -28 -12 202 34 -153 104 -160 -81 -21 99 -116 281 44 -229 82 -163 -50 -55 68 197 6 -111 -10
4221a0q6L4j48L20NR6pk53J46m9K26k77r5K1J90l00K74J33j82q2R0p0J23j36N4
$$ -10 -96 -62 -210 110 115 211 204 -49 97 48 274 -3 -98 -77 113 -187 87 220 38 -44 46 -24 99 -37 17
4246A7k81K35r3J53J8R8j47o0k7rJ27j42J51o4N3k03K78o0k09K09m7k22M02r7
$$ 17 -264 -29 -122 31 49 147 0 -60 -87 -96 31 -111 40 -24 29 -174 104 44 -165 44 -3 -225 177 80
4270H0N6l34K48j21L69r1j65J22k05J8j77L16r5J46l81K98Rk8j67n4L15l53J88
$$ 80 136 -198 50 -71 298 207 42 164 -41 -23 -200 116 21 167 -214 84 93 65 -102 -156 159 -194 -6
4293fJ20j71m8P0j8J36N5Pk0J09l48J58L5P8J7l01J18J96k11mj52L41j46j47j10
$$ -6 114 -57 -105 -35 -53 83 138 145 125 234 -114 44 79 157 174 -127 -9 187 -24 -28 -180 161 15 -132 -242
4318b42K20Jr6J37J93j88J27Nm11K25R1K4J82l04J24j80K67M5m89K16L0J40k51
$$ -242 -22 -21 -117 20 213 25 152 157 -254 -29 62 86 268 -36 88 -92 175 220 -269 -53 -23 117 -134
4341a34J36J73l61J55J36j21N6l66M12QJ5J82k23R3l7j45R4J4K98l28l8J74k82
$$ -134 2 175 -186 -31 105 -16 40 -326 86 94 109 291 68 161 124 -21 73 87 385 57 19 193 -89
4364h9J08M5M1j28l9K6j3J36L6q3l2k40L62O6k33R9o8j11M0K06n7J6r7J31J8k50
$$ -89 19 64 105 -23 -62 -36 -49 87 123 40 8 -232 130 196 -37 62 -6 -117 -77 129 72 88 -9 122 140 -110
4390a10Q9J39n4q0Q7K4j29q2j47L15R6k04O4N8N5k75M08m06L83j72r1k37K48K2
$$ -110 -21 118 64 -16 71 95 -34 -116 -263 52 148 -56 8 66 121 -154 254 -152 231 59 -32 -269 -21 1
4414An8n7Q1No9R3K19k87J35m4J8l01M01j0l58L35r3J0J01k52K19j43q8q2J85
$$ 1 -57 -114 -33 -28 -97 -4 215 -72 63 19 37 -264 137 127 -231 104 11 21 122 -130 89 -54 -142 -224 -39
4439c9J13k43J03J83N3l82J71j69N2L13j71K07j64j68J54m1J79j45Q1J21N8l05
$$ -39 74 -169 -66 117 170 -212 -41 -210 -158 155 -16 191 27 -141 13 -28 151 6 87 208 266 -39
4461c9m3K03n9k7m1J75m06L6K04J8O4k26J98N3j07l02j06L62q4K41j81OJ26%N9
$$ -39 -82 121 62 35 -6 169 -237 -201 3 21 85 -141 57 110 3 -299 -405 -43 -127 114 -67 -61 65 65 124
4486A24J97m15j2l0K28l13J33K69k89J91k44j0K40p7k04J51m0MK08k79J10J91
$$ 124 321 -94 -106 -136 92 -221 -88 181 -108 83 -161 -171 69 -8 -212 -61 -101 -97 111 -168 -58 133
4508A33k74K4K81k68k3Q9J33p5Q1k07R7K45n3l31QK43j95Q8K46k61p3J25p4L8
$$ 133 -141 -117 164 -104 -127 -38 95 20 101 -106 -9 236 183 -148 -140 103 -92 -4 242 -19 -92 33 -41 -3
4532cp4J24l9R0l0j22J34j15J37j94R9K72k96J39k86J32M3j04l5K43P1k62q5K04
$$ -3 -77 47 8 98 68 -54 80 -35 102 -92 7 279 -17 122 -164 -32 11 -93 -128 115 186 -76 -161 43
4556D3K68j71L5r6o3k0Qj23Q2Q9n4r5J0o9K50m01K78p7RK85l20J66j41K24j09
$$ 43 311 140 175 79 16 -4 4 -119 -37 52 -2 -97 -87 -156 94 -307 -29 -106 -97 188 -132 34 -107 117 8
4581HJ28l75P0J67O5k11J59n8J81k27n0K51j04j75K60n7J15p3N0pm9j27L9K09
$$ 8 136 -239 -169 -2 63 -148 11 -47 134 -93 -143 108 4 -171 89 32 147 74 124 117 68 -59 -20 189
4605A89k02R6J8k20O4K11k32J73q5KJ57l08J78%M0j40%J91J1O7k22J2J8k2K68
$$ 189 -13 83 101 -119 -55 156 -76 97 12 14 171 -137 41 41 81 -59 -59 132 143 210 -12 0 18 -4 264
4630B64m42M8L53r0j66K5J01j32l5O4j6O5j54p6K32J7m3n3P0o1K40k09o2Q0k82
$$ 264 -178 -130 223 133 -33 -8 93 -39 -74 -10 -26 39 -115 -191 41 58 15 -38 32 -29 211 2 -60 20 -262
4655b62K80j08l3Q9%j04K28j56J12O8l8j56k13K94K18k77o5J95p6K2KK04k65J3
$$ -262 18 -90 -123 -34 -34 -138 90 -66 46 114 76 -80 -293 1 219 -58 -123 72 -4 18 20 224 -41 -28
4679b8J48j40J50o5r5N5J1k02K02p7K21k87J81j52MO7o1J99k22j01m2J10l1J54
$$ -28 120 -20 130 65 -30 25 36 -166 36 -41 180 -107 74 -78 -74 -7 -68 131 -91 -192 -234 -124 -155 -1
4703ar0j55oL15o4m8O7J9j72L4r7J55K6L30j19p3j88K44Jp0j11o4K32k44K03j85
$$ -1 -91 -246 -252 63 -1 -49 18 37 -135 -101 -198 -43 -17 313 194 121 -67 177 178 108 -3 -67 165 -79 124 -61
4729f1p9J26n2j05J95J68k83K06j35j04K00L7m00J18J06J98n3j99Q6J69k27J24
$$ -61 -140 -14 -66 -171 24 192 -91 115 -20 -124 76 113 -287 -169 -63 135 82 -117 -31 138 -89 35
4751C5ol10R1L15j53O6l16J84M37k73j39J38K62m04q8K56j55K4Q0k41K47K08l64
$$ 35 29 -281 -190 125 -28 38 -278 -94 343 70 -69 69 331 -73 -161 95 -60 -36 44 -197 50 258 -106
4774a06J30K0j56K3J43Qm0j8M7m6l2j10N0L00Q0j85Q0p2r6K10j11j75K77n20L20
$$ -106 24 44 -112 -89 54 62 22 4 51 5 -27 -137 -87 213 293 108 188 116 20 230 119 -56 221 -299 21
4799B1J22J7j75J15n5k77L92l51J78J65k38J48J8l07K08j15L50k79J50l4lm2l0
$$ 21 143 160 -15 100 45 -232 160 -191 -13 152 -86 62 80 -227 -19 -134 216 -63 87 53 50 8 -22
4822b2q0k0J19j44K27k28L31k18j46O7M4L50l27J30p5j02R9l2Qk5K44l82J4J9
$$ -22 -102 -122 -3 -147 80 -148 183 -35 -181 -114 -70 280 -47 83 8 -94 5 -27 -19 -44 200 -182 -168 -149
4846a49p9K06j31J9P7J44j29L4n9L9Q1k43J97M3j2j0r4Q8j58J30J17j27j49K4
$$ -149 -228 -22 -153 -134 -57 87 -42 -8 -67 -28 53 -190 7 50 38 28 -66 22 -136 -6 111 -16 -165 -141
4870a41K51k27J67J78j84k74K35J9r2K28j85N3j07n3J08R7k7j40J85n1j73N9J49
$$ -141 110 -117 50 228 44 -230 5 24 -68 160 -25 28 -79 -132 -24 73 46 -94 91 40 -133 -74 75
4893G5R6j18J27J8j77J74j92j35K85m3o7J02k49M5j07L20l49j28M03j53K15j07
$$ 75 171 53 180 198 21 195 3 -132 153 110 43 145 -104 -59 -166 154 -195 -323 80 -73 142 35
4915C5L5j42J66j91J12J67j24O7l82K18L9ll4j07J07n3M6%J48n8j88QL5J54J85
$$ 35 70 -72 94 -97 15 182 58 125 -257 -39 0 -3 -37 -144 -37 -90 -44 -44 104 46 -142 -134 -99 55 240
4940B40j21j09J8m9r4J84N7m60M16J86j62o0J90j59K1l14L73k12j3Q9j2k18j5
$$ 240 119 10 28 -21 -115 69 126 -334 82 268 106 46 236 77 98 -216 157 -55 -68 21 9 -209 -224
4963b24K48j03j63L15j36J6r8K13k55J63O9J77k73R9j14L72j58l57L31j93J53
$$ -224 24 -79 -242 73 -63 -47 -145 68 -187 -24 45 222 -51 48 -66 306 148 -209 122 -71 82
4984H2k1j50P1j17j78M84k04J09J44r3r8J0J4J60k71Q4N0j20Q4lL04k59q9K4J38
$$ 82 61 -89 -18 -135 -313 171 -33 76 220 127 29 39 53 213 -58 26 76 -44 40 37 341 82 -7 17 155
5009A55j13j90J11J17q8k65M80j44k23J23M5K7M7J1m1J37k97O7Q8j66J43N2k86
$$ 155 42 -148 -37 80 -8 -273 207 63 -160 -37 8 35 82 93 52 189 -108 -41 47 -119 24 76 -210
5032b10K63J18k96M5j36K48j28pj6q1JJ29K97o5k42l8L17j24L9j34J41j36n1J38
$$ -210 53 171 -125 -80 -216 32 -96 -103 -119 -200 -199 -70 227 162 -80 -118 199 75 114 -20 121 -15 -66 72
5056G2J37j07m7J5O4n9j14n9K14J8ko0k50K94k61L14O2l06N5nM35n35K11j96l8
$$ 72 209 102 55 70 134 75 -39 -98 116 134 132 72 -178 116 -145 169 231 -75 -20 -25 410 -125 86 -110 -148
5081a48J61j08J46j9K7j20r9J85k35K20j67J05R5K35k7n14K12M9j75R0J87m3J31
$$ -148 13 -95 51 32 59 -61 -160 25 -210 10 -157 -52 43 278 251 -263 -51 -2 -177 -87 100 57 188
5104A88m29K27P5j19K05j15q0P8k80J77J70k7j83p8M5K97k43J14j27j41M3K27
$$ 188 -241 -14 61 -58 147 32 -48 30 -250 -73 97 70 -113 -191 -146 151 -92 22 -105 -246 -203 24
5126B4JJ16k60k4K80j68J58o7k18L46Rn4j83k0N8k18L12j02j63K18K06l71K82
$$ 24 25 141 -119 -143 137 -31 127 60 -158 188 197 143 -40 -60 -2 -220 92 -10 -173 45 251 -120 162
5149A62q6M5l8j38O9P7p4p3j9Q7J84Kj89j81R7M3K9J9L4L8l8j30J90J59k56j9
$$ 162 76 121 83 -55 14 91 17 -56 -75 12 196 198 9 -172 -75 -32 -3 16 50 88 50 -80 110 269 13 -6
5175fq7L52l49J50p7n2qP9N6k11K26n5j98Q5Q4Kk99M42k03J44k8k33J12J05j24
$$ -6 -93 259 -90 60 -17 -69 -77 2 58 -153 73 18 -180 -95 -11 -9 -308 134 -69 75 47 -186 -74 31 -93
5200i3j38L92j99o4J22J51k14K79k64M3j94K01j60K48kj38J86O5j29P8j34J0j32
$$ -93 -231 161 -38 -102 20 171 -43 236 -28 15 -179 22 -138 110 108 -30 156 221 92 170 36 46 -86
5223h6rK94m8k42J12J02n3k4k84J43J16N7j10P4J08j49j52K26n3R0o0n1R2l9J28
$$ -86 -95 199 151 -91 21 123 70 46 -238 -95 21 78 -32 42 150 1 -151 75 22 112 52 1 93 54 182
5248A82lL9k78Q6Q2j4l33O7J56J29k73P9J96K2K4k28MK0n7J28l4J32m6k0m7q9
$$ 182 179 218 -60 26 108 94 -239 -172 -16 113 -160 -81 115 137 161 -67 -63 -43 -100 28 -6 126 80 60 13 -76
5274g6j92R3K78k12J96j77Q9k14K29j32O2J54k19J78j60J47N4Q8k37J15j8K02
$$ -76 -268 -175 103 -109 87 -90 -1 -215 14 -118 -56 98 -121 57 -103 44 98 186 -51 64 46 248
5296B48m67J61J10r7l8R0J14l44R5N9m5j6R5J31k09J91k84L48j07P5j52j38K58
$$ 248 -219 -58 52 -45 -83 7 121 -223 -128 -69 -114 -130 -35 96 -113 78 -206 142 35 110 -42 -180 78
5319G8k22R0Q1o3K13k75J18j05K52k39O1J70l14pK33j98J87O8m13K44J05L8J89
$$ 78 -144 -54 27 -36 177 -98 20 -85 167 -72 -11 159 -155 -162 71 -127 60 128 -285 -41 64 102 291
5342B91l49o2Q9N4OP9K1j43o5K59j52j49J00J07J62k39j59L79k31J05J79k72m68
$$ 291 -58 -120 -31 23 29 108 129 -14 -79 180 28 -121 -21 86 248 9 -150 229 -2 103 282 10 -458
5365d58M75L7r6N4r4M7p5j80N90j87k61k1J89j7q5J19j14j63K96j82L1R4N8k19
$$ -458 17 54 -42 12 -82 -35 -110 -290 300 113 -148 -169 20 3 -82 37 -77 -240 56 -126 -95 -1 57 -162
5389a62L39k30n7o6K05J43k43O5J12j60N7jj32K12j91j95J21M55l46j33K99m6
$$ -162 177 -53 -110 -176 29 172 -71 -6 106 -54 3 2 -130 82 -109 -304 -183 272 -74 -207 92 46
5411D6j05K85j99J75j82m2lnK34k4l20P5P3j00J19k22N9J88Qj87J01P9K9j20K08
$$ 46 -59 226 27 202 20 -22 -25 -30 204 180 -140 -65 8 -92 27 -195 -136 52 60 -127 -26 53 82 -38 170
5436A70r9J7p2J16j95J72k10Q5M6l7k89L85l60K71O4r7K45k71J16k62J12P1L07
$$ 170 71 88 16 132 -63 109 -101 -16 30 -7 -296 89 -271 0 64 -33 212 -59 57 -205 -93 -22 285
5459B85l44K08j88K5j91J46p0L10k59J34J9l07J50J72j42M1M7o4J88k33N4j47
$$ 285 -59 149 -39 -14 -205 -59 -129 181 -78 56 75 -232 -82 90 -52 -11 36 -28 160 -73 -19 -166
5481a66J73M4n1j38P6l8k5k5K38o2j05K2J75j77O5J45j80l8J52j51J%j38L21J53
$$ -166 7 51 0 -138 -62 -100 -125 -150 88 26 -79 -57 118 -59 6 151 -29 -67 85 -66 -65 -65 -203 118 271
5506B71k26j9j6j49J31o1J1m9L17k60K64l94J01J86q2M6p3j29K32j14M8N7j89
$$ 271 45 26 10 -139 -8 -69 -58 -107 210 -50 214 -180 -79 107 25 71 -2 -131 101 -13 35 92 -97
5529i7rr2L37m4j28k9KJ35p3j38J45J85j78N5n0L7M1k98K14j0j38J72L8K53m43
$$ -97 -106 -198 139 95 -33 -62 -60 75 2 -136 9 194 16 71 21 58 99 -199 15 5 -133 39 77 330 -113
5554a13L05Lm1r3p8j77J51J47k36L17k3j58J41j92j01J29m8L7k02K32l4N1j31
$$ -113 192 195 154 61 -17 -194 -43 104 -132 185 162 4 145 -47 -148 -19 -67 -30 -232 0 -34 17 -114
5577a14K31k12K27k62L3J9K56j45k16M6P0j10L02j38R4n3J36p9n4o7R7o9r1J37
$$ -114 117 -95 132 -130 -97 -78 178 33 -183 -137 -67 -177 125 -13 81 28 164 85 31 -36 61 -8 -99 38
5601C8k15J61o2J90k00J40j49J80K9j18K37l82L32o3q1j1m4k9L0N7l1J33j82J29
$$ 38 -177 -16 -78 112 -88 52 -97 83 112 -6 231 -151 181 118 37 26 -18 -47 -17 40 9 142 -40 89
5625H9K7j85j29l3M72j91J42k01J86m28P2LJ85J98j38K9m9l1J7R6Qj27P3m28K78
$$ 89 116 -69 -198 -231 241 50 192 -9 177 -251 -179 -176 9 207 69 98 49 18 35 131 139 12 85 -343 -65
5650f5o2r0K50j74L1J01m3p3M06j74k40n0K29l1k52K34R9l13k1J28J53J57j78
$$ -65 -127 -217 33 -141 -110 -9 -52 -125 281 107 -133 -183 46 15 -237 -3 96 -217 -238 -110 43 200 22
5673B2k31J41r9J99k5J13l4k78J80K9N5j2o7k22J87Q4J90j60o7N6j62M3K24O6
$$ 22 -209 -68 -167 32 7 120 86 -192 -12 17 72 60 -7 -229 -42 42 232 72 5 61 -101 -58 166 232
5697B32j58m6q1o5L40k15L4j49m0J31Q1P8Kj40j13J18p0j01J97R6j7N5jk42K45
$$ 232 74 28 -53 -118 222 7 41 -108 -148 -17 64 142 144 4 -109 9 -61 -162 35 131 114 169 168 -74 171
5722A71l20J93J01j08k53lK90m31N31l55K12j15K50j95Lmj65R0K27m96K51n3L72
$$ 171 -149 44 145 37 -216 -219 71 -360 171 -184 28 -87 163 -32 -29 -33 -198 -108 119 -377 -126 -179 193
5745A93j02j64J11n6Op2J33J0j5J0Q4k4o2J77j17M6k03K07k06j5J65q8o1K1J60
$$ 193 91 -73 38 -18 -12 -84 49 59 44 54 138 114 52 229 112 158 -45 162 -44 -59 106 18 -43 -22 138
5770A38K1j90n6K11k9L8RL0k88K78j80R4j9j58K02l1K62l53K51q6qj15J84j79
$$ 138 159 -31 -87 124 95 133 142 172 -116 162 -18 76 57 -101 101 70 332 -21 230 144 136 21 205 26
5794B6j63OJ54j20O8N7q9M3J4o2kJ79k76J02k13K86k1k2J25j14J49Lj75R0k64
$$ 26 -137 -131 23 -97 -29 28 -61 -18 -4 -66 -68 111 -165 -63 -276 10 -11 -33 92 -22 127 130 -45 45 -219
5819b19J87j67K24j57RK45m07N14l00j78J88j86N6K50J50l21K77l09Nq7L58j14
$$ -219 -32 -199 25 -132 -123 122 -285 229 -71 -249 -61 -247 -191 59 209 -112 165 -144 -139 -226 132 18
5841A8n6M9P3j08Q4L4j76o9K43j42R9k38M20m00J6M64l04r4J52j42K04M5K8j92
$$ 18 -38 11 84 -24 60 94 -82 -151 92 -50 49 -189 231 -169 -153 311 7 -87 65 -77 127 172 200 8
5865HO8nj28J33j11O8q7K29k58j01M31j48Q4J8l03K73m08J47J25l7L9N1j60q6
$$ 8 76 71 -57 76 -35 33 -54 175 -83 -184 247 99 183 201 -102 171 -237 -90 35 -2 37 88 -72 -158
5889a58P8qJ30j07K69j65j18l5J01Q8m2Q9k65J33r4K71j46Q6j26J88j11k59J69
$$ -158 -80 -88 42 -65 204 39 -79 -114 -13 75 33 122 -143 -10 -104 167 21 107 -19 169 58 -201 -32
5912c2MQ9j39R3J08k99R1m1K14Lk3j12l6K7N4O4J08m14L24r7J09Q0r8j05Lj34
$$ -32 -28 61 -78 15 123 -176 -85 -126 88 91 68 -44 -80 -53 1 65 173 -241 83 -14 95 175 77 -28 -25 -159
5938a59J25J80j75P2m5j4j05J80k77K19K94l44k6R0k11Q0J31k00K72q3k70K92
$$ -159 -34 146 -29 43 -2 -16 -121 59 -218 1 295 -49 -75 15 -196 -116 15 -185 87 4 -266 26
5960B6j31%J67M0j60R7J97l59K24k8q9n7K10K6j49J12k32j54J13J72J90j58l0
$$ 26 -105 -105 62 102 -58 39 236 -123 101 73 -16 -73 137 163 14 126 -106 -260 -147 25 215 57 27
5983B7p4J54k32J38Q4K1j63j11J79J11j43l9j7K53j00m9J25k99J99j64K13k71
$$ 27 -47 107 -125 13 97 118 -45 -156 23 134 -9 -48 -65 188 88 39 164 -135 64 -100 113 -158
6005a58P6O4q9R8k22J73N8LK8Q2k50N8J60n3o5R7nl39L57j45N8O5k4L7L6r5k29
$$ -158 -82 -18 -107 -9 -231 -58 0 3 31 113 -137 -79 81 28 -37 60 55 -284 73 -72 -14 51 27 64 100 5 -224
6032b24L90j24j39J67M0j04j14L01l7k24jM6Q4jj48l9J77o4j07j6K54O6j80K5
$$ -224 166 42 -97 70 110 6 -108 193 156 -68 -69 -23 61 60 -88 -127 50 -14 -121 -137 117 183 3 28
6056B8o2K49k93K57j55K6j49QJ89j92j07K77%j05N1n9K23n1K0j72J23j37J09j00
$$ 28 -34 215 -78 179 24 50 -99 -91 98 -94 -201 76 76 -29 22 -37 186 135 155 -17 106 -31 78 -22
6080b2J1j36j0R4J45r6r7n1L2j03J90J00K6j81k07O3K58j02Q6j92M36l44j7r3
$$ -22 -11 -147 -157 -63 82 -14 -111 -162 -130 -233 -43 57 83 -98 -305 -242 16 -86 0 -192 244 -100 -117 -210
6104b10K31k04K38M1J8K0q4K1m1k22O2K43l62J41J93K0j05J31j93N3L10l23J0
$$ -210 21 -183 55 96 114 134 50 71 30 -192 -130 113 -249 -108 85 105 0 131 -62 -9 301 -22 -12
6127a2n1J45j32L04j20r7o9q8J52j07K28j53N6k94K26j30J29K58k86j9K42k05
$$ -12 -63 82 -50 254 134 37 -32 -120 32 -75 153 0 56 -238 -12 -142 -13 245 -41 -60 182 -23
6149b3J7J09j47j06K46j8j27Q5j29L9J70kJ63k12Q1j04K8n1k19L18p6J68q0j75
$$ -23 -6 103 -44 -150 96 78 -49 36 -93 -54 116 114 277 65 146 42 70 19 -200 118 42 210 130 -45
6173d5Q3J7k79L27O5k12k18L38J50l77J3m8J03N7Q5MJ26j20k38J18J5j28J61j39
$$ -45 38 55 -224 103 168 -44 -262 76 226 -151 -138 -186 -83 -26 59 63 189 69 -169 -51 -36 -164 -3 -142
6197a42K99j83l5P4O2j36l8q9P3N1o3K24j38LQ8k08o1L55j74K32l89l7K13J44
$$ -142 157 -26 -61 13 75 -61 -99 -188 -115 -64 -127 97 -41 -38 50 -158 -219 136 -38 194 -195 -232 -19 125
6221A25O2l53M1J53J9j82J89K5k09M08m30J03l9J06P6q3Q9J35l93J05K04n94N41
$$ 125 187 -166 -125 28 47 -135 54 79 -130 278 -152 -49 -88 18 94 11 100 235 -158 -53 151 -443 98
6244I8j92J93o5k66K79m9R9m7j21q2P8J13Q3n4j6J15k05NL2%J96p3q8l2O7k53
$$ 98 -94 99 34 -232 47 -2 97 50 -71 -153 -75 38 121 67 51 166 -39 -34 -2 -2 194 121 33 1 68 -185
6270a85L6l0j24L54J18k26j15J03M4L32l67K86k32m4L6Q2N7j62P6j36P3Q0k67
$$ -185 -149 -179 -303 51 169 -57 -172 -69 -25 307 -60 226 -6 -50 -14 68 125 -37 39 -97 -24 56 -211
6293b11L91k41K98k37J59p2k48K50l4j60m0lK85Rj19j57J91j64p7K23m8P8j40
$$ -211 180 -61 237 0 159 87 -161 89 55 -105 -145 -148 137 146 27 -130 61 -103 -180 43 -5 73 -67
6316f7J4J73k5l1j56K26K9k01n1j60L52l64M09r4Ok38K20j26m0J01J02N5k99K37
$$ -67 -53 120 95 64 -92 134 163 -38 -89 -249 103 -261 148 54 60 -178 42 -84 -124 -23 79 134 -165 72
6340G2j81m2K0M2K5N4nj57J80K9m4P7J0j98j13L38k94P8M6k12K07P3j10p3K84
$$ 72 -109 -151 -131 -89 -64 -10 -15 -172 8 37 -7 70 80 -118 -231 107 -187 -109 -63 -275 -68 5 -105 -178 106
$$ [...]
8191a80
##END NTUPLES=NMR FID
##END=
