##TITLE=1H_LR-618-R3-CR-OST
 DMSO, 8 sc, 
 28.06.2021
##JCAMPDX= 6.0         $$ Bruker NMR JCAMP-DX V2.0
##DATA TYPE= NMR FID
##DATA CLASS= NTUPLES
##ORIGIN= UXNMR, Bruker Analytische Messtechnik GmbH
##OWNER= root
$$ XWIN-NMR		Version 3.5
$$ Mon Jun 28 12:13:54 2021 Russian Standard Time (UT+4h)  she@DPX200
##.OBSERVE FREQUENCY= 200.131506
##.OBSERVE NUCLEUS= ^1H
##.DELAY= (6, 6)
##.ACQUISITION MODE= SIMULTANEOUS
##.ACQUISITION SCHEME= undefined
##.AVERAGES= 8
##.DIGITISER RES= 18
##SPECTROMETER/DATA SYSTEM= spect
##.PULSE SEQUENCE= zg30
##.SOLVENT NAME= CDCl3
##.SHIFT REFERENCE= (INTERNAL, CDCl3, 0, 15.7039)
##AUDIT TRAIL= $$ (NUMBER, WHEN, WHO, WHERE, WHAT)
$$ ##TITLE= Audit trail, XWIN-NMR		Version 3.5
$$ ##JCAMPDX= 5.01
$$ ##ORIGIN= Bruker BioSpin GmbH
$$ ##OWNER= she
$$ F:/spectra/data/she/nmr/H-F/1/audita.txt
$$ ##AUDIT TRAIL=  $$ (NUMBER, WHEN, WHO, WHERE, WHAT)
(   1,<2021-06-28 12:12:50.87 +0400>,<she>,<DPX200>,
      <created by zg, POWCHK disabled, PULCHK disabled
       configuration hash MD5:
       00 E9 B6 7A A2 85 ED C7 34 08 36 98 17 FE 4E 26
       data hash MD5: 16K
       83 E1 8B 7F 1A 71 42 5E 66 C1 CE 72 2F 85 84 9B>)
$$ ##END=
$$ 
$$ hash MD5
$$ B6 65 D5 56 B4 89 56 9B 18 90 2D 05 E1 E3 FC 69
##$RELAX= 
##$RELAX= 
##$RELAX= 
##$RELAX= 
##$RELAX= 
##$RELAX= 
$$ Bruker specific parameters
$$ --------------------------
##$DU= <F:/spectra>
##$EXPNO= 1
##$NAME= <H-F>
##$PROCNO= 1
##$TYPE= <nmr>
##$USER= <she>
##$AMP= (0..31)
100 100 100 100 100 100 100 100 100 100 100 100 100 100 100 100 100 100 
100 100 100 100 100 100 100 100 100 100 100 100 100 100 
##$AQSEQ= 0
##$AQ_mod= 1
##$AUNM= <au_zg>
##$AUTOPOS= <>
##$BF1= 200.13
##$BF2= 200.13
##$BF3= 200.13
##$BF4= 200.13
##$BF5= 200.13
##$BF6= 200.13
##$BF7= 200.13
##$BF8= 200.13
##$BYTORDA= 1
##$CFDGTYP= 0
##$CFRGTYP= 5
##$CHEMSTR= <none>
##$CNST= (0..31)
1 1 145 1 1 1 1 1 1 1 1 1 1 1 1 1 1 1 1 1 1 1 1 1 1 1 1 1 1 1 1 1 
##$CPDPRG= <>
##$CPDPRG1= <>
##$CPDPRG2= <>
##$CPDPRG3= <>
##$CPDPRG4= <mlev>
##$CPDPRG5= <mlev>
##$CPDPRG6= <mlev>
##$CPDPRG7= <mlev>
##$CPDPRG8= <mlev>
##$CPDPRGB= <>
##$CPDPRGT= <>
##$D= (0..31)
0 1.2 0 0 0 0 0 0 0 0.06 0 0.03 0 0 0 0 0.0002 0 0 0 0 0 0 0 0 0 0 0 0 
0 0 0 
##$DATE= 1624867970
##$DBL= (0..7)
120 120 120 120 120 120 120 120 
##$DBP= (0..7)
150 150 150 150 150 150 150 150 
##$DBP07= 0
##$DBPNAM0= <>
##$DBPNAM1= <>
##$DBPNAM2= <>
##$DBPNAM3= <>
##$DBPNAM4= <>
##$DBPNAM5= <>
##$DBPNAM6= <>
##$DBPNAM7= <>
##$DBPOAL= (0..7)
0.5 0.5 0.5 0.5 0.5 0.5 0.5 0.5 
##$DBPOFFS= (0..7)
0 0 0 0 0 0 0 0 
##$DE= 6
##$DECBNUC= <off>
##$DECIM= 32
##$DECNUC= <off>
##$DECSTAT= 4
##$DIGMOD= 1
##$DIGTYP= 9
##$DL= (0..7)
0 120 120 120 120 120 120 120 
##$DP= (0..7)
150 150 150 150 150 150 150 150 
##$DP07= 0
##$DPNAME0= <>
##$DPNAME1= <>
##$DPNAME2= <>
##$DPNAME3= <>
##$DPNAME4= <>
##$DPNAME5= <>
##$DPNAME6= <>
##$DPNAME7= <>
##$DPOAL= (0..7)
0.5 0.5 0.5 0.5 0.5 0.5 0.5 0.5 
##$DPOFFS= (0..7)
0 0 0 0 0 0 0 0 
##$DQDMODE= 0
##$DR= 18
##$DS= 0
##$DSLIST= <SSSSSSSSSSSSSSS>
$$ [...]
##$SUBNAM2= <"">
##$SUBNAM3= <"">
##$SUBNAM4= <"">
##$SUBNAM5= <"">
##$SUBNAM6= <"">
##$SUBNAM7= <"">
##$SUBNAM8= <"">
##$SUBNAM9= <"">
##$SW= 20.0188882624521
##$SWIBOX= (0..15)
0 0 2 0 0 0 0 0 0 0 0 0 0 0 0 0 
##$SW_h= 4006.41025641026
##$TD= 16384
##$TD0= 1
##$TE= 0
##$TE2= 300
##$TE3= 300
##$TEG= 300
##$TL= (0..7)
0 120 120 120 120 120 120 120 
##$TP= (0..7)
150 150 150 150 150 150 150 150 
##$TP07= 0
##$TPNAME0= <>
##$TPNAME1= <>
##$TPNAME2= <>
##$TPNAME3= <>
##$TPNAME4= <>
##$TPNAME5= <>
##$TPNAME6= <>
##$TPNAME7= <>
##$TPOAL= (0..7)
0.5 0.5 0.5 0.5 0.5 0.5 0.5 0.5 
##$TPOFFS= (0..7)
0 0 0 0 0 0 0 0 
##$TUNHIN= 0
##$TUNHOUT= 0
##$TUNXOUT= 0
##$USERA1= <user>
##$USERA2= <user>
##$USERA3= <user>
##$USERA4= <user>
##$USERA5= <user>
##$V9= 5
##$VALIST= <valist>
##$VCLIST= <CCCCCCCCCCCCCCC>
##$VD= 0
##$VDLIST= <DDDDDDDDDDDDDDD>
##$VPLIST= <PPPPPPPPPPPPPPP>
##$VTLIST= <TTTTTTTTTTTTTTT>
##$WBST= 1024
##$WBSW= 4
##$XGAIN= (0..3)
0 0 0 0 
##$XL= 0
##$YL= 0
##$YMAX_a= 54415
##$YMIN_a= -93202
##$ZGOPTNS= <>
##$ZL1= 120
##$ZL2= 120
##$ZL3= 120
##$ZL4= 120
##$ABSF1= 10
##$ABSF2= 0
##$ABSG= 5
##$ABSL= 3
##$ALPHA= 0
##$AQORDER= 0
##$ASSFAC= 0
##$ASSFACI= 0
##$ASSFACX= 0
##$ASSWID= 0
##$AUNMP= <proc_1d>
##$AZFE= 0.1
##$AZFW= 0.1
##$BCFW= 1
##$BC_mod= 2
##$BYTORDP= 1
##$COROFFS= 0
##$CY= 11.3945322036743
##$DATMOD= 1
##$DC= 2
##$DFILT= <>
##$DTYPP= 0
##$F1P= 15.9154993809931
##$F2P= -4.1035820241983
##$FCOR= 0.5
##$FTSIZE= 0
##$FT_mod= 4
##$GAMMA= 1
##$GB= 0.15
##$INTBC= 1
##$INTSCL= 1
##$ISEN= 128
##$LB= 0.24
##$LEV0= 0
##$LPBIN= 0
##$MAXI= 10000
##$MC2= 0
##$MEAN= 0
##$ME_mod= 0
##$MI= 1.114404
##$NCOEF= 0
##$NC_proc= 0
##$NLEV= 6
##$NOISF1= 3.799351
##$NOISF2= 2.8
##$NSP= 1
##$NTH_PI= 0
##$NZP= 0
##$OFFSET= 15.70392
##$PC= 1
##$PHC0= -11585.63
##$PHC1= 25.80101
##$PH_mod= 1
##$PKNL= yes
##$PPARMOD= 0
##$PSCAL= 0
##$PSIGN= 0
##$REVERSE= no
##$SF= 200.130013532006
##$SI= 16384
##$SIGF1= 3
##$SIGF2= 2
##$SINO= 400
##$SIOLD= 16384
##$SREGLST= <1H.CDCl3>
##$SSB= 0
##$STSI= 0
##$STSR= 0
##$SW_p= 3612.71676300578
##$SYMM= 0
##$S_DEV= 0
##$TDeff= 0
##$TDoff= 0
##$TI= <>
##$TILT= no
##$TM1= 0
##$TM2= 0
##$TOPLEV= 0
##$USERP1= <user>
##$USERP2= <user>
##$USERP3= <user>
##$USERP4= <user>
##$USERP5= <user>
##$WDW= 1
##$XDIM= 8192
##$YMAX_p= 0
##$YMIN_p= 0
$$ End of Bruker specific parameters
$$ ---------------------------------
##NTUPLES= NMR FID
##VAR_NAME=  TIME,          FID/REAL,        FID/IMAG
##SYMBOL=    X,             R,               I
##VAR_TYPE=  INDEPENDENT,   DEPENDENT,       DEPENDENT
##VAR_FORM=  AFFN,          ASDF,            ASDF
##VAR_DIM=   8192,          8192,            8192
##UNITS=     SECONDS,       ARBITRARY UNITS, ARBITRARY UNITS
##FACTOR=    0.0002496,     1,               1
##FIRST=     0,             0,               0
##LAST=      2.0444736,     0,               0
##MIN=       0,             -93202,          0
##MAX=       2.0444736,     54415,           0
$$ Real data points
##PAGE= N=1
##DATA TABLE= (X++(R..R)), XYDATA
$$ [...]
1678G6k17J91J47l16o6O4J24K37k45j0n0R3j54J8J36m9M5N2n8R4l30J13KJ03J14
1703A14m8q9O6L3k56K27j47k6n8Q6K19k51r4K79j5P0o6MJ98j15l03J19r4L8J43
1728C4n0p1J53o8k02J80K23k33m3m8J99r4k5l7m2J58j15k1M1N8j19k5K06p4K6
1753A1L1P2j28p1K79k58q8K08%k29P4J09J64k30Q4j92N70m99K09j08R4j30j06
1776a34P1j33M0n0K22J66k13j88J55J58j85k04K73j63N2N5N7n0J62k96K13n8J73
1799A23m71N31k36j0J17p2n0j7l2k4K39j36m6J20L06n63O0l0J89p2k85L37RK07
1823A94n8j22J27k13J42k45K02J32k31P1j98P2k5m2J80j12J53Qj41J5J3K89k40
1846b9j16kK91k72m5J83l46M96j74J41j72J06J19l97K21k12K95j30oN3J48k59
$$ y = [76, -141, 50, 197, -119, -185, -121, 3, 240, -5, -15, -65, 28, -126, -108, 28, -21, 24, 76, 18, 112, -218, -105, -103, 0, 114, 66, -23, 43, 76, -180, 47, -100, -126, -184, -98, 121, -130, -224, 55, 40, 110, 44, 48, 246, 131, -172, -53, -147, -109, 34, -16, -87, 66, -2, -204, -24, 199, -34, -77, -125, 74, -20, -45, -82, -124, 34, -81, -102, -61, -3, -122, -147, 59, -15, 11, 42, 114, -14, -85, 194, -64, -152, 56, 56, -173, -99, 10, 174, -56, 28, -164, 406, -93, 116, 8, 102, -28, -134, -63, -196, -156, -206, 16, 182, -31, -219, -64, 94, -91, -295, -22, -185, -133, -78, -21, -71, 91, -205, 8, -50, 123, -348, 183, -53, -63, 54, -18, -68, -85, -117, -141, 98, -38, -84, 36, 342, -221, -161, -191, -2, -74, -359, -22, -13, 194, 136, 14, 141, -72, 70, -175, 27, 159, -72, -1, -199, -127, -152, -194, -14, -126, 27, 35, -106, -91, -78, 211, -29, -145, -147, 144, -128, -173, 10, -336, 160, -14, 127, -45, 61, 180, -217, 4, -208, 87, -43, -49, 4, 152, -107]
1868a07j34K74j93K80k04j2o5K21L0j4J67l88O0R0j24J98L8j1r5p8J13Q8j19J24
1892A39k01q5L25j70K38j70j45K9m5J72k08L15o1n7K5M3m18J58L33r7j77n0L0
1915g7O8J7J41j53P5j58J95K7j44o6J35j93J64n1L38k86j92J30O6J95l65L12m53
1938b75L80j54L4m9J29K2M5mP6k66L8R8j63j22J73J75j7k71K9J71j05j51O9J2
1962a26J12p8m2K59k06J12l1k27L71N7k76R8J2j70K84rk42op3N6J58j04K06j82
1986d7q0L68J0m62J67R4l6j3p9L21o1l27K30k25K15J00j65m4J92j41J55j23n4
2009eP3p0K17k59K62k88J7K43k81k82M98l10K92L8k16k31L20l7j34J27q1L02k79
2032h4J67k50J31j11M63j96j6k37M1K25j26Pm0K87o38K35mJ47K8k48Q5R7K22m50
$$ y = [-107, -241, 33, -160, 120, -84, -96, -161, 60, 90, 76, 243, -145, -85, 5, -119, 79, 117, 106, 11, -67, 46, 134, 15, 139, -62, -147, 178, 8, 246, 76, -69, -40, -85, 87, -121, 194, 133, 76, 101, 144, -274, -116, 217, 120, -57, -107, -77, -9, 8, 149, -4, 71, -87, 108, 135, -9, -75, 60, -133, 31, -20, 318, 32, -160, -30, 36, 231, -134, 178, -275, 105, -49, -15, -64, 65, 87, 132, 128, 204, -62, -24, 74, -89, -211, -38, 137, 120, -151, -122, 49, -56, -207, -138, -126, -14, -92, -134, 125, -81, 31, 0, -227, 144, 201, -75, 23, 35, -135, 149, 140, -102, -108, -181, -125, 33, -71, 135, -47, -127, 241, 251, -211, -44, 50, 14, 1, -78, 243, 182, -145, 85, -140, 75, 175, 10, -34, 158, 17, 172, 49, -5, 68, -2, 215, -44, 218, -70, -53, 190, -91, -373, 125, -185, 107, 145, -71, -302, 18, -19, -153, -26, -107, 195, -84, 83, -167, -36, -147, 316, 120, 104, -133, -92, 133, 7, 14, -26, 261, -377, -142, -146, 1, 29, -219, -134, -37, 185, -265]
2056b65K08J18j60j04N0K59j00j43J30L0N8O5k39O0J28k09J33K35K7m06J20j54
2078a59J42o8J4K60J0r0O9K3m4j61k31J02J94n5K72k02j19j24J17RJ8j11o0P4
2102a20j00L06q6om6L32m44K61P3k45K02j47J25J11k27Q5k2l9q4J93k24NJ31J0
2126D4j4j63R9J94Lo7J6j80J55j39J78r5q8m9L9p9J16K54l20J06J54k05M8J58
2150A65j82L23j68j33k2O4O3P7k22j75R6m2J79j01k30L53J69j54j18J55m9L9j79
2173i2J90k75K40k2j24J04lo9j53P6L69k12j08pj01n1J54K27j80J92j02J6L09
2196C78k29k64N7Q6O9j22l5k5j05K8J50k4RK46k66j21Q7q4J20J48j56J57o5j07
2220f8l5m3J1K07n7l2K41j89q8K97nk48QN8L5jj25K32l51J6j00K24J30L7k91L39
$$ y = [-265, -57, 61, -99, -203, -153, 106, 6, -137, -7, 23, 81, 146, -93, -33, 95, -114, 19, 254, 281, -125, -5, -159, -17, -85, -71, 189, 199, 109, 178, 201, 157, -4, -235, -133, 61, 6, 278, 76, -43, -167, -50, -41, -23, -134, -194, -120, -220, 86, 0, -6, -52, 280, -164, 97, 170, -75, 127, -20, 105, 216, -11, 74, 52, 13, -71, 122, -102, -97, 34, 44, 30, -133, -34, 160, 163, 96, 112, -68, 87, -52, 126, 31, -57, -106, -67, -146, -30, 224, -96, 10, 164, -41, 7, 165, -17, 306, 138, 5, -17, 47, 110, 187, -35, -210, -114, -156, 23, -78, -308, 45, 214, 60, -58, 97, 48, 87, -92, 98, -177, 63, 41, -83, 21, 18, -51, -204, -128, 241, 29, -79, -86, -187, -238, -84, 143, -37, 155, 53, 69, 378, 149, -115, -58, 28, 97, -25, -60, -85, -190, -162, -12, -36, -27, 219, -47, -168, -81, -165, -45, 103, -53, 104, 39, -68, -103, -146, -135, 72, 15, -17, 224, 35, -53, 244, 239, -9, -1, 57, 92, 91, -34, 198, -153, -137, -237, -13, 117, 154, -137, 202]
2246B02k04nJ17k39K39q5P6k83J80p0J47l4p4mR3k69K51K8n8K06p9l65J32Q4J31
2271A17M1p4k42J73J52j55J7R2j28m4lJ4L28k14o2J20o8J31k55Q8j55lJ43r2j0
2296h9m2K50r9K67l27j58O0O5j14J37Q1j44O7O2j41L49j83k27J36pJ57p3k2J11
2320A16k5k00r3K2K19M62m63j60q7J76J77r9K6K3J88k87l9J21J1j14L9m7j5N2
2344Ck04k2J20J2K99l35q0K22j01J77k41K04j59J49Q4j99OJ68j04O0j27KJ07K8
2368F9L9n3k35J76J54j67KJ05l22Q4K47k84K57o8RL0J84l62J95k46L54l99J14
2391a17r0J31N7j52J50J19K1j74N7r4J64j6j00K06J03l43J07p7Mj03L85m30J09
2414h3J72j4K8J67n5k78R7K3L5p1j32J53j61J83m8Qj78O4Q3j11K99m61K82k0J45
$$ y = [202, -2, -7, 110, -129, 110, 25, 101, -182, -2, -72, 75, 41, -33, -37, 56, -213, 38, 66, 8, 214, 135, -230, -98, -14, 117, 158, 84, -158, 15, 167, 12, 29, 121, -7, -51, -54, -40, 288, 74, 12, 132, 64, 195, -60, 28, -127, -130, 13, -79, -89, -131, 119, 20, 287, -40, -198, -138, -73, -187, -50, 31, -113, -46, 16, -125, 224, 41, -186, -50, -57, 100, 27, 5, 116, 91, -109, -202, -180, 39, 501, 38, -122, -209, -33, 144, 45, 71, 94, 282, -5, -44, 77, 88, -26, 13, -34, -49, 3, -201, -223, -103, -91, 208, -127, -207, 15, -86, 91, -150, 54, -105, 44, 128, -71, -65, 103, -1, 59, -68, -66, 41, 69, 108, 55, -180, -4, 150, -17, -15, 90, -232, -148, 99, -185, 72, 4, 13, 43, 227, -135, 60, -186, 168, -231, -117, -207, -76, -19, -171, -21, 98, 119, -55, 2, -92, 72, 56, -44, 162, 265, -78, 29, -48, -44, -147, 238, -192, -83, 89, 75, 103, 270, 215, -63, 34, 57, 92, 21, -111, 42, -119, 64, 16, 24, -154, -90, -7, -118, 181, -280, 2, -18, 127]
2439A27j35P5j15r8q3J59K55j55K5M8J6r1p1k9J21O8R0r9Q3r5j27J42l07K36p2
2464c2n6J60l29L05q9J33j1j83L41k34m0J99k60J20J32j90L2J6N2l00K77m4J2
2487A1J92l00J45j0l3R0q7q1j18L90j69j68K53j98p2P8J47R8J3M0k48Q5k6k9K5
2512B8r6J5p0k17J68J41J90l28K42j77J22L4l0Q8j77J87L2j52j46m1J47L8j49
2535a51j24L74j58R9p2R9j03PP1j08J92M0j32J70o9kn9j73P5q4Q6jL1K05j40j8
2561E5k4r8j67K21j42R6j17M19k60J56j62l0P3O1j72j10L32j73J03P5j16J79m4
2584A55j25N3n5L1k53K17J4J76j91k01K66k71L34j32j52K12M0j93J09J38j0j68
2606fJ30m3o0l5J8O1j77O6j37J60K5j25K3o1p9J42j3L87l06l10L62n2m4O8J34
$$ y = [127, -8, 67, -48, -146, -229, -70, 185, 30, 55, 103, 119, 28, -43, -72, 49, 117, 207, 108, 191, 96, -31, 111, -196, 40, -32, -88, 72, -257, 48, -41, 92, 81, -102, 239, 5, -35, 164, -96, 24, 156, -34, -2, 14, 66, -234, 43, -1, 11, 203, -97, 48, 38, 5, 95, 8, -73, -191, 199, 30, -138, 115, -83, -155, -77, 70, 168, 181, 221, -27, 58, 32, 3, 28, -68, -53, -123, -340, -172, -31, 159, -169, 73, -104, 18, 52, 22, 110, -67, 120, 152, 0, -146, -187, -40, -2, -151, -275, 99, -59, 40, -32, 67, -36, -29, 42, -66, 126, 166, 34, 204, 135, 133, 74, -99, -24, -108, -22, -23, 8, 213, 73, 55, 31, -67, -234, -13, -155, -59, -176, 243, -17, 139, -23, -53, 20, 81, -91, -201, 131, -42, 61, 136, 20, 199, 155, 30, 83, 28, 59, -194, 23, 37, 213, 22, -179, 87, -184, 150, 18, -134, 78, 118, -75, 34, 172, 162, -6, 124, 81, 21, -14, 4, 65, -112, -46, -183, -23, 2, -123, -100, -161, -240, -98, -111, 276, -30, -340, 22, -30, -74, -6, 128]
2631A28J22n34L00j13J34KJ37o6j94N7R0J08j72j46K13N2j08m4K31jj80J07j70
2654d7l0l36N49j59q4N6j05R8K2q6n8J12k26L01j2K3J22l3k0oj8l70L56n6p5J65
2680H3k64P1J48k5q0j09K1K5J60K9k08J57pK58k25j04r7J87K69k66O9lK7j4n9
2705D3m2k5n9J83l03J33M18n25J41O5O2pk02J68l7J59k80J29o5m9K82k63p8K64
2729A12k34J07J36pl16K75k39o6L45j07j57l3K72p4r8J53J6Ok16K04n5j68K98
2752A54k89J19k79L83j88L6K52j88j90J77Q7l79K67J74k59J92J56j21j02J74m22
2773b46J69O0R4QP7n3nj59J97J0m9j28J45j60j90K94j1r7J48j00L9k7R8k55k0
2798a61O1K7J31j64J58j90J54lq0j67j4K75j8k33M82m69J06oL10j51jj33J15J68
$$ y = [128, 250, -284, 16, -97, 37, 39, 176, 110, -84, -27, 63, 171, -1, -147, 66, 118, 10, -34, 197, 196, 16, 123, -47, -77, -413, 136, -23, -107, -51, -156, -58, -36, -122, -180, -68, -294, 7, -5, 18, 140, 107, 87, 81, 63, -307, 49, -7, -82, 83, -181, -110, 38, 13, -67, -176, -155, -130, 30, 59, -149, 8, 1, 259, 34, -70, -167, 20, 289, 23, 92, 89, 116, 102, 43, 1, -24, -83, 100, -203, -70, 348, -177, -36, 29, 91, 84, -118, 50, 13, 172, -108, 21, -44, -93, 189, -74, -152, 112, -122, -15, 121, 114, -202, 73, -166, -232, 113, 6, -151, -184, 88, 14, -84, 69, 85, 91, -125, 79, 24, -144, 154, -135, -16, -295, 88, -100, -64, 188, 0, -190, -13, 74, -305, -38, 136, -123, 69, 225, 104, 2, 176, -246, -77, -17, 77, 85, 162, 109, 104, -55, 142, 152, 103, -25, 120, -40, -230, 64, 53, -44, 104, 4, 43, 16, 114, -141, -161, -100, -73, 58, -106, 52, -138, 16, 13, -67, -234, -248, 27, 9, -224, 258, -211, -105, -111, 199, 48, 47, -86, 29, 197]
2822A97j28j44J46k06J21j03J61j49P0J03j57P4p5J22j60J89J56k23j06K51k53
2843a14K79l61J88L5L5j9Q7ll27J50O1j03m5K5Q9k80L02J40r8k17J6K34r5N1k87
2868b57M52k31j41J97O3l1j03k0k8K70j65k8J48j23Q1k76K92l80J97K14j32L4
2890C3j08j33L04j8j46J98j5p1j09p8J96l5K90l46k0k26K42R0j24P7NM6q4q0L43
2915B31Q3l64K8J30k14J65J01j56q4L37l39l0P5P3l8k69M67j76k49L28l9r0K54
2938B24k13k37K46M8j63o3l2J17M7j06k18L14J52l62K05o3J33j85K02j3k67K63
2960B9j05m1m7K96k23K64j45j62K07j0k3j49M74k19m5m9J38j89LJ87j79Oj92P2
2984a02J16J70j62K7o1M5j21nJ72j33j29J40J06q3P4m8k55K69j0O5k78J12O7M9
$$ y = [197, 69, -75, 71, -135, -14, -117, 44, -105, -35, 68, -89, -15, -90, 32, -128, 61, 217, -6, -112, 139, -114, 165, -196, -8, 27, 62, 43, 130, 127, -200, -50, 11, -92, -137, -112, -23, -303, -1, 139, 41, -176, -160, 74, -21, 30, -257, 195, -36, -177, 20, 83, 52, -51, -71, -99, 171, 6, -22, 126, 3, 84, -192, 100, -280, -83, 131, -1, 33, -75, -208, 96, 78, -68, 130, 115, 44, -65, -143, 53, 18, 308, -38, -58, -284, -42, 48, -76, 1, 6, 52, -32, -112, 231, 314, -50, -22, 108, -106, 59, 160, 4, -80, 257, -82, -112, -37, 36, -2, -271, 196, 20, -229, 99, 60, -30, 224, 11, -226, 20, 68, -95, -158, -190, -73, -26, -132, -350, -36, 116, -246, -41, -104, 29, -156, 46, 33, -234, 29, -76, -117, -164, 132, -91, 173, 28, -134, 73, 63, 40, -109, 365, 146, 101, 52, 190, 1, 4, 191, 12, 18, -174, -102, 14, 184, 22, 49, -12, 33, -88, -93, 79, -54, -183, -43, 63, -20, 54, 6, -249, 20, 10, 75, -203, -91, -24, 25]
3008B5l3O3J18M1k23P0J7n6j87M5K80j96n5k9J75l9k5Oj09J65N8j9j01j11o8L42
3034A54j21l5P7qK0J23k15j7m3J56m04J61jJ20N5k36L60p4m5jQ7j10N1K9j33K51
3060B01l23R8R9J95l57J92l32L33l47n5L39J9l8P6l3J2J6j7j53J45l8k60L02k37
3084a63J18l02N88l24j67O5J78q7K33J47j46l85K78n2j40K00K34j24k70l2J97
3105D6Q6p7k56L40o6m9J2M4qk24J36J20k67K65j59p9J86k23K11J22J17k06J23
3128A94M2j65J42k67k26K37Q6k61K30l0K3R5j39o3J9K46J10k24n5K3O9k19O6k80
3152c47L59j0K23m09J4K71k52J68r2O6o5Q6L18l10LJ96m74K17O9m7J98j12q6M0
3176B4r4J75j41J15k7O6JJ80k28j88J43j49J68j10L72j57q9k03j20K37j41L30
$$ y = [25, -8, 55, 173, 214, -9, 61, 78, 22, -165, -120, 160, -36, -91, -120, 55, 16, -9, -3, -112, 53, 111, 92, -9, -120, -188, 154, 33, -2, 75, 67, 87, 210, -5, -22, -65, 91, -313, -152, -153, -33, 22, -214, 146, 72, 27, 26, 113, 3, 54, 83, -50, 201, -122, -24, 75, 270, -87, 105, -227, 106, -241, -296, 43, 62, 24, 100, 67, 79, 95, 78, -75, 70, 32, -228, 74, -163, -45, -347, 241, -83, -250, -185, -7, -94, 139, 286, 140, -245, 33, -19, -159, 41, 275, 151, -119, -151, 46, 132, 55, -201, 139, 73, 24, 36, 80, 72, -152, -16, 104, -163, 102, -57, -136, 50, -173, 38, 160, 277, 71, 194, 236, 71, 213, -54, -280, -43, 43, -218, 12, -18, 5, 100, -39, -102, -83, 163, 273, 49, -6, 17, 86, -133, -67, -347, 12, 2, 225, -184, -170, 101, -151, 17, -75, -9, -74, 12, 330, 20, 23, 219, -255, -38, 31, -16, 182, 70, -16, 24, -70, 105, -36, 79, 52, 118, 119, 299, 71, -117, 26, -123, 45, -65, 307, 150, 61, -142, -262, -25, -166, 164]
3198A64p8PL8mj14j1L07m14J91j31Q0K19k55k64L58l16M32k38KJ38N3k89m3K30
3222F2j78K58n03N21j72n1M5J14l9K58k92o4J09J9j52j05K98l81O7J37j5R2j07
3245g9J27q4j1m4K25j71P4j2J40j55k1J7q8R3J52l08J49kj19J74k7k73L87j0j67
3270c3j91N0K78q0M7j53L09m91J77L3J7P1r1J40l95M44j42o2J66q7nJ37k51R0
3294b2K09k40M3J02QQ9m9r8r9J30j69J5j05O0L96k37L9L5k43P1L31k00j70J22
3318A8j66L5K2J4J72j12L8J23j01Q1j88M7J61l2O0j85j7J10Q1r8j52J31j9L1k05
3343a51L97m15K89j42P1K88l49J47k17n5M40j80j73K29l61O3j06J03N4n4k9J2
3365a39J05k37K83kJ37l88K42j14K47m13R5J75O3R8r8m6k8n4O0MQp0r0M13k11
$$ y = [164, 86, 93, 131, 127, 13, 2, 309, -105, 86, -45, 35, 254, -1, -265, 93, -223, 209, -29, -27, 111, 164, -125, -168, 62, -116, 142, -361, 160, -12, -63, -18, 96, 57, 315, 23, -41, 68, 87, -65, -170, 128, -253, -186, -49, -64, 28, -79, 48, -36, -47, -91, 134, -37, 37, 25, 165, 10, -11, 6, -82, 11, 163, -145, 4, 2, -117, 57, 30, -243, 144, 134, -33, -224, -174, 104, 24, 71, -82, 227, -264, -87, -54, -37, 34, -57, 83, -312, 132, -10, -72, 94, 7, 2, 139, -112, -22, 187, -53, -10, 92, 100, 189, 140, 42, -57, 73, -96, -81, -186, -126, 270, 33, 72, 107, -136, -65, 266, 66, -104, 18, -148, -113, -91, -77, 95, -17, 21, 144, 43, 124, -64, -17, 144, 112, 172, -13, -30, 80, 161, 63, -89, 42, 23, 54, -151, 246, -169, 120, -22, 49, 337, -12, 135, -82, -137, 303, 123, -50, 179, -182, -119, -225, -122, -68, -122, -151, -139, -34, -271, 12, 10, 147, -241, 1, -113, 134, -279, -184, -9, 54, 152, 54, 8, -20, -74, -14, -10, -2, -72, -162, 251, 40]
3390D0l36K45K3j51K39k19K78P3j70j35J42N7nR1j23r8J68l4j40N2j14J64l41
3413b94K91j66K62j7R2j85n9J14k25K55j78K19j78O5j47J50m2J05j31K0K6L1j3
3436eQM8J42m4k21L9Q4n7J09Q5k29J41Jq5J07j34o7K30j66q6p0R4L5J81k35q2
3462a77R6l1R7j20J46J20m34K40oR1j22lK73m72K29km0R7O9j82MQ0L3j46J30J69
3488A39o0o6q2K62j89m9n5qj12J84L4J67Nn4l23J66O4lJ79j46j91M43k32P7j79
3513b9J0Q2o5j46J57k29L3L39j84N1J25k50J15r9J22j27M12l51k2M75m24R3j98
3536a10J21m8N5J20k84K56k47K37k05J56j21O6K16m21PN2L13l63K32J0k9q0k6
3559i3K24j88L2j9k4J10L9p8O3k85J25J82L4J5j72PK07k17q4o6K73j98Q6mq9K3
$$ y = [40, -296, -51, -28, -179, 60, -159, 119, 192, 22, -113, 29, 86, 81, 172, 49, -49, 119, 85, -55, -3, -117, 47, -294, -3, -169, 93, 76, 168, -17, -76, 38, -187, 68, -110, 109, -69, -4, -151, -1, -43, 62, -69, -49, -23, 8, -5, 3, 51, 193, 149, -72, -33, 51, -6, 103, 188, -41, 100, 101, 16, 123, -11, -78, 152, -14, -100, -170, -76, -41, 140, -95, -177, -81, -112, -15, -135, 11, 131, -303, -63, -69, 22, -100, -103, 170, -302, -73, -75, -115, -18, 51, -131, -127, -47, -14, -160, -30, 139, 79, 13, -69, 193, 4, -45, -100, -108, -220, -36, -2, 165, 170, 116, -207, -41, 23, 20, 199, 53, -138, 305, 73, 150, -29, -19, 63, -2, -148, 9, -220, -187, 152, -32, 19, 144, -106, 9, -90, 32, -95, 317, -34, -56, 419, -5, 88, -110, 11, -37, 18, 138, -146, 110, -137, 100, -105, 51, -70, -4, 212, -209, -202, -150, 163, -200, 32, 42, 13, -67, -93, 131, -57, -25, -44, -68, 42, 81, 3, 66, -219, -94, 88, 122, 137, -35, -28, 179, -38, -122, -188, 85, -113, -27, -31, -120, -97]
3585i7K00j99P6l7o5n2N56k24K09m05J23l6Nk10J84j13o5K29m07M07j96K20j60
3608e7L5qk05K13j25J07Oj47K27o5J46k35J79n4R3j4j8J31j94M5j49J45J29n44
3632c59L24L0o7m9m0J30j03O0K07k16J67l0n0RJ00k98J36K87j56k21J08Q4j2J03
3656A44k66K32k81L19j2j08j08l9M95l30j50J61j01M4J3oj03K47j63N7m9L19k28
3679H7rk37J53J14j90m6J39O1j34J96m6n7m9M0R4l1J15k50J88j36j70K30j60n9
3703a57K87j15j86K58j18mJ55l7j92J9J30r5R7j35r6J89jr8k74L79J98j46o8L4
3727B4K9M3j43L8O3J50k10j86J54p1K6j8K87j27j22J34J69k07j68o2R2J36l11
3750b80J54L8nJ69q6Q5p4K01j27K7M3r8J4j55mP9O6j44L4J18N2N4j29l6j3R3p9
$$ y = [-97, 103, -96, -20, -57, -122, -174, 382, 158, 367, -38, 85, 49, 54, -156, 28, -85, -150, 79, -328, 79, -117, 103, -57, -22, -30, -235, -22, -147, -40, -34, -181, 46, -19, 127, -108, 71, 17, 110, 96, 78, 209, 15, 60, -89, 56, 185, -359, -35, -5, -72, -121, -161, -31, -134, -74, 133, -83, 84, 54, 4, 13, 113, -185, -49, 238, 82, -139, -31, 53, 41, 144, -122, 110, -171, 148, 136, 28, -80, -119, 376, 46, -104, 57, -44, 0, 13, 7, -96, 151, -12, 45, -4, 315, 87, 78, -159, -6, 108, -82, -128, 11, 72, -62, 134, 88, 31, -18, 22, 116, 85, 200, -50, 138, 2, -168, 62, -98, -157, 130, 15, -171, 87, -31, -35, 120, 83, -109, -90, 40, -55, 42, -93, -189, 0, -1, -99, -373, 6, 204, 58, -10, 24, 53, 96, -47, -9, 54, 204, -6, -192, -38, -109, -83, -101, 186, 59, -63, 71, 240, 33, -135, -197, -105, 31, -280, -126, -88, -93, 76, -10, 75, 1, 202, 75, 102, 145, 47, 61, -94, -98, -19, 47, -97, -63, 55, 107, 161, 32, -4, -17, 76, -3]
3777cj78J58N1j45J74o8L83m27J62ln2j51Q6r3k7J03r7J23J5n0p1J43k21J68P1
3802E1p3O7j16J3j9N0j09J9n4J32RJ64k84J00K83l35K07J80l98K94n5k71K50m8
3826E7J93j80j38J35j16O7j22Q5O1J3j78J65j29j42J80J85k83K1L5J03m7J13m0
3849C8m0J20p0K9l03L77j23j68M37j73l44K25J55j77O2j40J28k30J17J12J2j38
3871i4P4Qj5j21j5R0M8J80l63k7M43k10j79J78P1O3j0O8j05n7j44J7L4j00L40
3896A74j81N1k82M14j49J82j53J15k44N3J45m7j28O1J62l7o3k4L4j83J79j63k8
3919a12J09N1o5O3M1j62j53J59N5K37k39n5K59lj59o1K53m85N31k73J0J06j41
3942c4K86l04k95J5L24L20l39N5l3j51O9Lk4L5q1K15j08Nk44K16K28j11j14K88
$$ y = [-3, -181, -23, 28, -117, 57, -11, 372, -55, 107, 104, 52, -99, -13, -106, -133, -30, -127, -4, 11, -39, -110, 33, -188, -20, 51, -22, 45, -71, -58, -77, -27, -136, -117, -171, -39, -30, 134, -150, -50, 233, -102, 105, 285, -113, 181, 126, -145, 105, 57, 250, 70, -68, 67, -49, 18, -104, -19, 42, 55, -123, 42, -87, -229, -49, 136, -147, -126, -91, 12, -35, 78, 38, -2, 118, 48, 77, -226, 151, 28, -140, 297, 124, -220, 5, 160, -17, 45, -95, 33, -197, -80, 32, 44, -94, -20, -12, -27, -148, -163, -73, -25, 155, -208, -235, 208, -2, -181, -3, 68, 131, 121, 189, 84, 27, -117, -100, -66, -166, 174, -7, 44, -238, 176, 27, 209, 56, 171, -73, -20, 125, 78, -50, 11, 173, 136, 73, 49, 83, -100, 79, -84, -112, -3, 48, -17, 46, 87, -75, -228, -69, -14, 223, -16, -71, 188, 185, 26, -35, 218, -267, 264, -9, 1, 107, -34, 252, -52, -347, -332, -8, 312, -27, 28, -5, -156, -87, -84, -108, -73, -154, 61, -47, -42, -286, -70, 158, 47, -67, 221]
3966B21j84N9k19O2M8n0J06m2j50J29j16J40L88m12K24m24M9O5O0J03J14l08j6
3989a53L08j0m3j05n7p2R9j29J70j74J63O0l5j06Q2j78K42j80Q4J10l07K4J33
4012g4P4K7j75P7j52K59k44k9R2J64j35K13j06J04J00j27Pj13M8J09j36J2r7O
4036i6L2K7j19J61O6o3j09J19J8J16j71j30K29R0k33R5Qj38L99l39J79j66L1j6
4060a0K7j80J63N7j53R4j21K45j24Mj17m8p3J17J40Q8j46k0j0P8k09J04N8J15
4084G9J12l04K13k83K70j37M3L2R9j54K14j8k62L66k53L6o5O1j24M8J4J09k20
4107a24K17j61j36L89m01K53J9q3m2j8q7K29j35J08r6L4J29k27O6J07N0o1O8j20
4131b2qK04l08J97k69j4K34n3J10p5o0O6R7n9p7Q5k88m5L31N9k0j16J13R4j0j32
$$ y = [221, 37, 96, -123, -61, -13, -63, 43, 1, -149, -20, -136, 4, 392, -20, 204, -220, -171, -106, -46, 57, 171, -137, -153, 155, 145, 102, -3, -60, -132, -33, -162, 8, -166, -3, 57, 22, -84, -2, -180, 62, -118, -34, 76, -231, -207, -74, 0, 27, -148, -71, -223, 36, -208, -237, -145, 19, -116, 97, -9, 95, 195, 68, 75, -38, 10, 119, -17, -5, -102, -96, -64, -37, -156, 5, 71, 8, -101, 18, 36, 152, -19, -149, 80, 170, -63, 32, 40, -98, 301, -38, 141, -25, 6, -10, 17, -163, 0, 57, -96, -2, -123, 122, -2, 2, -115, -163, -236, -119, 21, 109, -37, -57, -67, 11, -198, -94, -36, 79, 191, -113, 100, -183, 87, -50, -7, 25, 124, -30, 184, 166, -96, 270, 17, 53, -12, 49, -75, -27, -13, 96, -124, 93, -68, -204, 185, -216, 37, 56, -27, -69, -87, -174, 55, -80, 28, -68, -34, 95, -132, -66, 41, 91, 30, 98, -22, -30, 174, -134, 63, -206, -220, 14, -39, 71, -4, -64, 2, 99, 40, -37, 48, -240, -285, 46, 105, 85, -31, 82, 176, 166, 34]
4157C4mm9J13j51J48p0p6M9J66l08K90l28L03J11l09M5K6J09l26L17j51K22k40
4180g9J15p7j12K52l75J00j33L18j22j31K91k02L67o9l68J93N1j57J2J97k6j4
4202C1J64j97o9Q8j74L12j18p0M9R0J63k84k6J98o7q9k9j58K02N0o1j04L6J0K7
4227b6R3j32K58k56j9p0J65m5L3M2N0j67j00J08J39K32l14o2m5Q4R5m7L5j16N0
4252a5L30l52L4J28jj95P9Q0k12J52m3J62j22N2j36o5K46j88L8K02j09P0J02j30
4276A07k18N2J86J1j04k11q0L70j38Q2L6K1l3j94r7K86j49K42k17L30j94J00l61
4299a73K76k8l11J85K17q4Q8j66M0K20r1k49R0j32K02j69J23l7J16k0k38j4L70
4322B15k69P6l05L44N0l38L59j93O3K57k95m5J21j24O8J6p3r2K15q3J5j04M8J79
$$ y = [34, 30, -19, 94, -57, 91, 21, -55, -6, 160, -148, 142, -186, 117, 228, -81, -36, -10, 99, -227, 90, -61, 161, -79, 36, -41, -153, 99, -276, -176, -309, 9, -113, -244, 47, -155, 212, 143, -225, -32, 19, -138, -126, 71, 45, 31, 195, -2, -71, 17, -157, 155, 37, -33, 16, 106, 269, -15, -41, 157, 90, 1, -28, -186, 16, 66, 5, -99, -63, -53, -26, 67, -65, 193, -63, -82, -152, 13, -32, 1, 43, 93, -74, -174, -66, 73, 305, -9, -71, -116, -32, 63, 16, 51, -65, -15, 315, -37, -3, 125, 124, -71, 8, 88, -124, 28, -15, 147, 25, 77, -59, -124, 122, -66, -28, 174, 65, 135, 237, 107, -111, -59, 127, 138, 34, -177, -257, 113, -25, 57, 93, 114, 81, -113, -210, 76, -73, 169, -48, 282, 88, 188, -173, 103, 75, -236, -51, 166, 82, 170, 4, 44, 264, 173, -76, 14, -118, 84, -85, 38, 1, 117, 97, -141, -155, 215, -54, 22, -283, 61, 111, -227, 132, -61, 2, 259, -36, -81, 40, -84, -16, 0, -73, -165, 50, -33, -18, -122, -74, 105]
4346A05j40%J54J32j92j49J52M5P5K0l57m5J98l6j7k26L62m4m9P9j75J54n8JK6
4371A5O3N2j26j38J73k4n0J43k36J76k47J73J13o3o4o3m1rJ59k12J96J6K3k94
4395b65J52lP8q3K20p9P8m14M00j96m6n8L69l6r0l29J31J49l0k1o6L1J76j8J2
4420F2j03m1K48j42n4p8J19o5Q9j32Q6Q6k28J63j05L2o7K40k32M1J46M2r6J46
4444A57l5k82L4Q5K17%j07NP2l12L1M1N9m7P4k23K84k39J58k2R3J06j99M6j6j43
4470a63L6N9J62P0o7l04J87J04m7oK3o4jJ47p7k89K94k3K12m11J64j62O9r0J20
4495e7K62k9m65L07k02J76M86m10k7k80L59O0l44J83N0J28j64l13J31J12Q4j09
4517f2r4L18k47J52J85l52k1K14K5j87L9p4K11j1l0j20Kj09J33j26J48q8j66K23
$$ y = [105, -35, -35, 119, 251, 59, -90, 62, 107, 182, 202, -155, -200, -2, -38, -55, -281, 81, 37, -12, 67, -108, 46, -12, -11, 15, 78, 130, 4, -134, 39, 15, -35, 108, -128, 48, -199, -26, 87, 24, -40, -103, -144, -153, 6, -206, -10, 6, 29, -265, -113, -116, -38, -121, 99, 20, 98, -316, 84, -112, -158, -216, 153, 117, 27, -302, -171, -22, -52, -73, -139, -108, 68, 50, 62, -41, -82, 166, 24, -30, -108, 11, -54, 35, -97, -11, 75, -153, 10, -95, -63, -130, 110, -122, -81, 65, 107, 11, 157, 122, -160, -126, -41, 176, 176, 69, 74, 146, -166, -135, -94, -35, -82, -8, -231, 53, -186, -28, -50, 43, 149, -50, -4, -20, -163, -127, -68, 94, 164, 97, -207, -20, 84, 37, 31, 54, -10, -11, 136, 59, -230, 64, 41, 253, -158, 6, -156, -87, -177, -57, 205, 176, -289, 18, -184, -8, 478, 68, 41, -239, 120, 180, -164, 19, 69, 197, 33, -280, -149, -37, 47, -62, -156, 162, -85, 67, 252, -100, -121, 93, 118, -69, -30, -104, 107, 96, 66, -54, -52, -161, -28, -154, -6, -94, -260, -37]
4541c7L61n50K72J06n4J60j85j2qk93J81%Q6j0K1m1ok16L99k48ok8j3J98L7K8
4567A42l5j63J06M5L1k8K8k65J20p0j2O4J09M3k60K24j73J61J16n7k08J38K6r0
4591hJ42j60K29o0O6k53M4p3p8L5K16Pq3J06n1P8l36l1M05j63k42L31p4l2J29
4616A44j66O4m8m4m2J20O4O4k75Q3K9k48M73l21L2J74RJ13k98J24m4Q8j84O8j97
4641b18K48J18k62R5J20k2k27J34J62k24j4J6k7J26l0j24Q4Q6r1K66l10Q6o9K6
4665e1q1K29k31k9J2K81J14l17p0K52k21m7K27p5j2M4j18J15j44J87r2n0J32l0
4689B5l92L97J48l23J66j45K21k01J5O6LJ3k08J5K25j6q2L9p0J85j44J96j22k12
4713b01L27k76M8lK67l12K96j40R7j23J5N2q7L03l73M7J15j07J02j71P4J77k94
$$ y = [-37, 324, -226, 46, 152, 98, 258, 73, 61, 53, -240, -59, -59, 27, 17, 38, -3, -9, -225, 174, -74, -80, -108, -121, 77, 114, 142, 107, -56, 50, 95, 126, 98, 126, -139, -19, -89, -101, -37, 72, 115, -145, 79, -94, 67, 183, 126, -82, 56, 82, -8, 134, -26, 203, 143, 209, -44, 0, -73, -151, -116, 100, 107, 24, 130, 79, 157, -179, -210, 195, 32, -210, 121, 47, 15, 144, -22, 42, -6, -50, -92, 28, 92, 156, -119, -36, -7, -255, 218, -103, -71, 103, 112, 225, -73, 51, 7, 95, -89, -21, -218, 30, 148, -114, -19, 101, 79, -148, -14, 148, -76, -90, -74, -101, 25, -5, -129, -45, 41, -50, 216, -94, -8, -77, -51, -132, 97, -134, -163, -151, 130, 244, -73, -143, 109, -112, -159, 68, -7, -19, 25, -93, 22, -122, 65, -27, -77, 55, 25, -367, 30, 178, -145, 21, -124, 97, -104, -89, -23, -20, -7, -215, -200, 25, 9, -73, -34, -104, 81, -63, 133, 11, -201, 126, -150, -102, -105, 162, -150, 146, 6, 103, -20, -5, 47, -40, 263, -110, -63, 52, -55, 47, -124, -50, 127, -167]
4736a67J35j93K70o1o9J46p2P4o0J25k36J83m3M5M8j31J85k31j62N06l70j99L18
4759D1J11j97LP6r0J55q2l1K13j52o4R2j72J22J26n4j34J88j38M8n1K46k32n5
4783c1r8L52j10l30J61J25q0J10k09K01l6k4j60L41q5j57J66k34J58j47K07j30
4805a0K34k19J98l25p6L10k2k85K73j37J26J01l19J94j00P3NJ71j13k5k54K30
4827C0m8Q1o5l9R6k72K44J34l43M33j01j07J89p7l4j75j4K98j77N0j79J94N7k17
4851d2N0J53j71Qn1n4KK23j21k26K80pK8j83K52j76J1K66p6j83Q7o0Q4p1k20K52
4877E5k09J06J27j94K88j69Q6m73K83r1P0J62k09K57j20L7j6K44n39L35J16l03
4899a57J11kr2J33q3J25j59QK06k73J07L84l94R1O7q4OJ16l20L77Q5l57r4L52
$$ y = [-167, -32, -225, 45, -16, -85, 61, -11, 63, 3, 128, -108, 75, 32, 77, 125, -6, 179, -52, -214, 292, -78, -277, 41, 152, -45, -42, 34, -56, 99, 17, -14, 199, 47, -17, 75, -97, 25, 151, 97, -37, 151, 13, 61, 10, 256, 24, -31, -129, 223, 113, -217, -56, 69, -11, 99, -110, 91, 55, 31, -129, 212, 127, -30, 136, -98, 60, -87, 120, -10, 224, 5, 203, -122, -198, 112, 90, -195, 78, -59, 67, 168, -151, 43, -57, 16, 21, 192, 79, 54, -200, 30, -18, 63, -2, -41, 55, -217, 27, 161, -182, 251, 150, 43, 232, 155, 121, -54, -68, 230, 53, 103, -76, 118, 175, -42, 8, 161, -10, -2, -53, -107, -105, 118, -3, -229, 51, 44, 72, -111, 141, -35, -24, 242, 166, -17, 70, 10, 94, 23, -197, 55, -154, -48, 79, -115, 173, 4, 90, -383, -100, -191, -121, 41, -168, 89, -31, 6, -10, 234, -305, 30, 146, -157, -46, -48, -140, -7, -90, 35, -124, -116, 90, -183, -76, 308, -86, 5, 72, -12, -6, 110, -210, 167, 252, -105, -199, 153]
4923A53K20m45K69j52j99L82k3j82M2j19K12j40o2J39%L1j94J50k20K4J74M2l
4946I9L0k55j0K82J2m13L24o1op7j14M02l57K41N8j49nj57O6q9L49l8Q4m15L53
4971A54k26J07K32j50J00M3k60J2k46L24j09M3j17K01j07j68Q3J99j81K70j11
4992I3O3k04P0P1l20L09n1R0R7o4j38m4q3J5n9l6J95j28N39m81j18J26L00l46
5016a04K70k76J50k88N15l31O1j43J53O4j96L46m26K28j54J88o6n8q5J93K55j93
5038A03j01J80m45K15Nk6R9j54J16n0K14O4j29O5J57k13o3O8j92K47l20M32Jm79
5062b06J63M1J3J08j54J6j68J97N0k73L28k3j97L70l16J3J51j25J56Q2k72O8k15
5085a93L29N1j15k26J38J85n5j72K96k98j10O5k4K3K40K7L8l39J32k0n2K52j22
$$ y = [153, 373, -72, 197, 45, -154, 228, 205, 23, 65, -54, 158, 18, -44, 95, 95, 126, -68, 82, -138, -114, 60, 102, 99, 129, -126, -136, 146, 158, -255, 69, 8, 2, -75, -189, 213, -144, 97, 155, 6, 1, -156, -90, -179, 170, 132, 216, -199, 154, -72, 35, 267, 117, 217, 260, 0, 12, -234, 90, -19, 24, -93, 108, 1, -167, -84, 115, -66, 204, 93, 156, -48, 22, 93, -227, 82, 31, 121, 218, 154, 16, -28, -111, -96, -155, -191, 4, -124, 415, -66, -184, -58, 242, -104, 166, -110, 40, -248, 267, -64, -3, -146, 7, 71, -125, 221, -205, 23, -131, 57, -9, -67, -152, 41, 296, 103, 2, 182, -263, -48, -43, -69, 30, -124, -8, -58, 156, 220, 91, 156, 313, 100, 37, 105, -87, 160, -160, 272, 273, -206, -43, -2, 11, 119, -35, -19, -187, 10, 60, -213, 115, 92, -105, 265, -51, -38, 113, -12, 144, 226, -46, 22, -193, 136, 187, 72, -154, -16, 169, 114, -58, 238, -60, -170, -105, -129, -106, 134, 161, 199, -140, -8, -28, -80, 172, 50]
5108E0j74K6N30m26j61MK56J0j7k92L09k11J80j96K22j23j70j2l5K55J27r0p3
5131a1q7K65k23N8k0N0j72J41Q0o4o6J92j0k13J21j0R6j30R1J15m8k47lN3R4k78
5157b26Q3K26J24j75N8j11J94J9k27n7Q9R6l20J89pj87K48J23q0r1N3j23J84j
5181H1o4Q2R9l08K05Mj41l05L84k22J03l3K50l13K86o0p6l32L35j50J39J35Q6
5204A85j93J51l68J33j81L24j4l47L73n6jK1qj44P2k51N18j00O8j78m6J88n4l85
5228b93K59J9p8R8%m9M5j33K0K2K26j29k21K11k10K22j62R4L37l11p8J51J53p7
5252A16j98L97k87j55n0q7K01K22j62j26K31J1n06N47m6r0nJ3j33k7J58k05K78
5275I7k57K71J14j69J77j27n4p4j2Q9L3j5j08L6Q2k94J73M6j28J13k3k5o5j9K86
$$ y = [50, -124, -98, 432, 6, -155, -151, 105, 115, 98, -194, 115, -96, 84, -112, 110, -13, -183, -195, -230, 25, 152, 62, -11, -98, 167, -56, 2, -18, 32, -140, 1, 81, 17, -49, 143, 133, -80, 41, 31, 127, -3, 88, 203, 155, -92, -95, -42, 52, -226, -143, 83, 207, 32, 90, -21, 173, 192, -35, -92, -3, 93, -227, -38, -45, -232, 16, 139, 59, -32, 21, -102, 82, 81, 17, 99, 198, -110, 95, 99, -42, -347, 37, -185, -82, -115, 135, -178, 108, 48, -28, -360, -25, -175, -36, 99, 185, -8, 143, -225, -92, -273, 51, 37, -310, 63, 7, 6, 27, 19, -125, -53, -304, 214, 114, 182, 4, -42, 146, 92, -293, -34, -15, -93, 5, 5, -44, 1, -132, -112, -90, 136, 7, -214, -3, -213, 9, -153, -59, 278, -33, -111, 40, 193, 116, -82, 315, 28, -127, -177, -264, -63, 159, -3, -129, 102, 113, -393, 154, 108, 18, 13, 26, -107, -134, 24, -181, 97, -160, 111, 225, 56, 233, 106, 52, -22, -34, 55, 88, 73, -35, 1, 83, -211, -38, 8, -120, -7, -30, -55, -120, -139, 147]
5300A47k00K6J02J25j08m7K73m46K36J06j17j62k2K65m73N41q8j73J18j68Q6k19
5322a98o8OL08K63k80NP4q3r9j0J37j31o9L24j73J2L3j97L98ol66k0Q1J94j05
5347C0L7j75J50k8j19K21k84K16l30L24K13l34n1J15j20L02o5j02k55R4o7O4J83
5370A9J8P2m0k40J72p2J4m3J63P3n7K3q3O6r7j74M10k36j26J96P3k9j59O0j98
5395a95K43k89L81j39J25j84j10J24J57k65L10p8j17k1J20J47k26RP2J78q8k32
5417g8k7o9J41J30K0L6l55K14k37J64J10J03j85R4P0j79M6j06J36j91K27M9q0
5440C3j48J03l2M6j58M85m24J60J9mJ5k71J40l8K8r0J59j38M7J15j2RQ2k30N2
5465e2K59k83J37nK3o2j23P0j81K51N8R3m05M44k93K9J70j13r4K61l8j27r3J64
$$ y = [147, -53, -27, 75, 200, 92, 45, 318, -128, 108, 214, 97, -65, -87, 178, -295, 246, 158, -15, 103, -65, 21, -198, -266, -260, 48, 311, 31, 36, 110, 27, -72, -82, 55, -76, -145, 179, 6, 18, 51, -146, 252, 246, -120, -140, -59, 135, 30, 67, -108, 42, 14, -105, 116, -168, 48, -282, 42, 255, -79, -130, -15, -135, 167, 102, 0, -255, -161, -228, -164, 19, 37, 109, 69, -171, 1, -71, -57, -100, 63, 136, 79, 102, 19, 85, -12, -186, 224, -12, -138, 58, 131, 102, -57, 3, -195, 48, -241, 140, 1, 126, -58, -168, -44, 113, -152, 158, 80, -37, -58, 62, 209, -17, -8, 64, 242, 154, -78, -105, -174, -33, 97, 117, 153, -202, 12, -225, -61, 49, 152, -33, 61, 131, -48, -2, -108, 28, -163, 64, 113, 33, -115, -12, -44, 2, -156, 329, -95, 65, 84, 80, 95, -176, -36, -74, -46, -136, 23, -115, -68, 47, 35, 44, 126, -104, -52, 207, -76, 61, 56, 79, 17, -106, -36, -217, 34, 92, 185, -220, 224, -69, -40, 130, 17, -77, 184, 146, 19, -74, 90]
5489I0m35M67l12J51P7k4P1J5k25M3J62r5J60l36J60j47J15r3L41l30J42N9o1
5512ej41J51O6r1K77m33K62p4K5k00J75j34J18Q8j95P3q3JmJ79k10R5J84j58k
5537c6J33o8j70K56j21K5k3J48N0m74M87j55L6j56o8O9J6L9J82k92K98k63Q5L6
5561C4J48O8l06k5K00j1j97J22m1K37k00L2j86J40r9J07L0j20J78m3j82J40L7
5584F3O9k04q9K23p0q0K71k50o6L52K8o9j62j27J93p1K4n6p7K14mM1n6k55L18
5609A60k31P4k07K76k32L22k60J67J54m29K11q9Q4K08n0j64j77K27rl6p6L9j11
5632a49L86k41o1j55J97K19j50n3k41J24J34O0l27K03QJ24k36K10o4N6O7j82J50
5655G9k9o4J23j39No8R3p1K47k07l9J13k7p2J55o1r8Q8j35k1q5M39j96O1R9l18
$$ y = [90, -345, 122, -190, -39, 38, 14, 85, 100, -125, -82, 80, -15, 145, -191, -31, -178, -63, -156, 185, -145, -3, 56, -5, -146, 5, 71, -20, 257, -176, 86, 12, 37, -163, 12, -122, -4, 84, -111, -38, -121, -120, -124, 55, -155, -60, 124, -34, -36, 97, 29, -141, 115, -6, 19, -4, 144, 194, -280, 207, 52, 88, -68, -136, -67, -51, -12, 170, -122, 176, -87, -2, 34, 182, 250, -56, -81, 119, 108, -89, 33, -8, 229, 29, 61, -125, 15, -84, 23, 53, -67, 111, 68, -114, 26, 63, 132, -72, -161, 62, -8, -88, 183, -67, -133, 219, 247, 178, 16, -111, 82, 11, 35, -21, -98, 116, 112, 153, 97, -158, 160, -71, 3, -204, 72, -160, 162, -98, 69, 223, -206, 5, -84, 0, 208, 158, -6, -183, 44, 35, -1, -77, -38, -149, 237, -4, -65, -220, -23, 196, 46, -7, -248, -124, 10, 70, -257, -54, -46, 78, -158, 52, -12, 44, 111, -71, 79, 50, -14, 109, -30, -25, -93, 0, -71, 176, -31, -70, 43, 16, -56, 99, 38, -60, 28, -107, -128, -213, 226, 30, 91, 190, -128]
5681a28N8L2L60j9k96n0r2J59r8M6Ol0K80k25m7R6m3J20j86J37l4k9r3K13j06
5706C1j13K11k30N6J79j36N6p6Rj39K87j21Q5j07j37N3N6K32j65R0R7l12J67K8
5730A01l2j53J09O3k8j03O2K0oJ1k70M56l7j54q5J9L6J47l96M32j22j87L32m13
5754a98Q8J99l16M44L0l76K84o5j02K24j38K0m1J25j71J77r1q5m0J7J35k06L5
5777e1o0L01k97n4L23n3l47M86j39k8j27q3o2J44R8j2m5lJ61O8j31m8k62J12L20
5802B11l09K00j03n5J8r4q8K86l0j77K23q6K38m17K48p0n8r0J23K2n8P6L4k07
5826a63J50k81J32N1Q5kJ54l82L61J51r2m13K03j92N4L88m17K24J13q2k5j40J75
5849E2J3j83O3J91j87J31k22J79m5mm6n3J85q6J09J5J11j52k13L5J43p0L4J02
$$ y = [-128, -70, -38, 322, 303, 7, -43, -135, 24, -74, -28, -22, -52, 228, 3, -44, 52, 9, 129, -57, 80, 46, 17, -76, 137, 31, -82, 129, -101, -45, 134, -2, 54, -22, -13, -152, 135, 14, 99, -8, -145, -92, -36, 196, 31, 121, 218, -94, 73, 101, 69, -84, 25, 88, 60, -43, 19, 39, 33, 44, -226, 230, 193, 39, -46, -27, 9, 156, -240, 192, 70, -117, 215, -198, -110, 89, -227, 217, 247, -129, 155, 90, -12, 212, 74, 94, 53, 178, 7, 184, 93, 8, -32, -15, 120, -86, -51, -111, 190, -107, -161, 162, 109, -238, 248, 109, 81, -46, -129, -191, -47, 51, 39, -6, -9, 152, 220, 89, 41, -221, -109, 211, -98, 102, -1, -56, -38, -132, -220, 66, 36, -141, 82, -4, 234, -183, 65, -5, -63, -153, -30, -8, -66, 10, 44, -163, -13, -294, -162, -111, -26, -28, 126, -256, 105, 256, 164, -249, -46, -238, -184, 204, -213, 11, 124, 42, 17, -123, 52, 65, -118, -55, 136, -51, 80, -142, 37, -8, -12, -58, -111, 74, -12, 97, 112, 223, 71, -142, -107, 36, -34, 0, 102]
5873A02k65J16M7M0k76K17J75N2j16J10j64m5o3k6N9j02r1M21L9l49J67K05j30
5896A23j26J18j37k05L65j46k17L73o8l47J23K53j80L06j64j94r8L21J7l38J80
5917d1QJ40P7K4k67J01M9j55L0k08K72j85J30l1j20J13J54j6j09j49J94p9m6j33
5941b47K23L4n2M5J82j75j14K8K49k47j66R6M9L26k40M7Q6j71J22M1o2N0p9L7
5965F2J74m6j45L3J16k25MM5j8M2p3K26j83P8k17K50O6j08j03L0J3k72K97L0j39
5990f3J6K0K2K5L2j05K56l85J87Q3p0n4L0p2J56q6j32J67j5j75L67k39L2k52J66
6015h9K16k19PP1j6R0J51L3m5j52k17K84j13k09Q9k4K62j98m4K27j10J0q5m1Q4
6040c8Q7j7O3j65J93j17j84J67J26l30K91L6j42k23J64J73n9k96jM20j55p5Q6
$$ y = [102, -163, -47, 0, 40, -236, -19, 156, 208, 92, 202, 38, -7, -70, -96, -37, -139, -230, 191, 230, -119, 48, 253, 123, -3, 115, -22, -227, 138, -8, -225, 148, 80, -267, -144, 109, -71, 235, 71, -123, -221, 100, 117, -221, -41, -33, 107, 184, 208, -59, 42, 91, -64, -34, -242, 30, -155, -25, -56, -176, -63, 91, 75, -34, -183, 11, -68, -114, -247, -24, 10, -42, 3, 185, 10, -104, -76, 173, -74, -240, -144, -95, 231, -9, 38, 124, -47, 75, 116, 54, 104, 25, 62, 236, 190, 45, 78, 194, -31, -27, 18, 0, 42, -31, 195, 12, 90, -127, 123, 189, 81, -22, 8, 21, -251, 46, 76, -63, -47, -27, -5, 20, 52, -53, 203, -182, 5, 88, 18, -36, -6, -78, 78, -8, -140, 27, 12, -163, 204, -35, -3, -255, -89, 127, -92, -85, -14, -30, 60, 211, 244, 199, 47, -170, 114, 1, -208, -119, -143, 119, -79, -123, 104, -6, 4, -81, -122, -38, 49, 32, 95, -70, 123, 6, -178, -11, 115, -215, 76, 112, -30, -253, -89, 84, 25, -271, -272, 148, -7, -82, 4]
6063Dl1r6M3P3K69k61K52j98J14o7m4q9l9J08N7j11j3O7m3M0r0R4j65K90m5j10
6089IK12j96j1nq8K43j11k15J83j80K44j43mr3K35j18J74r2k45K14J72m46M03
6112A42l6p2p4J23q6N0J74p6k23l10N16j25K7j52J19J5Q5k12K85%L6j67K61m57
6136a57J73j07P6L50n13J20R0k7j97K32J12j95J83Q1k68M9o8j4J90J02k51Q2R5
6159A38j63l8K65j33k1o9J67N3j83lm3PL9q2J6J59l04K71q9J27l3J09l65L37O0
6184B22k79J78j69rN1K82l68J84l2N7Kj37J30l43L22o1o0pJ84j23J88j99k7j26
6208a40J90k93L07jp0j8K9l7l2J26o3L6j52J19n4K10j7j75J54j7j26P9J1k72K41
6233C5j36K94j31J79k21j36K33k85N07l00n4J23k68n9K12j9Q9j59Q0J01j84J67
$$ y = [4, -27, -123, -80, -7, 262, 1, 253, 55, 169, 102, 58, -31, -70, 38, 95, -16, -29, 38, -5, 35, -55, 39, -126, 164, 119, 9, 221, 25, 14, 9, -79, 164, 53, -162, 21, -159, 85, -58, -62, -155, 80, -38, 136, 44, -201, 13, 185, -261, 142, 106, 34, -40, 83, -3, 47, 221, 145, -78, -388, 128, 3, 30, -122, -3, 12, 97, -115, 170, 170, 206, 39, 300, -157, 16, -91, -15, 335, -178, -58, 32, 5, -192, 40, 152, -43, 140, 221, -47, 2, -66, -80, 110, 212, -39, 43, 138, -25, -63, 202, 69, 48, -21, 146, 199, 16, 13, -30, -23, 16, -66, -50, 109, -195, 76, -13, 114, 81, 190, -175, 162, 222, -57, 121, -48, -57, -6, 276, -92, 92, 60, 117, 119, -18, 112, -231, 91, 30, -30, -37, 147, 24, 212, 13, -14, -140, 50, -243, 64, 63, -7, -25, 4, -33, -65, 61, -2, 34, -118, 1, -53, 157, 140, -35, 119, 102, -24, 55, 66, -206, 35, -101, 193, 62, 241, 20, -116, 117, -168, 339, 39, -15, 108, -160, -219, -7, -26, 63, -96, -16, 85, -99, 68]
6255F8O5k91O5q6L63j78N5p5r5k6J51J01P9j63j52R9j1r6L26l27J30LJ59j20n8
6280a4J52rj04j19J91l2m9J90r8m6j8L1j12rJ23r7o3n1R1K06L7j04R8m5k68K78
6306A59j40OM6j81P7k25K96n5J18k44J27j30J70j64K34l21J97K90k53q9J6j00
6328a66J13J01j0l2p4K55k14L0J18k49k29L89o4l6j34K50L8N8o8K6M7k28J09J07
6352A37k67J69o2N0k99M32m4j1l79K16j69K77j29J29n4p4l8M8K24k22J79j45o7
6375i9J37pk48j38N40j6Jj94j6j36M87q2q4k07J80m2Q4k97o7N7M15k54o4J09l06
6400b47K10p5o7J29m3K12k47J70K7J2k45M16l24J5L9L0j55j4J81m2n3j37K64n7
6424aJ77k91L42J0l59L0N1J3K12k37J04k17J62j02K04k4j81Q6K6J8J8j12K25L
$$ y = [68, 133, -158, -93, -179, 184, 6, 61, -14, -109, -135, 16, 117, 196, 33, -119, -20, -31, -127, 199, -128, 2, 5, 164, 44, -14, 138, 129, 25, -94, 97, 65, 16, 206, 108, 62, 44, 75, -37, -46, 77, -20, -83, -134, -43, 163, 200, 96, 194, 149, -119, 159, 19, 25, 71, -110, -33, -258, 38, -17, 101, -143, -16, -146, 24, -140, 94, -227, -30, 260, 7, -82, -66, -166, -53, 48, 38, 6, -68, 187, -27, 3, 121, -128, -357, 32, -32, -68, -202, 48, 86, 144, 76, 102, 149, -79, 30, 137, -130, 39, -23, 27, -272, 160, 116, 105, -274, -58, -227, 50, -79, 50, -4, -78, -116, -68, 156, -66, 113, -32, -99, 38, 31, -217, -355, 185, 169, 170, -24, -40, -176, 311, 229, 145, -62, 118, 76, 160, -137, -204, -147, 268, 14, -50, 59, -247, -37, -112, -179, -50, -93, 119, -128, 42, 69, 81, -164, 252, -72, -57, -18, 12, -143, -157, 24, -18, -71, -208, 56, -1, 176, -115, 227, 237, -122, -92, -41, -28, 184, -53, 51, -166, -4, -106, 98, 74, -107, -21, 5, 23, 41, -71, 154, 157]
6448A57P9l87J54M1R8l53K85J37j89L9n7Q2M7R5k48l7J94K48m81K11r2J81M8l79
6472a27j74K08jJ2J52o9m1j06M45j73j94qM5J76l4K32n47J88K16k41O2k11K82
6495I2l5J03j52Rk34Q6J36M5j11J18j89m1J99Kj04J40K3J13j01O5j12j60J74r0
6519b4k1mQp7l3J12q3J46n9p0R5J36j80n6P4J74nk39K54m03L15l08K88j29K14
6544A25k21J78k7q4O4k35K06k2jJ88j26R1k59q4K06Q6l54L03K45l16j00K36PR8
6568B04k69K2J33j25J43l27L53j54n2M2J12N6j5M6k88K2K38j84n2J29o4J61p8
6591E3k15K41o8J10j21J31j11k03J88l0J7K03j75k30L17nk32r4J48J36q7K71l41
6614i7J50k33J48Q5P7o0M6k69K63j96K4K39l39J75p1n2K8m6K37L4l44J85q5M0
$$ y = [157, 236, -151, 3, 44, 142, -211, 74, 211, 22, 61, 4, 86, 133, 228, -20, -57, 137, 385, -96, 115, 23, 204, 252, -127, -301, -93, -94, -82, 70, 1, -40, -146, 299, 126, -68, -76, -31, 145, 111, 343, -204, -16, 200, -41, 21, -190, 92, 57, 160, 8, 17, -217, -131, 5, 50, -61, 57, -132, -173, 26, 28, -76, 64, 87, 200, 99, 164, 52, -108, 66, -24, -45, -49, -41, -118, -151, -39, -122, 24, -35, -105, -10, 126, -54, -110, -36, 138, 133, -106, 148, -255, 60, -248, 40, -89, 125, -96, 82, 55, -29, 35, -200, 6, -16, -17, 171, 45, 136, -123, -207, -1, 85, -269, 34, 279, -37, -137, 99, 106, 204, -65, -43, 90, -35, 108, -219, 134, -20, -72, -30, 82, 138, 123, 169, -119, -97, 141, -43, -95, 34, -30, 131, 53, -162, 79, 11, 121, 0, 131, 20, -183, 5, -25, -8, 195, 20, -210, 107, 102, -130, -224, -76, 60, -27, 244, -97, 53, -180, -32, 53, 130, 70, 116, -153, 110, -86, -62, 177, -162, 13, -58, -110, -82, -128, 109, 143, -201, -16, -101, -61]
6638f1KK74l12R1K1l9Ol4k4J49qJ9N8k30J15j6K26k92j30K03J22j84MP4J75m11
6664b02K96Q8j19j94Q4J7j09J81r8K21m34K58J14Jq2J09k09L84l17Q5k37L6K06
6687G9q8j47Q6J12K4k29K59J95j98j99pJ84k13K03k1N5k93J96k5J36k36m2K14
6710D5k17J62q1J01m5p2K39l50P9R6K96l59Q2L4P5Nl02J04k4M2L70k21p5Q4k0
6735D8l9j75L92l62J13M8l78L03r4J21j3M8m8J02l50L66j89P9M15m54L53k40k7
6758A9j24O9q6k6L5J72j95j33J46J32Ml7J28j17M3k95M70m3j67R7j34K75j11M9
6782A71l3k30J34K05j79P5k61L1J76K31m86J53n5J91j23PK59j47Q7r3k19oJ65
6805E3l5J98j22j05k54K68o0L23j14j39j83L17O5p8N0j92Pq0j4K08j70J49k52
$$ y = [-61, -59, 215, -97, -6, 15, -24, -18, -52, -76, 73, 65, 84, 142, -88, 27, 11, 237, -55, -185, 18, 140, -44, -40, 34, 209, -202, 94, 182, 63, -131, -47, -30, -139, 42, -56, 165, -269, -11, 103, 104, 22, 131, -78, 306, -11, 74, -163, -127, 79, -9, -156, -70, 42, 66, -163, 96, 291, 93, -106, -113, 71, -142, 61, 40, 95, -198, -2, -27, 109, -127, -169, 45, -172, -10, -91, 10, -35, -107, 132, -218, -139, -43, 253, -106, -24, 10, 85, 90, -212, -108, -132, -90, 280, 59, -16, 68, 48, 9, -166, 226, -136, -23, 25, -353, -50, -144, -23, -36, 12, -36, 66, -284, 82, -107, -28, 387, -67, 286, 46, 19, -105, -36, -122, -148, -113, 59, -136, -269, -123, 9, 13, -24, 104, -13, 30, -265, 205, 162, -5, 92, -42, 233, 122, 171, 138, -92, 42, 247, 68, 143, -118, -87, 89, 320, -166, -13, -68, 123, 0, 7, 266, 119, 206, 113, -106, -112, 53, 18, 216, 94, -11, -265, 3, -57, 266, 152, 13, -170, 147, 212, 134, 184, -8, -1, -81, -95, 113, -57, 92, -160]
6828a60N0K19m7k28J42J8O5k62K06k74K16K01k72K07j25K57p1o5O0qMj92Q1j40
6852a18K39j83j10J90J8nJ27k16n3k1K11j91M34n92L70j73r5L08j47JJ76o1j08
6875Ak04J13L01k01n3k38M12k65K28q6K6p3nj1N2L4j87J41J13l24L26j14lK7j86
6900a76J80R9K50k98j82J10k87L10p2J78j68j67L66j52n9o8K31j8j61j42L4K96
6922A04p1j55L11k61J9Ll4K24p1r5j61N6K13QQj80j7j4L5K31J11k97J46Jj74J85
6948A25m3j46o2J52q1K3p9K2J3j98J94Q4j9N9k89K30q8O2J36l59L07L5p5l25M47
6973A25j05J00N4k37Q1k03J85k1j34j0L4K20k12j11K81LJ55l69J73O7q2K23k15
6996BL5n9k10L09K5k23J63m3R7l4n1j61J57K43l41N5K15j04J71k55l7m3j6p7K29
$$ y = [-160, -110, 109, 62, -166, -24, -6, 59, -203, 3, -271, -55, 146, -126, 81, -44, 213, 142, 77, 137, 129, 133, -59, 22, -118, 121, -62, -172, 18, 36, 31, 158, -58, -111, -132, 79, -112, 322, -270, 100, -73, -168, 140, -7, -6, 170, 109, 1, -203, -90, 211, 10, -43, -281, 131, -134, 94, 8, 34, -39, -44, -55, -3, 31, -156, -15, 98, -226, 100, -14, -17, 10, -176, 4, 103, 353, 55, -127, -17, -304, 6, -66, 112, -56, -223, 143, -9, -68, -136, 95, 77, -84, -226, -192, 104, 33, -122, 189, -72, -53, -50, -84, 140, 69, -26, -187, -131, 82, 90, 98, -82, -99, -113, -78, 153, 264, -33, 113, 114, -60, 125, 82, -64, -126, 26, -55, -32, -111, -89, -76, -274, -80, 4, -15, 44, -245, -15, -103, -41, 95, -264, 43, 78, 3, -322, 125, 20, 120, 174, -63, 18, -185, 0, -21, -155, -165, -131, 89, -123, -234, 47, 50, 205, -164, 9, 76, -6, 217, 2, 37, -22, -232, 77, 102, -121, 42, -1, 96, 62, 11, -150, 7, 250, -91, -36, 179, 75, 246, -9, -46, -89, -105, -182, 47]
7021D7m4J1O6r0J15m9k52L10j10J07q5m0n5J57j58Q0R4r8K8j55K86j69j11Q7R7
7046F9j04Kr4o9K15q1k4k60M33j39K60j91j06J14j46K12k04L8p9L75k18K85l90
7069a02N4PlP4P9q9o4j11j47L60p6l18L93J51p2l0R4k34j3L8N3J29k82J3K90l06
7095a12qm4J07L8j84J85K7J07j03l21L75m3l8l0R3q9q8o0J94k09K39J35k77J88
7119H2r7j7k0n5K75k13o9J94J96m39O0N0n9J89l2J33j96J02j24K44j19l75L39
7142D9m9m8R3L6nO9j6l5j0m36M24l01K03r5J10R6L5j46J82l20k3K84n9p9J23Q7
7168A69k44J14k4k5J11j38M2Q2k17J58j78L41j28k6Q2j34P5ml5P0r7j6J55k70
7192a37J48l8k8K43Nj80m3p9J59j30J21P3j8O3j94j32L93k43J50k07K34j79j25
$$ y = [47, 3, 14, 80, -10, 105, 56, -196, 114, 4, 111, 26, -14, -69, 88, -70, 10, 104, 6, 34, -121, 165, -4, -115, -28, 69, -35, -33, -127, -196, 19, -62, -86, -346, 87, -52, 208, 17, -89, 25, -121, 91, -113, -75, -154, 221, 3, 288, -102, -48, -41, -44, 30, 109, 20, -44, -155, -302, 58, -18, -336, 57, 208, 136, 106, 200, -34, -47, -9, 44, 173, -109, -96, 194, -112, -120, -164, -57, -19, -203, -18, 9, 116, 13, -308, 67, 24, -14, -44, 49, -40, -128, -188, 6, -203, 36, 171, -106, 82, -15, -32, -52, -107, 168, -45, -114, 80, 276, -163, -103, -53, -112, 77, 45, 178, -18, 84, -40, 204, 85, -290, 49, 0, -48, 45, 81, 76, 145, 129, 94, 84, -352, 72, -229, -26, -121, -11, 85, 120, -26, 156, -164, -187, 97, 38, -41, 82, 169, -75, 39, 15, -10, 101, -37, 5, 87, -130, 28, -150, 191, 63, 37, 119, -15, 60, 56, 21, 91, -6, -22, 133, -137, 11, -27, -55, 188, 193, 13, -30, -109, 50, -80, 41, 114, 96, 159, -35, -167, 226, -17, 133, -74, 160, -19, -144]
7215a44K67r3K2m3J27l54L42L9P4k02k76J93m4j44L04m6m7N3j63J22jj25K14l
7239G2l6m3KL5J5j75K41j18K4K3p2K58rj40j99K46k86K12k14K15j5p8J61n6n3
7264A0J18Nk09L37k70L3J9k22K97o0m1j8n2Q4J47n2k44K40k05R4o6j98M0L91j70
7289HJ88k61L18l40LR4J28K4j43M6J31j41k64N42k22k05K00p7K3j30J0L8j77%
7313b07J31K13p3P7j18k5j63K75k40K45j66K18j18Q8o8j99K80r3Qk10rK21J07
7336A74l19l1L4n7L71qj94j53L19j36J1M3L4k27Q5LQ7j6k16N58l52J4rMj03m6
7362a30K6K24q3l3p5J25k25J99Q0j14k37L03j40L46l65J91K32k87rk0JK4R1j16
7386Hj03M6P5j8J88j33J19l11L51k06k02J91j72K05J66k72O8j16j44L97k07k19
$$ y = [-144, 123, 30, 52, 9, 136, -218, 124, 163, 237, 35, -241, -48, -92, -236, 68, 22, -25, 28, -135, -13, -14, -139, 75, 72, 36, -7, -5, 30, 45, -130, 111, -7, 17, 40, -32, 226, 217, 77, -122, 124, -162, 50, -164, 51, 36, -42, 119, 63, 10, 128, 133, -76, 261, -9, 24, 43, -179, 118, 58, 17, -1, -53, 31, 178, 126, -118, 122, -83, 11, -55, -253, -213, 178, 8, 196, -65, 253, -87, -84, 10, 138, 162, 19, 65, 196, 55, -209, 333, 111, -94, 106, 29, 52, -78, -68, -30, -207, -207, -76, 137, 64, 141, 23, -2, -165, 110, -130, 115, -51, 167, 49, 137, 69, -130, 150, 57, 65, -145, -154, 67, 174, -145, -176, -142, -199, 172, 164, -30, -183, 136, 0, 11, 54, 88, -139, -54, -51, 36, 20, -196, 362, 10, 24, 15, 19, -84, -130, -104, 120, 37, 4, -71, 54, -171, 28, 108, -6, -243, 60, -80, 266, -99, 92, 324, 37, 28, 8, 9, 33, 124, 8, -95, -49, 26, 8, 196, 63, 182, -129, 222, 16, -186, 5, -167, 38, 204, -68, 0, -116, -260, 137, -70, -289]
7408b89O8j27J76J75k01N0J25K1Oj1N0j00J50m6j37j02M87m38K80j88P2q4K67
7431B04k84J09J52k08K2Q4Qj6p9R6O1j48K03l58K38k4J9k52O4j05L90m22K80J92
7455B26K2k30j69R2P4L7J9K1j14n6k13M16%j80J94p3m9J64j03J43j47k48J90j0
7479Fr9J41k31J74j70J50j06J98j10j06K16m1k12L74j64J39L7j89J47Pl5n6l1
7502C9j04P9M9j0J8K07l88L95l29P5j84M05l29p4K29r2j3J4o4p5J08J18K39k36
7526G7k87J35K4j14nJ60j3o0p5J33J54%m4k00K62j02j89J82j97K57l0pj83O4j58
7551b16K72J1O2j47N3r6l5j91N07m01R9K56k84K05p3o4j95L67k31Q1oJ8J36K1
7575A49j00k1k28J85J92k13j22O0N3J14j07%j61J07L6P4O1k68K17o7N9L7L8q6
$$ y = [-289, -221, -348, -172, 3, -198, -148, -23, -2, 4, -7, 43, -57, 93, 47, -90, -192, 295, -143, 137, -51, 21, -63, 204, -80, 29, 181, -27, -5, 79, 87, 71, -8, 88, 149, 1, 204, -154, 84, 60, 79, -173, -109, -214, 176, -246, 34, 226, 248, 18, -151, -59, 15, 52, 71, 92, -22, -78, -291, 125, 125, -55, 139, 66, 17, 181, 78, 221, 74, -174, 16, 6, -93, 48, -183, -9, -179, -29, -135, 63, -47, -153, 63, 22, -190, 184, 20, 159, 196, 7, 154, 161, 126, 70, 39, -65, 14, 63, 53, 71, 278, -110, 285, -44, 31, -153, 252, -77, -151, 78, -14, -27, -13, -77, -152, -44, 74, 313, 77, -210, -75, -51, -165, -170, -10, -23, -83, -158, -25, 129, 129, 85, -115, 147, 45, -144, 38, -159, 98, 68, 61, -122, -58, -216, 56, 67, 129, -18, 35, -61, -96, -287, 220, -181, -82, 174, -110, 95, 22, -42, -237, 130, -101, -20, -26, -8, 128, 149, 49, 28, -200, -15, 177, -36, -158, -98, -45, 69, -38, -38, -199, -92, -56, 18, 79, -189, 28, -39, 20, 57, 95, 9]
7599IL1R8k92R5L2q3K73j18j24Q9R1J54m57L66j01q5k22L25j36K59j58j15j47
7622b16R5K9QJ02J28j88M3q2K0j45J60J0J43j40k9m3J44l1O1n6jj79J49j12K02
7647G2L6o3L0j15o7M2J78Kn1k52J60K4k7J20j04j8OJ10J20j46r6J91k14j7J14
7672C5N7j70j2K65K8k3j35k7RJ13P3n03K89l2j80L84k34J20k37K09j9O1l5J66
7696B02Nj66J96j95pJ7r3j03J35l8J19m0k2PJ79j08o5q8L60l06o7L0N7k35J77
7721d9M7J27l92J43J25L47l59j2L05k22j42L06k62j3K33p6n1j44L15l67L16l58
7743a83K08j18N4J8P6k12L87r6j61M7J31J28k14k20J26L19l97o6J17J08Pp7o3
7766h1K7Q9J00o0J7j95lP9R1k22Q9J48k69K03O8J18j29p8j02j31K85M8k13J90
$$ y = [9, 40, 138, -154, -59, -27, -110, 163, 45, -79, 10, 101, 255, -202, 164, 63, -22, -244, 81, -55, 204, 46, -69, -216, -121, -92, -84, 18, 146, -42, 1, -81, -61, -206, -46, -36, 107, -33, -62, -105, 39, 8, 69, 13, 12, -167, -18, -130, 72, 108, 45, 75, -40, -107, -65, 113, 115, 64, -188, -28, -4, -31, 89, -15, -33, -27, 83, 203, 57, -39, 152, -62, -79, 35, 92, -78, -90, 175, 203, 180, 45, 18, 27, 140, 213, -290, -1, -33, -213, 171, -63, 57, -180, 29, 10, 71, 36, 202, 207, 41, 237, 42, 35, 52, -41, -144, -9, -47, 72, 32, 10, 17, 196, 88, 23, -65, 295, -11, -78, -48, 9, -226, -49, -2, 125, -267, -124, 1, 348, -11, -23, 282, 60, -82, 224, -38, -51, 182, 106, 55, -89, 226, -141, 175, -183, 25, -93, -39, -21, 55, -157, 230, 134, -27, 20, 151, 279, 65, -155, -29, 290, -107, -173, -56, 52, 59, -18, -81, -54, 35, 135, 75, 92, -103, -106, -27, 64, -158, -69, 79, -190, 13, 81, 199, 70, -8, -110, -241, 44, 92, -121, 69]
7790F9j36o8J09K59Jk14l44L45p3M5J77j57J3l1M5J14l44K78j63L07l57J46K0
7813D1j19L04Kr3q3j24P0Q4l57M17k74r4L51j8k4m7q3O0J12J46j01l70j10L01
7837iRk8N9k65K41K2o9J21j15K20l54NJ43RO2J28k51P1r3m7J97j04M5J15l01J46
7863d3j72J21R6K73N6m07LK58k04q0J98k59J13n1O4M34m37J2L4jj30P7N1J86k32
7888d0QJ36p4j98J50K10k15j17J06j73J09j32L80j90K6P9k16m6OL03pj49r8K02
7912F0J02k53j37J45J04L0j08m6M8m6K5J47J72j19k48O9p0K9R1J13k15J78q1j0
7936b0q3M4j9L1n1K84k40q4J56n5J54j9j25L3k9r5K39K2p8M1m4k74K00R0K39m66
7962a49N9K31j22o6Q3j27J44j56J11k73J44K1j42J59J7j21L5K29OL1k71N9K78
$$ y = [69, -67, -135, -26, 233, 234, 20, -324, 21, -52, -7, 170, 13, 26, -5, 40, 154, -190, 88, -75, 232, -125, 21, 41, -78, 226, 228, 135, 52, -72, -2, 82, -275, 142, -132, -226, 125, 107, 83, 36, -47, 13, 125, 271, 170, -200, -310, -9, 0, -28, 31, -234, 7, 29, -40, 81, -34, 186, -168, -163, -20, -11, 51, 179, -72, -1, -94, -141, 56, -48, -3, 112, -189, -43, -215, -94, 2, 275, 331, -76, -73, 185, -19, -99, 99, -160, -47, -98, -34, 400, -37, -25, 9, 8, -122, -45, 6, 192, -40, -32, 104, 30, -168, -18, 192, -23, -140, -34, -207, -98, -230, 150, -40, -14, 65, -151, -197, -191, 112, 105, -44, -142, 60, 162, -91, -228, -83, 21, 51, -57, -103, -55, -101, -76, 71, 243, 124, -124, -55, -125, -96, -5, 108, -107, 71, -10, -20, -103, -59, -78, -47, -98, 186, -54, -138, 18, -37, 117, 98, -27, 6, -23, -118, 121, 143, 65, 106, 62, -212, -12, 78, 317, -149, -90, 141, 19, -47, 36, -91, 53, -103, 8, -265, -121, -100, -242, -83, -66, -187, -152, 77, 83, 114, -157, -98, 180]
7985A80o1j39K04j30q1KL74j97M3j17m2p8J64j78l2J88J5j14n5M3J30q6j18J80
8009I5k26K19O2j47j59J99o7R7J12k95P6K05n31K29P4k2N4k9qJ07m4n5P0j5j0
8034ik72K91O5k6J65k22m6J41L21l59qK5j18l8K69k78K5K04m4k02J82j70K24l3
8058H7l71J79p3J45O7k2j66K10J71o4k35L29q1j17j85J06l2l7J00l4K80k59K13
8081B11r7k6p9O4j56J31J88j06om2p0n4%m9pn0J16k9k17K51J24j72j2K31o9j06
8107c1J20j88oJ47k0m1J64j96k10J75j19Q2J03O9J32j98j97L68M5k50N1M9k09
8130a60J00k6J26n3J5J52j86R5Ko4K61m20K06lK93k25N3l36J8N7K84k42M2l6L4
8155a3L0p4l0Q5q4K29n4p3pP1l8q5n7K01J8j60j75K88r2l7L40k75R9m9k37J60
$$ y = [180, 119, -20, 184, 54, -27, -25, 349, 152, 195, 78, 36, -42, 122, -56, -88, 100, 115, 1, -54, -11, 119, 33, -85, 95, -131, 88, 150, 3, -156, 43, -24, 73, 185, -110, -34, 171, -360, -131, -57, -79, -25, -54, -62, 45, 1, -54, 16, 1, -9, -281, 10, 75, 49, 214, -8, -54, 87, 408, 49, 41, 66, -52, -90, 179, -99, -74, 130, 86, -116, 66, -104, 120, 87, -284, -105, -178, -33, 34, 12, -154, 56, 227, 163, -72, 257, 176, 59, -126, -20, -52, -89, 11, -23, 257, -2, 211, 114, 88, 9, 73, -83, 48, 236, 130, 124, 82, 12, -42, -42, -91, -98, -148, -32, -61, -278, -27, 97, -75, -87, 144, 75, -31, 89, -99, -105, 42, 22, -19, 145, -51, -261, -86, -205, -123, -20, 49, 181, -17, -214, 154, 199, -51, 0, 49, -160, -60, -86, 40, -13, 2, 154, -32, 63, 65, 1, 262, -158, 48, 45, 338, 113, 166, -170, -152, -95, 189, -53, -11, -47, -13, 17, -57, -87, -2, -86, 143, 89, 16, 9, 80, 42, -43, -100, 101, 119, -41, -216, 72, -20, -57, 283, 8, 107, 58, -179, -19]
8181a9p0M08j69j48n2K24j73j08K51p0
$$ y = [-19, -89, 319, 150, 2, -50, 174, 1, -107, 144, 74]
8191G4
$$ Imaginary data points
##PAGE= N=2
##DATA TABLE= (X++(I..I)), XYDATA
0@%%%%%%%%%%%%%%%oJ4j6J6j6J6k4L2l2M0m8N4o2P2q4R3j05J20j37J55j75J98
37A05k22K47k75L06l41L80m20M64n12N65o25O89p58Q34r20J014j117J234j366
56g18J516j687J887k121K402k748L181l741M501n597P324j0441J7793o7942l6811
71i3202J47617o67o8550j0301J5318P07L0297n861k4805O60P8J194L5263j4061
85A3687m7694K1494M4052k7058k6992J5924J8065M333j8643k7900K8686L7968
97C5922l4754k8458L2987J514k0687K5790Q442l9054j563K7772O121k617j7057
110e642k2122K7913L0928l2720k0505K9797L07k0361J4261Q868j2352j680k777
123f085K415J9168j0838k3706K1949J4821l1548J472L3440j2769k6539J1395J4070
$$ y = [0, 0, 0, 0, 0, 0, 0, 0, 0, 0, 0, 0, 0, 0, 0, 0, -6, 8, -8, 8, -8, 8, -16, 16, -16, 24, -24, 30, -32, 40, -44, 49, -56, 64, -73, 82, -93, 105, -117, 130, -145, 161, -180, 200, -220, 244, -268, 297, -328, 361, -397, 437, -483, 531, -586, 648, -718, 798, -889, 998, -1123, 1279, -1469, 1712, -2029, 2472, -3125, 4199, -6242, 11551, -56391, -93202, 54415, 53748, -14802, -25103, -9785, -9078, 21219, 15358, -9447, -8787, -8709, -7515, 27748, 13687, -34007, -12513, 31539, 4481, -22511, -6587, 11478, 15811, -2832, -30732, -2046, 35922, 1168, -27290, 5697, 7211, -13476, 12314, 20756, -18298, -19861, 7911, 14032, 11415, -5642, -27764, 149, 31077, -1643, -22148, 7649, 7956, -12405, 1856, 10724, -1628, -3308, -6085, -3670, 15498, 4660, -19046, 2903, 17724, -13824, -12352, 21088, 8319, -18220, -6825, 7245]
136G245J767n025j5701L841K1520j1387j6121K3259L278l1606Q253K9704j1089
149G938k0113N301R237M870n067j1753R624J2637j9714p242K7818l49k7683N706
163h790J9177o394q107K247K646L091n382p302J4114P824k2959m403K4864m99
177A0127j9259M039J0275m306l071L68L104N099r076q714J6288Q280k0505l435
191a0786J8024j321j2235L845O485j527m982l562P418Q860j2279r647J5714O099
205A0106j5768r96J3189k598r436K495O868J420o826o396Q836Q894j1895p069
219i176J3374L048j3238J073J0911k030q166o28O908L944o994o417R181O248j1610
234c572l722J2721N99j1902R91R275K6p253j912O220M173p427m462R156L357j0831
$$ y = [7245, 9012, 3987, -11714, -7873, 13647, 2260, -13861, 9398, 12676, -18930, -10677, 19027, 7938, -12175, -6874, 2363, 7233, 2166, -9587, 37, 12674, -7040, -14282, 13536, 13187, -14496, -8790, 10387, 3993, -4114, -1867, 779, 3870, -1512, -8814, 5300, 13124, -9835, -14238, 10626, 10127, -9132, -5093, 5182, 876, -2195, -1827, 1277, 6376, -2700, -11414, 4874, 13154, -7351, -10786, 7238, 5917, -6318, -2473, 4012, 2485, -2497, -6059, 1359, 10219, -2060, -11707, 4007, 10106, -5662, -6658, 6531, 3933, -5503, -3008, 3860, 5280, -1546, -7942, 894, 9788, -2107, -9176, 4198, 7246, -5992, -4919, 5992, 3962, -4204, -4832, 2076, 6020, -974, -7391, 1790, 8038, -3572, -7294, 5427, 6026, -5876, -4885, 4390, 4416, -2837, -4749, 1471, 5644, -1783, -6245, 2911, 6268, -4563]
250d563j442J0597K68q966o5P043J148n643k835N744L952p201l957Q892K596r224
266c656j387Q408O06o786j050O041J631n308k906O239L137p626k586Q090J910
281D757p909r81O741J051n822j298N180K274o149k355O660K440o777k203P053
296B662J348o449j221N998J185n500j872N647J911n607k324O134K159o348j592
311c869N861J398n813r96N244J397m986j463M977J635n153j726N258J653n394
326a977j308N178J267m778j683M778J848m810j811M970J605m904j550N229P96
341B850m522j142M312J409m534p32L973J070m151j245M076J591m512r60M230P67
357B480l869j226M117J076l924j053L718J077m047j009M204J115m210p75M029
$$ y = [-4563, -6005, 4592, 4860, -4106, -4171, 2872, 4020, -1623, -4458, 1286, 5238, -1963, -5920, 2972, 5568, -3656, -5043, 3365, 3971, -2815, -3865, 2176, 3807, -1501, -4407, 1832, 4969, -2657, -5243, 2847, 4757, -3152, -4133, 2608, 3659, -2163, -3461, 1719, 3993, -2156, -4511, 2149, 4589, -2188, -4391, 2662, 4010, -2439, -3660, 2338, 3523, -1977, -3849, 1798, 3709, -1898, -4222, 1912, 4071, -2277, -3869, 1992, 3390, -2423, -3419, 1825, 3222, -1764, -3227, 1750, 3385, -1768, -3494, 1764, 3417, -1977, -3285, 1893, 3160, -1618, -3301, 1477, 3325, -1485, -3296, 1674, 3279, -1625, -3175, 2054, 2850, -1672, -2814, 1498, 2907, -1627, -2359, 1614, 2684, -1467, -2712, 1364, 2955, -1557, -2517, 1713, 2480, -1389, -2615, 1502, 2578, -1346, -2399, 1319, 2396, -1651, -2660, 1544, 2659, -1551, -2326, 1703]
372A703P78l847j046M001M57l658n00L422J044l592j070L494J149m022n44L538
388A307Q90l506n94L180P91l117r90L142R58l147j196L564R13l745n40L540N06
405A956l213n56K884P94l052p53K954J017l310j020L889L26l292k81L239k11k424
422a053n45K578O78k680q99K979R27l167r16L627R7k997P7K254l3j859j92J736
440F12J226k601j332L067J030l307k66K935m86k104J88J944J84j974m74J727J364
457A733k056j592K779J236l428K02K533l34k031k99K221K56j510j103J419J901
473A927k710j004L084N4k941P77K196m53j815j76J123J261j353j285J587J076
489A348k113r73L347j83k697L38J536n0p44n29N43J331j239j199J985J133l289
$$ y = [1703, 2481, -1366, -2412, 1589, 2046, -1612, -2112, 1310, 2354, -1238, -2308, 1186, 2335, -1687, -2231, 1307, 2197, -1309, -1903, 1277, 2068, -1049, -2039, 1103, 2061, -1086, -2282, 1282, 2195, -1550, -2090, 1450, 1956, -1257, -1813, 1071, 1865, -1187, -1940, 1014, 2031, -1279, -2299, 1590, 1916, -1376, -1657, 1582, 1371, -1053, -1598, 980, 1658, -1022, -1921, 1058, 1985, -1182, -2098, 1529, 1626, -1371, -1294, 960, 927, -932, -1124, 612, 1838, -763, -2095, 972, 2002, -1305, -1571, 1364, 878, -1226, -1038, 906, 1090, -884, -1358, 369, 1733, -323, -1915, 864, 2100, -1328, -1126, 1407, 1073, -958, -1257, 964, 1220, -290, -1393, 26, 1927, -783, -1787, 1297, 1351, -1590, -813, 1383, 930, -885, -1061, 62, 1323, -30, -1315, 272, 1348, -765, -1738, 1609, 1426, -1271, -933, 603, 553, -191, -720, -177, 1154, -85, -1284, 701, 1834, -1455]
506a455L0K979n00k127N94P87nk66m29QJ615j885j267L121P27l354K15K239o21
525D06o59K67K24Q1l46j016J126J645k195j600K868N03k353P02R09m24p02N56
543hO1P74n85j782J215K050k046r87K123j51j736Q71J250j165j03P7j01J600o10
562G47k518J420J588j598l75J666m64j689R92P74k64R0j500L32K135p54k079J758
580B61P38k249N15K110r03j189M30J1N10O46j614L7J840j197j280K191K23k450
598a370L70J812p34q7L3p04Q87M60j299L76J350j748p09J975M04j720M49L91m32
617b96Q64j50j131R71J29j423J170J469j685j217J803j46n88N69m03l53P51j73
635A61n85J187k52j891J392J210j592k41J179q31j21Q81n73n9N81q83l03K090
$$ y = [-1455, -1425, 1554, 1054, -1073, -479, 308, 303, 37, -392, -384, 1231, -654, -1921, 1200, 1927, -1427, -1212, 1027, 406, -253, 14, 238, 319, -27, -1043, 83, 1728, -467, -2067, 801, 1304, -1049, -347, 562, 138, -564, -8, 53, 827, 242, -1540, -325, 1725, -321, -1308, 815, 664, -1072, -201, 1049, -116, -219, -142, -243, 1357, 747, -1771, -351, 1237, -361, -736, 930, 466, -1223, -231, 543, 279, 369, -1131, -799, 1336, 582, -1497, 261, 999, -1250, -735, 1375, 472, -717, -287, -276, 234, 880, -734, -697, 1143, -54, -1334, 857, 1080, -1370, -1000, 812, 78, -9, 24, -680, 207, 667, -632, -256, 1094, -654, -1363, 612, 1016, -704, -255, 136, -296, 568, 418, -713, 258, 387, -1036, 134, 1603, -82, -1299, 504, 358, -230, 339, -64, -417, 334, 161, -424, 763, 511, -1380, 12, 1222, -370, -611, 568, -263, -384, 497, -76, -135, 446, -437, -740, 1350]
653A350q45j847J251O56r86N68L06p07j4M51n72P62M95j553k6J589o21o99R97
672E55j33r32M04L14l96M12j15q77J089N52j478K86J098j037l25R97Rq20O38o2
692A79m73J014q46o39Q12L87j096O56O40p67l59O20j47J9K95q14K16R36p23n15
712f05J018l86p24J035J54p10J59L14p44O28K23q61P3J068r55K8P68m40m05N06
732A44j01q9K05m8m37M27L41q38M12M09n76j25N83j60n37L55J90l46L33k14l46
753d18O18J6n05L40K40o01J07K99j24m1J81j14k02P53m18l98N57o2n26J74L19
774A95l53j8K87m51J16K28k39J09K67m35j07P37k74j32K0J34q4r7j55R7O0O1o7
797a01K25k3k69J7N50m16p5J15k36J78K36k25j41M63m15j29M61n1k24r4J43j23
$$ y = [1350, 505, -1342, -91, 565, -421, 147, 453, -254, -268, 183, -389, 373, 868, -685, -711, 878, 257, -442, 555, 422, -510, -106, 208, -188, 224, 109, -768, 321, 873, -605, -319, 779, -258, -583, 414, 423, -397, 241, 179, -294, 720, -126, -765, 47, 434, -662, -6, 634, -133, -492, 128, -19, 0, 295, -519, -303, 633, -90, -605, 413, 27, -697, 338, 492, -218, -59, 255, -489, 139, 362, -499, -426, 642, -313, -285, 483, 43, -362, 144, 43, -46, 159, 111, -326, 101, 442, -396, 16, 425, -151, -276, 307, 147, -390, -35, 155, -191, 142, -72, -418, 200, 216, -289, 51, 291, -310, -203, 96, -28, -69, 112, -2, -204, 549, 131, -267, 290, 228, -298, -124, 195, -158, -176, 111, -340, -224, 4, -235, -126, 141, -294, -401, 336, 62, -70, -50, 84, 0, -97, -252, -155, -95, -34, -101, 124, 101, -168, -151, 399, -17, -92, 23, -213, -35, 201, -24, -165, 298, -117, -246, 215, 164, -60, -154, -11, -134]
819a34K09j92M6J62L9k43L65j05l55R0J78K10k62n9L6Nj28n9L38Ok31J29k26L26
843A45j11k51L10k00L59l13J58R3k15Q1j64J19O7k24K08J48j53p6j23N46l19j08
865b3J06K65r6l97N3R1J25l29J48J22J20j56r4k22J88Q7j33K19J01l53O8J42J26
888A58j35k06L7J31r8L6J08K7K6j60MK86l23K45k4O0l30m9p6M23m09M4J78J11
912F4j02j03J61j5k0j16k6K40j5k9L1J1k28M1L24j80j87J34K99l14L5q1J8P7k09
937a90N23m41K64o0l2j11K2K00l91K55k20J00J12j7K39l99j11K86J32l15Kj10
959b62K66j57j63K10j02M92j23k87J00L31m82O5O20m59j86P0J99j29k29K3K46
980D3jj93j9K20j33J29j59J44K47n10K52J69j29j19K3L41m0k10O4K0n5j85P2K31
$$ y = [-134, 75, -117, -71, 91, 130, -113, 252, 147, -208, -118, 60, 270, 8, -51, -15, -10, -138, -197, 141, 147, -84, 45, -181, 145, 34, -217, 93, -107, 252, -61, 97, 190, -25, 56, -108, 11, 78, -146, 62, 210, 57, -19, -142, 404, 85, -23, 83, 348, 252, -145, -92, -1, 124, -205, -57, 65, 185, 29, -65, -287, -99, -12, -145, 74, 175, -178, -110, 32, 158, 23, -183, -146, -15, -113, -77, 31, 58, 84, -76, -72, 214, -109, 136, 112, 172, -158, -207, -283, 140, -269, -225, -47, 64, -38, -141, 20, 5, -15, -131, -157, 83, 68, 39, 70, 81, -147, -106, 218, 38, -149, -15, 284, -30, 5, -76, -58, 19, -190, 333, -108, 156, 96, 64, -47, -25, 175, -216, 39, -181, -81, 31, 14, 253, -146, -257, 29, 161, -154, -152, -262, 4, -153, -316, -106, -208, 284, 161, -126, -26, 305, -177, -112, 508, 49, -137, -67, 132, 3, -226, -203, 43, 42, -151, -170, 50, -83, 46, -113, 31, 278, -232, 20, 189, 60, -59, -36, 305, 265, 55, 119, 139, 84, -101, -29, 202]
1004B02j39j94J73l0o5l4J15M6j02r6j97L15K15l8k78J34J08k2j01K7p5L14k86
1027hk47L47J19n57L38P5k21o9L96J8j52k4J43l9j18j03K18j18J1R3o2K7j98J
1051a30J65O2k29K39M8j4k47l3J21K88l45j24M15j79j62K9J29J00j34J50k33O78
1073E94m93l71J51K60k87j92K68j00m6M11k29K33q4k75L32J27j03k95P6J48k58
1094a33J79J23J2j89n2m9J78L6l29J28J04N8k30J00J76k47J67k31n1K51rj40J54
1117Fp0j73Q0M87m74pK90K54n69J41J05l25M40l41j50L95L8k34p1L54M7l50J67
1140D0L4j2k69N5J48J63k23j75O75n03k68L68K63l83J21M5P5n9p2k21P5K40j04
1163A3k81L08L1K0l6j74J25J76k92M1L25j98j59L36j45l05k3L12j18p3J85jj52
$$ y = [202, 63, -131, 42, 12, -53, -87, 28, 74, -28, -124, -321, -6, 209, 171, -107, 27, 135, 113, 12, 39, -36, 278, -8, -255, 92, 211, -346, -8, 67, -154, -223, 173, 191, 39, 15, 158, 119, 1, -102, 116, -2, 9, 102, 40, 67, -131, -130, 35, 97, -132, 107, 155, 141, -106, -139, -18, 270, -75, -199, 216, 37, -125, -96, 33, 133, -1, 149, -84, 594, 101, -270, -119, 141, -146, -338, -70, -170, -216, 195, -34, 199, 115, -160, 172, 299, 196, -99, -23, 125, -133, 46, 169, 181, -8, -60, -109, 69, 105, -224, -96, 8, 66, -164, -64, 112, -135, 32, -199, -250, 1, -8, -148, 6, -64, -237, -157, 330, -144, -151, 139, 393, -176, -35, 70, -255, 185, -156, -306, 89, 127, -107, -178, 176, 223, -127, 40, 74, 62, -207, -152, -4, 159, -64, -239, 436, -67, -335, 33, 296, -87, 34, 79, 154, 95, 23, -198, -123, 117, 13, -268, 40, 71, 91, 55, -119, 6, 182, -110, -69, 256, 58, -101, 235, 90, -215, -238, 74, -44, -117, 68, 67, -85]
1186h5J63k9j79L48k09k88M91j24j29M9K11m9j83L7R8j10J1j25J04K32n83L47
1208bJ82k12ooJ1J21j81L56K4j66n3j81l9K08Ml65K05J77k80K79l8j0n8K9p8l0
1234a09K33j32j1K12k06l1l5K03k46K18l11L25j77O4k59J16K52k21K2O6L2n5n2
1257a02K4R6L02l78J15k0k03k58M27K9q1p3J80mk0o9j8J58M8j83m4L94l29O8R3
1282A52j00m7Q4R9k23r0P4j31P6L19l34J53mk1j33J55L4j99K00q3j08K9o3k02
1306c63O08l79k81L50L05l38J9L0J26K9j85PJ3N9J06j4k65K29j84L84k40O2k68
1329a90J77Q3k29n2L60M3k12k13L88k62L5L9O6P2j52J68l00J78L6k5j00J19j5
1352A4q1j7J44J03m00K00j9j60K47J53k18J10p4J17q7p0J95j56j52J68l8j03J10
$$ y = [-85, 78, 49, -130, 218, 9, -279, 212, 88, -41, 8, 219, 170, -13, 24, 122, 12, 23, -102, 2, 234, -349, -2, 180, -32, -38, -44, -33, 88, -93, 263, 287, 121, 68, -113, -152, 56, 60, -305, -100, 77, -203, 76, 38, 28, -30, -1, -79, -109, 124, -8, -19, 193, -13, -44, -79, 124, -122, 96, -215, 110, -67, -3, -262, -146, 106, -115, -93, -27, 5, -50, -102, -78, 18, 320, -58, 57, 37, -166, -424, 3, 32, -49, -122, 58, 54, 34, -35, -53, 105, 153, -30, -74, 320, -9, 59, 152, 52, 5, 89, 188, -35, -125, -51, -182, -106, 213, -121, 32, 28, 7, -126, 29, 63, -136, 64, -19, -127, -98, -161, -363, 245, -134, -415, -65, 240, -98, -79, -49, 77, 106, -79, -72, -59, 0, 106, 92, -173, 56, -128, 256, 16, 78, -190, -13, 70, -159, -211, 149, 192, -20, -233, 155, -107, -72, -33, 33, 105, -47, 121, -179, -1, 35, 10, -90, 29, 14, -67, -84, 60, 163, -237, -37, -56, -216, 31, 184, -34, 76, 2, 119, 32, -38, 157, 1, -151, 17, -21, -124, -14]
1375a4O4K5l84L17J33k30k24M77n4j92k06K41Q8K43j87j85J4L8nNJ92j66%R2j04
1400b2MK05k06o5j00K10j44o6O9R7k56L32k2k56K5K76o6j32J98J81j14k57l4J10
1424c3K62q9o0k9k63J69K18l42L03j32J77k62OO0n0K00k43KJ59J52k19P7j59K50
1448A54j96R1l33J94M5R7N2n5k52L8j29L24r4KQJ07l7N9M1N9k45j52J0J89J60
1473A37n1l51L08Q2n1k79j3L95k77J09OK03k57J81n3k16J6q9K28J35k95N1J32
1496E1j3k28K2J67j2p2o4K42K4j20Rp0K29j75k6K83m09j7K81q3J69k95K44k09
1520g2K45l21P2r1K61J47k33N0j75K00r6m3q8P3O9j49K07n2k0k1j07R0m4L46k51
1545cJ70m7p6j39r9J54K33j77j09RK55k7j94K89l54j0J26J54k63K73j97J49k82
$$ y = [-14, 50, 75, -309, 8, 141, -89, -313, 164, 110, -82, -288, -47, 41, 284, 97, -88, -74, -36, -41, -36, 156, -10, -10, 82, -22, -18, 187, -19, -84, -184, 26, -118, -184, -115, -18, -274, 58, 36, -220, -195, 81, 15, -117, 81, 262, 148, -109, -143, -33, 229, 140, 80, 51, -212, -43, 175, -167, 136, 4, 181, -81, -75, -15, -65, 135, -108, -106, 53, 205, -14, 63, -96, 154, -42, 49, -284, -90, -45, 52, 104, 49, -203, -165, -294, 30, -64, -62, -54, 53, 16, 75, 116, 175, -70, -222, -212, -23, 137, 86, -265, 43, 125, 74, -205, -218, 177, -100, 9, 15, 218, -39, 142, 89, -127, -111, -200, 28, 163, -132, -81, 51, 38, -190, -168, -1, -13, -85, -149, 93, 117, -3, 6, -64, 165, -10, -36, 247, -162, -179, 102, 19, 188, -107, 137, -72, 173, -148, -76, -167, 94, 241, 8, 58, -117, 83, -13, -56, -144, -71, -2, -151, 56, 4, -16, -37, -144, -54, -98, 248, -3, 167, 120, 44, -95, -194, -40, 193, 16, -93, -84, 171, 144, -50, 239, -115, -125, 1, 155, -108, 165, -32, 117, -165]
1568a65K61j52K53N2j02m4l16K60J9k3j14k10K30o8Q9o2n7L09k27K70j19o5J05
1591A24q2j92L44k26L42j58k7j09J65l39J25Q7j79L70j18n5J28o0k01q1J87J47
1613A92k38K13N2k70k3j06J36M3kl09L68N3k5j38n8o0K55P2l00K96j50K1o1rJ37
1638H9j1n2j12J34p7J3k14M20k56K36j04J8l25J93o7J32M0M7o0J39k49Pm8J70
1662F3KJ6J24n01N68m40P4O5J97k27l4m2M2J98j33J81r0l58M03j37K64l47O5j6
1686f3j73K7P16k84l66J76r8K69n3p5j56J24n3o9j46K70J89k71r5O6J09j93J58
1709Ij83N1J39p1J93p6j96J02j05J50J5k70J86L2J7j70L55j30k79M34n06J21J74
1732hn3O3K19j87n4rj53J91K74k04N0Kj48k4n9J41N1J21k02j82L82m42J51j2n9
$$ y = [-165, 96, -56, 197, 249, 147, 103, -213, 47, 66, 43, -71, -281, -51, -119, -30, -92, -149, 160, -67, 203, 84, 19, 124, 42, -150, 194, -32, 310, 152, 125, 16, 181, -158, -33, 54, -125, 245, 127, 72, 200, 140, -61, -142, 45, 192, -46, 167, 219, -51, -74, -180, -44, -1, -3, -312, 56, 109, 84, -54, -112, -172, 83, 155, -145, 151, 1, 22, -39, -48, 89, 78, 26, -86, 48, -29, -16, -230, 190, -66, 170, 66, 84, -241, -48, -115, 17, 57, 104, 44, 183, -66, -59, -107, 63, 65, 81, 205, -296, 272, -168, -94, -29, 168, -59, -93, -135, -93, 105, -28, 153, 63, -295, 108, -29, 235, -112, -47, -63, -236, -209, 507, 223, -143, 33, -65, 204, 151, 76, -80, 44, -9, -78, -224, 46, 235, -36, -131, -65, 44, -149, 9, -174, -123, 16, -55, 138, 62, -134, -32, -137, 13, 28, -242, -56, -24, -7, -177, 178, 48, -231, 203, -303, -182, -8, -61, 2, 221, 34, -20, -29, -182, 9, 283, 79, 129, 131, -17, -41, -100, 41, 92, 213, 11, -171, 211, -231, -80, -92, -151]
1757a51J30j23MJ06k5M7k15K58j14K46k76J3j85K60n6R4R5j22q8J06J27J7j32
1780A6J5J87j43M2k65K69k15J0J05k16n6J88Q6p8O8o4K3K39l38K64j11m93N09
1803D2j93j21L67j83j75L20q9l70L95j21K2kJ50k74O6J05j6j1J14O2k38K21r7
1826b6j07K14o2k5k0J72j37N9R8J19k72R3N9m63M06J9j10j51K87m8j43O3k0j6
1850a1L7J0l9M9k81K91rj47K0R1j67l6K65l45K24p5J18k85M70k51j83L79M7j88
1874a6j46J55J23q2K2J06k34R1m8oj23M7K29j91J18q1qn1K57K9l37Q9K2j25P1
1899h9j4m7p4J49K68rk76N4j13L15M4l78k1K8O0J93j4J43jk64R6qj73K49k49J8
1925a13N7L1p2N0l5k2N0r6Q4P8j06m1N4P7J37q8k5Jo1N6o0J0k6K70j55j09j4K57
$$ y = [-151, -21, -144, -140, -34, -59, -12, -227, 31, -83, 163, -113, -100, -285, -25, -81, 13, 108, -14, -102, 4, 131, 148, 16, 31, 218, 75, 117, -148, 121, -94, -84, 21, -195, -251, -63, 23, -55, 13, -51, -28, 211, -127, 137, 26, -467, 42, -151, -272, 95, -88, -263, 57, -32, -402, -7, -128, -106, -108, 42, -232, -166, -61, -77, -88, 26, 88, -150, 71, -26, -133, 81, 19, -6, -26, 146, 9, 68, 166, 285, 13, 106, 165, -298, 108, 127, 17, -134, 153, 105, -38, 25, 5, -11, 26, 36, -3, 46, -235, 56, 47, -100, -80, 11, -156, -192, 73, -272, -48, -123, -5, -290, 180, -71, -254, 125, 172, -16, -162, -7, 116, 34, 56, 162, -72, 19, -29, -35, -158, -111, 118, -73, 45, -36, -44, -95, 162, 191, -146, -57, -35, -160, -89, -103, -150, -224, -75, 193, 184, -92, -38, -151, 164, 208, -170, -191, -163, -103, 90, 76, 219, 218, -46, 50, 42, -131, 118, -131, -113, -56, -25, -97, -47, -82, -104, -54, -150, -66, 12, -94, -135, -81, -4, 133, 45, 20, 21, -40, 16, -44, -34, -60, 210, 55, -54, -68, 189]
1953A89k27n3J88n0j86K92l49O0P7J27o0J49p7q6j49L56k79j68R9M5M5j4n8K44
1977A15M7k42N2J79j36j14J81l59L55k59J78p3J77l6pM4m1O4k37p5J67j22O5J07
2001C0N6j00J11l18L67k68J71O5o9j2j91l3K03J1j51R0J69p4L5J60l38K39j05
2024D8l8n8J94k16J7J99j52q6P2j0j87J17K8J26k23L89k06rj6k8J75k47j7J87
2048E9o2K27l89K51k7QO2k54K63k88J45L8o1j04N7K0N0j76M54k07n0J22m53M19
2072A04r4j90J5J83M6j58K04r9j3m0j08J63L4r5j49R6K27k9P7j49Q3l39J42J26
2096C7j79Q0j10K09J08J06j82j09J36m4J3Pj50K08l20K85l34N5K12k01r0M11m02
2119b54J71K09j02qJ8Q9k66o0J80Q8J15j07k27J71K12k70J5J53p1j12L3L9J57
$$ y = [189, -38, -91, 97, 47, -139, 153, -196, -136, -59, 68, 8, 157, 80, -6, -155, 201, -78, -246, -147, -102, -57, -71, -129, 115, 162, -80, -28, 151, 15, -99, 82, -277, 78, -181, -3, -76, 101, 65, 58, 102, 61, 125, -112, -187, -20, -142, -77, 30, 86, -14, 97, -221, 146, -122, 49, 114, 45, 33, -158, -191, 12, 23, -128, -38, 131, 57, 92, 252, -86, 153, 48, 10, -48, 146, -70, -53, 146, -6, -92, -20, -30, -217, -100, -72, 54, -169, 220, 14, 5, -11, -39, 136, -111, -128, 59, -3, 224, -165, 86, 59, 67, 129, -125, 138, -150, -5, 33, -28, -132, -75, -55, -5, -181, 273, 66, 16, 138, -315, 104, 10, -180, -165, 18, 64, -94, 110, 11, -2, -42, -150, 13, 47, -48, -197, -101, 126, 97, 174, 25, 108, -231, -89, 37, -142, -62, -172, 37, 145, 251, 69, -40, 96, 52, 65, 72, -78, 130, -190, 95, -239, -184, 28, -173, -263, 148, -254, -83, 126, 24, 16, 34, 123, -143, -203, -23, 65, 180, 73, -154, 17, 229, -41, -26, 127, 56, -56, -23, 16, 173]
2142A73l59m3L22J66k96r5J69j25K34k99K54j56K5R0j2j84N6N2K9R4j60J53K8
2165A16L6J18j28k25J51Q8j36K16k16o4J04R9K3j53nn3L1J30N4k50J09J95k95
2188e5M8j22J40j40j47L06k2M2k6Q3l77K93J77j76P2M0K1k39K39k13RJ53j92J02
2212A6j78J61K97j90k8J7j82K02N0k12K29P2j98j40r3Ln1J21K81J03m02P6Q4j90
2236a52K28j17qp9J30J35k80J90J32r6l01K42j24Q1J20j6J4j32RP1j8L4j15J57
2260A05j67o7j54M7J84j36J16K2kK05l4J9j13j06o6j21K04J59k31p0J07K67n17
2283c49K80K80j25k17J02K30k43Q8k8l48L18N4j45J91J58k67J66j20k3L4J97l05
2305g2J49j60OJ57Q2k66J71j30Jj95J41J29j84L30k14n2N4J4M9j16o4K31P4JM9
$$ y = [173, -186, -229, 93, 259, -37, -132, 37, -88, 146, -153, 101, -55, -30, 60, 48, -136, -80, -28, 1, 95, -65, 88, 116, 152, 270, 142, -83, 68, 156, 20, 236, 20, -44, 60, 159, 182, 29, 24, -29, 2, 132, 186, -64, 45, 240, -55, -7, -129, 11, -129, -276, 30, 8, 50, 24, 107, -270, 23, 200, 24, 96, 136, 157, -82, 157, -56, -47, 106, -86, 16, -162, -1, 296, 106, 78, 95, -87, 115, 165, -47, 182, 254, 56, -84, -177, -174, -225, -104, 177, 280, -122, -46, 38, -152, 76, -41, -49, -128, 2, 137, -143, 47, 179, 83, -218, 24, -100, -19, 101, 85, 99, -33, -24, 47, 29, 63, -52, 105, -62, -129, -283, -236, -52, -188, -72, -50, -52, 153, 119, 138, 25, -81, -147, -268, -64, 95, -136, -206, -99, 168, -349, -69, 211, 86, -131, -29, 201, -42, 46, 18, -330, -12, 42, -103, 88, 246, -21, 145, 25, 2, 36, 233, -72, 77, -83, -77, 80, 162, -104, 67, -63, -62, -257, -116, 13, -171, 159, -55, -107, -53, -39, 10, -106, -170, 61, 135, 136, 185]
2330A85j04j14l6J74r5l6M8j25L34k75J28m4J25j71P1ol63L49j44K75j53j09J32
2353D6J45ol63K92r3k57L20m0L9P6m40L44l2N4O5j96R7j00J91j57K61l08j14K4
2377a52K28k46K67j19j52J80j07k0L39k84J28r5L6K9M1l9K89k80J5Q9j31o7P9
2400B8R8l79K96o4j54N3K43k04J29R4n5k5j99J94j48p5J41qM6J10r0j17J36k63
2424b13J46Rj8L0Q8n5k7O3n5n6N9J09m1k1j68P3R6l94M83j40J24j10j49J58l2
2449d1R3J02l8j32K24l50N4j03K06j83K99P8m19K64l5p2Oj68K05l4K61l29J99
2472H7J4j12k3n4L61k20R1k79M07k11j99L06j48J36k14M8N7jO0j97O7P8o5p2J08
2497B5Q1j51N5q8J81J2k7j12O6k08L8k1J25M8O3j3l0O3p5J08j13kk63L97o5j83
$$ y = [185, 81, -33, -69, 105, 10, -26, 22, -103, 231, -44, 84, 40, 165, -6, 65, 59, -304, 45, -99, 176, 23, -86, 46, 191, 185, -178, 114, 21, -236, 84, 44, 83, 159, -281, 63, 31, 85, 150, -46, 51, -49, 142, -15, 246, -62, -176, -152, 76, -170, 97, -22, -174, 6, -101, -121, 218, -66, 62, -33, 3, 32, 73, 34, 323, 43, 58, 147, 16, -51, 28, 126, -253, 43, -21, -175, -122, 121, -83, 46, 140, 85, 60, -139, 55, -93, -168, -27, -35, 11, 121, 31, -86, 50, -213, -67, -58, -76, -46, 42, -13, -40, 23, -32, -88, -29, 80, 39, 18, -150, -77, 19, -375, 108, -32, 92, -18, -167, -9, -41, 52, 154, 116, -16, 208, -142, -88, -191, 15, -168, 131, 209, -210, 54, 19, -53, -47, -215, -10, -44, 217, -112, 87, 101, -11, -34, -88, 273, 53, 144, -135, 272, 61, -138, 168, 20, 156, -58, -10, 47, 46, 106, -91, -24, 54, -11, -83, 25, 106, -45, 10, -78, 103, 115, 88, -24, 42, -166, -128, -149, -24, 24, 87, 74, 44, 107, 32, 140, 27, 25, -238, 159, 94, -89]
2523h9K95n9j73p6O2J60o8k42L7K53k36J19r6K31k40K58q1M0k38L56pj91R1k57
2547a51J48pJ39j27j22K86j49j7j24j22P6J40J33l4j63K00j62j35J69k97L90k01
2569a30Q4K63o2l17J71j61J18K11j91rR1M8K1k29J58l1o0j42L50k40j66L43k05
2592h5K23k02P9n6J85j53j21K10j25n5j89L23J01k23j02N1O7m8K27j14J4m0J42
2615A09k02J63j45K16j38o4R1M9n2l32K35l6j54L77K44r7j29j02o2j34K65L9j
2638A40l4l59J62O8k8J12j02q3k32M37o9q4J83J37k39L6jj44l2K64j3k06K98k78
2662f7R8Q3p5j19R2m2J30O2l16J90m5K47l02M2M4j01J16k43J24K16j51j03K61
2685A41m32M69m16J66j4N5l5J59q7k33J56Q2N8k19J04r6L34R4k69K4j05K38J11
$$ y = [-89, 206, 147, -26, -102, -40, 120, 52, -190, -153, 100, -136, -17, -113, 118, -122, 136, 55, 95, -143, 213, 206, 15, 106, -151, -3, -10, 129, 2, -120, 166, 17, 0, -124, -246, -170, -30, 103, 69, -94, 106, -56, -191, -22, -319, 71, -130, -46, 217, 155, -162, 9, -152, -34, 177, -14, -23, 68, 116, 137, -92, 66, 35, -25, -167, 183, -57, -223, 120, -85, 138, -64, 15, -41, 144, -9, -130, 80, -45, -100, -289, 34, 135, -88, -190, -139, -72, -120, 107, -7, 7, -33, 109, -93, 70, -75, 141, 3, -61, 30, 79, 27, -305, -70, -106, -260, 117, 361, 264, 135, 33, -29, -163, 102, 141, 140, 106, -253, -91, -23, -51, 61, -41, -124, -356, 81, 12, -72, 111, 248, 9, 45, 44, -100, -132, 132, 119, -87, 211, -67, 31, 114, 39, -80, 12, -30, 100, 162, -154, 36, -9, 238, -64, -22, 22, -79, 37, -206, -82, 134, -17, -120, 141, -291, 178, -238, -72, -86, -31, -66, 93, 6, -227, -71, 11, 69, -150, -46, -142, 192, 286, 17, 41, -64, 174, 285]
2708B85l84KJ92j95J21J05l7k83K81l0k50J23J07k5m4P2n0J24q0j47o3J35l7M
2732g4K7J42j43r4K44k5%k02K2J2j88R6L15k81J23J67j28r2j10K63J6P6o2M3k19
2757g2K71o2j02j7k9j46K75j78K51J17k53P8j02R7j40R8Pm0k26L72k33M9K48k35
2781B8O0j37O3k04J59j96L15k6o1n3J81k67P4K68k36n4K33l05K53k41M1j1N2o1
2805a25m6L01p6R0j92J40q2j9L6j29M6K42k93N0O5r2J21J50j87j47J51j37K83
2828A50r6j04j9J2K1P3J8l7J10M3l75L35k34Mj20J83J0o7K26k57P4l3k03L37N
2853E6o6Oj88J86p9o8J56n9MR4r5J37m7j31j78N09k87J40r7J55j58j18K01j02
2877b9L2k4J58J79l43R8Q9k54L50k64k49L12K12j28p5r1k06K4K86p3Lj16k5k3
$$ y = [285, -99, -97, 95, -100, 21, 126, 89, -194, 87, 57, -193, -70, 37, 12, -32, 40, -10, 114, 34, -113, -176, -41, -78, -74, -47, 95, -48, -142, 102, 77, 77, -125, -103, -91, -279, -183, 132, -149, -26, 141, 13, -79, -189, 74, 90, 166, 104, 147, -72, 199, 137, 35, 18, -11, -157, 118, -60, 191, 308, 55, 133, 31, 128, -12, 86, 93, 53, -173, 199, -34, 15, 263, 28, 88, -49, 14, -190, -31, -227, 88, 62, 1, -52, 129, -138, -64, 204, -32, -86, 147, -158, 95, -146, -105, -116, -64, -125, -171, 130, 54, 144, -48, 92, 10, -9, 27, -102, -56, 186, -107, -57, 8, -84, 37, 187, 0, -147, 4, -133, 150, 54, -50, -69, -57, -36, 37, 55, 18, 128, 171, -204, 131, -103, -99, -219, -36, -26, -93, 133, -124, -50, -83, -286, 51, 56, -10, -4, -192, -6, -85, -153, 3, -56, -52, 42, -53, 84, 37, -94, -272, 237, -50, 90, -7, 148, -10, -128, 73, -29, 3, -21, 137, 316, -27, 71, 160, -94, 256, -8, -257, 55, 267, 139, 64, -27, -233, -209, 77, 4, 7, -109, -134, -157]
2901a57j2J32Q2J11O9j51P8l17K12O1j80j24J33J2m6J40O0O1k02j20R3K1j38J99
2925A7j30q1L62k15%M6jp2K83m19N55j18l68J11j10J77L9o5p1J0R5Lj0R4o1j1
2951F0k75J78J01Lk02J7Q8j33J76k59J37L59n4q2j38NJ22k7J9j22j91K36p2N9
2975Ej31K12k09K2K52j71P9o9L6R6p8o5o1K28m0k4k2L3o4p3J12O9J3J53l78k3
3001i8J02o4j12K24q9J3J12m2j33J26j51lp4L53l21k4P8J05J4R7k71K04j68RL87
3026B74m13K47l9j21O1n2m3J3Q8n0Jj2Q9l3j49K93k96R2p9P9j56L60q3on4k55
3052b44L74j7j13J61k92R0J2p7l1N2J6L59l96J10J99k99J5o1P0P0J17m1k47M78
3076C05m18j2P6J15O7n9L5j05j2J8K14k88J33j05Q6Q3r7k6j77R5N2M3n6m9N6k6
$$ y = [-157, -169, -37, 45, 156, 225, 74, 152, -165, 47, 108, -72, -196, -63, -51, -97, 43, 103, 164, -38, -158, -65, -44, -182, 17, -113, -194, 168, -47, -47, -1, -2, -74, 209, -210, 345, 227, -141, -30, -140, 37, 76, 11, -60, -50, 45, 48, 38, 132, 71, 60, -215, -37, 64, 67, -135, -118, -30, -163, 13, -246, -109, 250, 196, 114, -24, -19, 103, 76, 95, -27, -218, 18, -54, 5, -126, 86, -123, -101, 151, -20, 59, -10, 26, 122, 44, -21, -82, 146, 106, 82, 60, 93, 29, -44, 68, 137, 150, 303, -75, -98, 4, -60, -172, 52, -37, -24, 88, 46, -87, 39, -112, -115, -189, 164, -157, -181, -103, 2, 16, 113, -158, 46, -122, -113, 274, -139, 108, 69, -52, 9, -43, -86, -73, 15, -35, -34, -46, 43, 10, -139, 154, -142, -50, -129, -50, -206, 154, 71, 65, 11, -244, 130, 113, 0, 161, -131, -41, -29, -106, -137, -85, -69, 290, -106, 4, 203, -96, -81, -142, -72, -2, 115, 74, -173, 305, -113, -125, -49, 66, 133, 74, 109, 4, -8, 10, 224, -64, 69, -36, 50, 133, 36, 10, -167, -72, -20, 23, -33, -82, -26, -52]
3102e2P0M6p3J47k29O5J53k49J28r4J83m31K61K34J1j86p3l0p4L07p3J07Q7j99
3126C6k6l5Q4r6K00j77J05k10n8J75Q1j3J44k76j49L35j37K02k27P7j09p6o2M00
3150A88k50Jj5j36J85r0J88k41P2Q0l38N72k79K43j63k5QN7q2N4P7j63m9J44k10
3175a72L22k62J94o0o8k5oK57l07K08k33J88q1J40n5K75m69M28m37K53K1k49K4
3198a14L0J03j08K17j97K1P9jj96Q4J14m1J75j75q9K68j84nJ03m1M2N3r0k72K67
3223D3l7j09J32J9j69Q6j68L74j35j41K33l12L99j93J82k88K03k35L2J89J0j97
3245h2J55kl06L01q3l73L54J32l4j46K9O6J04j70j30J90j04J99M2k46R0j13J45
3268A8J1j95K28k5N0m2j37j1P4J27k32K21j5Pm4l9J55k20J31j67J41j63J81P2
$$ y = [-52, 18, 64, -9, 138, -91, -26, 127, -122, 6, -88, 95, -336, -75, 159, 170, -16, -89, -119, -193, 114, 41, 148, 235, 36, 10, -25, 59, -37, 163, -14, 91, -119, -177, -2, 79, 66, 210, -66, -215, 120, -17, 185, -42, 35, -74, -150, -212, 188, -62, -61, -76, -212, -27, -117, 71, -170, -98, -18, -356, 216, -63, 180, 17, -8, 0, 57, -25, 29, 106, -57, -106, 38, -172, 150, -112, 82, 22, -46, -71, -77, 180, -127, 81, -152, 36, -45, 95, 40, 315, -154, 274, -163, 90, 111, -138, -114, -84, 19, -89, 128, -69, -48, 31, 30, -166, -82, 32, -9, 166, -9, -98, 170, -14, -19, 84, 43, 85, 138, 48, -224, 43, 6, -103, 29, 48, -121, -35, -203, 171, 36, -105, 128, -184, 215, 22, 204, -84, 119, -116, -84, 105, 115, -82, 73, 71, -235, 66, -17, -390, -36, 96, 62, -84, -55, 11, 115, -55, -185, 5, -99, 100, 142, -104, -14, -127, 18, 29, -166, 62, 37, 87, 45, -92, -103, -29, 98, -134, 87, 72, 79, 35, -4, 151, -69, 62, -105, 36, -127, 54, 126]
3292A26j52q8K14o9J19n5M4J48l28M3R1l9O5j19o4J55k76K23l3j51M3o8J82J27
3316A38j83R1k11J52K10j74KL5j88K25j88L1n9q8J16K50n4l79K67p6J62j31j4
3339f6J8q3n7K42p2m2J42j60O8%J21K2l28L82j19q7M7J42j92L98o57O2L71k06
3363e4m4O0j28K82JL8j99K6j44M2K07j6p4j61K37k86K39q2L2J26k27J90J1j03
3387b7m2l0L04m39L18k47q5K59o1K39j87M0k1l9j20J77J02j4q7P0n8k2k24J13
3411h1n4K35j34j38j0R4k5lJ73p9k99L07l21K88K58Jj32j35j0m7J70j35j0J77
3435I0ql57M47l08J88n9N4O0j8r8j06J6K81k72J02j0o4J15K35j54q6R2j56j01
3459a17J91j38j28L95l41J63P1P5j90P0J34k45lK3l72L50K59K70l67j41J45q9
$$ y = [126, -26, -114, 100, 31, 150, 95, 139, 287, -41, 2, 93, 54, 119, 0, -64, 91, -185, 38, 5, -146, -103, -171, 11, 138, -45, 46, -165, -13, 197, 23, 25, 60, -128, 97, -91, -60, -119, -207, -91, 159, 105, -274, -7, -83, 79, -52, -66, -48, -131, -188, 54, -18, -60, 82, -78, -10, -10, 111, 133, -195, 187, 68, -19, 28, 170, -22, 376, -281, -219, 152, -54, -98, -38, -166, 116, 117, 155, -44, -18, -162, -120, 87, 71, -3, -164, 73, -213, 26, -56, -24, 102, -125, 65, 76, -27, -69, -99, 205, -234, 84, -163, -248, 11, -50, 189, 2, 42, 21, -18, -138, 39, 141, 127, 40, 110, 52, 30, -194, -81, -135, 100, -34, -172, -182, -88, -113, -116, 57, -22, -321, -14, -335, -47, 211, 212, 80, -55, -65, -112, 58, -77, -87, 90, 82, -275, 172, -136, 52, -7, 47, 107, 89, -9, -115, -99, 182, -90, 12, 2, -62, 53, 288, 134, 48, 140, -16, -117, 74, -64, -192, 203, -138, 25, 96, 171, -19, 51, 185, -60, -63, -40, -412, -62, 197, 467, 100, -41, 104, 15]
3481A5N2o5q4K39p6j21o0P6k67L24K5j30L03l55L00o2j82O9R4K3r0j2M8K7K26
3506C17l77M6P4J38j28J6n4p8J9J5Q3m8M4k17j41K87n0N1j10L6j8J50k13O5J96
3531A03j55j73J73O7J27l00K13j07l0q6J83O1N1L6l53L45k15M1o1J55K0j55K90
3554B30m23J64J03l12J98j61L19l1P3o3M0l13L03m1j74O2R2j08L9p0R5K37l72
3577a13q5J81p2rL67k88Q7j88q6J96o5l1K0k9Q1K26j95j61K25R2l7j03J0O1J3
3602I7j64pK31j89j86K83j98J08J23j00j25M45m93k6k80L39L0J96J95k89K34j81
3624D3j20Q4j87K18lk29K90p0J25j85L02k61K2j29J05L5N3l4l0J52j31j63L79
3647B66m59O0Pk8J39N7n3m9Oj35K69J12k18kJ19j40p0l7J45r9j9P7j11P8l6P4
$$ y = [15, 67, 2, -82, 157, 81, -40, -100, -24, -291, 33, 58, -72, 231, -124, 176, 114, -68, 1, 95, 118, 28, 16, 64, 91, 317, -60, -14, 60, 198, 70, 86, 32, -46, -27, -12, 71, 23, 67, -150, -291, -4, -54, -3, -113, -77, -95, 55, -158, -93, 103, -52, -225, -52, 15, 142, -158, 55, -52, -82, -168, 15, 76, 127, 163, -190, 155, -60, -19, -80, 75, 95, -60, 230, -193, -29, 74, -238, -40, -201, 118, 87, 160, 97, 137, -176, 127, 86, -88, -26, 66, -42, -3, -73, 22, 259, -113, -198, -17, -89, -98, 269, -19, 68, -120, -206, -10, -75, -106, -86, -115, -34, 192, -3, -164, 61, 153, 116, 13, 23, 84, 97, -67, -74, 157, -32, -218, 65, -133, -25, 98, -2, -127, 318, -175, -201, -481, -142, -112, 84, 279, -10, 224, 43, -77, 7, -180, 38, 35, -194, 96, 26, 151, -34, 268, 7, 29, -100, 5, 40, 93, 59, 29, 181, 50, -113, 266, -193, -133, -126, -154, -15, 42, -11, -60, -54, -189, 80, 192, -26, -28, 91, -49, -119, -156, -11, -110, -129, -52, -163, -85, -121, -47]
3673d7k00K18M2j82L01k33J77l7j14L9J7J0j72J45P6k22M62k33j83P5K72j37J99
3696B73j09O5n5j8k32K00O3m0j54jk43L28j82R0J8j41L28j65J23j67N4J19k81
3719a27M9J92p9Mj96K80m39M38j30J14j67N5p9K74k39j33Q7j18J07J49m6k13K38
3742B1l1O8K80m46QJ70K6j58J5OJ35k62K65k12M0L7J67l8j8k11L05m06Q3K28j61
3767h9J55j1j41k32L67k6j67k2J67Ln4O2J0n5n6J11pq6M6j6J00l0K05k82J04k44
3793a88K77j60J34J53j01Rl4k87J80j07m9K24K5o0M4p0j30K91k9o8J09k40J03
3816B6jk06J65j11J31n8j18J33L6O5Q2J6k32o9P5J90M2j93J99k68J66j44K06k72
3840a40R5Q2j42J27P5n8j10J08j62n9K52j62l09L55j50J77J34r3o3K7K5o9R0n6
$$ y = [-47, -247, -29, 13, -169, 132, -101, 76, 39, -75, -36, -19, -9, -181, -36, 40, -182, 280, 47, -136, -61, 211, 74, 273, 164, 229, 174, 156, -76, 124, 187, 147, -7, -8, -251, 77, -105, -15, 3, -138, 190, 25, 148, -19, 35, 154, -127, -78, 114, 35, 39, -157, 123, -316, 122, -8, 106, -61, -6, -85, 189, -50, -183, -96, -214, -107, 42, -4, -217, 21, -10, 58, 338, -108, -100, 70, 96, -62, -47, -41, 94, -168, 97, -115, -75, -38, 129, 91, 73, -138, 167, -239, -156, 72, -89, 66, 55, -86, -318, 49, 23, -144, -166, 1, 4, -50, 12, 22, -33, -89, 22, 15, -71, -25, -41, 59, 29, 234, -48, 56, -188, 89, -71, 63, 216, 115, 124, 90, -197, -17, -124, -173, 51, 76, 16, 60, -10, -140, 151, 122, 54, 163, -77, 26, 25, -181, -16, -127, 4, -54, -172, -39, -3, 62, 144, 160, -72, -141, -66, 124, 166, -27, 172, -96, 70, -74, 132, -140, -45, 37, -105, 22, 97, 39, -71, 37, -125, -184, 68, -94, -403, -48, -198, -21, 113, 20, -43, -16, 9, -60, 30, -26]
3864b6J6k74L89q1%j31J47J64k72K3J9j29K89j13N7m1l47L83Q2K1j17p4J09PJ
3889A02k8j36J56Kj5L6k91K28j0j33j11P6J83J74r6J01l16J59k16J32L0q2r8O1
3913i2J8P2k18J07j36K51k07L29N6k27J53q1j9j63J37J1J86j31j87K08M2L2j74
3936c3P1j29J00j12R2l7q5K19o4LN5l9k06L70j89L3l6PL05j49k68L13j83m7m3
3961e2LJ41J88l44o3n1P2N1k4L41l04j07K20j82L31p0j05j59P9j3J13L4l4l6l9
3986a0n0om9K83j03O8k78M7N9P2R8j10q4j15K56M3j24K20j86n5l0p8L5N1J60q1
4012C3J17Q4j54j45q8K46p7j16j25J82J02l4o3K19k32j0k3J9J07O8N1j58l3P5
4036D5R7l55PK47p1k62K85j13N7m8J43k54J47M2j6P3l2O8j62J63j27R1r5J67p6
$$ y = [-26, -10, -284, 105, 24, 24, -107, 40, 204, -68, -45, -26, -155, 134, 21, 78, 37, -310, 73, 155, 176, 59, -15, 94, 101, 102, 74, -62, 94, 96, 81, 117, -174, 54, 44, -89, -200, -124, 59, 233, 137, 238, -78, 81, -135, -3, 27, -55, -153, -92, -74, -2, -220, -113, -249, 2, -205, 124, 180, -47, 106, 25, 6, -157, -20, -9, 177, 46, -141, 67, 109, 141, -33, 38, -91, 9, -103, -11, -48, -133, 86, 22, 25, 80, 41, -165, 205, 16, 49, 13, 20, 325, 176, -92, 221, 38, -9, -52, -49, 92, 280, -64, -127, -178, -106, -55, -79, 262, -42, -149, 71, -111, 220, 150, 45, -114, -35, -48, 65, 99, 65, 29, -10, -60, -66, -115, 168, 65, 133, -145, -98, -39, 33, 131, 21, -63, -178, 78, 121, -3, 217, 31, -24, -54, -132, -97, -46, 114, 33, 150, 234, 80, -65, -153, 93, 16, -100, -225, -43, 59, 25, -38, 181, -51, -61, -84, -65, 42, 110, 161, 3, -30, 45, 142, -213, -206, 41, -30, -292, -7, -120, -63, -111, 32, -222, -75, -33, -49, 24, -8, 60, -102, 61, -66, 25, -70, 97, 21]
4061B1o7P6p0L9m6L4o1N6m8j58J41J40j07P1N5j96Ll3L74k04k58LJ52L04l73O5
4087h7o7K29n3K1j14o4M2O7K3J3r4K13k63J80l6N7o9m4J34l4J56k48M0j78K00
4112B4Jj89K3J56j14J92J36j86j02P1J17j28r6R2P3j25Q0j85L79j73qo7rK76l57
4137a19J25Q0j76L08m3r1j42j60K37n6J24k35K06K26l70J3J30J30K0k01L9j1o
4160B8R6%m22L09K13j34q6l2J57k70K93L7j42Ln0R1K7j60o9O3j4K01k32j12L5
4185a70K97j49p4J41p3p2K38k45j3J11R0L2k80J86n3p6P6P5J04j12n3J20j84N0
4209c4J66k84P5L9r2J92k62K90j51J5k3J65N7N1k37J30J2j94q4J51J04j26o9K78
4233A69j51J6K46k33l10K00J79k47J45j37K83k12l1J33p8J43m0M0j49k2o6p0K56
$$ y = [21, -46, 30, -40, -1, -47, -13, -74, -18, -66, -224, -83, 57, -50, 21, 76, -120, -117, -150, 224, 20, -238, -235, -83, 221, -152, -87, -154, 75, 22, 43, -71, -135, -93, -26, -3, 10, -84, 129, -134, 46, 10, 67, -2, -46, 88, 54, 210, -38, 2, -176, 24, 25, -164, -141, 15, -99, 93, 229, 43, -59, 12, 129, 1, -95, -3, 70, -55, 25, -160, 219, 46, 38, -29, -38, 238, -119, 6, 86, -90, 218, 175, 84, -58, -218, 19, -37, 87, -148, 58, 284, -86, -73, 57, 187, 207, 6, 45, 34, 28, 124, 124, -298, 11, 224, 90, 4, -28, 129, -141, 152, 189, 47, 50, 0, 91, 118, -42, -111, -48, -62, 139, -93, -205, -170, 127, -22, -96, 45, -28, -100, 138, -107, -120, -9, 81, 113, -167, 19, -34, -110, -34, 41, 145, 33, -20, 100, -84, -34, 132, -152, -77, -38, -130, 62, -200, 90, -61, -46, -69, 96, 153, 204, -33, 97, 109, -85, -169, -18, 86, -40, -109, 169, 18, 34, 280, 47, -263, -63, 116, -131, 14, -123, 160, -52, -83, 50, -28, 115, 75, 115, -34, -56, -122, -192, 64]
4256F4p4J50q9k04K62k37J64M2l1j10j2J08q6q5J40k01J75j00J86P7L4k63P2m3
4280f1L2J53j49J13j17OM2j7j04K84j5j44O7l2j2rJ7k28L39k14oj4K73m09L0J59
4306a6K66k83n2P8p9j96K96j14o0J70j84L27k19Q1k6j1N4J17j11j25P6J21k3r9
4330a2N6n5j36K88K6O3k78J37j02J56j1j17k3J86q0k00j09L49j73kR3l5K48k60
4354Ij75J1J82r6K18l27L20l39J99q9J0N3q0P2L1J66r5j73M2j45Q7j3K20l3k62
4379b07L7K71l3k11J8j13O6J11K49j58k15J93o8L15p8m00K18j41K02K9l65L16
4401C6J07k35L5O7j15j2J14j52J20J06J29N2k19K4L4j05j13J8J64r4k23L71j7
4424I2k20J01Q8L8j35M48k35O2m26K05K18m07J68J47qk22J26j12K4Nn7O2K56j83
$$ y = [64, -10, 140, 51, -153, 109, -128, 36, 78, 47, -63, -75, 33, -53, -138, 2, -199, -24, -124, 62, 139, 173, -90, -18, -61, -29, 124, -25, 88, -29, -23, 19, 2, -102, 182, 167, 23, 90, 58, 46, 37, 54, -174, 165, -49, -55, -69, 204, -205, -175, -16, 250, -33, -85, -7, -86, -282, 14, -100, -160, 10, -174, 153, -66, 15, -11, -22, 32, 149, 38, -87, -11, 110, 87, -12, 44, -11, -147, 141, 167, 230, -48, 89, -13, 143, 132, 15, -8, 178, 98, -102, -211, 138, -35, -37, 56, 21, 269, 9, -166, -155, 27, -69, 149, -178, 142, -197, 2, -87, -77, -24, -104, -32, -1, 165, 70, -103, -61, -206, -119, -132, 88, 55, -207, -170, 101, 68, -143, -125, -238, -172, -61, 188, 30, -185, 8, -60, 255, 177, -223, -5, -146, 56, 85, -280, 36, 143, -92, -57, 10, -105, -117, -3, -155, -35, 71, 200, 252, 33, 57, 91, -14, -127, -109, 55, -39, -262, 109, 92, -128, -27, 61, 99, -36, 412, 177, 239, -187, 18, 236, -171, -3, 144, 136, -86, 40, -72, -48, -43, -100, -38, 218, 35]
4448C5l7j46J56Q6j00k6M6m6K62j84k2j7m0J21k30L2R2P5R3j97P6K4j48K05p7
4473C3N0l14Q0K11Q9l83J98K87l65J41J50j08j65K33k04j1K8j7LN2j38M9j5K11
4497I5r7J92l43K70m1K8L1k92K59k02L29m16L73l58K40q1Q7k59J12n4L47k00n6
4520c6j68J78K56m32K27j56J35j26N8J16k07J86p6l7O4j1J00j5J10m17J72O7j86
4543a98O4J76j23K09n0j4L7o9j25J20qj10q4J8M05k45P6q7k25K21Pk28L46j46
4567c3K9J29k74K72k69J45J45j50L21k60mj57K26m8r2K83k79M2k88N01l97O0m3
4590a41J47m4P3j28J01K3P4Nm0m1n7M6J19q0J29O9m67M79k29l4K3k13J14J43o5
4615Fj5k2n6Pl1p0J82J04j58J07N4j87m0q4J17j94K76j05l36L90l3R6k00J26j2
$$ y = [35, -2, -148, 8, 94, -6, -32, 14, -32, 230, 46, 24, 7, -33, 88, -142, -110, -18, 57, 150, -47, 29, 53, -95, 110, 33, 83, -231, -151, 60, 149, -234, -36, 251, -114, 27, 177, 69, -96, 137, -67, -78, -50, -67, -64, -12, -150, -101, -116, 95, -2, 190, -153, 117, 76, 104, 135, -157, 102, -100, 229, -187, 186, -172, 68, -13, 74, -185, -73, -127, 220, 20, -36, -204, -26, 230, -202, 25, -131, 4, -122, -64, 52, -155, 31, -45, -82, -18, -29, 71, 56, 166, -251, -79, -12, -198, -134, 42, -81, 128, 78, 64, 101, 32, -93, 27, 19, -91, -175, -157, 248, 3, 79, -8, -233, -12, -5, -233, 113, -33, -4, 125, -149, 123, -146, -1, 144, -6, 315, 55, 51, -106, 120, 72, -20, 263, -16, 26, -262, 239, -158, -98, -141, 6, -38, 35, -93, 8, 31, 105, 110, 70, 29, -28, 18, 137, 57, 186, 255, -212, 267, 38, 4, 27, -186, -72, 71, 6, -9, -31, -87, -80, -111, -181, 1, 105, -53, 54, 108, -79, -119, -203, -86, -280, -4, -109, -445, -55, -88, 8, -192, -66, -78]
4640g8K39j8q9r5j30K79l69L29M4Q5k96K48j19K8j03J11O4l40k1J29J01J60j54
4663Ej63K50L6k13k9M6M7P1k33L46K2q4j14l3J62k25J56K08j21j84p5L96l55L54
4687B70q7p6l24L8J01K72l86M16k66j16J81o1J56p5j39J81j12j06K43k01L00k8
4709A81op8p2n8J9N2J03p8n0j72K19j54j51j7J34J65p3JK45k67J36J91j97r6P
4734a6r6m1O6J21K23k29j92j43M07j4j31O4k0k13J35J08j24M9j78K53j7j39j94
4757c21K49K80k39J52J15l32J57j76J08k7K25k89J71j29K05l1k87J14j26J39k58
4778c00M16j6j45o4lo3J47P9K9K01l10M4n9N4K39r4j25K42l08KJ50l10K20j30
4802a04R3J58k35K17j56RO2j51jK41j54l9j08K84j63O4R5l0j92J01M2j68J91k97
$$ y = [-78, 161, 143, 54, -41, -171, 108, -261, 68, 112, 197, -99, 149, 30, 58, -45, 66, 130, -210, -231, -102, -1, 159, 5, -158, 92, 128, -85, -114, -68, -21, 50, -183, 163, 185, 101, -13, -46, 116, -109, 47, 255, 134, -50, -125, 271, -84, 270, 183, 107, -217, -179, -78, 194, -192, 224, -42, -158, 23, -38, 118, 43, -96, 85, -27, -133, 110, -91, 209, 181, 175, 97, 25, -33, -14, 38, 141, 63, 13, -159, 60, -94, -245, -262, -128, 37, -36, -35, 210, -57, 79, 270, 73, -23, -16, -112, -153, -87, 34, 257, 28, -164, -307, 100, 86, -45, 19, -1, -214, -79, 29, -95, -46, -224, 29, 12, -127, -321, -72, 208, -31, 121, 236, -96, 61, -115, -7, -34, 191, -98, 73, -56, 149, 118, -169, -55, -181, -42, -300, 116, 100, -45, -109, -112, -175, -28, 51, 80, 281, -29, 15, -44, 10, 249, 155, 30, 272, -36, -34, 116, -194, 26, -104, -11, 147, -88, 129, -27, -18, 44, -107, -108, 133, -21, -60, -168, 116, -47, 17, 112, 82, -110, -9, 33, -135, 56, -241]
4826b41L76k53L3K12k51J28N3r7QL47l56MR2l8L2R6P7jk07j47L07N1l49k34L78
4851B0j47J47qmj45N8K06k8rl05K69p1J55j23K05l17o4o4K29l2K1p3k7n0Q5N0
4877b2n3K23j42o7L34j55P3q1j5P6lj80P3n2J82k4k05K08j88M5o4k1J36j22j49
4902a93K81J17k07N9M0l01K02j77J34J33j60l0K98n22L29l7K00o5j16N6J04j29
4924A6j40K68k73K67j95L03k51N3m3j55K62j93J02j08J46kl1k9N8r0k5O8k95N04
4948B17l25NL5Q1j04J38j62J5K41j86R4j05R3j42K46k86K69m4j38J24m6k53K22
4971a1l0r9l1M4J8M5l0L19j87j11l9M6J06j13j22J73%j45J69J5j25j09Np8L23
4996C3M1j70K58J15j58l38J62k66L60mRM5l5L2j03j9p0j1M11m99J86K87o41M52
$$ y = [-241, 135, -118, -85, 127, -124, 4, 57, -40, -32, 315, -41, -37, 55, 17, 49, 145, 222, 221, 14, -133, 174, 225, -124, -358, 20, -127, 20, 12, 8, -137, -79, 127, 99, 90, -215, 54, -17, 138, 15, 220, -97, -161, -225, 4, -28, -7, -80, -107, -157, -72, -22, -75, 148, 6, -61, 273, 118, 191, 110, 95, 171, 168, -12, 61, 9, 191, 167, -38, 170, -18, 27, -37, -58, 78, -44, -193, 88, 205, -2, 57, 97, -204, -2, -179, -45, 88, -72, -102, 196, -326, 3, -34, 166, 101, -15, 41, 145, 16, -124, 144, -129, 138, -57, 246, -5, 48, 5, -150, 112, -81, 21, -87, 59, 57, 26, -3, 55, -35, -60, 8, -287, 217, -108, -103, -68, 13, -91, 47, -115, -100, 141, -45, 49, -56, 37, -105, 141, -145, 124, 80, -58, 66, 20, -233, -11, -41, -140, -171, -127, -109, -64, -94, 225, 38, -73, -112, -66, 40, -73, -195, -22, -22, -167, 2, 17, -108, -217, -212, -290, 33, 74, -96, 162, 277, 119, -219, -57, -323, 37, 33, 42, 87, 52, 84, -19, -38, -108, -119, 292, -207, -21, 266, -375, 77]
5020G7k39Q8j04M22k21j28Q0O8rO1j98j51K69m0K38k32l8J58j23j8J33k78K74
5043H9j59prL43k57J28l01NK30j04OL1J17k96J56m8l6K62J04k53J5J47k63N1J9
5068c0lK66j03k89K37l3j4N7l48J73J16l4p7J39Nr3K5J84j09p0n0J4n7J87j18
5093b5R3j12k9KJ65l25J61L8N3p2J24JR6j64N1O2j58j61K63k85R1L2JM3K25j53
5119A7L8q3r0K58j29n3O2Q4m7L7k44J90J34j69J00l35J65Q5qm9m4K5O2J8j54J28
5145bj18K59k18O3o7k7k01L29n1J18r9K85l42K27k99n3P6K49k89m8J3Q3K53j57
5169a6P0j23m8K12Q2j87r8J21p6n5K67m04K57j47J17Q0j60J06j3j00J86J1p8J8
5193B2K3j63o2j2K18j62N0m9K3R2P4m3j25O1K61k50j8L3p9J82k41K4J40J8k79
$$ y = [77, -162, -74, -178, 244, 23, -105, -25, 43, 34, 95, -103, -254, 15, -25, 213, -19, -57, 101, -22, -40, 93, -185, 89, -70, -77, -86, 257, 0, 128, -173, -168, 62, -42, -36, -5, 112, -184, -28, -76, -112, 150, 254, 1, 16, 163, -100, -49, -30, -33, 233, 130, -159, 78, 45, 31, 88, -260, -87, 29, -5, -82, 57, 62, -31, -6, 178, 69, -1, -51, -37, -94, 93, -25, 68, -44, -73, -71, 94, -231, -70, -32, 21, -51, 73, 74, 170, 6, 57, 119, -39, -200, 63, -222, -131, -99, -98, -55, 170, 17, 55, -28, -118, 140, 11, -42, 20, 104, 57, 94, -150, 40, 174, 5, 105, -230, -65, 20, 12, -37, -81, -56, 6, 24, -130, -2, -120, 139, -79, -16, -83, -110, -311, 18, -33, 85, -14, 271, -71, 156, -143, -196, -120, 129, -160, -208, -195, -112, 141, -16, 54, -69, -117, 95, 177, -10, -108, 13, -63, -118, 149, -255, 2, -145, -28, 52, -108, -2, -15, -115, 71, 82, 4, 22, 45, -118, -180, -192, 26, -136, -86, -135, -112, -20, 54, 11, -114, -53, 208, -42, -60, -27, -106, 76, -165, -141, -1, 17, -262]
5218b62J44J17m9J92k17P4R7j0l7m5M4q6K45l84j4J17j09K4J41q9j41K69j21k11
5242c11M26N6j28p5j58M04m0j28J16M3p2j55N1P0j49K13l05L36j65Oj6l38N01
5265A82m34J64J5J7j9J97p3m2oK2p9L2l37O33j97KQ6k32J03P1r4K08j80l76M04
5290F7j56o5J31k0K07k33Q8M3q8j5K1j09Q5Q2j00K57k27j76L70J0j90J48J80j93
5314A17l6j40q2J87n7k8K22k57J31Oj72K43o3n0oj68K98l83J93K73n43M46OJ72
5338C09j27k04l3Q4m0j9k2k9k5Q9p6J84l19OJ43L76m93M38l14M8L1R0k13K13Q
5363A05p9N5l44K37J93r0K7l4Q1j61r5Q6P6n4j88K66j42L28J2l32K95k37j91K62
5387G6j69K22j19J97l97K43J16j27O8l35J56P6K9n8K13k46L1J08n6L47l80lk3
$$ y = [-262, -118, -1, -50, 142, -75, -1, 96, 86, 49, 4, 48, -38, 207, -177, -191, -74, -183, -159, -18, -107, -248, 21, -100, -311, 115, 171, 43, -32, -190, 214, 174, 46, 162, 205, 133, -22, 29, 99, -50, 163, -142, 194, 29, 35, 19, -319, 182, -252, -88, -73, -56, -75, 122, 49, 7, 1, 23, -56, -24, -361, 272, 75, 77, 163, -69, 34, 105, 11, 219, 39, -337, 67, -89, -154, -23, -43, 164, -69, 19, 62, -26, -41, -20, -129, -44, 38, -62, 195, -32, -208, 162, 172, -18, 130, 310, 117, 81, -59, -141, 46, -11, -39, 183, -74, 57, 63, -109, 134, 71, 21, 15, -153, 145, -238, -45, 228, -315, 131, 137, 309, 182, -22, -55, 29, -11, -30, -52, -81, -106, -17, -93, 91, -228, -222, -79, 297, -196, 242, -72, -24, 7, 97, -116, 97, 105, 26, 81, -263, -26, 167, 77, 104, 70, 151, -10, -105, -19, 57, 3, -185, 81, -61, 267, 279, -53, 242, 5, -186, 76, -93, 129, 10, 207, -190, 53, 169, 42, 110, -225, -69, 7, 36, -22, 191, -55, -24, 84, 28, 375, -5, -8, -31]
5410c1j68O7J63J78j97j33J29K1J01q5l76K49J00K1k0q9J0N8L2p4n0Q5m3n4j26
5435b32M29l28J41P6j26O4j82j1K01k0J28j23J98k23P4j19j3RK1J83k39J66j03
5458b9K19k21j73J40J10r3J70j21j0J1o6J37j47P4J25j27k20M92j61K2j19M3p8
5481b2m1L37m59L2J43J4R7j7j16M0o4l12L67q8J97l42J61P6k1k44L02N3p7j00
5505h4O1M9j65K4P7J33k68J83J02j21J96k59Pj39O6k5K27J2J81J35l50K25j81
5528H6L6j03M6L6J61j56K72k40N1j69n6O5j36K64j29j96P8J01j28L36k19rm2J0
5552d1l9k19J77J28J37k78M6l1k3L88j63k49L93k00J43k92J00K59m88K44m9RK07
5575A59m8j35K22k98L87k11l7m2O4J1nj51L7J08r0P8k39K86k04J65k04J01j3k0
$$ y = [-31, -199, -132, 31, 209, 12, -121, 8, 29, 130, 45, -331, -82, 18, 39, 19, -70, -60, -2, 30, -44, -94, -9, -52, -106, -232, 197, -131, 10, 86, -40, 24, -158, -169, 32, 12, 140, 17, 215, -8, 66, -53, -66, -57, -36, 147, -92, 74, -29, 190, -31, -204, -64, 46, -47, 123, 2, -8, 3, -63, 74, -73, 1, 126, -1, -221, 271, 110, 132, 13, 56, -22, -63, 274, -185, -153, -10, 4, 101, 84, -32, 8, -56, -368, -1, -89, 108, -234, -73, 3, -18, -262, 40, 93, 16, -84, -23, 26, -139, -115, -38, 95, -173, 10, 112, -9, 187, -72, -65, -204, -138, -163, 64, 76, 257, 392, 42, 267, 86, 122, 19, 65, 101, 262, 106, 378, 138, 189, 20, -36, 29, -107, 157, 28, -168, -90, 11, -117, 219, 0, -9, -51, -41, -80, -299, -122, 6, 143, -135, -89, -120, -143, 245, 82, -167, 226, 26, 169, -123, -23, 236, -252, -8, -57, -48, 159, 111, -24, 198, -100, 287, 76, 39, -3, 61, 72, 67, -84, -47, 61, -29, 49, -190, 96, -108, 57, -147, -46, -59, -79]
5599g9j27K05k59L05J10o2q1RK5j3j4k27J23J82J2O0j72l3nK15k84K03k17m7J9
5624a52J25Q8R5k62L2J54O5k06m4m3K72k19L3J54l8j84J77J66k80J12k39L30l1
5647A05J0j95K8J03K22l49k66K33K09j2j72p9N4Q8J3K12r4l31K97k47o3J13J04
5670a7r0J4J32q6M2J59j38NK43k31J34j04j68K42r6pj8j11J44m2J85k27J1K9L1
5695C6k60J14K53n8K67l32q7J3J86q4r9R9l23L48q2J67j24o5L08l96K28j9j65
5718g5R9j71J14j03J3K33j44J23rq0O6j68K26l15L54l47K48J54k29p2K06k4q6
5741A3K3j04J77Q1j43j42%J44O7l6L0j46J4J00j87J39k35P4M1J81O5j71j27K22
5765H0k30j1K87l19M63k46R9k58L04n3n0k71M6J58L14k46k44M9K74l6J2k14P1
$$ y = [-79, -206, -1, -260, 45, 155, 93, 12, 21, 46, 33, 19, -208, -85, 97, 109, 169, -3, -36, -41, 174, -110, 93, -124, -171, -152, -27, 61, 156, -106, -74, 80, 145, -61, -105, -148, 124, -95, -62, 92, 54, -130, 47, 213, -67, 45, -194, 136, 105, 115, -80, -52, 51, 273, -76, -342, -109, 100, 88, -84, -163, -109, -21, -8, 204, 110, -221, 76, -171, -234, -121, -17, -107, -93, 39, -47, -5, 154, 16, 21, 264, 33, 167, 63, -105, 137, 41, 34, 16, -95, 49, 7, 192, -35, -24, 5, 36, -224, -110, 143, 85, 352, 20, -67, -54, 132, 48, -51, 48, -275, 73, -9, 158, 34, -31, 277, -119, 109, 90, -75, 24, -147, -33, -136, -123, 110, -34, 89, 80, 0, 66, -102, 124, -191, 163, -184, 64, 218, -11, -83, 123, 99, 13, 36, -68, 109, 190, 47, -95, -95, 49, 116, 80, 110, -36, -22, 78, -109, 30, -205, -131, -90, 91, 156, -15, -142, 80, -150, -161, 126, -193, 270, 24, 123, -135, 169, 116, 66, -205, -159, -1, 313, 67, -177, -128, 146, 110, 122, -92, -21]
5788b1n3r3K24j84M0j44J49n0J7J96k27J55J35l80K71L4j25r0N8J00j92K36J24
5811A80k62n6J91j34K35O9k16j23J88q9j43K33k4q2M8J00m3J80j12O4m25M24l27
5834a24p6J56K5l46K41K1R6K2J6p5k72L88K7Ro7k03J47k81K54J87j86J74R2q7
5858A38j36j7l5K0K2J54l60K71j28rJ84o1J06p8j72j03J96K77l36J25p1q1J14
5881B0o9j49P2n3K69j31K13k99J39N3k60QJ7N85m23P7k11jj1j9k7K25k17J71n6
5906g7l2L13k75J2l5J5J94j2k11J7J25k24K03K46j69l3j20K33O0m69K62r4K86
5929B15l54qK76q0n9p5M7L1j99J84k72P0P0K28k14M0K14Nj94Lnj56L94j7k61j7
5955a34J84K1J91j63M3n4Q9l05K82Jm07N41l00J60k16R1j44K54k80K52j52J7j4
$$ y = [-21, -74, -167, 57, -127, -87, -231, -82, -132, -115, 81, -146, 9, 144, -236, 35, 69, -56, -146, -88, 12, -180, 56, 180, -82, -138, 53, -81, 154, 223, 7, -116, 72, -17, -160, 73, 49, -33, 15, 115, 72, 252, 140, 204, -221, 203, -124, -200, -44, -19, -365, -124, -103, -7, 15, 31, -44, -316, 72, 99, 108, 41, -162, -15, -296, -42, 145, -41, 133, 225, 138, 2, -15, -50, -30, -8, 146, -214, 57, -71, -80, 104, 43, 149, 71, -101, -204, -8, 269, -67, 58, -13, -94, 20, -49, -198, -126, -179, 90, -41, 172, -127, 12, 65, -195, -187, -170, 415, -8, 69, -142, -143, -154, -173, -200, 25, -192, -21, -77, -109, 204, -71, -59, -94, -79, 115, 103, -108, -91, 34, -190, 13, 259, 90, 57, -63, 170, 230, -239, 23, -71, 215, -139, -147, 129, 49, -10, -85, -38, -7, -206, -22, -294, -224, -154, 74, -140, -100, 114, 119, -75, -72, -77, -233, 161, 144, -117, -134, 50, 71, 262, 99, 142, 88, 177, -128, 154, 155, -252, 289, -11, 149, -67, 24, -120, 134, -146, 106, -46, -29, -43]
5978d3l8J2K56j1l27K92j46l9j34K89J29k53j82L49p1k77J84n4j6L3L7KJ12p4
6002C0O5l31L2J44P9N9j22J32m3j50K17J38r6j37p4J8J71m09K02N6n3J10j71J41
6026HQ4j49J19m6k8R2l2j62%N3R4J25k63r8J03P1j2J55Km20rJ62Q2R2N4j20K8
6053a5p7L08l46L06j23j1J06q5j0k10m5L34l85K73n2J11M3j61j34J18j96L60J19
6076B28k91J60j15j34J32RR8l4q8M34l73M1P3l9j04R6l16M07N6k66R7j80l2J49
6100Hk28JM01q4j19J70j65P6P1m8k01J48m7J23j77N7j28K5Kr1JP1J9J97L6J45
6126B63l19Q0Rj95K80k14O7J33j50L3J36j87j6R4N9l1o2pP3k08J54L95m02j2n1
6151g8n2L06j00J19k54m3l0L23n79M98j7k15K3R5J06O7j89j17K13k43K23P5p2
$$ y = [-43, -81, -69, 187, 176, -151, 141, -5, -44, -178, 111, 240, -13, -195, 154, 83, -194, -10, -64, -80, -47, -10, -8, 104, 30, 95, -236, -204, -60, 19, 78, -44, 88, 45, -105, 112, 250, 154, 17, -57, -39, 132, -277, -75, -19, -72, 38, -133, 8, 92, -57, 62, 16, -12, 80, 48, -114, -114, -61, 33, 158, -105, -203, -100, -29, -41, 114, 116, -304, -313, -151, -69, 23, 77, -43, -15, -92, 216, -130, 176, 53, 42, 148, 63, 53, -157, -202, 132, -253, 20, -32, 79, 122, -39, -173, -55, -251, 109, 228, -63, 97, -18, -152, -20, -11, 87, 53, -35, 399, 26, 67, 140, 101, -3, 93, -223, 184, 240, -26, 71, -109, -141, 8, -220, -219, 182, 98, -21, 149, -16, 60, 131, 83, -118, 30, -17, 106, -71, -14, -142, -117, -115, -206, -205, -134, -115, 82, 118, 263, -56, 24, 33, -162, 118, -96, -29, 104, -46, -13, 123, -64, -80, 14, 73, 42, -20, -27, 46, -162, -8, 387, -15, -27, -78, -130, 176, 76, 195, -59, -102, -132, 191, -388, 110, 93, -122, -99, -4, 102, 169, -20, -137, 76, -167, 56, 131, 59]
6174E9m8J8j50J45L4k05J6J47K5j65K20o2K01r4k51L6L93k15k8J27k43Q5J69l17
6198a03L8Q5j09J41O9q3j64J37o2J1k2J35k18M2N0J63m2k25oK60J3j12p5mJ03
6223B2j94L67k30J51J6K7j13k32K65J92l57L00k69J37Q8m09J90J7k6p0O9J8N8
6246A7j35q5K22N6j67j88K03J01j38j05J52N4R0K37P5k49P8k52N1k80P7J56n9
6269h9O8l5M9K57k55j01L15j20j39m1K41j52J46j53PL9k23n8L38J7j47J02R0k45
6293h9Q9p0J51L6k31J20j14J47k02K09k5l6R1P8j39P5r9j2NJ13L0j85Q4o7J7N6
6319C2K3j7j18L6J11j29J4L0J17j4N8N0m0m1j91Q3M2L9M7pj4l1j62J26j71K20
6345I3r5M1j01j78K62Qqk47K71j8k63L86m5l8P7k08J10m8l8J84K18l45m9k35K28
$$ y = [59, 11, 29, -121, 24, 58, -147, -131, 16, 41, -124, 96, 34, 235, 141, -110, -74, 319, 104, 76, 203, -40, 45, 214, -103, -65, 20, -89, 52, 121, 38, -126, 11, -51, -40, -62, 73, -145, -103, -53, 110, 68, -157, -163, 97, 110, -2, -77, -81, 22, -172, 195, -35, 116, 132, 159, 46, -186, 79, 271, -86, 214, -55, 82, 170, -239, -49, -32, -58, -128, -59, -41, 17, -118, -203, 19, 75, -92, -280, -77, 24, -114, -219, -67, -13, 77, 314, 389, 140, 218, -34, 17, -263, -186, -30, -89, -21, -56, -7, 250, -5, -106, 209, 89, -50, -91, 150, -2, 144, -9, -2, 37, -186, -244, 94, 111, -36, 66, 156, -89, 0, -70, 81, 117, -114, 6, -108, 39, -163, 46, 21, -15, 76, 154, 15, 90, -9, -21, -16, 97, 127, -58, 26, -41, -24, 32, 55, 38, -80, -44, 67, -62, -48, -18, 99, 85, 143, 193, 153, 112, -79, 4, 46, 85, 132, 125, 111, 80, -82, 44, -127, 93, -2, 39, -62, -240, 22, 30, 22, -225, 46, 28, -235, 151, 106, 68, 145, -63, 47, -1, -39, 145, 363, 18, -31, -266, -38]
6370c8O0o8J15j21M3q9K20m5K40j21l62lJ76J06Q0l16L1k0N3J4m7k6L60n10J22
6395a46J23jj4m1j93K83j2K9j27j2J75k15R0K4J2R3P8k03J65j56J90J1j71J23
6419A05j34K9O4k47L20k40M9k8K85j74KJ47j05R1q5j91M1K24j93J0J66j69K05
6442A72j33P2j11O0o5Kk5n9J53k58J79r1R8n4R5Q9jl30L71k09nJ96n2L8l7n6k04
6469a65K46j81m5K55j60j18l9N9L1l3L63k20K17j61K5o7j23j3J48m2J15m4j51
$$ y = [-38, 22, -46, 69, -52, -9, -98, 122, 77, 317, 196, -166, -169, 7, 113, 193, -123, -92, -112, -59, -45, -92, -118, 242, -268, -146, -23, -24, -38, -79, -272, 11, -1, 28, -99, -111, 64, -151, -61, -37, -25, 68, 146, -57, 108, -48, 142, 153, -18, 105, -29, 0, 64, -183, 137, -103, -54, -82, 203, 29, 31, 178, 73, 164, 79, -112, -71, 153, -40, -30, 136, -33, 172, 39, 111, 0, 60, -5, -3, -28, -87, 66, -192, -13, -104, -6, -60, 35, 124, 123, -207, 164, -45, -50, 146, 94, 132, 95, 39, -165, 81, -100, -145, 110, -50, -168, -207, -148, -117, -150, 213, -7, 210, 49, 74, 7, -116, -129, 19, -23, 92, 48, -103]
$$ [...]
8191B4
##END NTUPLES=NMR FID
##END=
