##TITLE=1H_LR-618-C2-Tol
 CDCl3
 8 sc, 
 9.11.2021
##JCAMPDX= 6.0         $$ Bruker NMR JCAMP-DX V2.0
##DATA TYPE= NMR FID
##DATA CLASS= NTUPLES
##ORIGIN= UXNMR, Bruker Analytische Messtechnik GmbH
##OWNER= root
$$ XWIN-NMR		Version 3.5
$$ Tue Nov  9 12:17:16 2021 Russian Standard Time (UT+4h)  she@DPX200
##.OBSERVE FREQUENCY= 200.1313468511
##.OBSERVE NUCLEUS= ^1H
##.DELAY= (6, 6)
##.ACQUISITION MODE= SIMULTANEOUS
##.ACQUISITION SCHEME= undefined
##.AVERAGES= 8
##.DIGITISER RES= 18
##SPECTROMETER/DATA SYSTEM= spect
##.PULSE SEQUENCE= zg30
##.SOLVENT NAME= THF
##.SHIFT REFERENCE= (INTERNAL, THF, 0, 15.7039)
##AUDIT TRAIL= $$ (NUMBER, WHEN, WHO, WHERE, WHAT)
$$ ##TITLE= Audit trail, XWIN-NMR		Version 3.5
$$ ##JCAMPDX= 5.01
$$ ##ORIGIN= Bruker BioSpin GmbH
$$ ##OWNER= she
$$ F:/spectra/data/she/nmr/H-F/1/audita.txt
$$ ##AUDIT TRAIL=  $$ (NUMBER, WHEN, WHO, WHERE, WHAT)
(   1,<2021-11-09 12:15:45.32 +0400>,<she>,<DPX200>,
      <created by zg, POWCHK disabled, PULCHK disabled
       configuration hash MD5:
       00 E9 B6 7A A2 85 ED C7 34 08 36 98 17 FE 4E 26
       data hash MD5: 16K
       E3 11 5D D2 25 49 07 AB F2 00 7F EC 9A FE 8F E6>)
$$ ##END=
$$ 
$$ hash MD5
$$ B8 12 B3 A7 AE F2 01 17 6D 0B D1 0E 23 9A AF 5B
##$RELAX= 
##$RELAX= 
##$RELAX= 
##$RELAX= 
##$RELAX= 
##$RELAX= 
$$ Bruker specific parameters
$$ --------------------------
##$DU= <F:/spectra>
##$EXPNO= 1
##$NAME= <H-F>
##$PROCNO= 1
##$TYPE= <nmr>
##$USER= <she>
##$AMP= (0..31)
100 100 100 100 100 100 100 100 100 100 100 100 100 100 100 100 100 100 
100 100 100 100 100 100 100 100 100 100 100 100 100 100 
##$AQSEQ= 0
##$AQ_mod= 1
##$AUNM= <au_zg>
##$AUTOPOS= <>
##$BF1= 200.13
##$BF2= 200.13
##$BF3= 200.13
##$BF4= 200.13
##$BF5= 200.13
##$BF6= 200.13
##$BF7= 200.13
##$BF8= 200.13
##$BYTORDA= 1
##$CFDGTYP= 0
##$CFRGTYP= 5
##$CHEMSTR= <none>
##$CNST= (0..31)
1 1 145 1 1 1 1 1 1 1 1 1 1 1 1 1 1 1 1 1 1 1 1 1 1 1 1 1 1 1 1 1 
##$CPDPRG= <>
##$CPDPRG1= <>
##$CPDPRG2= <>
##$CPDPRG3= <>
##$CPDPRG4= <mlev>
##$CPDPRG5= <mlev>
##$CPDPRG6= <mlev>
##$CPDPRG7= <mlev>
##$CPDPRG8= <mlev>
##$CPDPRGB= <>
##$CPDPRGT= <>
##$D= (0..31)
0 1.2 0 0 0 0 0 0 0 0.06 0 0.03 0 0 0 0 0.0002 0 0 0 0 0 0 0 0 0 0 0 0 
0 0 0 
##$DATE= 1636445744
##$DBL= (0..7)
120 120 120 120 120 120 120 120 
##$DBP= (0..7)
150 150 150 150 150 150 150 150 
##$DBP07= 0
##$DBPNAM0= <>
##$DBPNAM1= <>
##$DBPNAM2= <>
##$DBPNAM3= <>
##$DBPNAM4= <>
##$DBPNAM5= <>
##$DBPNAM6= <>
##$DBPNAM7= <>
##$DBPOAL= (0..7)
0.5 0.5 0.5 0.5 0.5 0.5 0.5 0.5 
##$DBPOFFS= (0..7)
0 0 0 0 0 0 0 0 
##$DE= 6
##$DECBNUC= <off>
##$DECIM= 32
##$DECNUC= <off>
##$DECSTAT= 4
##$DIGMOD= 1
##$DIGTYP= 9
##$DL= (0..7)
0 120 120 120 120 120 120 120 
##$DP= (0..7)
150 150 150 150 150 150 150 150 
##$DP07= 0
##$DPNAME0= <>
##$DPNAME1= <>
##$DPNAME2= <>
##$DPNAME3= <>
##$DPNAME4= <>
##$DPNAME5= <>
##$DPNAME6= <>
##$DPNAME7= <>
##$DPOAL= (0..7)
0.5 0.5 0.5 0.5 0.5 0.5 0.5 0.5 
##$DPOFFS= (0..7)
0 0 0 0 0 0 0 0 
##$DQDMODE= 0
##$DR= 18
##$DS= 0
##$DSLIST= <SSSSSSSSSSSSSSS>
$$ [...]
##$SUBNAM2= <"">
##$SUBNAM3= <"">
##$SUBNAM4= <"">
##$SUBNAM5= <"">
##$SUBNAM6= <"">
##$SUBNAM7= <"">
##$SUBNAM8= <"">
##$SUBNAM9= <"">
##$SW= 18.0517286264689
##$SWIBOX= (0..15)
0 0 2 0 0 0 0 0 0 0 0 0 0 0 0 0 
##$SW_h= 3612.71676300578
##$TD= 16384
##$TD0= 1
##$TE= 0
##$TE2= 300
##$TE3= 300
##$TEG= 300
##$TL= (0..7)
0 120 120 120 120 120 120 120 
##$TP= (0..7)
150 150 150 150 150 150 150 150 
##$TP07= 0
##$TPNAME0= <>
##$TPNAME1= <>
##$TPNAME2= <>
##$TPNAME3= <>
##$TPNAME4= <>
##$TPNAME5= <>
##$TPNAME6= <>
##$TPNAME7= <>
##$TPOAL= (0..7)
0.5 0.5 0.5 0.5 0.5 0.5 0.5 0.5 
##$TPOFFS= (0..7)
0 0 0 0 0 0 0 0 
##$TUNHIN= 0
##$TUNHOUT= 0
##$TUNXOUT= 0
##$USERA1= <user>
##$USERA2= <user>
##$USERA3= <user>
##$USERA4= <user>
##$USERA5= <user>
##$V9= 5
##$VALIST= <valist>
##$VCLIST= <CCCCCCCCCCCCCCC>
##$VD= 0
##$VDLIST= <DDDDDDDDDDDDDDD>
##$VPLIST= <PPPPPPPPPPPPPPP>
##$VTLIST= <TTTTTTTTTTTTTTT>
##$WBST= 1024
##$WBSW= 4
##$XGAIN= (0..3)
0 0 0 0 
##$XL= 0
##$YL= 0
##$YMAX_a= 132014
##$YMIN_a= -243708
##$ZGOPTNS= <>
##$ZL1= 120
##$ZL2= 120
##$ZL3= 120
##$ZL4= 120
##$ABSF1= 10
##$ABSF2= 0
##$ABSG= 5
##$ABSL= 3
##$ALPHA= 0
##$AQORDER= 0
##$ASSFAC= 0
##$ASSFACI= 0
##$ASSFACX= 0
##$ASSWID= 0
##$AUNMP= <proc_1d>
##$AZFE= 0.1
##$AZFW= 0.1
##$BCFW= 1
##$BC_mod= 2
##$BYTORDP= 1
##$COROFFS= 0
##$CY= 11.3945322036743
##$DATMOD= 1
##$DC= 2
##$DFILT= <>
##$DTYPP= 0
##$F1P= 2.36226072786647
##$F2P= -0.459571619588291
##$FCOR= 0.5
##$FTSIZE= 0
##$FT_mod= 4
##$GAMMA= 1
##$GB= 0.15
##$INTBC= 1
##$INTSCL= 1
##$ISEN= 128
##$LB= 0.24
##$LEV0= 0
##$LPBIN= 0
##$MAXI= 10000
##$MC2= 0
##$MEAN= 0
##$ME_mod= 0
##$MI= 1.114404
##$NCOEF= 0
##$NC_proc= 0
##$NLEV= 6
##$NOISF1= 3.799351
##$NOISF2= 2.8
##$NSP= 1
##$NTH_PI= 0
##$NZP= 0
##$OFFSET= 15.70392
##$PC= 1
##$PHC0= -15513.72
##$PHC1= 17.60082
##$PH_mod= 1
##$PKNL= yes
##$PPARMOD= 0
##$PSCAL= 0
##$PSIGN= 0
##$REVERSE= no
##$SF= 200.130013532006
##$SI= 16384
##$SIGF1= 3
##$SIGF2= 2
##$SINO= 400
##$SIOLD= 16384
##$SREGLST= <1H.CDCl3>
##$SSB= 0
##$STSI= 0
##$STSR= 0
##$SW_p= 3612.71676300578
##$SYMM= 0
##$S_DEV= 0
##$TDeff= 0
##$TDoff= 0
##$TI= <>
##$TILT= no
##$TM1= 0
##$TM2= 0
##$TOPLEV= 0
##$USERP1= <user>
##$USERP2= <user>
##$USERP3= <user>
##$USERP4= <user>
##$USERP5= <user>
##$WDW= 1
##$XDIM= 8192
##$YMAX_p= 0
##$YMIN_p= 0
$$ End of Bruker specific parameters
$$ ---------------------------------
##NTUPLES= NMR FID
##VAR_NAME=  TIME,          FID/REAL,        FID/IMAG
##SYMBOL=    X,             R,               I
##VAR_TYPE=  INDEPENDENT,   DEPENDENT,       DEPENDENT
##VAR_FORM=  AFFN,          ASDF,            ASDF
##VAR_DIM=   8192,          8192,            8192
##UNITS=     SECONDS,       ARBITRARY UNITS, ARBITRARY UNITS
##FACTOR=    0.0002768,     1,               1
##FIRST=     0,             0,               0
##LAST=      2.2672688,     0,               0
##MIN=       0,             -243708,         0
##MAX=       2.2672688,     132014,          0
$$ Real data points
##PAGE= N=1
##DATA TABLE= (X++(R..R)), XYDATA
0 0 0 0 0 0 0 0 0 0 0 0 0 8 -8 8 -8 16 -16 16 -24 24 -32 40 -48 56 -64 73 -88 104 -120 136 -152 176 -200
33 -200 226 -256 288 -324 364 -405 452 -505 561 -621 690 -763 843 -929 1024 -1129 1244 -1370
51 -1370 1509 -1664 1836 -2029 2246 -2490 2774 -3101 3486 -3949 4514 -5225 6146 -7397 9205
66 9205 -12060 17255 -29849 132014 45848 -144682 47578 29569 -51854 4548 56506 -39105
78 -39105 -31043 -26180 -84958 -36227 82611 22974 -29438 27483 124 -69927 25038 78100
90 78100 -8435 -7444 46810 -47383 -86921 23660 35772 -34839 17696 32825 -67369 -46878
102 -46878 57395 24553 -6320 60677 34737 -48943 -4531 38447 -7568 12515 48408 -28829
114 -28829 -61004 2949 -13006 -45623 28317 37979 -54067 -40066 26372 -10487 -21110 46686
126 46686 31462 -23425 4503 9969 -30517 11773 54624 -5878 -30622 18759 621 -34009
138 -34009 13201 32229 -9183 1217 16989 -26823 -20797 34106 13759 -21824 9468 7336
150 7336 -37184 -14152 19820 -9328 -13349 14848 -11364 -33347 7376 17402 -8613 11027
162 11027 25216 -11200 -10974 23333 9428 -4158 22480 13524 -19901 -3139 13535 -10947 -7242
175 -7242 17012 -3531 -20890 -328 -2271 -16863 4756 12590 -14810 -11240 10197 -5244 -13897
188 -13897 9858 9470 -8263 1253 6181 -9063 1330 17447 1517 -5075 12763 6652 -7984
201 -7984 6330 13255 -1861 160 7650 -6661 -9350 5698 355 -11154 -1662 -737 -13155 -6639
215 -6639 2664 -6390 -6777 4738 -516 -7914 3064 5661 -1979 4626 10172 -331 -1311 8984 4982
230 4982 -935 5872 5941 -1761 1460 4410 -3531 -2379 4131 -1332 -6768 -1298 -2020 -6714 -2861 -983
246 -983 -6757 -4770 618 -3422 -5404 1455 1844 -2094 983 3627 986 2905 6170 3307 2383 5717
262 5717 4550 1392 3503 3200 -344 731 2198 -2272 -3964 -662 -2060 -4967 -3446 -3328 -4831 -2955
278 -2955 -2029 -3928 -3447 -604 -646 -1143 456 1028 1184 3177 3492 1567 2916 5506 3710 2152 3435
295 3435 3797 2320 1638 1304 -119 -326 101 -2338 -2973 -1928 -2649 -4068 -3925 -3744 -3892 -2559 -1942 -2912
313 -2912 -2145 -98 135 -185 1119 2630 2261 2549 3788 3216 2918 3448 3205 3190 2912 1219 295 1255 974
332 974 -1491 -2324 -1749 -1938 -3157 -3562 -3562 -3505 -2647 -2519 -3227 -2862 -992 -721 -1197 -92 1151 1640 2420 2430
352 2430 2094 3417 4790 2904 1943 3330 3274 1465 1037 1156 -127 -238 -356 -2008 -2806 -1746 -2254 -3597
370 -3597 -3082 -2497 -3345 -2717 -1640 -2345 -1734 220 1 -558 1647 2979 1172 1915 3978 3369 2148 3405
388 3405 2908 2055 2363 1858 1 474 1406 -1227 -2305 -882 -1586 -3640 -2582 -2484 -4229 -2954 -1169
405 -1169 -2943 -2852 4 -452 -1956 127 1997 767 1434 2914 2035 2825 4472 2501 939 3518 3469
422 3469 926 1064 1875 -573 -986 232 -1615 -3218 -1309 -1494 -4229 -3270 -1551 -3156 -2771 -728 -1847
439 -1847 -2290 -132 571 -1005 1699 3024 597 1161 4266 2839 1274 3403 3394 1087 1745 2528 -178
456 -178 60 1447 -677 -2515 -348 -1750 -3869 -2099 -1243 -3160 -2695 -1367 -3541 -2940 452 287 -1754
473 -1754 558 1731 -5 1094 3386 2336 2368 3951 2237 596 3041 3233 994 1513 2067 -879
489 -879 -1523 429 -1212 -2444 -910 -1530 -4126 -2833 -1077 -2914 -3069 -758 -1216 -2038 -37 -56 -956
506 -956 1308 2688 800 1382 3450 1648 1016 3639 3846 1113 1203 1864 -38 660 1875 -630 -1913
523 -1913 -626 -2137 -3693 -1654 -828 -2779 -2491 -1547 -2875 -2712 513 -16 -1304 611 1381 -312 813
540 813 2894 1855 1500 3555 2377 931 2344 2414 991 1646 1890 -464 -1190 -225 -1452 -2275 -506
557 -506 -1173 -3481 -2876 -1522 -2503 -2022 -164 -800 -2098 -997 -331 -235 1669 2428 641 1169 2321 1582
575 1582 1706 3638 3195 740 1250 1703 376 308 1217 -714 -1412 -653 -1509 -2879 -2042 -1444 -2279 -2363 -1323
594 -1323 -2165 -2750 -821 -320 -640 738 1164 -409 477 2746 1790 1691 2943 1995 912 1864 2370 1327
612 1327 1081 1467 -562 -1343 74 -691 -1557 -515 -1454 -3024 -2468 -1645 -2290 -1567 -443 -1301 -2025 -795
630 -795 268 -189 427 1524 1228 1398 2302 1710 1212 2603 2537 1111 1507 1835 72 84 750 51 -1083
649 -1083 -852 -1289 -2817 -1696 -1014 -2045 -2089 -1771 -2029 -2123 -588 -89 -753 90 318 -379 952 2222 1678
668 1678 1243 2001 1849 1109 2207 2186 918 579 907 183 -334 -205 -808 -1593 -1002 -1001 -1958 -1956 -1670 -2137 -1604
689 -1604 -791 -859 -1494 -489 13 -214 471 1465 911 945 1838 1822 1640 1847 2169 1318 1347 1047 543 520 624
710 624 -85 -1139 -888 -1111 -1909 -1652 -1459 -1818 -2226 -1568 -1586 -1533 -954 -486 -405 -221 493 563 767 1261 1443
731 1443 1792 2235 1671 1174 1542 1963 1071 850 929 299 -304 -183 -562 -1258 -1415 -1451 -1583 -1799 -1530 -1967 -1792
752 -1792 -1154 -1189 -944 -723 -232 -86 414 810 593 985 1612 1749 1713 1810 1769 1612 1166 955 728 659 297 -553
774 -553 -466 -443 -805 -1721 -1645 -1077 -1433 -1803 -1664 -1370 -1301 -743 -563 -498 -240 283 722 751 808 1060 1771 1641 1616
797 1616 1500 1473 1677 1158 842 770 327 -51 -398 -546 -1030 -1100 -1385 -1542 -1333 -1422 -1607 -1615 -1501 -1107 -654 -513
819 -513 -411 -39 472 907 501 774 1598 1387 1592 1350 1756 1539 888 736 654 841 322 -445 -288 -484 -810
840 -810 -1225 -1404 -1653 -1543 -1455 -1561 -1870 -1453 -757 -769 -650 -378 624 468 315 740 1309 1377 1340 1398 1551 1481
862 1481 1051 784 1169 696 376 -27 -28 -401 -975 -876 -948 -1543 -1382 -1027 -1456 -1245 -1361 -893 -464 -629 -535 -186
884 -186 310 678 727 1083 1528 1420 882 1277 1712 1518 949 1211 822 368 108 -94 -272 -589 -908 -1016 -1223
905 -1223 -1404 -1515 -1217 -1114 -1534 -1226 -680 -525 -449 -227 398 317 521 922 1278 1080 1324 1377 1452 1233 1210 828
927 828 903 718 238 151 -275 -402 -839 -720 -807 -1405 -1555 -1373 -1260 -1694 -1265 -991 -651 -678 -185 -130 -94 528
949 528 845 707 1350 1530 773 1175 1628 1261 995 1069 565 161 477 173 -977 -614 -268 -606 -1146 -1055 -1187
970 -1187 -1721 -1117 -966 -826 -819 -506 -775 -374 518 369 -62 617 1207 526 991 1416 953 1156 1510 1014 336
991 336 375 589 -26 -122 0 -891 -791 -688 -844 -1432 -734 -930 -1649 -1055 -600 -808 -767 288 -94 -124 477
1012 477 676 307 1133 1518 852 642 1466 1276 990 1389 750 63 270 307 -348 -581 -127 -1086 -1389 -826
1032 -826 -931 -1631 -1075 -673 -1330 -972 -315 -899 -489 451 456 130 746 909 420 960 1622 873 841 1673 903
1053 903 98 476 974 121 152 -53 -1008 -1340 -611 -844 -1030 -685 -1040 -1502 -1140 -671 -586 -509 232 -428 -229
1074 -229 414 757 569 1032 1172 725 405 1165 1088 855 1338 554 -211 556 237 -555 -440 26 -817 -975
1094 -975 -1065 -886 -1397 -1039 -504 -866 -1166 -513 -604 -707 91 590 339 559 525 113 1166 1455 1175 959 996
1115 996 852 236 631 645 266 -340 -82 -644 -696 -491 -917 -1011 -944 -1100 -1433 -681 -687 -909 -718 122 -291 -217
1137 -217 357 709 326 880 1167 723 1010 1176 1112 810 1068 910 421 300 -16 -308 -224 108 -738 -1050 -936
1158 -936 -1014 -847 -809 -611 -952 -919 -669 -518 -371 50 416 338 679 729 670 1169 1076 867 898 1091 677 573 563
1181 563 365 144 124 31 -582 -991 -742 -897 -1106 -589 -866 -1200 -1126 -750 -657 -316 -252 -116 -368 488 456 715
1203 715 740 803 635 701 1050 822 619 866 866 356 274 206 -3 -248 -570 -538 -652 -827 -1016 -995 -723 -1044 -1031
1226 -1031 -449 -442 -472 -92 159 -81 88 589 466 361 756 1002 975 1066 983 662 509 594 274 100 216 32
1248 32 -452 -344 -768 -752 -663 -914 -835 -813 -706 -660 -732 -415 -214 -356 -33 -270 332 616 554 777 669 1092 919
1271 919 677 604 672 462 270 380 68 9 -194 -579 -401 -514 -656 -864 -736 -671 -953 -819 -751 -446 -363 -219
1293 -219 -286 9 140 501 492 846 656 988 968 843 718 759 626 414 352 210 270 -167 -173 -388 -613 -723 -640
1316 -640 -721 -931 -697 -789 -573 -697 -548 -206 -247 249 -24 254 453 705 630 765 807 467 942 677 724 658
1338 658 522 232 304 104 -213 -307 -350 -438 -425 -621 -648 -733 -632 -672 -627 -514 -630 -251 -117 -89 169 427 421 598
1362 598 493 829 1000 861 573 762 814 662 78 60 77 -34 -54 -165 -324 -922 -742 -674 -827 -731 -869 -565
1384 -565 -666 -671 -70 -105 -254 69 302 283 435 630 808 1077 917 459 582 771 901 329 375 27 -58 -100
1406 -100 -417 -716 -490 -494 -512 -645 -755 -832 -681 -478 -484 -436 -107 -236 -45 -7 201 141 428 731 543 579 902
1429 902 745 578 870 486 404 152 -208 17 -115 -432 -346 -438 -595 -788 -901 -590 -682 -636 -687 -296 -381 -339 231
1452 231 -19 206 211 179 588 677 1032 693 504 591 585 308 616 347 156 -18 -12 -149 -475 -473 -412 -579 -919 -569
1476 -569 -646 -655 -538 -353 -580 -68 -462 -82 72 155 118 240 632 567 467 881 604 818 429 722 169 292
1498 292 77 223 -154 -65 -256 -574 -459 -485 -597 -754 -433 -751 -675 -380 -241 -338 256 117 33 -30 303 174
1520 174 570 803 573 468 841 499 432 428 602 159 -228 -217 14 -375 -168 -350 -658 -634 -512 -653 -618 -658
1542 -658 -422 -414 -323 -25 -173 104 209 189 456 425 281 419 562 353 743 843 267 370 205 147 -124 -129 -326
1565 -326 -411 -452 -751 -513 -392 -597 -436 -635 -865 -398 -273 -268 -134 -21 -169 -107 320 409 422 587 510 874 676
1588 676 442 349 339 626 501 181 -200 -398 -335 -396 -255 -288 -408 -507 -585 -640 -259 -474 -521 -536 -185 -22 -203
1611 -203 46 345 361 338 329 487 720 493 572 231 445 429 259 246 71 -175 -48 -216 -287 -388 -515 -355 -529
1634 -529 -459 -511 -679 -651 -519 -471 198 132 15 319 381 220 360 568 571 473 131 377 654 625 52 318 84
1657 84 -87 -111 -240 -274 -337 -615 -724 -729 -591 -671 -548 -214 -434 -329 -323 -1 -67 -4 246 155 357 395 268 636
1681 636 375 455 627 425 537 265 -46 -44 -69 -182 -227 -431 -475 -439 -527 -488 -642 -454 -412 -441 -261 -156 105 -72
1705 -72 -201 129 367 305 423 585 670 556 508 790 480 543 363 65 154 15 -326 -9 -246 -154 -325 -379 -639
1728 -639 -515 -313 -408 -450 -344 -237 -166 -321 -95 31 30 380 192 408 151 446 484 505 370 532 269 201 205
1751 205 93 -50 -111 -199 -308 -554 -189 -436 -971 -539 -490 -224 -372 -503 -308 -1 -190 219 236 11 313
1772 313 146 462 537 460 312 585 459 289 320 197 -26 -18 13 -390 -366 -528 -273 -353 -508 -451 -328 -285 -253 -298
1796 -298 -167 -90 2 -98 -38 139 314 68 459 690 460 556 584 363 448 412 473 206 141 27 64 -206 -327
1819 -327 -451 -545 -93 -404 -331 -663 -446 -577 -235 -90 -287 134 85 -119 59 216 373 -21 264 529 431
1840 431 269 401 248 270 328 208 -51 -150 -20 -170 -206 -385 -316 -345 -376 -319 -388 -192 -342 -308 -477 -261 -190 156
1864 156 233 78 438 105 517 331 717 280 453 152 479 473 177 316 -115 -22 -302 -79 -268 -206 -577 -463
1886 -463 -249 -446 -510 -499 -214 -80 -208 40 79 108 15 343 377 552 487 486 458 371 57 284 229 174 53 182
1910 182 -275 64 -173 -128 -242 -575 -214 -291 -249 -575 -434 -491 -373 -215 -103 -118 -74 20 217 228 265 327 237 337
1934 337 470 201 620 342 434 56 91 194 -307 -26 -113 -115 -405 -539 -341 -460 -347 -178 -318 -403 -45 -65
1956 -65 -352 -336 -177 -13 116 446 343 396 389 258 583 511 343 80 180 392 43 165 -5 26 -165 -279
1978 -279 -77 -290 -203 -785 -350 -425 -489 -251 -354 -239 -144 13 210 148 176 379 617 472 444 494 345 236 180
2001 180 -61 164 109 23 -382 -206 -116 -193 -322 -129 -436 -615 -194 -207 -508 -350 -372 -188 -172 16 33 19 272
2024 272 76 387 281 477 526 515 391 30 162 215 141 -2 1 -126 -76 -269 -328 -243 -423 -215 -380 -227 -288
2047 -288 -225 -257 -198 -306 -96 -68 65 -90 -95 419 422 515 458 289 145 511 712 154 48 51 -34 -146 104 -189
2071 -189 -420 -43 -548 -491 -393 -37 -646 -396 -248 -322 -329 107 59 66 -24 175 338 317 236 319 262 377 479 136
2095 136 295 159 114 49 191 -1 -127 -136 -169 -607 -160 -228 -446 -542 -185 -471 -247 -163 -80 -226 -116 339 -41
2118 -41 266 403 266 301 93 408 197 534 396 131 -59 162 214 -42 -135 -274 -124 -231 -154 -318 -471 -337
2140 -337 -101 -171 -443 -180 -285 -276 301 -82 244 173 215 -31 431 372 -115 345 407 244 -9 354 8 368
2162 368 128 -75 -309 4 -402 -265 -283 -178 -321 -422 -192 -145 -422 -439 -95 -377 -315 414 81 122 384 342
2184 342 197 491 232 52 346 151 109 175 356 70 123 162 -317 -132 -260 -257 -133 -344 -267 -178 -281 -210 -507
2207 -507 -271 -178 22 119 76 275 20 116 286 167 299 152 406 89 242 491 15 45 52 -21 -233 -304 -220
2230 -220 -118 -383 -326 -27 -128 -346 -387 -279 166 -396 -155 -92 -135 44 -12 92 309 336 120 222 254 522
2252 522 236 152 47 53 -45 175 -9 136 -150 -237 -189 -206 -446 4 -415 -44 -99 -18 -27 -302 -91 -122 35 231
2276 231 56 186 66 208 397 49 367 493 206 95 409 252 121 -61 -61 -123 -71 -323 -30 -204 -72
2297 -72 -187 -38 -372 -281 -117 -265 -84 -146 -20 -186 286 -23 -27 281 344 296 212 372 496 91 338 151 202
2320 202 1 105 -8 -41 -167 -246 -177 -245 -157 -157 -357 35 -284 -157 -157 -146 52 76 299 43 303 55 108 -94
2344 -94 499 185 212 190 136 61 203 159 182 23 -160 -157 -23 -52 -276 -139 -200 -219 -202 -362 -479 -12 -180 132
2368 132 -96 217 81 115 301 409 146 153 -90 205 319 206 165 251 -160 53 195 -115 -6 -86 -3 -211
2390 -211 -267 -547 -151 -270 -515 -173 -231 -121 101 29 211 222 20 81 406 108 -87 164 225 178 201 217 -143
2413 -143 295 380 139 -133 68 -278 -243 -5 -73 -341 -248 -255 12 -126 -180 52 -213 -346 89 58 -180 235 216
2436 216 75 175 -121 265 95 339 286 538 125 64 68 31 138 -117 -233 175 -26 -47 -383 -181 -24 -303
2458 -303 -117 -48 97 -272 -113 98 111 -34 78 -115 67 119 191 173 278 10 100 209 232 106 -87 -10 -27
2481 -27 148 -24 -184 -138 28 -387 -267 -361 -168 -423 -427 19 -212 -36 35 -268 189 180 179 389 168 -10 293
2504 293 246 92 93 128 100 -13 5 -206 -143 -144 -235 -16 -113 -297 -162 -126 -112 19 -221 -355 -44 -303 -40 -166
2528 -166 266 114 415 136 124 228 115 188 307 245 -35 -169 201 153 -76 -61 114 -339 -20 -124 -171 26
2550 26 -273 -172 -44 -207 54 18 -136 -85 -179 113 208 25 23 211 72 316 69 265 336 113 154 87 -166
2573 -166 78 10 99 -55 -151 -39 -36 -163 -90 -239 -236 69 -371 -255 -43 141 132 -211 80 218 -70 80 -86
2596 -86 183 -39 94 369 95 15 123 141 117 -9 145 74 -245 -323 -6 137 -226 -118 -105 -226 -322 46 -8
2619 -8 -95 61 -129 -175 151 277 -23 155 -64 246 410 140 149 -86 54 295 -49 -35 59 -146 -239 -164 -19
2642 -19 -86 -233 -116 -281 -460 -355 -170 -162 -115 -30 -74 -100 217 -8 42 -187 175 416 115 37 127 35 140 107
2666 107 -115 12 -99 63 199 -118 -149 95 -277 -277 -11 -312 -115 -223 0 -103 -222 -178 6 110 54 325
2688 325 -116 -11 77 75 119 268 133 208 -13 -14 136 168 -6 -191 -57 -101 5 -19 -128 -291 41 -132 -30
2711 -30 13 -114 -65 -162 -266 115 62 192 -33 16 275 83 -14 103 246 135 361 -129 -11 167 -76 -68 119
2734 119 -156 -225 -203 -26 -91 87 -176 -27 -118 -79 -157 58 -44 176 1 215 -150 130 56 201 156 214 75
2757 75 22 37 -8 187 -19 40 121 -110 46 -151 -29 -103 -181 -280 -281 -278 -218 -190 -97 -186 45 20 -154 -119 218 70
2783 70 144 -91 85 145 4 231 230 193 83 86 -166 34 20 -162 -301 -1 -64 -145 -251 -144 -104 -297 75 -173
2807 -173 -181 111 -94 155 62 3 155 266 -106 134 45 36 -50 -80 -1 112 -83 305 5 81 -159 -107 -346 -37
2831 -37 -250 51 -74 -169 -258 -76 -50 -253 -15 -65 -57 151 -64 -72 292 152 61 -26 146 46 65 179 3 82
2855 82 141 86 29 135 24 -93 -98 -219 80 -73 -273 -126 -9 -198 -342 -153 -99 11 -260 -86 71 13 -108
2878 -108 -39 340 78 124 79 -4 250 195 248 7 103 -88 111 168 24 98 -113 -52 -113 -15 -70 33 -137 29
2902 29 -230 -54 67 -288 -151 153 -139 117 10 142 -107 68 97 122 -23 170 153 367 209 28 -78
2923 -78 25 -164 -16 130 -208 50 0 -65 -204 161 -118 19 -125 92 -9 15 156 142 -50 108 0 48
2945 48 125 126 243 423 205 189 92 90 -139 -119 -124 -244 13 -161 -110 -233 16 -186 -324 -333 -198 94 116 48 161
2970 161 194 92 224 26 122 115 71 171 171 12 -14 354 3 13 104 194 -49 -231 41 -170 -147 -327 32 -390
2994 -390 -131 205 -139 -73 -38 -410 11 67 75 -205 -36 5 -23 367 162 282 16 -102 -68 59 86 97 -97
3017 -97 25 46 -19 -67 -9 32 -185 -155 -55 58 -149 148 92 -103 39 -8 -126 22 -35 95 79 257 201 256
3041 256 139 -36 148 237 -45 81 41 76 -264 34 3 -247 -158 82 -179 96 70 -151 -240 0 -310 -17
3063 -17 19 -52 44 39 -68 147 145 -32 69 75 40 255 103 152 -119 -188 -12 -201 -337 77 -129 52 76 86 115
3088 115 -263 -153 79 -28 176 -1 54 25 -158 479 -26 83 118 150 11 2 178 45 -53 82 244 189 181
3111 181 -44 39 40 -127 0 -432 -95 8 -24 -128 -140 -90 -194 -55 -45 41 68 -16 -194 -271 156 -93 175 146
3135 146 23 26 -68 287 258 244 107 40 122 -133 -93 -52 -52 -168 -55 -197 -207 -203 -79 71 -1 -3 69 117 -141 -158 38
3162 38 -265 104 -14 68 -20 -61 47 30 -14 -25 33 4 -64 -81 67 157 -153 5 32 -93 -141 29 116 -371 -43
3187 -43 35 -150 -15 161 24 -104 257 -124 -16 134 -217 219 18 90 -227 44 72 -238 60 -43 -196
3208 -196 40 284 -3 170 35 20 88 -71 -115 -87 -70 11 128 208 -182 68 205 93 -44 218 -130 -188 260
3231 260 297 231 70 -62 30 -51 184 -56 -58 -126 -245 28 95 35 -249 -137 3 -312 -122 -235 -177 131 -77
3254 -77 -158 242 -191 7 -51 -260 -77 122 131 217 121 -176 218 -97 -41 50 94 -5 56 115 64 -103 -339 -98 -55
3279 -55 -104 -39 -39 -329 -182 62 -185 -299 168 48 28 156 -90 37 73 32 -37 -157 13 20 -9 265 -172 -61
3303 -61 31 -67 -290 -70 -53 -174 -143 -382 -5 53 68 -138 2 74 90 48 -68 -40 -77 150 197 -107 -3 -101 -137
3328 -137 137 31 230 11 81 69 -60 0 -125 24 -274 -165 51 -207 -3 -133 10 -121 289 -174 -18
3349 -18 -54 277 -111 94 13 80 115 -5 -143 308 47 -26 -42 88 302 130 -197 17 -78 87 -97 -164 -300
3372 -300 -381 105 28 -89 -49 33 -177 -116 -95 2 -35 51 56 5 -4 -123 119 97 103 -82 176 43 -239 64 148 9
3398 9 223 0 -209 -211 51 135 -82 6 25 -207 -33 -69 -160 -66 43 208 22 -103 71 -181 17 78 -93 21
3422 21 259 -12 -144 35 -206 -86 227 6 80 -148 -202 207 -11 -216 -129 158 -53 56 -55 -26 -14 -205
3444 -205 -79 -79 142 -34 -23 118 131 78 -140 -63 -173 227 -20 141 19 69 -97 -74 -138 -20 -14 -53 -238 -69
3468 -69 159 -157 62 52 -261 178 78 -80 -28 215 -21 25 146 67 -14 -41 13 -394 -167 102 107 -1 -13 105
3492 105 -1 -246 -294 234 -300 -196 -257 -69 -7 -291 -79 -156 9 209 43 -44 287 -95 68 8 154 48
3514 48 315 262 29 -143 25 -115 62 -102 -157 -85 35 180 54 -161 -174 2 -2 184 27 -175 -234 66 152
3537 152 -223 -168 -203 -32 -85 215 -245 -10 344 133 30 80 227 -67 11 3 91 37 38 159 53 37 -39 -96 -1
3562 -1 65 63 -140 91 -184 -275 102 -117 64 327 165 -29 -91 -67 253 98 -38 -104 165 -86 146 129 -153
3585 -153 126 -30 -35 -113 -67 -213 -8 33 -15 -274 -71 -129 174 -185 -17 -110 78 -1 56 85 -286 8 -135 59
3609 59 -248 30 268 -13 -21 -27 141 75 46 -45 -109 -152 -312 -94 -91 -121 106 38 -206 -71 27 -149 -199 -168 -35 -26
3635 -26 51 -292 87 -192 -131 100 -88 38 192 246 29 234 -29 -36 18 24 172 165 51 -209 151 98 85 30 66
3660 66 -87 -99 -215 72 -2 78 266 -6 175 -170 -6 50 6 131 177 14 164 54 -17 101 -276 118 119
3683 119 -283 205 0 15 -50 -16 220 -42 160 152 212 182 111 -292 392 103 -251 76 143 -184 -70 123 -26
3706 -26 -219 -236 96 94 102 55 -139 147 -28 -49 -128 -128 -41 -44 -109 111 136 -149 133 33 -17 55 38 -266 49 130 -94
3733 -94 86 38 -26 -82 148 -187 21 159 68 194 92 -19 98 262 -55 174 63 -92 21 -273 159 -95
3755 -95 42 47 -55 81 -96 115 21 331 -4 -154 17 143 140 106 -16 36 351 35 112 -85 64 179 -19
3778 -19 -101 -99 -74 66 145 -165 129 -78 -17 -40 -69 -167 116 -126 -47 43 -173 88 27 -212 -118 -60 175 -108 -38
3803 -38 -17 9 145 -2 120 20 -88 -56 -124 45 -166 89 105 -55 70 -128 122 -293 -231 -63 -54 -44 -261
3826 -261 26 133 -124 141 -30 46 49 28 -237 37 11 62 -290 150 33 13 218 111 17 -51 -173 -58 -4
3849 -4 -119 62 -87 -51 84 57 130 -136 -63 -114 -36 -11 -285 182 223 67 -83 139 206 -5 -43 178 3 96
3873 96 15 -301 53 324 9 -112 -209 226 -11 -182 -46 78 87 100 -43 -164 -67 -130 49 99 241 -106 63
3896 63 101 181 139 42 -167 49 -85 -124 -39 55 -167 -121 -79 -103 -95 -305 32 -52 -22 -68 159 -281 -11 -123 -120 174
3922 174 119 -64 347 -200 100 67 -91 148 25 -33 9 52 61 -67 160 131 38 137 -65 22 21 64 -7 -102 -1
3947 -1 115 20 128 -95 126 8 49 -90 114 239 101 218 126 101 -82 274 354 190 33 -74 179 66
3969 66 139 -44 190 50 -7 0 -85 51 -169 8 -88 -255 25 -186 -71 -234 85 -18 -223 -179 66 -118 -267
3992 -267 -91 -32 27 -43 41 325 -9 91 0 -108 126 126 -390 142 -5 11 400 -123 59 -84 -250 -114 -24
4015 -24 11 -68 32 85 -97 -4 146 -170 -171 6 -4 -132 -315 166 101 -86 -169 165 -44 9 -126 -213 -161 87
4039 87 156 -91 -210 63 -59 21 84 56 61 21 -163 367 -289 90 183 -33 257 108 239 -96 180 144 -9
4062 -9 61 -16 248 235 70 107 -69 50 -108 -139 -181 -143 -70 -45 -138 -419 127 80 48 39 -220 133 -2 -95 -101 207
4088 207 175 167 159 53 -7 34 77 168 120 -27 -63 114 -326 50 -90 -314 -26 39 -159 -16 -110 -189 -356 72 -8
4113 -8 286 -211 -26 -327 90 103 288 -171 -24 424 420 -2 84 141 -194 20 245 -25 103 -205 -61 67
4135 67 -53 34 -60 -186 -89 191 59 -73 42 -76 -38 6 -10 29 -71 159 -15 -49 -266 172 88 161 234 181
4159 181 117 109 -199 -82 -79 -53 -137 -156 -64 -7 -71 -269 -27 -243 -24 -93 73 106 -93 -3 -43 106 55 -174 -45
4184 -45 150 -139 78 -93 49 -128 39 134 45 28 71 231 -103 157 -69 -81 36 -10 -248 245 -26 262
4206 262 -23 -126 -92 204 176 -84 200 -110 41 -158 160 -57 -105 144 -53 72 -114 208 -132 -233 59
4227 59 -98 -259 -32 51 160 -112 119 -81 -82 -139 -218 130 65 206 295 -52 163 349 67 26 107 44 108 84
4251 84 -29 -107 1 -34 -220 87 -15 -89 -48 26 161 125 60 -11 -307 -13 219 -140 -24 273 18 -34 -175
4274 -175 143 -109 158 103 -56 29 -86 -222 214 -88 -183 -19 -39 -60 -68 34 -45 -124 71 149 -18 116 -217
4297 -217 -155 24 16 -43 290 -251 49 170 80 9 6 -230 132 3 157 1 -53 -61 -94 28 -172 -127 -58 86 -307
4322 -307 145 -88 -155 -12 123 -212 13 -31 -55 109 -11 -73 -67 -46 -196 -245 5 -225 18 27 131 300 100
4345 100 61 19 121 191 3 70 -57 43 -63 -229 -112 -134 3 -17 -89 -16 96 -194 -43 76 84 -26 13 82
4369 82 -173 319 90 23 162 171 -107 42 149 -29 -66 108 -48 -82 37 -103 75 167 53 -104 -180 -196 18
4392 18 117 -231 -97 -98 -1 103 -38 -71 38 -311 199 75 9 -6 -82 74 -17 57 -158 276 2 19 98 -108
4416 -108 -261 -56 -317 -134 -159 158 -211 -101 1 -260 -289 -55 -19 101 -19 8 39 -110 -185 4 -25 7 -37
4439 -37 -137 143 25 -108 122 -4 293 -84 -80 76 187 121 -139 110 -296 -30 -10 207 -41 -33 -94 -34 -1
4462 -1 -122 7 149 -73 44 -73 38 -6 -182 113 157 -94 265 -79 -224 25 -51 -94 20 65 147 86 -96
4485 -96 122 -153 -215 5 -101 -233 64 -316 -122 -7 -82 67 89 7 -41 -78 269 66 167 242 43 167 -200
4508 -200 -1 -32 -5 -240 -134 -158 48 -295 -17 -115 -186 -76 -11 78 -115 228 -43 145 69 52 100 26 15 -98
4532 -98 -106 -23 2 111 33 105 -1 33 169 245 -219 265 86 48 11 -24 93 -91 -55 91 51 -96 24 -97 89
4557 89 -64 -112 -25 -97 187 -110 -160 121 106 117 71 175 -4 -68 -306 -24 27 -86 -1 -229 66 13 134 -78
4581 -78 -183 -12 66 117 336 65 -62 98 -97 233 -40 161 187 -192 -26 -107 -40 135 -40 -105 -167 65 32
4604 32 106 -105 -114 -14 194 -97 -84 77 49 -45 45 -35 -109 -142 -42 53 50 -59 113 -27 14 3 -45 158 219 124
4630 124 136 -183 122 -49 162 -56 125 68 27 -77 -208 -41 -359 -60 -6 -127 -57 326 -8 171 210 -93
4652 -93 128 51 -257 -1 289 51 39 42 63 -62 -92 71 200 -89 -13 -246 -215 -87 -21 78 -274 69 -171 -288
4676 -288 -166 256 -65 -98 217 59 74 -21 8 49 175 -41 -2 221 70 236 -54 -12 79 60 79 -81 -257
4699 -257 -9 79 -259 -37 -122 -47 60 -140 -152 164 -227 21 -191 106 -267 -272 139 74 -158 -124 88 -129 -29
4722 -29 -132 246 45 28 118 -131 -22 297 83 -138 226 -147 36 132 -177 158 179 -117 156 393 -63 88
4744 88 -132 -154 77 -145 -20 57 16 15 133 87 -63 77 -19 85 151 -325 -57 31 -220 -64 -6 -1 -369 -96
4768 -96 -26 33 -151 260 -180 91 -29 -47 102 -77 93 -45 31 313 272 -35 160 -25 117 103 9 93 190
4791 190 -145 -168 244 -129 40 230 94 -276 -162 -139 151 27 149 -85 71 25 -285 -126 133 38 -231
4812 -231 -170 76 -13 -152 -100 62 -97 -113 243 52 102 -87 303 -49 -88 209 74 -19 -1 -42 -297 186 -14
4835 -14 121 -36 53 -191 90 62 -41 14 -147 103 83 -64 114 11 143 -26 74 86 -109 41 157 115
4857 115 -125 -156 52 -105 -158 -244 -18 -64 129 -92 55 -129 91 173 -113 103 197 -69 36 73 -150 -13
4879 -13 131 24 138 -157 20 -112 47 -47 71 75 -160 -167 9 112 46 10 -56 34 -194 -64 140 -238 92
4902 92 154 -88 -14 136 18 -217 142 -298 178 89 76 -127 40 -34 -155 -168 256 26 36 38 -4 67 -194 157
4926 157 66 -275 8 -30 -115 317 -49 73 111 -111 -170 185 235 0 46 1 76 203 -103 4 109 113 1 -218
4950 -218 -129 -7 -192 112 -234 -36 -49 -36 195 -137 -197 -72 -125 28 -144 -161 -80 83 36 -69 -162 100 54
4973 54 138 169 6 -77 -123 -24 -239 77 -110 41 148 -153 156 -50 -2 193 -229 -136 -88 -308 -69 -89 148
4996 148 32 221 117 97 -76 158 226 -134 49 171 -218 -148 218 133 -44 -21 379 85 54 -261 162 -115
5018 -115 -60 170 -112 -101 -180 16 170 -30 -111 112 -24 -228 -94 -39 25 32 -31 -31 85 14 -52 -140 -203 65 -232
5043 -232 52 65 -144 146 55 -27 63 -100 -64 -54 -2 -25 6 123 -260 -196 -139 86 123 -98 228 255 6 -184
5067 -184 22 194 103 11 -164 -63 105 -324 -133 126 42 47 155 -40 -237 111 65 21 165 -79 -130 82 -2
5090 -2 18 139 -95 -118 -105 -130 -63 -101 10 -154 -127 -234 164 154 -62 259 -90 -205 -136 -69 -169 -394 -30 -120
5114 -120 83 -279 65 96 -87 -65 -105 69 13 64 -53 -102 48 -62 23 26 -195 -64 29 -77 -35 -17 83 190
5138 190 91 -25 164 39 -5 -85 135 -29 -110 147 45 -200 -155 -77 -25 31 -284 -134 -106 -76 137 59 -57 -84
5162 -84 -54 194 311 233 -22 -175 -392 -48 -11 110 -78 124 113 -115 -323 -124 49 -14 240 -253 151 -4
5184 -4 105 54 -262 41 40 -146 122 -103 -63 -111 161 -139 -183 -160 11 92 -69 -45 -220 53 56 -1 3 -315 -221 116
5210 116 -174 -199 -241 -292 43 -42 -53 161 277 -200 1 4 105 141 -178 -133 198 143 26 129 -45 46 -191 -202
5234 -202 -3 -190 -230 -167 -63 -133 0 -61 377 -210 -101 207 -72 -108 -25 133 -144 -77 265 -17 16 -57 12
5257 12 0 57 -41 131 -279 -23 84 105 125 -93 79 -52 -158 -62 60 -37 -69 -197 173 66 -129 -210 200
5280 200 -70 -13 91 137 74 80 132 -155 -84 48 -22 112 76 -107 -47 121 69 -28 184 -166 -37 101 44 99 -50
5305 -50 149 54 72 16 220 -67 88 6 217 -129 215 -40 -1 87 -129 108 -58 8 413 372 -47 178 -45
5328 -45 -144 38 329 -118 290 146 -69 -6 -115 67 -57 218 338 255 -55 -4 106 -50 -27 -74 -90 145 -288
5351 -288 7 -244 356 594 -140 69 224 -46 226 129 -25 129 -133 -33 -109 -186 -320 30 -225 -56 83
5372 83 -233 78 133 -2 52 137 73 -151 4 123 -224 124 -287 248 171 201 191 52 15 -158 192 118 -382
5395 -382 -42 171 -108 167 153 -127 -169 192 76 142 -138 -91 55 -312 -2 128 115 119 -117 -53 20 -226 67
5418 67 271 -140 103 142 -156 -132 -70 -32 -101 -7 18 243 -64 -112 180 -85 89 159 53 -20 176 274 -15 -36
5442 -36 -205 -132 -24 110 -110 -130 195 -20 248 -289 -106 -112 -37 -215 238 81 -38 -99 -207 -90 -94 -83 -12 154
5466 154 -123 174 133 103 174 -49 -171 47 293 81 -41 74 -175 182 -65 -6 132 51 140 363 -86 136
5488 136 215 -150 -40 4 -163 -18 159 -57 -169 -185 206 193 61 35 75 -36 163 161 217 237 -1 69 160 3
5512 3 -43 183 221 -87 -99 92 25 -29 10 181 -32 50 -130 125 -267 -111 -133 267 -63 -52 51 -40 439 74
5536 74 -30 217 -30 103 68 130 -44 -1 78 -3 264 72 97 100 -114 -31 -11 -31 221 -148 -91 -124 3 3 -4 204
5562 204 -1 47 -101 143 46 123 -22 -349 -247 -169 -5 -9 -22 140 5 4 -34 205 -329 -123 31 -66 288 24
5586 24 -225 217 11 -97 25 193 14 -106 139 163 9 14 96 1 49 -16 56 -51 98 155 49 -149 114
5609 114 158 171 193 134 -206 -78 -99 -46 -63 9 -68 204 106 69 -7 72 57 246 -18 -103 -129 -158 -21 251 38 -139
5635 -139 -1 47 150 -192 -109 -25 -232 55 174 -87 147 25 -19 203 -192 -103 -59 -8 -9 57 -155 42 -45 -167
5659 -167 126 -123 56 -59 -42 71 73 -262 -119 193 -4 36 19 -327 -204 -165 36 -216 -63 51 -73 -28
5681 -28 99 191 103 -164 5 -184 -112 6 47 27 258 44 144 -160 52 -23 155 -50 154 46 79 212 151
5704 151 -44 -37 130 -163 66 91 53 -275 -135 -47 76 110 -170 -3 -6 -68 23 -282 106 10 -18 -43 -129 123 53
5729 53 -30 -91 -71 -144 129 65 -42 -9 56 262 -39 180 -142 -84 110 -101 -168 152 -20 42 28 -258 -17 -77
5753 -77 190 82 85 -69 -208 -174 25 125 -142 49 109 -64 101 -143 40 47 -46 359 -5 41 -107 75 -328
5776 -328 149 -311 -155 -69 9 -72 253 -19 -47 77 -30 198 -137 45 104 -87 25 -7 228 -67 45 145
5798 145 -103 -13 -35 -13 82 -176 -37 22 -103 190 10 308 -47 -111 -166 -215 20 284 190 5 -107 32 94
5821 94 90 25 44 35 -80 -8 100 143 -90 -78 72 -20 52 -24 -338 56 215 176 -101 10 28 -27 -97 -53 -10 136
5847 136 21 -191 -94 -194 -186 -47 -393 71 137 -29 -69 -84 -409 148 128 -198 118 -112 359 44 150 -94
5869 -94 -199 135 -95 -48 -109 75 -3 -249 -131 -59 -112 27 77 -25 -118 32 141 58 57 115 -44 -174 -51 -88
5893 -88 95 -125 66 -81 -149 24 -9 188 38 -42 -121 112 -51 155 93 -155 102 -229 -79 35 -133 -177
5915 -177 95 184 51 19 46 231 -138 -21 42 83 -16 9 134 36 -85 -33 -30 346 104 -34 93 106 -13 177
5939 177 -37 -1 148 -31 -311 246 -113 240 -81 183 24 243 0 -184 -325 -109 240 -26 -155 -126 133
5960 133 110 -305 238 49 91 42 -174 -96 147 130 233 129 -24 -103 28 162 -230 51 -112 -29 181 285
5982 285 -167 128 103 78 131 210 102 -71 -230 113 -109 53 150 164 -89 151 92 170 -21 9 92 75 101 81
6006 81 73 -33 -57 49 -205 -34 -53 -33 62 81 182 -14 40 47 183 -108 -58 -261 -181 60 -44 86 -15 21 45
6031 45 20 -73 -179 172 -206 87 -61 -282 -111 142 205 -146 44 122 54 -146 223 -89 111 44 -163 -241 138
6054 138 -304 74 -114 19 5 80 60 145 97 -144 -146 -80 -12 -55 140 -61 125 -87 96 76 -24 61 37 192
6078 192 -42 224 31 14 249 -133 30 94 -46 -64 85 32 161 146 -27 157 197 -32 101 127 -6 -16 145
6101 145 -59 -52 -120 1 306 127 -34 -218 66 50 -165 -9 98 51 -79 -127 -39 49 -127 -214 131 -6 -160
6124 -160 50 -71 257 -131 -164 -87 287 -1 159 -60 9 4 -32 -32 165 -392 -188 4 252 149 57 155 -113
6147 -113 42 -83 94 172 229 123 -84 -153 -186 94 -72 92 360 39 33 37 92 -62 -421 -14 168 117 462
6170 462 -38 63 -53 248 217 -196 20 -155 -39 -201 -36 96 114 -60 -190 -42 3 -177 -172 -206 115 174
6192 174 69 40 -93 126 212 193 45 5 -52 313 159 14 -139 45 148 40 20 -78 245 -300 78 -94
6214 -94 150 378 -98 17 -37 150 -119 -77 179 150 56 251 -92 -205 -59 -6 3 164 26 123 226 44 -71
6237 -71 4 64 121 -88 2 82 139 48 66 -117 -117 47 -113 97 -92 -58 -140 -73 -201 89 -39 -99 192 -70 -33
6262 -33 -156 -56 -70 -232 176 -72 -48 120 89 -58 -273 -2 13 0 -52 146 -12 196 14 -20 26 253 -96
6285 -96 -69 271 199 84 -72 40 -55 74 55 -141 175 204 -71 -38 200 82 73 364 263 70 126 -43 34 196
6309 196 -8 -18 -69 38 -311 77 -58 148 14 134 -123 -51 -204 145 29 -21 -58 -48 -186 103 -84 147
6331 147 54 -68 -130 91 238 30 246 196 170 -44 13 136 -59 -110 -44 -232 -82 -224 20 -105 143 -44
6353 -44 281 -19 70 98 113 124 36 -72 103 -59 -48 229 -116 105 -276 25 -41 -43 98 -191 -159 82 149 104
6377 104 -28 -278 260 -29 -257 -80 -44 -47 35 12 119 473 -111 38 127 -173 10 -42 32 89 -30 164 64
6400 64 -113 -28 82 -65 5 230 -88 189 -26 318 -39 89 38 -73 92 134 58 -253 -161 -31 -38 -233 132
6423 132 152 -155 -28 -74 -63 -97 145 153 -1 151 67 86 9 165 -225 54 46 -103 -16 -19 93 274 10 79 -1
6448 -1 -108 293 81 21 -17 180 82 36 -141 -6 172 -13 -30 54 -230 -4 -67 103 -17 -119 226 6 -61
6471 -61 -86 83 25 88 91 -195 -39 -140 21 -186 -166 -271 18 -87 52 73 42 21 101 -178 -44 -68 128 171
6495 171 152 129 -70 167 22 -196 -158 -16 -168 -279 -105 170 -15 131 -126 -157 239 303 -369 -164 104 34
6517 34 280 -143 7 -158 -341 -20 97 83 -17 -15 -28 -133 110 163 242 -128 12 -195 -101 -85 -47 84 -105
6540 -105 -242 46 -169 123 77 57 122 193 -73 36 32 -48 94 44 82 127 281 -166 -294 56 39 -14 -97 -60 -201
6565 -201 -85 82 343 -166 -239 -20 90 -20 91 136 -104 201 -49 140 -123 -114 -80 113 9 79 39 306
6587 306 35 69 26 -234 246 -157 -44 126 15 -96 -209 -11 -150 135 230 -9 -125 -213 -270 52 -82 134
6609 134 12 64 -55 9 -119 -141 194 -69 22 185 -102 230 133 82 71 -195 67 -72 112 30 -16 24 9 125
6633 125 35 354 57 -49 -272 -225 30 -260 84 -15 56 -75 211 175 83 -61 154 -16 43 -91 -220 151
6655 151 8 58 -138 142 -34 -18 -378 -255 -374 -315 159 -13 38 -96 -116 -313 -153 291 -82 27 23 296
6677 296 -133 -119 -113 -76 74 -106 -49 -187 69 6 19 -122 178 -154 -131 24 -168 -118 -10 -118 -338 79 93
6700 93 -164 -298 24 146 -65 76 -132 184 73 -243 231 174 299 6 -23 147 276 -61 -43 -56 151 -115
6722 -115 -66 200 14 13 80 49 -100 193 76 251 -41 97 -89 -328 -232 -170 39 -88 -67 -14 -65 -177 328
6745 328 158 123 283 -274 269 189 -124 174 -107 -135 -252 83 -40 -76 -7 179 -1 164 -198 -12 -1 187
6767 187 -43 -19 -107 94 -34 -78 270 -67 -115 -199 -41 87 -46 209 -268 -95 -89 98 103 -79 -4 -73 49 119
6791 119 -31 -59 -173 -91 262 4 107 253 135 269 71 125 28 -161 66 260 76 115 -162 228 189 -275
6813 -275 -308 -188 12 -37 132 -237 62 -169 -201 -175 -110 0 55 187 -54 -64 339 -19 -41 41 184 -46 332
6836 332 -145 -206 102 -187 -64 -113 -110 -162 143 -24 -163 81 -88 -182 4 -114 -37 -75 36 31 184 -46 -55 -133
6860 -133 11 264 -4 53 162 92 -48 36 -2 176 158 -38 -175 -128 -65 -100 -131 -71 -152 173 100 316 -92 -50
6884 -50 -54 40 -50 -57 59 -31 180 -70 -15 44 -64 147 -51 -128 -24 28 154 -14 -13 -64 40 270 132 -211 -84
6909 -84 -5 -105 65 -228 -150 78 -198 -91 -54 193 92 18 -14 207 151 -164 153 169 -74 -33 -96 172 -257
6932 -257 60 35 -77 46 -105 -53 -167 -347 -308 -177 80 63 -53 -134 -11 -4 33 44 5 -39 171 113 -229 -32
6956 -32 5 200 -233 371 44 -38 -135 151 -54 30 -182 -83 46 165 -94 138 -97 -258 44 -184 -129 -6
6978 -6 41 -67 -190 99 -55 149 -17 -65 -227 115 277 -47 -80 -205 -298 220 -100 -133 123 235 93 95 133
7001 133 -223 -273 95 52 60 -12 -134 -14 -176 -86 19 -239 -76 208 -276 164 9 -23 -117 255 -33 -56 116
7024 116 -155 50 90 104 85 -254 -26 -40 47 157 -194 70 114 -16 97 118 82 48 5 -199 17 -18 10 -1
7048 -1 -89 69 394 -179 7 60 75 265 69 -198 -36 -198 -42 -19 12 -228 188 -28 -47 -178 -61 41 -96
7071 -96 -66 154 -26 -127 -90 -194 -68 111 -19 -6 -14 -85 -236 202 -58 -110 225 115 99 110 41 -207 -83 -202
7095 -202 39 -39 -128 -377 240 -119 177 -177 180 0 4 187 173 -18 -130 74 143 43 117 294 -36 -22 108
7118 108 -221 71 126 56 -9 -146 35 -26 -74 -40 -33 -168 -135 53 -122 131 -324 -16 -20 202 -114 94 -19 80
7142 80 -187 148 -16 -164 -132 -150 135 -19 -99 96 132 12 -146 -74 212 -5 -71 -113 -43 249 3 47 175
7165 175 74 -143 -111 255 -138 -13 -74 111 -97 132 145 59 -65 -167 -96 74 -3 122 -62 -147 -46 108
7187 108 -30 209 -45 -96 -134 -39 -129 -126 10 -276 -76 -19 -141 -127 340 28 118 -87 -117 139 -86 -74 17 121
7211 121 -149 40 -238 109 13 127 27 -288 146 44 151 37 -17 -70 33 84 -29 -64 176 -20 72 2
7233 2 89 -50 -16 -95 147 -23 2 197 -86 -76 68 -70 -122 -87 229 213 133 -166 -190 -340 7 -171 -112 200
7257 200 -274 -73 -95 293 -34 -71 20 143 -179 -92 209 -58 41 -140 -17 50 -103 15 92 -20 -127 -144 -109
7280 -109 -14 146 210 99 -44 59 -109 46 -132 -23 -10 -102 150 296 -206 21 25 73 -147 -142 -165 -52 35 24
7304 24 -24 163 -42 43 54 5 132 64 -113 144 2 -30 -154 -121 91 -87 45 131 -104 -49 237 -83 -97 90
7328 90 107 -42 102 -40 -157 -149 138 109 -168 -4 65 174 -64 -242 -49 -154 -20 -219 -8 -25 -209 -109
7350 -109 -88 -92 -20 245 -177 -6 54 162 79 -61 21 -124 159 36 -204 -48 224 -91 127 15 70 184 -147
7373 -147 -10 -95 223 -280 -33 112 -278 93 -212 -31 -151 120 -63 38 -48 56 202 109 179 36 5 -93
7395 -93 -89 -152 -86 -29 27 133 17 -184 -14 68 192 6 -44 11 131 -169 -45 30 -111 28 5 -104 -4 -72
7419 -72 100 -116 42 127 78 -18 -1 -110 -164 108 297 207 -115 -42 -28 -57 -294 196 -4 23 141 -192 -85 258
7443 258 17 159 11 11 -263 -133 174 -125 -124 91 -66 -141 195 -245 68 81 144 -16 189 31 -62 73 62
7466 62 94 -48 -55 14 -78 74 -151 2 -176 -60 78 77 227 -254 13 88 115 105 182 9 -28 -17 104 -95 161
7491 161 -81 -78 35 -31 156 28 85 -23 318 3 -151 -39 86 -176 10 124 -126 91 -345 71 10 5
7513 5 131 -62 -364 -15 -89 -39 27 -179 110 290 105 14 -3 -286 64 145 163 156 -198 66 16 -64 117 113 1
7538 1 -26 156 -47 190 115 -76 -126 -119 168 -83 -135 200 360 -126 144 4 225 130 185 97 85 102 109 114 164 -23
7564 -23 -6 266 59 185 171 45 -28 129 -98 -311 48 55 -17 -143 46 77 12 77 -139 -34 23 86 -103 31
7588 31 103 3 -10 -165 156 151 -79 -54 58 182 167 -142 83 -11 56 -155 -14 91 -71 -106 8 66 -116 -26
7612 -26 -10 134 -8 -120 -201 154 -26 -210 85 274 -114 -26 124 252 -219 -20 -155 -57 -81 125 111 -23
7634 -23 211 -150 -149 260 -254 -61 272 38 -101 -123 117 70 -150 41 27 101 -62 -186 -94 203 128 172 -50
7657 -50 -94 -175 220 -27 74 9 -5 112 143 -176 -306 54 4 -177 -93 81 -114 266 -72 -216 -117 -185 -36
7680 -36 228 -93 259 368 108 363 222 -171 40 -88 293 212 46 129 129 -175 92 13 -38 84 -118 -187 -205
7703 -205 101 146 -61 109 167 174 64 279 -123 -29 126 168 -33 48 114 69 -25 -259 46 330 -3 96 184 -225
7727 -225 6 -114 -150 -43 -201 111 93 398 134 -10 209 138 26 60 -52 71 94 -187 -256 160 -344 -6
7749 -6 -124 -190 -89 43 -3 -94 -237 51 -54 18 -204 -64 -214 -121 -50 -43 79 -8 96 10 52 70 -72 103 46
7774 46 -162 -78 147 356 138 88 -319 4 -376 56 32 112 -177 -99 -172 344 112 1 -31 -131 -92 -163 -71 197
7798 197 75 210 -229 -198 1 -153 -57 -213 -11 -36 -131 215 63 54 -225 -1 150 -37 -192 172 55 -284
7820 -284 86 18 -109 186 158 67 287 144 7 -158 -8 -156 -103 -43 257 164 -132 -119 -102 -220 -95 123 -15
7843 -15 16 19 26 384 -39 -67 -148 -11 -18 5 -22 -241 101 -120 -142 -201 -7 1 -184 -179 82 -247 15 -41 -60 -224 -73
7870 -73 33 -248 -47 -49 26 -103 5 -11 -138 89 -179 -19 13 17 145 7 145 -157 45 -40 -41 -148 366 160
7894 160 -138 98 -216 -85 -86 -61 -32 48 -211 -121 -13 202 -7 157 32 -50 325 -125 12 -24 -100 -236 -52
7917 -52 39 -74 57 -54 298 194 99 6 25 160 51 40 89 60 137 -2 -190 80 -177 -135 102 251 58
7940 58 -84 -83 -13 118 107 -144 -148 94 -19 -91 25 -59 3 77 45 -146 12 198 136 110 64 246 -93 -92 -64 -113
7966 -113 -34 116 133 79 -48 -52 -1 -2 -35 -106 135 -74 -85 195 71 239 33 -86 -90 -109 -250 -2 -328 86 -57
7991 -57 123 77 230 -78 -7 -199 -86 177 72 68 -106 55 -78 20 61 -74 -167 25 254 -72 311 298 -16
8014 -16 -219 -17 71 -16 -127 231 20 -31 54 -152 83 -113 -116 -135 -7 -4 75 26 -161 -32 42 103 208 106 -216
8039 -216 101 201 121 31 255 130 -333 -66 205 -185 0 -90 83 93 -119 85 246 -18 5 -23 0 -6 -62
8062 -62 220 9 -28 -158 -43 65 -70 83 -137 354 165 100 175 118 -13 17 -199 78 115 177 136 -110 66
8085 66 -24 54 146 79 90 -3 115 -34 -38 153 -47 -274 54 -93 -73 -191 -97 120 -103 -105 -70 -85 -130 -81 115 211
8111 211 145 -147 147 91 -71 27 -185 -8 113 1 68 14 -115 38 -44 41 -52 -193 -106 120 -200 16 -167
8134 -167 -70 99 248 -64 -14 32 92 23 66 -226 100 -11 197 -7 195 -68 -232 172 -210 -27 189 -87
8156 -87 -124 175 -70 -71 13 54 -8 -52 -246 -104 54 92 2 53 138 -33 -2 -194 100 -52 19 359 -51 66 237
8181 237 10 -269 71 -196 4 100 258 109 23 -80
8191h0
$$ Imaginary data points
##PAGE= N=2
##DATA TABLE= (X++(I..I)), XYDATA
0 0 0 0 0 0 0 0 0 0 0 0 0 0 0 0 8 -8 8 -8 8 -12 16 -16 22 -24 27 -32 40 -43 49 -57 65 -75 84 -96 107 -121
36 -121 135 -152 169 -188 210 -233 257 -284 314 -347 383 -424 464 -510 565 -623 685 -756 836
55 836 -929 1034 -1155 1297 -1465 1670 -1926 2254 -2692 3309 -4239 5796 -8876 17246 -86195
70 -86195 -243708 -3283 61363 -56778 -19643 56063 -32007 -45417 10970 -13215 14852 116577
82 116577 55834 -39564 11792 22417 -48024 17744 78682 -22315 -59567 8197 -45503 -90207
94 -90207 22393 54958 -38618 -17443 26931 -49842 -40479 73829 49778 -20553 28243 26036
106 26036 -55371 -15993 52181 4971 -8456 31103 -24089 -60837 15952 28878 -19607 27419
118 27419 47043 -42938 -42116 41384 15660 -23888 29660 22051 -46505 -25360 6846 -27427 -5677
131 -5677 39795 -14538 -50440 8946 15873 -23654 14697 44502 -2536 -7635 21652 -6654 -10512
144 -10512 40982 25436 -24711 -1145 13498 -27169 -13617 27551 -859 -22706 6114 -6147
156 -6147 -31731 5000 23341 -11060 -6418 13841 -15796 -22006 17094 10820 -13221 8184 10138
169 10138 -21231 -6139 21802 1319 -4084 21425 7829 -14588 6300 14220 -4711 6943
181 6943 16765 -10923 -14907 9413 -1491 -17657 2460 6243 -16538 -11358 1369 -10891 -6007
194 -6007 11618 -1367 -12436 6167 7441 -8043 3771 15774 693 -1934 10012 1338 -4145
207 -4145 11526 9634 -5720 1308 6491 -5662 -3458 7470 -1571 -7821 2135 -1271 -11626 -3382
221 -3382 2075 -7300 -4859 2313 -6412 -8833 2995 2328 -4681 2121 5851 -886 1991 8175 2365
236 2365 1981 9588 5875 -1315 3744 5588 -1035 932 3486 -3079 -4008 1047 -3104 -7612 -1758 -761
252 -761 -6764 -5313 -1583 -4181 -3583 310 -1478 -2856 1764 1991 -752 2082 4385 1955 3121 5596
268 5596 2971 1699 5053 4688 1199 1748 2454 -128 -325 477 -2312 -3679 -1403 -2431 -4957 -4260 -3557
285 -3557 -3937 -3153 -2337 -4115 -2567 847 74 -1002 1236 3084 2236 2362 3323 3335 3686 4078 3036 1958
303 1958 3214 2849 693 472 201 -595 -1044 -1320 -2984 -3513 -2412 -3130 -4389 -3780 -2745 -3416 -2979 -1539
321 -1539 -1317 -1040 98 717 1573 2267 2081 2185 3791 4222 2583 2183 3539 3444 1779 1431 903 381 213
340 213 -523 -2464 -2671 -1596 -2660 -4070 -3786 -3024 -2993 -3012 -2729 -2886 -1211 224 -508 -662 1841 2823 1512
359 1512 1957 3321 3079 3217 3882 2817 1841 3180 2824 827 507 730 -637 -1550 -1066 -2567 -3093 -2529
377 -2529 -2697 -4103 -2825 -1883 -3677 -3188 -542 -847 -1845 116 1349 659 1752 2201 1743 3037 4283
394 4283 2689 1569 3431 3229 1059 1352 2012 -296 -560 326 -2026 -2894 -937 -1787 -4184 -3213 -1600
411 -1600 -3001 -3353 -1640 -2202 -1799 222 -469 -1353 1511 3227 800 1540 3757 2558 1792 3662 3059
428 3059 1335 2260 2966 32 -166 1158 -559 -1858 -499 -1617 -3689 -2316 -1724 -3551 -2518 -1398
444 -1398 -3625 -3528 98 -452 -2145 345 1831 95 1076 3278 1582 1685 4188 2528 944 3216
460 3216 3048 292 1462 2365 -177 -968 265 -1826 -3049 -195 -942 -4224 -2941 -1188 -3350 -3146
476 -3146 -432 -1533 -2184 -99 -537 -1230 932 3051 1139 1564 3257 1817 1367 3899 3543 1099 2276
493 2276 2606 -344 -114 1899 -506 -1828 -250 -1060 -3539 -2326 -1927 -3605 -2458 -923 -2931 -3060
509 -3060 -164 -1223 -1755 1257 1894 -596 88 2505 1720 2075 3966 2418 762 2408 2366 599 2216
526 2216 2742 -208 -1044 -233 -1275 -2080 -361 -869 -3507 -2515 -1456 -3170 -2657 -525 -1046 -2145 -311
543 -311 -9 -993 601 1858 1022 1947 3057 1521 1018 2992 2761 1612 2484 2227 -363 -385 1050 -80
561 -80 -1058 38 -1198 -3323 -2519 -1355 -2408 -1737 -1005 -2932 -2857 -904 -887 -775 966 1278 -547 371
579 371 2732 1946 1818 3266 2198 1255 2559 2216 602 1304 1904 398 -420 -10 -847 -2087 -945 -849
597 -849 -2263 -1715 -1897 -3429 -2646 -393 -1253 -1693 -433 -287 -1153 391 1976 1352 1265 2063 1581 1110 2749
616 2749 2580 1742 1852 1662 76 310 1281 -106 -1000 -392 -1035 -3129 -1757 -932 -2151 -2217 -1359 -1973 -2039
635 -2039 -899 -1084 -1343 542 958 85 633 1858 1146 1302 2728 2386 1306 2155 1993 929 1207 1629
653 1629 467 -377 -221 -673 -1349 -1097 -1010 -2353 -2175 -1927 -2632 -1922 -901 -1299 -1730 -811 -257 -345 532 1527
673 1527 888 791 2017 2116 1413 2194 2126 1277 1601 1528 563 8 300 -220 -655 -205 -957 -1923 -1789 -1592 -2014
694 -2014 -1832 -1382 -1972 -1919 -871 -354 -729 57 573 305 558 1553 1351 1655 2073 1653 1406 1505 1775 1175
714 1175 1139 1338 320 -353 -269 -193 -1222 -1153 -1088 -1709 -1665 -1704 -1882 -1887 -1360 -1418 -656 -425 -91 -751 486 1319
736 1319 867 1080 1796 1640 1482 1838 1886 1486 1479 1227 727 377 160 -97 -682 -796 -961 -1667 -1551 -1561 -1846
757 -1846 -1568 -1487 -1885 -1412 -894 -556 -597 -277 269 449 862 1158 1326 1654 1451 1630 1872 1788 1556 679 887
778 887 1056 482 65 -103 -523 -1052 -900 -1004 -1475 -1837 -1524 -1525 -1628 -1656 -1422 -876 -734 -299 -64 506 331
799 331 552 1003 1477 1478 1526 1693 1412 1287 1415 1173 768 633 415 -208 -619 -410 -824 -946 -1390 -1655 -1943
820 -1943 -1424 -1508 -1859 -1249 -998 -928 -731 -259 117 550 487 799 1277 1592 1569 1217 1498 1686 1284 1015 1059 767
842 767 288 314 29 -854 -737 -607 -1250 -1857 -1416 -1456 -1633 -1505 -1502 -1254 -908 -588 -562 -110 301 569 340 1118
864 1118 1339 1093 1456 1823 1532 1266 1257 1280 480 774 635 69 -688 -708 -654 -818 -1337 -1369 -1370 -1292 -1060 -1420 -1156
887 -1156 -917 -547 -512 -395 144 335 503 962 1168 1196 1223 1440 1183 1292 1378 960 703 764 636 77 -198 -559
909 -559 -831 -779 -1041 -1273 -1486 -716 -1473 -1259 -1132 -972 -982 -494 -409 -209 3 422 773 883 1445 1503 1000 1346
931 1346 1582 1101 1054 1194 860 370 600 85 -593 -527 -448 -738 -1283 -1135 -1235 -1478 -1376 -1305 -998 -726 -618
952 -618 -736 -397 309 103 255 967 987 796 1371 1427 1140 850 1588 1001 574 688 617 46 122 39 -770 -1061
974 -1061 -988 -1427 -1139 -850 -1242 -1345 -1206 -541 -1180 -841 61 -112 -231 297 629 608 1080 1383 1051 770 1355
995 1355 764 946 1238 946 266 451 644 -376 -380 -26 -782 -1185 -635 -1284 -1815 -1111 -788 -1203 -917 -413
1015 -413 -701 -984 257 336 399 956 866 518 1003 1731 872 1033 1708 988 91 1111 789 -92 206 256 -682
1036 -682 -945 -421 -1113 -1422 -795 -908 -1599 -883 -821 -965 -709 124 -270 -518 279 404 -200 827 1478 900
1056 900 953 1633 748 713 1513 1227 404 565 424 -646 -241 71 -727 -1070 -735 -1134 -1596 -936 -514 -947
1076 -947 -1086 -596 -609 -708 32 503 357 541 732 303 819 1203 1097 1101 1532 964 452 752 556 -235 -246 531
1098 531 -384 -900 -733 -1012 -1466 -647 -635 -1250 -1171 -1140 -1253 -454 330 -324 -339 259 249 256 1294 1107 789 436
1120 436 1023 915 689 1340 867 445 165 97 -382 -354 -408 -561 -790 -729 -954 -1368 -936 -586 -1156 -736 -160
1141 -160 -745 -616 69 256 356 832 969 596 786 1017 962 1057 1278 690 712 593 527 463 327 220 -676 -864
1163 -864 -352 -825 -817 -898 -794 -1247 -1003 -722 -898 -587 -257 -445 -93 42 132 401 743 897 548 820 945
1184 945 712 731 977 1023 548 414 259 -197 -337 -370 -320 -267 -687 -1211 -1173 -637 -611 -994 -595 -875 -480 -669
1206 -669 -146 292 240 415 635 517 790 909 1079 1161 1106 702 681 600 344 480 233 -9 -375 -355 -401 -637
1228 -637 -838 -881 -848 -877 -864 -946 -835 -436 -96 -163 63 203 117 377 754 622 587 820 1097 631 1074 1006 855
1251 855 501 309 409 58 -39 -265 -656 -553 -811 -920 -681 -826 -845 -743 -673 -912 -574 -195 -105 -125 371 369
1273 369 611 518 445 849 1004 886 982 759 859 671 315 132 167 -58 -403 -179 -588 -431 -614 -609 -882 -687
1295 -687 -655 -837 -744 -709 -434 -294 21 -110 537 280 358 474 899 1004 754 640 700 605 672 627 377 101 74
1318 74 -97 -238 -296 -652 -469 -669 -842 -953 -950 -844 -712 -615 -701 -260 -88 -57 245 235 426 328 624 553 577 811
1342 811 463 861 821 497 564 563 101 82 -13 -332 -544 -483 -443 -535 -783 -699 -979 -335 -528 -577 -209 -186 -212 -15
1366 -15 272 546 533 657 616 758 659 647 1001 603 681 461 564 251 -110 -216 -135 -331 -841 -763 -707 -670 -781
1389 -781 -568 -628 -835 -338 -429 -329 -286 -57 107 91 250 460 528 577 780 628 842 255 604 444 555 -69
1411 -69 48 73 54 -356 -321 -331 -382 -804 -666 -484 -683 -788 -593 -592 -357 -93 -267 -3 432 328 160 390 686
1434 686 471 641 914 820 551 595 610 570 460 100 165 -555 -456 -371 -524 -626 -665 -532 -699 -928 -400 -660 -628
1457 -628 -172 146 24 -52 328 490 563 703 512 503 699 712 645 554 604 628 288 206 196 -138 -99 -268 -246 -521
1481 -521 -737 -825 -731 -499 -763 -659 -628 -202 -249 179 232 138 -125 366 343 367 556 776 577 538 509 570 593 515
1505 515 265 238 137 -248 -857 -272 -501 -848 -497 -635 -870 -670 -388 -554 -665 -296 95 -324 -303 92 284
1526 284 395 450 349 472 538 469 511 682 703 381 80 278 171 -42 -40 -33 -222 -215 -681 -812 -642 -509 -683 -649
1550 -649 -539 -636 -352 -312 250 384 93 178 301 94 538 830 715 493 555 321 238 371 408 65 37 -177
1572 -177 -351 -703 -209 -380 -547 -688 -591 -627 -589 -370 -565 -163 -19 77 -60 6 180 323 564 664 445 426
1594 426 793 818 768 610 673 248 57 8 -72 34 -84 -268 -435 -430 -459 -829 -367 -223 -321 -573 -329 -103 -185
1617 -185 -149 94 24 48 348 372 799 548 584 739 748 498 534 455 295 210 -65 14 -75 -267 -243 -430 -222 -395
1641 -395 -727 -612 -727 -627 -448 -320 10 -410 -157 -36 45 517 282 654 559 288 199 944 496 416 42
1662 42 377 398 -94 236 139 -45 -192 -412 -484 -416 -561 -588 -812 -364 -294 -493 -310 -254 -36 70 196 196 481
1685 481 335 416 565 319 629 349 320 218 361 638 -56 32 91 -61 -283 -517 -281 -511 -790 -752 -800 -542
1707 -542 -359 -413 -358 -464 -267 -202 75 279 205 339 596 556 379 446 496 450 572 552 627 117 -191 279 -214
1730 -214 -272 -406 -455 -223 -440 -514 -425 -396 -418 -415 -562 -218 -163 7 -60 228 144 299 424 247 713 482 545 363
1754 363 393 469 610 476 227 18 123 53 -108 -91 -172 -456 -399 -498 -309 -593 -470 -357 -437 -186 -83 -138 206
1777 206 -229 -58 425 406 404 330 491 594 477 149 335 326 216 11 203 -66 -310 -152 -184 -475 -432 -468 -583
1800 -583 -225 -399 -486 -214 -54 -243 -240 -64 96 40 320 605 107 165 664 255 97 342 456 375 157 253
1822 253 -19 23 -329 -174 -228 -144 -525 -604 -321 -625 -498 -310 -337 -315 113 22 -121 84 -26 243 533 152
1844 152 338 323 502 347 277 384 391 517 431 243 -14 -22 -152 -69 -261 -534 -490 -260 -369 -535 -423 -141 5
1867 5 -464 192 72 -30 158 -7 138 361 468 567 617 472 428 505 212 327 415 147 303 -42 -119 -378 -244
1890 -244 -347 -156 -300 -79 -418 -7 -523 -333 -216 -312 -374 -228 71 -48 387 215 363 450 254 140 538
1911 538 526 298 268 382 238 45 112 -6 -254 -212 -294 -288 -235 -340 -486 -505 -567 -538 -208 -21 -252 -241 347 4
1935 4 130 40 329 131 439 570 356 378 459 307 374 415 203 68 4 -127 75 -73 -493 -293 -362 -392 -317 -337
1959 -337 -314 -163 -378 -300 -134 8 129 -63 -129 303 404 324 340 365 269 470 337 509 290 474 199 150 -71
1982 -71 -117 -200 -157 -205 -250 -340 -276 -278 -168 -327 -145 -515 -361 -148 -18 -5 53 371 414 489 467 359 85 345 621
2007 621 475 385 93 82 -113 -152 151 -190 -80 -196 -308 -379 -65 -326 -159 -278 -364 -304 -380 -17 15 137 -230
2030 -230 124 172 446 217 297 298 326 112 418 159 63 222 308 52 -101 18 -55 -33 -479 -123 -184 -260 -321 -557
2054 -557 -149 -609 87 -333 -122 -268 -212 151 708 235 72 392 303 169 466 581 126 257 339 19 189
2075 189 -13 103 -23 -78 186 -274 -407 -150 -566 -511 -321 -369 -225 29 -117 -198 39 249 222 -141 336 200
2097 200 410 376 599 361 347 235 268 32 248 33 -245 -1 -223 -446 -111 -187 -151 -307 -153 -558 -419 -129
2119 -129 -254 -427 -39 -17 112 -89 189 263 141 289 352 349 254 243 191 302 124 138 -144 266 -77 -146 0
2142 0 59 -275 -389 -225 -386 -184 -281 -313 -323 9 -143 -80 52 433 -34 -68 170 278 246 143 217 331 301 437
2166 437 106 50 437 293 47 73 -148 -411 -95 -173 -502 -324 -297 -437 -259 0 -196 -304 -49 -54 -198 67
2188 67 314 -260 101 174 291 172 459 532 206 104 137 -213 183 277 -180 -61 64 -130 -413 -332 -217 -294
2210 -294 -470 -128 -171 -347 7 -87 -171 23 -73 167 361 285 310 207 461 410 278 467 45 95 268 251 20
2233 20 -42 11 71 -27 -181 -78 -278 -396 -120 -627 -233 -74 -251 -370 -162 -79 -266 157 229 224 -44 407 396
2256 396 -51 63 522 459 -11 136 149 30 192 -17 -118 -158 -404 -229 -78 -170 -454 -324 -146 -22 -205
2277 -205 -208 -108 -42 -20 63 -110 237 214 318 337 454 -25 251 355 114 159 218 121 129 123 -114 -199 -67 -316 110
2302 110 -191 -154 -301 -318 -267 -406 -294 -352 192 -431 -46 104 163 116 -25 119 280 236 65 259 198 199 128 92
2326 92 84 297 169 177 -64 -1 -180 -160 -147 -265 -227 -283 -201 -414 -52 -152 -263 -197 -5 165 103 178 31 93 508
2351 508 32 226 223 196 336 210 221 348 -2 13 -148 46 -175 -15 -84 -128 -62 -231 -277 -288 -353 9 -143 -125
2375 -125 -58 -11 105 50 196 54 331 317 233 83 301 407 -12 248 142 43 225 -177 -121 173 -144 -299
2397 -299 -14 -269 -515 -136 -5 -435 -294 -47 -74 -4 -244 -29 130 -31 142 312 100 14 192 137 278
2418 278 226 277 -15 21 167 -218 -38 138 -416 -170 -126 -191 -280 -112 -138 -178 -109 -366 -44 74 -209 -149 187
2441 187 123 189 339 118 76 404 326 318 64 422 11 131 -52 0 128 -186 -143 -151 174 -238 -136 -293 -355 -268
2465 -268 -167 -26 -198 -152 253 -22 83 90 174 82 231 231 246 274 230 439 90 160 18 170 240 21 76 -209
2489 -209 -62 -179 43 -50 -92 -402 -295 140 -187 -251 -271 -202 -72 -95 20 51 -207 163 290 353 -123 18 -122
2512 -122 288 289 72 58 -21 8 70 123 84 -450 3 -87 -209 -9 -35 -287 -102 -231 -252 -116 -98 77 83 -111 89
2537 89 -72 501 135 83 -7 69 135 282 345 -7 36 -82 -11 5 75 -53 -40 -191 47 -168 -10 -324 -304 -193
2561 -193 -33 300 -250 115 -11 271 199 103 475 140 -47 183 39 290 0 291 129 -210 334 0 98
2582 98 -79 87 -102 -174 -239 -335 -218 -233 -53 -75 -270 -172 28 10 -223 -43 -125 103 11 -16 149 13 -37 -2
2606 -2 273 85 129 301 112 -151 29 121 48 -81 42 -130 -108 -146 -120 -107 183 13 -88 -234 -156 -3 -136
2629 -136 -43 294 305 210 98 230 28 240 39 173 119 214 149 85 13 76 -104 -127 -234 -479 -49 -168 -214 -73
2653 -73 -199 -244 1 -139 -344 47 127 -65 -122 169 -71 114 320 -46 108 -38 339 265 186 160 190 148 105
2676 105 101 53 35 45 98 -68 -139 -254 -36 -124 -85 -304 -58 -53 -90 -95 187 79 -151 -353 121 223 -64 299 319
2701 319 300 213 4 239 -67 359 146 46 -15 -223 -89 -164 -16 -103 -103 -155 -137 -87 -157 -77 -129 -223 110 44 -163
2726 -163 131 -114 264 122 110 284 -203 160 241 -23 151 204 -73 41 -118 -36 25 177 -130 -171 -615 -246
2748 -246 64 -85 -135 -110 -160 -101 141 -76 -171 -223 -125 179 262 17 57 113 52 248 13 168 84 88 230 252 38
2773 38 -115 -97 -174 27 -197 -120 28 -47 -277 -260 258 72 9 321 -169 -231 138 155 -140 -11 236 387 217
2796 217 73 -2 224 346 63 346 58 92 -79 -382 10 -217 -353 -2 -67 -276 -110 174 -130 128 -287
2817 -287 -1 -25 -15 64 90 44 112 88 223 214 -107 94 275 -50 16 220 128 -9 -226 -44 -52 224 -508 -75
2841 -75 -71 -293 66 214 19 72 -225 -43 135 -65 -73 34 85 200 67 112 19 175 247 103 134 52 114 53 -31
2866 -31 115 -8 -101 9 -112 -77 250 25 -58 -65 -30 -107 94 -80 -123 -131 -85 203 -4 -34 83 154 74 71 9 69
2892 69 10 302 -99 96 189 141 -86 -132 39 -77 -217 189 124 27 -17 -246 -174 -41 -39 40 -72 -107 -69 214 187
2917 187 217 -135 18 69 284 217 176 69 115 125 -26 168 108 81 -103 153 -74 -213 17 -60 -75 21 96 -337
2941 -337 -181 -231 -16 66 -48 16 -1 236 140 270 -13 111 248 232 -144 -52 -19 148 69 -61 62 100 -205
2964 -205 38 -95 -5 -94 18 -287 63 -171 -356 -315 -151 -53 -104 -130 -3 -39 -185 -17 168 249 250 121 131 158
2988 158 110 199 232 4 25 93 166 -215 -82 -186 -276 -264 -47 -30 28 -147 -283 -218 22 213 -259 145 -45 60
3012 60 53 139 -118 121 86 -186 -37 -90 107 57 -8 63 5 10 1 -51 -237 -264 -82 -94 -325 140 31 -40 -216 -147
3038 -147 -19 -2 136 81 144 95 51 -364 84 283 101 147 51 276 81 -137 313 1 -201 55 -245 47
3060 47 22 -176 -40 34 -176 -14 -169 -263 -70 -34 20 -115 -14 286 160 265 55 -113 169 67 93 47 -79
3083 -79 175 74 -54 -160 -162 -11 -164 79 -33 -268 -168 52 -24 -14 -59 -63 18 17 74 -78 219 -65 32 -34 44
3108 44 -71 159 166 150 -141 155 -35 52 242 249 81 -202 -101 89 -20 22 166 183 -166 -34 -2 -511 -18
3131 -18 -27 42 -221 38 -132 96 16 -32 -139 317 -52 -60 216 27 131 92 -62 73 128 48 -46 3 53 -338 17
3156 17 -49 -20 -166 102 15 -128 35 -14 19 -265 4 -216 -51 205 -139 -75 307 259 206 -6 165 195 -58
3179 -58 -89 307 160 95 108 -50 -121 55 -100 98 -161 95 -314 -145 -261 120 -443 -91 -9 -146 -108 -81 -179
3202 -179 -7 114 106 81 66 64 1 239 72 106 -153 134 22 -42 -85 44 -117 -53 -94 -361 -240 66 201 -114
3226 -114 -126 -170 -88 9 -124 59 93 86 -62 -46 -102 136 111 6 93 -11 -30 124 85 -57 -104 124 96 35 -46 -40
3252 -40 -102 -26 11 64 -38 -19 -103 97 135 -42 -23 105 -214 -30 -356 38 43 -29 288 266 307 297 -4 83 112 -52
3278 -52 120 135 -30 -35 -66 11 16 -160 171 -61 -38 -66 84 -77 -104 -87 -41 -73 -208 -62 33 176 224 -35 247
3303 247 41 -40 112 74 30 -146 -346 182 32 161 -78 231 -164 119 14 -407 335 -137 -183 -154 -150 -189 -204
3326 -204 -109 291 68 47 -47 -26 -18 -251 122 227 78 162 108 -26 153 69 -51 -179 -5 -44 -38 92 -12 -120
3350 -120 -224 -132 -49 -310 -68 -192 -62 -31 -81 -192 24 52 196 52 125 256 84 -45 72 35 122 147 14
3373 14 -82 -105 -335 -156 -62 -283 1 -76 -187 -251 -187 4 -144 -77 -86 -97 117 58 40 147 -68 111 61 -73 72
3398 72 -81 -94 144 -171 152 -139 -219 -120 119 -113 -15 -53 -186 -85 34 -284 84 -85 -145 -65 -107 -79 1 49
3422 49 -37 -47 270 128 -15 -21 262 172 37 -82 20 -86 11 -183 0 200 44 -186 -99 65 233 126 -253
3445 -253 -78 -335 -92 -117 -65 -113 -72 57 197 56 -2 -56 30 -182 271 7 125 -46 116 -7 -116 208
3467 208 88 135 201 12 141 -26 -107 232 -253 -11 105 -138 165 -38 -138 -213 -132 -35 38 213 22 -31 -68
3490 -68 -80 70 47 67 -27 36 44 101 34 60 52 -9 103 110 49 -311 211 -44 -109 -141 64 29 -53 -1 -262 -107 -75 -30
3518 -30 -51 212 51 106 129 -136 -60 197 -42 -31 290 292 10 -81 -133 -282 139 55 -7 129 86 73 -99 56 195
3543 195 221 102 -55 -100 -37 14 73 -70 -24 93 -5 146 161 -52 -2 41 -161 269 253 147 -143 -132 240 227
3567 227 15 -26 35 193 -150 -202 -291 49 -253 32 -90 31 50 109 -224 -59 -83 -50 88 120 20 -27 51 67
3591 67 151 10 164 -124 -179 217 233 13 -91 -169 -18 -36 -8 -85 -271 -129 -4 -115 115 180 73 -88 122
3614 122 50 46 -260 196 159 148 75 214 312 183 -63 144 140 -49 -80 -3 33 -168 61 77 -103 -175 55 -188 -281
3639 -281 -279 29 -55 189 -16 -154 270 69 144 -119 175 -137 287 212 43 272 -118 -12 38 -140 -143 -76 -87
3662 -87 -135 102 -34 147 -88 39 -121 -76 75 89 126 -236 -160 -274 -48 -267 -43 171 -21 -146 53 137
3684 137 133 177 173 254 56 120 -37 24 20 -5 40 -161 52 -26 -316 -4 -209 -167 -206 -102 -73 157 -118 16 99 -62
3710 -62 138 -194 59 -111 -320 -79 -82 -105 31 -162 -98 -35 26 30 186 114 48 -58 -30 106 8 -267 -155 -18
3734 -18 23 -35 296 39 -305 7 -130 -99 -19 135 -74 -14 84 -141 -51 -26 15 -104 -14 -54 -47 294 88 -353 2
3759 2 -79 -120 -143 -21 -227 -40 249 70 -128 -51 -30 1 96 81 153 101 17 -119 114 5 -89 125 -124 106 234
3784 234 146 4 43 105 1 133 -37 -50 197 -218 -106 20 -63 28 39 -83 -157 25 -84 102 211 200 -41
3807 -41 12 7 -69 109 185 139 16 3 -15 -43 -116 18 -155 -69 24 195 269 4 -13 -181 -380 14 -37 -47 -170 51
3833 51 -22 20 -278 235 81 -144 -136 -27 -93 171 -115 -145 -43 57 26 148 13 207 -113 -98 -262 -140 -52
3856 -52 -340 -352 -11 2 175 41 7 -96 250 -82 -28 239 49 235 -16 -89 48 6 82 292 -174 -39 31
3879 31 23 -82 -22 102 -26 12 -16 -129 -317 44 -34 111 -59 16 -28 -54 108 -82 -65 -162 199 178 55 -8 94
3904 94 0 63 -27 -12 21 37 -147 -259 85 -79 109 124 107 104 28 -91 97 -87 61 -32 10 -61 -41 -14 163 -5
3930 -5 -59 -44 142 -5 -61 58 23 49 -84 60 42 -264 32 -147 -19 72 20 32 -159 11 126 -116 -254 -184
3954 -184 -113 23 -2 180 -37 -90 -148 165 87 158 -17 296 24 100 139 -32 78 232 51 53 83 -139 -27 -28
3978 -28 -54 8 -33 -30 -139 -314 -43 -130 28 -53 104 19 105 -183 313 116 12 -41 -48 -29 137 89 -26 151 131
4003 131 203 116 -188 112 -49 15 -209 51 -239 -91 -113 211 -74 -317 60 -22 212 -18 -102 -143 -119 -66 221
4026 221 56 -241 -1 391 -60 -144 -47 -19 77 111 -191 -51 80 35 188 -256 -104 29 -153 55 -195 97
4048 97 215 -289 -109 11 -18 -246 98 82 91 -210 343 29 186 182 38 26 136 -70 -64 150 -102 -61 -112 -8
4072 -8 7 127 -321 133 179 37 -33 -234 -215 -281 72 106 72 -259 198 -16 -139 277 16 113 62 -85 -82 -61 141
4097 141 -153 108 -61 -81 -49 181 160 217 -147 -157 -103 -41 196 168 52 39 -90 31 86 -82 -8 -99 222 -111
4121 -111 31 -105 47 -5 220 205 70 248 -158 -74 132 185 260 -79 -263 -127 23 -103 -44 92 -57 -13
4143 -13 -124 -107 -2 -5 -48 -7 -258 -44 -21 57 -312 -15 138 -14 360 120 17 96 -30 -80 26 2 -179 28
4167 28 81 154 -70 55 -32 67 182 60 -90 -1 -110 -136 -168 122 189 94 51 71 -130 173 174 -78 228 -54 117
4192 117 43 -109 212 -91 -309 -206 98 -77 -128 107 -44 71 -105 31 -9 -64 463 -29 179 22 14 39
4214 39 169 79 -95 101 0 -55 -75 141 -99 -37 125 42 39 304 -301 87 -171 -85 23 375 160 -56 22
4237 22 -110 -62 98 -39 18 -20 5 -144 -3 7 -8 -211 -56 -8 296 34 14 -28 -111 -94 144 -177 -32 -135
4261 -135 -31 51 117 -94 183 225 54 25 -32 -94 97 25 39 -147 138 -201 196 12 -35 -22 50 190 84 15
4285 15 -9 259 -204 179 262 149 216 154 -107 259 -108 -2 143 98 84 -71 -274 -34 50 -179 86 -166 61
4308 61 -7 47 47 -77 49 74 -21 -99 182 46 74 -8 -217 3 -1 -321 -137 -259 -300 -87 -42 -210 25 4 192
4333 192 -212 -146 119 49 221 -105 235 236 -193 -209 134 -196 -96 91 -100 -51 25 217 93 -18 222 -206
4355 -206 -42 -9 -254 65 18 -131 18 -51 -275 -264 -81 -3 -79 -100 70 132 -35 -143 -13 97 -115 37 61
4378 61 69 115 42 335 -95 2 215 155 288 172 -111 43 -88 1 167 -32 -310 102 21 165 -182 -78 60
4401 60 17 -44 -86 3 32 166 143 -51 405 51 171 2 171 -50 -19 12 84 -59 334 139 65 195 -290 182
4425 182 -76 -119 -91 -114 59 30 -18 -116 229 -73 -92 -161 76 -38 66 162 186 -75 45 19 -1 41 82 79 127 -223
4451 -223 -165 93 -32 125 -111 225 39 27 -38 -68 128 -86 -185 -11 -153 -86 97 92 49 155 -34 27 166
4474 166 237 66 -295 143 113 -1 41 6 146 -245 8 -24 211 -46 -8 -34 -60 -215 -26 -79 -109 190 -223
4497 -223 -163 68 317 -105 -106 39 -9 -239 257 80 135 -56 -3 -96 4 -1 47 40 67 -215 -68 227 122 33 -191
4522 -191 -63 63 -198 -173 -210 70 -113 -121 93 36 136 -61 -207 285 -69 -126 -171 0 281 91 77 -26 25
4545 25 -73 357 -105 8 5 -147 84 -14 81 94 -44 -78 -168 -221 -249 -18 23 -241 -23 -56 194 -15 203 -20
4569 -20 72 -93 -86 -79 88 -53 -61 -86 -57 -123 179 58 9 -82 -245 287 49 -154 50 -57 55 114 8 -66 -71 -269
4595 -269 -172 168 -59 52 234 0 199 -21 191 107 21 -137 119 6 -215 -42 -230 -57 -67 106 57 -7
4617 -7 -263 -144 -188 -35 -39 -19 2 39 88 -12 -277 -234 183 75 -10 -158 -8 62 -21 9 -67 -241 -123 213 -321
4642 -321 -154 0 28 61 -116 -42 -34 -160 -1 -55 -143 -53 180 91 -69 -46 -9 -102 35 87 134 182 -17 49 146 29
4668 29 -177 32 -47 43 203 -69 91 83 -283 178 117 62 -91 -155 222 110 108 -83 -82 -169 -61 122 -91 155
4692 155 52 -41 204 -139 62 -208 -242 376 5 -32 45 -237 -8 32 193 -181 227 -98 -64 166 -226 52
4714 52 253 86 28 -72 -47 72 114 275 267 -16 -133 278 123 -92 267 74 101 140 -131 180 -34 -23 -74
4737 -74 -137 -101 -133 -39 -67 112 214 -51 -51 -1 -40 -110 11 -199 35 304 38 -31 -50 -42 35 -113 114 28 -13 -74
4763 -74 172 94 37 -51 -91 68 -27 -55 -282 -296 114 -141 -58 -72 -82 -89 -194 -74 -124 -378 60 -33 33 -64 247 72
4789 72 198 131 -198 95 -57 -2 -209 -60 -42 -35 23 -217 -56 -34 -162 -100 -232 52 176 -214 -42 65 -58
4812 -58 18 -108 71 24 117 19 86 -34 -166 -102 -64 167 66 153 18 163 220 108 117 -84 9 -68 -10 -270 31
4837 31 -82 9 -87 60 -196 37 114 -83 104 37 37 162 -88 -126 198 -4 108 -12 -51 -102 424 129 63 114
4861 114 -13 -51 17 22 -111 -79 -42 -85 83 172 124 198 -18 20 -303 51 -149 -190 -80 23 124 -146 -93 177
4885 177 -19 45 0 45 -57 191 323 37 76 -29 137 -164 -123 60 30 -79 291 -87 -195 -123 39 88 206
4908 206 -108 -50 -166 74 34 293 32 -12 108 30 122 -29 -169 43 55 4 -51 142 -195 150 211 -130 93
4931 93 74 21 136 -15 -42 -108 -27 -67 119 -200 158 262 13 272 -172 -42 -104 176 -8 44 -91 -114 132
4954 132 -198 102 52 -81 36 74 276 66 -376 -74 -117 -94 66 68 101 -108 31 -340 130 27 -128 1
4976 1 74 208 -144 -6 -55 -136 -56 -24 167 -100 -15 84 68 24 -128 72 216 173 147 -92 -54 114 43 -167 -120
5001 -120 -132 -194 -157 60 -164 33 -128 -2 -47 -31 -53 15 146 -131 47 -112 286 10 -70 -133 -17 14 -8 18
5025 18 196 -67 -106 10 -1 -102 -122 9 -158 43 -165 -273 45 -132 137 -51 -103 110 136 220 132 -73 -153
5048 -153 -200 -160 -13 76 -180 148 180 -137 -88 26 -69 -55 -7 -38 -40 243 95 -82 -64 -230 126 262 131 -116
5072 -116 -193 137 93 -62 -94 -15 123 -196 -160 159 1 5 -23 214 -17 83 58 -14 37 -167 54 -23 -185 -261
5096 -261 -29 22 -26 -212 -5 -358 -5 203 200 -25 264 -4 -117 90 153 -170 10 -50 -220 164 -35 -185
5118 -185 -226 -141 -145 -91 95 -61 273 70 84 -20 73 -69 70 47 -67 -62 48 -56 47 -89 41 1 350 -194
5142 -194 -349 106 6 55 -55 -153 -169 55 75 62 -75 7 -84 81 -8 76 -166 72 -10 -294 -324 -150 -39 17
5166 17 -44 -191 -50 -93 26 -186 -181 330 -99 115 50 -128 -153 301 -104 -52 7 20 108 -85 -132 -361 33 -212
5190 -212 177 67 346 -19 112 -120 340 -36 -73 -194 270 97 41 111 72 72 -226 -48 -51 -130 19 73 -146
5213 -146 14 -89 -69 358 -21 -139 -60 170 -77 -132 97 -94 -29 136 26 64 -103 54 -52 -18 -49 134
5235 134 -22 145 106 92 114 85 192 54 -26 -99 -58 -230 -178 -125 22 -17 -42 148 -32 284 146 298 -173 -18
5259 -18 174 -212 94 103 326 -21 62 69 341 -44 98 170 -54 73 -169 -68 117 62 -124 72 -102 11 -121
5282 -121 51 -43 -47 -20 5 -299 -30 100 -36 119 -124 -58 289 -67 35 45 170 -77 -131 -39 -302 51 35
5305 35 -76 -78 -77 -142 12 10 -102 41 98 -50 -121 -181 43 -141 -246 -7 138 194 101 -327 86 -14 -54 -29 -360
5330 -360 -140 -10 -107 119 174 -33 86 -27 59 -88 51 253 -111 38 -15 117 23 -79 -56 -4 -220 71
5352 71 72 64 152 -31 202 -49 -147 -9 -100 -271 -149 155 138 -336 -20 -28 -108 57 -32 -131 105 -166 74 -38 104
5377 104 93 -34 -229 -22 -286 260 158 36 53 58 146 29 29 149 -55 -115 -157 -76 250 313 -74 87 -86 40
5401 40 54 -89 -78 149 170 -91 -144 -70 47 -128 65 46 -198 -141 85 -179 95 -52 79 -18 146 -62 -265
5424 -265 118 -55 -132 -25 -150 206 -128 134 88 -222 -38 39 166 89 113 -64 216 -38 39 121 259 -140
5446 -140 -30 -88 -189 112 -88 11 110 34 10 -39 -38 140 125 158 -75 113 134 103 -102 54 -67 -157 -174 -13 -229
5471 -229 -99 -70 -87 145 -101 78 167 -94 218 -186 -186 -37 -24 -19 108 64 -52 -67 54 29 1 -45 43 98 -112
5496 -112 -15 352 222 88 -15 -145 -51 -13 -103 4 -161 -62 -64 -49 -303 31 -94 45 -18 -255 -326 -70 -2 -111
5520 -111 -83 241 -126 245 -119 139 161 -59 -106 120 -45 58 117 -104 -134 28 -227 -128 -105 215 147 -16 -226
5543 -226 174 -211 -96 1 78 90 -31 -127 114 138 82 -187 20 -121 87 117 -55 134 -67 -213 -133 -121 -27
5566 -27 -82 71 -57 -162 64 -331 155 -387 93 114 -163 -184 -107 88 3 -39 -19 29 45 35 -144 -195 182 -78
5590 -78 -51 -16 16 287 97 110 114 183 28 125 -146 -342 109 -259 -69 -316 232 -59 -153 14 227 100 -122
5613 -122 -26 23 209 -52 -119 -61 -96 119 -176 124 -138 -152 -82 13 -95 -5 -325 -252 -9 198 -216 -63 95
5636 95 -99 -22 234 -157 -116 48 0 65 -28 135 -144 -89 -176 409 167 150 -470 239 -87 -112 120 -295 -385 -36
5660 -36 123 -71 3 -131 -80 -227 -8 -102 -96 -21 66 43 70 69 -33 96 -94 -94 -8 -56 -311 -124 62 95 295 42
5686 42 -80 -53 16 -147 -45 30 187 -125 -22 155 -60 -78 -172 -196 99 91 3 -74 66 0 -33 -88 1 -208 -73
5711 -73 91 109 -69 7 -137 -63 20 -46 195 128 61 -47 -27 -308 105 138 9 56 -4 -130 130 -111 -259 48
5735 48 156 -3 53 -159 -90 197 33 31 -143 76 -122 -8 62 198 -100 -46 -152 -158 28 -401 57 135 -86
5758 -86 201 4 86 -203 115 137 47 -99 -44 8 17 229 31 35 77 -40 37 -65 -3 -42 -13 -108 -158 9 31 -52
5784 -52 44 10 61 -27 -133 -99 -116 264 71 -56 117 29 -43 -16 207 -103 -192 77 -5 20 105 173 90 -197 80
5809 80 25 -47 256 -86 -166 397 -27 112 20 19 -276 150 -55 -102 -17 290 138 -175 -45 -156 -172 -109 89 49
5833 49 51 121 136 32 83 122 65 153 173 201 -130 -44 192 40 -219 80 -33 -39 136 73 28 142 -37 -239 95
5858 95 -65 -151 14 -84 -268 28 -45 87 -4 99 -49 -22 4 -100 239 -214 -188 -211 104 101 109 -52 171 25
5882 25 -97 76 -88 159 100 72 126 -82 63 -111 -83 -123 -130 -64 -62 14 22 73 80 61 1 39 84 185 -130 79 -136
5909 -136 243 -26 104 14 -18 246 159 -2 -18 -299 -100 -78 192 -231 59 75 151 58 -55 -180 -90 -142 -2
5932 -2 28 -137 41 -58 -77 -14 129 -86 57 12 -139 -280 85 -75 277 -218 25 -55 -51 -215 195 63 -223
5955 -223 -280 35 -92 65 139 92 196 43 62 -25 -85 -62 61 83 -33 144 77 -277 29 92 22 -65 141 172
5979 172 -53 -23 -121 -19 -199 133 193 -193 194 -154 -22 2 -138 -129 53 -336 -8 295 60 -42 -159 35
6001 35 -99 65 -284 -10 -8 -42 216 -175 253 -43 -72 -33 -152 214 185 -365 206 104 153 -64 216 222 -76
6024 -76 54 -135 69 -288 -234 -63 106 54 -20 55 -43 91 152 70 74 -105 144 -29 -90 -118 -74 33 38 -97 -171
6049 -171 -184 152 149 107 138 -40 9 22 74 6 -12 -165 24 -46 167 19 -357 -166 415 52 -40 -105 20 258
6073 258 -361 222 -79 10 151 -181 39 -4 -93 -196 157 49 80 -58 103 121 10 -127 -121 216 124 88 214
6096 214 86 -3 123 129 128 -8 -22 53 55 -64 -145 -53 -108 -111 -93 -118 31 -93 -270 31 -89 4 -101 -45 -64 40
6122 40 149 -104 -53 -87 -251 -367 148 10 103 -78 10 -8 79 92 -118 88 -105 120 91 -297 -28 248 14
6145 14 62 -391 48 -250 213 -118 -237 -148 -139 232 -221 217 14 247 150 142 102 -45 80 -187 -247 6 223
6168 223 -12 87 145 -18 -129 7 -1 -63 56 -152 -24 205 -148 -269 127 -155 193 -51 -137 49 159 -129
6190 -129 -152 -111 2 147 -109 311 -74 3 121 137 88 -117 91 -202 266 411 -38 227 96 -22 42 140
6212 140 128 35 -117 126 -67 11 36 -89 43 -134 277 154 -175 -60 8 21 -36 57 -15 64 37 114 -50 138
6236 138 -129 35 -204 -79 4 -161 -40 -75 103 11 -161 -23 111 -60 24 48 -200 60 -67 132 39 45 162
6259 162 64 219 -241 -134 91 -88 157 76 -113 -90 65 -22 84 -100 73 37 -68 25 19 -36 29 -84 46
6282 46 98 55 83 247 -63 -27 -270 177 20 -136 57 -190 141 225 -137 1 -2 42 -43 52 -174 -72 -75 -88 78
6307 78 28 265 286 188 -113 -84 2 13 66 195 -187 48 -246 -186 -180 66 -113 -118 45 -101 8 -37 119 138 -20
6332 -20 68 200 -46 115 169 204 128 -103 -85 45 -81 105 15 -124 -61 57 -93 -194 13 10 113 -94 -35 51
6356 51 -99 -140 163 -41 -11 267 -136 98 21 78 -111 -7 118 189 -33 -140 -162 -268 -145 144 182 -31 266
6379 266 41 28 97 75 42 111 -240 30 126 -99 -102 245 -81 95 77 64 50 71 -271 89 -163 13 -61 28 205
6404 205 -36 -40 4 92 12 -165 -48 72 -181 -25 162 83 -130 16 -252 -66 -73 93 -17 -84 -58 -166 5
6427 5 -63 104 278 173 32 -164 -290 -82 -64 100 140 -240 -15 118 15 130 -146 10 -124 -159 45 18
6449 18 -163 285 193 25 193 33 64 -11 -23 -77 41 -200 -57 -72 124 -75 -26 -231 212 -111 156 -53 119
6472 119 -264 -6 78 -56 46 -51 114 -147 -234 6 -81 151 -71 272 -138 -144 313 -60 -59 -100 -59 -109 -132 -17
6496 -17 46 199 -148 -90 60 -201 28 212 -30 -29 -42 42 -69 -48 32 -73 -75 -49 -35 -126 67 -32 40 -66 34
6521 34 -14 186 110 -15 -11 -188 -42 -32 33 111 -49 -28 53 68 -92 147 -178 -26 193 -74 54 -155 -21 -88
6545 -88 -104 39 -108 -112 -45 -67 39 -354 -194 -83 83 13 -114 85 -77 29 173 -166 187 60 -28 281 203
6568 203 3 -38 -23 24 -156 -288 152 146 29 74 -42 -204 32 -160 324 52 228 92 244 -65 92 -35
6590 -35 -198 72 -39 177 -95 -103 17 123 -9 222 -81 -94 159 53 -19 -226 -27 -7 -22 11 129 -106 4
6613 4 169 -142 145 -76 -37 148 -175 140 77 -84 200 111 260 -59 -10 -221 228 -92 14 76 37 26 -48
6636 -48 -14 -147 276 -143 215 118 40 -83 165 79 -146 113 70 -110 222 15 255 -53 17 -228 171 80 -26
6659 -26 217 124 -113 -82 35 57 23 202 137 -221 -77 -196 -32 139 -15 -174 196 36 23 -228 -256 -170 48
6682 48 -7 102 -163 -51 -155 34 -100 91 -140 76 141 -71 84 25 -77 165 -131 38 171 -84 -106 -81
6704 -81 99 -237 -204 -131 -79 85 64 155 -58 -57 -57 155 -28 -40 -280 -69 -254 152 -118 78 -58 -36 96 -95
6728 -95 -69 19 12 -48 145 65 -138 -140 -15 114 107 163 -60 56 47 -286 11 -156 38 192 -139 57 8 157 40
6753 40 74 -17 -64 64 38 -177 -23 -250 -49 79 24 -77 -129 -249 41 -18 -135 -36 -76 241 111 3 63 -53
6777 -53 80 3 -162 169 -51 -10 -41 -85 113 -3 118 45 -97 -83 -125 128 75 16 -155 -116 38 82 9 46 -79
6802 -79 125 36 -162 23 -185 149 54 11 -245 107 -264 -22 47 7 204 128 11 -112 234 86 290 30
6824 30 34 -137 345 -123 41 -108 184 341 157 136 -148 -34 -122 215 -402 82 -43 -1 -50 -156 72 -13 -211
6847 -211 99 94 -284 -65 186 -72 -106 -88 -31 -69 279 259 -7 -35 21 -141 -124 87 -219 -163 -35 270 -204 -202
6871 -202 100 35 17 -159 57 -227 57 -90 -223 181 -157 -8 29 202 -185 35 123 112 117 -54 96 -155
6893 -155 -34 -39 181 99 21 177 235 177 -105 -114 -102 -227 37 -82 103 91 73 258 44 -55 -23 312 197 42
6917 42 -26 151 69 -39 -101 239 156 -63 -12 -123 -44 -52 182 -153 -2 110 -129 -41 63 59 165 -38 54 74 -22
6942 -22 -4 140 135 -118 -80 -171 140 -174 2 -84 -145 124 155 36 -160 219 211 136 241 108 -30 -123 -185 -18 72
6967 72 -47 -15 -216 -25 101 80 -51 -73 95 -75 194 -62 231 -19 -135 -30 -80 59 -78 -22 165 -68
6989 -68 -110 -264 50 20 71 327 -112 3 71 -49 344 -53 -40 30 75 108 -75 122 101 175 83 -4 14 -73 41
7014 41 -131 -65 17 145 -40 60 138 -258 -30 37 45 -81 -70 106 -23 19 103 152 61 -82 266 134 58 7 -41
7039 -41 -259 12 231 49 198 -145 63 -63 -42 170 56 126 -143 56 184 -14 -133 -249 -6 -12 12 -235
7061 -235 -145 74 -182 49 -171 -51 -1 -85 -124 70 -79 54 97 37 -41 89 81 -76 36 13 142 212 231 138
7085 138 30 66 16 -65 -8 -28 -137 41 169 42 -161 9 84 228 117 112 20 -302 42 -252 -157 -411 -132
7108 -132 -86 -283 -7 -78 125 208 -183 -297 162 91 -96 2 -32 -71 -173 -228 -221 -169 -197 115 -11 101 -40 -10
7132 -10 161 120 132 86 -333 -78 -220 331 87 -57 130 -145 -58 -90 -93 -56 137 -124 12 2 -63 128 100 -27
7156 -27 -9 -143 -231 77 177 -56 -125 -33 48 -4 -21 52 67 147 66 66 239 -6 0 -47 -348 -147 49 5 -24 -12 -207
7183 -207 -44 -167 229 92 -41 -102 -214 448 0 -4 -39 125 164 55 45 -81 -5 173 -38 78 -89 164
7205 164 60 97 -10 -49 260 -92 -195 -165 68 -174 -102 -89 -75 -161 -120 79 -143 -223 72 4 76 -59 7 87
7229 87 48 102 60 -13 211 -313 -67 -129 126 -41 53 -223 -198 -61 8 130 -94 23 71 -125 88 -141 247
7252 247 17 -97 346 232 4 -22 10 241 37 75 47 -290 97 112 166 22 -199 -79 253 -113 111 -172
7274 -172 -240 -43 -80 77 -9 3 -9 72 48 -15 207 -108 57 -37 -253 95 89 -295 -22 -190 -304 -214 -94 -121
7298 -121 -93 -37 59 -218 27 438 -340 -215 16 -107 -219 115 235 -56 -97 -77 1 143 -117 -133 -131 132 155
7321 155 91 -150 -138 -141 -5 247 60 66 101 -2 -110 -97 33 -151 39 -131 49 -169 169 -158 -184 -110 142
7344 142 -25 -396 -32 -148 -44 235 -4 206 50 49 5 -229 162 -41 -68 78 241 -40 -41 -35 106 233 -103
7367 -103 53 -33 -40 218 0 -254 79 -28 -101 -27 13 -179 121 -15 -10 217 -43 190 -98 -1 94 10 -174 43
7391 43 -151 -14 -71 -14 -3 37 43 8 58 252 -69 3 13 48 199 51 -74 260 10 -55 14 32 127 -1 106
7416 106 -85 93 -32 -125 24 57 -220 66 34 126 -21 88 -97 -75 156 -123 78 -184 195 3 -53 40
7438 40 -71 179 -8 38 -27 131 -169 -16 196 7 192 45 -250 18 -217 -198 7 34 -140 -27 -37 100
7460 100 -69 121 10 93 -88 70 45 142 50 -106 98 48 208 -233 -80 -34 196 -111 172 -23 261 36
7482 36 -68 -303 36 -41 22 70 132 -123 -173 -104 169 -78 146 6 210 66 -192 -60 44 -155 161 62 146
7505 146 83 42 190 -4 20 -169 144 44 -215 -11 202 89 159 209 82 -209 2 -20 168 115 260 -49
7527 -49 10 -83 99 8 -83 88 140 -190 -98 -124 129 68 -48 -5 -77 -115 -159 254 48 101 -105 -35 -29 110 -95 -170
7553 -170 181 345 -29 112 -12 -69 27 119 213 0 -143 -80 104 119 -125 -20 13 -161 -4 23 -95 74 52
7576 52 -268 -17 3 -422 -118 -309 -17 82 15 -149 -161 -82 152 -448 -97 36 -306 12 88 -29 -70 39 25
7599 25 61 185 -29 -102 54 23 -74 98 -127 -5 171 1 -201 140 -94 -27 -141 22 1 67 -35 95 -82
7622 -82 -91 108 23 25 -1 -156 276 -127 95 -19 -1 1 161 27 64 80 -12 5 -79 -210 -74 -25 -175 -65 79
7647 79 158 88 -121 -204 87 -1 109 72 -69 -263 -70 -148 72 -101 137 -188 -120 62 108 -93 -129 82 39 -46
7671 -46 133 -85 -82 78 181 3 129 127 38 66 -88 206 -69 -157 8 -109 -27 -259 -64 -260 111 -186 -212
7694 -212 60 58 -45 -335 150 123 -120 164 -6 -124 -179 -67 -203 -47 18 -75 84 -324 159 -130 -180 129
7716 129 180 -150 206 -25 0 194 91 111 -89 146 -89 170 -2 -45 180 -120 26 86 3 379 15 -90
7738 -90 123 79 -18 9 -140 -1 91 -195 50 -167 13 -3 -10 -35 -16 -120 -141 7 -212 -130 27 -163 44 -132
7762 -132 -11 88 -7 109 14 -28 -117 57 -159 3 -170 -185 60 31 203 -145 53 39 94 -113 43 -64 33
7785 33 -205 -82 -8 74 73 -58 -58 191 180 64 -18 -45 36 28 102 31 5 -72 31 69 -46 -129 -114 -313 -76 -173 89
7812 89 71 34 -52 43 -21 4 171 -103 10 34 -180 -132 1 -62 78 11 -229 -130 36 -17 137 63 -47 57 252
7837 252 -54 -188 128 -138 -95 -92 -11 204 -131 -178 47 -21 156 -149 -97 7 -91 -184 -84 23 -6 -64 89 -166
7861 -166 5 55 102 -2 232 43 149 -48 -95 89 -26 24 -40 -49 11 46 134 180 -215 251 -18 84 22 90
7885 90 6 48 -195 36 -146 -15 126 -17 75 -245 39 -24 218 -197 -44 -100 126 24 -89 138 106 180 -53
7908 -53 63 202 -70 -54 65 -85 72 -9 109 91 97 53 24 29 18 -15 127 -28 -306 -166 -91 -194 -300 -29
7932 -29 -50 -211 170 107 194 -74 95 -106 -328 -50 1 189 362 -45 114 -43 69 19 -43 60 29 -8 205
7955 205 64 -74 7 42 -112 143 -6 79 -20 55 230 -132 -150 88 148 79 57 -8 -3 -127 28 118 -103 -196 5
7980 5 140 -137 17 -58 -87 68 65 17 -79 134 -59 -129 70 -195 -23 -46 58 258 5 -2 -184 -36 -6 23 14
8005 14 221 -179 126 46 4 -150 -51 6 242 57 38 60 217 60 -69 98 -40 -33 -164 232 -66 -23 -189
8028 -189 -161 -244 21 -221 50 131 33 263 -52 82 149 20 254 -361 -24 -26 131 -171 -277 -30 -57 157 51
8051 51 85 189 -155 -156 -14 -120 -102 54 146 57 83 -18 186 166 -95 114 -215 298 -14 -152 156 -33 74
8074 74 -105 55 29 -141 -37 82 115 161 -47 -128 -28 107 258 -140 15 -9 -134 -11 90 -99 -60 -67 71
8097 71 -160 198 -82 -1 30 -110 200 -95 64 -58 47 143 157 6 33 122 -52 82 79 100 30 -203 -73 332
8121 332 -188 46 -59 40 -217 -163 31 52 198 100 -53 112 -26 6 17 -191 -21 84 -150 -30 -38 -28 -313
8144 -313 -64 -105 -93 -1 52 -74 188 -130 -68 100 -89 200 -71 -54 -158 187 -33 -164 75 334 -148 50
8166 50 -51 7 -179 62 144 52 104 26 276 -40 -235 -52 -146 -53 -60 194 53 -112 -30 147 181 -11 -73 179
8190 179 198
8191A98
##END NTUPLES=NMR FID
##END=
