##TITLE=1H_LR-598-H
 D2O
 8 sc, 
 3.9.2024
##JCAMPDX= 6.0         $$ Bruker NMR JCAMP-DX V2.0
##DATA TYPE= NMR FID
##DATA CLASS= NTUPLES
##ORIGIN= UXNMR, Bruker Analytische Messtechnik GmbH
##OWNER= root
$$ XWIN-NMR		Version 3.5
$$ Tue Sep  3 14:31:31 2024 Russian Standard Time (UT+4h)  she@DPX200
##.OBSERVE FREQUENCY= 200.1318
##.OBSERVE NUCLEUS= ^1H
##.DELAY= (6, 6)
##.ACQUISITION MODE= SIMULTANEOUS
##.ACQUISITION SCHEME= undefined
##.AVERAGES= 8
##.DIGITISER RES= 18
##SPECTROMETER/DATA SYSTEM= spect
##.PULSE SEQUENCE= zg30
##.SOLVENT NAME= DMSO
##.SHIFT REFERENCE= (INTERNAL, DMSO, 0, 15.7039)
##AUDIT TRAIL= $$ (NUMBER, WHEN, WHO, WHERE, WHAT)
$$ ##TITLE= Audit trail, XWIN-NMR		Version 3.5
$$ ##JCAMPDX= 5.01
$$ ##ORIGIN= Bruker BioSpin GmbH
$$ ##OWNER= she
$$ F:/spectra/data/she/nmr/H-F/1/audita.txt
$$ ##AUDIT TRAIL=  $$ (NUMBER, WHEN, WHO, WHERE, WHAT)
(   1,<2024-09-03 14:30:25.12 +0400>,<she>,<DPX200>,
      <created by zg, POWCHK disabled, PULCHK disabled
       configuration hash MD5:
       00 E9 B6 7A A2 85 ED C7 34 08 36 98 17 FE 4E 26
       data hash MD5: 16K
       EF C2 16 DD EB C9 EF 71 63 26 36 2B DE 7B BB 3A>)
$$ ##END=
$$ 
$$ hash MD5
$$ A0 4B 09 F8 C1 25 45 5E B1 8A 9A DA A2 3A FF 74
##$RELAX= 
##$RELAX= 
##$RELAX= 
##$RELAX= 
##$RELAX= 
##$RELAX= 
$$ Bruker specific parameters
$$ --------------------------
##$DU= <F:/spectra>
##$EXPNO= 1
##$NAME= <H-F>
##$PROCNO= 1
##$TYPE= <nmr>
##$USER= <she>
##$AMP= (0..31)
100 100 100 100 100 100 100 100 100 100 100 100 100 100 100 100 100 100 
100 100 100 100 100 100 100 100 100 100 100 100 100 100 
##$AQSEQ= 0
##$AQ_mod= 1
##$AUNM= <au_zg>
##$AUTOPOS= <>
##$BF1= 200.13
##$BF2= 200.13
##$BF3= 200.13
##$BF4= 200.13
##$BF5= 200.13
##$BF6= 200.13
##$BF7= 200.13
##$BF8= 200.13
##$BYTORDA= 1
##$CFDGTYP= 0
##$CFRGTYP= 5
##$CHEMSTR= <none>
##$CNST= (0..31)
1 1 145 1 1 1 1 1 1 1 1 1 1 1 1 1 1 1 1 1 1 1 1 1 1 1 1 1 1 1 1 1 
##$CPDPRG= <>
##$CPDPRG1= <>
##$CPDPRG2= <>
##$CPDPRG3= <>
##$CPDPRG4= <mlev>
##$CPDPRG5= <mlev>
##$CPDPRG6= <mlev>
##$CPDPRG7= <mlev>
##$CPDPRG8= <mlev>
##$CPDPRGB= <>
##$CPDPRGT= <>
##$D= (0..31)
0 1.2 0 0 0 0 0 0 0 0.06 0 0.03 0 0 0 0 0.0002 0 0 0 0 0 0 0 0 0 0 0 0 
0 0 0 
##$DATE= 1725359424
##$DBL= (0..7)
120 120 120 120 120 120 120 120 
##$DBP= (0..7)
150 150 150 150 150 150 150 150 
##$DBP07= 0
##$DBPNAM0= <>
##$DBPNAM1= <>
##$DBPNAM2= <>
##$DBPNAM3= <>
##$DBPNAM4= <>
##$DBPNAM5= <>
##$DBPNAM6= <>
##$DBPNAM7= <>
##$DBPOAL= (0..7)
0.5 0.5 0.5 0.5 0.5 0.5 0.5 0.5 
##$DBPOFFS= (0..7)
0 0 0 0 0 0 0 0 
##$DE= 6
##$DECBNUC= <off>
##$DECIM= 24
##$DECNUC= <off>
##$DECSTAT= 4
##$DIGMOD= 1
##$DIGTYP= 9
##$DL= (0..7)
0 120 120 120 120 120 120 120 
##$DP= (0..7)
150 150 150 150 150 150 150 150 
##$DP07= 0
##$DPNAME0= <>
##$DPNAME1= <>
##$DPNAME2= <>
##$DPNAME3= <>
##$DPNAME4= <>
##$DPNAME5= <>
##$DPNAME6= <>
##$DPNAME7= <>
##$DPOAL= (0..7)
0.5 0.5 0.5 0.5 0.5 0.5 0.5 0.5 
##$DPOFFS= (0..7)
0 0 0 0 0 0 0 0 
##$DQDMODE= 0
##$DR= 18
##$DS= 0
##$DSLIST= <SSSSSSSSSSSSSSS>
##$DSPFIRM= 0
$$ [...]
##$SUBNAM2= <"">
##$SUBNAM3= <"">
##$SUBNAM4= <"">
##$SUBNAM5= <"">
##$SUBNAM6= <"">
##$SUBNAM7= <"">
##$SUBNAM8= <"">
##$SUBNAM9= <"">
##$SW= 24.0689170037331
##$SWIBOX= (0..15)
0 0 2 0 0 0 0 0 0 0 0 0 0 0 0 0 
##$SW_h= 4816.95568400771
##$TD= 16384
##$TD0= 1
##$TE= 0
##$TE2= 300
##$TE3= 300
##$TEG= 300
##$TL= (0..7)
0 120 120 120 120 120 120 120 
##$TP= (0..7)
150 150 150 150 150 150 150 150 
##$TP07= 0
##$TPNAME0= <>
##$TPNAME1= <>
##$TPNAME2= <>
##$TPNAME3= <>
##$TPNAME4= <>
##$TPNAME5= <>
##$TPNAME6= <>
##$TPNAME7= <>
##$TPOAL= (0..7)
0.5 0.5 0.5 0.5 0.5 0.5 0.5 0.5 
##$TPOFFS= (0..7)
0 0 0 0 0 0 0 0 
##$TUNHIN= 0
##$TUNHOUT= 0
##$TUNXOUT= 0
##$USERA1= <user>
##$USERA2= <user>
##$USERA3= <user>
##$USERA4= <user>
##$USERA5= <user>
##$V9= 5
##$VALIST= <valist>
##$VCLIST= <CCCCCCCCCCCCCCC>
##$VD= 0
##$VDLIST= <DDDDDDDDDDDDDDD>
##$VPLIST= <PPPPPPPPPPPPPPP>
##$VTLIST= <TTTTTTTTTTTTTTT>
##$WBST= 1024
##$WBSW= 4
##$XGAIN= (0..3)
0 0 0 0 
##$XL= 0
##$YL= 0
##$YMAX_a= 221746
##$YMIN_a= -252938
##$ZGOPTNS= <>
##$ZL1= 120
##$ZL2= 120
##$ZL3= 120
##$ZL4= 120
##$ABSF1= 10
##$ABSF2= 0
##$ABSG= 5
##$ABSL= 3
##$ALPHA= 0
##$AQORDER= 0
##$ASSFAC= 0
##$ASSFACI= 0
##$ASSFACX= 0
##$ASSWID= 0
##$AUNMP= <proc_1d>
##$AZFE= 0.1
##$AZFW= 0.1
##$BCFW= 1
##$BC_mod= 2
##$BYTORDP= 1
##$COROFFS= 0
##$CY= 11.3945322036743
##$DATMOD= 1
##$DC= 2
##$DFILT= <>
##$DTYPP= 0
##$F1P= 15.6554695791079
##$F2P= 12.8336369535428
##$FCOR= 0.5
##$FTSIZE= 0
##$FT_mod= 4
##$GAMMA= 1
##$GB= 0.15
##$INTBC= 1
##$INTSCL= 1
##$ISEN= 128
##$LB= 0.24
##$LEV0= 0
##$LPBIN= 0
##$MAXI= 10000
##$MC2= 0
##$MEAN= 0
##$ME_mod= 0
##$MI= 1.114404
##$NCOEF= 0
##$NC_proc= 0
##$NLEV= 6
##$NOISF1= 3.799351
##$NOISF2= 2.8
##$NSP= 1
##$NTH_PI= 0
##$NZP= 0
##$OFFSET= 15.70392
##$PC= 1
##$PHC0= -26154.92
##$PHC1= 8.387478
##$PH_mod= 1
##$PKNL= yes
##$PPARMOD= 0
##$PSCAL= 0
##$PSIGN= 0
##$REVERSE= no
##$SF= 200.130013532006
##$SI= 16384
##$SIGF1= 3
##$SIGF2= 2
##$SINO= 400
##$SIOLD= 16384
##$SREGLST= <1H.CDCl3>
##$SSB= 0
##$STSI= 0
##$STSR= 0
##$SW_p= 3612.71676300578
##$SYMM= 0
##$S_DEV= 0
##$TDeff= 0
##$TDoff= 0
##$TI= <>
##$TILT= no
##$TM1= 0
##$TM2= 0
##$TOPLEV= 0
##$USERP1= <user>
##$USERP2= <user>
##$USERP3= <user>
##$USERP4= <user>
##$USERP5= <user>
##$WDW= 1
##$XDIM= 8192
##$YMAX_p= 0
##$YMIN_p= 0
$$ End of Bruker specific parameters
$$ ---------------------------------
##NTUPLES= NMR FID
##VAR_NAME=  TIME,          FID/REAL,        FID/IMAG
##SYMBOL=    X,             R,               I
##VAR_TYPE=  INDEPENDENT,   DEPENDENT,       DEPENDENT
##VAR_FORM=  AFFN,          ASDF,            ASDF
##VAR_DIM=   8192,          8192,            8192
##UNITS=     SECONDS,       ARBITRARY UNITS, ARBITRARY UNITS
##FACTOR=    0.0002076,     1,               1
##FIRST=     0,             0,               0
##LAST=      1.7004516,     0,               0
##MIN=       0,             -252938,         0
##MAX=       1.7004516,     221746,          0
$$ Real data points
##PAGE= N=1
##DATA TABLE= (X++(R..R)), XYDATA
$$ [...]
1227D151o470l735L065O237K464l658n959j714M514N823N20n345n228Q16N799
1242A280M236j916n820l432K697N968K720l757o062j241M727N146K61m915m939
1257e047O54N549M334j986n737l151K811N598K326l485n732j315M502N121J89
1272D631m963m600P96N382L930j918n388l075K724N425K266l600n442j034M247
1287f19M896P4m644m352P87N093L824j799n477k874K824N271J842l482m960j026
1303d622L974M827K41m934m260J218N020L261j794m957k881K623N232J950l580
1318A318n011p48M094M419rm533l968R22M893L280j914m962k438K640M929J643
1334D555l347m699q49M094M252j46m410l657R37M563L198j846m872k315K725M596
$$ plain form
1227 4151 -2319 -6054 -2989 3248 5712 2054 -3905 -5619 -1105 4718 5238 -107 -5335 -4519 1280
1242 1280 5516 3600 -2220 -5652 -2955 3013 5733 1976 -4086 -5327 -600 4546 4807 -108 -5047
1257 -5047 -4393 1156 5490 3504 -2233 -5384 -2573 3025 5351 1866 -3866 -5181 -679 4442 4631
1272 4631 -332 -4932 -4136 1246 5176 3258 -2130 -5205 -2481 2944 5210 1610 -3832 -4866 -619
1287 -619 4277 4351 -293 -4645 -3858 1235 5059 3260 -2217 -5091 -2267 3004 4846 1364 -3596 -4622
1303 -4622 -648 4179 4420 -514 -4774 -3556 1464 4725 2931 -2026 -4907 -2284 2948 4898 1318
1318 1318 -3693 -4441 -347 4072 4063 -470 -4438 -3516 1377 4657 2743 -2219 -4657 -2017 2912 4555
1334 4555 1208 -3491 -4340 -246 4006 3860 -550 -4207 -3270 1293 4491 2645 -2227 -4542 -1817 2779
1350B779J632l293m521p20L909M045k21m205l534Q81M572L080j932m675k123K624
1366a702M405J395l017m335p61L804L958k44m197l285J066M269K844j803m467
1381b070k148K535M394J359l254m083m74L684L713l81l893l331J088M314K575
1396D028j897m159j986K451M129J416l179m012k64L462L471l07l774l153J019
1411b755M216K473j978l987j811K383M028J196l051l781l75L480L385m39l677
1426f93l012J137L977K373j821l979j626K331L815J087k932l644k89L378L218
1441C320l94l704k680J129L717K248j776l809j624K372L742Q50k824l427j94L111
1457E7L155l98l551k743J238L672J948j674l549j590K270L506R19k746l337j26
$$ plain form
1350 2779 4411 1118 -3403 -4123 -214 3831 3610 -595 -4129 -3248 1324 4404 2472 -2203 -4326 -1702
1366 -1702 2703 4098 1081 -3254 -4015 -211 3747 3503 -694 -3979 -2913 1356 4200 2397 -2070
1381 -2070 -4218 -1683 2711 4070 816 -3267 -3741 -57 3656 3275 -618 -3949 -2861 1453 4028
1396 4028 2131 -2028 -4014 -1563 2566 3982 803 -3209 -3473 -11 3460 3153 -621 -3774 -2755
1411 -2755 1461 3934 1956 -2031 -3842 -1459 2569 3765 714 -3067 -3442 38 3423 2984 -693
1426 -693 -3705 -2568 1409 3782 1961 -2018 -3644 -1313 2502 3589 657 -2987 -3276 102 3320
1441 3320 2926 -778 -3458 -2329 1388 3636 1860 -1949 -3573 -1201 2541 3391 567 -2860 -3054 57
1457 57 3212 2814 -737 -3480 -2242 1430 3378 1704 -1845 -3435 -1165 2341 3260 514 -2823 -2949
1473b949L064K896l32l382k603J113L509K062j711l518j391K172L435Q07k721
1488D51l183j97L054K826m38l211k478J032L521J824j715l310j297K066L265P87
1504B997k557l133p5K973K696n47l116k284J086L226J816j596l292j202K100L109
1520B201P06k511k839j56K794K585m67l092k146J076L062J722j509l059j324K033
1536i24L066O67k471k767o4K697K496n16k882k153J024L098J614j549k995j185
1552b844K013K864O70k398k699k8K633K373m18k865k056J055K931J502j451k832
1568a550j182J869K934M60k317k546P5K479K244l76k775j970J030K828J456j495
1584A164k740j052J828K801M92k305k493K8K560K142n50k596j807R64K708J443
$$ plain form
1473 -2949 115 3011 2679 -703 -3306 -2193 1316 3378 1667 -1851 -3242 -1070 2365 3172 451
1488 451 -2732 -2929 125 2951 2513 -698 -3176 -2144 1377 3201 1486 -1824 -3121 -1055 2210 2997
1504 2997 440 -2693 -2768 205 2901 2354 -762 -3046 -1960 1266 3082 1486 -1806 -3008 -908 2201
1520 2201 2907 396 -2443 -2599 195 2780 2313 -779 -2925 -1849 1213 2935 1426 -1633 -2957 -924
1536 -924 2142 2809 338 -2429 -2493 204 2700 2184 -698 -2851 -1827 1271 2885 1336 -1659 -2844
1552 -2844 -831 2033 2703 305 -2394 -2422 211 2584 2166 -699 -2755 -1700 1231 2733 1282 -1550
1568 -1550 -2732 -863 2071 2531 214 -2332 -2257 222 2466 2090 -685 -2655 -1625 1203 2659 1164
1584 1164 -1576 -2628 -800 2001 2493 188 -2305 -2277 283 2425 1875 -721 -2528 -1564 1144 2587
1600B587j390k734r95J852K610M02k091k388j0K382K128m65k654j695R95K559
1616A093J332j345k579r25J763K501M30k098k284L7K333K054m78k523j718J028
1632a379K506J158j246k534q58J695K457L71k067k084K9K223J915m83k380j677
1648b354R79K447J212j288k369q71J588K487L37k014k139J46K194J712m59k214
1664f06j586Q75K318J191j266k319q12J702K232L07j895k077J58K008J859n10
1680A579k304j431R79K276J055j343k195p49J626K141L75j940j947J25K102J727
1696B076o22k137j460R01K230J071j230k173o92J569K056K44j773j852P6K021
1712C05J667n50k167j328J010K012R78j081k148o51J516K025K52j840j760J71
$$ plain form
1600 2587 1197 -1537 -2532 -680 1930 2332 241 -2147 -2157 225 2353 1888 -766 -2461 -1466 1093
1616 1093 2425 1080 -1499 -2424 -661 1840 2270 172 -2112 -2075 258 2312 1834 -689 -2407 -1379
1632 -1379 1127 2285 1039 -1495 -2353 -658 1799 2170 103 -1981 -1952 271 2186 1703 -677 -2354
1648 -2354 -1375 1072 2284 996 -1373 -2244 -656 1831 2168 154 -1985 -1839 355 2067 1608 -606
1664 -606 -2192 -1317 1001 2192 926 -1393 -2205 -503 1729 2036 141 -1936 -1778 230 2089 1579
1680 1579 -725 -2156 -1177 1099 2154 811 -1384 -2133 -507 1634 2009 69 -1878 -1753 349 2076
1696 2076 1454 -683 -2143 -1242 988 2059 829 -1344 -2036 -467 1589 1833 60 -1792 -1716 305
1712 305 1972 1422 -745 -2073 -1063 949 1927 846 -1302 -1953 -437 1588 1840 0 -1760 -1589
1728a589J913J553m59k034j366Q86K108R50j186k125n66J492J910K16j629j728
1744a654P9J873J619n16k057j299R59J947Q95j103j972o30J505J816K31j641j711
1761a659J54J811J456m82j873j230P78J934R48j185j833n95J406J839J60j629
1777@j618J12J826J381n10j801j196Q95J849Q55j020j985n75J437J752K11j680
1794f7j461J42J628J398l71j866j210R04J840Q18j212j744m17J327J651J97j544
1811A3j494J00J684J370n91j726j005P85J771O72j004j739m67J352J639J45j561
1828e6j459K24J565J324n64j629j106Q43J804O55j060j608m40J270J529J34j400
1845B6j463J83J582J245n30j638r69P69J608P67r36j806l35J272J431J54j424
$$ plain form
1728 -1589 324 1877 1418 -616 -1982 -1096 1012 1962 776 -1349 -1915 -423 1487 1703 74 -1654
1744 -1654 -1575 298 1917 1401 -656 -1955 -996 951 1846 743 -1229 -1859 -354 1462 1693 52 -1659
1761 -1659 -1505 306 1762 1280 -593 -1823 -1045 889 1837 652 -1181 -1776 -370 1469 1629 0
1777 0 -1618 -1506 320 1701 1191 -610 -1806 -911 938 1793 773 -1212 -1787 -350 1402 1613 -67
1794 -67 -1528 -1386 242 1640 1269 -597 -1807 -903 937 1755 543 -1201 -1618 -291 1360 1557 13
1811 13 -1481 -1381 303 1673 1082 -644 -1649 -864 907 1579 575 -1164 -1631 -279 1360 1505 -56
1828 -56 -1515 -1291 274 1598 1034 -595 -1701 -858 946 1601 541 -1067 -1507 -237 1292 1426 26
1845 26 -1437 -1254 328 1573 1043 -595 -1564 -795 813 1580 644 -1162 -1497 -225 1206 1360 -64
1862f4j276P7J522J296n04j681r63Q60J587N94r54j499m48J177J463J83j405j368
1880a403J46J597J147n57j449r28O53J522P96j000j564m37J272J406M1j310j206
1897a274J69J292J212m03j541r12O74J644N70r88j435l64J051J432J47j278j267
1914a271J41J432J085n11j420q68P14J417P56r88j476l33J183J287N5j243j223
1931a263J10J464J065m44j502q22P70J341O37r22j343l46J063J295R4j229j231
1948a263K45J351R57m07j398p85O37J349O54q61j477k38J080J264Nj146j154K11
1966i76J237J010l38j458q33P32J337N25p95j294l10R52J243J25j200j132J91
1983i84J270R32m48j260p74O52J363M96q49j280k57R86J123Q3j154r91J00J216
$$ plain form
1862 -64 -1340 -1263 259 1555 1051 -630 -1593 -733 854 1448 494 -1005 -1453 -276 1187 1370 -35 -1403
1880 -1403 -1257 340 1487 930 -519 -1447 -794 728 1524 524 -1040 -1477 -205 1201 1242 -68 -1274
1897 -1274 -1105 187 1399 996 -545 -1457 -783 861 1431 443 -992 -1356 -305 1127 1274 -4 -1271
1914 -1271 -1130 302 1387 876 -544 -1412 -698 719 1475 487 -989 -1322 -139 1148 1203 -40 -1263
1931 -1263 -1153 311 1376 932 -570 -1392 -622 719 1356 434 -909 -1255 -192 1103 1197 -32 -1263
1948 -1263 -1018 333 1290 883 -515 -1300 -663 686 1340 479 -998 -1236 -156 1108 1113 -33 -1187 -976
1966 -976 261 1271 933 -525 -1358 -626 711 1236 441 -853 -1163 -211 1032 1157 -43 -1175 -984
1983 -984 286 1218 770 -490 -1264 -612 751 1247 398 -882 -1139 -153 970 1053 -101 -1092 -992 224
2001B24R33m46j262o80P19J176N22p55j280l53J033J160Q5j190j004K38J178Q30
2019A128l81j241o86O10J270N13q89j175k61J033J032L7j013r93J08J218Q67n01
2037F76j207o20O40J228L70q13j153k08R13J125Jj017j066K82J144P38l82j169
2055e18n64N97J143M53q00j116j86Q71J019J1j014q74J73J077Q09m04j188n25
2073a036N56J118L94o85j116k85J021R77j0j106p77J73J121O51l86j079o14N70
2091e13J154L99p93j070j32R20Q81J8q88r76K19J083P40l87j162m56N47J035L97
2110A016p17j073j62Q81R88j00r36r08L88R79O24l35j131n41O42J055L37q04r16
2129g13j75P59R01Q9j006q22K20J048O85m71r46n46N44J075L14p17j008j83R32
$$ plain form
2001 224 1157 711 -551 -1231 -512 664 1186 431 -849 -1202 -169 991 1076 -114 -1118 -880 298 1128
2019 1128 747 -494 -1180 -570 700 1213 324 -851 -1112 -79 953 990 -23 -1016 -908 310 1177 676
2037 676 -531 -1151 -511 717 1087 274 -879 -1087 -174 951 952 -65 -1131 -849 295 1033 651 -518
2055 -518 -1082 -485 658 1111 311 -805 -991 -120 899 910 -104 -978 -805 272 1081 677 -511 -1036
2073 -1036 -480 638 1032 347 -769 -1054 -33 944 934 -172 -949 -776 345 996 610 -469 -1083 -513
2091 -513 641 1040 247 -823 -955 -35 846 864 -24 -1000 -781 302 1042 655 -507 -963 -416 619 1016
2110 1016 299 -774 -936 -55 933 833 -103 -1011 -623 356 980 645 -486 -1027 -385 670 1007 203 -713
2129 -713 -888 -129 772 861 -145 -967 -747 301 986 515 -431 -977 -433 642 956 239 -769 -952 -20
2148b0Q98o5r53p18J77R98O24l89j017n25N83J033L05p28r62k6P34Q74o3q49q29
2169i18K64R74O18m30r98l42M48R99L27p30r51j21Q28Q50q5r10p45L17R09N94
2189H98l96r64m07M76R89L02p20q84j15P49Q88j15q52p09K12R61N45l22r77m71
2209i12N38R95K02o33q84j45Q26Q51j40q65o59J61J016N31m30q98m11N60Q98J74
2229G75o14q04r7P39P95o8q86o19J45R44O14m46r29l89N63Q21K73n50r79l1P86
2250D3Q81k04r04o63K23R43N46m06r66m04O10Q67K58o99q60j7P70P47q1q20o82
2271h18K73Q62N19m49q27l51M99R02J86o69p91o5Q53O21j06q28o10K37R06M46
2291G90l81p92m35N34Q66J72o00p86o1P10O50m1p88o46L62Q40L36l35q00m09N61
$$ plain form
2148 -20 878 813 -140 -858 -681 317 941 552 -465 -990 -407 626 931 203 -759 -785 -51 823 760 -89 -918
2169 -918 -654 320 938 508 -490 -832 -384 615 942 212 -739 -860 -32 818 733 -177 -922 -605 304 898
2189 898 502 -462 -869 -393 596 898 178 -706 -821 -72 816 701 -151 -860 -648 313 858 536 -441 -912
2209 -912 -374 621 823 190 -694 -839 -13 838 698 -167 -826 -665 351 882 452 -446 -857 -297 601 775
2229 775 161 -643 -740 -1 794 726 -160 -779 -634 310 924 478 -451 -840 -277 544 817 267 -712 -743 43
2250 43 924 720 -184 -847 -624 319 865 459 -507 -911 -301 566 824 125 -735 -752 18 765 684 -136 -818
2271 -818 -545 317 836 387 -440 -791 -292 610 796 127 -664 -729 124 745 639 -189 -799 -562 344 790
2291 790 409 -383 -818 -284 582 754 154 -632 -693 17 667 626 -162 -808 -446 394 730 395 -405 -814 -253
2312b53Q62J52p03p46NP64N84j05q17m95K50Q68L77l57q56l32N91Q24Q8n79p81
2333f59l1P92O36j29q06n82L39P02M96m04p91l51N64Q04J17n56q35K2P20N58p0
2354E36p48n33K94P66L94l76p52l11N22P13J73o01p16l9P20O41j13p92n86L98
2374d10P64L03l39p60k84N27O76J78o54o87M0P26O11j52p43m92J79Q02M18l51
2394C52p47k76N02O26J74n64o77QP20O04j87p81m53L21P97K90m55p00k49N04P88
2415E97Jn89n91K1O71N46n7p46n06K55P62L64m75o91k44N72O26J19o29o16rP14
2437I5N91k28p61l53L73N49L76l47p23k24M56P38N1n88o11O6O17N54j65p15m74
2458g23L74P52K92m41p51j10N15N41J64o20n69P3N94M89j31o85m04K42P26K64
$$ plain form
2312 -253 609 761 58 -688 -683 81 665 560 -257 -752 -502 366 743 386 -470 -802 -211 613 701 122 -659
2333 -659 -690 102 738 609 -197 -779 -440 262 758 354 -437 -788 -224 580 697 141 -694 -672 48 606 536
2354 536 -212 -745 -451 315 709 333 -419 -730 -208 505 678 77 -639 -678 42 683 570 -222 -808 -410
2374 -410 354 657 318 -442 -726 -199 477 655 1 -686 -646 80 691 539 -204 -696 -517 285 703 352
2394 352 -395 -671 -169 457 631 67 -610 -602 118 722 535 -246 -699 -378 419 709 254 -446 -695 -191 597
2415 597 598 9 -582 -561 110 656 599 -147 -653 -398 364 728 253 -438 -682 -110 516 635 6 -610 -619 95
2437 95 686 458 -303 -656 -283 266 642 295 -428 -652 -196 542 593 5 -606 -540 77 631 466 -249 -723
2458 -723 -349 403 695 254 -497 -607 -92 449 613 -7 -576 -503 91 580 449 -236 -640 -398 328 592
2478E92k82p19k25M56O92O8n72o49J58N83M74r4p32l71K46P12K87m08o72p9M15
2499a20O64m4n11n19nO20M74r5o61m40L10O68L38m34o55j74M52O11P7n51n46M3
2521d98O65M36j27o85m03K73O90J90l52n74j95M60N82R8n72n02N0O65L67j92o08
2542b32m05L12O51K15l56o18q9M66N25O0n81m74O8N84M39k54n41m14M46N60K04
2563E66m11m99k21M37O54o8n04n00J01O17L52j66o34k56K46O46K25m29o16p3N21
2584a2M97p7m75m74J29N36L91j83n81l06L81M86K43m33n66j26N30N38o9n23m61
2605e55R9N91L44j75n95k75L34N15K63l78n46j09M72N24r3m18m44J7O44L04j83
2626C36o14k90L78N55J41l19o55m8M94N32n4n88l88J48N26L34j73o20k46L50N60
$$ plain form
2478 592 310 -409 -634 -178 514 582 10 -639 -481 102 576 482 -250 -621 -375 337 624 216 -456 -535 -120
2499 -120 544 500 -11 -530 -535 85 559 464 -197 -637 -327 341 679 245 -410 -584 -132 479 556 5 -541 -498
2521 -498 167 603 476 -209 -612 -339 351 541 189 -385 -580 -120 462 560 -12 -514 -464 201 568 376 -232
2542 -232 -637 -325 326 541 185 -433 -522 -56 469 529 -52 -526 -458 126 565 311 -230 -644 -198 362 566
2563 566 155 -344 -565 -128 526 458 -46 -546 -445 172 524 358 -276 -532 -286 360 585 156 -460 -533 -12
2584 -12 485 408 -67 -541 -412 124 515 332 -249 -555 -174 312 555 122 -444 -570 -40 498 429 -94 -555
2605 -555 -456 135 479 304 -291 -566 -232 283 546 168 -378 -487 -15 509 416 -2 -446 -429 215 519 336
2626 336 -278 -568 -190 365 506 187 -468 -516 -22 510 456 -132 -520 -372 154 488 315 -305 -551 -201 359
2647C59J40m28m46q2M45M66J5n06m23O2N86L10k26n76k10L70N17J16l41n81k5
2668d58M64M48on56k93P5M73M10j95o34k31L26M90J72m21m69r9N02M40k5n02l90
2690d79J34O24K60l11m97k17L21M50K26m03o04L3N12M33j08m34l32O8M45M41l31
2711B31n24j91L33N19P7l51n12J9M66L65n9m66l72J76N13K52k45n51j43K86N07
2732C30J41m29m27mL59M44m1m64l46J33M75L04k57m69k58L90M58R3l64m59l6M40
2754A3M46j49m18m27K59N14J65k29m88j17K70M88J46m77m45J00L92L60j01m09
2774a07l57J96L96L00j76o02j08L46M53M7l69l84n3M24M29j12m42k86J87M72J72
2795D26k56m83j14L00M95P2m12m64R5M67K70j06m40l04J82N07K34l21m93j20L62
$$ plain form
2647 359 499 71 -375 -457 -12 454 469 -37 -460 -398 188 498 272 -304 -514 -144 373 489 148 -433 -458
2668 -458 6 454 448 -108 -401 -326 147 557 362 -272 -503 -177 313 485 64 -405 -504 -2 438 413 -89 -479
2690 -479 -345 279 539 228 -269 -486 -165 285 511 108 -496 -463 49 482 374 -60 -392 -324 121 562 231
2711 231 -293 -484 -151 368 445 94 -418 -399 67 432 373 -93 -465 -289 224 476 231 -320 -463 -177 330
2732 330 471 42 -385 -389 -30 414 373 -91 -437 -304 171 475 218 -251 -509 -119 339 432 68 -391 -427 13
2754 13 459 310 -108 -535 -276 238 403 174 -314 -431 -161 327 473 -4 -449 -349 43 403 302 -107
2774 -107 -464 -268 128 428 252 -350 -458 -112 341 388 19 -365 -418 6 435 323 -119 -405 -218 254 426
2795 426 170 -313 -427 -127 368 440 28 -436 -341 126 396 290 -150 -454 -272 235 469 148 -345 -465 -103
2816a03M19M2l22m18k3N11K86j32m21k55J85M76J33k17l95j96L26M49J02l97m43
2837c93Q4L93K95r8m04l09K02M66K06l32m16r5L37L92J4l37l71J0M17L73j99l92
2859a57k60K22M20J53k35m20j73L22M67O6m14l60J36K88L44j28l47l45K00M00
2879A79K64l18m91PL09L56J10l80m03M1M07K79j74l31k22K32L53K11l18m02j21
2900d12L42M22J4m60k67N9L93K69j16l75k32J31M60J70l37l85j4L01L08J8l19
2921c0l13K9L97L68k11l97j46R2M12K01l45l75j02L93K94O9m20l35K00L28K54
2942C63j38m72j28K36M51O7l22l68p9M15L13n8l11l17Q4M14K00j43l22k12K09
2963a18L33J56l00m04qL09L18N2l28l20O1L83K14j43m44j92L11M39pk88k95p3
$$ plain form
2816 -103 316 358 36 -382 -405 106 392 260 -161 -416 -231 245 378 161 -234 -430 -104 345 447 50 -393
2837 -393 -309 84 379 281 -123 -432 -230 236 442 110 -306 -401 -64 328 342 5 -366 -356 61 434 235 -157
2859 -157 -417 -195 225 378 143 -277 -450 -128 339 405 -9 -369 -233 55 399 271 -76 -421 -221 179
2879 179 443 125 -366 -359 -50 306 416 36 -367 -326 81 360 186 -145 -367 -135 218 429 111 -291 -412
2900 -412 -70 352 366 -94 -361 -302 91 360 244 -131 -363 -232 228 398 61 -324 -338 -37 271 289 -30
2921 -30 -343 -314 83 451 240 -157 -303 -211 201 402 57 -318 -420 -27 267 336 -84 -419 -219 109 363
2942 363 225 -247 -375 -139 312 379 57 -311 -390 25 338 280 -31 -348 -264 150 350 207 -115 -327 -118
2963 -118 215 371 71 -333 -341 -32 286 338 10 -310 -249 134 348 205 -239 -431 -120 319 312 24 -271 -344
2985c44K99M17p3l57k80J26L75K27l20l27p6J79M02R8l15l53j2M09K30n2k68l12
3007c27J02L39K26j53l95j10J50L88Q0k83l30R6K41L01Ml71k73M8M24J26o2m10
3029a89j40K16L68J11k71l53l5L41K79j40k89k28J53L51J46j79l61r2J85M50q4
3050B39k50k53NK62L34m5m58j85J45L24K33j79k93j17J49L15J13l43l59J43K55
3071C5K94q3l54j86P6L52K40k91k48j24K72K58J0k59k77N7K96K49j66k62j97J55
3093a53L24J20j76l18j28K58L60J1l09l05N7L24K10p1m01j14J52K97J61j52l74
3114b27k2J84K81J00l31k53O4L21K48j32l97j57J91K69J69k07l18j38L21L11j8
3135B59k65k42L9K72K56j26l08j61J07L63J10k32k71l9K48J72J14l49k74R6K42
$$ plain form
2985 -344 -45 372 299 -58 -338 -212 163 390 70 -257 -333 -154 248 346 31 -322 -334 75 305 253 -15 -327
3007 -327 -225 114 340 187 -208 -318 -168 220 300 17 -313 -217 24 325 329 -42 -315 -267 157 283 221 -189
3029 -189 -329 -113 255 366 95 -258 -293 48 327 187 -102 -330 -177 174 320 141 -220 -312 -127 323 239
3050 239 -11 -264 -259 3 337 292 -166 -351 -206 118 351 172 -121 -238 -89 226 339 -4 -363 -220 35
3071 35 329 246 -108 -294 -218 134 374 83 -165 -289 -17 241 251 -8 -285 -228 68 317 151 -111 -308 -153
3093 -153 171 291 115 -203 -331 -73 287 298 -11 -316 -259 65 275 204 -197 -311 -159 138 299 147 -227
3114 -227 -249 -65 216 316 -15 -268 -204 117 365 233 -164 -321 -130 139 308 101 -217 -355 -34 277 259
3135 259 -6 -248 -209 63 319 193 -115 -276 -169 194 304 72 -199 -238 10 182 296 -53 -327 -231 11
3156A1K93j13l33j39J61K71R5j71k77j3J89L16j05k54j97kL20J63M4l66j64J29
3178a42L46R3k70k83M8J66K19P3j94l25K9L87J45j05l40j08J38K68Q8j54l09K
3200b28J91L13m5l05k14R0K89J80j19k87j50J82L36K3j63l07j16L34K28m0k23
3221c1j70K1K35K03p8l20q6Q2L29R5k57j85j20K89K74j22j59k40O0L00J25j38
3243A07k65j61K04L20M3j71k85J6J30K71k5j94k38M7L53N9r3k65r7J49K35J24
3265B64j87k77l1K29K22k9k60j56M9K62J46m1l34j18J42K75O0j82k67M4K64J74
3287B49p9k67j08J8L10J72j89k49j41K18K69L6k19j75k7J78K85j38j88k08R1L02
3309A40N9j11k08j81K16K94J7j92k75O3K25J88k9l22o5M1K33J91k22j91q8J01
$$ plain form
3156 11 304 191 -142 -281 -120 151 246 75 -202 -215 -26 290 185 -69 -266 -268 52 215 259 -107 -271 -142
3178 -142 204 297 27 -256 -208 -42 177 250 56 -269 -240 147 292 187 -153 -261 -123 145 233 79 -230 -228
3200 -228 -37 276 231 -74 -288 -198 91 271 152 -135 -285 -103 233 256 93 -214 -330 4 232 192 -31
3221 -31 -201 -180 55 258 180 -140 -226 -144 185 280 23 -162 -282 7 281 159 0 -240 -180 120 245 107
3243 107 -158 -319 -115 205 248 77 -208 -192 -62 209 184 -10 -248 -201 152 211 118 -147 -244 -95 140 264
3265 264 77 -200 -231 -2 220 191 -69 -225 -176 86 232 191 -143 -261 -119 156 216 34 -233 -189 75 249
3287 249 170 -97 -205 -187 123 295 106 -143 -284 -66 203 239 20 -155 -182 -4 281 143 -45 -253 -162 140
3309 140 199 88 -120 -301 -85 209 226 34 -241 -178 47 235 206 -116 -181 -140 93 284 62 -129 -217 -116
3331a16K88k0j23l03J72J32J76j24k04j22R7J91J79j34k76q6J75K84K6k78j20
3352a86q0K74K10m0k74j07P4K74R9k09j31j43J51J78J46j85k59P8J58J92j39j88
3374a07j20J13K51J00r6l34QJ77J85k7j41k03O4J58J94o7k25j64J40J84J17j78
3396B9j69p8K02J65L8j79j63J3K27R8l7j50k16J41J56J32j33j90j28K55J10M2
3418A65k23j57J08J53J65p4k04j31R3K79J9j14k32q9K15K40n9k39j58K25J30K2
3440A34lj89j24Q9K09O9r9k17n1K65Q2pj76j24O3Q8J78j08j49j60N5K47J24j64
3464C2j00j07J73K16n5j63j79M8J64J39n1j35k26J27K26Q3j59k42Q7J27K39r2
3486A52j37j20j5J99J22k3k73r2J38J34Q5j81j59N3J53J37K4k28j20P7J32J35
$$ plain form
3331 -116 172 152 29 -274 -102 30 206 82 -122 -244 -147 44 223 89 -187 -273 -98 186 212 -66 -186
3352 -186 -266 8 218 178 -96 -203 -129 145 244 35 -96 -239 -88 90 236 51 -208 -130 28 220 81 -107
3374 -107 -227 -114 137 237 141 -193 -185 -8 177 150 9 -194 -130 28 222 155 -70 -234 -94 90 207 29
3396 29 -140 -218 -16 149 187 8 -155 -142 85 183 146 -4 -220 -79 77 209 76 -114 -242 13 123 165
3418 165 -58 -215 -107 46 211 137 -67 -198 -105 174 193 79 -153 -242 -27 213 154 -85 -243 -18 112 134
3440 134 131 -58 -182 -93 116 185 86 -131 -182 83 165 158 -18 -142 -79 9 187 79 -70 -230 -175 72 196 32
3464 32 -68 -175 -2 214 159 -4 -183 -135 29 168 117 -18 -244 -117 109 192 33 -209 -122 5 244 152
3486 152 15 -105 -120 79 201 178 -95 -187 -49 85 170 -11 -170 -117 36 173 197 -31 -151 -74 58 193
3508A93j08k42N1k6K80N0j54j88J9J28J42p7q0j09lK21Q9j12j69o5J10J73L8j28
3532C3k30j2J93K02j21m2j80Q7J58L6m7j33m5N7J94L6q3k79J7J90J36j3k01j58
3556b05J68J45R3j46j95lQ8J78l0j31j07L9J45P9j7j44p4l9J47R8k3j97p3J69
3580c5J45N7q9k13m9J74J70K2k79q8J21J27R6j43j38%J25J06K4j31j32J2J72J87
3604B41j54r3j90J37J00R1j52o4n4J07J77n6j35j27M7J27J84r4j36j15N2J92O4
3627A49j67o7k9Q4J26J1p9j01p9J55J57m4j85m2N2Q5J04o8j63j37K29J79lk36
3651f9l5l0J37R7l5j04r4O0J03J14j17r5o0M9J84K1j15j05lJ17J64j7j97n4jK09
3677A24K4q2k11O4LK32p5j20p6J0J97J03r3k01J8qK00k2l3j20o5M4J69J6p5j45
$$ plain form
3508 193 85 -157 -106 -132 148 198 44 -144 -125 3 145 68 -12 -121 -124 97 186 74 -95 -160 -50 123 161 33
3532 33 -197 -209 -16 186 65 23 -157 -70 88 124 77 -56 -101 -44 150 186 103 -176 -159 31 167 154 -47 -205
3556 -205 -37 108 201 55 -140 -143 -55 123 93 -38 -145 -106 39 118 101 -43 -117 -156 -9 89 66 -131 -204 -35
3580 -35 110 167 78 -135 -184 -10 160 182 -97 -185 -64 63 159 16 -122 -122 3 109 133 2 -130 -118 54 241
3604 241 87 -6 -196 -59 41 132 -20 -84 -138 -31 146 90 -45 -172 -125 2 186 92 -44 -159 -107 85 149
3627 149 -18 -85 -114 -30 96 107 28 -73 -152 3 160 116 -69 -111 -59 26 130 62 -101 -238 -9 170 167 -69
3651 -69 -104 -134 3 100 65 -39 -133 -73 30 144 27 -68 -128 -79 105 126 11 -94 -97 20 184 167 -30 -84 -85 124
3677 124 148 66 -145 -81 -78 154 79 -41 -117 -107 90 193 100 -101 -83 -91 109 87 54 -66 -131 -87 82 98 23 -122
3703a22L0J31P5k6j56k9K3J30J14j06j40l6J75N4J5j55o0O0J13L6m2k13K4O1J32
3728H8R0j19j36n2R2J13lo7j74Q3M0Q2nj31k7M1J81M1j17j81L1J02J45m7o1j36
3754a27N6J25M8m3j10m1R5J9R5j03j50O5J12O6jr2j21L4J25RK5j67L5L0J18P8
3780A80j02j53L9N6P9J6q7r3K7J36J5j13k7k4P7L7Q6j47j25K6J93K0m2j3j95N9
3806g5J46K9m8k1j19N5J31Q4k29Ko7R0J56p0q0m7j7J70J4j14n3q2J21R3P9j11
3832C7q7pO6J12m7j64l7O4P1J07r7m9q0R9P0Q0j47J8q7J32O2K6j18j15P7R5K4
3859A05j1j82j5M9J55j7o6j18K0J34J01k4k07J3M8N1Q2r9j07k0Q4Q8Ro9p8L6K9
3886iJ60m2j46o8K6J31nn9k0p9M7J09M8j06o7rJ23N4pj21nQL9L0k3p9l4K5J52
$$ plain form
3703 -122 -92 39 114 88 -68 -97 -74 56 170 64 -76 -112 63 117 132 -23 -83 -23 90 126 84 -129 -105 -44 88
3728 88 178 59 -77 -129 -37 76 73 6 -168 -85 -45 37 32 -99 -126 -85 96 137 20 -161 -130 -28 117 70 9 -127
3754 -127 -71 54 102 59 -51 -92 3 22 117 14 -136 -71 41 107 106 14 -107 -73 52 61 86 -81 -46 -16 102 180
3780 180 78 -75 -36 20 99 115 28 -65 -38 98 113 0 -27 -51 26 63 149 2 -123 -97 96 116 74 61 -134 -75
3806 -75 71 100 52 31 -88 -33 98 182 -47 -45 -112 -22 134 64 -16 -63 -80 90 104 -10 -63 -145 -24 69 148 37
3832 37 -50 -57 9 121 74 -90 -127 -63 8 115 18 -31 -111 -12 58 138 -9 9 -78 54 116 142 24 -91 -14 81 105
3859 105 94 -88 -103 -54 101 84 18 -100 -80 54 155 131 -76 -63 -15 36 118 19 -88 -108 -24 64 73 4 -74 -38 -9
3886 -9 151 109 -37 -105 -79 52 47 -12 -32 -111 -64 45 93 -13 -80 -89 34 88 81 -40 -45 -37 2 32 9 -70 -104 -79 73
3915G3Nj01l2o8J68O2j6j39q9Q5J35j4n1n8k1J3M9J12r7q4j4J09N9l1q7l5K4P5
3943C2Q0p4r3j05J70M2pNj22K5L8J05o5r1n6Q6J31Rr6p1m4J07M0Qj00l5L1P6J9
3972D5j9Lj61J58R0k5p8l7o8M8J28ko8k9p5Q6N8N0q8j29J02Q9l0p7J6m7L1J04
4000G5Rp6m8K4RR8j55K9k3J8P5On8m6L4Q7nj4n9o3N9Q8L2p8j15K5Q8L9ql8p6n1
4032a18J0J41K0q7qrJ18J1k7q5m7Q1j1J19j08o6L5J0J98q2p2o5K3O1L4m7q9k9
4060h9L8O2Q8p3n7n6J18M9J4j26m6L9L1P0k6p9j1K1M3N7p4J5k7J25Rp7or7L5R9
4090F9j3j0j24M6JR2N3j15n5K8P1N4k9n3j05Q5M7M8j39Pk5k6K06p8p1j1P2QoP2
4120I9m9j18N9O2jqn9m3k1J09N1j05n2%J12mk0k1l1K1M8L0k7l3p2M7Q8j1j4m8
$$ plain form
3915 73 78 -23 -55 -123 45 107 91 -48 -137 -52 83 69 18 -40 -61 -48 1 113 16 -68 -82 27 86 55 -32 -67 -43 32
3943 32 112 38 -55 -160 10 52 45 50 -72 -47 -9 96 31 -60 -116 -30 101 110 14 -57 -101 6 46 54 -46 -81 -50 26 45
3972 45 26 29 -132 26 116 91 13 -24 -92 -44 84 82 14 -15 -90 -4 54 104 16 -113 -11 78 48 -29 -13 -60 -29 75
4000 75 84 8 -40 -16 -7 91 -64 -35 -58 -40 35 41 -17 -63 -29 58 53 39 -20 -83 -24 64 96 18 -97 -72 16 55 47 9 -67 -118
4032 -118 -108 33 53 -34 -42 -51 67 78 51 -34 -81 0 -11 108 0 -66 -31 -21 177 95 23 -42 -19 42 76 29 -60 -89
4060 -89 -51 11 99 26 -31 -87 31 80 94 -32 -78 -39 -8 62 36 -43 -54 -33 10 67 -7 8 -19 106 115 38 32 -65 -30 69
4090 69 56 46 -78 -32 -31 61 114 -1 -56 -28 43 97 68 15 -90 -5 42 90 -49 -42 -67 -93 113 35 -36 -47 25 33 27 99
4120 99 50 -68 -9 53 52 44 -15 -58 -79 30 81 -24 -76 -76 36 32 12 -9 -40 -19 29 59 32 -1 -73 -26 62 51 37 -11
4150a1n9P9P7k2o1l8K6M9Qm3M3n7k7P4k6k5o3L5L0K8l3j8o8O7P5K2j0j64M6P6
4180A0NLk9K3m8M3LJ6k5m5O1L4nm1q0QK3M1L6o3l1JJ15lj6p9jL2LP0j0o6m1J7
4214c9J30q1j3m6rqJ28o5Nl3N0PO7j33j0M4n4J05jo4m5pJ20k5K5j21m1O2O3P8
4244H9l8j65M5N3N8p6L2J8p5M6O9n0l3J4n2O7N7k6q6M7l9N4N2p0j06M2P4N5k8
4273B8o7L4nQ5k7m9m3k8J23Jk6j2j08J9J55np8l7m6P3Q8l3J2r3Kk4R3Q3j25q8
4303i8Q3L7mP1j21m6J09j5N4n9l3j05J64l8l0N0n6l0K3P6Mo1j3N6N0J2j04J4n8
4332f8M1J36q0o4o7J92q5n7J2k2M2j4O2L5l9m3LK3jK3l2%J1k4P8p6o8J7Q0l7K3
4363ALj6o0L0J03L1r4k0o2R9J6k1Qr2Q0jJ3m3n4P1j0K2l2k2L8j8L9J4L8j48l1
$$ plain form
4150 -11 -70 9 86 64 3 -35 -9 40 48 5 48 -9 -36 38 12 -13 -76 -41 -11 17 -16 -34 -102 -35 40 62 52 -112 -66 10
4180 10 15 18 -11 12 -36 7 10 26 1 -44 17 51 46 5 -75 -67 -44 -3 33 -30 -61 -60 55 52 36 -43 -44 -12 -9 61 51 -15 -56 -39
4214 -39 91 10 -3 -49 -58 -66 62 -3 2 -31 19 26 93 -40 -50 -6 -60 45 44 -20 -65 -72 48 23 48 -73 -114 -52 11 89
4244 89 51 -114 -69 -16 42 -34 -2 16 -59 -13 56 6 -27 -13 -65 2 59 33 -53 -6 -45 9 61 -9 -115 -73 1 56 28
4273 28 -39 -5 -10 75 48 -1 -44 -72 51 52 26 14 -94 -75 80 75 -3 -40 -86 -13 75 42 54 -39 -37 -61 32 115 -10 -98
4303 -98 -15 22 18 89 -32 -78 31 16 70 11 -22 -127 37 -1 -31 19 -37 -67 -44 32 36 -25 -38 18 68 80 -24 -10 -68
4332 -68 -27 109 29 -35 -102 90 5 -52 -40 -62 -20 -34 28 63 24 -19 -16 7 6 29 -3 -3 8 -16 62 -14 -82 -65 15 -22 1
4363 1 4 -12 -72 -42 61 92 -2 -22 -84 15 31 10 18 -74 6 5 18 -25 -79 -8 -18 4 -28 -50 -12 -30 9 23 61 -87 -118
4394a18J33K0N2n9n6o7P6P7o5n7R5p0P8L9o6Jp1L1K6K7p1N2k0k7R9j4p5L1m8K0
4424b7P0q9K3j2K9O5mq5j9O4M8l9k8k2k0J11r8P3l4k8J5K1M6k3m2N5m1J7K9k3
4454C2l3q2P3M3Kqk9l5O7R0j63Ok1M6R9j15N9m6Q0j24J32n1j5q6K6RL6J9M4l6
4484A9l2K3J8K7q3k0MR1o6J8n8P2j6j8J09r0k4k6M8L6l4l8J1O7q2j3J0j7lJ32
4514F5l2j2o6MK4j6J38j40K5o2N3K8j0M0l7n1N9J9M4m3o8rK8N2j3k9k5N1k3Q7
4544H1j02PL7q4M9jk5Jj7Q6J2l5j8K0q8J10pJ5J3k4j3jj2Kk7nL5O0p5J9j0o8J41
4577G6k8l9m3oO8L9n8L5m4rM0o3N9q7rO5L0L6j8q0ON6j6QL0j17Q7n4%M7m7L6L9
4610C9m3j7N7l7L3k1L1l0N3p1q4J43qr1J6Rn8K0J00k6m6k9Q1p6N9q3L7PJ9K8k5
$$ plain form
4394 -118 15 35 87 28 -28 -95 -19 58 -7 -64 31 -39 39 78 12 13 -58 -27 -1 26 -45 7 -13 -40 59 45 -30 1 -47 -27
4424 -27 43 -46 -23 -35 -6 59 55 -30 -49 15 63 24 -4 -26 -46 65 -33 40 6 -22 -7 14 60 37 -5 50 9 26 55 32
4454 32 -1 -83 -10 33 35 27 -2 -37 30 120 -43 -37 -58 -12 87 -28 31 -15 65 -59 73 22 7 -79 -53 -44 -8 11 55 19
4484 19 -13 10 28 55 -28 -48 -44 47 -19 -1 -59 13 -3 -21 88 -2 -26 -52 -4 32 -2 -40 -29 38 -44 -57 -47 -64 -67 65
4514 65 33 21 -45 -41 -17 -33 105 -35 -10 -72 -19 9 -1 39 2 -49 10 29 73 30 -38 -47 -19 33 20 -9 -34 17 -6 81
4544 81 -21 -14 23 -61 -12 -13 -38 -37 -54 32 44 9 -9 11 -77 33 26 41 54 30 17 16 4 6 -21 -26 9 69 -6 13 3 -65 76
4577 76 48 9 -34 -40 28 67 9 44 0 -9 31 -32 27 -60 -69 -4 26 62 44 -36 -30 26 10 18 48 -69 18 -36 -36 11 -36 0 39
4610 39 -4 -21 36 -1 32 11 42 12 65 -6 -90 53 45 -46 -30 -21 -79 -59 41 15 -31 -60 21 -55 4 -79 -42 -35 -16 12 -13
4641a3J4l6N1p2P1k9J2M5J0m3J5m0n5Q6J0M0p5rJ9k8L5N0p9jJk4L3MK3O2j02j4
4673c9RP0j31O8N9L9o1l4j0n2M9K5l2l1M3J2L4pPK1l4l3L7pm5R5k9m3kK0j3qk3
4706d6N2L4n4J6o7Q4j0oK6m7mO9%J6k4q0lL9K9j6l0l6J8J4L8l2J8L2Km2J7o0j4
4739f7N3P0q5M2j8np0Q5M2m9J0Mm6K8L5J9j10L0M6J8m9J4L7%k9n8P4J8m8L6o3
4770c6M0J7J6n8P4p3N3l4k8L6nNk4L1Ok8M3m7PL4J3l2J3Pk9nJ1k6O1l1j1K8M0
4803F8n7l0J5oJ8m5k3R2o5k4P5l3JM2j9n4J2QL7Rq5Q2lKmn0M9JR7r5K2l6%N3k8
4838B6k1rQq7R2N1l5p8O6j0l0j4Q7o2J7qJ8JQl6J3j4L8l1l9N5m4L2LK0J5o7j9
4871e4ON4m3L8j2mO3j2l5J02q9n4N7Mj1pR3j09M8p9O1l9m4J6O3kl8Q3k1m3K3l3
$$ plain form
4641 -13 1 -35 16 -56 15 -14 -2 43 53 10 25 -15 -70 16 26 66 -9 -18 1 -27 8 58 -21 -22 -21 -45 -12 -8 15 77 -25 -39
4673 -39 -30 40 -91 -23 36 75 14 -20 -30 -82 -33 -8 -40 -71 -28 -16 18 11 18 39 5 -28 9 2 -43 52 23 -20 -22 -2 -15 -23 -46
4706 -46 6 40 -14 2 -65 19 9 3 29 -18 -22 47 47 63 39 -41 -44 -5 24 8 -22 -58 -40 -26 12 -20 -2 30 32 -10 7 -53 -67
4739 -67 -14 56 -29 13 -5 -10 -80 5 47 -2 8 12 -34 -6 29 48 -62 -32 14 32 -17 -3 34 34 5 -53 21 39 -9 27 -36
4770 -36 4 21 37 -21 53 -20 33 -1 -29 7 2 7 -17 14 20 -8 35 -12 -5 29 42 10 23 30 1 -4 7 -19 42 11 0 28 68
4803 68 11 -19 -4 -10 8 -37 -60 32 -33 -57 18 -15 -14 28 9 -45 -33 -25 12 21 -64 18 15 17 13 -37 12 13 110 15 37 1 1 54 26
4838 26 5 -4 4 -83 9 60 25 -53 13 3 -27 -41 46 -16 1 -7 11 12 20 -16 -3 -17 21 -10 -49 6 -38 -6 -3 17 32 -35 -54
4871 -54 -48 6 -37 1 -11 -15 48 36 1 103 14 -40 17 21 10 3 96 -13 35 -44 17 -22 -66 -50 13 11 -27 56 35 -8 15 -18
4903a8k8J12m6%o6MN8m3J9j4P2n5L6q0L7jk0m6Q5PJ3l6J7JL3K7o8j6J3J9l5j6
4935c5K2KLM2l4m5N1J7J1m4L0m8J6K4L3Pmn1N1jm0l1L9Jm5K7K1m2P0p6J4j8N3
4968B0O1m3p4J3j3N7J8j2j0L5o6n4L1O3n1l6J20j8q0j6L9K1l2N3p3M3J1k0J6l6
4998c3Q9j3jPMp0R3o1n4J5O8j5k1K9n%j9L9p1J4J7Nj0j4m9Q2j3M6n4k6N8p2K9
5031fR0r3K4J3k1m5qK7N7p7L6N5n6Qj5L1%rL9k5k1j6K1n2K4L4oKq3N0J0L8L0m6
5065A0J3k1OM5p3j6J4M0n3N6l1L9n7kN0pJ1o9JJ3j5O0j4M5k3l9j7N3j3K8o9K2
5097a3Q4l4M3q6J2lL0m3KkK8l7NN7q6L1J7jm6P4n2L0kJ5q2Q5MKm7J4N2p6n1O0
5131a6L9p4N9p7J03J1n7M8l4N3m8k0J05q9J1q4J22m9k0L7q1K1L4L6j4pn6J15n7
$$ plain form
4903 -18 -46 66 20 20 -46 -42 16 -27 -8 -22 50 -5 31 -49 -12 -13 -33 -79 6 13 26 -10 7 8 41 68 0 -16 -3 16 -19 -35
4935 -35 -13 -11 -8 34 0 -45 6 23 34 -10 20 -28 -12 12 45 52 48 -3 48 47 7 -24 15 16 -29 -2 19 -23 47 -29 -15 -33 20
4968 20 81 38 -36 -23 -36 21 39 27 17 52 -14 -68 -37 26 -25 -61 59 41 -39 -55 -16 5 -27 26 -47 -4 7 -13 3 -33
4998 -33 56 43 42 49 53 -17 76 15 -39 -24 44 29 8 37 32 32 13 52 -19 -5 12 17 7 -7 -56 26 13 59 5 -21 37 -35 -6
5031 -6 84 -9 15 28 7 -38 -46 -19 38 -39 -3 52 -4 4 -11 20 20 11 50 25 4 -12 9 -43 -19 15 9 11 -72 -22 -12 26 56 10
5065 10 23 2 8 53 -20 -36 -22 18 -35 21 -10 29 -28 -30 20 13 24 -45 -44 -31 -46 14 0 45 22 -17 -34 19 6 34 -35 -13
5097 -13 71 37 80 -6 6 3 33 -10 -8 -10 18 -19 -14 43 -43 -12 5 4 -42 32 -20 10 8 23 -59 26 30 32 -15 -1 51 -25 -76 -16
5131 -16 23 -51 8 -69 34 45 -12 36 2 55 7 -13 92 3 14 -70 52 3 -17 20 -61 -40 -6 30 16 9 -47 68 11
5160A1j6j7K7O2q2j4mJ0O3n6k2N2l6L6kM1lJ0l2m1K3j5k5K0Pl7N4l6R7n5J8J8
5192E6n4L5n9P2n6J7j1L5LQn5l7K0P0n2M3j6rl3m8L2K6j4J6J8k0M4M8j41O3J6
5223A7M3Ml2Ll2m5O4j5K2K0m4n2M6qm0N0lok1L5N4r2M9J5n8JJ0k6L6QL6o1m0P9
5257A7n3L0m4N1K3K7j9k0m1K2L6J2l5M0l4m6L3J8L7m1KKJ9k8m8K1LN8l1l3Kn7
5289g7P1JJ3kRJ1n6j6M8K6k5l9L0k3M0p5J15p6M7J1o1L5r8R8pj8L6j2m7K0K7j
5321Enl8J2K3M3n1M6q0M7L7m7j8J3Pk1N4j18Q3J0nM9K3m2Jj5L4n7j7R9o6M6n9
5353gM4j03K3L8N0k6o1N3m7N9r5N4PJ1Nlo5N6kJ3J5M7j32P9kq2P0j4oj0L0k3k5
5386d9J04n0j9K6k2K7L8m5L7n4L9l3nJ8M1l8k6Qjj7k3N4J5j8oK9J1K1l5k5j2R0
$$ plain form
5160 11 -5 -22 5 67 -15 -29 -33 -23 40 -16 -38 14 -22 14 12 53 50 60 28 -13 10 -5 -30 -10 -3 -40 14 -22 75 20 38 56
5192 56 2 37 -22 50 -6 11 0 35 38 46 -9 -46 -26 44 -8 35 19 10 -23 -71 -39 -13 -27 -11 7 -13 31 79 -62 1 17
5223 17 60 64 32 35 3 -42 22 7 29 49 5 -47 -1 -9 -49 1 -2 -8 -29 6 60 -32 17 32 -26 -25 -15 -41 -5 3 39 -22 -62 17
5257 17 -36 -6 -50 1 24 51 32 12 -29 -7 29 41 6 46 12 -34 -1 17 54 13 15 17 36 8 -40 -19 -16 42 11 -22 -20 -77
5289 -77 -6 -5 8 6 15 26 -30 -46 2 28 3 -36 -6 -29 11 -64 51 -25 22 33 -28 7 -91 7 0 -18 18 6 -41 -21 6 5
5321 5 0 -38 -26 -3 40 -11 35 -45 2 39 -8 -26 -13 -6 -27 27 -91 -8 2 -3 46 69 27 28 13 47 -10 -27 72 6 52 -7
5353 -7 37 -66 -43 -5 45 19 -42 11 -36 23 -72 -18 -11 0 5 2 -63 -7 -9 4 19 66 -66 13 11 -71 -1 -15 -21 -31 -1 -24 -49
5386 -49 55 5 -14 12 -10 17 55 10 47 -7 32 -1 -6 12 53 15 -11 -3 -4 -21 -44 10 25 7 1 30 41 62 27 2 -10 80
5418H0q7L9l0mK8l7jj7L1o7J21p7Jn5J32p3j3J4K5q7Q4J8K%KNk5m1P3j7m3M0o3
5451d2L2J8N2k4k6m5N0pK3r1O8M5L1Pn8J1n9Mk5K1L9p0Q5l5l0JK6m3O9l0k4Jm8
5484g4N9k9O1l2N4N0j34P5l1o0J24l8k1O3q6J8Po4K6j4P0r6R6j2n0M1j9O8lk6
5514B3j3jj0m4O0N9n5l9j2Q7l7l5K3o1J9M6J6j5k4J4J7j0Rk3j1QJ8kk9O6o3nj6
5547d0R8n3o1P8o5M8Qj3p1J00k3L3m5J9j6K2n1M9l1mL1k9M7p8N0K0l5O0n9n6M9
5578a8j8P0j22R6M6m4J9o3L9K5q8M2L5k8J2qm1P3o2M6K9o2M2j3j2k0M5m5O0n2
5608a7Q5m2o7M2J6L2q8Pk8O2ML4Qj04P7L5l5Oj7N7l4k9Nk0m0lQ4k3Q7p6j1J8m7
5641b2K6K4kKp0N0Q9o7%K1n2j7m2L4L3m2P3l3K5mm9L1pnJ2LPK4l7l1K4j0J9o9
$$ plain form
5418 80 -7 32 2 -2 26 -11 -12 -29 2 -65 56 -21 -20 -75 57 -16 -29 -15 10 -77 7 25 27 27 29 34 9 -32 41 24 -19 21 -42
5451 -42 -10 8 60 36 10 -35 15 8 31 -60 8 53 84 91 33 44 -15 -11 -36 -15 24 -46 39 4 -26 -25 1 -42 27 -3 -27 -26 -74
5484 -74 -15 -44 17 -15 39 89 -45 30 -1 -61 63 25 4 67 -19 -1 6 -58 -32 -46 24 -72 24 12 -38 3 -16 52 49 23
5514 23 10 9 -1 -45 15 74 19 -20 -32 55 18 -17 6 -55 -36 10 26 11 -13 1 18 8 17 -6 -17 -9 9 7 -22 44 -19 -24 -40
5547 -40 58 5 -56 22 -43 5 13 0 -71 29 6 39 -6 13 -3 19 -32 17 -14 -18 13 -16 31 -47 3 23 -12 48 -11 -67 -18
5578 -18 -36 34 -88 8 54 10 29 -34 5 30 -58 -16 19 -9 3 -5 -46 27 -35 11 40 -22 20 7 -5 -25 20 -25 35 -17
5608 -17 68 26 -41 1 17 49 -39 -32 -60 2 6 40 48 -56 21 56 21 27 10 67 33 4 9 -11 -51 -54 30 7 94 18 7 25 -22
5641 -22 4 28 26 28 -42 8 97 30 30 51 -1 -18 -60 -26 7 -35 38 5 30 26 -23 8 1 -4 8 11 18 42 5 -26 -2 -12 7 -62
5675f2Q4M1p8N6k9L2l1J1m0k6J6M1L0q9N8Rk7rk0J7N0r7Q9J1k9k5Q4q4m7K5K0
5706a9J0l8O7rJ2o1j2M4N1n1L1o9K0M8l5K8k3M0j4m2K4j5jRP8o3Kj3kkj4N5n5
5739a9J4K8J0n8J5L9m5J0J9j7J0j6J9K7m4oJ0m1N2k3K0k4J3nJ1Nk2J4j7%m8R0
5771B1m1N6M9o6j15P5OrN0o3rj8j1O8l8O7k7P6j08L6l0K2nn0J3M8Qj9K4j8QJ9
5803A9lk7J1lk6P1nm6K5n4M8l8P5q1N4l0J9p3J10o3K1n0L4j7Q4m2L8o5l5k3Q1
5834IN4m8K1o3LM4l5N0Pl3M3%pK4m1p5J33r4K2n3M7l3M9M2p2L0m4NK4J6l0J6j2
5867am0jM2k6O2%J0jq6kK0L6k7J3Rm1J2KN0l2m3Q3K3o2n7O9M4k9j9k5RJ6l8KL6
5902HN4l8KN2n7j9N7k4K0l3Qm5RQjL8p5K5k0lP0o0K5k4j1Pm2K5M4M8o0K6m3P0
$$ plain form
5675 -62 22 63 -15 41 12 44 13 24 -16 -42 -26 15 45 -44 14 23 -4 -13 -33 -16 34 -63 26 37 8 -17 67 -17 -64 -39 -19
5706 -19 -9 -47 20 11 23 -38 -50 -6 45 -6 25 -44 -24 24 -11 17 -6 34 20 -22 2 -13 -14 -5 73 10 12 -1 -3 -5 -19 36 -19
5739 -19 -5 23 33 -25 -10 29 -16 -6 13 -4 6 -10 9 36 -8 -14 -4 -45 7 -16 4 -20 -7 -12 -1 4 -18 -4 -21 -21 -69 21
5771 21 -20 36 85 19 -96 -21 -15 -24 26 -37 -46 -64 -75 -7 -45 22 -5 71 -37 -1 -31 -9 -14 -64 -51 -3 5 -14 10 -8 0 19
5803 19 16 -11 0 -3 -29 42 37 -9 16 -38 10 -28 47 -34 20 -10 9 -64 46 -17 4 -46 -12 -29 55 13 51 -14 -49 -72 9
5834 9 63 15 36 -27 -24 20 -15 35 42 9 52 52 45 69 28 -47 86 -8 14 -39 8 -25 24 66 -6 24 -20 -15 9 25 -5 11 -1
5867 -1 -41 -42 0 -26 36 36 46 45 -41 -43 -23 13 -14 -1 8 -33 -21 -19 31 -1 -44 39 62 0 -57 12 56 27 8 -17 -8 8 -30 -28 8
5902 8 62 24 26 78 21 2 59 35 55 22 30 -15 -6 2 1 39 -36 -11 -31 -34 36 -24 1 -23 -34 -27 -69 -44 0 48 -12 14 -29 41
5936D1n4o1J34j6q3L5n7J7rL6P6j6m1m7P7l0nj2K8K3j8M4k8%m0K7j4M5l7j8QM
5968In8O1J1j3K6j6o3lN4k5L1o1M9m3L5M0%k9N0m2k0L8j05J62j06L4J8m6jL0R
5999B6p1L9k0n3Q1o7O3Q1rm7K0r0N3j5k0qO0n0jM8l1P6k9k5jM3n7o2J06k7n6L8
6031eJ4j8Nj9O5nrJ5m5K5l6m0J11k7n7L6RL1j3l5n2RJ08o3KJ8L5j8qn8m6J11r0
6064e0M8J3L0m7k3J6N7j6m6J4j3K4j1M4n0N6k1O2j17J9PQk0K2L5o3mR2l4K6l7
6095B1l3R7n1o3P6j7n6m8M4K2oL1l4pR0n0m3N7n1LK4k7jRj9O0j5N0j1oo0M0m9
6128b3N5j18R9k7OM3o6J09j03M5Pm3KJ4O0p5M1n6O8l8j1k8no1J33l6N5m7Onj0
6159iK4k6J5K1l2o1M5N0p8O3L6o7J6J1Jl1J2koL1K8l6J5m0L6l6K7n2NQ1j12R0
$$ plain form
5936 41 -13 -74 60 44 -39 -4 -61 -44 -53 -17 59 43 2 -45 32 2 -3 -15 13 36 18 62 34 34 -6 21 7 52 15 -3 5 9
5968 9 -49 12 23 10 36 20 -43 -46 8 -17 14 -47 2 -41 -6 34 34 5 55 13 -7 31 -74 88 -18 16 34 -12 -13 17 26
5999 26 -45 -6 -26 -79 2 -65 -2 79 70 23 43 -47 6 -9 -29 -37 23 -27 -28 20 -11 65 36 11 10 53 -4 -66 40 13 -43 -5
6031 -5 9 -9 -4 -23 42 37 28 43 -2 23 -13 -53 58 31 -26 10 19 50 37 2 -50 -41 67 4 6 24 59 41 33 -25 -71 40 -50
6064 -50 -2 11 41 -6 -29 -13 44 28 -18 -4 -17 7 -4 40 -10 46 25 87 -30 -11 -4 4 -16 6 41 -22 -26 66 32 58 21
6095 21 -12 85 34 -29 47 30 -26 -74 -30 -8 -14 17 -17 -24 66 16 -27 30 -21 -18 6 -21 -22 -13 -32 28 13 63 52 46 -14 26 -23
6128 -23 32 -86 13 -14 -8 35 -31 78 -25 20 27 -16 -14 0 60 -15 26 -30 38 0 -11 -39 -44 -105 28 -8 47 0 6 1 -9
6159 -9 15 -11 4 25 -7 -68 -23 27 -51 12 48 -19 -3 8 9 -22 -10 -12 -18 13 41 5 20 -20 16 -20 7 -45 -40 41 -71 19
6191A9m5K4KRNM5l6l3M3j2o4M8M0j35Q5L0k9L3ml2m0M7J9p5M7o1P8M0l9M5q9m8
6223h3J38l2%N0m2n5K1J6o5P8j6o3Q2nlj03J90j47L9J0k1M7j1LMJ0q3M7J1k1q
6254a2j3K4kJm2P4lq2J14p2L5n6N7q0L4j0L2L1J3J1o6P3j49N0N2j9K7Pn1j0K4
6285hJ5oK8k2K1n7nO9nm0J8o1P5J6p3N8l7Q5n2J0n5j3N3J0n9N9k3m5L7M1o1M0
6317A3j1lo9K1j6P4M7n1m4O2j8JJ1m6M6m7O9n2N6n3k2N2Rj5j7J7K8Kl3k3j9O5
6349C4n7O4n1QJ4k7J5j8L0m9J7RnJ0L9K7o6j2L7m6mJ01n5l0M6n4J4%O9n2j1j0
6381a3L7p2L6J5l3K3J3j4K8m3N7j7j0plJ2K3Mp0KJ8lj0O5n1N1o5L5o7P6k5P9j19
6414d8R9j9J7p2M6K3q5L0o0J02o3L8K4%m6lJ2J2%J3k8m2P1Pr1N3K1o4j6K8j3M9
$$ plain form
6191 19 -26 -2 0 9 14 59 23 -10 33 21 -43 5 45 -90 -5 25 -4 29 25 -7 -47 0 19 -56 -9 -70 8 48 9 54 -35 -83
6223 -83 55 23 23 73 31 -24 -3 13 -52 26 10 -53 29 24 21 -82 108 -39 0 10 -11 36 25 28 32 42 -41 6 17 -4 -12
6254 -12 -25 -1 -3 -2 -44 30 27 -55 59 -13 22 -34 23 -57 -23 -33 -1 30 43 54 -12 61 -88 -38 14 -5 22 29 -22 -32 -8
6285 -8 7 1 29 7 28 -29 -34 35 30 -10 8 -53 22 38 -35 23 -14 71 19 29 -26 -39 14 24 -35 24 1 -44 -7 34 -27 13
6317 13 2 -1 -70 -49 -65 9 56 5 -39 23 5 6 17 -29 17 -30 39 -13 43 -10 -32 20 29 14 -3 14 42 44 11 -12 -31 34
6349 34 -23 41 -10 -2 12 -15 0 -18 12 -37 -20 -11 -16 -6 33 60 -6 -18 19 -27 -31 70 15 -15 31 -23 -9 -9 60 8 -3 -13
6381 -13 24 -48 -12 3 -30 -7 6 -8 20 -23 34 17 7 0 -3 9 32 36 -34 -32 -14 -17 -27 38 -13 38 -27 8 -59 17 -8 71 -48
6414 -48 51 32 49 -23 23 46 -39 -9 -69 33 -30 8 32 32 -14 -17 -5 7 7 20 -8 -50 21 28 -63 -10 11 -53 -69 -41 -54 -5
6446el8Q2p9J1M5Jlo9J15k5m1J8lk3J1pK6L4o8J3nN3j5L3n9J8K9q2O0Krjm4M1
6480A6m3L1L4j5m2j0Q0j09L2J0K1j9kPk4NK6M6m4k4m8M7m3P5J6L1q2N2k2o0pN2
6512a3L3l9O1o8J06j00N0J6n1j4M1M1r5L1J9o0M2Kk8L8K5j01MqJ39q9M1k0l4n3
6542h4J04p9O0m2J0K4L7m8p9M6O8j5l0N2L8q3N4k0m0M4j7L6r8O4j9M2p0L3%k6
6572c8M6n7N9k9K8K8K0k9n6K2J17j11LJ6l2K9n3P0j7m8M6J2o0K0l3M1jj3l3L6
6602a7L5n9n3J09k7J3k8J3Nj3QN1k9nl6K0J3n8J2J7M7K9j0J4p5J8K8p1J3J8RO6
6634E7p5k6R2j22K2Q0l8K9j8j9R3j12J6K5N6kp6klP4n0N0o3k4Q6l5qJ7jp7j6J6
6666e4L8JP1m9m6M6l4pRo4R9Lm1M6qm2L3j9qL6pPj5j0M6n9mM3JJ0Kl0J5k5J2l6
$$ plain form
6446 -5 -43 39 -40 -29 16 17 14 -55 60 35 -6 12 9 -14 -3 -10 16 50 -18 -5 -10 43 28 61 2 20 49 -33 27 29 20 19 -25 16
6480 16 -27 4 38 23 -19 -29 51 -58 -26 -16 5 -14 -16 -9 -33 -28 -2 44 0 -24 -72 -25 -68 7 23 54 -28 24 2 -58 -65 -13
6512 -13 20 -19 42 -26 80 -20 30 46 -5 -19 22 63 -32 -1 18 -42 0 2 -26 12 37 -64 -60 -68 71 -18 23 3 -31 -84
6542 -84 20 -59 1 -41 -31 -7 30 -18 -97 -51 17 2 -28 24 62 -21 33 13 -27 17 0 36 -62 2 -17 25 -45 -12 -12 -38
6572 -38 8 -49 10 -19 9 37 57 28 -28 -6 111 0 3 19 -13 16 -37 33 16 -32 14 26 -34 -14 -47 -6 -7 -20 -53 -17
6602 -17 18 -41 -94 15 -12 1 -27 -14 -9 -22 -14 37 8 3 -33 -13 0 -58 -46 -29 18 47 37 51 -24 -6 22 -49 -36 -18 -9 57
6634 57 -18 -44 48 -74 -52 28 -10 19 1 -18 75 -37 -21 4 60 58 -18 -20 -23 51 1 51 -12 -36 50 15 7 24 23 -54 -70 -54
6666 -54 -16 -15 56 7 -39 7 -27 -34 -25 -89 10 13 -28 18 10 -32 1 -18 -26 10 3 10 -5 -15 31 -28 -32 11 12 22 24 -6 9 -16 -4 -40
6702d0K9LK1J4l3m8O7J4o6J01l7j5m0J12q1K2j01O7KK2Nl6j8k8J45r6J3k0j5m7
6732h4O6OR2m9m6J0qO6n2l0N9m6K0K2l2OL1k0rN6q9M0m2O8p4MK2L9O1j00N2m8
6764iK3n3j5J35j21N4q2R4l9nO4q4k6K6O6p7QM2k4L4J0m7P3p5l1N2mj5k8Q6m2
6795a0l3Q1j7j0L9k2n8P5m4l3j7K3NJ1Mqj1L7p0Q0K7r4L0n8O6N8n8J0L2l5j8M6
6827B8J1n1m9J1N1l2N8jlj1m0N8n0j7K5No8J04J5n2k4K7J8QP9j74J32m3o2LO1
6858A7K1K3n5J0J7%j8m0J16q4J0o7O4kK2qk7J4kJ9N3j04K8k7J2kj0lJK6LP7j02
6891a8qnN1%l0K8lJ7q8M5k5L2K0J4l6J6m5Q0r7N0oOQ9q4nKL5m8J4k9N1Kl%m6K2
6927bN7m7P8o2j5l1L8o7L1L3j3P2r5Q0l9mm3Q0l9m2O3kq8N7o5Q8l0K4l1J8MOj
$$ plain form
6702 -40 -11 -8 13 27 -6 -54 13 27 -39 62 25 10 -30 82 1 23 -78 -11 -9 13 18 -18 -36 -64 81 -15 -2 -22 -37 -84
6732 -84 -18 -12 80 31 -15 -5 -13 53 1 -29 30 -16 4 26 -6 0 31 11 2 58 -31 9 -33 35 -39 -35 -13 26 87 -13 39 -9
6764 -9 14 -39 -54 81 -40 14 -68 26 -13 -18 46 -38 -64 -38 28 -49 -41 1 -23 11 21 -26 47 -28 -59 -7 -11 -26 -54 32 -10
6795 -10 -43 38 21 11 50 28 -30 45 1 -32 -49 -26 -21 -10 -6 -14 -25 12 -58 22 49 -45 -15 -73 -7 51 -7 3 35 0 -18 28
6827 28 39 -12 -61 -50 1 -31 27 26 23 12 -28 30 -20 -37 -12 -7 -75 29 44 -8 -32 -5 13 21 100 -74 58 15 -47 -44 17
6858 17 38 61 6 16 33 33 15 -25 91 7 17 -50 14 12 34 26 -1 13 11 30 83 -21 7 -20 -8 -10 -20 -23 -22 4 7 84 -18
6891 -18 -26 -31 20 20 -10 18 15 32 -56 -11 -36 -4 16 30 -6 10 -35 45 -52 -2 -8 -2 87 3 -2 0 35 -13 1 -28 23 25 22 22 -24 -2
6927 -2 55 8 86 24 9 -22 16 -51 -20 13 0 72 -23 57 18 14 -29 51 12 -30 33 31 -57 0 -65 23 -7 17 -14 4 8 14 13
6960A3MJ4j8K8m7O2l0N8r5N2o5%M3l8L8k0Qj4m2P4l6M7P6j43j8R1p5P4Mm5Mj0
6992fL3r0N5oL5%M1r1J1L8p2O6o3P1n5Q8r5j9M9m5R6m7mn5P3L1m7jj1J9l3M0m1
7025c5l2O5jkOJ3Mj7J8l3Rk1M0k5N1j8o0N2k2p1J57p4K2j8jk9%O6J6j13J13n5
7057EK6p1M3k4q7J23M4p0L0k1m4L8J4k6K4km1M8j9l2j7O6k0P3j11M6j1NM7N2j00
7088a2N7p9k4O6j5M5ll1j0L9p7R9nk9O6o9Qm8J4MLRm9Q8j06J11l6P1j25Q6m6n2
7120e0J8OP4n3m7j2J12m6m3L9J5J5j4j4K4M4k3r5K7kJK3O1p0M9o4J36r5N6p0K0
7151B2j8l1L8J1J1m0LO8q6J3L1l7RM2rl3N2o4K2pn2M2n5Q3j4J1l9pL5l5N1l5K2
7184DmRKkJ9j7J2m7lrPP9o8rM7J0q0J0P9l9LL5r7R9m5rK1jQn5P4O5l9k0j31J21
$$ plain form
6960 13 17 31 13 41 -6 56 26 84 -11 41 -24 -24 19 -19 19 -1 7 -7 -49 25 -11 36 112 -31 -49 42 -33 41 45 0 4 -6
6992 -6 27 -63 -8 -14 21 21 62 -29 -18 20 -52 14 -49 22 -33 55 -40 -59 -10 -55 41 -6 -10 -65 8 39 -8 -9 -20 -1 -34 6 -35
7025 -35 -67 -2 -3 -5 1 14 18 1 19 -14 -5 -26 14 -11 40 22 -38 14 -8 -79 78 4 26 8 7 -22 -22 44 60 -53 60 5
7057 5 31 -40 3 -21 -108 15 59 -11 19 -2 -46 -8 6 -20 4 2 -39 9 -10 -42 -59 7 -13 60 -51 -5 -16 -11 36 88 -12
7088 -12 45 -34 -58 8 -7 38 35 4 -6 33 -44 55 50 21 87 18 26 -22 -8 -4 -1 8 -41 47 -59 52 16 87 -38 48 2 -50
7120 -50 -32 -26 48 -5 -52 -64 48 2 -41 -2 13 28 14 0 24 68 45 -50 -23 -25 -24 -1 60 -10 39 -25 111 16 72 2 22
7151 22 4 -27 11 22 33 -7 -4 64 -22 -9 22 -15 -6 36 27 -6 46 -18 4 -3 -55 -13 -68 15 1 12 -27 -34 1 -34 17 -18 4
7184 4 0 9 11 9 28 11 23 -24 -27 -36 -29 50 -18 -27 20 30 -50 -40 39 0 3 38 -59 40 -5 -14 7 6 14 -41 33 98 59 39 -92 29
7220B9Kk0k2J9K3o2O4m5Q7j03K1JJ1N5p7M7o6K0Q5k0o5%j9L8n0L0mL8nm8J0P6
7252E0l0p4NN7o0P6M6l4k8m6O5j3m8Q9m6j3QL2J9Mn5L2l0j0Pk9J6P0p9K6N2q4
7284b5J9J1l8L4L2p7K0M3l9kP4j3o4OqlM4k7L8k4nn0M3O2Pj9m7j0J7j3M0Nr2O6
7318EJ0KK0m9Q1r3L5m1K3J7n5P0n8J5L7q0P5k8N7o5P7j3q0LN7n3JM9m4j3j1N4
7350EJ9Rj9nl1L6n6O6m0M1k2m9P4Qn6N6j16J12n5R0q3PL5m7M1l1n6J10n1mK6R
7382B3j0j1Q9j03m8O4k7O1p9K9L1p4N1O1qp2jj5M5RJ1k7l7O2m5M7m4R4o6k8J4
7413dj0n3J45q6L7l9k7J7J8NJ9Jk6P2n8m1P3m4J0k4K4M8l9Kl4Nj8K1KMRl8O3j09
7447g5O2nK9J5n0m1Q0j6jK5q8P1K3j7j9kn2QQ7j3q6J08k4m3P2n1j5RM5q1K7j9
$$ plain form
7220 29 31 11 -11 8 31 -31 33 -12 75 -28 -7 -6 5 60 -17 30 -36 -16 69 49 -16 -16 -35 3 -47 -17 -21 17 12 -36 -26 50
7252 50 20 -54 -49 8 -52 24 70 36 8 -38 27 14 -34 55 9 -4 4 36 55 59 4 36 6 -4 3 -26 -10 60 -19 7 59 -25
7284 -25 -6 5 -33 1 33 -44 -24 19 -20 -22 52 39 -25 -19 -27 -30 14 -13 25 1 -4 -54 -11 51 58 39 -8 -18 -1 -14 26 31 -61 5
7318 5 15 17 37 -12 69 -24 11 -30 -7 10 -45 25 -33 -18 19 -61 14 -14 43 -22 55 42 -38 -35 22 -31 -30 19 -25 -38 -49 5
7350 5 24 33 14 9 -22 14 -42 24 -16 25 3 -46 28 36 -20 36 -80 32 -23 67 -16 -9 26 -21 20 -11 -67 43 -8 -12 14 23
7382 23 13 2 91 -12 -60 4 -23 38 -41 -12 19 -55 -4 57 49 -23 -24 -39 6 15 26 -1 -38 24 -21 26 -18 76 10 -18 -4
7413 -4 -14 -67 78 -8 29 -10 -37 -20 -2 3 22 23 -3 69 11 -30 43 -1 9 -15 9 57 18 20 -14 -9 -27 -6 -4 0 9 -29 34 -75
7447 -75 -13 -18 11 26 -24 -65 15 -1 -2 23 -65 6 29 12 -7 -9 -61 -53 34 21 -65 43 19 -24 48 -3 -18 -9 36 -45 -18 -37
7479c7L0M4q2M2k5N2Kl1LN3n7J7nN9j50L9J18p7j7k5N8K6l9ql4k4K5J8K2k0O9
7510D6n5J4m4NN4J3o2P4j6n6n7J18nm0L8j21R7nn8P0J0J4m0J6J2p2N1J2j4L2q3
7541e2M9J1l8QJ5O4l8L1q3N0l9l9Q1K2n0K1l6M7pM0l6m9J5J1n2K5k9N2j0l9N5
7572@m4O5n4J8J7J8o0%J0P0j8m3jM8o3N4k0ln7P1j7J7k1K7L9k2n3QO2j02L6N2
7604C4N7n9j4K8mJ7p7k5J02q5J5j0J3m1J2jk0Q6Kk8Qnk6n0P4m7Ok6K9R2j4j11
7636f8N2R3o6J8M0q8N0n0K3J5K6o4L9Ol0p4Q5nl9J1L5N8o6k1J3M3n3mM2K3n3Q1
7668G2o4lj0mO7p1rN9r7K3K6LJ9kQ8r1j8l4O9q6l8P5K7M5k0l7j6K2Mk2L9p5Q0
7701B1mp6O9K0J0k2K7p4M6Ll0QJ1pj3Mj7n1Q3J6p6P1M0l7l4L6jl5NK3L0l9J1q2
$$ plain form
7479 -37 -7 37 -45 -3 -28 24 26 -5 -2 51 -6 11 6 65 -85 -46 72 -5 -22 -47 11 37 -2 -10 -44 -68 -43 -25 -3 -23 46
7510 46 -9 5 -39 -34 20 33 -29 45 29 -27 -84 34 29 -11 27 -94 3 -2 -60 10 20 34 -6 10 22 -50 1 13 -1 31 -52
7541 -52 -3 8 -30 -22 -7 57 19 50 -33 17 -22 -61 20 42 -8 13 -23 24 17 57 21 -28 -13 -2 -54 -29 -58 -6 -16 -55 0
7572 0 -44 21 -33 -15 2 20 -40 -40 -30 40 22 -21 -22 26 -37 17 -3 -6 -63 8 -9 8 -13 14 53 31 -22 -14 48 -54 -18 34
7604 34 91 32 18 46 42 59 -18 -43 59 -26 -11 -21 -8 -49 -37 -38 -58 28 30 2 10 5 -21 -71 3 -44 -38 -64 -35 57 43 -68
7636 -68 -16 77 11 29 69 -19 31 -19 4 19 45 -19 20 26 -4 -78 7 2 -37 -26 9 67 1 -20 -7 36 -17 -21 21 44 -9 72
7668 72 8 5 -5 -9 58 -13 -22 37 -60 -37 -11 -8 11 9 97 6 -12 -46 23 -63 -101 -26 1 46 26 -11 -27 -5 -1 -23 16 -59 21
7701 21 17 -59 10 30 40 18 45 -29 17 20 -10 -2 9 2 -11 -7 -24 -75 8 24 -52 19 59 22 -12 24 23 -12 -7 16 46 7 18 -64
7735f4J02k0j6%k8Nk9L4J06q3J7j7nj1K6p7N6m8K0J1J2j7L0k5KO9o0J7p0M6O8
7766E1mo2mM1j3L1k9l5N7m1k6L8J2q1P2Km1L3M2l2j8jRj7J3o2P8j0l9k6jP2Q8
7799I7j14M6j0M3n5k4k1M8n6N1J0l1K8m1P1M4r2M6j6k5O5o3l1K4J3L8m4L0j1l3
7829a3M7l8M0k1j0l6P0r4M9QM0j21P2M7o5L4n5J3P0o2Om7J00Prl7oL1l1l0J5J0
7861a6L7n6O9q7J1N4Km8N6m8J6K5l6Jl1J18r2pL9m6P5k5n5K5KM5K1j6m7J7Rm6
7893c4P2qK2p7K9L0o1K6KOk0o9Q0j05J20l2lJ0K7J7Ml1J3l3J8j2RJ9l8Ol5M8J0
7926A0J9rJ2j34R8N5J9n3m2L7mj3J7J0k4O3r6L4l2N8m8L6J1l3Mk6Q5j5mo1rk7
7958f2J12l0p3L1j9j3J7J6k0J0P9p5l2J8L4L0l7KK6l6j6K4kJ1OJ7o5N5Q4q8j8
$$ plain form
7735 -64 38 18 2 2 -26 -21 -50 -16 90 7 24 7 2 -9 17 -60 -4 -52 -32 -21 -9 -26 4 -21 -19 50 -10 7 -63 -17 51
7766 51 47 -15 -19 22 9 40 11 -24 33 -8 -34 4 16 -65 7 9 -32 1 43 11 -7 -8 1 -16 -3 -65 13 3 -36 -62 -63 9 97
7799 97 -17 29 19 62 7 -17 -38 10 -46 5 15 -16 12 -29 42 86 -6 40 24 -1 64 1 -30 -6 7 45 1 31 20 -13
7829 -13 34 -4 36 15 5 -31 39 -55 -6 2 42 -79 -7 40 -25 9 -46 -33 37 -25 -19 -66 34 41 32 -5 -11 20 -11 -41 -26 -16
7861 -16 21 -35 34 -53 -42 12 14 -34 22 -26 -10 15 -21 -20 -51 67 -25 -32 7 -39 36 11 -44 -19 -17 28 49 33 -14 3 12 -34
7893 -34 38 30 52 -25 4 34 -27 -1 1 7 -13 -82 -2 -107 13 -19 -22 -12 15 32 36 5 18 -15 3 -9 0 19 -19 -13 -48 0 10
7926 10 29 20 32 -102 -4 51 70 17 -25 12 8 -5 12 22 -2 61 -35 -1 -33 25 -23 13 24 -9 -5 -31 54 39 35 -26 -35 -62
7958 -62 50 20 -53 -22 -41 -54 -37 -21 -41 -31 48 -27 -59 -41 -7 23 -14 -12 14 -22 -38 -14 -16 -5 1 18 -47 8 92 4 -14
7989a4O5r4R4m9M8o8m2J24j9o8j5J5J2O4l8j7K1k3m7M7K3J7m3n3M3L2M7j08L2
8018a4LOJ1J1o0mJ26n3n9L7m5K4Rl9O2K7r7K8K5J4Lk9L1Jqk5mLQRlj6O4l7nK6
8054C0J2J7p2jMK5L5l0oM0q0M1k0K6j9k4O2k0j2M7k8J3j6m8O1o0L6k7J3j2L3l6
8086a6k5Q3k5n0JJ4mK5j3J7J3k4n9M2K1N3o7N5n6J5l9l4P1oo2J04mrM1l4j7O4
8118G5q9J0K0K1kp4K8o9N4J2L5j2rLj7J1Pl4O1n4L5j6M0q8L9L9m3QJ9Pj0pj4j5
8152b9O4Rp9P2p1O3k9l0k1L0N5l7k3O2o3P0m4J8J4j3k4l8Q7k3J2p4Q4k5o2k7K3
8183d9k2J18n3o4J28n4k5J5
$$ plain form
7989 -14 51 -43 51 2 50 -18 -60 64 45 -23 -38 -23 -11 53 15 -2 19 -4 -51 -4 19 36 -7 -60 -17 15 62 -46 -14
8018 -14 -11 -5 6 17 -43 -47 79 26 -33 4 -41 -17 -8 -47 15 42 -55 -27 -2 12 15 -14 17 18 10 -15 -19 -16 -8 1 -2 -18 46 9 4 30
8054 30 42 59 -13 -14 -10 15 50 20 14 54 -26 15 -5 21 2 -22 40 20 8 55 27 40 24 -24 37 -23 13 -14 -1 -13 20 -16
8086 -16 -41 42 17 -33 -32 -18 -22 3 -10 7 20 -4 -63 -21 0 53 -14 41 -15 0 -39 -73 -2 -8 -70 34 30 21 62 28 11 75
8118 75 -14 -4 16 37 35 -39 -11 -80 -26 -14 21 9 0 3 -14 -3 4 -30 31 -23 12 -4 36 -52 -13 26 -17 -9 10 17 7 0 -14 -29
8152 -29 35 44 -35 37 -34 29 0 -30 -51 -21 34 -3 -26 36 -27 43 -1 17 31 18 -6 -44 43 20 32 -42 42 17 -45 -72 -49
8183 -49 -71 47 -6 -70 58 4 -21 -6
8191f
$$ Imaginary data points
##PAGE= N=2
##DATA TABLE= (X++(I..I)), XYDATA
0@%%%%%%%Qj6J6j6J6k4M0m8N6o4P2q8J04j20J42j66J92k24K56k88L28l76M24m75
31b51N34n99O69p48Q33r25J028j142J266j402J554j721J905k111K340k597K894
48A527l232L624m088M640n316O166p269Q766j0930J4344k0549L5377j32030j43968
62b52938K85949J27740m9524j15509j26411m5796K10329J87906j02266k26218
72a06738o1537Q8765J62641R7336j12246k20184k8878J77987J60112r056j53673
83e471j57723K9499J92262J17985q3392j70455r3872Q2940J92345P6214j41829
94C8503j73077r476J39410J46331N611j64282j48348M9670J69904R2889n8871
105H8264j55819j02388R2640J95159M6526j42871j40027o822J12156J39022J2922
$$ plain form
0 0 0 0 0 0 0 0 0 8 -8 8 -8 8 -16 24 -24 32 -32 40 -48 56 -64 78 -88 104 -120 136 -152 176 -200 224 -251
31 -251 283 -316 353 -395 438 -487 541 -601 665 -737 817 -904 1001 -1110 1230 -1367 1527
48 1527 -1705 1919 -2169 2471 -2845 3321 -3948 4818 -6112 8232 -12317 23060 -108970 -252938
62 -252938 33011 160751 111227 -4282 -130693 -176489 33840 221746 119480 -106738
72 -106738 -168275 -79510 83131 180467 68221 -151963 -180841 -2854 157258 148202 -5471
83 -5471 -163194 -133695 58567 176552 93160 -77295 -171167 -88227 104118 180332 38503
94 38503 -134574 -144050 -4640 141691 147302 -16980 -165328 -115658 54246 147135 88264
105 88264 -67555 -169943 -77303 117856 164382 21511 -118516 -125338 -13182 125840 138762
116A38762j60660j41626N7657J66396Q0476o5004j39980q2118P9923J68116N2996
127A54938j27541j51629o225J33454J22088j7550j33198j06614L2894J44775J02913
138A48305o4392j62570o4104J02678J36983K6769r9653j29699k3034J25397J32434
149A29114k2328j40322r0869M3911J27081Q5096n7477j47848o1913R5801J31029
160I1275K3905r6548j19103j6181J17354J20292k2684j31865q4417M4910J19165
171D6103P2936n5701j32512n6769Q7685J25502K2018r5451j07178o988J04762
182D407J05279j5679j21220q7765M3467J20498O1840o0816j13939m5237P2389
193c6776J15486L0692r3224j09749J480J03732Q5660j8698j01499q1833L1055
$$ plain form
116 138762 -21898 -163524 -105867 60529 141005 76001 -63979 -146097 -66174 101942 154938
127 154938 27397 -124232 -130457 2997 125085 107535 -25663 -132277 -99383 45392 148305
138 148305 83913 -78657 -142761 -40083 96900 123669 24016 -105683 -128717 -3320 129114
149 129114 106786 -33536 -124405 -80494 46587 131683 74206 -73642 -135555 -39754 91275
160 91275 115180 18632 -100471 -116652 702 120994 98310 -33555 -117972 -73062 46103
171 46103 119039 63338 -69174 -125943 -38258 87244 109262 13811 -93367 -100355 4407
182 4407 109686 94007 -27213 -114978 -71511 48987 110827 50011 -63928 -109165 -36776
193 -36776 78710 109402 16178 -93571 -92091 11641 97301 78603 -22896 -104729 -73674
204g3674J17243O5990o3060j11665l4411P1676J00782K5473q3229j03193k430
215i0498R9409Q4047k1104r8895p0999L5154J06786N7953n6800j03592l5057O7530
227b6066R6482K0532q1427r3866J032R3218P8992k0725r4859o4130L7222R7040
239D3445M9937n1722r6914l5492O6492R3549J3733p9679q1836M355Q3987P3974
251H3829j7865r1988o1322L9268R1682M1277n0761q7898l1544O2322Q8720J2849
263G8569p6445p5787P267P9048O5972j8748q5970n7607L6944Q7927L8909n0737
275B9342q2514k4587O0514P9927J0853p0707p2747O619P7234O1389k2514q0842
287b8033m9595L5983Q1244L6427m8206p8440k1429N9181P3941O778o7877o7174
$$ plain form
204 -73674 43569 109559 46499 -65166 -99577 -27901 72881 98354 15125 -88068 -90498
215 -90498 8911 92958 71854 -27041 -98040 -62886 43900 101853 45053 -58539 -93596 -26066
227 -26066 70416 90948 9521 -84345 -83313 9905 88897 68172 -26687 -90817 -53595 43445
239 43445 93382 41660 -55254 -90746 -24254 69295 83028 3349 -78487 -74132 9855 83829
251 83829 65964 -26024 -87346 -48078 43604 84881 34120 -53778 -85322 -23000 65720 78569
263 78569 2124 -73663 -66396 12652 78624 59876 -26094 -83701 -46757 41170 80079 29342
275 29342 -53172 -77759 -17245 62682 73535 2828 -69919 -63300 13934 75323 52809 -28033
287 -28033 -77628 -41645 39599 76026 27820 -50620 -72049 -12868 61073 67851 -26 -67200
299f7200P971P3641N6362k3274p6004m4223L5832P6243L2794m7064p4659j8779
311f8360N7850O8994L225o5083o1001R674O9502N2272k2862p2290m0439L6004
323c2514P1877K8357m5914o9344j6162N4950O4388J663o2348n6377J1484O6288
335A6348M8247k3152o8796l7252L5649O7651K4261m5067o4530j3374N2578O0494
347E3057R59n9515n3027J2500O3702M3825k4322o4796l3499L4056O3386K2691
359E9017m3197o1403j1217N1677N6905j219n7087m8863J3161N9991M0373k3930
371C4208o1968l1191L4048O0988J9893m2489n7059q628M9432N2933k385n5014
383g232m6165J3902N7480L6731k4086n8228k7819L3470N7494J7909m1166n4168
$$ plain form
299 -67200 -59229 14412 70774 47500 -28504 -72727 -36895 39348 72142 25078 -49581 -68360
311 -68360 -10510 58484 61709 -3374 -64375 -54701 14801 67073 44211 -28079 -68518 -32514
323 -32514 39363 67720 21806 -47538 -63700 -8750 55638 57301 -5047 -61424 -49940 16348
335 16348 64595 41443 -27353 -64605 -28956 38695 62956 17889 -46641 -60015 -7437 53057
347 53057 54016 -5499 -58526 -46026 17676 61501 37179 -27617 -61116 -27060 36326 59017
359 59017 15820 -45583 -56800 -5123 51782 50563 -6524 -55387 -42226 17765 58138 34208
371 34208 -27760 -58951 -24903 36085 55978 13489 -43570 -52198 -2766 50167 47782 -7232
383 -7232 -53397 -39495 17985 54716 30630 -27598 -55417 -21947 35547 53456 12290 -41878
395d1878o989M7882M9143m564n2783m2092J4345N4315L4570k3557n5653k5161
407e2422L3675N4275J4411m0032n0275n797M5198M6288m793n0910l9242J6076
419c3548N2598L0763k3832n1919k2903L1635N1093J3560l9358m8453l518M5018
431A136M3005o663m7994l5730J5427M9735K9288k3968n0606k0706L2007M8132
443C3063J0963l7739m4833k665M3160M0932p143m6482l3738J6076M7581K6425
455D5600k4137m8097j8417L1250M5700R835l6517m2563j035M2112L7848q547m4663
468a1631l0874J5805M5129K4712k3508m6083j6402L1367M3278P640l5505l9314
480c5386j74L9872L5364q832m3197k8976J6796M3499K1981k3598m2697j4305K9660
$$ plain form
395 -41878 -48867 -985 48158 43594 -9189 -51281 -36936 17379 51949 28392 -27261 -52422
407 -52422 -18747 35528 49939 9907 -40368 -46165 -967 45321 40528 -10382 -49624 -33548
419 -33548 19050 49813 25981 -25938 -48841 -17206 33887 47447 8089 -40364 -43882 1136
431 1136 44141 37478 -10516 -46246 -30819 18916 48204 24236 -26370 -47076 -15069 33063
443 33063 44026 6287 -38546 -41211 1949 42881 35738 -10744 -44482 -28406 19175 45600
455 45600 21463 -26634 -45051 -13801 31899 41734 5217 -37346 -38381 3731 41579 33032 -11631
468 -11631 -42505 -26700 18429 43141 19633 -26450 -42852 -11485 31793 39433 3928 -35386
480 -35386 -35560 4312 39676 30844 -12353 -41329 -24533 18966 40947 17349 -25348 -39653 -9993
493i993M0908P126l5041l8225J664L9074L2075r990m0212k6522J6245M1706K0803
506C9618k3661m1153j2364K9374L8073N233l3565l5721K391L7688L0208j0440
518B5681l8505k4427J6637L9898J8822k3792l9090j0714K8592L5702M084l2477
530D11l3656L246L6954K8541j1282l7338k1991J6802L7152J6910k2744l7749j0000
543c4744K8864L4457J880l1590k9978M097L4004K6965j0618l6800k1258J7954
555a6767L5945J3936k2520l4287q739K7159L3172J847l1538k8687N790L2772K3866
568C1949j1090l4273j9778J7208L4747J3182k2526l2669o822K6410L0714Q80k9990
581b058k7384N605L2098K2294j1724l2409j7666J6511L3054J2911k2316l1837
$$ plain form
493 -9993 30915 38041 3000 -35225 -33561 5513 37588 27598 -12614 -39136 -22891 18815 39618
506 39618 15957 -25196 -37560 -8186 29887 35120 1555 -34166 -31775 5913 36121 25681
518 25681 -12824 -37251 -20614 19284 38106 14314 -24776 -35490 -6898 28804 32888 411
530 411 -33245 -29999 6955 35496 24214 -13124 -35115 -18313 18839 35749 13005 -24744 -34744
543 -34744 -5880 28577 30457 -1133 -31111 -27014 6990 33955 23337 -13463 -34721 -16767
555 -16767 19178 33114 10594 -23693 -32432 -5273 27899 29746 -1792 -30479 -24689 8083 31949
568 31949 20859 -13414 -33192 -15984 18763 31945 9419 -23250 -30072 -3662 27052 27932 -2058
581 -2058 -29442 -23837 8261 30555 18831 -13578 -31244 -14733 18321 31232 8916 -22921
593b2921n286K5985K7789O1k7897k6214N218L1686K1588j2797l1169j4932J6196
606a2693L0178J2123k1029l1263m956K6376K6356j997k6417k3189N013K9517K1175
619B9194j2266l1029j4128J7126K8907R447k0482k8397m435K4687K5656j678k6572
632c970k2015O788K8353J8318j2062k8966j3539J6710K7980Q213k0519k6334l208
645b4251K3376K4447j738k6349k0899P927K7022J6004j1675k6785j3216J5821
657a0316K8053P557k1297k4760j022K2039K1743j414k4513k0910P669K7148J4986
670B4963j3043k5480j0613J5429K5420P244j9699k4353j277K2729K0760l680k3569
683e169j7945P228K4902J4973j2254k5527r737J6501K3802N262j8657k2391j428
$$ plain form
593 -22921 -28207 -2222 25567 25628 -2269 -28483 -23265 8421 30009 17212 -13957 -28889 -12693
606 -12693 17485 29608 8579 -22684 -27640 -1264 25092 23095 -3322 -26511 -21498 8019 29194
619 29194 16928 -14101 -28229 -11103 17804 27251 6769 -21628 -26063 -1376 24280 22602 -3970
632 -3970 -25985 -19197 9156 27474 15412 -13554 -27093 -10383 17597 25810 5291 -21043 -24251
645 -24251 -875 23572 21834 -4515 -25414 -17487 9535 25539 13864 -12921 -26137 -10316
657 -10316 17737 25294 3997 -20763 -21785 254 21997 20583 -3930 -24840 -17171 9977 24963
670 24963 11920 -13560 -24173 -8744 16676 23920 4221 -20132 -21409 1320 22080 18400 -5169
683 -5169 -23114 -15886 9016 23989 11735 -13792 -23529 -7028 16774 22036 3379 -19012 -20440
696b0440K1519K0302l906k3416j6494Q039K3827J3501j2033k4278q902J6095K2540
709A6354M355j8054k1149j142K1043J9572m423k2874j5140Q725K2280J1939j1282
722A0204k2772r053J5512K2519L545j8799j9486P39J9474J7425l498k1335j5471
735b0996Q531K2690J0717j2447k1220p266J4488K0774L792j7759j9214J023J9654
748B767J6287m598k0358j3886Q138K1266J0312j2040k0642o407J4564J9647L095
761A8145j7149j8091J173J8979J5456n086j9713j2793Q244K0273R644j1790j9901
774a2609n701J4648J8367K237j6268j7218J094J8732J4835n852j9257j1128Q576
787i544J8671Q921j1014j9188n657J4589J8073J124j6447j5452K066J6982J3670
$$ plain form
696 -20440 1079 21381 17475 -5941 -22435 -14396 9431 22932 10899 -13379 -22281 -6186 16354
709 16354 20709 2655 -18494 -19636 1407 20979 16556 -6318 -21458 -12733 9547 21486 10204
722 10204 -12568 -21621 -6109 16410 19955 1156 -18330 -17591 1883 19308 15810 -5525 -20996
735 -20996 -12465 10225 20942 8495 -12725 -19991 -5503 15271 19063 1304 -17910 -16887 2767
748 2767 19054 14456 -5902 -19788 -11650 9616 19928 7888 -12754 -19161 -4597 15050 18145
761 18145 996 -17095 -15922 3057 18513 13427 -6286 -19079 -10835 9438 19082 7292 -12609
774 -12609 -18310 -3662 14705 16942 674 -16544 -15450 3282 18117 12265 -6992 -18120 -9544
787 -9544 9127 18048 7034 -12154 -17811 -3222 14851 15975 -472 -15924 -13858 3124 16794
800A6794m772j8448j1445Q842J8911P606j1679j7649m425J3324J6762J510j5704
813c73j5419K315J7196J2722n404j7530j0347Q478J7910P172j1424j7042m003
826a5749J3314J6030Q37j5352j4178K617J6386J1941n456j6925r683Q468J7075
839I325O553j1149j6224l541J3020J5180N89j4738j3689K891J5975J1129n850
852I471j6100q661Q050J6080O326j0627j5862l181J3074J4510k37j4168j2414
865a3739K689J4808J0850n362j6011q405Q606J5606N204j0357j4566k758J2101
878a334J3720N2j3890j2109K988J4675J0068n804j5032p552Q167J4834N074j0147
892C710j4206k437J1972J3046n54j3362j1313L284J4059R332n592j4436p134Q147
$$ plain form
800 16794 12022 -6426 -17871 -9029 9882 17488 5809 -11840 -16265 -2941 13821 15331 -373
813 -373 -15792 -13477 3719 16441 11037 -6493 -16840 -8362 9548 16720 5296 -11746 -15749
826 -15749 -2435 13595 14432 -920 -15098 -12481 3905 15846 10390 -6535 -16218 -7750 9325
839 9325 15878 4729 -11495 -15036 -2016 13164 13753 -985 -14674 -11783 4192 15321 9471
852 9471 -6629 -15290 -7240 8840 15166 4539 -11323 -14504 -1430 13080 12843 -1325 -13739
865 -13739 -11050 3758 14608 9246 -6765 -15170 -6564 9042 14246 3889 -10677 -13435 -1334
878 -1334 12386 12438 -1452 -13561 -10573 4102 14170 8366 -6666 -14218 -6051 8783 13857 3710
892 3710 -10496 -12933 -961 12085 11531 -1831 -13144 -9860 4199 13531 7939 -6497 -13631 -5484
906e484J4195M513j0107j3490j931J1629J2402q19j2828j0817L498J3623Q634
919A3018n698j3716o675P781J3740M309j0044j3020j401J1495J1674j224j2295
932b056r852L208J2864Q483n717j3460o058Q003J2949L471r453j2024j449J0811
946b80J1283j012j2211r601L691J2642P363n640j2519n601P530J2338L426r167
960B242j1745j118J0767J0458j411j1535q909L484J2037P193n500j2231n162P614
974c816J1638L047r011j1007r26J0292J0102j576j1249q243L641J1365O672n345
988E584j1631m935P302J1528K556r017j0345l11R845R086j409j0518q042L374
1002f933J1210O502n654j1295m235P304J0544K323q342j0006m30R618R008j829
$$ plain form
906 -5484 8711 13224 3117 -10373 -12304 -675 11727 10908 -1920 -12737 -9239 4384 13018
919 13018 7320 -6396 -13071 -5290 8450 12759 2715 -10305 -11706 -211 11463 10239 -2056
932 -2056 -11908 -8700 4164 12647 6930 -6530 -12588 -4585 8364 11835 2382 -9642 -11091 -280
946 -280 11003 9991 -2220 -11821 -8130 4512 11875 6235 -6284 -11885 -4355 7983 11409 2242
960 2242 -9503 -10621 146 10604 9193 -2342 -11251 -7767 4270 11463 5963 -6268 -11430 -3816
974 -3816 7822 10869 1858 -9149 -10075 217 10319 8743 -2506 -10749 -7108 4257 10929 5584
988 5584 -6047 -10982 -3680 7848 10404 1387 -8958 -9269 576 9662 8253 -2265 -10307 -6933
1002 -6933 4277 10779 5125 -6170 -10405 -3101 7443 9766 1424 -8582 -9012 606 9614 7785
1016G785j0440p331L742J0521N705n210j0547m175O858J0403K119q366r545n6
1030h537R374Q278j732r932o981L545J0216N527n300j0176l809O882R622J903
1044H880p898r079j59R129Q003k027r568o321L500R589N210n025r873l615O861
1059b393R341J456p730q265PQ461P467j757r100o460L610R548M827n330r224k924
1075h466O342Q555J542p196q248N6Q482P166k101q858n653L560Q718M483m736
1090C646q929l044O315Q528J220p373p672N90P948O529j987q283n542L405Q663
1105D014M225n012q526k441O032P921J079o954p375N08P763O376k302q015m986
1120g693L446Q153L886m737q172k387O038P609P09o842o777O80P297O007k075
$$ plain form
1016 7785 -2655 -9986 -6244 4277 9982 4772 -5775 -9950 -3092 7311 9430 1064 -8481 -8537
1030 -8537 837 9115 7383 -2549 -9530 -5985 4231 9758 4458 -5718 -9527 -2645 6977 8880
1044 8880 982 -8097 -8256 873 8876 6849 -2719 -9040 -5540 4049 9259 4234 -5639 -9254 -2393
1059 -2393 6948 8404 674 -7591 -7584 877 8344 6587 -2513 -8973 -5363 4185 9012 3682 -5542 -8466
1075 -8466 -2124 6431 7973 777 -7471 -7415 1067 8233 6132 -2726 -8379 -4819 3899 8382 3646
1090 3646 -5283 -8327 -2012 6516 7736 363 -7309 -6719 1229 7758 5771 -2512 -8054 -4649 4014
1105 4014 8239 3227 -5299 -7740 -1708 6213 7292 338 -7037 -6529 1234 7610 5308 -2707 -7693
1120 -7693 -4247 3906 7792 3055 -5117 -7504 -1466 6143 6852 10 -6767 -6087 1210 7217 5142
1135E142p783m945L619P995L371m888p485j991N571P169Q09o498o725P62P460
1150A583N507k371p493m214L356P373L255m403p399k103N746P031L25o437o011
1165f255R64O765N134k050p127m336L418P333K926m639o878j610N380O450M40
1180E915o074n886Q44O745M853k264o798l831L258O824K939m326o890j459N415
1195g35O084J13n738n526Q19O407M834k212o763l627L513O527K438m278o329j380
1211e853N102N888J47n704n411J153O379M364k445o324l177L227O141K477m188
1226A776o347j118N316N594l27n566m739J171N854M081k105o290l165L419O041
1241C595J962m279n589p63M679N228M9n459m802J344N892L761k604n700k773L060
$$ plain form
1135 5142 -2641 -7586 -3967 4028 7399 2511 -4974 -6965 -1394 5775 6584 86 -6639 -5877 1583
1150 1583 7090 4719 -2774 -6988 -3632 3741 6996 2593 -4806 -6909 -1163 5868 6193 -244 -6255
1165 -6255 -5291 1474 6608 4558 -2569 -6905 -3487 3846 6772 2133 -4745 -6355 -975 5475 5915
1180 5915 -159 -6045 -5201 1544 6397 4133 -2665 -6496 -3238 3586 6525 2199 -4691 -6150 -735
1195 -735 5349 5462 -276 -5802 -4983 1424 6258 4046 -2717 -6344 -2831 3696 6134 1856 -4473 -5853
1211 -5853 -751 5137 5284 -420 -5831 -4678 1701 6065 3620 -2704 -5881 -2654 3487 5964 1776
1226 1776 -4571 -5689 -373 5221 4894 -672 -5411 -4240 1614 5695 3590 -2700 -5865 -2446 3595
1241 3595 5557 1278 -4311 -5074 -395 4833 4882 -577 -5379 -4035 1857 5618 3014 -2686 -5459 -2399
1257b399N864K075m222n575o75M721M950k37n148m515J269N683L555k366n652
1272b672k660L191N636J709m073n196o62M543M750k61n051m360J511N479L249
1287E133k280n426k527L096N278J761l868n254o18M617M627n59m880l786J274
1302c412N056L310k158n464k469L428N086J255l794m668n35M262M505l76m976
1317i50l778J535M999K984k371m896k247L016M922J343l779m664k30M225M124
1332D233n63m588l532J406M856K797k304m841j970K979M610J291l642m483j92
1347c943M130L971p61m342l430J498M691K590k332m529j883K904M473J213l601
1362F49m325j21M084L647o77m215l158J293M500K670k345m532j660K978M210R71
$$ plain form
1257 -2399 3465 5540 1318 -4257 -4932 -211 4739 4502 -646 -5161 -3892 1791 5346 2980 -2672
1272 -2672 -5332 -2141 3495 5204 1131 -4065 -4727 -184 4566 4305 -746 -5106 -3595 1884 5133
1287 5133 2853 -2573 -5100 -2004 3274 5035 1167 -4087 -4705 -88 4539 3980 -900 -4686 -3412
1302 -3412 1644 4954 2796 -2668 -5137 -1709 3377 4632 838 -3830 -4365 -103 4402 4026 -950
1317 -950 -4728 -3193 1806 4790 2419 -2477 -4724 -1708 3214 4557 778 -3886 -4116 109 4233
1332 4233 3670 -918 -4450 -3044 1812 4609 2305 -2536 -4506 -1527 3083 4374 732 -3751 -3943
1347 -3943 187 4158 3397 -945 -4375 -2877 1814 4404 2072 -2457 -4340 -1436 3037 4250 649
1362 649 -3676 -3797 287 3934 3257 -958 -4116 -2823 1677 4347 2002 -2530 -4190 -1212 2998 3969
1378C969l399m034k12L926L599o36m206l117J595M297K271k103m209j800K830
1393a229M202Q68l470l823%L688L452n61m161k977J597M222K129k158m025j604
1409c850K675M035P97l362l625N9L653L233p02l960k795J542M028K120k171l955
1425b278j502K773L845P48l264l523P7L526L083p95l717k680J480L924J975k086
1441A586l829j292K681L573O07l105l270l2L576K973q69l703k405J471L666J850
1457C478j919l751j298K629L594L97k968l137Q0L266K883p31l553k410J488L568
1473A616J722j895l580j200K581L363M83k941l084L02L033K745p75l402k255J403
1489a884L496J646j944l373j124K451L238M45k815k928J94L029K605p14l334k183
$$ plain form
1378 3969 570 -3464 -3676 250 3849 3213 -993 -4110 -2515 1782 4053 1950 -2259 -4059 -1229
1393 -1229 2973 3841 371 -3452 -3452 236 3688 3127 -1034 -4011 -2414 1808 3937 1779 -2246 -3850
1409 -3850 -1175 2860 3657 295 -3330 -3271 382 3615 2913 -1047 -3842 -2300 1728 3848 1677 -2278
1425 -2278 -3780 -1007 2838 3586 322 -3201 -3124 402 3485 2690 -1027 -3707 -2227 1697 3672 1586
1441 1586 -2243 -3535 -854 2719 3326 221 -3049 -3081 495 3468 2599 -1104 -3509 -2038 1628 3478
1457 3478 1559 -2192 -3490 -861 2733 3130 162 -2975 -2895 371 3254 2523 -1030 -3440 -1952 1616
1473 1616 3338 1443 -2137 -3337 -756 2607 3090 149 -2935 -2633 400 3145 2370 -1032 -3287 -1884
1489 -1884 1612 3258 1314 -2059 -3183 -732 2506 2951 136 -2792 -2598 431 3036 2322 -1012 -3195
1505c195J431L308J626j958l206r95K293L086M96k721k898K02L006K446p97l142
1521a018j964J327L162J583j927l170r15K345K923L30k491k777J90K822K460p73
1537B107l178j862J353L045J452j855l031q21K206K868L60k509k574J07K793K295
1553B756p76l009j784J370K902J316j720k867q92K179K773K61k510k465K25K622
1569C81K304q04k875j677J245K811J278j662k794q69K106K681K65k338k373K40
1585b081K540K031o57k772j675J251K782J219j679k694q00K097K548K27k340k289
1601b292K60K455K123p59k708j582J271K535J234j601k642p25K020K388K61k274
1617c6k132J87K477J858o47k641j512J221K476J173j550k485o83J893K376J69
$$ plain form
1505 -3195 -1764 1544 3170 1212 -1994 -2989 -696 2390 2886 165 -2733 -2531 475 2921 2124 -1018
1521 -1018 -2982 -1655 1507 3090 1163 -2007 -2922 -577 2346 2676 185 -2592 -2402 420 2880 2107
1537 2107 -1071 -2933 -1580 1465 2917 1062 -1969 -2790 -584 2284 2644 135 -2439 -2332 461 2756
1553 2756 1980 -1029 -2813 -1443 1459 2775 1055 -1812 -2704 -525 2248 2509 -1 -2466 -2241 381
1569 381 2685 1881 -994 -2671 -1426 1385 2663 1001 -1793 -2662 -556 2125 2390 52 -2321 -2081
1585 -2081 459 2490 1833 -939 -2614 -1363 1419 2638 959 -1735 -2535 -438 2110 2337 -3 -2292
1601 -2292 -2032 423 2546 1787 -921 -2503 -1232 1303 2537 936 -1706 -2431 -411 1977 2238 -36
1617 -36 -2168 -1981 496 2354 1707 -934 -2446 -1225 1251 2424 874 -1611 -2294 -401 1975 2144
1633B144k156k133K48K378J849p16k482j488J183K454J038j518k417o21J852K337
1649A952L9k073j987K53K269J765o71k439j381J080K457R86j551k227n83J742
1665c69K246J86k145j976L00K299J607p86k232j306J094K303R95j555k194o21
1681b154J842J998J32j967j793K55K153J651p47k244j257J107K194R25j453k176
1697a534m37J684K015M6j902j759K52K151J526p88k099j202J083K141Q47j340
1713F84k138m57J638J935K6j758j752K36K045J533o77k155j150J168J966P61j292
1730F13j969n19J618J938N5j892j710M04J969J358o57j987j157J028J987Q27j366
1747E40j930l81J593J813o9j692j588K84J899J408o93k063j005J025J912P66j319
$$ plain form
1633 2144 -12 -2145 -1897 481 2330 1614 -868 -2356 -1173 1281 2319 801 -1616 -2237 -385 1952
1649 1952 1991 -82 -2069 -1816 453 2218 1547 -892 -2273 -1193 1264 2250 699 -1528 -2111 -369
1665 -369 1877 2063 -82 -2058 -1758 541 2148 1362 -870 -2176 -1082 1221 2216 661 -1533 -2154
1681 -2154 -312 1686 1818 -149 -1942 -1687 466 2117 1370 -874 -2131 -1024 1170 2095 642 -1534
1697 -1534 -1971 -287 1728 1774 -128 -1887 -1635 516 2042 1254 -845 -2047 -964 1177 2024 684
1713 684 -1454 -1911 -273 1662 1688 -70 -1822 -1586 459 1992 1315 -840 -1990 -822 1144 1905 613
1730 613 -1356 -1875 -257 1681 1736 -156 -1866 -1462 507 1865 1208 -779 -1936 -908 1079 1906 540
1747 540 -1390 -1771 -178 1635 1566 -126 -1714 -1430 469 1877 1184 -879 -1884 -859 1053 1819 500
1764E00j849l80J551J757K8j714j603L69J844J269o63j872j015R30J967O82j318
1781D83j805l59J543J630R1j698j529K80J838J335p41j846r31R49J816O74j143
1798E87j901l99J489J713Oj658j474L83J704J202n76j841r99R50J884O21j251
1815D40j694l09J463J564J1j622j436L59J722J154p08j744r48J053J733O13j193
1832D58j668k85J396J562l5j567j439M19J593J186o87j628q89Q57J763N57j181
1849D12j681j92J377J417K1j426j429L24J629J095o29j681p24Q40J615N91j141
1866D18j655k29J325J505m7j533j220L42J515J047n37j607q43Q56J594N71j139
1883C63j461j98J186J359J1j360j343L62J509J030o28j556o96P60J569M38r72
$$ plain form
1764 500 -1349 -1729 -178 1579 1607 -107 -1710 -1341 503 1772 1109 -763 -1778 -848 1119 1801 483
1781 483 -1322 -1681 -138 1492 1583 -115 -1644 -1364 474 1809 1068 -778 -1709 -760 1056 1730 587
1798 587 -1314 -1713 -224 1489 1495 -163 -1637 -1254 450 1652 1076 -765 -1764 -814 1070 1691 440
1815 440 -1254 -1563 -100 1464 1475 -147 -1583 -1224 498 1652 944 -800 -1748 -695 1038 1651 458
1832 458 -1210 -1495 -99 1463 1428 -139 -1578 -1159 434 1620 933 -695 -1584 -727 1036 1593 412
1849 412 -1269 -1461 -84 1333 1354 -72 -1501 -1177 452 1547 918 -763 -1487 -647 968 1559 418
1866 418 -1237 -1466 -141 1364 1317 -216 -1436 -1094 421 1468 931 -676 -1519 -663 931 1502 363
1883 363 -1098 -1296 -110 1249 1260 -100 -1443 -1081 428 1458 830 -726 -1422 -662 907 1345 373
1900C73j473k42J307J357q6j382j198L93J428R39n72j511p72Q24J559M57j062
1917C39j377k36J190J280K3j418j123L16J526Q92n72j482o95P39J423N37r81j491
1935a110j68J228J288r0j282j122L30J333Q63m04j556o82Q21J478M05j015j362
1952a045j71J097J309n5j280j165L79J356R55o23j406n60O62J359M27q48j346
1969i55l22J188J297j94j153r53K40J290Q01n67j267p31P99J358L93r72j249j37
1987a134J071J147rj164j167M45J246P92n79j218o92Q07J238L67q64j229j17J086
2005B6J024j0j184j049K95J255Q64n12j272o61P69J259L89r67j134k23J113J088
2023A070p6j191r78L21J303O76m95j220n36P02J185L81r27j156j47J024J097j67
$$ plain form
1900 373 -1100 -1342 -35 1322 1236 -146 -1344 -951 477 1416 844 -667 -1439 -615 944 1401 339
1917 339 -1038 -1274 -84 1196 1219 -199 -1322 -1006 520 1412 840 -642 -1337 -598 825 1362 381 -1110
1935 -1110 -1278 -50 1238 1148 -134 -1256 -926 407 1270 866 -690 -1372 -551 927 1332 317 -1045
1952 -1045 -1216 -119 1190 1135 -145 -1310 -931 425 1380 757 -649 -1209 -547 812 1239 391 -955
1969 -955 -1277 -89 1208 1014 -139 -1092 -852 438 1239 672 -595 -1326 -527 831 1224 252 -997 -1134
1987 -1134 -63 1084 1075 -89 -1256 -811 435 1227 648 -570 -1262 -455 783 1150 286 -943 -1060 26
2005 26 1050 1040 -144 -1193 -898 357 1221 709 -563 -1224 -455 804 1193 226 -908 -1131 -18 1070
2023 1070 994 -197 -1175 -854 449 1125 630 -590 -1126 -424 761 1142 215 -941 -1088 -64 1033 866
2041H66j080q35K24J181Q40n60j226n29P35J172K53q11j110j15R34J089o0j081
2059a13r61L01J214O32m99j110n08O03J146L60q15j097j05R88Q89o4j020q94L00
2078g53J197O93n40j222l57O67J067L40r00j008r0Q39J015p6j127p56L11J149
2096D49N11m20j001n33N34J150L58q58j037j16J045Q43o0j013q72K82J147O27
2114A036n35j070m76P77R72K74p75j012r7Q94R39o5j011q56L73R88O83o00r88
2133e49m50O98J056J22p13r60l3Q66P85o8r29p85L12J055N49m33j056m23O82R06
2153F32L10p90r50p7R03Q49j36j009n78K58R52N60m52j004m22O47J051K10q88
2172F6q14l4R00O77o2r16p51L43J003N61m98j027l73O24J045J64p49q73q1Q35
$$ plain form
2041 866 -214 -1049 -825 356 1196 636 -590 -1119 -384 788 1041 230 -880 -995 -61 1028 968 -113
2059 -113 -1074 -773 441 1073 574 -536 -1044 -441 705 1065 250 -847 -952 36 925 861 -159 -1053 -753
2078 -753 444 1137 597 -625 -982 -315 752 1092 192 -816 -906 -67 948 872 -255 -1011 -700 449
2096 449 960 540 -461 -994 -460 690 1048 190 -847 -963 82 925 865 -148 -1020 -738 409 1036
2114 1036 501 -569 -1045 -268 704 978 203 -809 -906 -12 927 862 -149 -1005 -632 356 1039 439 -549
2133 -549 -999 -301 755 877 164 -796 -829 37 822 754 -175 -960 -648 407 956 523 -533 -956 -274 632
2153 632 942 152 -798 -875 28 877 741 -268 -846 -588 364 924 472 -532 -954 -307 744 954 66
2172 66 -748 -782 118 795 733 -183 -934 -591 412 973 475 -552 -925 -301 744 908 159 -714 -795 40
2192D0P88j74q88n93L05R50M70m52r66m40O72R97J82q27q62M9P94P93j69q82o35
2213h48K42J028M29m45r32l54O47Q99K15q25q00q2R52P96k47r44n52L15R26M44
2233H64m36r13l97O37R19J73p89p82Q2P15P35j61q44o10L42R01M70n57q53k89
2253g93N44Q94J39p64p66n1Q45P37j60r10n63L72Q20N23n03r09k86P03P82J12
2273G66o70q03P1P49O61k00q02o07L74Q46M15m78p63l02N15Q07K52p85p83J13
2293f24P32O43k44p78n21L22Q75L63m28p80l35N25R39n9o08o52L4O39P03j96q01
2314b51n66L94Q68L22m64p84l27O13Q27J51p97o77R0P26O31k22q31l65K93P76
2334D07M25n20p98k72O34P37J03o68o87k2P63O34j92p80n16L58Q29L27m13q49
$$ plain form
2192 40 828 654 -234 -827 -522 428 898 446 -520 -960 -288 709 891 64 -798 -749 45 838 669 -213 -848
2213 -848 -606 422 851 406 -526 -880 -233 666 881 56 -744 -826 126 922 675 -269 -821 -506 420 864
2233 864 428 -485 -882 -245 674 847 58 -724 -642 73 808 647 -197 -807 -465 436 906 349 -504 -793
2253 -793 -249 645 784 20 -746 -797 48 785 625 -285 -848 -476 344 867 364 -545 -831 -128 654 766
2273 766 96 -707 -636 113 774 574 -228 -835 -461 385 800 322 -441 -743 -228 579 831 46 -737 -624
2293 -624 108 751 507 -271 -792 -470 405 768 340 -440 -775 -250 689 630 22 -630 -596 43 746 550 -251
2314 -251 -817 -423 445 767 303 -481 -808 -195 632 783 -14 -691 -601 125 756 534 -297 -662 -369 407
2334 407 832 312 -486 -758 -124 613 716 48 -639 -661 102 736 544 -236 -752 -394 435 762 349 -500
2354e00k28N82P78K9o49p20J04Q01M98j64p51n01K97Q18L75m89p77k46O87O80
2374F24po30o28K2P63N90k80p62m41L80P35L03m27o87k46N44P00J25o63o73P6
2395e82P96N25k86o77m41K47P29L95m85o97j82N77O94k7o46n43P3O77N14k05p12
2416b56m37K90P26L86n04o46j75M64P22M8o48o52J18O95N68k27o97l94K30Q20
2436D31K81m51p41j22N70N53J07o68n50N9P08N03k57p67l45M19N96L19l51p85
2456d91j74O18N91j6n59n47O7O43M68j60o04n48L99P06K34m23p17j05N87O11l5
2477E45o73m82J33O40N33l17p02l01L59O46K35m36o83j24N47O21Ko78n10J44O63
2498A62M61k29o35l91L94O54J70m59n97j31N13N97Mn26n14J04O45L73k03o41l51
$$ plain form
2354 -500 -728 -146 632 661 12 -708 -604 197 695 531 -220 -721 -424 394 769 280 -497 -743 -56 624
2374 624 617 -13 -641 -619 144 734 454 -308 -749 -369 366 669 242 -445 -691 -147 553 678 15 -658 -582
2395 -582 214 739 453 -224 -665 -418 311 706 221 -476 -658 -81 613 586 -60 -603 -530 147 661 456 -256
2416 -256 -693 -403 323 709 205 -441 -616 -152 570 618 -30 -682 -564 131 699 472 -225 -619 -389 431
2436 431 712 261 -480 -602 -32 521 628 -40 -590 -531 177 680 423 -344 -689 -270 326 645 294 -491
2456 -491 -665 -47 544 528 -31 -578 -511 132 600 440 -164 -712 -313 393 627 204 -513 -618 -31 580 545
2477 545 -128 -610 -477 163 696 379 -323 -624 -265 381 616 180 -503 -627 -80 541 543 -135 -645 -501 162
2498 162 623 394 -241 -632 -238 416 586 127 -470 -601 -88 509 513 -13 -527 -423 222 595 392 -249 -600
2519f00L13O85K31m45o32j44N50O03m9n84m59R3O30L83k60o01k47K76O84J37m35
2540A29n91p1M96M87K5n15n27J99O14L91k70p05k88L80O17K16m69n41p8N07N37
2561E43n7o03m09J50N78L88k98o35k19M03N64J65m14n93l9M75N31m5n85n18K49
2582c69N56L61k80o03k17L03N96K35m06o20l7M98M79j14m78m54K26N13L67k90
2602B66o04k23L86N98R9m38n34q2N66M42p2n59m11K16N82L11k67n84k32L35O11
2623D06J55m62n48RN10M12m9n12m04J12N45L58k81n62k55M31M82J33m37m78rM70
2645B6N28j80m95l73J48O34K27l07n42j93L41M99J72l74n23L6M49M00lo14m35
2666e79K89M94K97l21m93j76L26N71Q9m06n63j1N07N16r7n46l93J40N81L64l89
$$ plain form
2519 -600 -287 398 629 184 -448 -592 -42 561 512 -72 -531 -438 192 575 315 -286 -533 -257 427 564 129
2540 129 -462 -533 -37 450 475 -40 -567 -368 246 637 367 -338 -626 -246 371 587 118 -423 -501 6 543
2561 543 486 -117 -526 -376 202 590 292 -343 -562 -159 405 570 156 -437 -476 -1 530 485 -100 -618 -369
2582 -369 187 548 268 -335 -552 -249 347 582 176 -444 -481 17 496 382 -96 -550 -324 189 556 266
2602 266 -338 -561 -175 423 522 84 -450 -532 34 476 404 -155 -566 -350 232 543 276 -308 -540 -205 406
2623 406 561 99 -449 -440 70 482 433 -79 -483 -371 174 532 251 -311 -566 -135 347 480 43 -435 -444 26
2645 26 554 374 -121 -494 -346 288 515 208 -334 -527 -186 313 485 111 -412 -376 73 473 470 -144 -579
2666 -579 -290 204 501 180 -313 -489 -163 408 497 91 -472 -483 24 540 443 -103 -496 -356 225 589 200
2687B00m84k31M20M81M1m29m45J9M83L57k4m93l86J86N15L67l49m90j87L61M75
2708C87J06m36m95%N21M08j62n01k97J92M59L21l13m55k59M17N39j9m10l75lM08
2730C3L49p6m60l36K29N18K42l54m39j64L72M56P2m39l96K8M85L59j51m61k43
2751c76O3N77K51l41m79j41L42N75o1m73l80J34L70L61j30m43l23K20N77J43k57
2772B09n42m1L04L41J04m20l61l0N87L43k26m70j59J25M50K35l24l78j45M13L42
2793C57Ql63m30R0M19L01n6m68k98K30N41J30l00n38J0L61L70L4m08m28M6N48
2815A56L49k61m00k71J69M70K36k85m83j52M78M56j16l86l72R8L71L58j61m75
2835b21k21K10N32Q6k30m66q3L27M84l7m58l16R5M19K95j67m11j91J97M27J90
$$ plain form
2687 200 -284 -515 -95 386 427 -2 -447 -428 55 412 388 -105 -491 -305 210 577 228 -262 -449 -88 387
2708 387 493 57 -438 -438 83 491 329 -172 -469 -277 182 503 190 -265 -524 -107 432 413 3 -372 -375 33
2730 33 382 306 -154 -490 -261 257 499 145 -294 -458 -86 370 442 3 -393 -365 120 479 328 -133 -376
2751 -376 -313 264 515 174 -305 -446 -104 471 410 -63 -443 -309 61 422 292 -151 -474 -254 323 466 209
2772 209 -333 -374 -70 271 375 -45 -406 -436 151 494 268 -202 -361 -236 214 449 125 -253 -398 15 357
2793 357 365 2 -428 -338 81 382 326 -142 -440 -210 331 461 161 -377 -367 -6 364 398 -10 -438 -392 156
2815 156 505 244 -156 -427 -258 212 448 163 -320 -472 6 462 346 -40 -412 -314 57 415 254 -221
2835 -221 -442 -232 300 386 156 -310 -393 -66 418 381 -77 -393 -298 121 416 249 -162 -353 -156 271 461
2856D61l50m62n7L84M11k9l94l96J41L65L59j47n31j28J91M94N9k94l55m7L18
2877gL78m8m05k82L4M56K75k42l83j74K00M82R4l29l75p1L36L62l5k76l91J26
2899b75L95K99j85m23k29K87M03R5k85l61k3K80M26k6m01l71J27M42K55k58l33
2920a61k37K35M58P6l05l46p7M14K89n3l58k95J39M12J97j60m58j49K86L64R9
2941C70l73k66j18L35L93l3m60k25J40M11J83k26m07j51L18M33L1l51l56P0L95
2962A13K81j02l15l33J22M20K04j72m47j30K82L23R2k77l36k7L47L15o7l85k20
2983c12R0L55J86j26m09j96L59L15Q2l96k29l6L43L75j36l82k50J51L56K04j97
3004A47l97p0J99L85K1k89l12j1K93M14j41l86j83J49K97K03j04m08j12K13L76
$$ plain form
2856 461 111 -351 -408 -24 387 358 -36 -432 -291 74 433 286 -245 -373 -182 312 371 77 -278 -325 -7
2877 -7 371 323 -82 -364 -330 126 401 159 -224 -398 -198 284 378 49 -326 -397 -61 301 266 -10 -401 -275
2899 -275 120 419 234 -189 -418 -131 272 367 82 -279 -302 -22 404 378 -23 -394 -267 175 430 172 -161
2920 -161 -398 -163 295 371 66 -280 -357 57 346 293 -65 -360 -221 191 388 228 -230 -379 -93 271 370
2941 370 -3 -269 -387 -52 341 308 -152 -377 -237 174 357 131 -276 -427 -109 324 355 4 -352 -282 113
2962 113 394 292 -23 -356 -234 186 390 218 -229 -359 -77 246 338 61 -275 -302 45 360 293 -92 -312
2983 -312 -222 133 319 193 -216 -412 -53 262 344 -52 -281 -317 26 401 265 -117 -367 -216 140 344 147
3004 147 -250 -320 -121 264 285 -4 -316 -327 -34 380 239 -147 -330 -181 116 319 215 -193 -305 -92 284
3025B84ol34k55M3L32K03M5m13k17R0M75R0k00l17j20K24L20J10l62l19J6M09
3047I8K59j51l57j46J73K45K60k66l67r0K19M67n5k92l53J13L25K68j65l92j66
3068c73K01L60K23k77l73p4K63L53L6l36k34o0L39K69j05l60j52J29L34J54k36
3089H1k32j80K65L37L7l44k52R3L10J77j16l34j17J28L59J34l04k60r2K85K36
3110B11j2k30k83J18L16J67j39k55k13J26M16L7j33l94m9L15K42J3k81k36J8L35
3132H9J75j04l48j07J86L39J27k45l59m2K57K90Nk72l08J19K89K52j67l20j20
3153b64K05K20R7j99l27k6L50J77j9k68k34N6L32J85j70l16k4J56K74L4j76k90
3175b27p1K97L22p1l66j83J07K70J86q9l53j25J43L58J56l01k68n1L10J97j3k57
$$ plain form
3025 284 278 -56 -311 -268 64 267 312 -101 -318 -228 247 337 137 -180 -300 -76 244 354 -8 -327 -311 98
3047 98 357 206 -151 -297 -124 121 381 115 -252 -342 -123 344 289 -3 -356 -243 82 350 185 -207 -373
3068 -373 -172 188 411 134 -239 -313 -50 303 339 3 -231 -291 48 317 212 -148 -300 -171 163 317 81
3089 81 -151 -331 -66 271 308 -36 -288 -195 115 292 176 -158 -275 -147 212 346 42 -218 -310 -25 211
3110 211 199 -31 -314 -196 120 287 148 -107 -320 -194 222 259 126 -268 -317 -2 240 253 -28 -264 -246 89
3132 89 264 160 -188 -295 -109 230 357 112 -247 -289 -32 258 263 -9 -317 -198 91 343 176 -144 -264
3153 -264 -59 161 258 59 -268 -294 56 233 214 -54 -288 -232 100 285 115 -201 -225 -69 205 239 63 -227
3175 -227 -298 -1 321 250 -116 -299 -192 78 264 175 -178 -303 -160 198 354 53 -215 -266 44 241 228 -29
3197b9k22R2K88J55j39k92j31J52L05N6j90k76q1L63J64L9l98j65J72K05K43j49
3219A62l27j27J63L71mj67k78l5J96K94j20k02j87N9K83J51p1l90j05K60K65M2
3241B33k13k17n9K46L12j41k27k07K15J87J99j94k48j66J89K92M0j96l60J35K23
3262D3K28j54k01j76R1L34J05j37l12l9J72K33N3k06k76O1K03K30o1k85j91J42
3284a43K54R0j51j89j17J88K25Q8k21l37J51J52K57l2l03j19Q1K44J22j37k04
3305a01r3J78J79Q1k33j89k7K78J90j37j87j77J00K50R3r6l07j8K14J38Lj67j90
3328b18JK60J81q8k19j69J07K71Q2j27k16j07K06J94N7k42k04M6K61J78j00k13
3350e9j57J27K32N5j87j76p7J57L20l2k40j34RJ80J98j6k86j32R7L01N9k57j65
$$ plain form
3197 -29 -251 -159 129 284 145 -147 -278 -126 179 235 45 -231 -312 51 215 254 -144 -309 -137 68 311 162
3219 162 -165 -292 -129 242 238 71 -207 -242 -46 248 128 -74 -261 -202 81 232 161 -229 -334 -74 191 233
3241 233 20 -197 -256 -10 302 161 -66 -273 -58 129 328 134 -114 -280 -91 201 241 45 -315 -180 43
3262 43 271 117 -84 -260 -169 165 270 133 -179 -218 -46 187 240 34 -242 -181 22 252 191 -94 -285 -143
3284 -143 111 201 50 -139 -256 -68 157 245 24 -313 -162 -10 247 215 -88 -207 -126 118 240 103 -101
3305 -101 -194 -16 163 244 11 -178 -205 73 263 126 -61 -238 -138 112 205 109 -198 -216 -2 136 139 -28 -218
3328 -218 -217 43 224 136 -83 -252 -145 126 208 81 -135 -242 -36 158 215 -27 -231 -185 76 254 154 -59
3350 -59 -216 -89 143 198 11 -165 -242 -85 235 203 -37 -171 -162 18 216 200 -86 -218 -121 180 239 -18 -183
3373a83QJ21K19m9j76j39L6K62J00p3j99j05R6J92R7j76j68m9J65J86Oj59j85
3396a73k5K58K00j15l12o7O7K82J33j99j63r1K39J67l1k02j62K9J73K15j13k20
3418a10m9J29J67R4j73k33M5J86J55n1j95j24J8K02K05j53k77J5J19K25Kj34j85
3441a22K0N7K13J1k88p4J29O3J52j21j26j34J42K17M6j32j59j07K16J78q3j30
3463c2j57L1K10J66q8k45p7J80J12R6j65k00O6J46J70n3k15j85J54J94Q7q8j64
3486e7j26J45J72K6r9k41M6J72Q3k4j47j20J36Q5J73j54k23RR9K03M2k32j39j4
3510a85J57J89l5j95j08J10J81k9l8j38p5J51J37j9j81l9j0J27J61J5k14r4N2
3533h0J69N5j23j12m2J19J36Jj49r9k7J46J11L3j96j32J09K19k1j8j88o2J13J97
$$ plain form
3373 -183 -175 -54 165 116 -60 -199 -163 99 199 126 -73 -178 -82 110 207 31 -137 -186 -21 165 171 12 -173
3396 -173 -198 60 260 145 -167 -234 -167 115 248 49 -114 -205 34 201 170 -32 -194 -165 8 223 110 -110
3418 -110 -159 -30 137 231 58 -175 -130 56 211 160 -35 -159 -141 61 266 113 -164 -149 -30 195 197 63 -122
3441 -122 -102 -45 168 179 -109 -183 -54 9 161 40 -86 -220 -78 139 185 53 -106 -213 3 181 98 -32
3463 -32 -189 -158 52 218 130 -115 -192 -12 100 196 31 -169 -103 43 213 160 -55 -240 -86 108 195 107 -57
3486 -57 -183 -38 134 160 61 -180 -134 38 121 97 -50 -170 -34 51 224 70 -153 -144 -45 158 200 -32 -171 -185
3510 -185 -28 161 126 -69 -177 -67 114 85 47 -91 -166 -15 122 103 -78 -117 -127 0 161 176 -38 -132 -80
3533 -80 89 144 21 -91 -133 -14 122 123 -26 -125 -152 -6 105 138 -58 -190 -81 138 117 99 -89 -151 -38 159
3557A59j3j84o3pJ94M4rj76l0n0J92J01j40j72MR2J25O5j82q7j3K17Q3p3j20j46
3583a89J01R1J67j85q7o7R0J92N0k04j29N9J37R1n1j16q6O6J63M1p4j41k8J04
3607eR7R4k01j20P5J42R3k4k21n5L3J96N4j00j54r2J26J86k8j43q8JJ68J43p4
3632A03j75m6O1J62l7m9j11j4J02J35k1r7k22P9J71P4p5j36n6R1J49N8l3j85j0
3657h2J11O6on6k10K5J37J64j02q3j15Q1J23J08j46j21n7R8J39O8j79j04M7J77
3681H3L8m7j85L3K8J03Q0j06j48k7J59Q8j2j49j12J10J34N0n8j22n9P7J53L7j11
3706C7j34k2J34J18m4o6j91L8J86O6n8j65k2P8J50M3j06j68M6J65K4Oj33r9L3
3731h4J92R4j41r7o5N8J43or5q9j6N2J13K1n0k09N3J25J32r3j08k4O0J35L6o9
$$ plain form
3557 159 146 -38 -101 -108 86 130 121 -55 -85 -135 57 158 18 -154 -150 -58 67 132 -50 -137 -150 67 150 77 -43 -189
3583 -189 -88 3 170 -15 -102 -169 -79 113 163 -41 -170 -111 26 117 66 -50 -136 -70 93 134 60 -81 -109 -5
3607 -5 92 186 -15 -135 -60 82 175 151 -70 -125 -92 104 158 58 -96 -188 -62 124 96 -47 -135 -134 34 177 103
3632 103 -72 -118 -57 105 68 19 -92 -106 -4 131 110 13 -209 -130 41 115 40 -96 -152 -61 88 146 113 -72 -82
3657 -82 29 95 89 33 -177 -152 -15 149 47 -36 -151 -70 53 161 15 -106 -163 -65 74 142 -37 -141 -94 83
3681 83 121 74 -111 -78 -50 53 133 27 -121 -148 11 99 87 -62 -174 -64 70 120 62 -60 -119 -42 111 148 37
3706 37 -97 -119 15 133 89 23 -168 -130 56 122 64 -101 -123 -45 105 148 42 -126 -80 85 109 115 -18 -117 -84
3731 -84 108 202 61 -36 -101 -43 100 94 -1 -90 -106 -54 59 80 30 -179 -126 -1 131 38 -70 -94 -34 101 137 68
3757F8j95J04N0J29n5j21o3P8L2J12q0r3q7Q3J48j4m2j43%J05P6k6m7j68J20K2
3783gJ27o1o8m3M1J42l1j17Kq6J60L4j1j29l5j5J10P8l7j45J2L6P2J41k00j08
3809a38N7P9J28l0j14o3%J74P5j21j18J0N8J08K2r3j07j2R5Q4Oo8j59M0J18k3
3835HK5j17n2J12J48K8j45j29O9L2J01jj14j1JM5J47j30m0o4P3J19oj24p6P9R
3862a3J55p5j17o3J12R2m2qr2N7p1J72l1n7o8k2J04P7n7o8j20N9J34P5j02r9k3
3889i1P8N8N3j52o1JQ2J06Oq1p3L1J20J3j23o3m5J20lO9n5r2J7L3J25J3j09m2
3917f5L3M5L4O4j25r4Q4J45r1pj01J6Q5J34j47no3N4P0O0j31r1Q5PO2K6p7m8k7
3946f8J09J03q5j29QK0Q7K8p6p1l6R2J05J7o6r0l1J54J5q5n1pj4J53K2o5l9L4
$$ plain form
3757 68 -127 -23 27 156 101 -20 -83 -5 27 139 59 -34 -121 -38 110 96 54 -89 -89 16 92 66 19 -149 -29 -7
3783 -7 120 59 -9 -52 -11 131 100 -17 -15 -101 59 93 82 -47 -82 -97 13 91 54 -91 -79 -43 29 170 -30 -138
3809 -138 -81 -2 126 96 -18 -81 -81 93 168 47 -71 -61 -3 105 127 34 -73 -85 10 94 100 32 -127 -87 31 8
3835 8 33 -84 -136 -24 124 152 7 -122 -53 -21 80 79 -35 -46 -45 0 147 17 -23 -87 -14 105 99 -25 -101 -22 -13
3862 -13 142 67 -50 -113 -1 91 49 41 -51 6 -65 107 76 19 -49 -71 33 110 53 -15 -135 -76 58 133 31 -68 -91
3889 -91 -13 45 98 -54 -115 -114 -32 74 80 -1 -74 -43 77 90 -33 -96 -141 -21 -24 45 -10 -102 -85 -52 73 86 -23 -65
3917 -65 -32 13 47 111 -14 -108 -24 121 30 23 -78 -62 23 157 10 5 -58 -4 66 126 -5 -96 -11 -4 58 84 7 -41 -68
3946 -68 41 144 59 -70 -62 -42 45 73 -3 -74 -110 -18 87 104 38 -52 -83 71 86 1 -50 -57 -71 82 104 39 0 34
3974C4j2K0j1m9n2Q5j8R8o0m0j0lJ02L0j05p7J9J03J05j31j7q9j7J22LN0j20n9
4002i9P6J05J6j16j7%O7m5P4q5q9N6J29M2j04j17L9PJ62K6j20j01O7J05m6L2p5
4029a1n8J6J13rJ1p1q3R7O3L8j43n8O6N6O3J7j98N4l6R5Q5o5n6l2N6O4qn8o6P2
4059A4J3N3m9r2o1R6L6R4q8q2lQ4k5M7l5kl3L9O3k6q5nnN9J1P1p8n4L4J4J13j33
4091a5j8nJ12p0P9q7m5M5R4L4j23pl2J6Q9j9m3n0m4J11J07j19j3k3j0J9M7J1r9
4120e8lK4N4J1n3l3J7L5J7K4j24j2O2R4j0k1q0M1K5J1O2l7p0K0m8J21k4j6j53
4149a24R6J5P4o4q9N4O6N0l4l1q2oJ14M1K0j44K1k1P8M0j09km6J19K7j5p5rMJ10
4179G8N1j03o0j4J3Q3K3l6r7l6J05J03n7p3k2NN0jJ9ok7p4J02L8n9%kL9m8Q4p4
$$ plain form
3974 34 22 42 31 -18 -70 15 -3 95 35 -5 -15 -18 84 114 9 -68 -49 54 159 28 11 -78 -95 27 30 80 -40 -99
4002 -99 -23 82 98 -18 -35 -35 32 -13 61 -24 -113 -57 72 114 10 -107 -68 -61 101 127 7 -94 -27 78 32 64 -11
4029 -11 -69 -53 60 51 62 -9 -92 5 68 106 -37 -95 -29 27 90 107 -91 -37 -73 22 107 42 -14 -46 10 74 66 8 -58 14
4059 14 27 80 31 -61 -122 -26 10 104 16 -66 -69 15 -10 37 2 0 -33 6 69 43 -42 -47 -52 7 18 89 11 -43 -9 5 118 -15
4091 -15 -33 -38 74 4 83 -4 -49 -4 90 124 1 -6 -38 -22 67 48 5 -45 -89 22 129 10 -3 -26 -36 -17 30 41 -58
4120 -58 -61 -37 17 28 -25 -58 -41 -6 11 35 -89 -101 -39 55 45 24 -56 -15 10 21 83 46 -24 -4 -52 69 45 29 -124
4149 -124 -28 -13 61 -3 -92 -38 28 78 44 13 -69 -75 39 80 100 -44 -23 -44 34 74 -35 -37 -83 36 63 48 -27 -36 -32 78
4179 78 129 26 -34 -48 -35 48 71 35 -62 -98 7 110 53 -20 -42 -37 13 12 31 25 -2 -76 26 64 5 5 3 42 -6 78 4
4210Dm3M6J4J25r4l2Oq3J41q3O1p5m2Q0J4J8l2p5L6L4N2m5k2l7nM5L8L8q5q3R8
4241A4L1l7m3mM2N3l6j2j3NM8j0l3j4p1JJ28j3j1m2l7J7Q0jq6l6M7QP5jJ6j02
4273c7J1J6M3oj3n0J0L7Qkp9L6N9K2m9L1j22R9J8M7l0Oq0l4P7OM3j59K7K8N4O0
4305G7k7p0j1MP8m4%k9J4K3M0q3qj7O1M8n9p4J02l5NP0n0M6q1OP1k2J4r6LJ02
4337E8Kpk8p2mO3N0k7m1m8%Q0L2j5p6j6j6Q4K6m6o3J3M4K0K3m8j6KM2L3m7j9M
4370a3N5l5PJ9q8J9N0M9m5k3j1n1R2J9j8n0O6m2N1J6o5J7p2N3L1nK3o7Ll6J13
4401F2m9l1o4O3L5M5n0k1l1O4K4J3n1p9R4K4o5J5J2p2P1K6n7M8o2rJ6J30j03K9
4431B7J5m1O9rpp4j9M7M8o8L8J3o9M8j8L5p2L3nrM4j4J8q5L9O5oj00RK8M8o3O5
$$ plain form
4210 4 -39 7 21 146 52 20 26 -57 84 1 62 -13 -55 25 39 57 25 -50 -14 20 72 27 5 -32 -37 8 46 84 -1 -84 14
4241 14 45 8 -35 -39 3 56 20 8 -5 0 48 38 5 -9 -80 -79 49 36 25 -17 -54 -37 43 42 -44 -80 -33 -25 50 49 65 -37
4273 -37 -26 -10 33 27 14 -36 -26 11 19 17 -62 -26 33 55 6 37 -85 14 32 79 49 55 -25 -59 18 24 67 -92 -65 -37 17 77
4305 77 50 -20 -31 -27 51 7 7 -22 -8 15 55 -28 -36 -53 8 56 -3 -77 25 -10 -5 65 15 61 -20 -14 57 35 49 -47 -44 58
4337 58 60 53 25 -47 -51 12 62 35 -6 -54 -54 26 58 43 -33 -49 -65 19 45 -1 -64 -51 -7 13 36 -12 -28 -26 16 49 2 -17 -13
4370 -13 42 7 14 33 -55 -36 14 63 18 -5 -16 -67 25 44 26 -24 42 0 51 67 2 19 -53 0 31 26 49 -18 -15 -51 62
4401 62 13 -18 -82 -19 16 61 11 -10 -41 23 47 60 9 -70 24 48 -17 -2 10 -62 9 35 -22 26 -36 -45 -29 101 -2 27
4431 27 42 1 70 61 54 -20 -39 8 56 -12 26 39 -30 18 0 35 -37 -4 -9 -18 26 12 30 -55 -16 49 43 -57 -48 -20 28 -35 30
4464C0k9j0m8P5k6M6r0j6J22n5N8n0J7K1n8L2J2q3NJ1Q0j0jp5L4J3Km2O8k0Mr
4496Hm9Q9q4j5rO1K9l1LM9l5l6M1l6rM4l1Q4lk7o5k9R3k6qnj7J1K4o3R0n1j4j1
4530b8mR3p1k0RJ0N6k3k7n6M3N6M4o8J2%J9m6j6j3qJ06J8n3j8k5j9P8n4rJ8JJ8
4563B3k1Oqk0L4L5k0j8lj6K4l5O1l6jm1L3M7on3K5J9k5K1k3K5m8K0N8qL8j11J8
4596fk8L0M3m7N3r3L0K1K7k2j0o8J00Rm2m3J0K7K1k7m4M6m6P1m9M7NL5o9K1l0
4627b8O6p7L9l6K2Q0r0L2l7j2J10n6N1j25L5pk1LL9o4P2O3n7pl3P2l1K2k6J6J3
4658B8o7NQ6J3p5J6k0M1k6oP4m0o6R7Jk5Np6Q1n9ol3K4j1LQ8k3n9N7rL3J1j29
4691f7P0m5j5O2K8k1k3j6L3K1k7j5J9j7N7l2k1rJ4J8k3J9j16O8N2k5j0J4L4k1
$$ plain form
4464 30 1 -9 -57 18 -8 38 -52 -68 54 -1 57 7 24 45 -13 19 31 -52 -47 -36 44 34 33 -42 -8 5 7 -35 33 13 17 8
4496 8 -41 48 -36 -51 -60 1 30 -1 2 51 16 -20 21 -15 -24 20 -11 73 70 43 -22 -51 42 16 8 3 -14 -3 21 -42 48 -3 -17 -28
4530 -28 -32 61 -10 -30 -21 -11 45 22 -5 -61 -18 38 82 14 26 26 45 -1 -17 -30 -38 68 86 33 15 -10 -29 49 -5 -14 4 5 23
4563 23 2 8 0 -20 14 49 29 11 8 -8 16 -19 42 6 5 -36 -3 44 38 -15 10 29 4 25 2 27 -21 -1 57 49 87 -24 -6
4596 -6 -34 -4 39 -8 45 -48 -18 3 30 8 -2 -70 30 39 -3 -46 -36 -9 12 -15 -59 -13 -59 12 -37 10 15 50 -19 2 -28
4627 -28 38 -39 0 -36 -14 66 -24 8 -29 -41 69 13 64 -61 -26 -33 -54 -51 -12 -76 -4 59 2 -5 -38 34 3 25 -1 15 28
4658 28 -39 -34 52 65 -10 6 -14 27 1 -5 69 29 -37 60 61 36 41 -35 46 -13 -19 -52 -28 -39 -36 52 29 -30 27 18 51 62 -67
4691 -67 3 -42 -57 5 33 12 -11 -27 6 27 0 -15 4 -13 44 12 -9 -18 -4 14 -9 10 -106 -38 14 -11 -21 -7 27 6
4721FL1p7R5n9k3l5P6jM9j09O6l6P1J5k6p1n9Q5J8oo3P6k5J4j5K2j2mm7M1J0M
4753A1r7Q7n4L6L1L6p6rO9NOm2QLOl8K3l7K0QO9m3l5j8jP5m7j9k8N9L8l5k4J5
4787Bj2M9m3K4m4j2n5N6O9rk5m2KP6m4L7k9j3L4k9M0n3rJ2k0O3j0l2l1j3R2k3
4819Hj8J6j0m8M2K2M2m3j11J05L4m8N4jo9L5K1k3n3M9l9L1J0j0Q6j02Jj1L3j1
4849hmL5qJ7K3k6l2j8MK1k5K5m4J28p9J5k6n9O6Pm0N6K1p4m7P8J3oQnmk8K3J1
4883A8k9LJ8k4n1M5kN0l3oK1J3K3o7L3J3L0p6k9O5k1Lp0P4%J5n2J8K6Om1j6N4
4916A1l9J0J1j3N6J0m9rM9m5K9L8k3L3j02j8K0J3OJ0M6q3L8L8l1Rm5K4M0k3Lm6
4948c2P3n6L6L2o7J1k7P2m1O3nj15M7N7n3k5ON2p5N3O8j56J6Q1j2K0K1o2P2o5
$$ plain form
4721 6 37 -40 55 -4 -27 -62 14 13 62 -47 19 -17 54 69 43 -28 -87 -2 16 10 -53 23 -2 12 -3 19 7 3 -44 -3 7 11
4753 11 -86 1 -53 -17 14 50 -26 -35 34 39 45 3 11 14 20 -18 5 -32 -12 -4 65 22 -13 -31 -32 43 -4 -23 -51 8 46 11 -13 2
4787 2 -10 39 -4 20 -24 -36 -91 -35 34 25 0 -42 -40 36 -8 29 0 -13 21 -8 32 -21 -30 -18 -38 25 15 -17 -48 -61 31 8
4819 8 -10 6 -4 -52 -10 12 54 11 -100 5 39 -9 45 44 -25 10 31 8 -45 4 -35 -4 6 -4 82 -20 -19 -30 3 -8
4849 -8 -12 23 15 32 55 29 -3 -21 -17 4 -21 4 -40 88 9 24 -2 -61 5 12 -28 28 49 -25 -72 6 19 13 21 16 12 -16 7 18
4883 18 -11 -8 10 -14 -65 -20 -22 28 -5 -11 10 23 46 -21 12 25 55 -21 -50 15 -6 -3 -73 1 1 16 -36 -18 8 14 -27 -43 11
4916 11 -28 -18 -7 -20 36 46 -3 -12 37 -8 21 59 36 69 -33 -51 -31 -18 -12 -2 44 -39 -1 37 6 15 -30 -6 34 11 14 -32
4948 -32 41 -15 21 53 -14 -3 -30 42 1 64 59 -56 -9 48 -5 -30 -24 28 -47 6 74 -82 -66 15 3 23 44 -18 54 -11
4978a1Jk5k5k2P1J8J5J2l3NM1r0N0mk5N1l2L0m6K2j1j4L5j0rkK9k0J2j6l5K2Q9
5011G3o0lmK4j5l4J4%M4n6J6O4m2J5l1k8K8krL0L4o6J9rL1l2M0p2O4nJ4o5LlJ7
5046fP5n3j0m6N8k0J0o7L9K2QJ9N4j06R4o2o1O2QJ9K4k5J0k5j4k5oL4m8k9M9N1
5078C3q8M6L2Nll3oK3kN2p7J3o9N7j4nO3k1J0J7l7J8Lm4O8p8M8n2M5M1O2o8o0
5111b1K3m7M3K2M8o8N2l7%K2l6m4L0K0K0l6km3M2J0M9pQj5j8K6Mn8O6o2K1L4l8
5144Hl0K2O2q3l7lO1k0j5K4J7M1p0M4q1L2L3j1J3kLL9j5K6j09Q4l0%m7l0R6m5
5176b3R6qj33J46n7M2q4M3l6K5%K0j00R9r5O8OL3Jj2n4rM2L6J1q4L4l0J8Jm1J08
5208F3j18O3Jm4N5j00J11k9pOL1J8O5j06k2M7q5J09r2J3J4O2m2k5M5k5j1l2J6
$$ plain form
4978 -11 -10 -35 -60 -82 -11 7 22 34 1 6 47 -43 7 3 -22 29 -3 27 -19 3 -8 -22 13 3 -6 -8 21 1 13 -3 -38 -16 73
5011 73 13 10 6 30 15 -19 -5 -5 39 -17 -1 63 21 36 5 -23 5 3 -6 24 58 -8 11 2 33 1 41 -31 33 28 42 -23 -20 -23 -6
5046 -6 69 16 6 -40 18 -2 8 -59 -20 2 10 29 83 -23 71 9 -52 10 18 37 61 36 46 21 7 -18 -24 10 -38 -67 -18 33
5078 33 -55 -9 23 28 25 -8 -14 9 7 59 -18 -5 -74 -17 -31 -36 27 6 16 33 -4 14 17 -27 41 -37 11 -41 4 45 107 39 -21
5111 -21 2 -45 -2 20 68 0 52 15 15 37 1 -43 -13 7 27 -9 -11 -54 -12 -2 47 40 48 33 15 41 45 -13 53 -9 12 46 8
5144 8 -22 0 62 -21 -58 -61 0 -20 -35 -11 6 47 -23 21 -60 -28 5 -6 7 5 8 47 32 58 -51 33 3 3 -44 -74 22 -23
5176 -23 73 65 -68 78 21 63 -21 22 -14 11 11 31 -69 30 -65 3 9 42 43 31 -23 -32 10 46 57 -27 7 -23 -5 -4 -45 63
5208 63 -55 8 9 -35 20 -80 31 2 -5 1 32 50 115 9 -13 34 -51 58 -34 -21 -7 55 13 -12 33 8 -3 -35 -19
5237a9P1j3j30O2K0P2p3n1O2m6N9J9L0p3M9j5j1p8M0K3O4m5n7O2O1n5k7j1l8M4
5267dm7O5j4l1L6m9K1L7K5jl8j7O0n8k6O4K3k0m1L1%n1Q0J1j01J7J0J1J7nm4M0
5299Am7M1k6jmL6%mQJ5k7Rj5k7P5p8R8q8k4N2K9m1nN6m5okK6p0P9n9Q0j19P5n
5334a3QL9l0p1P0P2l1m1pL4m5k6K5P1Pl2J3J6m3ol2K9J7k6Pk5mJ1J2J8l0J9j8
5367a2k6jK9M3j2k0k0k9l5Q0M4m2nj2rJ7K3nl6m9K6RM0l6L0N8m2L6l2jmm4K1J7
5401Aj8J5K0K4mm8O1L1n7J9p6J3o1J09M1n0oJl7OL0j4m4J0J4J7J9m1O7m9J6J9
5433B8l2j5RQOL8po6KL0p4L7L5L5qm1J6J9o5O2ML1k6l5m4L3J8M2Jm5M1L2o5oM8
5468D6n9M8n9K0L2o6M1QKOJ8j0l9K5Pl4L8r0P7pj2k2K8j1j9k1N1K4l1j2M5k1L2
$$ plain form
5237 -19 52 39 -91 -29 -9 63 -10 -61 1 -45 14 33 63 -10 39 24 13 -65 -25 -2 62 17 -40 22 83 28 1 -10 -48 -4
5267 -4 -51 14 0 -31 5 -44 -23 14 39 38 0 -17 43 -15 -41 23 46 26 -15 16 16 -35 45 56 -45 -28 -18 -7 10 5 -39 1
5299 1 -46 -5 -31 -32 -36 0 0 -4 4 19 -8 1 -14 -41 34 -44 54 -34 -58 -6 23 -18 -23 33 -12 -18 -20 6 -64 15 -44 36 -83 -8 -13
5334 -13 -5 34 4 -67 3 75 44 3 -4 30 -15 -41 -16 55 62 30 43 59 16 10 -22 7 24 -2 5 -20 -24 -13 -1 17 -13 6 -12
5367 -12 -38 -39 -10 33 21 1 -19 -48 -83 -3 41 -1 -6 -18 -27 -10 13 8 -28 -77 -51 -42 -2 -38 -8 50 8 44 12 11 7 -37 -16 1
5401 1 -17 -2 18 42 38 -10 51 82 25 44 -32 -19 -80 29 70 20 14 15 -22 -16 14 0 -44 -34 -20 -3 16 -25 42 -7 9 28
5433 28 -4 -19 -10 -2 4 42 35 -31 -29 1 -73 -36 -1 34 26 -15 1 20 -45 17 21 52 26 -9 -53 -20 -2 40 41 -4 37 69 4 -2 46
5468 46 -13 35 -24 -4 28 -38 3 11 13 19 37 27 -12 13 20 -14 24 -66 11 4 -8 -30 -2 -13 -32 -53 -2 22 -9 -21 24 3 35
5501C5j6p7oR7lqK1o7pO8p3O5J2q3K3N5o0K1N4m8qPk8J2J5n0J5N8ln1N4p1O4K4
5535D1q6P5o3k1P7ro9O5l6J5m2K5n9R8m3%K1j0N4n0L6r2P0kJQ4l7m9j0K2n4R7
5567D9k4J2k9l6J8M1J9l5L8n2j2LM2mn9kK2K4Kq6O1K4k8O6j0Jj2k4q%j7kJol0
$$ plain form
5501 35 19 -58 -64 33 30 22 43 -24 -31 37 -36 29 41 -42 -19 36 -24 -3 51 3 -5 2 -26 -14 1 -49 -34 24 21 -30 24 -47 17 41
5535 41 -45 30 -33 -54 23 14 -55 10 -26 -11 -53 -28 -87 11 -32 -32 -11 -21 33 -17 19 -73 -3 -5 -4 80 43 -6 -16 6 -48 49
5567 49 25 37 8 -28 -10 31 50 15 53 1 -11 -8 34 30 -29 -31 -9 15 17 -69 -8 16 -12 54 44 45 33 9 1 1 -16 -18 -17 -23 -53
$$ [...]
8191B0
##END NTUPLES=NMR FID
##END=
