##TITLE=1H_LR-580-R2H2-CR3
 D2O, 8 sc, 
 10.1.2020
##JCAMPDX= 6.0         $$ Bruker NMR JCAMP-DX V2.0
##DATA TYPE= NMR FID
##DATA CLASS= NTUPLES
##ORIGIN= UXNMR, Bruker Analytische Messtechnik GmbH
##OWNER= root
$$ XWIN-NMR		Version 3.5
$$ Fri Jan 10 15:20:54 2020 Russian Standard Time (UT+4h)  she@DPX200
##.OBSERVE FREQUENCY= 200.1315
##.OBSERVE NUCLEUS= ^1H
##.DELAY= (6, 6)
##.ACQUISITION MODE= SIMULTANEOUS
##.ACQUISITION SCHEME= undefined
##.AVERAGES= 8
##.DIGITISER RES= 18
##SPECTROMETER/DATA SYSTEM= spect
##.PULSE SEQUENCE= zg30
##.SOLVENT NAME= CDCl3
##.SHIFT REFERENCE= (INTERNAL, CDCl3, 0, 15.7039)
##AUDIT TRAIL= $$ (NUMBER, WHEN, WHO, WHERE, WHAT)
$$ ##TITLE= Audit trail, XWIN-NMR		Version 3.5
$$ ##JCAMPDX= 5.01
$$ ##ORIGIN= Bruker BioSpin GmbH
$$ ##OWNER= she
$$ F:/spectra/data/she/nmr/H-F/1/audita.txt
$$ ##AUDIT TRAIL=  $$ (NUMBER, WHEN, WHO, WHERE, WHAT)
(   1,<2020-01-10 15:19:58.76 +0400>,<she>,<DPX200>,
      <created by zg, POWCHK disabled, PULCHK disabled
       configuration hash MD5:
       00 E9 B6 7A A2 85 ED C7 34 08 36 98 17 FE 4E 26
       data hash MD5: 16K
       E1 04 99 47 E0 EC EB D8 87 9F D2 BD BB 53 47 F0>)
$$ ##END=
$$ 
$$ hash MD5
$$ F8 11 29 68 A1 A5 F2 CE 6A 9A DE 4F 98 FD 0C 4C
##$RELAX= 
##$RELAX= 
##$RELAX= 
##$RELAX= 
##$RELAX= 
##$RELAX= 
$$ Bruker specific parameters
$$ --------------------------
##$DU= <F:/spectra>
##$EXPNO= 1
##$NAME= <H-F>
##$PROCNO= 1
##$TYPE= <nmr>
##$USER= <she>
##$AMP= (0..31)
100 100 100 100 100 100 100 100 100 100 100 100 100 100 100 100 100 100 
100 100 100 100 100 100 100 100 100 100 100 100 100 100 
##$AQSEQ= 0
##$AQ_mod= 1
##$AUNM= <au_zg>
##$AUTOPOS= <>
##$BF1= 200.13
##$BF2= 200.13
##$BF3= 200.13
##$BF4= 200.13
##$BF5= 200.13
##$BF6= 200.13
##$BF7= 200.13
##$BF8= 200.13
##$BYTORDA= 1
##$CFDGTYP= 0
##$CFRGTYP= 5
##$CHEMSTR= <none>
##$CNST= (0..31)
1 1 145 1 1 1 1 1 1 1 1 1 1 1 1 1 1 1 1 1 1 1 1 1 1 1 1 1 1 1 1 1 
##$CPDPRG= <>
##$CPDPRG1= <>
##$CPDPRG2= <>
##$CPDPRG3= <>
##$CPDPRG4= <mlev>
##$CPDPRG5= <mlev>
##$CPDPRG6= <mlev>
##$CPDPRG7= <mlev>
##$CPDPRG8= <mlev>
##$CPDPRGB= <>
##$CPDPRGT= <>
##$D= (0..31)
0 1.2 0 0 0 0 0 0 0 0.06 0 0.03 0 0 0 0 0.0002 0 0 0 0 0 0 0 0 0 0 0 0 
0 0 0 
##$DATE= 1578655198
##$DBL= (0..7)
120 120 120 120 120 120 120 120 
##$DBP= (0..7)
150 150 150 150 150 150 150 150 
##$DBP07= 0
##$DBPNAM0= <>
##$DBPNAM1= <>
##$DBPNAM2= <>
##$DBPNAM3= <>
##$DBPNAM4= <>
##$DBPNAM5= <>
##$DBPNAM6= <>
##$DBPNAM7= <>
##$DBPOAL= (0..7)
0.5 0.5 0.5 0.5 0.5 0.5 0.5 0.5 
##$DBPOFFS= (0..7)
0 0 0 0 0 0 0 0 
##$DE= 6
##$DECBNUC= <off>
##$DECIM= 24
##$DECNUC= <off>
##$DECSTAT= 4
##$DIGMOD= 1
##$DIGTYP= 9
##$DL= (0..7)
0 120 120 120 120 120 120 120 
##$DP= (0..7)
150 150 150 150 150 150 150 150 
##$DP07= 0
##$DPNAME0= <>
##$DPNAME1= <>
##$DPNAME2= <>
##$DPNAME3= <>
##$DPNAME4= <>
##$DPNAME5= <>
##$DPNAME6= <>
##$DPNAME7= <>
##$DPOAL= (0..7)
0.5 0.5 0.5 0.5 0.5 0.5 0.5 0.5 
##$DPOFFS= (0..7)
0 0 0 0 0 0 0 0 
##$DQDMODE= 0
##$DR= 18
##$DS= 0
##$DSLIST= <SSSSSSSSSSSSSSS>
$$ [...]
##$SUBNAM2= <"">
##$SUBNAM3= <"">
##$SUBNAM4= <"">
##$SUBNAM5= <"">
##$SUBNAM6= <"">
##$SUBNAM7= <"">
##$SUBNAM8= <"">
##$SUBNAM9= <"">
##$SW= 24.9337058887773
##$SWIBOX= (0..15)
0 0 2 0 0 0 0 0 0 0 0 0 0 0 0 0 
##$SW_h= 4990.01996007984
##$TD= 16384
##$TD0= 1
##$TE= 0
##$TE2= 300
##$TE3= 300
##$TEG= 300
##$TL= (0..7)
0 120 120 120 120 120 120 120 
##$TP= (0..7)
150 150 150 150 150 150 150 150 
##$TP07= 0
##$TPNAME0= <>
##$TPNAME1= <>
##$TPNAME2= <>
##$TPNAME3= <>
##$TPNAME4= <>
##$TPNAME5= <>
##$TPNAME6= <>
##$TPNAME7= <>
##$TPOAL= (0..7)
0.5 0.5 0.5 0.5 0.5 0.5 0.5 0.5 
##$TPOFFS= (0..7)
0 0 0 0 0 0 0 0 
##$TUNHIN= 0
##$TUNHOUT= 0
##$TUNXOUT= 0
##$USERA1= <user>
##$USERA2= <user>
##$USERA3= <user>
##$USERA4= <user>
##$USERA5= <user>
##$V9= 5
##$VALIST= <valist>
##$VCLIST= <CCCCCCCCCCCCCCC>
##$VD= 0
##$VDLIST= <DDDDDDDDDDDDDDD>
##$VPLIST= <PPPPPPPPPPPPPPP>
##$VTLIST= <TTTTTTTTTTTTTTT>
##$WBST= 1024
##$WBSW= 4
##$XGAIN= (0..3)
0 0 0 0 
##$XL= 0
##$YL= 0
##$YMAX_a= 490474
##$YMIN_a= -299352
##$ZGOPTNS= <>
##$ZL1= 120
##$ZL2= 120
##$ZL3= 120
##$ZL4= 120
##$ABSF1= 10
##$ABSF2= 0
##$ABSG= 5
##$ABSL= 3
##$ALPHA= 0
##$AQORDER= 0
##$ASSFAC= 0
##$ASSFACI= 0
##$ASSFACX= 0
##$ASSWID= 0
##$AUNMP= <proc_1d>
##$AZFE= 0.1
##$AZFW= 0.1
##$BCFW= 1
##$BC_mod= 2
##$BYTORDP= 1
##$COROFFS= 0
##$CY= 11.3945322036743
##$DATMOD= 1
##$DC= 2
##$DFILT= <>
##$DTYPP= 0
##$F1P= 16.9975609425685
##$F2P= -3.02152046262296
##$FCOR= 0.5
##$FTSIZE= 0
##$FT_mod= 4
##$GAMMA= 1
##$GB= 0.15
##$INTBC= 1
##$INTSCL= 1
##$ISEN= 128
##$LB= 0.24
##$LEV0= 0
##$LPBIN= 0
##$MAXI= 10000
##$MC2= 0
##$MEAN= 0
##$ME_mod= 0
##$MI= 1.114404
##$NCOEF= 0
##$NC_proc= 0
##$NLEV= 6
##$NOISF1= 3.799351
##$NOISF2= 2.8
##$NSP= 1
##$NTH_PI= 0
##$NZP= 0
##$OFFSET= 15.70392
##$PC= 1
##$PHC0= -10151.39
##$PHC1= 14.2008
##$PH_mod= 1
##$PKNL= yes
##$PPARMOD= 0
##$PSCAL= 0
##$PSIGN= 0
##$REVERSE= no
##$SF= 200.130013532006
##$SI= 16384
##$SIGF1= 3
##$SIGF2= 2
##$SINO= 400
##$SIOLD= 16384
##$SREGLST= <1H.CDCl3>
##$SSB= 0
##$STSI= 0
##$STSR= 0
##$SW_p= 3612.71676300578
##$SYMM= 0
##$S_DEV= 0
##$TDeff= 0
##$TDoff= 0
##$TI= <>
##$TILT= no
##$TM1= 0
##$TM2= 0
##$TOPLEV= 0
##$USERP1= <user>
##$USERP2= <user>
##$USERP3= <user>
##$USERP4= <user>
##$USERP5= <user>
##$WDW= 1
##$XDIM= 8192
##$YMAX_p= 0
##$YMIN_p= 0
$$ End of Bruker specific parameters
$$ ---------------------------------
##NTUPLES= NMR FID
##VAR_NAME=  TIME,          FID/REAL,        FID/IMAG
##SYMBOL=    X,             R,               I
##VAR_TYPE=  INDEPENDENT,   DEPENDENT,       DEPENDENT
##VAR_FORM=  AFFN,          ASDF,            ASDF
##VAR_DIM=   8192,          8192,            8192
##UNITS=     SECONDS,       ARBITRARY UNITS, ARBITRARY UNITS
##FACTOR=    0.0002004,     1,               1
##FIRST=     0,             0,               0
##LAST=      1.6414764,     0,               0
##MIN=       0,             -299352,         0
##MAX=       1.6414764,     490474,          0
$$ Real data points
##PAGE= N=1
##DATA TABLE= (X++(R..R)), XYDATA
0 0 0 0 0 0 0 0 0 8 -8 8 -8 16 -20 24 -28 32 -40 48 -56 68 -80 92 -109 124 -143 165 -188 215 -243 276
30 276 -313 349 -394 441 -490 549 -609 678 -753 833 -925 1024 -1134 1255 -1390 1541 -1710
47 -1710 1902 -2126 2379 -2679 3035 -3466 4007 -4698 5628 -6947 8969 -12504 20397 -74647
61 -74647 174583 416698 189224 30769 28366 -12084 -225895 -286909 -98977 112454 132282
72 132282 121327 176626 165183 -45310 -268854 -299352 -131738 76361 224667 239585 117245
83 117245 -39894 -102681 -109598 -146509 -152843 -10050 179263 210684 96513 20163 -12325 -129968
95 -129968 -259213 -168799 101998 238259 132411 18461 34100 13656 -138127 -221595 -91620
106 -91620 83527 119522 93401 118186 95331 -66514 -210779 -160431 -4102 67953 61857
117 61857 88318 120206 55658 -66486 -126421 -112007 -76728 -10147 101303 167681 107651 -13490
129 -13490 -84059 -99287 -97660 -52821 40368 94505 63966 33892 56296 32962 -93201 -180588
141 -180588 -93149 66773 117741 74586 56362 45950 -42453 -138863 -102537 21475 62765
152 62765 9908 8419 82278 93564 -14083 -115656 -110827 -43958 14471 64684 101205 76960
164 76960 -5155 -67987 -69505 -44688 -21843 8349 40943 47419 38168 37306 16694 -54972 -115370
177 -115370 -74716 35912 92230 60098 20157 11620 -12591 -63022 -70360 -13626 30759 22540
189 22540 17255 49692 56923 -6241 -78086 -78441 -23929 22084 41299 49657 40789 5691 -29663
202 -29663 -38029 -31221 -26065 -11344 23762 52369 47382 16257 -17561 -44553 -53821 -30227 16278
215 16278 44933 35488 15182 7793 -800 -25406 -43731 -31906 -302 24681 37630 40343 21005
228 21005 -19812 -50081 -40746 -6584 16702 19653 18861 21417 15985 -3113 -23642 -33088 -26768 -6791
242 -6791 19821 39903 37556 10557 -23203 -39511 -27189 -2432 12132 11892 11977 18150 17549 381
256 381 -21982 -30904 -22857 -4872 17332 34756 31227 5017 -22737 -28891 -16297 -2895 3955
269 3955 9373 13627 14570 11787 3534 -13712 -30300 -25637 1023 23964 25167 14122 4304 -7698
283 -7698 -22178 -21917 -3116 10594 5819 2530 15607 21504 96 -25253 -24120 -6162 2423 6631
297 6631 18762 23283 3911 -18526 -16119 -2337 -3885 -10850 2408 22364 19053 -119 -6840
310 -6840 -5604 -13931 -20154 -2422 22185 20087 449 -3554 4370 -3474 -19432 -13820 6498 11291
324 11291 3048 7452 16628 1794 -23335 -21206 3514 10501 -1272 1495 17875 12319 -12607
337 -12607 -17271 379 2904 -11804 -6462 20207 24329 -3057 -17892 -4882 2941 -9885 -10873
350 -10873 11365 20255 1150 -9651 3547 6434 -12997 -20160 2133 18075 5952 -3721 6969
363 6969 8806 -12795 -21211 718 15248 1122 -8945 8386 18454 -2889 -21002 -6310 9817
376 9817 -1668 -11362 7960 22886 3198 -19330 -8259 9705 -695 -15033 186 20134
388 20134 8890 -11755 -5436 9225 -1589 -18381 -5503 17505 11650 -8060 -4357 10885 1144
401 1144 -17888 -9452 12134 9909 -7018 -2145 14113 5577 -16243 -12788 8387 8063 -8542 -4105
415 -4105 15235 11092 -11949 -13407 5840 7146 -10294 -8046 13829 15079 -7298 -13277 4107
428 4107 7746 -9326 -11665 8842 14995 -2722 -10132 5049 8578 -8945 -14498 4142 14143
441 14143 -395 -8283 4899 9906 -6533 -14619 1150 11580 -1009 -8656 5183 12988 -2687
454 -2687 -14165 -1321 9268 -1540 -9771 3679 14402 1004 -12649 -3109 8361 -478 -11100
467 -11100 87 13027 3967 -9238 -2641 8104 282 -11378 -2824 10849 5211 -6943 -2402
480 -2402 8145 1435 -10877 -5683 8018 5451 -5598 -2282 7846 3558 -8833 -6370 5831
493 5831 4618 -5101 -3073 7293 5896 -5935 -5696 3710 3234 -5923 -3696 7159 7035 -4257 -5847
508 -5847 2946 3513 -5352 -4800 5126 6713 -2759 -4783 3520 4640 -4476 -6993 2240 5946 -835 -3654
524 -3654 3079 4994 -3579 -6888 432 5674 -122 -3950 1840 4706 -1087 -4673 -65 3177 -1022
539 -1022 -3991 1625 5685 765 -3907 -1019 1892 -1322 -3259 1608 4578 324 -3838 -569 3514
554 3514 -273 -4230 -1035 3094 1582 -1544 350 2912 -473 -4384 -1760 2683 2415 -943 -741 1157
570 1157 639 -1332 -962 1138 -120 -1583 344 2543 1734 -1483 -1574 -100 -118 -660 356 1877 216
587 216 -1462 -257 1078 279 -1306 -1044 664 1323 875 394 -285 -883 -927 -60 719 771 -74 -320 13
606 13 587 466 -649 -1854 -1477 862 2219 953 -380 -885 -893 -857 -35 1073 697 -1700 -1395 1383 2528
625 2528 214 -2893 -1637 730 849 442 1214 974 -1734 -2450 654 2782 476 -2471 -1575 1497 1707
642 1707 -191 -698 -356 -1206 -1269 1487 2951 142 -2928 -1318 1905 806 -1061 -222 960 -911 -1820
659 -1820 1468 4012 -14 -4908 -2254 3591 3269 -1871 -2215 1180 1507 -1975 -958 2632 1571 -3474
675 -3474 -2518 2840 4315 -986 -3780 -421 1438 -6 17 2078 321 -3373 -1870 3170 3466 -2286
691 -2286 -3739 1123 2734 -378 -1626 1963 1084 -3871 -3407 3826 5204 -2463 -5416 551 5027 176
707 176 -3213 -115 1837 -1617 -2869 2803 4780 -1691 -6240 -429 4913 1593 -3392 -985 2347
722 2347 -210 -2517 1418 3738 -1486 -5274 -96 5427 2024 -3713 -2194 2325 340 -2067 958
737 958 3413 -1223 -5150 -661 5633 2260 -4711 -3376 3006 2191 -2078 -844 3111 -48 -4681 -1462
753 -1462 5422 3182 -4499 -4312 2626 4327 -1106 -2523 771 1233 -2549 -1266 3772 3223 -3549 -4289
769 -4289 2103 4291 -212 -2909 125 1194 -1366 -712 3365 1963 -3837 -3778 2562 4806 -784 -3646
785 -3646 302 2715 -1144 -2014 2006 3244 -2591 -4393 1859 5786 255 -5235 -1720 3432 1789
800 1789 -2124 -401 1970 -729 -3274 780 4042 613 -4118 -1670 2765 2047 -1264 -759 1059 -829
816 -829 -2447 1087 3672 116 -4158 -1437 3208 2007 -2115 -1608 1181 42 -2019 553 3386 334
832 334 -4216 -1805 3448 2829 -1945 -2631 927 1613 -879 -786 1757 959 -2782 -2014 2890 3284 -1054
849 -1054 -2855 55 1853 341 -493 859 219 -1984 -924 2375 1866 -1461 -2784 207 1693 204
865 204 -595 496 25 -1697 -728 1921 2062 -1780 -2654 441 3003 445 -1618 -599 524 -131 -608
882 -608 1100 1749 -699 -2197 -159 2073 1267 -1360 -1167 434 654 116 442 348 -1318 -1456 -83 1779
900 1779 662 -1467 -709 263 606 149 542 256 -1138 -1316 585 1877 451 -1479 -1179 566 926
917 926 -2 -312 39 -139 -495 333 1585 112 -1484 -1065 567 1191 210 -406 -259 -418 52 231 567
936 567 -21 -958 -613 350 1083 306 -541 -522 50 227 890 217 -645 -725 -73 663 784 -124 -827 -540 -267
957 -267 192 516 263 -328 -593 -229 537 721 286 -626 -664 240 789 227 -342 -682 -315 306 254 171 -151
978 -151 -46 -280 -319 722 711 -270 -775 95 668 340 -333 -411 -13 66 -250 508 381 -226 -1174 -429 1231
999 1231 342 -582 -476 264 542 106 -3 252 -225 -696 -39 1223 381 -760 -524 271 605 -191 -187 511
1019 511 -48 -667 227 765 281 -1121 -1095 977 811 -584 -571 298 357 -589 -322 948 566 -820 -912 597
1039 597 1041 -356 -913 10 718 -319 -564 603 914 -583 -953 724 1201 -520 -1039 -101 955 -72
1057 -72 -645 96 577 -305 -992 239 1077 -69 -1326 -138 1278 91 -880 -77 1050 16 -803 2
1075 2 1115 -81 -1190 -255 1616 273 -1198 -727 1001 594 -1122 -194 774 247 -1184 -233 1331
1092 1331 828 -1105 -1016 952 591 -900 -260 786 618 -734 -708 897 653 -991 -1048 462 1001 -599
1110 -599 -719 617 602 -790 -690 878 929 -914 -792 793 1035 -321 -950 189 888 -422 -944 738
1128 738 974 -525 -1192 714 1181 -260 -1152 39 945 -575 -944 160 1042 -171 -1184 287 975
1145 975 176 -1330 -108 937 52 -806 4 678 335 -668 16 1126 251 -1289 -328 813 569 -888
1163 -888 -335 721 275 -757 -446 1048 153 -932 -403 893 590 -358 -612 454 528 -590 -260 534
1181 534 76 -1142 -639 988 625 -447 -547 223 498 -109 -169 187 612 -604 -740 439 813 -18 -463
1200 -463 -88 255 -96 -387 538 501 -687 -530 380 729 169 -627 -81 584 196 -328 -156 242 -304 -559
1220 -559 253 580 -58 -684 -25 551 124 -221 -306 71 125 -302 174 167 -241 -727 -4 362 -16 -269 -330 79
1242 79 37 -222 215 576 -61 -752 -59 592 190 -379 22 92 215 -12 269 104 -104 -464 -86 273 211
1263 211 -405 -288 196 440 -287 -58 -168 -73 -26 233 223 15 -74 4 176 74 144 22 -47 -222 -366 31
1285 31 139 314 -325 -308 181 246 211 -131 -174 132 -288 44 82 82 -235 -414 202 63 160 -113 -154 171 -35
1308 -35 -3 95 -146 -422 -474 -299 266 -61 -100 -126 -319 -122 91 212 -332 -235 -106 272 40 562 -7 -181
1330 -181 -128 70 422 144 -227 -164 225 172 360 131 -139 -278 -238 301 517 118 -63 -227 63 47 130 185
1352 185 -18 -226 -133 192 56 218 -454 -32 152 373 -4 -8 108 -29 -221 162 199 85 -291 -436 91
1373 91 219 -32 -385 -160 -151 -166 30 98 93 -404 -427 331 370 -275 -158 261 315 -122 63 315 -138 -296 -396
1396 -396 298 561 84 -561 -168 211 37 -60 -1 245 -35 -511 236 383 93 -408 181 77 -91 -231 -159
1417 -159 5 32 -391 215 327 -135 -474 33 269 217 -148 -371 235 -163 -362 13 568 199 -278 -7 480
1438 480 317 -415 -71 440 488 -326 -271 375 125 -552 -321 25 429 -175 -336 67 115 -5 -35 314 261 -152
1460 -152 -9 419 462 -150 -534 317 429 214 -338 -54 257 -84 -304 227 233 -450 -292 -99 361 436 -288
1481 -288 -40 483 -160 -513 -1 357 -526 -579 176 458 162 -426 -373 38 -87 -451 196 101 91 -324 -81
1502 -81 550 301 -462 -290 445 265 28 -79 264 11 -468 138 281 348 -262 -180 113 493 -107 -180 203
1523 203 32 -411 65 44 63 -189 -347 228 227 180 -171 167 -7 -2 53 63 81 -160 -98 259 344 -214 -231 -277 193
1548 193 102 -106 72 -50 -90 83 291 516 147 -500 202 89 303 -77 -34 38 55 -121 85 275 202 -346
1570 -346 -114 314 213 -222 -197 -180 196 -150 -32 222 17 -297 20 169 -90 -71 1 86 -80 -206 189 322
1592 322 102 3 293 66 18 -231 -315 242 482 212 -63 -2 -73 -328 89 221 331 71 136 -140 139 21
1614 21 -43 238 133 -8 115 15 -18 -63 -89 -156 111 188 -146 -29 101 112 151 214 157 -189 -211 240 257 -47
1638 -47 -243 -44 -10 83 282 -152 14 -349 5 64 -10 -216 -32 172 142 85 184 -98 -146 122 -101 207 171
1661 171 -38 84 -68 317 160 168 46 68 -92 -383 81 137 -11 64 -39 -18 160 242 60 -217 -299 6 72
1684 72 99 131 123 -185 235 -85 220 -132 -40 58 124 69 106 -76 6 -26 119 -190 -51 112 190 -33 -44 219 294
1709 294 -524 -124 105 -238 52 147 -34 -40 -31 256 43 -21 -153 -293 -123 25 180 -168 13 -150 112 -52
1731 -52 11 -186 -165 67 451 84 -207 -52 -135 39 262 30 88 -407 72 134 417 68 -67 165 311 -24
1753 -24 -52 -106 62 -227 -209 52 100 -99 -73 -263 109 147 -260 359 191 113 -31 57 -104 118 -18 -302 335
1776 335 -49 -238 -170 121 -149 -8 -75 168 208 -172 77 17 -21 -94 -30 -67 336 -103 -58 148 -133 -153 136
1799 136 349 349 -26 -21 260 165 276 -214 -27 92 34 -136 124 77 -100 -154 250 151 134 -86 79 321 95
1822 95 -18 -112 157 -165 -16 -90 -114 63 -29 -72 -119 -13 -95 128 60 31 65 -98 214 -162 -230 -30 -4 -32 -129
1847 -129 224 127 307 168 -77 96 -69 184 -314 -101 34 59 -337 -301 -82 -87 -93 183 20 -253 5 1 30
1870 30 131 -173 258 32 9 144 271 16 159 -76 -90 169 105 -21 -265 -124 9 -190 254 -51 -85 -113
1892 -113 18 191 -175 123 -95 -158 -170 -132 8 163 124 8 -58 182 74 162 -61 31 -98 76 280 -70
1914 -70 174 -100 -146 27 -34 -223 -360 98 -39 232 74 -39 157 -303 245 11 -85 -313 5 100 -348 61
1936 61 -138 -260 -240 -312 86 86 -89 -158 -33 334 6 228 24 124 -107 35 120 -35 -51 -147 32 -198 87
1959 87 -119 -202 -64 42 -122 123 185 366 29 73 248 -26 168 -48 -188 293 168 -33 37 208 -417 69
1981 69 -112 15 143 -18 -119 20 -175 92 102 89 -42 -94 145 84 98 -183 -205 366 97 -49 -96 -23 -173
2004 -173 -39 -41 155 185 40 136 199 273 133 188 -342 52 46 94 8 -200 -164 -267 -15 279 -154 -338 -208 125
2028 125 -211 149 59 70 163 -393 103 84 -95 -25 65 -90 -38 52 24 -11 -32 -29 -146 -320 11 192 -201 149
2052 149 -24 -151 164 -197 -28 -143 -119 97 383 -65 377 160 261 311 39 121 -51 27 -75 0 86 312
2074 312 -255 285 186 14 191 -100 69 289 29 -85 150 -62 92 188 -79 -29 1 14 275 286 -209 43
2096 43 -133 -112 130 -52 136 150 -83 -1 91 -11 10 -166 59 220 -344 194 221 -177 -4 132 -64 -148 -35
2119 -35 -169 105 -50 122 31 -118 -153 -173 -113 110 -15 290 -319 -28 -87 -15 -34 315 12 -95 -159 17 -5
2142 -5 -9 -76 104 -150 17 -236 3 116 108 129 -66 171 66 -40 76 270 150 45 -255 23 42 103 -436
2165 -436 152 30 -91 80 216 143 350 100 81 -184 47 8 -200 3 -152 -149 -152 43 109 -216 152 -73 2
2188 2 -15 64 131 -179 -80 -55 335 144 -120 -148 -87 89 101 284 5 30 -34 -43 18 131 -57 147 37 -115 40
2213 40 -47 34 130 -51 8 -28 -134 74 -43 64 53 -108 -52 -63 -187 -116 -22 -127 -109 188 43 285 -208 154
2237 154 -358 -70 -135 -141 26 -12 249 -158 -38 212 41 -106 -15 -197 -107 -200 177 -162 -271 -136 -23 -14 -108
2260 -108 -45 -13 123 -92 -4 -437 235 227 -23 92 -40 63 38 56 83 91 -207 -68 60 278 -124 -36 -318 189
2284 189 187 16 -202 158 -148 -15 187 -136 -57 83 -93 209 -187 -88 -2 -48 265 67 80 -270 72 6 -43
2307 -43 -170 -10 112 -99 -156 -60 -90 -46 -142 161 -154 -341 3 -76 -165 58 49 -214 168 290 -150 -28 171
2330 171 -76 -364 11 263 165 -164 87 -233 -59 -151 -76 66 -251 -45 54 146 -88 126 6 -159 200 146
2352 146 234 116 -30 -71 -264 -158 60 -34 93 -205 156 -19 -130 85 -159 -237 -92 261 74 361 34
2373 34 -157 -159 112 54 -25 -174 -13 106 -170 -210 -108 232 -12 163 -54 -183 155 -57 158 -30 -67 -78 -58
2396 -58 -139 -19 140 -26 137 11 145 320 -135 -66 93 -167 123 132 234 20 108 373 282 -364 46 75 -206
2419 -206 58 -49 -151 134 188 131 101 -35 -261 -79 -26 79 -5 -47 46 -10 96 50 263 35 115 2 -247
2442 -247 105 35 -294 -101 18 -52 30 -83 -41 -163 -176 -150 228 -239 37 -102 2 -70 32 95 -101 -8 203
2465 203 -362 3 -52 -315 2 79 327 235 54 146 -70 302 -174 52 272 0 -151 -28 186 -272 162
2486 162 -79 251 85 136 14 154 261 -158 -22 265 -84 -83 -54 119 99 46 43 -62 98 -109 6 350 -168
2509 -168 201 311 -247 37 -303 163 44 62 -293 333 -2 -153 191 -159 162 -185 215 140 -25 -26 -47 -265
2531 -265 65 180 178 133 -488 507 76 83 183 50 73 129 210 -217 63 276 -79 -194 -158 62 -38 -117 93
2554 93 83 -112 -66 -7 -126 10 -20 170 151 4 -69 1 128 -78 -60 189 131 -120 101 -44 -2 -69 22 -32 -119
2579 -119 87 61 -4 202 -93 -178 -193 47 71 379 -179 -53 -7 -171 -61 83 -70 -106 -85 -8 95 31 108 -1
2603 -1 -375 -144 -46 -79 265 -42 35 -21 126 263 91 -159 -219 19 -137 31 103 -15 361 -215 -100 255 -45
2626 -45 -229 187 -17 -290 52 -309 9 -23 273 136 -7 -240 -342 58 166 93 186 -40 -268 -30 182
2647 182 98 43 -61 83 40 70 212 -139 81 -15 -267 -91 120 -130 -87 42 -171 -82 87 311 52 -65
2669 -65 27 54 -4 112 10 348 266 144 94 -260 -90 231 45 70 -131 43 -154 140 -81 58 63 -221 -77
2692 -77 -12 -66 30 203 -153 -21 -38 234 -170 -56 -43 126 144 -146 76 229 212 36 -194 -23 -180 -112 -253
2715 -253 187 -161 254 105 18 27 -9 -130 -135 -33 153 -15 -18 143 70 -131 -82 34 -55 87 63 -102 -23 109
2739 109 -179 -21 20 -56 -235 195 -221 22 151 46 -148 -265 216 92 -14 52 -305 398 24 141 -65
2760 -65 137 4 -26 -347 34 -324 -86 -146 253 77 15 42 62 74 -64 -77 158 245 -291 -5 247 210 285 20
2784 20 -53 -67 4 25 -137 -208 90 68 204 118 -82 -244 14 245 33 320 96 -94 240 129 10 -22 -99
2807 -99 -145 -72 -94 25 -50 85 -22 -17 -10 76 233 43 149 -16 121 -75 -122 47 -134 -166 4 -1 13 63 30 -76
2833 -76 40 163 -134 7 -29 35 -186 9 19 -91 236 29 122 201 104 200 -174 -215 -66 -44 118 -8 -198
2856 -198 -96 -155 295 -2 -126 30 -245 -157 -181 33 -25 -31 -85 -26 -192 -68 -94 -53 -157 16 -62 157 42 26
2880 26 50 133 -1 -6 -52 212 222 52 383 -80 -48 286 -25 126 256 177 195 -181 10 -37 183 -243 47 -343
2904 -343 149 200 -155 66 -274 178 -263 -29 23 2 -120 11 -76 -365 -31 -248 176 -159 176 318 31
2925 31 67 199 57 -77 -46 -165 255 57 -81 -138 169 -2 -174 169 171 239 -17 -2 -232 -74 50 56 -40 217
2949 217 280 -30 -283 167 48 34 -155 -63 192 -274 64 49 108 -126 -32 133 -12 -50 -243 -53 100 -15
2971 -15 163 24 -11 -137 -100 -171 -263 213 -153 -4 -76 359 276 163 -104 148 -160 -148 103 -94 65 -121 -249
2994 -249 268 -99 143 156 12 -329 177 24 -53 -260 24 130 -250 226 57 0 -29 129 57 -9 246 -239
3016 -239 25 125 115 -169 96 213 -107 -292 152 18 47 -414 178 114 -72 -190 -146 55 -56 50 1 -173
3038 -173 -24 184 -7 -147 -75 63 119 -5 -121 -58 6 -97 -97 -85 -93 289 -207 -83 -131 -55 124 -286 115 80
3062 80 169 -41 35 112 112 268 257 -120 139 -31 20 -145 16 92 43 18 -129 121 -214 144 207 35 -69 -52
3086 -52 -276 188 -194 -123 -208 50 234 -23 135 65 -23 174 41 -329 -94 7 -80 200 96 -218 40 -100
3108 -100 -171 103 -27 -351 -100 -195 20 1 -62 -271 -49 69 119 -116 -122 43 136 179 -101 273 21 30 -69 -82
3132 -82 -168 -7 -149 5 11 11 134 -22 196 92 85 -60 -212 -237 6 151 -6 27 125 -344 152 -42 94 28
3156 28 -54 -100 -265 -121 -64 -103 178 -261 -39 -205 107 79 -81 -134 -410 21 -48 -177 -128 111 -4 -387 55
3179 55 -82 -88 59 -386 -79 269 -161 -347 13 148 -122 42 -22 21 53 85 -164 -16 -87 -81 225 2 22 -141
3203 -141 57 -133 -77 -25 203 36 -41 -254 -51 -91 -111 -184 59 -182 -14 237 -273 51 297 29 -157 -182
3225 -182 -209 -28 -69 29 91 -63 -208 -88 20 -204 -118 -27 245 -11 35 -28 -69 151 -76 175 26 89 -62
3248 -62 149 -286 -122 -326 -40 123 -34 38 35 38 -34 118 -22 118 36 -29 -254 88 275 -8 -171 -138 -117 -232
3272 -232 148 3 -153 -20 44 -66 -78 80 -30 182 -285 -47 -106 -243 -67 10 -172 -105 207 -138 -72 79
3294 79 -159 -149 -52 -65 63 204 79 -126 -256 -241 -277 69 -31 -40 9 -67 164 160 -52 -393 -22 131 -1 -202
3318 -202 -243 91 79 -135 223 -20 -199 -269 155 -47 101 154 -121 -67 -37 187 -60 13 35 19 29 -67 87 141
3342 141 -158 -4 64 42 -20 -6 -122 117 -111 292 -107 -101 237 211 245 166 -57 -61 -374 20 146 35 64 85
3366 85 129 -110 144 -15 -13 310 340 -167 4 -3 -382 -214 -98 297 10 104 29 -77 129 -40 -42 -83 -187 -38
3390 -38 -126 -156 31 104 175 219 -235 -77 -24 -104 25 46 449 279 -33 415 30 254 10 -192 -159 20 11 348
3414 348 -97 101 -70 -123 -95 -183 137 -22 98 37 -252 111 231 60 61 -15 155 -201 5 -9 -210 12 -10
3437 -10 -296 57 -132 -5 16 -44 197 -85 28 226 -57 -25 -67 127 -92 -288 -175 -119 -23 12 -191 96 132
3460 132 -72 -135 118 281 120 44 122 122 55 87 89 39 89 86 -70 10 187 176 2 -192 120 139 -159 -38 -25 281
3486 281 -65 -212 -145 -29 18 95 167 272 -68 -105 -121 77 -78 104 -96 107 159 346 24 245 184 83 -23
3509 -23 -60 113 174 73 244 -27 -108 62 -232 -64 -218 91 -52 -115 -129 42 72 -71 -34 41 -85 -142 -102 -172
3533 -172 31 191 195 385 115 -67 -177 -86 45 128 104 -113 -98 77 55 -12 115 22 108 -393 148 -204 -129 -41
3557 -41 -119 21 28 -35 -115 -368 -86 167 -102 50 32 -103 260 -139 -392 156 42 -28 1 -87 25 116 -22 -42
3581 -42 24 147 -64 -301 130 208 83 -132 221 120 -67 -27 180 -127 79 -13 212 135 -218 -194 -149 -163 -58
3604 -58 155 14 224 -12 -27 45 140 19 -10 5 -171 -119 -54 37 -64 -138 -37 99 -227 359 219 17 -203
3627 -203 -62 81 351 -352 65 112 166 357 0 -106 302 -156 -142 -7 -26 143 -228 -98 -18 174 -118 102
3649 102 -333 -223 121 -52 56 85 -63 254 -202 31 153 76 269 -164 -104 359 79 -104 128 143 -48
3670 -48 -127 216 -279 -92 176 32 -256 -202 168 91 119 -91 -285 -82 -162 78 -172 130 280 44 138 -94
3692 -94 153 -79 -45 10 19 163 -251 224 99 -17 84 22 250 -98 -1 96 -71 -173 178 -89 -211 -172 52
3715 52 -85 125 312 19 -127 62 -146 -133 -158 195 -167 -107 176 -95 -184 -258 277 0 -45 -142 -8 47 195
3738 195 97 -112 58 -84 27 -221 198 62 252 62 121 115 146 54 -37 15 -236 208 211 133 124 -68 -229 95
3762 95 -337 -40 -80 61 -28 -370 -38 -161 -221 -195 -63 408 -80 258 13 -46 37 136 280 -305 9 29 -41
3785 -41 -175 53 -98 -86 50 -226 45 347 244 -145 65 360 464 -150 -5 41 -81 106 -14 208 37
3806 37 -132 -94 -231 -176 16 97 118 392 -76 -87 399 -161 3 -10 -93 -3 302 15 44 -125 91 -107 120
3829 120 -161 233 159 -126 -100 179 -140 9 134 116 158 -253 -108 337 124 -68 -36 -72 -97 -33 -92 -84 -107 -39
3853 -39 -124 103 -30 -226 -320 -191 -172 260 138 174 46 -26 273 -262 68 -275 93 -82 -33 -116 42 -148 70
3876 70 -53 267 67 82 235 185 161 -113 -172 -218 -19 353 -193 -296 299 169 -3 -68 -64 179 32 68 -61
3899 -61 142 -121 -5 206 -249 -62 16 -303 -206 -141 81 101 -272 -93 -120 220 -232 27 106 27 -151 191 -230
3922 -230 -62 148 -285 -160 191 23 -41 -83 -102 53 156 454 17 42 -209 117 115 -71 39 -279 -108 83
3944 83 -251 93 83 256 -54 -167 162 308 109 -55 68 -106 30 2 -103 -281 -354 47 97 157 -186 -2
3966 -2 35 -411 22 -353 67 114 -165 -203 50 -22 -156 0 75 92 40 105 -225 2 56 109 9 -73 -311 -80
3990 -80 -2 193 -93 -42 162 32 -101 72 12 0 82 -33 -181 -80 257 314 128 12 -48 50 31 -137 -107 173
4014 173 -244 -173 -90 -268 146 27 173 -21 -223 461 53 63 82 44 -228 -158 -178 -122 50 180 70 126 -9
4037 -9 70 204 -46 -84 39 -168 -126 -18 194 -37 -103 -258 136 -181 -211 197 -187 116 -43 -89 18 152 -159
4060 -159 -69 81 37 48 58 -284 108 79 255 159 -67 99 -51 148 99 -119 345 40 -72 393 56 71 -52
4083 -52 110 -96 -493 -66 291 -74 174 -230 -337 -148 -9 276 6 -39 -68 131 -128 -95 69 -144 16
4104 16 -160 -125 42 -263 -105 -30 -295 -298 -153 -61 160 82 101 86 -108 -60 38 129 -97 54 -80 -55 44 -82 37
4129 37 -76 -166 -16 16 78 142 84 94 3 -17 90 -480 -22 -76 -315 144 241 -42 -132 134 65 -77 202 -10
4153 -10 -75 69 -68 144 189 -55 190 -109 -1 -10 221 -17 302 39 -101 -87 -198 -189 220 288 -6 -11 95 34
4177 34 106 -53 50 80 -113 130 -59 -53 89 44 -53 12 108 -82 -81 62 -100 -7 -141 -100 195 -126 16 201
4201 201 -310 202 65 175 -294 251 2 -167 -35 91 199 11 262 -172 130 -4 -44 -51 -133 -28 -18 107
4223 107 175 -136 -122 74 -128 -24 -272 24 47 -108 6 336 89 159 -141 -43 -149 14 -110 1 78 171
4245 171 110 69 55 277 155 -40 22 19 128 -71 104 -35 -130 -287 -83 -52 -168 -155 -28 124 113 -268 -209 267
4269 267 337 26 57 -134 275 86 -177 41 88 36 -140 -211 -156 -74 -12 -45 -21 -114 -295 57 -68 19 -172 351
4293 351 175 216 -146 -33 80 164 -224 -376 54 -157 -194 165 67 -135 -161 321 -101 136 53 127 -19 312
4315 312 67 -10 147 213 37 49 -68 294 82 -169 -120 -192 10 98 341 -83 37 -179 333 -4 204 -14
4337 -14 119 -6 -169 22 -51 -546 112 -176 29 -187 228 -202 -90 41 10 -90 151 251 64 292 290 -151
4359 -151 -166 -221 -195 -15 -162 -169 -273 65 349 130 -102 12 19 482 -156 68 151 -136 -46 -105 -65 137 43 -88
4383 -88 66 -152 49 338 187 -258 293 -93 24 -265 -83 -41 226 -4 18 95 -126 -309 171 -141 8
4404 8 163 78 -38 40 283 360 24 273 -10 -24 -78 213 65 74 117 -255 59 -252 209 -210 29 -91 -119 156
4428 156 -142 0 293 89 174 -56 -133 -31 106 63 13 69 -84 -41 -133 123 -98 67 -26 42 41 104 100 -260 -232
4453 -232 -152 -205 -162 8 -44 -133 170 -124 -22 208 90 102 83 -252 -160 185 27 5 -160 39 113 120 -113 -136
4477 -136 -100 -64 -73 -111 218 238 -82 -16 -196 106 17 53 49 -123 -9 138 -50 2 -115 -191 107 65 275 -31 278
4502 278 108 -237 111 158 31 -78 -19 -135 18 181 -53 29 53 109 -71 64 157 -121 135 -96 -113 354
4524 354 134 143 547 -149 -204 64 -108 344 111 164 -105 30 -12 -171 137 -63 64 -171 -39 -105 179 159
4546 159 1 232 -267 -102 -313 -39 20 -164 -79 99 59 -168 111 -118 152 -60 4 45 -273 -194 -255 61
4568 61 77 47 -155 -329 245 -159 -164 -34 167 49 140 93 -23 -121 -50 -55 293 61 -139 13 -1 297 71 37
4592 37 98 -67 -27 -9 -276 236 263 -98 83 293 99 -137 57 172 173 -335 144 -32 -96 150 43 -1 -143
4615 -143 170 -222 36 -55 76 -70 169 133 -93 -45 8 -106 -118 254 105 440 -143 142 102 200 9 70 99
4638 99 8 134 47 -52 36 102 -253 112 240 210 134 202 293 -135 80 164 -300 300 208 177 -11 13 -95 142 -341
4663 -341 76 140 -186 -109 246 151 21 -82 25 95 -169 -109 -133 -197 -208 42 -153 -25 -47 84 88 338 64 250
4687 250 -132 -431 -182 222 -222 209 114 -136 55 179 -54 -282 -21 -251 -67 -153 -96 -380 45 92 128 219
4709 219 42 -70 48 -255 9 76 -8 225 216 119 -242 25 -300 -37 -11 60 5 -14 10 64 -200 -158 66 25
4733 25 -168 109 -184 -307 -155 -190 -47 26 -287 -115 65 -150 -292 98 -66 -296 31 -109 27 -158 -124
4754 -124 -73 -176 66 26 59 -44 -228 191 287 190 -24 156 92 -30 -25 41 -181 -226 -139 -294 -150 -98 62 -240
4778 -240 -24 216 -120 154 -29 92 98 -69 367 -132 14 317 -117 -87 164 179 -118 -24 -190 154 -50 143
4800 143 -109 -71 -41 10 -238 249 -34 -199 -79 -187 76 -82 52 -211 -140 -33 63 -88 -6 22 37 -196 127
4823 127 5 147 101 79 24 -87 23 123 -38 152 -12 141 90 115 165 -18 -229 233 -78 -34 -70 231 -171
4846 -171 -242 -84 35 79 -154 -69 171 -20 -118 -84 42 126 -350 26 -156 -78 254 246 -45 253 178 -43 -75 220
4870 220 19 10 178 -385 49 63 -48 101 379 113 -22 -339 -145 -4 -123 175 -2 68 26 4 154 253
4892 253 110 360 -101 -143 19 29 -75 49 304 -91 173 226 3 -196 -76 -134 -5 -153 117 -19 -14 -91
4914 -91 229 504 306 147 -57 -134 77 113 -225 199 -117 -121 43 -94 130 -126 -40 -93 61 -135 -159 168 87
4937 87 37 182 61 85 449 226 -39 -44 79 -27 39 16 9 157 -318 89 37 -366 -81 500 59 17 7 127
4961 127 -11 -157 -3 147 117 -95 128 62 -132 294 -1 167 187 196 63 37 -110 -54 106 165 20 -108 84
4984 84 -22 90 105 -431 145 249 237 -12 -31 143 -148 -73 -137 -93 -250 -84 -25 -88 303 -88 -133 -159 123 120
5008 120 -44 96 38 87 -181 321 -73 26 -2 -14 65 -258 111 55 -36 253 257 -83 -22 -203 126 7 -66 -147
5032 -147 -205 43 0 -109 -3 -99 -70 19 -4 322 -208 -217 -164 -51 0 -273 52 57 -70 164 299 64 150 96 173
5057 173 40 188 -21 281 47 257 133 -36 68 92 57 180 -104 135 309 -22 4 -28 200 -277 114
5078 114 -148 -165 16 -133 -39 -63 199 -58 126 35 -32 -54 107 -28 -119 93 -77 -122 -241 192 -172 4 -165
5101 -165 63 -108 -58 -140 21 189 70 9 86 -181 -301 119 -258 -15 -307 -100 61 25 -3 189 118 -223
5123 -223 -91 93 -153 73 130 -117 -143 -20 114 -21 53 156 -116 -84 -28 -35 112 -230 -275 29 -57 -188 232
5146 232 204 -19 -33 15 -11 190 19 -250 -161 222 -85 -72 -290 -81 74 35 -244 135 27 -34 7 42 31 -24
5170 -24 -17 -159 452 -47 -95 -37 -327 191 -46 -55 12 -7 55 -60 62 130 -120 228 -156 155 74 -183 201 -98
5194 -98 -280 198 151 -75 73 -302 223 -184 -277 -246 235 107 224 78 -39 170 100 -234 66 112 13 -45 -29
5217 -29 179 74 236 -157 -246 5 340 82 -233 -158 124 -217 -68 137 214 213 147 14 -167 19 -41 98 -189
5240 -189 103 -74 -82 219 68 3 98 -94 -164 168 100 -202 289 274 24 5 -80 141 129 -87 22 -110 25
5263 25 -42 194 -23 214 98 5 9 -107 84 -38 -13 -182 -43 -27 156 3 318 -128 166 82 134 61 -18 -71
5287 -71 39 -113 72 40 48 83 322 289 -89 27 -115 92 155 162 -185 113 301 17 266 -90 122 -8 10
5310 10 5 1 367 105 33 93 -70 -57 -157 -39 34 -138 -192 -359 -455 -49 105 -348 -6 -247 -147 -136 38 37 163
5335 163 97 -70 -393 88 247 125 290 -46 36 159 176 234 231 232 175 230 164 -14 423 -50 135 -250 -87 -123
5359 -123 107 175 -192 -27 -68 145 74 102 141 178 132 214 207 -127 -109 189 63 -161 80 -57 113 22 -213 -148
5383 -148 -249 188 33 99 -176 -137 234 188 8 106 -132 24 -184 -159 38 -78 176 126 18 -10 205 221 -273
5406 -273 -14 -68 -270 -18 45 -205 222 -226 217 -183 -136 -18 -44 144 -159 -18 89 -124 -54 55 -135 -124
5428 -124 -67 -197 45 81 82 -69 -70 68 54 -19 -166 127 -98 -195 -45 20 218 -15 -109 67 324 23 79 -14
5452 -14 -13 14 83 82 73 -128 -259 41 -132 0 265 -118 213 -149 -124 -165 -10 166 -214 -131 -254 36 -172 -301
5476 -301 -32 -228 -92 -53 29 180 149 -5 -216 -45 -94 264 131 -108 -184 -7 43 -202 -132 -138 87 145 -256
5499 -256 135 19 180 -102 50 -68 -170 35 -78 -341 18 126 12 -119 -91 210 63 -29 -75 8 -87 -66
5521 -66 -356 -207 37 248 26 24 100 -195 -289 33 233 -70 -50 110 10 -122 203 -87 78 -204 124 278
5543 278 -90 186 -409 63 194 7 20 -17 -375 68 -283 40 -9 58 161 -129 -127 120 108 195 439 -8 2
5566 2 240 -644 -60 -57 14 248 -194 -146 -237 202 -177 143 -44 -70 -115 -198 84 -139 0 -151 -103 -109 107 137 224
5591 224 71 -276 120 22 -5 161 -164 76 -101 3 -112 208 -301 21 -73 0 118 -150 84 392 -93
5612 -93 208 -85 -44 10 -192 -302 129 100 99 2 73 -8 109 142 -305 101 -100 -8 83 -196 -164 125 83 -145 -271
5637 -271 337 -54 93 -217 -109 222 -39 -12 -205 -134 -40 69 43 -10 -244 36 -266 -81 -248 83 148 -326
5659 -326 -125 56 40 -205 -71 -127 61 -107 346 -81 -23 -1 -17 104 410 139 94 210 6 109 -54 -121
5681 -121 -153 -41 -65 14 1 -296 135 -94 47 -136 192 -98 21 -39 -206 43 -177 213 238 -186 -192 103 15
5704 15 -152 -116 -282 -69 199 -25 -141 71 -140 -311 127 -182 -106 -191 9 -140 -98 316 -23 -45 78 215
5726 215 -28 149 -12 210 91 -60 -86 -49 36 237 -8 11 -40 -114 196 214 41 -194 -38 111 84 -270 -107
5749 -107 70 61 69 -23 5 56 -134 -52 7 29 30 -29 260 37 228 -89 -91 35 -177 -88 -84 -25 -57 -242 -125 362 29
5776 29 -194 22 -131 -45 -237 90 -104 82 -91 66 196 280 28 -5 222 -163 -31 -236 130 -14 -68 -50
5798 -50 76 79 -83 -8 -30 8 253 -144 114 83 -334 -100 120 171 59 -172 5 98 334 54 -6 -111 -89 -266
5822 -266 3 -91 61 106 59 68 33 61 -33 35 122 -200 -170 99 -20 31 -193 70 -302 93 205 -287 99 -28
5846 -28 -344 -63 -106 -79 9 -2 165 -145 -176 -100 -59 -16 31 328 215 -244 -273 74 107 172 -92 -22 217 -68 35
5871 35 158 -16 -10 -259 -27 -22 0 -88 24 -21 66 -88 -13 134 118 -210 -102 -47 97 -225 -49 52 -288 -112
5895 -112 -154 -118 -130 -59 -86 -197 91 15 2 39 88 -15 -248 37 38 38 286 81 38 37 166 -122 -222 -6 247
5920 247 -234 -173 118 135 13 202 -150 278 -88 -108 36 -119 70 -184 126 -179 -200 -201 -41 115 52 -61
5942 -61 -168 -245 270 41 -43 250 -100 -302 67 -29 -240 -34 -24 18 102 -126 -62 97 -145 -127 -75 157 -60
5965 -60 165 -52 236 -139 159 -111 44 -87 -20 -68 161 -156 65 -8 -140 -51 2 -33 -195 -40 4 21 -117
5988 -117 -104 88 179 -157 -26 -115 -96 -17 242 -65 -183 22 201 -74 -8 -101 101 -70 167 -123 -154 290 -35
6011 -35 -146 3 -4 -8 30 72 -70 85 88 213 479 43 142 83 -45 -166 3 -163 -38 -18 -17 79 54 -363 25
6036 25 12 -98 -192 -166 -20 -6 147 -51 -79 157 -21 38 274 -67 -10 -83 -205 69 257 -70 30 -151 78
6059 78 -9 -73 -36 -32 -13 122 176 150 15 -83 270 281 153 -114 -29 14 368 57 61 183 -103 -397 225 -188 49
6084 49 186 233 -22 204 133 -115 -1 -43 86 253 163 103 -147 12 80 -240 -7 2 11 -85 -75 150 3 -171
6108 -171 36 -134 -99 -57 -137 -104 239 -225 -74 108 12 26 200 7 -212 -69 91 176 -28 -3 146 -121 -196
6131 -196 75 -118 10 155 -6 -117 -13 -52 141 261 -16 69 225 -20 224 125 -76 217 37 30 -152 -237
6153 -237 -71 33 21 124 40 -18 169 -71 313 -28 255 65 271 135 201 -28 -101 44 23 -61 -148 27 114
6176 114 -91 -50 -56 -114 140 180 -1 120 57 -117 191 -95 111 -57 19 167 150 -294 -217 75 75 82 -85 17
6200 17 -59 21 37 133 302 145 -164 120 38 468 69 45 185 -18 58 -8 -30 -36 -248 -220 -95 106 -163 59
6224 59 -11 -100 -161 -16 28 -48 152 -91 -58 -64 90 11 87 -230 -40 -135 405 76 126 -162 -29 -28 -45 -84 -300 130
6250 130 177 57 0 -42 -367 -197 85 -298 -4 22 235 223 102 -57 -65 -191 19 -5 -78 98 -197 114 -30
6273 -30 -190 -51 109 148 -23 -95 -50 -158 7 204 -102 174 138 -99 -184 -100 90 201 -46 -253 90 -307
6295 -307 -206 -116 97 67 168 -135 -35 -172 -222 125 -288 -75 -63 -110 266 284 14 167 184 -185 168 -269
6317 -269 273 66 -59 -271 -217 -73 213 -25 -139 -66 -17 143 82 -165 -274 -125 65 70 -265 101 28 -234
6339 -234 -172 -52 -63 -158 -88 -227 -56 251 94 -205 -319 129 -265 -45 -142 91 -38 251 -31 222 -326 8
6361 8 2 -8 10 110 -237 38 215 98 10 93 -76 55 94 222 60 17 56 20 71 14 162 -159 30 111 128
6386 128 -189 -112 -214 141 88 -22 64 111 -131 -142 -279 -121 82 151 109 -55 234 14 -165 -71 -259 316 169
6409 169 95 -148 -74 -299 -193 238 124 26 -21 303 -132 171 -71 -121 -226 195 -256 -47 -174 -12 8 -267
6431 -267 -132 6 -317 -68 -41 60 36 70 54 99 219 103 -124 -56 47 169 -48 23 104 -126 -76 -230 159
6454 159 -33 80 -126 -36 100 52 -318 153 -96 -88 -87 145 -22 3 -347 -220 -221 29 -45 111 -33 -164 113
6477 113 -33 -74 123 -220 -104 129 -244 43 -179 36 -147 132 -135 66 -68 130 -84 292 -358 37
6497 37 -52 -205 137 74 226 434 437 16 31 -22 -114 -5 -129 120 112 6 -78 -280 -101 121 -265 -20 121 -66
6521 -66 -68 79 -34 -270 -56 -18 -171 266 102 -111 147 151 -68 -52 142 -29 299 288 -17 36 186 -164 -143
6544 -143 -93 24 -34 20 36 -142 -250 79 -227 -188 -17 -50 -92 -280 95 30 216 -35 135 -259 1 -240 218
6567 218 -67 -16 140 -223 -8 -223 190 22 -49 140 60 10 78 -84 30 -79 -149 -325 61 29 399 148
6589 148 75 -34 -1 -48 -105 126 5 -51 171 -227 182 -2 -24 12 -439 198 -255 101 -83 98 -30 29 103
6612 103 28 179 132 94 98 123 -111 39 161 189 -24 197 -83 80 -158 -80 -39 166 -58 335 -248 155 -127
6635 -127 68 17 39 -33 -72 85 -130 -147 -187 -181 117 -163 172 -172 -250 18 116 -173 -385 -123 23 32 148 259
6659 259 97 78 -15 -57 -45 -51 -147 -71 -17 36 133 161 193 -92 -159 -62 -17 -258 -144 8 -106 -383 32 -184 0
6684 0 -10 30 -308 293 -223 31 216 -137 39 385 -20 162 -127 -124 -10 279 -126 97 -84 -280 -96 93
6706 93 223 275 -218 290 91 -97 -107 83 76 -159 178 -34 -52 84 178 -266 95 -36 114 -86 186 -186
6728 -186 55 -2 118 -106 -125 -105 -61 41 27 -372 -254 15 26 -13 -286 -68 -21 -222 -42 14 70 116 -128 221
6752 221 -80 -329 113 219 -117 -251 261 73 33 -16 36 -307 62 236 -248 195 180 -30 60 -49 -81 -390
6774 -390 -206 179 -208 -328 -205 -129 95 205 -198 145 -199 128 -36 -42 -228 -48 -25 178 176 -291 22 -434
6796 -434 -147 214 453 -653 -39 56 -65 -126 -71 299 -40 280 -145 -227 20 19 221 -138 125 84 -121 9
6818 9 -101 -114 -257 -197 -34 23 -140 146 -98 49 11 -223 204 43 -89 -326 -167 63 -24 -88 -53 -91 -103 -261
6842 -261 33 158 -33 2 -9 -10 -158 155 -80 234 -183 -9 174 108 -238 96 145 -86 120 66 -62 236
6864 236 74 26 -230 56 -159 227 -68 -52 -10 -288 150 -81 -2 -37 -20 -91 -279 -73 -293 -48 187 23
6886 23 -88 -78 58 196 141 -185 -75 185 -104 -48 275 -73 -38 -115 105 37 34 154 -77 5 189 63 -42
6909 -42 168 96 -99 -134 230 -275 191 -126 -107 139 -65 177 73 -119 169 -32 -80 116 87 -143 251 -63
6931 -63 328 283 146 193 -99 -60 -110 -111 85 23 81 203 -6 -91 -162 37 -37 21 -20 33 137 -62 -328 47 44 26
6957 26 170 93 124 -230 123 -7 -30 10 -158 -255 -25 -170 43 82 18 3 115 141 76 78 -56 111 291 201 153
6982 153 -198 188 -173 -172 -174 -78 -166 29 272 -47 13 -28 123 -171 154 97 103 -89 133 -11 -208 -54 149 77
7006 77 134 -100 -3 -196 84 -85 86 -59 -266 159 -34 -281 0 -21 -101 -151 172 -18 -135 -67 -89 -93 -30 -53
7030 -53 -45 11 142 285 -48 28 79 148 37 -22 -79 -326 4 -137 -14 -142 98 -52 81 -87 -154 4 -23 -232
7054 -232 126 -63 5 -85 -100 184 -201 -148 118 22 -94 -253 -317 -10 -144 47 30 11 -139 -116 -71 -26 11 -3
7078 -3 25 -83 -70 -111 -36 82 23 61 -19 138 26 -145 146 85 -59 111 206 -117 -58 -67 -45 -192 -14 207 205 -131
7104 -131 94 13 -95 88 131 70 -326 -293 297 -81 -53 -106 -208 108 25 11 -113 66 -180 102 -75 -55 -94
7127 -94 49 -98 185 -111 -266 -140 167 27 -69 46 -213 93 -94 -154 -149 187 -185 160 -34 112 97 195
7149 195 55 -37 6 320 47 156 -81 -7 -128 -29 287 202 150 -4 -192 -333 323 76 56 80 -80 391 58
7172 58 220 225 -107 -42 -296 13 143 494 -72 -267 40 89 -223 103 -249 -230 -214 -93 343 -2 217 106
7194 106 -110 72 -30 151 153 -59 86 -478 25 33 41 62 -251 74 -118 224 -282 -21 -43 86 -32 -19 134
7217 134 121 -110 -62 -68 -101 83 105 58 115 348 -40 -78 -134 -81 81 12 176 -149 -97 187 -197 224 165 -147 285
7242 285 3 83 -144 -40 -80 -110 25 -228 -194 8 38 -110 -68 -4 246 -34 119 -54 209 -127 -226 39 76
7265 76 -408 15 219 -282 236 66 141 13 19 -1 -267 -92 76 -94 -99 -264 -94 -193 60 328 -78 -227 154
7288 154 23 133 86 -14 -282 -13 88 -382 220 -5 90 -136 -38 134 125 25 -44 -36 150 -19 -227 76 -102
7311 -102 -57 -82 -148 -35 115 94 210 -11 -7 198 61 163 127 -87 109 -267 151 -16 -117 15 70 -175 60
7334 60 282 -103 -119 -52 361 241 -205 -122 -56 -155 15 187 31 -46 -73 74 242 -149 -182 73 -261 196 37
7357 37 -137 -66 6 -138 -33 -80 -177 61 -292 96 -187 75 -74 236 94 145 206 -32 -70 290 -306 -70 30
7380 30 -94 -56 -268 72 -27 414 91 140 126 -42 -8 -392 169 -25 -31 146 -34 -64 89 280 -27 50 115 -94
7404 -94 119 -136 43 -65 156 3 -111 -377 104 -102 -42 -59 52 -61 -188 -221 165 -8 40 40 57 6 165
7427 165 48 105 374 -185 -206 -263 -175 -23 256 319 -82 -157 185 -88 86 43 34 117 57 -90 102 45 287 -26
7451 -26 47 -39 145 -186 79 -32 -90 90 -133 214 114 73 195 137 -50 -93 263 -118 -96 27 -171 26 -76
7474 -76 -47 -179 -90 -161 70 -61 -259 354 -188 99 -32 -154 108 199 127 48 60 399 8 63 -68 -36 -185
7497 -185 -73 129 97 126 244 129 -91 -200 -101 235 66 -56 131 66 -32 -98 -237 226 -194 48 -51 -135 -124
7520 -124 28 157 -48 -145 49 -47 37 -140 48 248 64 52 132 -210 -73 -117 -83 105 -184 149 -46 -257
7542 -257 -135 -40 -39 -304 -9 7 -196 -86 75 234 47 207 181 -64 214 -17 111 312 56 -179 -136 -19
7564 -19 134 236 -120 -186 62 128 66 -49 -8 -283 -235 193 137 16 222 -89 221 -132 136 -56 211 213 164
7587 164 -137 139 54 -72 -252 -42 -25 62 263 -102 415 166 107 -138 3 -12 -117 63 246 -261 -110 56
7609 56 138 6 -260 254 -107 76 -198 63 -137 7 166 55 -23 218 58 24 -145 128 50 123 205 -154
7631 -154 -24 -55 -140 28 116 56 153 308 -244 71 117 13 -73 178 105 -25 -162 -132 -42 -416 192 -39 -227
7654 -227 -70 171 -49 -34 199 -48 -114 -282 218 11 177 -255 -145 29 383 222 -65 125 -60 -89 -25
7675 -25 -124 -251 44 255 96 -22 107 -178 132 372 -109 109 -25 -139 65 -113 125 274 300 303 112 195
7697 195 -86 73 -23 152 -23 7 -90 -123 -45 255 90 78 318 -332 49 50 -34 40 8 -3 118 226 291 -137
7721 -137 -312 211 336 22 51 -92 -220 -43 119 -21 53 108 128 -66 18 -1 -5 7 -135 56 -67 27 -47 -96
7745 -96 72 315 255 -255 -40 -68 137 -52 23 -88 -144 -190 54 153 -210 11 120 50 37 397 135 104 19 -215
7769 -215 -98 -227 192 457 83 -151 29 -135 -25 143 -385 -287 246 180 142 -127 257 74 -149 -237 270
7790 270 -126 -339 -232 -45 200 -115 234 19 -156 -104 40 12 -147 263 -205 -156 74 102 140 13 8 182
7812 182 92 53 -35 83 -150 -299 -80 185 -6 160 -186 337 63 -171 64 -79 134 199 -175 -80 257 -185
7834 -185 112 220 -52 -29 -248 210 212 -448 -203 -379 -42 180 -99 46 17 13 -5 -36 -52 72 121 40 6 -78
7858 -78 -5 -94 158 -142 -95 19 103 -159 135 87 32 -32 24 126 -196 253 125 61 124 39 -88 -49 -60 -300 -208
7883 -208 3 -62 -15 -36 -7 263 33 200 -106 34 -66 -113 -207 39 35 -40 -39 134 -5 -188 -78 -10 208 96
7907 96 -149 14 25 5 -24 83 280 -39 -106 175 -58 -131 -118 -79 73 -122 -67 125 -30 144 -60 -98 196
7930 196 136 -66 -122 -302 -86 114 -55 158 -68 74 -121 -405 146 95 -29 -107 -149 182 -149 27 390 83
7952 83 331 -173 23 316 71 137 -149 -133 -182 -331 -60 131 -29 1 147 110 78 272 -134 64 116 -79 29
7975 29 153 -44 -5 253 -213 -257 -325 -48 333 70 -41 -13 -6 -13 -198 -33 -26 -11 -41 -210 263 287 -94 -234 188
8000 188 -178 -141 48 0 -73 -79 202 97 -108 163 75 107 -44 166 94 -125 9 -172 157 -20 0 -93 57
8023 57 35 -19 -54 78 118 -73 -372 63 92 -138 117 -8 397 -30 144 -11 30 118 44 -143 101 -53 -168
8046 -168 86 -98 159 134 -78 -166 255 122 -153 226 -208 -92 49 76 16 103 -66 169 19 59 -367 214
8068 214 -29 14 55 -122 177 -158 33 47 14 -27 56 -97 -82 -67 -22 329 93 -71 153 41 309 88 -209
8091 -209 -55 185 154 -104 -58 -107 197 -89 -79 -43 271 -236 63 228 119 -58 411 319 206 93 -226 55
8113 55 -77 -21 -352 -104 193 -34 199 58 132 69 -174 28 65 188 -249 -62 93 -111 279 -150 -243 114
8135 114 266 -230 -149 54 -108 -25 87 -109 118 -103 -203 167 -417 204 -191 48 119 107 -235 45 162
8156 162 159 72 28 -176 73 42 271 142 -200 180 -113 -1 211 220 -214 115 43 -77 -115 107 -264 -154 49
8179 49 -130 -278 -22 -183 -74 -110 -46 -84 208 139 212 41
8191D1
$$ Imaginary data points
##PAGE= N=2
##DATA TABLE= (X++(I..I)), XYDATA
0 0 0 0 0 -8 8 0 8 -8 16 -16 23 -31 32 -40 48 -60 72 -88 103 -120 139 -163 191 -217 251 -287 328 -372 420
29 420 -475 534 -602 674 -753 841 -936 1041 -1157 1281 -1422 1575 -1741 1930 -2136 2368
45 2368 -2627 2918 -3254 3638 -4084 4614 -5250 6037 -7033 8340 -10149 12808 -17148 25441
59 25441 -47061 222983 490474 39766 -176638 -157976 -97491 -206923 -156450 83058 271472
70 271472 188786 65476 28824 -17155 -192215 -292721 -168188 93339 258898 263973 131173
81 131173 -55762 -192318 -180130 -95159 -44720 -2516 124028 230868 157558 -35575 -132146
92 -132146 -119123 -135740 -151755 208 237273 268324 54870 -111159 -87484 -58602 -135388
103 -135388 -139101 39100 199011 160708 43064 2376 -32049 -145814 -200880 -65435 121471
114 121471 158153 80711 40326 29988 -44439 -137257 -132662 -43192 36530 90026 136748 121098
126 121098 3812 -120482 -140515 -79932 -19326 38845 102296 109337 35482 -27291 -22874 -35019
138 -35019 -110440 -126225 8240 156200 145763 31079 -30265 -39503 -85633 -121390 -39377 92623
150 92623 108409 22048 -8021 40531 29647 -74824 -134341 -65646 41672 89443 88126 66046
162 66046 6790 -73097 -101446 -55532 4062 33313 46824 53936 35729 2631 -15690 -32667
174 -32667 -70274 -80464 -5027 97179 110140 29487 -35605 -39665 -39029 -56938 -36040 30956
186 30956 66261 37400 7479 16723 10890 -46635 -87445 -47268 31188 67863 53638 27608
198 27608 332 -33463 -52732 -37242 -7850 9323 22177 41172 45064 15000 -26358 -48609
210 -48609 -46645 -26177 11475 49293 53478 19720 -13709 -21729 -21041 -29249 -28365 -1349 31981 42556
224 42556 30817 10917 -16146 -43953 -48573 -16354 25514 39630 25270 8969 2304 -7040 -22014
237 -22014 -30629 -21939 -506 21382 35793 33262 11060 -21318 -42736 -35687 -6203 22029 28507
250 28507 16379 6202 4261 -1384 -16683 -28538 -21678 -282 20189 30835 27963 8680 -20464
263 -20464 -36792 -25456 -183 15675 16829 13420 10078 4220 -3913 -11979 -20410 -21779 -5288 21333
277 21333 33559 18865 -3717 -14992 -18812 -20402 -9969 11392 21437 10454 827 6603 6836
290 6836 -13811 -30196 -15970 9923 18323 13377 13564 9051 -10882 -26702 -15232 5846 6990
303 6990 -331 7864 20597 9791 -12981 -18111 -8177 -6369 -6377 9867 26411 15178 -10227 -14446
317 -14446 -2486 -3994 -14028 -4820 15957 17105 2247 -470 4692 -7215 -24643 -13907 14229
330 14229 18998 1549 -1587 9849 3367 -18569 -18399 4325 10594 -3477 -857 19069 16415 -13128
344 -13128 -25004 -4326 8297 -2232 -3945 14167 17673 -4427 -16503 -1915 5020 -9996 -13442
357 -13442 9608 22591 4693 -9780 -720 3132 -12902 -16276 7206 20670 2635 -10330 4566
370 4566 12666 -8297 -22596 -3252 15478 4048 -7859 7396 17417 -3939 -23590 -8174
382 -8174 13516 4409 -10557 2350 19008 4705 -16862 -9074 8664 773 -13711 -473 20201
395 20201 10613 -12194 -8840 7372 871 -15265 -4968 16595 11815 -8347 -5418 9748 2354
408 2354 -17036 -9992 12656 11812 -6774 -4652 12570 6718 -15031 -13756 7912 10512 -6794 -5913
422 -5913 13260 11960 -11252 -15520 3925 9738 -6502 -8709 10195 14406 -5622 -13069 2613
435 2613 8285 -7791 -11754 7471 15677 -1051 -10807 2040 7723 -6848 -12988 4136 13889 -328
449 -328 -9458 3289 10697 -4592 -14533 -117 11477 956 -8434 3481 12582 -1552 -14514
462 -14514 -2977 10175 1293 -8615 1274 12673 2105 -11446 -4075 7852 862 -9474 -857
475 -857 11706 4753 -8482 -4118 6811 1312 -9822 -3639 9854 6315 -5826 -3536 6367 2554
489 2554 -9277 -5022 7204 5961 -4758 -3205 6759 4049 -7387 -6313 4308 4202 -4344 -2987
503 -2987 6728 5834 -5864 -6972 2710 4331 -4019 -3719 5806 5915 -3792 -5744 2866 4283 -4534 -5979
519 -5979 3648 7099 -605 -4898 1571 3811 -3660 -6090 2320 6837 -146 -4036 1301 3956 -1526
534 -1526 -5243 -2 3949 -523 -3095 2029 5031 -616 -5082 -1375 2514 15 -1993 1635 4194
549 4194 -536 -4371 -260 3263 -207 -3898 -391 3430 1345 -2151 -579 1962 -799 -3761 -641
564 -641 3993 2265 -1725 -1741 1151 344 -1562 -954 1129 469 -1072 790 2172 784 -2123 -2000 334
581 334 705 42 567 1031 -50 -1756 -135 732 197 -1402 -698 1435 1696 546 -662 -962 -786 -248
599 -248 566 1070 750 -503 -592 44 389 292 -957 -1289 -93 1666 1919 219 -1373 -1242 -556 -22 713
618 713 1171 431 -1490 -664 1476 2069 -670 -2974 -838 1530 1575 75 518 214 -1589 -1928 1276 3082
636 3082 117 -2808 -1111 1970 1659 -722 -1540 -304 -421 -358 1660 2714 -655 -3228 -1009 2351
652 2351 1366 -1229 -699 973 -160 -1232 1371 2890 -1160 -4755 -1183 4360 2904 -2738 -2925 1084
668 1084 1984 -1659 -1127 2322 1305 -3238 -2038 3531 3698 -2046 -4428 220 2827 522 -512 1239
684 1239 217 -2620 -1617 3396 2840 -3058 -3490 1529 3694 -429 -2168 1016 995 -3047 -2233 4135
700 4135 4295 -3201 -5517 1440 5163 341 -3767 -624 2879 -888 -2414 2394 3722 -2378 -5660
715 -5660 664 5768 1792 -4105 -1682 2612 739 -1821 1124 2920 -1406 -4544 750 5511 1393
730 1393 -4667 -2509 2718 1498 -1976 308 2546 -1069 -4438 544 5580 1055 -5451 -2911 3879
745 3879 3058 -1996 -1440 2373 357 -3895 -610 5144 2415 -5135 -3979 3769 4339 -1871 -3258 733
761 733 1644 -1635 -910 2995 1949 -3736 -3959 2583 4487 -862 -3629 124 2120 -452 -578 2136
777 2136 1170 -3919 -2895 3585 4548 -1858 -4790 438 3464 -309 -2277 1775 2497 -2356 -3601 2596
793 2596 5578 -1104 -5777 -1196 4396 1967 -2303 -1009 2034 -579 -2508 944 4021 -107 -4129
808 -4129 -1214 3790 2550 -1798 -1365 820 -275 -1728 1197 2918 -563 -4054 -536 3897 2093
823 2093 -2858 -1834 1398 485 -1432 381 2899 -271 -3851 -750 4015 2697 -2938 -3163 1222 2141
839 2141 -619 -1218 1432 490 -2180 -1115 2925 2656 -1986 -3072 239 2288 284 -1012 495 59
855 59 -1417 -373 1946 1135 -2144 -2552 901 2172 297 -881 123 300 -852 -214 1734 1321 -1863
872 -1863 -2305 1039 2810 303 -2086 -928 833 373 -240 1090 893 -1163 -2015 286 2430 726
888 726 -1730 -1373 731 975 -21 -151 332 -846 -1027 527 1594 109 -1772 -1041 735 1088 -307
905 -307 -430 -22 -727 -881 1001 1836 -226 -1625 -919 941 1583 -337 -781 -332 -143 -282 156 1325
923 1325 -378 -1304 -553 1052 1307 -192 -984 -629 32 338 367 576 -276 -1063 -482 679 931 -105 -813
942 -813 -515 455 595 454 -60 -422 -901 -42 835 447 -596 -706 -520 270 267 348 -206 -652 -301 432 620
963 620 456 -462 -494 -511 335 604 89 -522 -465 270 618 480 -264 -518 -230 -116 186 482 586 -360 -937
984 -937 425 788 514 -484 -754 8 186 -36 145 333 -592 -800 92 1178 451 -668 -408 352 494
1003 494 -336 328 4 -187 -543 210 1022 126 -1201 -505 766 451 -94 -548 206 -75 -747 225 996
1022 996 43 -1060 -674 918 1078 -323 -855 213 412 -353 -286 899 664 -932 -879 760 1169 -472
1040 -472 -1173 257 865 -376 -410 487 640 -499 -927 818 985 -593 -1119 493 905 149 -780 93
1058 93 956 -515 -838 278 1226 -355 -1434 -52 1304 396 -1114 -408 1240 -56 -994 54 1114
1075 1114 -89 -1314 -353 1313 300 -1119 -633 1133 531 -823 -98 679 96 -1248 -240 1247
1091 1247 562 -1369 -826 922 953 -527 -586 831 404 -807 -335 996 641 -1124 -715 953 1149 -504
1109 -504 -1182 646 441 -670 -1025 830 688 -955 -1140 639 1399 -801 -1152 -136 1023 -383 -987
1126 -987 102 777 -640 -1221 411 1092 343 -1320 -42 976 12 -625 14 674 -372 -1172 305
1143 305 896 128 -1041 -321 1050 194 -1121 -202 669 139 -891 -262 1134 266 -1163 -431 789 571
1161 571 -801 -441 719 272 -847 -80 805 52 -1118 -511 1260 761 -749 -1038 778 215 -708 -206
1179 -206 606 300 -530 -218 568 799 -616 -1136 232 732 -210 -427 618 214 -414 -502 731 721 -579
1198 -579 -744 205 838 -228 -462 328 437 -53 -505 706 670 -262 -800 -141 738 102 -322 30 257 -90
1218 -90 -143 373 685 -490 -660 -49 719 107 -349 57 419 -179 -348 292 418 -39 -608 38 503 -73
1238 -73 -382 -133 511 156 -207 199 474 -182 -441 15 483 164 -676 -215 501 113 -258 101 279 254 -38
1259 -38 74 579 209 -447 -497 -125 264 7 -132 254 -264 -51 88 397 262 -308 -388 205 419 68 -362
1280 -362 -20 83 -270 68 298 175 -375 -409 363 356 -59 -72 -236 230 158 -174 -164 -37 -291 -98 193 -20
1302 -20 -164 -7 -438 -40 125 316 144 -147 -195 -130 86 234 -123 36 -151 -19 60 7 114 -530 23 0
1324 0 251 -37 -201 -60 -263 -129 56 168 -211 -85 171 -17 99 97 213 -112 26 -76 351 227 19
1345 19 -257 148 260 256 -205 41 -280 -203 -138 -61 82 -34 -516 -88 469 96 -125 -195 94 261 -105 126
1367 126 127 -306 -443 -289 470 310 -51 -438 -28 -271 176 -15 -168 92 -282 -216 712 329 93 -373 -150
1388 -150 288 54 -214 25 99 -39 -203 288 429 -195 -477 -155 471 128 -317 -101 253 181 -250 108 173
1409 173 -277 -585 -457 496 251 -235 -165 -72 -72 -144 112 150 -253 -494 64 288 86 -166 -264 168 103 -230 -161
1432 -161 314 229 -639 -335 400 316 -590 -352 117 521 267 -319 340 -63 -95 -31 393 584 -215 -397 101
1453 101 270 195 -285 -179 -39 -370 -12 376 371 -666 -708 97 553 -86 -402 -99 656 -174 11 349 289
1474 289 -226 -421 482 510 -133 -502 38 234 -127 -362 117 157 -280 -326 -10 648 50 -469 -176 185 64
1495 64 -210 74 13 214 -351 308 356 -85 -183 -411 161 359 -72 -159 274 207 -72 -184 229 -21 -355 -198
1517 -198 226 709 -270 -172 327 -60 10 -75 353 32 -155 -337 347 282 119 -583 -19 156 -57 17 269 191
1539 191 -160 -116 237 578 -233 -125 -348 42 121 -319 161 263 -232 -64 109 153 -110 -188 112 76 -2 -125
1561 -125 340 100 106 -40 182 365 -124 -284 -187 223 110 -336 127 -104 9 -121 86 215 -387 -28 47
1582 47 425 -110 -212 -49 83 -81 83 386 162 -277 -146 163 166 5 -135 -252 -206 -23 -157 187 -79
1603 -79 -138 8 -9 77 -76 168 -289 -88 140 115 -44 -29 87 -56 123 -158 -50 -2 11 27 254 38 -66
1626 -66 -17 -176 -222 -308 154 -94 -203 -246 84 199 -209 -199 -47 -175 34 -284 -77 -54 -91 -1 445 121 112 59
1650 59 127 -158 227 104 -69 142 0 294 153 216 218 -87 140 -197 56 -56 -79 -231 -31 216 181 106 -82
1673 -82 -264 3 -166 34 -74 127 -178 -145 168 246 0 283 -275 121 439 -91 79 -398 -32 -249 30
1694 30 -62 219 149 0 76 211 43 -96 103 -119 -2 354 -6 -258 -70 -162 212 22 271 -50 -149 -260
1716 -260 -62 203 -188 -187 -151 114 192 -72 -24 239 -53 -11 249 -46 293 -217 61 -37 139 -160 -188 -33 -106
1739 -106 86 -187 -96 41 -391 -108 294 -135 -259 31 -80 128 -62 -69 70 -78 -264 -303 200 228 152 -392
1761 -392 -19 8 -94 -196 49 -221 -8 -86 -292 355 110 -173 -27 309 121 -114 81 150 -74 79 -281
1782 -281 -26 108 155 -143 229 114 -65 32 172 -193 209 -315 160 144 -35 96 115 409 88 92 62 -44
1804 -44 -16 53 179 263 -108 162 28 155 -123 -377 167 14 252 136 149 -37 -9 -143 -72 -12 -164 -347 -44
1827 -44 66 129 -103 91 220 238 -193 158 250 -143 -47 -30 193 449 -80 -165 -92 93 -59 -135 -147 -268 42
1850 42 344 291 217 -10 -139 234 -6 -102 93 40 126 -102 252 55 -86 -464 -285 217 217 -323 359 -177 141
1873 141 -56 -172 46 75 180 -49 218 -102 -28 -350 -277 152 130 266 280 -47 -137 -107 -81 192 199 127 -54 223
1897 223 -230 246 -129 236 193 14 -53 37 -36 -127 -66 296 129 16 167 -202 43 -224 -169 165 -242 -199 -19
1920 -19 -72 309 222 229 -410 -24 105 282 326 61 -78 95 128 45 -6 -91 -134 28 129 -70 -119 -127 -29 272 225
1945 225 132 3 -97 155 239 102 -274 8 77 -149 250 108 168 255 100 105 98 -117 163 147 -112 310 -136
1968 -136 -111 200 -259 -206 -172 -163 -233 -102 377 90 120 111 -128 -189 42 -107 -185 -18 25 -218 6 -104 187 25
1992 25 158 -114 -167 -28 188 66 129 -4 -1 0 -152 -190 3 -269 -6 -142 -151 86 276 -158 90 300 -404
2015 -404 15 -29 -140 37 109 -30 41 25 -20 -127 -246 -8 -218 50 4 -163 35 39 159 -14 -260 -15 -46
2038 -46 -125 242 -238 47 -99 -111 -8 241 -92 -36 54 81 67 51 285 31 -9 191 -108 334 34 -32 -97 -142
2062 -142 -7 146 333 -112 -51 -48 124 -203 -151 -89 -94 160 150 -96 -225 -132 -223 174 -107 -265 -111 115 -22
2085 -22 154 -84 40 17 -18 140 -378 14 -380 13 313 -99 -165 -76 391 112 13 95 -152 209 -144 -88 209
2108 209 43 -55 -46 -295 -137 -65 -126 257 -79 127 -191 93 28 -50 -89 163 24 88 97 24 -226 124 -205 83
2132 83 166 111 -197 -208 204 69 37 19 -25 195 69 46 8 312 133 -20 -218 -35 180 -182 81 -61 -202
2155 -202 -264 39 65 -160 -135 199 138 236 -16 -280 0 -144 150 -128 -68 196 131 -185 322 138 352 168
2177 168 42 -187 -16 105 111 97 17 -179 -40 -21 -167 -147 266 -83 106 -81 313 15 -227 55 53 -18 -16 -149
2201 -149 -6 146 324 -52 -312 -84 -182 -40 70 -69 -136 -265 -14 80 -102 -209 110 264 -79 -223 108
2222 108 -35 -65 -274 -73 96 140 -196 54 322 156 8 92 -23 -261 83 154 -38 -224 172 -150 233
2243 233 415 106 -2 -44 -84 -28 -209 491 43 -175 -144 98 93 271 219 123 -158 -72 282 -77 219 65 -94
2266 -94 -307 -20 -176 -98 -229 53 31 -167 18 57 -64 38 12 45 -73 160 -216 -106 14 -5 223 4
2288 4 -156 112 91 -70 -228 213 -26 33 -125 228 142 -327 -82 54 -126 408 96 -64 85 -90 306 -261
2310 -261 92 -42 -309 167 208 167 78 -211 133 -76 87 275 -77 -135 -10 -120 251 -73 -183 -35 40 79
2332 79 27 -179 224 9 -45 12 102 154 -251 152 -80 233 149 9 -165 340 103 86 19 3 -33 64 148 -110
2356 -110 -15 -285 -25 56 -239 476 -33 -125 -177 -28 -300 136 116 27 291 62 -192 -158 9 -16 236 -94 -187
2379 -187 66 83 -87 -34 -404 292 155 210 -103 -8 -62 162 82 35 80 -47 100 3 17 -89 -16 104 40 301
2403 301 33 93 65 43 -20 -286 -129 -22 288 -154 -122 -27 74 -186 -162 -5 -154 132 123 -121 15 131 51
2426 51 129 -175 33 176 111 -79 288 -107 -56 127 120 42 55 143 -279 -160 278 307 55 -45 207 -115 -256
2449 -256 -23 186 -68 -327 354 222 -27 -304 43 -128 127 423 -120 -48 -199 -27 -39 -4 -225 -108 152
2470 152 129 107 -19 16 -172 65 -44 91 -144 -92 2 30 173 307 -391 83 56 -148 38 -322 -80 54
2492 54 -73 -181 182 64 5 349 -257 -57 4 208 141 -227 -83 -104 -89 173 139 80 23 -219 -24 185 211
2515 211 -78 -264 -334 45 -185 -208 -89 -57 -384 192 -17 -172 370 -29 -129 220 -67 -134 -107 196 -26 390
2537 390 -184 -117 21 302 -27 -12 -103 143 -72 -208 -175 171 124 35 -216 224 3 -31 -174 -337 -25 -41 188
2560 188 39 -51 16 98 -79 92 -233 253 -231 197 -109 59 -44 1 141 73 -23 -161 11 -149 -336 129
2582 129 -122 206 172 132 -75 -81 97 275 63 -71 -83 -251 -104 -80 62 9 -206 106 226 368 70 -29 -149
2605 -149 88 -55 125 184 133 -233 -107 111 173 86 95 41 164 -37 87 300 -204 79 126 320 46 13 -44
2628 -44 -77 -112 -283 109 -117 -160 216 -31 -214 273 -130 -43 65 42 -32 138 418 -169 228 91 -78 336
2650 336 -31 4 84 -154 -74 427 -211 85 -6 -190 35 118 -66 -75 191 -266 -78 -18 199 -68 -56 130 -285
2673 -285 -181 77 18 93 -175 -98 81 17 144 26 -101 135 -275 196 233 8 108 -299 33 168 139 -113
2695 -113 -278 140 -23 102 128 -84 329 -54 89 127 200 57 -337 164 80 -79 -119 -12 -82 -239 -5 99
2717 99 68 76 -145 79 -42 182 177 153 -37 -79 59 131 -95 -48 179 48 99 -176 -291 257 -202 -124 -60 -135 -115
2742 -115 -162 60 75 -59 -201 132 74 -165 -15 -116 83 -15 -60 20 82 72 -180 210 -32 146 73 -15 -4 -110
2766 -110 279 -34 35 69 182 43 -177 341 -17 -187 202 111 -260 -72 -79 14 -132 19 57 51 -63 181 -264
2789 -264 -152 226 122 221 149 203 -202 167 108 -13 53 96 -72 59 -26 10 -256 71 -5 -175 55 -244 79
2812 79 20 58 -81 326 210 82 148 171 20 -114 -58 462 181 -2 102 -113 -198 -48 -146 -219 37 56 120 23
2836 23 -112 203 117 -3 7 -25 82 -12 33 -38 68 -103 137 -102 13 168 -109 387 283 -143 -121 252 168
2859 168 188 -145 8 162 115 23 255 -59 155 34 23 -22 -50 -239 -35 15 -115 8 -290 250 197 460 166
2882 166 -294 100 179 0 -122 135 -27 -32 -190 94 76 73 -51 69 340 -207 53 -128 -26 -59 -196 269
2904 269 -199 -199 -341 78 42 45 203 15 73 -39 27 -23 179 -52 -131 123 52 -134 -88 -211 -363 109 397 56
2928 56 -108 3 72 -315 78 226 65 3 40 -114 -79 -2 71 -83 -263 -74 -73 107 155 -203 17 -82 44 189
2952 189 -118 -203 -41 -193 -86 -492 -78 0 -60 33 -164 -122 -22 -492 75 85 -29 -116 130 45 -120 200 -187
2975 -187 70 -66 -62 -17 88 -37 -46 -159 119 207 -98 -9 66 257 8 -7 -89 35 -25 12 102 216 -60 294
2999 294 155 -281 77 -70 271 -176 127 34 -103 -11 -112 -15 -136 39 -48 -251 -31 40 30 273 46 135
3021 135 -224 -196 -15 -122 151 185 -72 44 -67 178 -228 -406 83 207 33 -95 61 -2 20 23 -63 -95 -174
3044 -174 -109 18 -48 74 -188 -51 168 -199 -93 65 -18 -115 -106 153 17 -55 36 -89 -219 81 -61 -124 -82
3067 -82 -105 -229 -319 -42 160 -49 -234 7 166 223 -105 -1 -370 -15 14 -241 -64 243 -74 125 19 -58
3089 -58 -64 -60 -55 -74 52 37 160 -219 -14 -118 -131 -159 -21 76 -31 10 51 -54 -152 -35 114 -33 111 -191 -132
3114 -132 125 -19 -6 -11 53 -31 77 121 166 -4 2 100 -176 13 398 72 64 -44 -99 77 -310 226 149 -166 143
3139 143 228 -25 5 127 -201 -69 -124 195 -21 -285 -30 -75 -122 34 -438 -53 -109 -221 -162 -411 165 -36
3161 -36 57 -69 -141 200 -16 -361 74 209 -93 -125 41 -55 -70 -42 -84 41 -166 -242 94 -147 329 -67 158
3184 158 226 -107 124 -213 169 -23 -108 -67 172 346 -119 -49 245 -73 -11 118 -46 -116 396 -138 87 74
3206 74 37 24 306 -17 -114 11 -65 37 66 312 159 -130 5 73 -41 -33 -220 -115 32 -37 15 142 -229 -61
3230 -61 -49 72 191 97 -27 119 76 -73 83 70 -202 -136 -100 -145 10 182 221 306 -60 -159 98 -53 105 -357
3254 -357 -418 -259 -61 -208 -178 36 -331 113 133 82 5 24 -10 -26 10 29 88 50 128 165 225 197 103 -157 -140 -151
3280 -151 -206 -11 18 34 -102 -169 204 -231 25 -236 18 -35 17 -146 -210 -16 -197 -52 -202 169 -2 120
3302 120 -51 222 164 -165 125 138 -130 -118 129 71 -270 223 -13 27 -13 -177 105 -11 50 -127 -19 -170
3324 -170 -80 -241 -78 135 -93 70 -51 58 -172 -70 -56 267 164 14 95 350 -41 -44 214 13 -55 45
3346 45 127 -4 387 129 -68 35 27 -102 62 77 23 217 261 -103 16 -21 -178 27 99 198 146 -272 97 -165
3370 -165 -148 -88 187 -202 -53 163 -40 -93 -75 20 47 0 279 60 -39 107 81 35 -293 94 79 -313 120 -113
3394 -113 -46 339 -125 -201 357 -87 122 12 -323 112 -29 260 9 173 128 66 11 67 -40 -279 -52 258
3416 258 -20 -70 -5 302 -4 263 55 -295 26 -123 134 129 395 -120 -91 -128 -141 160 -85 -126 263 27 78
3439 78 80 -143 -85 132 -148 -185 -201 21 -19 308 -318 -63 33 291 7 336 200 71 -107 -32 198 90 -85
3462 -85 -80 -151 -216 93 2 22 -78 109 37 -95 205 48 -197 -18 23 70 -201 -235 -31 185 -110 -139 -156 65
3486 65 54 157 -363 -146 -179 116 23 95 235 -171 -11 -109 91 206 202 -29 253 123 0 -2 -155 -351 111
3509 111 -152 32 160 115 -244 144 57 -125 232 133 -44 138 166 -115 -235 -17 72 -45 54 -378 51 138
3531 138 49 239 40 244 -110 -18 -20 13 -168 30 298 -145 -198 -171 -181 -188 -173 65 -96 108 -22 -81 88 127
3555 127 -154 7 -125 118 22 -89 -133 -5 74 -178 160 -285 -156 61 50 244 1 -209 16 -77 221 31
3577 31 -223 180 -89 -91 -282 24 117 -16 -257 84 -32 -159 46 -11 -181 8 -27 -185 -141 -184 -17 -123 203
3600 203 150 -159 101 -202 59 -80 -11 -62 69 180 -53 198 169 -49 -82 99 164 291 176 113 -35 -83 -87
3623 -87 -185 -226 -451 -195 -128 -25 13 -96 -214 156 -106 30 -30 0 -149 -83 158 15 -240 -195 25 -23 -54 139
3647 139 -139 56 29 228 34 93 -37 179 -212 26 -275 -86 -162 178 207 154 -156 100 84 -117 -117 -188 -200
3670 -200 -43 46 8 -21 153 -25 82 -77 -184 281 123 -111 -220 84 -7 -29 -27 -167 -73 56 -150 206 94
3693 94 245 -13 16 121 68 117 86 326 130 50 -12 -125 -193 -87 171 -125 -36 -13 393 78 217 138 30 -100
3717 -100 -106 11 23 155 -24 -21 268 63 -22 116 181 110 -338 -148 86 130 -58 43 -200 180 -2 192 -33
3740 -33 -14 153 -20 -309 -133 -80 158 127 -107 -108 58 -161 -76 187 -307 73 128 -10 -59 -33 -110 47 -4 121
3764 121 14 -20 -24 -50 -74 92 39 322 121 -325 -82 167 -23 -25 8 -169 -189 27 98 -375 37 -206 -88 26
3788 26 -21 4 89 61 37 -261 -65 97 -151 146 -36 198 -291 -111 64 -16 416 -113 -31 243 197 26 136
3811 136 24 86 -103 32 -61 -163 -85 42 -206 109 -37 -14 -14 247 -276 154 -37 -83 103 90 6 -64 23 -26
3835 -26 212 14 32 87 114 142 -62 113 -211 198 -407 -132 23 -16 -228 2 291 -337 -36 -138 -105 -4
3857 -4 91 151 55 214 -128 149 47 -115 104 -159 -216 -139 34 -22 -2 168 368 20 3 -153 119 108 121 -213
3881 -213 252 117 -75 176 155 189 -51 160 -277 -189 98 196 -117 261 77 -73 4 -117 8 157 -49 141
3903 141 139 31 24 63 -45 41 71 -427 155 143 28 -282 -35 64 -25 -187 -115 10 -23 79 169 99 -11 -247 -138
3928 -138 -88 -119 74 -122 40 109 127 -70 -145 142 -221 13 -105 255 -172 82 -126 314 -69 62 -19 -262
3950 -262 69 236 -105 -126 -30 342 10 30 -65 45 -78 68 41 -208 -68 224 -1 76 -25 329 78 125
3972 125 177 221 96 -249 33 -142 -243 59 -84 417 -66 -72 84 -90 8 36 43 -262 -25 30 128 -21 113
3995 113 -10 43 -152 -101 -335 -211 299 6 -101 -26 251 83 -266 205 46 40 -268 334 236 -32 -32 48 50 -39
4019 -39 49 24 208 -143 -252 119 -189 227 59 -177 -308 -18 -100 97 -45 19 -230 -81 -123 161 -112 356
4041 356 4 -156 26 205 -28 32 198 -122 192 99 283 93 -51 -189 -274 198 79 -13 133 -23 -191
4062 -191 -116 -69 -61 14 271 92 -73 -157 -80 105 -31 -249 6 -141 162 -25 18 30 -287 115 34 76 72 136 -12
4087 -12 95 -38 270 117 -87 140 -296 57 -103 242 -203 228 150 50 1 -175 -155 -68 5 -115 -112 87 250
4110 250 126 89 -40 193 -97 117 -89 -187 96 -187 -91 173 285 6 111 90 -245 -30 -276 -265 -51 -60
4132 -60 130 0 -61 131 19 -140 39 130 -94 377 0 -67 -203 378 56 -127 -268 72 322 -105 -20 105
4154 105 165 -197 111 -22 103 170 -86 -226 45 -189 -172 -26 316 9 11 -43 137 -57 120 21 10 11 -248
4177 -248 48 -65 -111 -172 201 52 -45 -149 141 33 -89 233 93 -32 -67 291 -277 32 -343 252 -75
4198 -75 -161 91 71 34 -71 11 -266 163 -112 -175 103 164 48 177 196 123 277 -147 47 261 -69 282 58
4221 58 -156 -99 -276 158 -19 143 -22 -90 502 214 -386 224 -125 -52 -100 151 192 -14 25 -82 -54 96 -30
4244 -30 -107 -35 -262 -64 -38 82 35 44 281 -29 55 9 -6 -265 43 -44 -192 -155 277 -62 87 138 -32 57 -75
4269 -75 -76 -100 -20 -107 179 -113 -47 101 -30 -220 108 325 282 -390 7 -125 -59 -71 56 353 102 -149 -94 96
4293 96 -155 166 -194 -114 -73 127 -173 40 93 -46 -188 -77 146 191 189 250 141 -270 254 -161 115 -230 -138
4316 -138 -34 -3 303 284 121 -191 145 66 284 -160 -185 64 6 -134 145 282 -103 -11 -260 140 -93 51
4338 51 69 70 68 343 -233 -11 80 295 -184 -317 10 -65 269 27 -22 10 -116 134 -49 -114 77 83 -100 -173 -133
4363 -133 52 -3 184 96 168 -102 -198 -126 85 18 -97 410 -31 -177 172 37 -259 45 127 -101 3 -315
4385 -315 -32 24 -19 25 -281 98 217 -103 -86 -53 188 -21 332 -121 -19 -247 -199 -137 -122 84 -152 178 -71
4408 -71 -326 -144 -277 -147 114 215 86 126 -19 -3 413 246 368 -447 102 116 -21 51 18 120 31 31 111
4431 111 -326 -157 70 56 116 -45 130 -79 -277 -117 -223 -16 174 142 490 186 81 -171 70 88 131 -355
4453 -355 -281 229 167 231 128 13 -69 22 151 -120 106 84 103 134 69 25 -171 -202 15 -124 -41 402 175 -86
4477 -86 -218 333 146 154 -35 250 119 299 -88 -272 -149 22 -216 56 176 181 339 -104 367 -247 58 -5
4499 -5 140 171 -156 -232 209 55 87 49 84 240 -219 138 146 85 -252 -35 68 288 -98 77 118 -4 -38 -163
4523 -163 -189 -84 -55 -155 63 -164 105 -85 -100 51 -97 -83 42 -22 142 3 185 -71 58 172 130 350
4545 350 -41 -141 -53 59 77 -106 -25 138 -305 24 -12 54 9 -66 -196 77 0 85 -66 -45 -212 -126 -101 10
4569 10 288 123 -34 -355 -16 35 -58 127 -118 -221 -87 -86 -95 -95 58 -134 -74 -68 13 -97 -76 -229 -54 -66 20
4594 20 37 -13 -153 -54 171 58 -189 -79 -117 170 -26 36 -149 -141 -120 -13 -14 -246 41 24 47 291 173 -104
4618 -104 107 129 -175 -5 -68 -137 340 357 -278 -157 -64 -31 187 -18 43 6 20 111 -274 61 89 13 146 -49
4642 -49 59 -124 246 151 312 139 163 -119 -17 -24 131 -8 171 137 -196 -106 -82 -157 -219 -5 -47 -15 -163 89
4666 89 -57 38 -76 204 -114 -113 90 41 3 42 -179 -61 76 84 -64 104 -326 -187 -146 406 -35 -348 47
4689 47 -90 145 -114 481 -146 -10 -124 -33 -239 91 34 -359 -234 -177 -353 153 69 1 31 189 -5 26 136
4712 136 57 -25 21 -180 -19 -179 175 174 257 250 -280 108 -55 -15 -176 2 -29 294 -179 437 115 166 64 186
4736 186 62 36 -49 11 -56 -27 -63 108 -66 -405 48 349 166 -13 -187 46 19 -16 74 -118 -393 100 -38
4759 -38 17 281 103 -196 -98 -58 95 -149 -42 -77 -171 -92 59 -175 128 -223 -69 -142 -37 10 65 27 -163 3
4783 3 22 -7 20 -131 66 -188 -292 183 73 -86 159 119 -34 177 179 112 -37 92 14 -6 -77 -9 -107 -128 173
4808 173 109 146 -144 20 279 159 -64 164 -101 36 293 192 15 -151 35 40 -22 -84 -160 -37 193 -74
4830 -74 -253 -37 108 59 147 -67 -32 -132 181 -261 -297 -6 -94 71 -78 157 69 118 96 126 -86 53 -71
4853 -71 155 -176 151 -3 88 107 -141 -40 -338 -72 -83 -45 213 -288 61 -42 67 124 -258 -112 -72 -4 35
4876 35 58 -22 366 -65 -185 -75 -13 113 101 353 169 134 -401 -27 -48 152 -80 -103 194 75 27 59 200
4899 200 216 -17 120 195 -161 -145 -156 98 136 79 -61 -197 -170 -75 39 174 -92 -93 101 165 171 26 -48 2 44
4924 44 144 -214 -203 -42 -326 107 -201 -62 -81 -140 316 163 -140 47 139 -111 -273 288 35 -14 140 -55
4946 -55 110 -152 138 76 -73 28 -43 -83 -98 206 26 66 -137 315 -123 -75 -41 31 -65 106 78 -156 208 -5
4970 -5 -143 121 291 -196 -91 134 -77 105 101 -258 -106 -96 47 -147 -57 82 212 -115 176 -245 228 -305
4992 -305 -35 119 323 -179 -66 -20 -23 -74 -15 99 -275 -17 356 -78 184 49 -31 -112 -200 -16 -311 10 -58
5015 -58 -12 219 -245 47 -99 -210 104 68 -78 -226 -135 -183 134 207 -76 -13 -146 -80 -75 136 -53 177 134 17
5039 17 21 -119 267 87 131 -158 -333 9 -453 -358 163 -19 112 -51 -194 62 39 -96 -150 -182 152 -169 -5
5062 -5 -80 74 -213 -1 -268 -16 143 -286 66 108 -142 -261 119 -116 -146 -138 284 366 -93 -64 54 -109 -46
5085 -46 -45 48 -225 447 224 -161 66 24 -122 187 146 -382 34 -31 123 199 -160 -172 -5 -18 279 9 1 -137
5109 -137 -170 118 -106 -114 20 -20 205 -98 -152 92 -278 -29 11 287 -193 -46 -14 -190 62 21 15 96 -2 74
5133 74 79 246 183 24 -32 -51 142 215 -159 242 84 -197 -25 114 -79 -221 -311 -183 35 29 -211 271 -33
5156 -33 122 -78 -9 43 -93 45 295 417 -47 307 -48 -102 100 -10 131 -154 226 -49 -49 -50 9 126 81
5179 81 -57 -21 14 -277 -53 -55 94 -73 11 154 282 260 -150 63 -18 -145 -283 -59 -282 -112 -24 -322 65
5202 65 45 253 -214 103 288 -155 79 186 7 120 134 80 -10 126 -3 -26 60 67 -184 23 -239 -460 -67
5225 -67 -247 -193 17 25 218 -153 216 169 -62 -122 -244 207 176 -157 210 176 -69 270 57 -162 -126 70 -19
5248 -19 10 41 8 -177 -106 246 70 -413 77 -80 -10 -156 -209 116 142 -158 54 -146 -4 -50 -385 -73 44
5271 44 -60 -89 -64 -14 86 -100 -370 4 75 118 35 249 176 197 -71 -350 303 50 4 36 -167 -157 105 -79
5295 -79 345 82 171 71 -33 18 -43 81 -20 32 303 16 -256 -127 231 -138 -131 -307 -114 -53 -143 72 12
5318 12 57 214 12 114 -338 93 -172 -284 120 -105 150 -173 -37 -142 -134 90 -85 506 240 49 17 41
5340 41 35 108 76 109 43 -293 300 53 323 200 83 -95 -255 288 37 -145 140 -166 168 -184 -23 -157
5362 -157 116 -143 50 -156 -64 192 233 343 -92 465 -165 -92 122 -231 -84 217 112 -14 -239 236 42
5383 42 -304 -181 206 148 148 22 150 -221 -285 16 -367 192 19 3 313 -293 -18 8 -68 -379 117 5 -162
5406 -162 24 99 -215 -107 -24 -12 -142 -365 -78 341 -87 242 138 -127 162 -144 -33 98 103 142 33 -28
5428 -28 34 180 101 -405 265 53 281 82 -33 -243 -17 -78 88 33 29 -143 228 -115 203 123 122 -32 114
5451 114 139 -74 -123 106 231 -367 228 -385 -155 -138 30 -88 -308 22 -13 -154 -395 47 62 -55 43 -233
5473 -233 -70 -215 118 -12 -36 -218 54 -244 17 -35 -224 -209 -127 21 -102 120 29 314 -67 -122 -33 -148
5495 -148 -182 59 -137 395 75 179 87 -288 -22 103 -267 55 250 354 -81 -67 100 47 23 -103 -54 -50 -151
5518 -151 -158 78 34 -358 -93 49 -51 -283 14 -151 -161 10 -213 -179 245 133 105 75 199 163 382 -9 -213
5541 -213 -49 -176 82 118 69 -7 229 -175 -86 -15 -241 -14 38 -103 16 89 -51 -69 201 66 -167 -94 -24
5564 -24 -22 84 19 154 136 17 -38 -48 143 109 105 96 259 -430 -2 80 -103 -202 -150 -177 -139 -161 123 -376 39 98
5590 98 -24 115 17 20 135 -142 126 108 -41 -53 101 -41 -245 -51 252 -47 -25 363 -54 -106 188 40 -60
5613 -60 3 123 151 -389 237 187 -180 295 258 186 -154 225 34 58 21 -1 288 -153 147 -86 -179 -205 -236 -209
5637 -209 -47 63 -94 -72 -212 321 -121 -78 -242 181 23 -75 16 1 -45 -62 -113 184 -212 33 62 98 471
5660 471 -4 49 0 152 -123 303 125 -20 187 -158 -260 -283 -8 -268 -242 -187 104 -19 -264 130 -99 69
5682 69 60 69 74 10 -98 85 70 -39 96 380 -193 -112 110 -100 -114 166 -20 5 -9 173 229 84 51 -455 94
5707 94 117 132 -170 -56 43 -22 -11 7 256 30 187 -73 -3 -134 -73 -52 -198 86 97 126 -43 162 -58 -50 213
5732 213 -27 59 275 -68 -173 -45 -97 -204 -24 54 201 182 -200 -192 -74 -167 -220 -66 60 223 133 88 80 192
5756 192 49 -36 285 -38 65 226 82 183 76 42 -58 41 -227 236 66 -86 -213 66 -49 -240 119
5777 119 324 173 233 -31 125 247 -61 -197 -237 -74 291 -252 -183 -15 -206 157 -103 -12 211 -86 162
5798 162 56 -432 -122 -186 46 61 181 -65 -346 85 267 135 -36 280 -197 37 -121 74 -6 192 198 6
5820 6 65 641 0 90 222 90 187 -60 -122 -104 151 -89 -43 146 37 -228 212 217 101 -64 -3 -177 -50 -36
5844 -36 405 -200 -353 212 -223 4 127 23 -109 68 159 -229 -181 -69 280 -84 87 19 302 -86 -83 -271
5866 -271 -11 -19 -1 51 -51 -45 -101 27 305 188 -136 -53 49 -289 22 121 225 -11 68 127 -70 -50 28 -45 -9
5891 -9 246 -43 -140 -17 -53 27 200 95 15 174 121 203 -7 229 36 0 -113 93 -53 45 -68 232 221 -112
5915 -112 65 -222 89 197 146 -31 1 38 132 46 -37 232 128 -41 -66 154 -128 32 -72 -13 45 3 -10 -82
5939 -82 -92 40 -198 45 -85 -42 15 2 21 -50 149 -25 67 351 119 454 114 -94 -113 119 26 11 199 85
5963 85 -68 -200 365 114 56 180 6 -68 368 68 11 215 61 -158 45 117 228 237 -138 15 -20 13 -168
5986 -168 216 0 170 419 149 182 -103 34 -26 76 39 -256 9 22 201 10 -368 170 -2 -18 -173 109
6008 109 20 -170 -7 -229 193 -80 134 191 108 208 -185 -33 -113 -203 45 56 -41 -62 97 28 183 191 -67 278
6032 278 -16 63 -355 -22 -54 -47 49 -167 -46 -115 23 -51 77 90 69 -72 -168 -158 73 -163 32 88 -1 -307
6056 -307 -50 -88 -110 -220 -111 85 191 164 49 80 -5 -37 158 -157 -93 216 36 197 34 -363 -165 -55
6078 -55 -186 132 314 -70 78 -186 -165 13 123 290 -211 -7 333 -87 -15 254 -290 -394 -143 35 292
6099 292 -248 164 -81 -110 -125 17 -38 -34 277 40 -19 8 12 105 -206 -14 113 289 30 62 -16 -149 370 215
6123 215 -34 120 123 70 323 202 334 -157 -2 -69 -237 67 -16 -197 -128 -107 -7 146 37 -163 228 47
6145 47 -232 -133 -197 -62 -231 -249 82 6 -136 78 136 343 108 -70 143 -227 116 -140 -130 -25 173 79 224
6168 224 16 99 75 -19 -203 168 -38 383 72 21 331 -37 -57 256 -174 14 -70 337 343 -146 -23 6 181
6191 181 -179 -177 75 76 -160 -18 -47 -97 77 -45 37 -191 20 187 237 105 -2 112 244 -43 -184 56 -234
6214 -234 231 263 247 29 51 69 -343 154 143 -307 -14 83 -28 -92 57 10 71 -161 176 -113 104 84 -242
6237 -242 -195 43 -93 80 -5 -4 110 -153 266 247 -103 8 -47 295 -265 -48 202 -209 -21 -81 -26 -392 86
6260 86 302 201 73 238 140 -300 408 -220 116 -252 -30 81 35 -149 -129 -250 4 -26 -79 -138 37 -68
6282 -68 103 108 -282 -165 -160 -47 -142 4 -65 193 -111 239 -12 20 -43 -314 197 -86 19 -103 6 -157 118
6305 118 204 -49 243 -108 -355 -117 -19 309 187 9 155 60 -52 87 -17 -210 152 -227 -190 -205 -45 -106
6327 -106 185 113 55 3 -247 -92 21 -123 -29 -26 398 -44 18 245 29 -136 -226 -132 32 -100 -54 -95 162 -153
6351 -153 -53 -92 -124 -57 100 6 62 159 34 141 150 22 83 -173 99 44 -71 -145 -119 -214 229 -76 -92 -25 -198
6376 -198 395 -79 -124 92 6 -42 -161 -80 248 -42 -10 80 -10 242 28 -25 -6 118 -27 78 -138 24 24 -21
6400 -21 -65 -138 -110 112 302 340 97 240 -165 -50 61 146 -166 -64 -124 -102 99 -28 37 73 -140 -69 -170 43
6424 43 15 113 54 -94 57 32 -72 5 156 -21 138 -113 12 184 -65 110 -108 -56 -128 16 -48 -58 111
6447 111 -115 147 177 -145 71 -216 137 327 85 109 78 -39 -19 -77 -211 -38 -68 -190 -34 -110 -221 77
6469 77 15 -217 -129 98 -149 -292 -200 115 -94 202 132 -151 61 298 95 -160 -33 -21 52 226 94 41 108
6492 108 84 -185 -306 55 -181 -17 141 129 68 -129 -170 212 -48 102 -109 -155 78 137 215 107 222 96
6514 96 -214 -224 30 -99 -176 -159 -285 60 188 -137 -256 55 -24 24 -65 -24 305 2 59 44 44 -77 215 141
6538 141 185 -81 -25 -7 -4 154 349 16 10 -4 -169 -66 98 -68 -91 -241 -235 -96 -73 107 -41 65 -124 -153
6562 -153 319 172 -39 25 333 -101 -316 -244 -89 262 28 118 -147 -133 96 177 -198 -184 40 -40 -22 159 -129
6585 -129 151 -171 -67 143 127 -148 -129 32 -126 230 -43 265 -107 109 -9 113 -68 -245 83 95 61
6606 61 -251 78 -130 -9 -166 106 -486 9 -7 -165 79 -44 -60 176 -7 -321 -163 -222 62 -39 252
6627 252 -218 37 181 -157 155 14 131 163 -108 -21 -69 -94 -45 30 12 -275 -28 2 243 -3 100 -78 178
6650 178 81 -167 240 -65 -31 26 15 -146 184 178 -58 40 267 0 44 4 -71 -6 -150 -67 -39 -123 -117 137 -62
6675 -62 -261 79 110 183 -116 -88 -119 32 -110 -93 -5 -101 110 -56 -108 -125 -72 100 4 99 149 -150 201 -12 114
6700 114 120 191 3 -73 310 42 158 143 -29 409 5 60 7 -5 17 -136 -205 -268 9 336 4 253 -263 -75
6724 -75 -246 152 -243 -257 -101 -373 422 27 79 -261 -182 101 -74 522 305 41 -240 -108 40 125 -27 127
6746 127 233 -138 -133 223 -73 -199 218 -6 133 -222 -356 -223 -56 -14 44 216 123 43 -126 -92 -124 31 -249
6769 -249 -95 207 -211 81 -306 0 -94 169 288 -149 -159 -49 -154 335 264 143 10 -60 115 -194 123
6790 123 -162 -110 -97 109 293 -35 74 -140 -108 298 214 55 76 3 -77 -47 132 16 167 -118 93 -291 -54
6813 -54 36 60 77 162 -4 -26 -219 178 -43 213 2 -93 23 -45 255 204 17 -249 21 -468 -169 -12 208
6836 208 40 130 -180 -83 275 133 -156 40 -181 219 -69 -139 98 -120 -371 -65 -81 -128 -54 -389 56 180
6858 180 -35 -32 -5 -7 188 -35 -299 256 51 7 23 137 -49 65 101 49 127 22 188 -234 -84 -49 56 59
6882 59 -13 -63 133 -199 -13 81 -49 149 33 130 114 19 337 248 -101 -212 -170 -135 62 41 -212 22 -57 -110
6906 -110 -143 212 -41 74 -113 200 312 -179 374 -33 48 -103 90 153 -21 -273 182 13 21 -1 248 180
6928 180 -316 -107 -86 -148 -67 131 149 222 -36 212 -201 26 -146 -156 -120 61 62 283 31 77 14 124 -26 -168
6952 -168 13 131 65 170 47 4 8 -99 42 58 -194 -77 128 -240 317 -101 81 4 -125 76 -232 -168
6974 -168 -214 -27 50 27 147 53 521 24 -386 -111 92 11 -53 -61 34 -77 -24 -79 -208 48 41 106 207 215 141 54
7000 54 -160 -39 -72 -10 -169 -289 18 16 -200 -73 305 32 -3 -306 -58 -16 -365 -290 -24 -194 139 44 104
7023 104 232 21 239 231 88 16 224 244 -353 194 42 -63 21 149 171 -128 -78 -34 99 227 -24 98 20
7046 20 256 -94 106 226 -166 -7 50 165 207 -221 -137 -60 -102 92 -19 -365 -81 358 -117 -191 78 117 -324
7069 -324 -109 191 146 111 -27 54 -132 85 145 -136 108 -147 38 31 -9 119 -9 108 -133 66 -28 -34 -271
7092 -271 -26 -122 67 131 -174 228 94 80 -108 75 -39 -159 -289 50 164 -36 235 -99 -73 88 -117
7113 -117 -168 91 -58 -211 9 -71 238 178 9 95 -96 -347 173 -9 -87 163 -74 -131 116 168 -1 233
7135 233 -40 -85 -17 -10 212 -8 -58 -27 162 164 -191 -183 21 137 9 -36 232 4 292 -11 38 -71 -320 -78
7159 -78 -177 206 6 89 -98 48 -188 -100 251 -71 0 -7 146 201 60 -67 -213 -105 -93 50 -59 -3 26 -245
7183 -245 119 -153 -44 -3 137 -75 -169 -224 -135 101 60 -56 190 -203 -147 -439 -121 -11 28 123 26 -144 -79
7206 -79 53 43 -9 -240 124 -107 23 -63 -23 -323 -339 271 -29 66 -46 74 -103 -8 -261 28 120 -162 -65
7229 -65 2 -223 344 36 296 -238 -257 -219 -46 -101 240 117 -73 -238 148 -76 -113 98 18 -16 93 27 -116
7252 -116 -38 -206 -129 -188 15 -95 352 -82 -83 -210 -240 38 -138 106 -257 -237 -32 -79 -52 -229 169 -479 147
7275 147 332 -226 -50 -52 388 104 -71 -394 241 -167 -11 -143 -297 187 289 161 -76 -310 -318 -175 176
7296 176 98 75 274 -38 113 0 -138 18 -40 66 -159 -296 -302 -122 -66 -174 -181 -82 101 8 -103 -85 60 4
7320 4 149 -68 -35 -13 72 51 -140 181 33 -151 -194 271 86 175 -49 -93 153 -96 -12 -162 44 -22 214 162
7344 162 -109 -261 133 -9 -132 -147 79 267 120 -3 377 -267 -46 40 -299 308 37 103 63 99 43 -88
7366 -88 263 -207 111 41 -88 147 -40 -106 503 -32 189 -66 91 41 99 -5 91 42 -67 11 -164 132 34
7389 34 369 -148 -100 69 160 -138 -173 -21 -186 21 66 202 -308 -284 -131 48 -83 108 -143 -222 -71 27 47
7412 47 64 -78 -201 198 20 -162 79 12 71 54 88 -111 40 -24 -177 -8 7 62 43 -201 -211 -127 -165 -6
7436 -6 63 13 2 286 42 -4 -23 282 -44 2 -217 -284 11 31 -17 -233 131 7 -176 160 123 -209 -30 237
7460 237 -112 295 188 -55 -96 200 -202 -247 -148 45 -256 -18 296 37 26 -78 220 90 203 102 143 19
7482 19 -297 24 -126 240 -12 225 14 -67 -261 30 146 106 77 5 17 -11 -46 55 -66 -6 111 -193 -93
7505 -93 -74 -1 -76 -1 -342 261 -30 101 69 172 50 64 -43 -331 35 235 227 -33 334 -259 113 201 -438
7528 -438 -127 124 -127 222 112 86 -211 194 167 11 107 6 -80 108 24 -125 -324 34 -162 -100 176 111
7550 111 34 78 68 267 -156 -93 54 -395 -19 139 -144 12 -91 323 106 -88 218 64 35 16 120 -103
7572 -103 3 -47 32 -122 -173 18 -8 -383 -80 211 181 -44 -158 -86 -177 71 399 -57 600 -405 -313 -95
7594 -95 -116 72 -235 -80 -88 204 -214 -142 -61 -67 73 9 -66 157 72 301 -156 30 55 81 -176 54 -59 -22 -63
7619 -63 -33 302 -46 107 -36 -17 12 93 114 312 -27 -139 -14 -183 169 238 -109 -323 -39 68 -184 -110 134
7642 134 60 345 -227 193 -196 197 75 -172 93 4 6 -245 -90 254 303 -83 -98 -102 197 121 -58 24 -19 -101
7666 -101 -124 -164 92 114 17 -24 -51 21 202 -155 -24 -242 -45 -64 -77 -50 -94 -89 -273 -93 130 -274 -151 -92 -474
7691 -474 -8 -148 -134 16 97 37 17 101 27 298 96 58 -25 234 114 91 252 66 -6 149 -27 237 -326
7714 -326 -110 77 -326 205 -207 -238 36 -170 -61 220 -88 55 -109 -208 -25 26 -124 -94 141 -310 -359 -128
7736 -128 -85 19 306 -18 71 -128 -156 207 -174 123 -58 30 64 -48 -96 125 -35 381 331 -11 564 188
7758 188 -36 -206 -225 -30 142 141 17 216 -191 -171 -115 -90 200 4 238 164 -12 83 -131 133 -37 -122 58
7781 58 -225 -83 1 8 213 247 -44 -183 197 -31 367 1 5 165 -87 -169 -209 -311 57 357 -49 26 248
7804 248 176 -36 -106 18 39 195 -130 -12 204 -179 -11 243 92 11 -242 -92 254 -5 -145 -183 111 -70
7826 -70 -83 12 2 24 353 121 -70 82 292 -184 40 -243 -48 -7 280 -138 -41 417 24 12 -342 392 1
7849 1 272 109 -114 -186 34 444 -119 282 10 -83 72 -41 -173 63 -188 152 74 -94 -131 -188 59 -277
7871 -277 -129 -55 7 176 78 -88 48 3 198 16 -158 29 -183 -27 -188 -147 -100 51 -68 -21 -34 9 -128
7894 -128 88 -232 -65 136 31 28 22 -98 -274 -268 -195 -480 473 77 -93 -224 109 3 62 84 111 36 -272 11
7918 11 268 159 -227 -79 -43 109 87 -62 -120 -291 -125 298 243 -89 -98 -77 -66 77 224 -146 -8 13 -166
7941 -166 -118 3 -38 165 -223 -118 -68 -119 -173 90 194 -100 -45 -252 121 16 152 -105 -246 1 -79 -79 -49
7964 -49 192 -72 -58 56 303 6 -116 -217 150 -51 80 52 -24 151 -66 -156 -100 -10 76 56 -93 221 106
7987 106 39 44 -81 31 132 -128 -75 84 -9 -392 326 163 -54 114 -201 -99 -23 32 83 43 30 -34 394 58
8011 58 111 -279 204 114 -118 82 242 12 335 -113 -189 -165 37 -20 208 -135 190 -99 -39 -140 -25 181
8033 181 -3 -260 172 74 -7 -198 164 189 -192 -165 125 -112 -220 101 -86 -47 1 -103 18 -488 50 -225
8055 -225 32 170 154 -192 -291 194 106 -110 106 65 -134 -1 -128 107 -23 -48 347 453 -120 -6 -51 -115
8077 -115 85 -246 59 8 58 131 279 57 -91 -177 344 -69 -84 -203 255 147 141 -9 13 118 -241 127 -131
8100 -131 74 57 -26 -303 82 -19 -67 -102 -54 312 -110 -324 -101 -202 -83 -104 77 23 10 142 -115 350 186
8123 186 61 96 27 -76 -88 291 -99 106 -153 -427 -15 56 17 -56 -97 135 236 -121 75 -19 -25 -58 -203 196
8147 196 -446 213 -161 26 -114 91 -279 182 -17 209 -37 193 9 -99 -84 17 218 163 -178 -136 23
8168 23 -153 181 -31 61 -50 -72 -206 181 -10 410 139 72 42 -81 10 105 -27 -218 46 -312 91 -235
8190 -235 -4
8191d
##END NTUPLES=NMR FID
##END=
