##TITLE=1H_LR-580-R2H2-CR2
 D2O, 8 sc, 
 26.12.2019
##JCAMPDX= 6.0         $$ Bruker NMR JCAMP-DX V2.0
##DATA TYPE= NMR FID
##DATA CLASS= NTUPLES
##ORIGIN= UXNMR, Bruker Analytische Messtechnik GmbH
##OWNER= root
$$ XWIN-NMR		Version 3.5
$$ Thu Dec 26 13:49:59 2019 Russian Standard Time (UT+4h)  she@DPX200
##.OBSERVE FREQUENCY= 200.1315
##.OBSERVE NUCLEUS= ^1H
##.DELAY= (6, 6)
##.ACQUISITION MODE= SIMULTANEOUS
##.ACQUISITION SCHEME= undefined
##.AVERAGES= 8
##.DIGITISER RES= 18
##SPECTROMETER/DATA SYSTEM= spect
##.PULSE SEQUENCE= zg30
##.SOLVENT NAME= DMSO
##.SHIFT REFERENCE= (INTERNAL, DMSO, 0, 15.7039)
##AUDIT TRAIL= $$ (NUMBER, WHEN, WHO, WHERE, WHAT)
$$ ##TITLE= Audit trail, XWIN-NMR		Version 3.5
$$ ##JCAMPDX= 5.01
$$ ##ORIGIN= Bruker BioSpin GmbH
$$ ##OWNER= she
$$ F:/spectra/data/she/nmr/H-F/1/audita.txt
$$ ##AUDIT TRAIL=  $$ (NUMBER, WHEN, WHO, WHERE, WHAT)
(   1,<2019-12-26 13:48:07.57 +0400>,<she>,<DPX200>,
      <created by zg, POWCHK disabled, PULCHK disabled
       configuration hash MD5:
       00 E9 B6 7A A2 85 ED C7 34 08 36 98 17 FE 4E 26
       data hash MD5: 16K
       77 2C F1 C1 0E D1 22 53 1A 8F D9 CA CA A8 78 02>)
$$ ##END=
$$ 
$$ hash MD5
$$ 48 20 16 2E 4C 9E 87 B0 C1 B1 FE 79 C1 51 07 B2
##$RELAX= 
##$RELAX= 
##$RELAX= 
##$RELAX= 
##$RELAX= 
##$RELAX= 
$$ Bruker specific parameters
$$ --------------------------
##$DU= <F:/spectra>
##$EXPNO= 1
##$NAME= <H-F>
##$PROCNO= 1
##$TYPE= <nmr>
##$USER= <she>
##$AMP= (0..31)
100 100 100 100 100 100 100 100 100 100 100 100 100 100 100 100 100 100 
100 100 100 100 100 100 100 100 100 100 100 100 100 100 
##$AQSEQ= 0
##$AQ_mod= 1
##$AUNM= <au_zg>
##$AUTOPOS= <>
##$BF1= 200.13
##$BF2= 200.13
##$BF3= 200.13
##$BF4= 200.13
##$BF5= 200.13
##$BF6= 200.13
##$BF7= 200.13
##$BF8= 200.13
##$BYTORDA= 1
##$CFDGTYP= 0
##$CFRGTYP= 5
##$CHEMSTR= <none>
##$CNST= (0..31)
1 1 145 1 1 1 1 1 1 1 1 1 1 1 1 1 1 1 1 1 1 1 1 1 1 1 1 1 1 1 1 1 
##$CPDPRG= <>
##$CPDPRG1= <>
##$CPDPRG2= <>
##$CPDPRG3= <>
##$CPDPRG4= <mlev>
##$CPDPRG5= <mlev>
##$CPDPRG6= <mlev>
##$CPDPRG7= <mlev>
##$CPDPRG8= <mlev>
##$CPDPRGB= <>
##$CPDPRGT= <>
##$D= (0..31)
0 1.2 0 0 0 0 0 0 0 0.06 0 0.03 0 0 0 0 0.0002 0 0 0 0 0 0 0 0 0 0 0 0 
0 0 0 
##$DATE= 1577353687
##$DBL= (0..7)
120 120 120 120 120 120 120 120 
##$DBP= (0..7)
150 150 150 150 150 150 150 150 
##$DBP07= 0
##$DBPNAM0= <>
##$DBPNAM1= <>
##$DBPNAM2= <>
##$DBPNAM3= <>
##$DBPNAM4= <>
##$DBPNAM5= <>
##$DBPNAM6= <>
##$DBPNAM7= <>
##$DBPOAL= (0..7)
0.5 0.5 0.5 0.5 0.5 0.5 0.5 0.5 
##$DBPOFFS= (0..7)
0 0 0 0 0 0 0 0 
##$DE= 6
##$DECBNUC= <off>
##$DECIM= 24
##$DECNUC= <off>
##$DECSTAT= 4
##$DIGMOD= 1
##$DIGTYP= 9
##$DL= (0..7)
0 120 120 120 120 120 120 120 
##$DP= (0..7)
150 150 150 150 150 150 150 150 
##$DP07= 0
##$DPNAME0= <>
##$DPNAME1= <>
##$DPNAME2= <>
##$DPNAME3= <>
##$DPNAME4= <>
##$DPNAME5= <>
##$DPNAME6= <>
##$DPNAME7= <>
##$DPOAL= (0..7)
0.5 0.5 0.5 0.5 0.5 0.5 0.5 0.5 
##$DPOFFS= (0..7)
0 0 0 0 0 0 0 0 
##$DQDMODE= 0
##$DR= 18
##$DS= 0
##$DSLIST= <SSSSSSSSSSSSSSS>
$$ [...]
##$SUBNAM2= <"">
##$SUBNAM3= <"">
##$SUBNAM4= <"">
##$SUBNAM5= <"">
##$SUBNAM6= <"">
##$SUBNAM7= <"">
##$SUBNAM8= <"">
##$SUBNAM9= <"">
##$SW= 24.9337058887773
##$SWIBOX= (0..15)
0 0 2 0 0 0 0 0 0 0 0 0 0 0 0 0 
##$SW_h= 4990.01996007984
##$TD= 16384
##$TD0= 1
##$TE= 0
##$TE2= 300
##$TE3= 300
##$TEG= 300
##$TL= (0..7)
0 120 120 120 120 120 120 120 
##$TP= (0..7)
150 150 150 150 150 150 150 150 
##$TP07= 0
##$TPNAME0= <>
##$TPNAME1= <>
##$TPNAME2= <>
##$TPNAME3= <>
##$TPNAME4= <>
##$TPNAME5= <>
##$TPNAME6= <>
##$TPNAME7= <>
##$TPOAL= (0..7)
0.5 0.5 0.5 0.5 0.5 0.5 0.5 0.5 
##$TPOFFS= (0..7)
0 0 0 0 0 0 0 0 
##$TUNHIN= 0
##$TUNHOUT= 0
##$TUNXOUT= 0
##$USERA1= <user>
##$USERA2= <user>
##$USERA3= <user>
##$USERA4= <user>
##$USERA5= <user>
##$V9= 5
##$VALIST= <valist>
##$VCLIST= <CCCCCCCCCCCCCCC>
##$VD= 0
##$VDLIST= <DDDDDDDDDDDDDDD>
##$VPLIST= <PPPPPPPPPPPPPPP>
##$VTLIST= <TTTTTTTTTTTTTTT>
##$WBST= 1024
##$WBSW= 4
##$XGAIN= (0..3)
0 0 0 0 
##$XL= 0
##$YL= 0
##$YMAX_a= 524082
##$YMIN_a= -333934
##$ZGOPTNS= <>
##$ZL1= 120
##$ZL2= 120
##$ZL3= 120
##$ZL4= 120
##$ABSF1= 10
##$ABSF2= 0
##$ABSG= 5
##$ABSL= 3
##$ALPHA= 0
##$AQORDER= 0
##$ASSFAC= 0
##$ASSFACI= 0
##$ASSFACX= 0
##$ASSWID= 0
##$AUNMP= <proc_1d>
##$AZFE= 0.1
##$AZFW= 0.1
##$BCFW= 1
##$BC_mod= 2
##$BYTORDP= 1
##$COROFFS= 0
##$CY= 11.3945322036743
##$DATMOD= 1
##$DC= 2
##$DFILT= <>
##$DTYPP= 0
##$F1P= 16.9975609425685
##$F2P= -3.02152046262296
##$FCOR= 0.5
##$FTSIZE= 0
##$FT_mod= 4
##$GAMMA= 1
##$GB= 0.15
##$INTBC= 1
##$INTSCL= 1
##$ISEN= 128
##$LB= 0.24
##$LEV0= 0
##$LPBIN= 0
##$MAXI= 10000
##$MC2= 0
##$MEAN= 0
##$ME_mod= 0
##$MI= 1.114404
##$NCOEF= 0
##$NC_proc= 0
##$NLEV= 6
##$NOISF1= 3.799351
##$NOISF2= 2.8
##$NSP= 1
##$NTH_PI= 0
##$NZP= 0
##$OFFSET= 15.70392
##$PC= 1
##$PHC0= -10148.86
##$PHC1= 11.2008
##$PH_mod= 1
##$PKNL= yes
##$PPARMOD= 0
##$PSCAL= 0
##$PSIGN= 0
##$REVERSE= no
##$SF= 200.130013532006
##$SI= 16384
##$SIGF1= 3
##$SIGF2= 2
##$SINO= 400
##$SIOLD= 16384
##$SREGLST= <1H.CDCl3>
##$SSB= 0
##$STSI= 0
##$STSR= 0
##$SW_p= 3612.71676300578
##$SYMM= 0
##$S_DEV= 0
##$TDeff= 0
##$TDoff= 0
##$TI= <>
##$TILT= no
##$TM1= 0
##$TM2= 0
##$TOPLEV= 0
##$USERP1= <user>
##$USERP2= <user>
##$USERP3= <user>
##$USERP4= <user>
##$USERP5= <user>
##$WDW= 1
##$XDIM= 8192
##$YMAX_p= 0
##$YMIN_p= 0
$$ End of Bruker specific parameters
$$ ---------------------------------
##NTUPLES= NMR FID
##VAR_NAME=  TIME,          FID/REAL,        FID/IMAG
##SYMBOL=    X,             R,               I
##VAR_TYPE=  INDEPENDENT,   DEPENDENT,       DEPENDENT
##VAR_FORM=  AFFN,          ASDF,            ASDF
##VAR_DIM=   8192,          8192,            8192
##UNITS=     SECONDS,       ARBITRARY UNITS, ARBITRARY UNITS
##FACTOR=    0.0002004,     1,               1
##FIRST=     0,             0,               0
##LAST=      1.6414764,     0,               0
##MIN=       0,             -333934,         0
##MAX=       1.6414764,     524082,          0
$$ Real data points
##PAGE= N=1
##DATA TABLE= (X++(R..R)), XYDATA
$$ [...]
$$ plain form
1976 66 298 -223 -188 216 59 -114 -307 529 338 -532 -648 174 420 -151 -180 13 215 -157 134 166 46
1997 46 -184 -226 -94 423 401 82 -56 -234 387 408 467 -95 -172 117 16 160 29 475 15 -410 -269 -5
2019 -5 313 -159 -280 329 61 -58 136 108 -72 -279 205 203 410 -429 -333 121 163 -189 -234 195 506 -524
2041 -524 -490 692 239 -712 -464 163 487 -77 -736 -37 419 -421 -292 183 627 -131 -762 1 790 112
2061 112 -656 -143 250 207 -552 -168 697 -203 -1011 -109 849 330 -831 -413 562 130 -326 -395 428 328
2081 328 -660 -162 1069 640 -656 -638 467 677 -364 -664 464 559 -903 -677 1031 1194 -488 -1242
2099 -1242 334 936 98 -794 -166 1023 -334 -989 205 1132 -172 -1106 -33 947 213 -831 -59
2116 -59 636 207 -880 199 974 -21 -1288 -141 1239 319 -787 -582 637 512 -655 -354 851
$$ packed form
1976F6K32n21L5M04j57j73j93Q36j91q70j16Q22K46n71k9J93K02l72K91L2j20
1997D6k30m2J32N17k2l19j38j78O21K1N9n62p7K89j01J44j31M46m60m25J41K64
2019eL18m72j21O09k68j19J94k8j80k07M84kK07q39R6M54M2l52m5M29L11j030
2041e24L4J182m53r51K48O27L24n64o59O99M56q40J29M75M44p58o31P63P89o78
2061A12p68N13L93m3p59L84Q65r00q08R02R58n19j161M18R75m32m56o9Q23j00
2081C28r88M98J231m29j296J8J105K10j041l00J128R5j462K26J708J63j682p54
2099a242J576O02q38q92O28J189j357o55J194R27j304r34J073R80p34j044P72
2116e9O95m29j087J079P75r95j267J147J380r20j106K05J219j25j167L01J205
$$ plain form
2133 851 334 -1170 -486 1149 1092 -1149 -887 728 1004 -512 -501 935 757 -865 -864 820 1157 -498
2151 -498 -1139 428 1259 -339 -1120 316 1047 -164 -574 314 1188 -475 -1252 -134 1142 -134 -1315
2168 -1315 -170 950 194 -822 -57 1325 156 -1279 -27 1207 359 -1145 -438 952 490 -1009
2184 -1009 -579 932 533 -1052 -500 1147 846 -998 -874 715 770 -335 -849 691 665 -280 -793 894
2202 894 883 -446 -547 422 911 -124 -879 349 704 -234 -714 248 1084 -330 -1207 451 1070 70
2220 70 -1180 -55 725 -15 -700 -77 1109 -112 -1228 -65 1062 303 -978 -663 649 353 -382
2237 -382 -504 643 480 -708 -268 903 294 -942 -922 605 635 -524 -400 229 418 -331 -374 451 701
2256 701 -586 -827 306 695 16 -567 38 633 -198 -428 175 366 -322 -690 265 780 -140 -847 71
$$ packed form
2133H51n17j504O84J635n7k241K62J615K76j516J1J436j78j622JJ684L37j655
2151d98o41J567Q31j598p81J436P31j211m10Q88Q74j663p77J118J276j276j181
2168a315J145J120p56j016P65J382j169j435J252J234q48j504P07J390m62j499
2184a009M30J511l99j585N52J647l01j844J24J589N5j105n14J540k6r45n13J687
2202H94j1j329j01R69M89j035p55J228L55r38m80R62Q36j414q77J658O19j000
2220G0j250J125P80p40o85O23J186j221j116J163J127p59j281L15J312k96p35
2237c82j22J147j63j188M40J171o09j236K0J527L0j159J24O29J89p49m3Q25K50
2256G01j287k41J133L89o79n83O05N95q31k30O03J91o88l68R55N15r20p07R18
$$ plain form
2275 71 831 249 -302 26 411 -103 -911 -211 518 420 -665 -240 467 489 -365 -451 645 79 -377 -15 507
2296 507 353 -330 -155 282 384 -22 40 -66 557 -211 -217 364 63 -77 -449 64 429 -221 -328 -65 286
2317 286 -34 -144 272 285 -97 -349 138 534 -295 -296 -105 244 199 217 85 92 -19 -198 120 -145 266 -424
2339 -424 -227 213 377 -67 -47 -241 -30 -243 180 -18 -64 -418 -48 41 123 382 -240 -99 126 179 -73 -89
2361 -89 60 -302 49 315 -60 -135 -116 -137 72 312 -19 151 -346 -103 170 71 99 -41 71 112 -328 -21
2383 -21 415 300 -397 -111 257 283 -615 -310 110 117 20 -78 316 -18 -219 -398 420 324 106 -193 158 33
2405 33 -196 59 346 47 -177 -82 165 145 -27 -511 34 500 -64 -258 452 518 6 -421 178 705 26
2426 26 -537 -200 578 -15 -553 -121 578 -26 -329 212 516 -32 -885 -192 594 212 -764 -289 510 223
$$ packed form
2275G1P60n82n51L28L85n14q08P00P29r8j085M25P07K2q54q6J096n66m56L62N22
2296E07j54o83J75M37J02m06O2j06O23p68oN81l01j40l72N13L65o50j07K63L51
2317B86l20j10M16J3l82k52M87L96q29jJ91L49m5J8j32Pj11j79L18k65M11o90
2339d24J97M40J64m44K0j94K11k13M23j98m6l54L70Q9Q2K59o22J41K25N3k52j6
2361h9J49l62L51K66l75p5J9k1K09K40l31J70m97K43K73r9K8j40J12M1m40L07
2383b1M36j15o97K86L68K6q98L05M20Pr7r8L94l34k01j79Q18r6k18k99L51j25
2405C3k29K55K87k99k24R5K47k0j72m84N45M66n64j94P10O6n12m27N99N27o79
2426B6n63L37P78n93n38M32O99o04l03N41L04n48q53O93P86l82r76M75P99k87
$$ plain form
2446 223 -458 -395 485 -43 -216 -291 690 448 -314 -261 393 441 -620 -205 422 292 -415 -255 678 418 -506
2467 -506 -673 292 679 -198 -798 183 384 -259 -552 807 568 68 -799 -42 641 215 -253 -214 655 271
2487 271 -496 98 766 -333 -606 -117 511 117 -705 -224 176 187 -427 -200 511 245 -837 -260 461 446
2507 446 -623 -613 410 727 -389 -300 243 163 -356 -304 394 230 -622 -527 94 777 -315 -423 253 528
2527 528 52 -576 162 642 -205 -208 189 754 -82 -494 -181 493 -124 -612 94 708 -58 -748 14 563 447
2548 447 -456 -114 814 226 -562 -213 427 38 -747 -153 613 137 -389 -321 387 518 -351 -339 435 441 -482
2569 -482 -330 417 289 -438 -847 192 505 -201 -452 185 346 38 -168 364 343 -6 -276 167 586 279
2589 279 -524 -297 396 57 -401 -5 179 -52 -736 -52 646 6 -354 -315 515 234 -252 -12 209 7
$$ packed form
2446B23o81O3Q80n28j73p5R81k42p62N3O54M8j061M15O27j30p07J60R33k60r24
2467e06j67R65L87q77o00R81K01o43k93J359k39n00q67P57O83m26m68L9Q69l84
2487B71p67N94O68j099k73M89O28l94q22M81M00J1o14K27P11k66j082N77P21j5
2507D46j069J0J023L17j116Q9N43q0n19N2O98j64q52R5O21O83j092j08O76K75
2527E28m76o28P38M80q47lL97N65q36m12L13O74o17m88P06O14p66o90P62N49j16
2548D47r03L42R28n88p88L49O40l89p85N94P66m76n26O8P08J31q69J2P74Or23
2569d82J52P47j28p27m09J039L13p06k51O37J61l08k06N32k1l49k70M43M19l07
2589B79q03K27O93l39m58L96J84k31o84O84O98o40l60L9Q30k81m86K40K21k02
$$ plain form
2609 7 -287 38 449 304 -331 -522 280 201 -203 -495 122 36 -204 25 418 418 -342 -396 294 192 -303 -312 92
2632 92 169 21 -222 301 183 -149 -626 168 386 -354 -253 -281 -27 151 -311 229 126 -365 -624 -418 238
2653 238 188 -351 -236 201 262 53 -104 54 -13 29 244 315 20 -153 -174 51 341 -59 -355 148 -4 -201
2675 -201 -186 37 -247 -214 32 37 302 -139 -269 20 -247 -203 141 294 101 -364 -227 -108 289 189 83 26
2697 26 2 128 -186 -116 185 0 -32 -47 -77 160 16 -66 -217 -175 201 -317 -54 -21 -378 -245 -148 60 -94
2720 -94 192 -345 250 204 -151 115 -44 188 450 184 -28 227 -55 -168 -21 20 95 -127 -381 -103 161
2741 161 -37 -103 17 -206 -122 -204 -28 143 -18 103 109 41 70 -324 -119 -43 -96 -18 -101 142 25 -279 -144 160
2765 160 -141 -20 -264 73 -106 -188 24 48 194 -612 -336 20 59 -161 -117 378 465 -8 -127 67 321 -48
$$ packed form
2609Gk94L25M11j45o35j91Q02p9m04k92O17q6k40K29L93%p60n4O90j02m95rM04
2632I2P7j48k43N23j18l32m77P94K18p40J01k8K54J78m62N40j03m91k59K06O56
2653B38n0n39J15M37O1k09j57J58o7M2K15P1k95j73k1K25K90m00k96N03j52j97
2675b01J5K23k84L3K46NK65m41j30K89k67M4L44J53j93m65J37J19L97j00j06n7
2697B6k4J26l14P0L01j85l2j5l0K37j44q2j51M2L76n18K63L3l57J33R7K08j54
2720i4K86n37N95m6l55K66j59K32K62k66k12K55k82j13J47M1P5k22k54K78K64
2741A61j98o6J20k23Q4q2J76J71j61J21Oo8K9l94K05P6n3P8q3K43j17l04J35L04
2765A60l01J21k44L37j79q2K12K4J46q06K76L56L9k20M4M95Q7m73j19J94K54l69
$$ plain form
2787 -48 -425 18 103 185 -362 275 -41 -90 -77 -207 80 -198 -749 405 593 -135 -396 43 563 40 -176
2808 -176 -87 169 -42 -116 -71 364 34 -289 -303 239 358 89 -371 390 310 -463 -266 231 99 -447 -318 181
2830 181 329 -188 -442 38 152 -7 -381 79 156 -176 -355 324 234 -225 -135 122 246 284 -316 11 169
2851 169 128 -291 385 621 -276 -236 71 623 88 -268 -256 450 228 -143 -30 24 118 -588 -154 184 -189 -214
2873 -214 -387 284 312 -162 -245 622 300 -333 -213 19 126 28 -369 107 417 -16 -241 60 226 -232 -163
2894 -163 295 352 142 -9 151 322 -185 -688 -17 92 23 -678 183 369 -279 -396 104 321 121 -269 -317
2915 -317 692 -1 -424 118 303 90 -421 85 48 202 -228 -117 39 136 103 -397 141 32 -225 -310 190
2936 190 336 -343 -358 271 497 -220 -358 154 75 -7 -71 212 155 -208 -167 149 407 -404 -204 4 196 -118
$$ packed form
2787d8l77M43Q5Q2n47O37l16m9J3j30K87k78n51J154J88p28k61M39N20n23k16
2808a76Q9K56k11p4M5M35l30l23j4N42J19k69m60P61q0p73J97M97j32n46J29M99
2830A81J48n17k54M80J14j59l74M60P7l32j79O79r0m59R0K57J24L8o00L27J58
2851A69m1m19O76K36q97M0L07N52n35l56J2P06k22l71J13N4R4p06M34L38l73k5
2873b14j73O71K8m74q3Q67l22o33J20K32J07r8l97M76L10m33k25L01J66m58O9
2894a63M58N7k10j51J60J71n07n03O71J09o9p01Q61J86o48j17N00K17k00l90m8
2915c17J009o93m23N42J85k13n11N06l7J54m30J11J56R7l3n00N38j09k57q5N00
2936A90J46o79j5O29K26p17j38N12p9q2o4K83n7l63M1L16K58q11K00K08J92l14
$$ plain form
2958 -118 -198 121 28 -153 -91 -134 429 -66 -236 -240 271 -2 -82 159 335 95 -159 81 6 132 -128 -41 -76
2981 -76 51 -52 72 207 6 -154 -24 253 169 138 -197 239 -27 158 63 250 102 -186 -118 260 27 -207
3003 -207 -216 107 -345 -10 -46 45 -58 -203 57 324 125 -37 -117 -44 218 -26 -42 -12 -77 69 -48 -293 -103
3026 -103 -537 19 13 -234 -82 76 -264 16 170 83 -38 39 137 -218 44 319 273 206 -50 -33 -67 -114 0
3049 0 -142 299 120 -62 -242 -43 19 238 9 -121 93 -17 -34 39 -59 304 28 -273 -121 -41 180 -18
3071 -18 -270 3 -25 -102 -210 50 292 -266 -279 281 416 190 -181 -189 -1 -117 -421 123 171 -175 -48 -70 221
3094 221 -69 -46 -115 -86 32 -107 -318 42 -113 -96 67 218 -284 -27 -331 255 203 -40 -90 107 -160 374
3116 374 -87 109 -100 -119 -143 300 75 34 -290 60 -16 -101 204 320 -254 -112 -100 302 5 -303 138 -54
$$ packed form
2958a18q0L19r3j81O2m3N63m95j70mN11k73q0K41J76k40k54K40p5J26k60Q7l5
2981g6J27j03J24J35k01j60J30K77q4l1l35M36k66J85r5J87j48k88O8L78k33k34
3003b07rL23m52L35l6R1j03j45K60K67j99j62q0P3K62k44j6L0o5J46j17k45J90
3026a03m34N56ok47J52J58l40K80J54q7j21P7R8l55K62K75m6o7k56J7l4m7J14
3049@j42M41j79j82j80J99O2K19k29j30K14j10j7P3r8L63k76l01J52Q0K21j98
3071a8k52K73k8p7j08K60K42n58j3N60J35k26l71qJ88j16l04N44M8l46J27k2K91
3094B21k90K3o9K9J18j39k11L60j55J7J63J51n02K57l04N86n2k43n0J97k67N34
3116C74m61J96k09j9k4M43k25m1l24L50p6q5L05J16n74J42J2M02k97l08M41j92
$$ plain form
3138 -54 -121 -17 39 98 223 -238 -131 106 56 -172 -358 -111 121 -148 -166 -141 277 -416 -440 144 92 44 107 214
3162 214 427 37 26 -230 -41 -321 -141 -168 255 -298 -146 34 80 67 -202 -264 54 -254 -520 -55 60 118
3184 118 -70 48 282 193 -143 27 58 -145 -254 200 100 129 8 -29 110 198 -408 31 106 -30 -66 -217
3206 -217 -117 78 -257 -212 127 275 -12 -204 17 273 -106 107 44 36 261 -74 96 12 -286 -419 98 213
3228 213 182 -434 -117 20 -70 -163 53 481 87 -527 55 174 -186 105 10 351 -3 -99 -302 -56 48 -185
3250 -185 -87 143 168 -325 136 223 135 -27 -169 165 203 -422 -152 52 86 -232 -305 -84 298 -164 -64 91
3272 91 30 -207 -59 151 162 152 -17 185 305 -183 -103 -263 50 146 -152 88 245 -113 -151 -54 106 6 -330
3295 -330 90 124 235 36 -32 277 -116 53 208 130 -140 -31 -30 -134 -55 -47 -392 9 95 -155 -132 37 -78
$$ packed form
3138e4o7J04N6N9J25m61J07K37n0k28j86K47K32k69j8K5M18o93k4N84n2m8O3J07
3162B14K13l90j1k56J89k80J80k7M23n53J52J80M6j3k69o2L18l08k66M65J15N8
3184A18j88J18K34q9l36J70L1k03j09M54j00K9j21l7J39Q8o06M39P5j36l6j51
3206b17J00J95l35M5L39J48k87j92K21K56l79K13o3qK25l35J70q4k98j33N17J15
3228B13l1o16L17J37r0r3K16M28l94o14N82J19l60K91r5L41l54r6k03K46J04k33
3250a85R8K30K5m93M61Q7q8j62j42L34L8o25K70K04L4l18p3K21L82m62J00J55
3272I1o1k37J48K10J1j0j69K02J20m88Q0j60L13R6k98K40J57l58l8R7J60j00l36
3295c30M20L4J11j99o8L09l93J69J55p8k70J09Jj04P9Ql45M01Q6k50K3J69j15
$$ plain form
3318 -78 -139 8 150 124 159 -125 328 309 -42 58 141 133 -39 146 -141 117 -41 -90 -161 -85 -22 -107 75 180
3342 180 6 -207 39 22 -20 -135 0 176 -33 -69 -8 233 -68 73 -220 -41 37 99 -138 5 220 -50
3364 -50 -47 109 -126 63 -32 115 74 277 259 266 38 -206 -112 55 -138 47 -151 -222 44 -187 56 -68 55
3387 55 198 275 149 124 -122 23 155 -330 -54 -51 0 -171 250 96 359 -26 -201 95 -155 -184 -140 -38 40
3410 40 49 22 -196 110 198 -11 360 125 356 -6 -512 258 233 -24 173 -113 -63 -212 -79 213 77 -107
3432 -107 -93 82 -243 30 -185 -16 -142 91 512 217 168 71 13 48 -123 -72 70 -252 -319 -143 -140 167 445
3455 445 -113 174 51 240 116 35 176 451 -363 -84 -73 -234 148 -26 394 261 -100 46 -73 -95 84
3476 84 -128 -46 321 -190 -110 358 128 -85 -188 -157 -198 291 -44 111 30 37 -291 -69 131 -13 -243 -152 15
$$ packed form
3318g8o1J47J42k6L5k84M53j9l51J00Q3qj72J85k87K58j58m9p1P6O3q5J82J05
3342A80j74k13K46j7m2j15J35J76k09l6O1K41l01J41k93J79P8O2k37J43K15k70
3364e0LJ56k35J89r5J47m1K03j8Pk28k44R4J67j93J85j98p1K66k31K43j24J23
3387E5J43P7j26k5k46J45J32m85K76LN1j71M21j54K63l85j75K96k50k9M4J02P8
3410D0Rk7k18L06Q8k09L71k35K31l62n06P70k5k57J97k86N0j49J33K92j36j84
3432a07J4J75l25K73k15J69j26K33M21k95m9r7n8L5j71N1J42l22o7J76LL07K78
3455D45n58K87j23J89j24q1J41K75q14K79J1j61L82j74M20j33l61J46j19k2J79
3476H4k12Q2L67n11Q0M68k30k13j03L1m1M89l35J55q1Pl28K22K00j44k30R1J67
$$ plain form
3499 15 147 -153 -136 232 63 -49 245 -8 137 -186 -61 -96 -58 -104 7 -23 -35 -131 131 407 58 -403 45
3522 45 -2 126 -57 -228 288 -75 -299 -126 273 52 118 -273 182 196 178 55 272 -165 -93 -96 18 -44 242
3545 242 -150 -158 155 -300 -449 -122 180 -48 -306 -66 131 -243 176 -72 205 51 -162 264 268 -156 -134 -141
3567 -141 -78 196 -22 304 -37 -114 -95 -141 -24 33 -136 -90 159 157 183 7 188 -65 -385 266 319 436 -302
3590 -302 -287 -361 314 -176 117 -299 280 279 -70 -297 147 -30 -134 -211 -1 -57 4 105 38 125 -57 52 119
3613 119 123 70 -199 251 -71 -320 36 -247 -49 -181 -79 66 -75 -208 29 -6 -78 -95 -86 -25 98 -83 141
3636 141 -102 68 14 172 -375 -22 97 70 9 -83 178 -145 -53 13 -181 -104 -11 148 111 -135 105 -9 -168
3659 -168 -320 -11 -92 110 -261 -262 123 -71 31 -216 17 165 -109 -275 28 159 57 88 -111 -84 -5 69
$$ packed form
3499A5J32l00J7L68j69j12K94k53J45l23J25l5L8m6J11l0j2r6K62K76l49m61M48
3522D5m7J28j83j71N16l63k24J73L99k21O6l91M55J4j8j23K17m37P2lJ14o2K86
3545B42l92qL13m55j49L27L02k28k58K40J97l74M19k48K77j54k13M26Mm24K2p
3567a41O3K74k18L26l41p7J9m6J17N7j69M6K49kK6j76J81k53l20O51N3J17p38
3590c02J5p4O75m90K93m16N79jl49k27M44j77j04p7K10n6O1J01o7Q7j82J09O7
3613A19Mn3k69M50l22k49L56k83J98j32J02J45j41j33K37l5p2j7RO1J23j81K24
3636A41k43J70n4J58n47L53J19k7o1r2K61l23R2O6j94P7R3J59l7k46K40j14j59
3659a68j52L09q1K02l71jL85j94J02k47K33J48k74j66L03J31j02L1j99K7P9P4
$$ plain form
3681 69 28 21 69 -234 4 141 6 64 84 24 157 -204 189 201 -32 -112 -176 11 -69 74 267 342 -161 195
3705 195 -221 222 183 -319 -75 257 -86 -118 -7 194 101 -33 -226 -108 -37 -109 185 145 144 -185 -2 -154 116
3728 116 -56 71 108 -32 48 48 292 110 305 94 -46 29 82 -169 17 265 -251 -322 94 162 157 300 46
3751 46 226 165 64 -91 81 195 -131 74 38 72 213 -108 -28 169 -185 82 -29 59 -49 132 -73 -210
3773 -210 -194 289 31 285 127 -52 -55 -18 -230 -81 136 -305 121 10 -39 -94 -265 216 28 -78 -39 77
3795 77 -41 -32 66 -46 480 -208 -66 -102 36 -87 13 -71 -200 -17 -169 134 203 -136 171 -42 113 97 -83
3818 -83 -27 -208 40 114 352 191 245 28 197 1 21 168 68 250 -32 313 -19 -246 -62 29 -5 -80 -134
3841 -134 32 -27 121 -221 19 130 44 -211 -127 -79 199 83 -89 -39 7 -136 -256 1 160 -256 -62 51
$$ packed form
3681F9m1pM8l03K38J37j35N8K0o0J33l61L93J2k33q0o4J87q0J43J93P5n03L56
3705A95m16M43l9n02K44L32l43l2J11K01r3j34j93J18P1p2K94m0jl29J83j52K70
3728A16j72J27L7j40Q0%K44j82J95k11j40P5N3k51J86K48n16p1M16O8nJ43k54
3751D6J80o1j01j55J72J14l26K05l6L4J41l21Q0J97l54K67j11Q8j08J81k05j37
3773b10J6M83k58K54j58j79lL7k12J49K17m41M26j11m9n5j71M81j88j06L9J16
3795G7j18RR8j12N26o88J42l6J38j23J00q4j29J83j52L03O9l39L07k13J55j6j80
3818h3N6j81K48P4K38j61N4k17J69j96K0J47j00J82k82L45l32k27J84R1l4p5n4
3841a34J66n9J48l42K40J11q6k55Q4M8K78j16j72N0M6j43j20K57J59m16J94J13
$$ plain form
3863 51 -51 26 30 246 78 14 -106 -50 -26 198 -102 -27 -101 -124 215 -164 155 29 61 64 -75 -28 -215 -49 -44
3888 -44 162 -32 -307 79 266 -240 -31 117 53 -101 202 -300 176 204 -10 -160 98 234 35 -28 57 192
3910 192 -122 -171 -115 257 55 59 137 86 89 1 92 -32 -102 -59 23 -67 97 -177 214 -235 275 -294 57 225 -124
3935 -124 -52 79 118 -209 8 -131 249 -3 -83 -173 81 67 -45 -18 7 -41 -36 193 -2 -123 -81 335 -358 -248
3959 -248 -222 187 -23 134 -143 -49 57 190 142 -160 16 167 -32 96 -5 62 -122 -169 -125 -83 -314 9
3981 9 201 -11 90 -311 124 -136 -148 25 76 -158 121 -39 -267 -56 -38 -119 37 18 -253 -119 11 -149
4003 -149 -69 -29 -70 9 93 -148 -152 -61 -342 -158 -23 72 -176 174 45 95 142 112 28 229 45 -98 -131 3 -55
4028 -55 29 31 182 -84 -88 -91 -377 -270 109 -12 24 -86 -46 -331 -138 80 2 -317 22 45 120 -51 -123 263 -132
$$ packed form
3863E1j02P7MK16j68o4j20N6K4K24l00P5p4k3L39l79L19j26L2Lj39M7j87J66N
3888d4K06j94k75L86J87n06K09J48o4j54L03n02M76K8k14j50K58J36j99o3Q5J35
3910A92l14m9N6L72k02MP8n1Lq8R1j24p0M3Q2r0J64k74L91m49N10n69L51J68l49
3935a24P2J31L9l27K17j39L80k52q0r0K54j4j12K7K5m8NK29j95j21M2M16o93J10
3959b48K6M09k10J57k77R4J06J33m8l02J76J51j99J28j01O7j84m7M4M2k31L23
3981IJ92k12J01m01M35k60j2J73N1k34K79j60k28K11J8q1J56j9k71J34J30j60
4003a49Q0M0m1P9Q4k41mR1k81J84J35R5k48L50j29N0M7l0q4K01j84j43l3J34n8
4028e5Q4KJ51k66mlk86J07L79j21L6j10M0k85J93K18p8l19L39K3P5j71p2L86l95
$$ plain form
4053 -132 144 147 240 117 -166 89 134 -312 -80 -25 -4 -74 27 225 -36 251 74 -137 336 31 180 -70
4075 -70 -130 103 232 218 -62 248 -29 -84 82 -45 -39 -74 163 -105 67 67 -150 91 -4 -119 254 23 -24 -234
4099 -234 -31 108 39 157 79 -244 112 156 14 153 -18 102 -99 236 -71 -97 -200 -96 -107 -141 -81 -11 -29
4122 -29 27 228 29 250 7 20 -59 300 60 -152 18 260 -208 122 12 -49 141 -29 112 -9 13 -93
4144 -93 44 -105 101 -26 -17 40 -402 -116 87 -297 -26 -14 -54 122 45 -5 155 -205 -97 -223 -151 2 -175
4167 -175 -83 -22 -55 158 44 -44 37 -334 -158 -54 3 74 -18 -32 212 107 186 -47 123 44 -264 160 -328 -334
4191 -334 -222 215 -193 9 -95 -98 -77 4 -323 -24 347 -12 70 -8 7 -64 -50 -234 -162 -194 -134 -94 44 125 192
4216 192 -263 -142 -237 140 39 46 52 86 320 114 329 208 41 113 17 343 -104 -359 -355 141 228 -116 92 -65
$$ packed form
4053a32K76LR3j23k83K55M5m46K32N5K1p0J01J98k61K87j77k11M73l05J49k50
4075g0o0K33J29j4k80L10k77n5J66j27Ol5K37k68J72%k17K41r5j15L73k31m7k10
4099b34K03J39o9J18p8l23L56M4j42J39j71J20k01L35l07k6j03J04j1l4O0P0j8
4122b9N6K01j99K21k43J3p9L59k40k12J70K42m68L30j10o1J90j70J41j21K2j06
4144i3J37j49K06j27RN7m42K86K03l84K71J2m0J76p7n0J60l60J08j26P2J53j77
4167a75R2O1l3K13j14q8Q1l71J76J04N7P1r2j4K44j05P9k33J70p9l08M24m88o
4191c34J12M37m08K02j04lK1Q1l27K99L71l59Q2p8J5p1J4j84P2l2O0M0J38Q1O7
4216A92m55J21r5L77j01POL4K34k06K15j21j67P2r6L26m47k55MM96Q7l44K08j57
$$ plain form
4240 -65 274 -133 -167 -76 312 -145 88 -366 3 303 0 -258 109 101 -121 -41 19 82 -100 27 -85 -36 -77
4263 -77 101 -42 -190 -293 -72 -24 43 -252 12 21 -72 -67 252 -84 -62 -151 -43 77 -168 -80 -79 253 131 -193
4287 -193 -47 343 -130 -182 242 -115 -69 -150 -118 -162 149 268 -136 52 -53 128 -31 -123 304 83 -11 -192
4309 -192 212 120 69 -147 -222 -68 -10 -36 -48 -228 -230 -409 -338 78 52 -117 -28 45 -36 -132 181 -88 -77 118 165
4334 165 -21 -258 -78 154 -188 58 21 151 159 -83 -117 -7 -1 -88 0 -145 80 107 18 -55 105 -72 326 68
4358 68 -2 60 -183 -80 -220 88 295 -144 -82 -33 69 -104 -239 10 -193 -107 32 2 -98 96 -91 20
4380 20 -269 -77 -62 -159 -237 -106 -54 -82 75 -227 -21 28 19 -225 145 1 -16 72 225 -68 -33 186 25 112
4404 112 483 -83 -168 105 4 -161 -11 250 -149 -182 -276 -364 45 -145 -257 158 -169 -3 -62 303 52 195
$$ packed form
4240f5L39m07l4R1L88m57K33m54L69L00l03k58L67qk22Q0O0O3j82J27j12M9m1
4263g7J78j43j48j03K21M8O7k95K64Rr3NL19l36K2q9J08J20k45Q8JL32j22l24
4287a93J46L90m73n2M24l57M6q1L2m4L11J19m04J88j05J81j59r2M27k21r4j81
4309a92M04r2n1k16p5J54N8k6j2j80kj79P1M16k6j69Q9P3q1r6L13k69J1J95M7
4334A65j86k37J80K32l42K46l7J30Qk42l4J10Oq7Q8j45K25K7q9p3J60j77L98k58
4358F8p0O2k43J03j40L08K07m39O2M9J02j73j35K49k03Q6J39l0j00J94j87J11
4380B0k89J92J5r7p8J31N2k8J57l02K06M9rk44L70j44j7Q8J53k93L5K19j61Q7
4404A12L71n66q5K73j01j65J50K61l99l3r4q8M09j90j12M15l27J66n9L65k51J43
$$ plain form
4426 195 258 141 -207 103 88 42 102 24 -174 2 55 -247 -6 131 -66 -121 -2 415 82 -44 -87 143 15
4449 15 -9 -170 210 62 -17 -24 -195 28 195 -226 -303 163 -133 316 29 -84 -37 -36 53 134 105 141 -22 115
4473 115 -62 -110 126 -303 -14 20 44 8 199 -31 154 -85 149 -251 -223 -218 20 -418 144 -23 -287 13
4495 13 -64 31 193 165 -57 121 159 -174 -51 -57 -125 5 -80 21 10 -187 -118 -113 -60 114 -318 111 125 28 -236
4520 -236 110 -103 -49 -35 -130 54 -100 -2 -51 8 -22 389 92 -89 144 37 -172 -210 -302 -236 116 78 -44 -138
4544 -138 86 -17 109 131 -179 -41 -13 337 -49 114 102 63 -83 232 122 82 281 142 -208 246 130 27
4566 27 12 10 256 238 193 -215 51 112 3 -177 162 45 5 228 54 -108 44 -62 -236 49 242 -43 0
4589 0 144 -204 281 -212 62 155 284 -195 351 50 -33 -66 -327 66 -189 56 -41 23 -368 -32 -27 -116 -27 53
$$ packed form
4426A95O3j17l48L10j5m6O0p8j98J76N3l02K41J37j97n5J19M17l33j26m3K30j28
4449A5k4j61L80j48p9pj71K23J67m21p7M66k96M49k87j13M7JQ9Q1k9L6j63J37
4473A15j77m8K36m29K89L4K4l6J91k30J85k39K34m00K8NK38m38N62j67k64L00
4495A3p7R5J62k8k22J78L8l33J23oo8J30q5J01j1j97O9NN3J74m32M29J4r7k64
4520b36L46k13N4J4r5J84j54R8m9N9l0M11k97j81K33j07k09l8r2O6L52l8j22r4
4544a38K24j03J26K2l10J38K8L50l86J63j2l9j46L15j10m0J99j39l50M54j16j03
4566B7j5kK46j8m5m08K66O1j09j80L39j17m0K23j74j62J52j06j74K85J93k85M3
4589@J44l48M85m93K74R3J29m79N46l01q3l3k61L93k55K45r7O4l91L36Nq9Q9Q0
$$ plain form
4613 53 -360 -91 -12 43 -52 178 177 56 -34 -94 108 -36 67 -177 163 -63 -17 123 145 191 -100 143 123 81
4637 81 206 98 -194 114 214 5 97 -3 -76 -185 -126 -113 209 -48 131 -167 118 84 48 -107 121 -263
4659 -263 -66 -287 62 91 -205 -23 -118 115 121 197 -7 93 -163 -215 -79 94 -61 -189 -102 -252 -233 96 -1
4682 -1 71 197 -362 107 -178 128 -18 -114 -27 -200 -170 127 34 179 -48 -63 177 -117 83 -299 3 -13 -20 -26
4706 -26 -94 -194 228 -226 -80 183 136 144 150 364 167 -248 -218 49 -33 -153 -12 240 97 118 80 -81 43 89
4730 89 -216 12 -173 115 41 48 -292 -121 -53 -60 111 -253 -27 -5 -38 -251 265 100 147 -174 69 103 46 -8
4754 -8 -122 27 145 -114 255 -401 333 59 -114 30 -111 188 96 -59 -36 236 68 127 -224 -75 -73 230
4776 230 -105 48 -1 135 388 322 20 46 196 184 212 215 -131 74 -150 92 44 -96 34 139 -144 107 -169
$$ packed form
4613E3m13K69P9N5r5K30jj21r0o0K02j44J03k44L40k26M6J40K2M6k91K43k0m2
4637H1J25j08k92L08J00k09R2j00p3j09N9J3L22k57J79k98K85l4l6j55K28l84
4659b63J97k21L49K9k96J82r5K33OP6k04J00k56n2J36J73j55j28Q7j50J9L29r7
4682aP2J26n59M69k85L06j46r6Q7j73L0K97r3J45k27j5K40k94K00l82L02j6po
4706b6o8j00M22m54J46K63m7QOK14j97m15L0K67q2j20J41K52j43K1l8j61J24M6
4730H9l05K28j85K88p4Pl40J71O8pJ71l64K26K2l3k13N16j65M7l21K43L4n7n4
4754hj14J49J18k59L69o56P34k74j73J44j41K99r2j55K3K72j68N9l51J49KL03
4776B30l35J53m9J36K53o6l02K6J50j2K8Ll46K05k24K42m8j40J30J05k83K51k76
$$ plain form
4799 -169 -3 43 32 -266 -22 543 -204 -174 -71 24 152 11 508 -160 251 -97 154 118 -230 201 43 -192
4821 -192 -298 -141 47 -114 279 -50 157 -252 76 191 -270 102 -13 -93 0 243 149 326 194 253 -129
4842 -129 70 -267 -109 -255 -177 -19 -128 -268 424 11 48 -73 150 236 206 124 -192 -138 -175 95 96 -265 72
4865 72 -23 -381 164 112 -36 -31 -77 -309 -27 -60 109 161 68 -292 -122 36 41 70 -10 4 -6 162 -322 192 -30
4890 -30 25 14 136 -111 -206 -181 195 -13 -88 44 -2 -53 153 32 -43 348 136 -148 -94 196 -91 -212 -60
4913 -60 25 -104 23 -303 -140 -84 -85 87 161 -24 -51 73 34 -85 210 297 -132 122 47 3 -97 -24 308 273
4937 273 -138 -59 217 -33 21 202 363 41 66 -58 -130 138 42 -77 -291 56 -86 -160 47 144 -18 6 161
4960 161 -59 -68 23 160 38 67 -63 123 -18 44 22 -200 136 46 -53 -9 -129 18 0 -54 -8 285 -203 194
$$ packed form
4799a69J66M6j1k98K44N65p47L0J03R5J28j41M97o68M11l48K51l6l48M31j58k35
4821a92j06J57J88j61L93l29K07m09L28J15m61L72j15q0R3K43r4J77j32N9l82
4842a29J99l37J58j46P8J58j09j40O92m13L7j21K23Q6l0q2l16N4l7K70Jl61L37
4865G2r5l58N45n2j48Nm6k32K82l3J69N2r3l60J70J58NK9q0J4j0J68m84N14k22
4890c0N5j1J22k47r5K5L76k08p5J32m6n1K06j21p5L91k12k84N4K90k87j21J52
4913f0Q5j29J27l26J63N6jJ72P4j85k7J24l9j19K95Q7m29K54p5m4j00P3L32l5
4937B73m11P9K76k50N4J81J61l22K5j24p2K68r6j19k14L47j42p4K07R7j62K4J55
4960A61k20rR1J37j22K9j30J86j41O2k2k22L36r0r9M4j20J47j8n4M6K93m88L97
$$ plain form
4984 194 -3 -60 90 98 -9 91 158 140 156 -26 -186 -209 50 18 207 -86 -113 -105 -42 202 53 64 -14 -51 39
5009 39 202 -71 -134 277 -107 -175 51 79 -81 166 78 -193 63 67 -69 -167 -5 36 -115 42 33 294 -12 26
5033 26 -88 -153 -308 30 67 -64 -135 162 153 244 1 110 -185 -60 -98 -482 27 289 45 249 -50 130 84
5056 84 292 3 164 -101 -72 222 -243 -58 84 -89 4 -264 234 20 -96 -120 31 19 -136 266 -4 41
5078 41 95 10 -40 -50 12 44 15 84 172 66 -110 -360 97 -186 -150 -366 -21 -191 -12 1 -29 51 -58 174 -269
5103 -269 -207 27 -64 363 -20 -34 -123 -141 -90 57 48 -186 -119 16 -78 55 -226 -213 113 82 334 7 67 149 -155
5128 -155 -149 36 -236 -11 -25 -45 -54 -204 -8 73 20 300 -102 -24 -131 -31 11 179 252 -163 -108 18 11 29 1
5153 1 19 -132 46 -341 -324 346 48 -231 156 -62 -56 59 15 -28 70 -123 -20 -73 -89 -2 -17 -32 -9 -376 97
$$ packed form
4984A94j97n7J50Qj07J00O7j8J6j82j60k3K59l2J89k93k7QO3K44j49J1p8l7R0
5009C9J63k73o3M11l84o8K26K8j60K47q8k71K56Mj36r8J62M1j51J57rK61l06L8
5033B6j14o5j55L38L7j31p1K97rR1k43J09k95J25l8l84N09K62k44K04k99J80m6
5056H4K08k89J61k65K9K94m65J85J42j73R3k68M98k14j16k4J51j2j55M02k70M5
5078D1N4q5n0j0O2L2k9O9Q8j06j76k50M57k83L6k16L45j70J79J3l0Q0j09K32m43
5103b69O2K34r1M27l83j4q9j8N1J47rk34O7J35r4J33k81J3L26l1K52l27O0Q2l04
5128a55OJ85k72K25j4k0rj50J96Q1n3K80m02P8j07J00M2J68P3m15N5J26pJ8k8
5153AJ8j51J78l87J7O70k98k79L87k18OJ15m4m3R8j93J03n3j6Q7j5j5K3l67M73
$$ plain form
5178 97 -72 -49 -40 -78 56 -109 78 -95 60 112 -26 -111 -48 380 102 38 7 91 192 7 110 -50 83 97
5202 97 66 -134 -166 -120 306 -170 -259 27 69 -158 -174 342 -246 -80 289 144 109 -55 173 120 64 -53 -27 128
5226 128 6 119 89 -183 96 92 46 -61 224 256 -157 -326 177 323 14 155 -183 99 196 223 -214 126
5248 126 -114 18 7 -15 -63 18 -198 -167 -134 -60 12 -126 82 -291 -303 64 25 -217 -16 -45 -142 -236 -35 25 -262
5273 -262 3 -162 146 -201 -314 196 -170 78 -207 109 136 130 38 -90 -120 7 -51 -193 -33 294 86 261
5295 261 186 -78 99 -59 -49 320 94 12 258 -108 -158 34 -55 -98 -53 74 -385 157 44 175 -4 96
5317 96 103 -135 -39 194 240 -21 -137 418 96 -30 164 -58 -11 176 -59 -75 52 -102 -95 196 -72 36 -99
5340 -99 232 76 -25 18 144 336 -254 -58 -64 -192 173 314 -36 -121 9 -150 413 -231 -349 -152 -136 65
$$ packed form
5178I7j69K3Rl8J34j65J87j73J55N2j38q5O3M28k78o4l1Q4J01j85J03j60J33J4
5202I7l1k00l2M6M26m76q9K86M2k27j6N16n88J66L69j45l5j64K28n3n6j17K6J55
5226A28j22J13l0k72K79mm6j07K85L2m13j69N03J46l09J41l38K82R7K7m37L40
5248A26k40J32j1k2m8Q1k16L1L3P4P2j38K08l73j2L67l9k42K01k9r7r4K01O0k87
5273b62K65j65L08l47j13N10l66K48k85L16K7or2j28l0J27n8j42J60L27k08J75
5295B61p5k64J77j58J0L69k26q2K46l66n0J92q9m3M5J27m59N42j13J31j79J00
5317I6Pk38R6K33M6k61j16N55l22j26J94k22M7J87k35j6J27j54PK91k68J08j35
5340i9L31j56j01M3J26J92n90J96oj28L65J41l50q5J30j59N63o44j18J97J6K01
$$ plain form
5362 65 -101 58 183 -106 -102 49 188 31 -68 -56 -92 -376 -217 111 -192 -222 -147 123 -152 92 -16 -207 247
5385 247 243 169 38 -173 -142 -42 -19 -121 -387 -61 15 86 30 -183 317 -54 -107 358 224 -245 -153 130 52 357
5409 357 -73 207 -88 -50 -56 44 -258 -128 162 -83 33 -2 16 5 86 -92 110 -264 109 -70 87 -192
5431 -192 -77 3 151 -239 65 75 -142 -56 297 -65 -215 89 137 -139 113 102 -123 -307 -333 114 224 58
5453 58 51 -272 36 -138 111 -33 -49 105 104 50 155 85 184 -224 108 172 15 -109 -93 228 -149 72 82 139
5477 139 -74 -148 111 460 -96 -104 101 132 -175 -22 -43 -235 -32 111 -40 246 -216 136 -29 26 116 -248
5499 -248 -101 83 235 280 -106 145 199 4 193 -204 220 -145 -137 101 314 232 18 128 -76 86 211 -19
5521 -19 -39 119 -130 -8 -174 45 -182 85 -57 228 -125 81 130 -97 111 -99 -260 -158 80 202 310
$$ packed form
5362F5j66J59J25k89MJ51J39j57r9J2l6k84J59L28l03l0P5K70k75K44j08j91M54
5385B47mp4j31k11L1J00K3j02k66L26P6P1n6k13N00l71n3M65j34m69R2K83p8L05
5409C57m30K80k95L8oJ00l02J30K90k45J16l5J8j1Q1j78K02l74L73j79J57k79
5431a92J15Q0J48l90L04J0k17Q6L53l62j50L04M8k76K52j1k25j84k6M47J10j66
5453E8pl23L08j74K49j44j6J54jn4J05p0R9m08L32O4j57j24J6L21l77K21J0N7
5477A39k13p4K59L49n56qK05L1l07J53k1j92K03J43j51K86m62L52j65N5R0l64
5499b48J47J84J52M5l86K51N4j95J89l97M24l65QK38K13q2k14J10k04J62J25k30
5521a9k0J58k49J22j66K19k27K67j42K85l53K06M9k27K08k10j61J02K38J22J08
$$ plain form
5542 310 -177 -1 6 86 -309 -134 -33 -267 123 169 60 66 178 -59 -25 -165 -25 -10 97 -27 -116 -28 119
5565 119 0 -79 200 -314 120 -256 -77 -51 -55 125 -204 -94 136 384 -147 143 -80 257 127 -219 -316 260
5587 260 27 102 -351 125 215 239 -150 133 72 -31 -51 -210 -192 -298 -28 148 -47 59 -161 32 -78 -177
5609 -177 28 -38 151 -58 178 -142 254 -125 33 -9 55 204 177 -22 143 -64 -110 -224 -136 177 255 268 -61
5632 -61 -47 -240 -237 -411 47 64 -211 125 109 -13 367 -29 -39 93 -4 43 -164 102 -72 17 -34 -65 -30 365
5656 365 -270 -69 154 305 208 -33 -125 -7 12 157 79 45 70 247 54 -1 48 299 188 -12 228 315 1
5679 1 144 -4 -61 -192 -34 40 -77 96 -66 18 37 -13 -110 -22 -136 -45 208 -54 -98 44 78 -12 119 -74
5703 -74 2 332 56 202 24 187 50 261 30 105 22 31 51 -188 -221 -101 160 69 -28 -361 -3 87 202 138
$$ packed form
5542C10m87J76PQ0l95J75J01k34L90M6j09OJ12k37L4j40J40J5J07j24q9Q8J47
5565A19j19p9K79n14M34l76J79K6mJ80l29J10K30K48n31K90k23L37j30l46r7N76
5587B60k33P5m53M76R0K4l89K83o1j03k0j59J8j06K70J76j95J06k20J93j10r9
5609a77K05o6J89k09K36l20L96l79J58m2O4J49k7j99J65k07m6j14Q8L13P8J3l29
5632f1J4j93Lj74M58J7k75L36j6j22L80l96j0J32r7M7k07K66j74Q9n1l1L5L95
5656C65o35K01K23J51r7k41r2J18J9J45p8l4K5J77j93n5M9K51j11k00K40Q7l14
5679AJ43j48n7j31J58P4j17J73j62Q4J9n0r7Q8j14R1K53k62m4J42L4r0J31j93
5703g4P6L30k76J46j78J63j37K11k31P5q3RK0k39l3J20K61r1r7l33L58R0J15o4
$$ plain form
5727 138 -172 -71 -38 127 -320 63 398 -189 10 -22 152 40 45 -2 -240 -348 14 407 -57 119 -129 -82
5749 -82 -287 240 -20 -122 -300 292 32 -180 -22 -176 14 -129 -92 -70 106 261 -13 149 103 297 -110
5770 -110 60 -24 113 12 -7 140 280 69 22 166 -235 -92 180 -307 -96 123 -134 105 -345 19 50
5791 50 -255 -105 37 -152 -81 -42 -82 -322 58 37 -77 -2 87 -243 -51 211 223 55 -138 -299 -46 -221 137
5814 137 67 156 89 106 -125 51 156 363 130 38 299 127 -40 -59 -143 -99 157 93 169 94 -61 38 -35 178
5838 178 197 -365 58 128 18 -198 79 188 187 -17 -195 26 -62 179 -244 -61 327 -304 42 -61 -23 142
5860 142 -24 -24 -247 112 -72 212 150 110 -181 -34 -37 -64 -92 30 344 -175 55 311 -23 -279 -53 108 82
5883 82 -256 -85 100 26 -161 169 211 95 83 9 17 -219 23 155 -99 -378 -106 -206 -145 -188 -17 7 28 -239
$$ packed form
5727A38l10J01L3J65m47L83L35n87J99l2J74j12Nm7k38j08L62L93m64J76k48M7
5749h2k05N27k60j02j78N92k60k12J58j54J90j43L7K2J76J55k74J62m6J94m07
5770a10J70q4J37j01j9J47J40k11m7J44m01J43K72m87K11K19k57K39m50L64L1
5791E0l05J50J42j89P1L9m0k40L80k1j14P5Q9l30J92K62J2j68j93j61K53j75L58
5814A37p0Q9o7J7k31J76J05K07k33r2K61j72j67j9q4M4K56o4P6p5j55R9p3K13
5838A78J9n62M23P0j10k16K77J09jk04j78K21q8K41m23J83L88o31L46j03L8J65
5860A42j66%k23L59j84K84o2m0k91J47lk7k8J22L14n19K30K56l34k56K26J61k6
5883H2l38J71J85p4j87L30M2j16j2p4Qk36K42J32k54k79K72j00O1m3J71K4K1k67
$$ plain form
5907 -239 -3 205 257 -1 54 138 68 -102 266 49 -13 -35 -18 127 21 -253 -65 -45 72 -321 -489 -35 16
5930 16 -61 244 -272 101 51 -18 -12 -289 107 -172 -207 106 33 -5 -103 111 -75 -405 -112 -74 93 166 -45 -142
5954 -142 59 29 225 48 223 215 -126 72 -23 -44 -119 108 -38 -126 105 -70 264 187 -116 45 -24 9 -6 -56
5978 -56 123 -144 161 364 -168 51 115 6 251 76 188 61 -411 199 -281 -6 93 -138 327 59 -27
5999 -27 -138 -159 -315 153 73 -88 85 -1 67 261 126 32 1 -3 -382 105 249 136 88 221 228 167 15 -130
6023 -130 -69 52 219 -93 -88 -43 -112 -193 136 -311 85 0 -6 112 -76 180 98 41 190 67 51 -83 -289 -95
6047 -95 165 -262 95 90 -124 -235 -249 34 -264 -215 132 -21 -20 -186 -24 142 -171 215 52 164 28 159
6069 159 99 -112 -1 54 113 -85 97 222 114 102 -125 -74 245 -1 -185 -56 36 7 120 -16 -79 36 57
$$ packed form
5907b39K36K08N2k58N5Q4p0j70L68k17o2k2J7J45j06k74J88K0J17l93j68M54N1
5930A6p7L05n16L73n0o9Ok77L96k79l5L13p3l8r8K14j86l30K93L8J67P3k11r7
5954a42K01l0J96j77J75ql41J98r5k1p5K27j46q8K31j75L34p7l03J61o9L3j5n0
5978e6J79k67L05K03n32K19O4j09K45j75J12j27m72O10m80K75R9k31M65k68q6
5999b7j11k1j56M68q0j61J73q6O8J94j35r4l1ml79M87J44j13m8J33Po1j52j45
6023a30O1J21J67l12NM5o9q1L29m47L96q5oJ18j88K56q2n7J49j23j6j34k06J94
6047i5K60m27L57nk14j11j4K83k98M9L47j53Jj66J62J66l13L86j63J12j36J31
6069A59o0k11J11N5N9j98J82J25j08j2k27N1L19k46j84J29R2k9J13j36o3J15K1
$$ plain form
6092 57 -127 81 -243 -374 106 155 -51 -246 246 -21 113 218 -295 53 93 -131 -157 -33 -10 83 -190 -36
6114 -36 57 24 95 6 -81 -319 -80 221 -43 2 196 135 57 435 -38 137 -59 226 -59 97 -143 -214 202
6137 202 -155 -51 21 -163 408 31 -63 87 64 -13 -124 32 -137 -157 -244 -50 -4 -130 -170 232 210 216 -94 46
6161 46 81 45 53 -162 137 -315 -233 -123 -7 40 163 -67 -97 413 -279 -229 -88 -69 32 132 68 -34 111 -382
6185 -382 -10 18 216 197 62 -296 65 -155 52 -186 86 -26 67 60 21 -89 -156 62 10 -111 -217 181 -202
6208 -202 92 -27 295 -12 -4 159 -68 -73 287 64 -288 -11 183 241 -5 -184 -267 -8 50 -42 -45 -340 125
6231 125 12 -100 -138 -272 -239 159 178 70 107 210 279 206 -16 -36 34 -425 120 321 -236 -83 -472 -166 -73
6254 -73 164 -53 52 -65 191 165 79 4 267 87 -237 24 -378 -183 65 36 2 1 235 -115 57 112 -242
$$ packed form
6092E7j84K08l24j31M80M9k06j95M92k67J34J05n13L48M0k24k6J24K3R3k73J54
6114c6R3l3P1q9q7k38K39L01k64M5J94o1p8L78m73J75j96K85k85J56k40p1M16
6137B02l57J04P2j84N71l77r4J50k3p7j11J56j69k0q7J94M6j26m0M02k2Ol10J40
6161D6L5l6Qk15K99m52Q2J10J16M7J23k30l0N10o92N0J41J9J01J00o4j02J45m93
6185c82L72K8J98j9j35l58L61k20K07k38K72j12R3pl9j10o7K18n2j21j06L98l83
6208b02K94j19L22l07QJ63k27nL60k23l52K77J94N8k46j79q3K59N8r2lk95M65
6231A25j13j12l8j34L3L98J9j08L7J03O9p3k22k0P0m59N45K01n57J53l89L06R3
6254g3K37k17J05j17K56k6q6p5K63j80l24K61m02J95K48k9l4jK34l50J72N5l54
$$ plain form
6277 -242 201 131 -3 -162 92 -160 149 -77 -108 -123 66 -99 -175 9 184 -113 -83 -106 163 -142 19 26 203
6300 203 -251 253 172 -70 25 19 138 23 -13 -21 81 -291 -246 62 -10 -54 281 -165 171 306 174 43 38 -21
6324 -21 -127 335 290 -134 82 -114 -203 -196 -7 -192 160 247 -118 -53 -78 -17 -352 -61 -162 -122 -120 71 159 -8
6348 -8 176 128 77 69 203 72 -128 164 -138 394 334 304 114 -36 -123 93 -118 47 89 -128 43 -24 -88 171
6372 171 95 119 189 -65 302 -53 121 -26 320 23 -135 -77 -137 -9 -131 -184 -18 -149 -52 21 4 177 -96
6395 -96 -20 68 -59 -1 -30 103 -214 -95 116 80 -192 89 -77 -35 235 139 157 -137 77 217 89 198 205 288
6419 288 129 14 35 -20 24 -96 298 187 23 1 -35 -88 190 113 282 -43 47 -112 -55 240 131 151 68 -88
6443 -88 49 94 -235 97 65 -115 -298 1 -97 -371 82 161 134 250 107 5 59 -324 -22 333 -113 -330
$$ packed form
6277b42M43p0j34j59K54k52L09k26l1j5J89j65p6J84J75k97L0k3K69l05J61PJ77
6300B03m54N04q1k42R5oJ19j15l6qJ02l72M5L08p2m4L35m46L36J35j32j31nn9
6324b1j06M62m5m24K16j96q9PJ89j85L52Q7l65O5k5O1l35K91j01M0KJ91Q8j67
6348hJ84m8n1qJ34j31k00K92l02N32o0l0j90j50q7K16k11J65M2k17J71o7o4K59
6372A71p6K4P0k54L67l55J74j47L46k97j58N8o0J28j22n3J66j31R7P3j7J73k73
6395i6P6Q8j27N8k9J33l17J19K11l6k72K81j66M2K70r6J8k94K14J40j28J09PQ3
6419B88j59j15K1n5M4j20L94j11j64k2l6n3K78p7J69l25R0j59N7K95j09K0q3j56
6443h8J37M5l29L32l2j80j83K99r8k74M53P9k7J16j43j02N4l83L02L55m46k17
$$ plain form
6465 -330 -33 -5 120 -50 -17 150 20 -129 -53 -14 -224 -76 58 -24 -145 192 -38 -61 -98 54 0 136 -147
6488 -147 197 -3 139 -108 -48 103 -82 -131 -46 186 106 -141 -138 -5 -2 19 167 132 -302 89 5 340 -120 -19
6512 -19 -269 254 -109 -20 -141 -116 53 -62 77 142 -142 -403 -57 -344 87 130 186 144 -45 -61 207 391 204
6535 204 19 249 176 -40 -219 -56 2 -134 132 -145 -193 79 35 -19 84 83 -22 177 -307 15 39 -208 -339
6558 -339 151 -172 -87 -27 -55 159 -49 68 -93 39 -6 31 101 61 273 58 -110 92 191 -172 -39 59 70
6581 70 -7 -175 -363 73 -248 -90 139 7 -7 -165 -129 -3 10 163 291 -139 -114 10 -6 219 -21 334
6603 334 26 154 45 -188 142 250 -25 -83 -74 -120 -169 31 -56 86 -67 136 -92 -3 -111 105 198 153 -197
6626 -197 -41 -83 -210 -42 -96 -138 3 340 -305 122 -87 84 -232 95 -24 -122 125 -55 56 85 -134 -2
$$ packed form
6465c30K97K8J25j70L3J67j30j49P6L9k10J48J34q2j21L37k30k3l7J52n4J36k83
6488a47L44k00J42k47O0J51j85m9Q5K32q0k47LJ33LK1J48l5m34L91q4L35m60J01
6512a9k50N23l63Q9j21K5J69j15J39O5k84k61L46k87M31M3N6m2j89j6K68J84j87
6535B04j85K30p3k16j79J63N8j36K66k77m8K72m4n4J03jj05J99m84L22K4k47j31
6558c39M90l23Q5O0k8K14k08J17j61J32m5L7P0m0K12k15j68K02R9l63J33R8J1
6581G0p7j68j88M36l21J58K29j32j4j58L6J26J3J53J28m30K5J24j6K25k40L55
6603C34l08J28j09k33L30J08k75n8Rm6m9K00q7J42j53K03k28Q9j08K16R3m5l50
6626a97J56m2j27J68n4m2J41L37o45M27k09J71l16L27j19r8K47j80J11K9k19J32
$$ plain form
6648 -2 211 -75 42 -346 -45 203 8 -120 -174 20 -164 4 148 -47 222 -176 -292 -281 213 95 334
6669 334 7 -58 51 -238 88 -113 19 -22 -148 46 180 106 -9 -45 58 83 64 185 102 -157 36 243
6691 243 30 39 68 -76 -257 -36 4 -177 140 -41 -5 45 -61 175 -9 -137 42 -167 117 218 110 -196
6713 -196 40 43 93 -96 38 -50 21 59 10 -129 -12 147 163 75 -240 -94 -153 168 54 -91 -63 78 184 36
6737 36 -63 10 26 -137 32 83 129 82 -242 -186 231 -347 -38 30 306 -195 -96 -12 195 159 204 36 -9 148 -106
6762 -106 -157 -274 51 -125 131 53 -130 -164 8 -283 -49 173 -41 -45 -54 56 45 -220 -98 -36 -176 -49 86
6785 86 -257 -14 193 -166 -108 -50 -208 -299 21 -28 211 -169 -46 -142 -55 216 223 346 255 -246 -29 -148 51
6808 51 -44 167 -260 31 44 -35 76 207 184 -103 -216 -55 99 -58 98 210 41 82 304 188 164 -105
$$ packed form
6648bK13k86J17l88L01K48j95j28n4J94j84J68J44j95K69l98j16J1M94j18K39
6669C34l27o5J09k89L26k01J32m1j26J94J34p4j15l6J03K5j9J21q3k59J93K07
6691B43k13RK9j44j81K21M0j81L17j81L6N0j06K36j84j28J79k09K84J01j08l06
6713a96K36LN0j89J34q8P1L8m9j39J17J59J6q8l15J46n9L21j14j45K8J41J06j48
6737C6r9P3J6j63J69N1M6m7l24N6M17n78L09O8K76n01R9Q4K07l6M5j68m5J57k54
6762a06n1j17L25j76K56p8j83l4J72k91K34K22k14mrJ10j1k65J22O2j40J27J35
6785H6l43K43K07l59N8N8j58r1L20m9K39l80J23r6Q7K71PJ23r1n01K17j19J99
6808E1r5K11m27K91J3p9J11J31k3k87j13J61J54j57J56J12j69M1K22j16k4k69
$$ plain form
6830 -105 120 56 -209 157 184 23 281 -193 -372 198 -88 -260 -3 25 -129 7 -122 133 175 28 -36 53
6852 53 59 -12 99 139 64 -122 -118 182 -51 -191 -39 39 82 -143 -167 -2 -59 -44 166 -240 66 50 -18 200 123
6877 123 -266 170 135 61 32 -93 69 221 169 -185 135 238 170 98 52 -204 -396 17 435 115 12 9 -339
6900 -339 -287 109 214 302 145 -122 218 198 26 103 -25 -184 6 -38 -72 102 -28 -235 -269 -96 87 74 -80
6923 -80 -28 -73 298 -225 67 -214 -253 -41 -35 133 -294 -124 239 12 -21 184 -328 362 181 -248 -293 -315 15
6946 15 -55 -34 106 -236 115 -68 -37 74 -26 52 -22 208 53 -88 178 201 -65 118 61 20 -248 -99 212
6969 212 312 -35 100 -113 -294 -160 157 -256 121 5 149 -64 -163 -14 38 -32 54 -55 30 -259 -42 -219
6991 -219 -11 12 -245 78 1 -45 121 -85 -150 115 -30 99 259 49 -357 -63 -181 5 -107 -184 203 14
$$ packed form
6830a05K25o4k65L66K7j61K58m74j79N70k86j72K57K8j54J36j29K55M2j47o4Q9
6852E3Op1J11M0p5j86ML00k33j40J52P8M3k25k4J65n7J5K10m06L06j6o8K18p7
6877A23l89M36l5p4k9j25J62J52n2l54L20J03o8p2m6k56j92M13M18l20j03ll48
6900c39N2L96J05Q8j57k67L40k0j72P7j28j59J90m4l4J74j30k07l4J73J83j3j54
6923h0N2m5L71n23K92k81l9K12OJ68m27J70L63k27l3K05n12O90j81m29m5k2L30
6946A5p0K1J40l42L51j83L1J11j00P8p4K30j55j41K66K3k66J83n7m1k68J49L11
6969B12J00l47J35k13j81J34L17m13L77j16J44k13r9J49N2p0Q6j09Q5k89K17j77
6991b19K08K3k57L23p7m6J66k06o5K65j45J29J60k10m06K94j18J86j12p7L87j89
$$ plain form
7013 14 121 -62 -94 122 30 373 -19 321 -10 60 189 205 125 -54 167 -208 -86 140 109 -166 175 225 -56
7036 -56 64 171 183 183 -142 183 -130 -213 -117 -229 -59 202 158 -98 -11 22 -23 -141 118 31 253 -46 -136 -54
7060 -54 62 40 119 -14 33 -24 -149 163 -86 -294 195 -37 226 -149 175 -247 -95 -143 63 -117 64 84
7082 84 -171 200 -52 133 -218 160 114 324 -141 -79 66 -158 -39 208 -24 105 -251 39 -99 111 -308
7103 -308 9 -228 -220 -124 -111 -21 -203 52 -332 -38 -81 49 -113 -13 12 63 264 -121 104 -131 145 -240 127
7126 127 114 163 -116 -2 277 54 -97 -225 170 -80 333 -233 26 181 -147 4 101 -132 -120 -251 -231 112
7148 112 10 20 -25 47 -71 161 127 -222 106 -255 -315 311 18 -16 -161 46 -100 290 45 70 18 -217 87
7171 87 55 -245 -60 -196 35 -95 144 33 138 -289 116 -314 -218 -90 -199 202 -128 -363 -254 -147 -139 -147
$$ packed form
7013A4J07j83l2K16r2L43l92L40l31P0J29J6q0j79K21l75J22K26l1k75L41N0k81
7036e6J20J07J2%l25L25l13q3R6j12J70K61m4k56Q7L3m5j18K59q7K22k99r0Q2
7060e4J16k2P9j33M7n7j25L12k49k08M89k32K63l75L24m22J52m8K06j80J81K0
7082H4k55L71k52J85l51L78m6K10m65O2J45k24J19K47k32J29l56K90j38K10m19
7103c08L17k37QR6J3R0j82K55l84K94m3J30j62J00K5N1K01l85K25k35K76l85L67
7126A27j3M9k79J14K79k23j51j28L95k50M13n66K59J55l28J51R7k33J2j31K0L43
7148A12j02J0m5P2j18K32l4l49L28l61o0O26k93l4j45K07j46L90k45K5n2k35L04
7171H7l2l00J85j36K31j30K39j11J05m27M05m30R6J28j09M01l30k35J09J07Qq
$$ plain form
7193 -147 28 56 -326 -68 -28 -91 14 64 13 117 318 113 245 50 -130 224 101 -9 -65 113 180 67
7215 67 82 -265 -129 -19 213 -103 203 -104 -2 -29 151 -180 158 -67 98 87 476 -102 197 -87 4 -130
7237 -130 219 -248 198 -98 193 -251 -193 -85 273 75 -108 -137 -151 -180 143 -58 77 186 13 -227 -117
7258 -117 31 -12 -316 -137 22 -120 65 -142 264 6 -147 10 -31 -112 -202 269 -34 -1 -75 -267 282 -98
7280 -98 -143 -208 74 -68 37 -297 -91 -90 441 222 -27 -43 0 181 -6 185 154 -254 17 315 70 -112 -69
7303 -69 371 -15 -147 -124 4 -46 236 -64 49 13 -200 254 276 15 -280 -197 -18 -49 -137 -177 -57 17 138
7326 138 -78 252 -175 52 17 69 58 43 271 -184 139 131 -22 -119 -158 -134 101 81 -13 -166 -41 -146 110 -587
7350 -587 219 159 -43 -48 -5 -178 153 -104 101 -14 -135 -157 75 68 -137 341 72 26 -124 -374 121 -80 -162
$$ packed form
7193a47J75K8l82K58M0o3J05N0n1J04K01k05J32j95j80L54j23j10n6J78O7j13
7215F7J5l47J36J10K32l16L06l07J02k7J80l31L38k25J65j1L89n78K99k84R1j34
7237a30L49m67M46k96K91m44N8J08L58j98j83k9j4k9L23k01J35J09j73k40J10
7258a17J48m3l04J79J59j42J85k07M06k58j53J57m1q1r0M71l03L3p4j92N49l80
7280i8m5o5K82j42J05l34K06JN31k19k49j6M3J81j87J91l1m08K71K98k45j82M3
7303f9M40l86j32K3J28n0K82l00J13l6k13M54K2k61k95Q3J79l1q8m0J20P4J21
7326A38k16L30m27K27l5N2j1j5K28m55L23qj53r7l9K4K35k0r4j53J25j05K56o97
7350e87Q06o0k02nM3j73L31k57K05j15j21k2K32pk05M78k69m6j50k50M95k01q2
$$ plain form
7373 -162 36 73 55 -228 -43 9 131 -46 55 -193 -21 -100 -235 -368 226 75 -193 -60 -19 83 27 132
7395 132 60 -105 95 31 394 -8 -24 -4 3 86 55 -189 94 34 -241 326 -137 -6 -298 -46 78 -46 79
7418 79 75 -47 -105 39 -80 -34 -18 141 23 -116 127 35 40 -129 210 129 -108 144 -97 244 18 229 -213
7441 -213 261 -159 17 -88 131 -108 -151 131 -271 -311 -103 53 32 -58 397 -21 76 177 168 72 167 -206 203
7464 203 225 -459 96 257 -52 -78 -19 -22 9 -177 5 171 -124 -83 70 -6 91 104 112 27 49 -159 106 -163 39
7489 39 -278 75 316 -235 189 -214 38 -168 -210 -61 -11 -137 71 227 52 -109 -19 -143 -169 84 -38 -38
7511 -38 -172 196 -7 -3 -76 51 223 64 -50 -55 -1 13 -52 94 288 -72 -155 44 147 -19 244 -40 252
7534 252 -51 151 -8 149 552 -14 145 -102 6 -133 97 -51 19 -72 57 114 -62 26 -174 -37 219
$$ packed form
7373a62J98L7j8k83J85N2J22j77J01k48J72p9j35j33N94j51k68J33M1J02n6J05
7395A32p2j65K00o4L63m02j6K0PQ3l1k44K83o0k75N67m63J31k92K52J24j24J25
7418G9mj22n8J44j19M6J6J59j18j39K43r2Nj69L39q1k37K52k41L41k26K11m42
7441b13M74m20J76j05K19k39m3K82m02m0K08J56k1r0M55m18R7J01rr6R5l73M09
7464B03K2o84N55J61l09k6N9lL1j86J82J66k95M1J53p6R7J3Qq5K2k08K65k69K02
7489C9l17L53K41n51M24m03K52k06m2J49N0j26K08J56j75j61R0j24k6K53j22%
7511c8j34L68k03Mp3J27J72j59j14nN4J4o5J46J94l60q3J99J03j66K63k84K92
7534B52l03K02j59J57M03n66J59k47J08j39K30j48P0r1J29N7j76Q8k00J37K56
$$ plain form
7555 219 23 -174 -88 191 -212 94 263 2 -61 -171 112 73 94 111 79 -36 191 -14 -141 -234 290 -130
7577 -130 -51 15 -87 -136 31 -83 -14 -314 58 43 -81 32 95 216 -324 14 -65 168 -6 168 110 -164 -61
7600 -61 252 168 -364 166 -112 245 -189 -53 188 -182 13 183 -28 22 -136 181 -31 -201 -102 127 252
7621 252 105 285 5 -235 113 -303 204 -355 -129 25 262 -159 17 119 85 -31 -162 -270 -140 -119 -74
7642 -74 10 -119 -211 273 -115 -17 321 76 -83 320 -49 -181 31 -156 -105 -368 -141 116 -196 -97 55 265
7664 265 -164 46 -69 -116 -136 -76 -45 36 48 72 129 -173 -55 222 219 -19 104 45 -109 -199 -103 -111 151 112 -178
7689 -178 114 1 194 -367 51 -14 199 144 -61 123 6 -86 14 -51 105 290 57 163 199 86 33 -95
7711 -95 -101 108 -67 40 6 -61 -28 164 -303 111 -168 -26 -6 31 -158 -53 -111 -95 -42 87 116 138 -173 -244 97
$$ packed form
7555B19j96j97Q6K79m03L06J69k61o3j10K83l9K1J7l2j15K27k05j27r3N24m20
7577a30P9O6j02m9J67j14O9l00L72j5j24J13O3J21n40L38p9K33j74J74n8k74J03
7600f1L13q4n32N30k78L57m34J36K41l70J95J70k11N0j58L17k12j70R9K29J25
7621B52j47J80k80k40L48m16N07n59K26J54K37m21J76J02l4j16j31j08J30K1M5
7642g4Q4j29r2M84l88R8L38k45j59M03l69j32K12j87N1k63K27K57l12R9J52K10
7664B65m29K10j15m7k0O0L1Q1J2K4N7l02J18K77lk38J23n9j54r0R6qK62l9k90
7689a78K92j13J93n61M18o5K13n5k05J84j17r2J00o5J56J85k33J06L6j13n3j28
7711i5oK09j75J07l4o7L3J92m67M14k79J42K0L7j89J05n8J6N3J29K9K2l11p1L41
$$ plain form
7736 97 -85 -135 -65 77 -192 401 -130 65 175 134 45 -26 -298 -77 -191 -211 -33 77 148 84 -38 -23 172
7759 172 258 93 -166 95 112 89 -140 107 167 49 -76 154 -148 29 87 -118 -172 -85 46 102 -261 -113 126
7782 126 215 -97 131 -108 -1 193 9 255 231 -241 3 -187 167 -66 -208 214 -43 5 3 100 -253 78
7804 78 1 69 -355 17 -97 166 -135 -58 -146 -110 151 -286 53 -169 125 202 -211 -151 -6 384 -35 -178 -10
7827 -10 -33 227 62 -16 -186 -235 2 -161 151 -34 67 191 97 -28 326 -41 -218 81 -2 -40 -79 5 -92
7850 -92 -45 -108 -162 -215 212 -66 73 74 73 -198 276 217 14 107 -91 -96 68 -128 -163 -46 9 -145 -100 -86 110 -2
7876 -2 162 -8 71 -45 147 -20 -113 -93 99 -264 -27 -107 -15 -74 -250 222 -67 -184 -211 -204 179 28 -209 -131
7900 -131 60 86 -195 70 -19 -71 -4 257 27 -68 339 -199 38 236 156 81 67 216 361 -168 164 -49 -20
$$ packed form
7736I7j82n0P0J42k69N93n31J95J10m1q9p1k72K21j14k0J78J10P1o4j22J5J95
7759A72Q6j65k59K61J7k3k29K47O0j18j25K30l02J77N8k05n4Q7J31N6l63J48K39
7782A26Q9l12K28k39J07J94j84K46k4m72K44j90L54k33j42M22k57M8kR7l53L31
7804G8p7O8m24L72j14K63l01P7q8L6K61m37L39k22K94P7m13O0J45L90m19j43J68
7827a0k3K60j65p8j70m9K37j63L12j85J01J24r4j25L54l67j77K99q3l8l9Q4r7
7850i2M7o3n4n3M27k78J39Jjk71M74n9k03R3j98nJ64j96l5J17N5j54M5J4J96j12
7876bJ64j70P9j16J92j67r3K0J92l63K37q0R2n9j76M72k89j17k7PL83j51k37P8
7900a31J91K6k81K65q9n2O7K61k30r5M07n38K37J98q0p5j4J49J45n29L32k13K9
$$ plain form
7923 -20 148 -90 -51 211 125 159 79 -15 -125 -162 251 -78 -8 174 157 89 -133 -189 30 178 -94 -10 345 141
7947 141 4 0 280 -150 -193 -107 -274 -25 -87 -45 95 237 5 -73 -147 45 -66 38 118 124 37 53 163 -92
7971 -92 3 14 -155 34 -11 -18 354 344 80 -414 268 261 -177 -201 -175 82 181 -131 -182 -41 110 -70 87 69 -94
7996 -94 40 -157 -235 -15 35 -42 -245 73 532 125 102 132 -2 200 -48 146 191 37 -105 -33 -49 -20 18 -53
8020 -53 180 -229 175 97 227 -242 -221 184 166 -2 81 72 145 -142 -142 -337 46 151 31 144 194 47 77 -24
8044 -24 100 -378 -345 -214 -105 -116 -25 235 193 331 33 -4 381 146 112 82 360 74 204 -72 -105 157 27
8067 27 -192 -25 309 -77 101 -210 -244 -284 156 189 89 -149 -204 117 86 123 -90 -171 95 -143 268 63 -176
8090 -176 63 179 -62 -28 179 302 -80 -254 -117 21 464 -222 -138 -37 -92 -1 -37 -96 57 -59 339 -339
$$ packed form
7923b0J68k38L9K62q6L4q0r4j10l7M13l29P0J82j7o8k22n6K19J48k72Q4L55k04
7947A41j37mK80m30m3Q6j67K49o2M2J40J42k32p8p4J92j11J04Q0Oq7J6J10k55
7971i2R5J1j69J89m5pL72j0k64m94O82pm38k4K6K57R9l12n1J41J51j80J57j8j63
7996i4J34j97p8K20N0p7k03L18M59m07k3L0j34K02k48J94M5j54j42P2j6K9L8p1
8020e3K33m09M04p8J30m69K1M05j8j68Q3rP3k87%j95L83J05j20J13N0j47L0j01
8044b4J24m78L3J31J09j1R1K60m2J38k98l7L85k35l4l0K78k86J30k76l3K62j30
8067B7k19J67L34l86J78l11l4m0M40L3j00k38n5L21l1L7k13q1K66k38M11k05k39
8090a76K39J16k41L4K07J23l82j74J37J38M43o86Q4J01n5R1l6n9J53j16L98o78
$$ plain form
8112 -339 4 -196 -163 127 211 3 -78 -29 17 -61 -129 -45 -103 -211 180 2 87 139 79 -54 176 -46 -63 30 -31
8137 -31 -190 -6 245 294 63 93 87 -97 0 -102 124 -6 -155 66 82 -138 94 24 -44 7 -20 -104 104 -82
8161 -82 -21 -167 103 -147 5 -109 -123 49 12 -27 -99 33 99 384 280 336 -124 24 20 -22 -344 -144 -164 -139
8185 -139 -236 29 -37 -196 -363 67
$$ packed form
8112c39L43k00L3K90Q4k08q1M9M6p8o8Q4n8j08L91j78Q5N2o0j33K30k22j7R3o1
8137c1j59J84K51M9k31L0oj84R7j02K26j30j49K21J6k20K32p0o8N1k7q4K08j86
8161h2O1j46K70k50J52j14j4J72l7l9p2J32O6K85j04N6m60J48mm2l22K00k0K5
8185a39r7K65o6j59j67M30
8191F7
$$ Imaginary data points
##PAGE= N=2
##DATA TABLE= (X++(I..I)), XYDATA
$$ plain form
0 0 0 0 0 -8 8 0 8 -8 16 -16 24 -32 40 -44 56 -64 80 -96 112 -133 152 -178 208 -237 276 -314 356 -408
28 -408 460 -520 585 -658 739 -822 920 -1026 1138 -1266 1401 -1555 1723 -1906 2111 -2339
44 -2339 2590 -2875 3194 -3562 3981 -4471 5052 -5748 6608 -7697 9130 -11108 14022 -18771
58 -18771 27850 -51487 242109 524082 -7732 -236277 -139012 -26783 -185454 -187366 69631
69 69631 285888 170493 18117 27495 45402 -148936 -319659 -217394 82516 275176 276578
80 276578 138377 -49724 -199890 -192354 -87165 -28960 -18194 90350 235242 198309 -19320
91 -19320 -150461 -118425 -115322 -175579 -62761 229987 340309 102824 -144914 -120568 -26241
102 -26241 -113765 -199225 -23951 230681 232992 52939 -23380 -12139 -116617 -248867 -146935
$$ packed form
0@%%%qJ6qQj6K4l2M0n6P2q4J00j20J44j76K08k45K85l30L86m45N13n90O70p64
28d08Q68r80J105j243J397j561J742j946K164k404K667k956L278l629M017m450
44b339M929n465O069o756P543q452R523j0800J2356j4305J6827k0238K5130l2793
58a8771M6621p9337K93596K81973n31814k28545R7265J12229j58671j912K56997
69F9631K16257j15395j52376R378J7907j94338j70723J02265K99910J92660J402
80B76578j38201j88101j50166P536J05189N8205J0766J08544J44892l6933k17629
91a9320j31141L2036L103o0257J12818K92748J10322k37485k47738K4346R4327
102b6241q7524q5460J75274K54632K311j80053p6319J1241j04478j32250J01932
$$ plain form
113 -146935 122966 227124 104953 10482 39526 12197 -131689 -201201 -97105 41653 104796
124 104796 144240 166644 71920 -117433 -216067 -142291 -17627 56842 106524 131280 75405
135 75405 -18789 -43570 -31447 -96800 -173941 -77586 150943 242632 111601 -36473 -68291
146 -68291 -92664 -160247 -118489 76661 195522 94333 -37296 -2812 68812 -24699 -181773
157 -181773 -163664 15080 137312 129412 91288 53415 -43068 -154805 -152238 -32719 69191
168 69191 84904 69592 61721 32822 -20459 -64675 -91764 -102097 -49630 77666 169980 120694
180 120694 -9380 -79592 -74060 -74595 -78105 -11777 92179 116008 49716 1455 2005 -34333 -116408
193 -116408 -124352 -7591 112642 120010 54958 7860 -22042 -67911 -94882 -59262 8828 49635
$$ packed form
113a46935K69901J04158j22171r4471K9044k7329j43886o9512J04096J38758O3143
124A04796L9444K2404r4724j89353r8634P3776J24664P4469M9682K4756n5875
135G5405r4194k4781J2123o5353p7141R6355K28529R1689j31031j48074l1818
146f8291k4373o7583M1758J95150J18861j01189j31629L4484P1624r3511j57074
157a81773J8109J78744J22232p900l8124l7873r6483j11737K567J19519J01910
168F9191J5713j5312p871k8899n3281m4216k7089j0333N2467J27296R2314m9286
180A20694j30074p0212N532n35l510O6328J03956K3829o6292m8261N50l6338q2075
193a16408p944J16761J20233P368o5052m7098k9902m5869k6971L5620O8090M0807
$$ plain form
205 49635 64471 76589 62320 -6796 -89143 -113880 -66689 8353 68440 93570 70431 12331
217 12331 -38430 -56275 -54428 -49441 -27075 24595 76411 87258 51214 -10825 -72406 -102875
229 -102875 -72322 7076 74694 83235 46303 7658 -16952 -38425 -57144 -54624 -24198 22873
241 22873 64025 78194 52920 -5859 -67320 -92933 -63795 3263 62180 72537 40863 7716
253 7716 -7293 -24982 -54553 -64040 -25764 31720 61387 60178 43700 5756 -54795 -90871 -57531
266 -57531 12960 51006 44367 35023 32747 5993 -40628 -61679 -43170 -15986 10166 48581 75999
279 75999 48129 -19360 -60722 -51461 -31133 -17183 15392 57417 59042 16535 -14375 -17715 -34310
292 -34310 -62186 -41681 30815 74507 48643 8945 -1029 -17158 -56674 -61504 -5512 43276
$$ packed form
205D9635J4836J2118j4269o9116q2347k4737M7191P5042O0087K5130k3139n8100
217A2331n0761j7845J847M987K2366N1670N1816J0847l6044o2039o1581l0469
229a02875L0553P9398O7618Q541l6932l8645k4610k1473j8719K520L0426M7071
241B2873M1152J4169k5274n8779o1461k5613K9138O7058N8917J0357l1674l3147
253G716j5009j7689k9571r487L8276N7484K9667j209j6478l7944o0551l6076L3340
266e7531P0491L8046o639r344k276k6754m6621k1051J8509K7184K6152L8415K7418
279G5999k7870o7489m1362R261K0328J3950L2575M2025J625m2507l0910l340j6595
292c4310k7876K0505P2496M3692k5864l9698r974j6129l9516m830N5992M8788
$$ plain form
304 43276 35213 17048 33789 32408 -27649 -78405 -50523 8403 24577 19921 43273 54486 2304
317 2304 -60452 -52840 -6859 -869 -14528 18215 66697 49390 -15976 -42988 -25319 -26924 -38586
330 -38586 73 63012 62269 3807 -22973 -5876 -15151 -52041 -38045 27371 53205 20463 5884
343 5884 25491 5167 -59682 -70625 -1458 47027 23215 3970 32857 34688 -28737 -68233
355 -68233 -26359 19602 4221 -8801 35761 64398 9898 -54511 -42040 -1076 -9188 -23115
367 -23115 21115 66831 33379 -28795 -29223 638 -17332 -47083 -8337 55452 48884 -4297 -11577
380 -11577 12228 -12116 -58446 -36243 32955 46398 4593 -341 30961 11024 -52656 -57267
392 -57267 6050 34406 3296 -619 40325 36498 -29951 -59130 -12840 18477 -7628 -14215 36200
$$ packed form
304D3276q063j8165J6741j381o0057n0756K7882N8926J6174m656K3352J1213n2182
317B304o2756P612M5981N990j3659L2743M8482j7307o5366k7012J7669j605j1662
330c8586L8659O2939p43n8462k6780J7097r275l6890J3996O5416K5834l2742j4579
343E884J9607k0324o4849j0943O9167M8485k3812j9245K8887J831o3425l9496
355f8233M1874M5961j5381j3022M4562K8637n4500o4409J2471M0964q112j3927
367b3115M4230M5716l3452o2174m28K9861j7970k9751L8746O3789o568n3181p280
380a1577K3805k4344m6330K2203O9198J3443m1805m934L1302j9937o3680m611
392e7267O3317K8356l1110l915M0944l827o6449k9179M6290L1317k6105o587N0415
$$ plain form
405 36200 57114 1392 -46009 -22330 5990 -17427 -29268 21012 59898 22384 -26939 -15185
417 -15185 8074 -18996 -45100 -3823 48167 31999 -9704 -1344 20338 -11763 -54234 -27549
429 -27549 31105 31190 -3850 4281 34416 8197 -47880 -42731 11591 23151 -7727 -576 40387
442 40387 30969 -28042 -44127 -3099 12190 -15939 -12407 35540 45886 -4071 -33968 -8837
454 -8837 4930 -22641 -26078 22002 47645 11086 -21367 -3179 10217 -21445 -38898 183
466 183 37770 18675 -8307 6594 20622 -13238 -45386 -18561 24099 18853 -4256 8779 28659
479 28659 2050 -36951 -26509 9593 9618 -10243 4646 34490 20122 -21874 -26805 -339 1025
492 1025 -18238 -5383 32099 31969 -6602 -21452 -1637 627 -22160 -18557 18646 32832 5484
$$ packed form
405C6200K0914n5722m7401K3679K8320k3417j1841N0280L8886l7514m9323J1754
417a5185K3259k7070k6104M1277N1990j6168m1703Q360K1682l2101m2471K6685
429b7549N8654Q5l5040Q131L0135k6219n6077N149N4322J1560l0878P151M0963
442D0387r418n9011j6085M1028J5289k8129L532M7947J0346m9957k9897K5131
454h837J3767k7571l437M8080K5643l6559l2453J8188J3396l1662j7453L9081
466A83L7587j9095k6982J4901J4028l3860l2148K6825M2660n246k3109J3035J9880
479B8659k6609l9001J0442L6102K5j9861J4889K9844j4368m1996m931K6466J364
492A025j9263J2855L7482j30l8571j4850J9815K264k2787L603L7203J4186k7348
$$ plain form
505 5484 -11371 3272 6557 -19646 -29421 148 24568 12682 -1102 9487 12736 -13664 -31097
518 -31097 -10882 13523 8928 -865 11557 19621 -1246 -23238 -14504 3153 -1421 -7607 9509
531 9509 27128 12111 -14809 -16249 -2249 -4272 -13003 67 22331 19064 -3217 -9500 -592
544 -592 -3465 -17029 -12038 10837 20265 8060 -901 1530 -2327 -14831 -15005 171 10649 6994
558 6994 4884 9411 5263 -9811 -17277 -8792 1240 3855 6330 12977 10428 -3509 -13449 -8978
572 -8978 -1590 -2610 -2422 6324 14541 9628 -1598 -8316 -9314 -9126 -5440 4044 12365 11717 3504 -4040
588 -4040 -6705 -6199 -5387 -3507 245 5398 10188 9386 2111 -6633 -11392 -10071 -3963 5442 12112 9355
604 9355 1100 -3686 -2347 -3472 -8048 -7098 1996 8628 7379 5369 5099 -1828 -13526 -14509 -453
$$ packed form
505E484j6855J4643L285k6203r775K9569K4420j1886j3784J0589L249k6400j7433
518c1097K0215K4405m595r793J2422Q064k0867k1992Q734J7657m574o186J7116
531I509J7619j5017k6920j440J4000k023q731J3070K2264l267k2281o283Q908
544e92k873j3564M991K2875R428j2205q961K431l857j2504j74J5176J0478l655
558F994k110M527m148j5074p466Q485J0032K615K475O647k549j3937r940M471
572h978P388j020J88Q746Q217m913j1226o718r98J88L686R484Q321o48q213p544
588d040k665N06Q12J880L752N153M790q02p275q744m759J321O108R405O670k757
604I355q255m786J339j125m576R50R094O632j249k010k70o927j1698r83J4056
$$ plain form
619 -453 11591 8062 -59 1448 5221 -1039 -9643 -7692 -974 -540 1396 9992 13604 1835 -12379
634 -12379 -11472 -1864 84 -579 5806 10695 1578 -6577 -542 5456 -5795 -17626 -4995 17170
648 17170 16409 -2296 -7249 1979 -941 -14129 -8842 12615 14713 -4742 -9432 8086 13726 -6813
662 -6813 -20122 -6192 9304 5682 1513 8274 7667 -9461 -16801 -1322 10191 698 -7393 3959
676 3959 13030 1997 -8438 -1691 2461 -10559 -13241 9630 24892 4988 -17918 -8469 10049
689 10049 1749 -14535 -4308 14632 8113 -9066 -1526 14760 2543 -22884 -15546 13934 18155
702 18155 -2856 -8191 7338 6522 -11868 -11750 8276 9300 -9874 -9487 14991 19570 -6917 -21105
716 -21105 -4323 8961 -815 -4877 10111 13060 -7258 -15711 3816 13766 -5472 -18216 662
$$ packed form
619d53J2044l529q121J507L773o260q604J951O718M34J936Q596L612j1769j4214
634a2379R07R608J948o63O385M889r117q155O035N998j1251j1831J2631K2165
648A7170p61j8705m953R228k920j3188N287K1457K098j9455m690J7518N640k0539
662f813j3309J3930J5496l622m169O761o07j7128p340J5479J1513r493q091J1352
676C959R071j1033j0435O747M152j3020k682K2871J5262j9904k2906R449J8518
689A0049q300j6284J0227J8940o519j7179P540J6286j2217k5427P338K9480M221
702A8155k1011n335J5529q16j8390J18K0026J024j9174L87K4478M579k6487j4188
716b1105J6782J3284r776m062J4988K949k0318q453J9527R950j9238j2744J8878
$$ plain form
729 662 18087 6344 -7512 661 6207 -11095 -18595 6065 24420 4423 -19180 -5584 17403
742 17403 6581 -17324 -10283 10963 6059 -10474 53 20758 7503 -22267 -18904 10994 17340
755 17340 -4384 -10340 6805 10253 -6325 -8646 6333 4851 -13061 -10670 14146 18903 -4243
768 -4243 -14777 7 6009 -7262 -7527 11084 12837 -9339 -13739 10224 17547 -8561 -23626
781 -23626 -738 19623 5723 -10643 1087 12877 -4157 -19418 -1587 19041 5778 -16870
793 -16870 -6593 17002 11286 -11679 -12422 3621 4118 -6547 888 14701 5927 -14526 -11158 8850
807 8850 9110 -7569 -8671 6506 8373 -3783 -3071 7861 1437 -15416 -10116 13684 16597 -4668
821 -4668 -12778 3088 8980 -5429 -9636 5712 9509 -6891 -10368 9510 16920 -4945 -20565
$$ packed form
729F62J7425j1743j3856Q173N546j7302p500K4660J8355j9997k3603J3596K2987
742A7403j0822k3905P041K1246m904j6533J0527K0705j3255k9770L363K9898O346
755A7340k1724n956J7145L448j6578k321J4979j482j7912K391K4816M757k3146
768d243j0534J4784O002j3271k65J8611J753k2176m400K3963P323k6108j5065
781b3626K2888K0361j3900j6366J1730J1790j7034j5261J7831K0628j3263k2648
793a6870J0277K3595n716k2965p43J6043M97j0665P435J3813q774k0453L368K0008
807H850K60j6679j102J5177J867j2156P12J0932o424j6853N300K3800K913k1265
821d668q110J5866N892j4409m207J5348L797j6400l477J9878P410k1865j5620
$$ plain form
834 -20565 -4858 13561 5756 -7440 -476 9293 -167 -11830 -1668 10964 1972 -12320 -4730
847 -4730 12353 9852 -5231 -7679 229 -410 -4756 1919 10121 2313 -9344 -4254 8395 4624
861 4624 -8358 -7124 4581 5497 -2536 -210 8078 1632 -12476 -9132 8491 11770 -3633 -9592
875 -9592 2691 9024 -711 -7472 -735 3586 -2651 -4958 5435 10628 -742 -10610 -4889 5275
889 5275 3202 -2769 -875 3309 240 -2430 1196 3422 -2563 -7823 -1571 7159 5388 -1613 -2345
904 -2345 13 -1540 -3212 839 4461 197 -4616 -399 6378 3015 -4873 -5925 239 2717 903
919 903 1516 3421 353 -4932 -3655 2757 3740 -1661 -3908 858 4506 2532 -1606 -2461 -2357 -1790 90
936 90 2823 3654 275 -2485 -2184 417 1507 551 -1692 -1770 836 3681 3134 -935 -4041 -2741 -84
$$ packed form
834b0565J5707J8419p805j3196O964R769r460j1663J0162J2632q992j4292P590
847d730J7083k501j5083k448P908o39m346O675Q202p808j1657N090J2649l771
861D624j2982J234J1705R16q033K326Q288o446j4108L344J7623L279j5403n959
875i592J2283O333r735o761O737M321o237k307J0393N193j1370r868N721J0164
889E275k073n971J894M184l069k670L626K226n985n260O252Q730j771p001p32
904b345K358j553j672M051L622m264m813M217O777l363p888j052O164K478j814
919I03O13J905l068n285J277O412R83n401k247M766L648j974m138q55J04N67J880
936I0K733Q31l379k760L01K601J090r56k243p8K606K845n47m069l106J300K657
$$ plain form
953 -84 1304 1920 1848 603 -1827 -1562 837 1163 -1295 -2654 -165 2233 2192 930 447 -1855 -3813 -1352
971 -1352 3157 3203 -849 -1890 1188 1780 -1285 -2254 425 1054 -1925 -969 4157 3795 -2827 -5681 4
988 4 4146 115 -3262 859 4019 -104 -3557 28 3264 -1871 -5467 553 6586 2221 -4547 -2848
1004 -2848 3148 999 -4226 -953 4359 1564 -4261 -1069 5612 1940 -6299 -4637 4062 4408 -1989
1019 -1989 -1989 3770 1876 -5357 -3663 4717 4368 -4477 -4416 4469 6023 -2940 -5592 1850 3828 -3442
1035 -3442 -4284 4659 7118 -2879 -7320 1359 6552 -1896 -7216 932 7300 215 -6165 604 6086
1050 6086 -1411 -8030 -220 7866 1512 -6920 -1341 6726 1757 -7341 -2861 6544 2477 -5779 -1737
1065 -1737 7023 2746 -7804 -4501 6266 4408 -5815 -3926 5900 4651 -5145 -4552 5107 4139 -6536
$$ packed form
953h4J388O16p2j245k430K65K399L26k458j359K489K398m1j262m83k302j958K461
971a352M509M6m052j041L078N92l065r69K679O29k979R56N126l62o622k854N685
988DM142m031l377M121L160m123l453L585L236n135l596O020O033m365o768J699
1004b848N996k149n225L273N312k795n825L192O681l672q239J662Q699L46o397
1019a989%N759j894p233J694Q380l49q845O1Q885J554q963k652P442J978p270
1035c442q42Q943K459r997m441Q679N193q448n320Q148O368p085o380O769N482
1050F086p497o619P810Q086o354q432N579Q067m969r098M480R405m067q256M042
1065a737Q760m277j0550L303J0767j858j0223J889R826j249r796N93R659r68j0675
$$ plain form
1080 -6536 -5529 6641 7598 -4183 -7325 3414 6288 -3759 -6595 3842 6903 -3387 -7159 3271
1094 3271 8011 -2771 -9335 364 8064 208 -6541 896 6922 -1303 -8419 -23 8170 562 -7592
1109 -7592 -1275 8051 1813 -7321 -2596 6215 1648 -7011 -1897 7741 3380 -7306 -4318 6275
1123 6275 3590 -6268 -4513 6473 5398 -5189 -4633 5291 4427 -6214 -5884 5489 6437 -4450 -6161
1138 -6161 3980 6186 -4062 -6871 2888 6533 -2775 -6027 3652 7474 -2791 -8281 985 7548
1152 7548 -238 -6766 702 6643 -158 -6318 99 6490 -326 -6938 -677 7494 1996 -5973 -2270
1167 -2270 5016 1173 -5538 -970 6631 2173 -6656 -2741 6087 3598 -5629 -4232 4604 4066 -3778
1182 -3778 -2681 4857 3200 -5304 -4796 4091 5270 -2860 -4671 2451 4554 -2523 -4464 2257 3969
$$ packed form
1080f536J007J2170R57j1781l142J0739K874j0047k836J0437L061j0290l772J0430
1094C271M740j0782o564R699P700p856o749P437O026q225p116Q396Q193p608q154
1109g592O317R326o238r134M725Q811m567q659N114R638m361j0686K988J0593
1123F275k685r858J755J0986j075j0587N56R924q64j0641L30J1373R48j0887j711
1138f161J0141K206j0248k809R759L645r308l252R679L822j0265n490R266O563
1152G548p786o528P468N941o801o160O417O391o816o612O261Q171n498p969L703
1167b270P286l843o711M568P601m458q829L915Q828k489r227J397Q836n38p844
1182c778J097P538j657q504N08Q887J179q130j811P122K103p077j941O721J712
$$ plain form
1197 3969 -2678 -4366 2715 5401 -1424 -5294 641 4355 -1170 -4102 996 4559 -677 -4691 436
1212 436 4458 -431 -4897 160 4776 1112 -3892 -940 3986 980 -4308 -1124 4161 1536 -3746
1227 -3746 -1424 3769 1807 -3647 -2361 2834 2167 -2244 -1548 2400 2286 -2527 -2236 2112 2191 -1967
1243 -1967 -2067 1509 2363 -832 -1669 986 984 -1764 -1692 2049 2653 -1347 -2486 343 1759 -375 -1996
1260 -1996 669 2059 -643 -1894 1241 2331 -200 -2649 -1088 1727 1061 -631 -396 555 -182 -966
1276 -966 -49 928 588 -1198 -654 809 1215 -202 -479 -205 -674 -392 422 1147 -298 -818 -616 496
1294 496 269 -233 -36 -106 -175 -10 853 517 -165 -894 -334 421 356 708 32 -649 -807 278 1001 -32
1314 -32 -1067 -314 836 436 -351 45 972 -615 -1675 -119 2152 661 -1602 -1173 1447 646 -1354
$$ packed form
1197C969o647j688P081K686o825l870N935L714n525k932N098L563n236m014N127
1212D36M022m889m466N057M616l664n004K952M926l006n288L184N285k625n282
1227c746K322N193j962n454J286N195o67m411O96L948j14m813K91M348P9m158
1243a967j00L576Q54l195q37K655kk748P2L741O04m000j139K829J416k134j621
1260a996K665J390k702j251L135J090k531k449J561K815o66j692K35R51p37p84
1276i66R17R77l40j786N44J463M06j417k77K74m69K82Q14P25j445n20K02J112
1294D96k27n02J97p0o9J65Q63l36o82p29N60P55o5L52o76o81j58J085P23j033
1314c2j035P53J150m00p87L96R27j587j060J556K271j491k263M29K620q01k000
$$ plain form
1331 -1354 -1108 1132 419 -1347 -235 2061 1199 -1888 -1960 1193 2190 -820 -1508 490 1252 -885 -869
1348 -869 1290 1100 -2106 -1904 1665 2719 -486 -2040 171 1533 -875 -1257 1468 2286 -1857 -3043
1364 -3043 1212 3805 -734 -3649 -380 2680 558 -2434 142 2886 -759 -3805 -158 3951 1251
1379 1251 -3739 -2066 3110 2141 -2242 -1664 2244 797 -2805 -988 3450 2022 -3428 -2666 2623 2581
1395 2581 -1979 -2088 1915 1756 -2196 -1374 2861 2144 -3407 -3062 2600 4125 -1827 -3407 1498 2827
1411 2827 -1736 -2881 2083 3570 -2413 -4497 1468 5105 -125 -4962 -774 3707 489 -3236 2
1426 2 3394 -100 -4253 -209 4449 975 -4203 -2095 3635 2139 -2636 -1585 2678 653 -3022 -656
1442 -656 4030 1848 -3643 -2144 3284 2910 -2659 -2698 2814 1968 -2667 -1561 3564 2992 -3998 -3940 3116
$$ packed form
1331a354K46K240p13j766J112K296q62l087p2L153R97l010o88J998P62k137J6
1348h69K159j90l206K02L569J054l205j554K211J362k408l82K725Q18m143j186
1364c043M255K593m539k915L269L060k122k992K576K744l645l046L647M109k700
1379A251m990J673N176r69m383N78L908j447l602J817M438j428n450P62N289m2
1395B581m560j09M003j59l952Q22M235p17n551L45N662J525n952j580M905J329
1411B827m563j145M964J487n983k084N965L637n230m837M188M481l218l725L238
1426BL392l494m153M044M658l474n178K108N730j496m775J051M263k025l675K366
1442f56M686k182n491J499N428l74n569l9N512q46m635J106N125n72o990N8P056
$$ plain form
1459 3116 4679 -1928 -4060 1204 3253 -996 -3322 1970 3610 -2153 -4270 1273 4952 -304 -4517
1474 -4517 -587 3782 646 -2640 23 3216 -190 -3551 -98 4191 500 -4173 -1701 3351 1611
1489 1611 -2496 -1140 2545 633 -3335 -523 3751 1663 -3938 -2213 3478 2918 -2564 -2372 1995
1504 1995 1744 -2477 -1719 3083 2104 -3089 -3494 2431 3632 -1518 -3477 1020 3060 -703 -2408 1504
1520 1504 2562 -1590 -3331 1214 3518 -146 -3454 -402 2906 722 -2080 -24 2281 -401 -2823
1535 -2823 462 3487 -229 -3815 -1144 3049 1324 -2241 -940 1877 114 -2478 -438 2942 994
1550 994 -2925 -1825 2379 2241 -1892 -2286 971 1341 -1161 -944 1346 1695 -1765 -2081 2024 2575 -771
1567 -771 -2090 357 2078 -380 -1135 943 1231 -1098 -1616 871 2498 -413 -2447 -71 1895 634
$$ packed form
1459C116J563o607k132N264K049m249k326N292J640n763k117N543L679n256m213
1474d517L930M369l136l286K663L193l406l361L453M289l691m673K472N052j740
1489A611m107J356L685j912l968K812M274k088n601J725N691n60n482J92M367
1504A995k51m221P58M802r79n193m05N925J201n150j959M497K040l763j705L912
1520A504J058m152j741M545K304l664l308L052L308k184k802K056K305k682k422
1535b823L285L025l716l586K671M193j725l565J301K817j763k592K040L380j948
1550I94l919J100M204j38m133l94L257L70k502K17K290L49l460l16M105N51l346
1567g71j319K447J721k458p55K078K88k329n18K487J627k911k034K376J966j261
$$ plain form
1583 634 -1263 -99 1199 -337 -1446 493 2145 -140 -2195 -667 1416 1081 -1171 -557 755 -33
1599 -33 -839 -242 1318 -182 -1213 -930 1050 1260 -685 -1090 336 653 -452 -147 799 308 -1086 -848
1617 -848 1231 1341 -775 -1368 -70 761 457 -277 -3 367 -518 -216 316 849 -130 -561 -512 714 490
1636 490 -103 -493 -134 98 168 428 374 -402 -479 -319 53 236 -143 -360 -242 23 199 529 116 -152 -77
1657 -77 173 435 296 201 -223 -73 -176 639 454 -628 -591 383 514 185 -104 211 139 -551 -146 944 671
1678 671 -657 -614 180 1300 12 -737 -225 855 -147 -785 313 1158 -156 -1332 119 1340 374
1695 374 -1224 -679 968 256 -502 88 1073 50 -868 -7 1449 915 -875 -831 444 824 -420 -542
1713 -542 765 153 -1159 -770 1270 709 -1600 -1156 833 1433 -647 -1115 310 825 -950 -1258 851
$$ packed form
1583F34j897J164J298j536j109J939J652k285k055J528K083l35k252O14J312p88
1599c3q06N97J560j500j031K83J980K10j945m05J426L17j105L05R46m91j394K38
1617h48K079J10k116n93J298Q31l04p34K74L70q85L02N32N33r79m31M9J226k24
1636D90n93l90L59K32P0K60n4p76p7J60L72J83l79k17J18K65J76L30m13k68P5
1657g7K50K62j39r5m24J50j03Q15j85j082L7R74J31l29k89L15p2o90M05J090k73
1678F71j328M3P94J120j288p49N12J080j002o38J098Q45j314j176J451J221r66
1695C74j598N45J647p12p58N90R85j023r18Q61J456n34j790M4J275L80j244j22
1713e42J307o12j312L89K040n61k309M44J989O00k080m68J425N15j775l08K109
$$ plain form
1730 851 1484 -839 -1617 622 2139 -223 -1873 -9 1386 -17 -1418 184 1818 -184 -1583 -40
1746 -40 1805 317 -1646 -750 1745 413 -1479 -579 1577 150 -1731 -107 2046 466 -2293 -1140
1762 -1140 1755 1244 -1411 -1279 1223 761 -1081 -892 1600 1253 -1714 -1977 1206 1976 -1094 -1797 616
1779 616 1618 -379 -1548 919 1676 -1047 -2074 663 2259 -386 -2198 245 1705 -178 -1683
1794 -1683 121 1699 -370 -2110 158 2112 162 -2296 -660 2160 661 -2033 -571 1770 473
1809 473 -2169 -774 2176 740 -2386 -1364 1930 1581 -1591 -1391 1304 1355 -1388 -1022 1634 1372 -1530
1826 -1530 -1587 1330 1848 -1131 -1883 951 1452 -619 -1454 940 1495 -742 -1696 1283 2032 -522 -2177
1843 -2177 298 1878 -309 -1738 -185 1992 -194 -1828 780 2356 106 -2635 -658 1902 500
$$ packed form
1730H51O33k323p78K239J517k362j650J864J395j403j401J602J634k002j399J543
1746d0J845j488j963Q96K495j332j892R00K156j427j881J624K153j580k759J153
1762a140K895n11k655J32K502m62j842J89K492l47k967k63L183P70l070p03K413
1779F16J002j997j169K467P57k723j027K737J596k645j812K443J460j883j505
1794a683J804J578k069j740K268J954j950k458J636K820j499k694J462K341j297
1809D73k642J395K950j436l126J022L294l49l172K00K695N1k743L66K656k62k902
1826a530n7K917N18k979p52K834N01k071q35K394N55k237r54K979P49k554j655
1843b177K475J580k187j429J553K177k186j634K608J576k250k741J977K560j402
$$ plain form
1858 500 -1578 -649 1646 383 -1592 -468 2071 776 -1807 -1028 1607 1557 -934 -1365 913 1110 -798
1875 -798 -921 910 1067 -1418 -1308 1233 1423 -846 -1815 566 1471 -537 -840 792 1107 -1080 -1185
1892 -1185 1028 1765 -226 -1583 -22 1803 256 -1266 355 1292 -114 -1152 124 1741 22
1907 22 -1614 -159 1156 614 -1005 -476 1135 211 -1031 -244 1206 76 -1032 -617 1225 900 -911
1924 -911 -673 384 362 -676 -252 923 573 -839 -882 820 903 -619 -703 232 736 -336 -681 479 814
1943 814 -531 -948 482 1287 118 -964 -134 1194 120 -702 149 174 -271 -867 132 837 151 -871
1961 -871 -177 528 463 -469 -157 220 -5 -201 -151 277 85 -521 -246 559 293 -253 -305 212 9 -108 76
1982 76 352 142 -312 -531 414 380 -12 -322 48 19 252 -8 107 -57 -364 -503 72 356 60 3 -226
$$ packed form
1858E00k078R29K295j263j975J124K539j295k583P79K635n0k491m31K278J97j908
1875g98j23J831J57k485J10K541J90k269r69K381R05k008l03J632L15k187j05
1892a185K213P37j991j357J561J825j547j522J621R37j406j038J276J617j719
1907B2j636J455J315n42j619N29J611r24j242P87J450j130j108M15J842l25j811
1924i11K38J057k2j038M24J175l50j412m3J702Q3j522q4R35N04j072l45J160L35
1943H14j345m17J430Q05j169j082Q30J328j074q22Q51K5m45n96R99P05o86j022
1961h71O94P05o5r32L12L77k25j96N0M28j92o06K75Q05k66n46n2N17k03j17J84
1982G6K76k10m54k19R45l4l92l10L70k9K33k60J15j64l07j39N75K84k96n7k29
$$ plain form
2003 -226 29 313 -81 340 -258 -19 -173 88 38 -29 165 8 -161 152 504 88 -679 -644 104 338 165
2024 165 -389 95 26 -93 176 417 410 -202 -348 334 198 -99 -233 184 117 -47 -192 485 139 -347 -604
2045 -604 260 684 212 -477 409 504 125 -396 209 534 -293 -557 157 584 47 -1018 -445 349 -81 -409
2065 -409 43 595 -92 -682 5 924 338 -1176 -450 911 476 -178 -92 377 363 -268 -325 921 485 -984
2085 -984 -749 642 622 -388 -1066 346 573 -513 -373 750 913 -895 -1062 364 983 -147 -883 -98
2103 -98 573 95 -780 369 1346 -186 -1219 65 909 310 -915 -186 747 56 -736 -229 963 -54
2121 -54 -1103 199 1073 369 -1170 -531 1067 295 -529 -520 715 366 -970 -463 1155 869 -1079 -757
2139 -757 819 965 -777 -904 537 622 -495 -631 940 872 -800 -1262 524 1192 -128 -1157 136
$$ packed form
2003b26K55K84l94M21n98K39j54K61n0o7J94j57j69L13L52m16p67L5P48K34j73
2024A65n54M84o9j19K69K41po12j46O82j36k97j34M17o7j64j45O77l46m86k57
2045f04Q64M24m72o89Q86R5l79n21O05L25q27k64P14M27n37j065N73P94m30l28
2065d09M52N52o87n90O87R19n86j514P26J361m35o54Q6M69j4o31n7J246m36j469
2085i84K35J391k0j010o78J412K27j086J40J123J63j808j67J426O19j130p36P85
2103i8O71m78q75J149R77j532j033J284Q44n99j225P29R33o91p92N07J192j017
2121e4j049J302Q74p04j539O39J598p72q24RJ235l49j336N07J618k86j948L22
2139g57J576J46j742j27J441Q5j117j36J571o8j672m62J786O68j320j029J293
$$ plain form
2156 136 890 -151 -633 396 986 -423 -1046 59 1478 -120 -1255 -53 1142 -18 -847 45 1053
2173 1053 -141 -1416 263 1059 246 -1151 -444 867 646 -923 -518 737 332 -1041 -495 1069 577
2190 577 -680 -1024 563 1068 -360 -768 492 737 -666 -713 536 747 -767 -1312 564 1106 -260
2207 -260 -1083 283 783 -27 -609 166 663 -347 -1027 506 1131 -107 -1124 -71 1077 51 -565
2224 -565 295 982 306 -1073 -77 1262 69 -1096 -427 785 595 -750 -538 330 352 -630 -275 908
2242 908 357 -807 -800 150 798 -583 -824 312 451 -73 -226 721 232 -607 -863 576 688 -238 -762
2261 -762 224 286 -44 -74 596 175 -234 -815 241 743 -170 -490 -90 332 673 -663 163 394 297 -547
2281 -547 -271 783 382 -600 -275 346 321 191 -172 343 -37 -329 -290 197 93 -784 -190 463 260 -377
$$ packed form
2156A36P54j041m82J029N90j409o23J105J419j598j135J202J195j160q29Q92J008
2173A053j194j275J679P96q13j397P07J311k21j569M05J255m05j373N46J564m92
2190E77j257l44J587N05j428m08J260K45j403m7J249K11j514n45J876N42j366
2207b60q23J366N00q10n82P75M97j010o80J533O25j238j017J053J148j026o16
2224e65Q60O87o76j379R96J339j193j165O69J212j90j345K12Q68K2r82L55J183
2242I08n51j164PR50O48j381k41J136J39n24j53R47m89q39k56J439J12r26n24
2261g62R86O2l30l0O70m21m09n81J056N02r13l20M00M22L41j336Q26K31r7q44
2281e47K76J054m01r82L25O21k5j30l63N15l80k92L9M87j04q77N94O53k03o37
$$ plain form
2301 -377 -178 260 -21 -119 -238 205 268 -216 -173 253 8 -284 -459 -132 462 309 -340 347 194 -201 -260
2322 -260 234 696 292 -390 -255 213 342 -162 19 36 234 132 208 62 -307 31 -101 151 79 37 -51 -162
2344 -162 -256 268 149 89 -317 100 -123 -36 305 -96 -236 35 160 93 204 43 -457 -218 -235 -31 233 -338
2366 -338 22 48 9 200 302 58 -247 93 262 -117 -37 -97 174 -83 -250 -43 163 85 -137 106 432 227
2388 227 -195 -183 327 306 46 -10 72 145 -470 -234 398 110 -161 -269 260 402 5 -249 -42 314 -244 -387
2410 -387 573 375 -360 -647 43 747 -10 -272 371 386 -12 -215 264 821 -196 -564 117 682 -58 -447
2430 -447 -18 320 79 -368 -63 735 -152 -728 115 485 349 -658 -397 464 129 -386 -27 429 -133 -616
2450 -616 -126 475 399 -426 -106 486 438 -488 -327 383 248 -378 -304 340 426 -500 -439 220 548 107 -462 152
$$ packed form
2301c77J99M38k81r8j19M43O3m84M3M26k45k92j75L27N94j53o49O87j53l95n9
2322b60M94M62m04o82J35M68J29n04J81J7J98j02P6j46l69L38j32K52p2m2q8j11
2344a62r4N24j19o0m06M17k23Q7L41m01j40K71J25o7J11j61n00K39j7K04K64n71
2366c38L60K6l9J91J02k44l05L40J69l79Q0o0K71k57j67K07K06p8k22K43L26k05
2388B27m22J2N10k1k60n6Q2P3o15K36O32k88k71j08N29J42l97k54K07L56n58j43
2410c87R60j98p35k87O90P04p57k62O43J5l98k03M79N57j017l68O81N65p40l89
2430d47M29L38k41m47L05P98q87n76Q43L70j36j007K61Q61l35n15L59M56n62m83
2450f16M90O01p6q25L20N92m8r26J61P10j35o26P4O44Q6r26O1O59L28m41n69O14
$$ plain form
2472 152 635 -148 -494 591 671 -266 -755 228 768 -59 -706 125 468 70 -401 35 473 -319 -454 -221
2492 -221 861 237 -658 -224 503 465 -676 -1 366 124 -956 -366 353 512 -622 -491 702 827 -325
2511 -325 -528 501 175 -361 -294 378 416 -512 -614 596 834 -439 -401 156 398 -295 -534 244 618 -462
2531 -462 -513 41 680 -139 -522 -270 409 -197 -391 166 634 -151 -756 -182 587 192 -725 -148 474 372
2551 372 -473 -178 138 167 -335 -117 539 331 -352 -422 306 531 -386 -338 443 171 -194 -218 34 336 -291
2572 -291 -650 270 736 -183 -384 287 496 -123 -106 151 568 -11 -584 428 567 -141 -734 71 519 168
2592 168 -426 -405 40 182 -310 -61 546 -84 -45 -350 276 251 -401 206 -6 149 -311 -96 609 102 -173
2613 -173 -173 95 353 -427 -178 190 119 -156 -308 196 503 -311 -470 297 169 -277 -400 282 490 -81 54
$$ packed form
2472A52M83p83l46J085Q0r37m89R83N40q27o47Q31L43l98m71M36M38p92j35K33
2492b21J082o24q95M34P27l8j141O75L67k42j080N90P19J59j134J31J193J25j152
2511c25k03J029l26n36O7O72L8r28j02J210K38j273L8N57K42o93k39P78L74j080
2531d62n1N54O39q19l83K52O79o06j94N57M68p85o05N74P69l95r17N77O22j02
2551C72q45K95L16K9n02K18O56k08o83p0P28K25r17M8P81k72l65k4K52L02o27
2572b91l59R20M66r19k01O71K09o19J7K57M17n79n73J012J39p08n93Q05M48l51
2592A68n94K1M45J42m92K49O07o30L9l05O26k5o52O07k12J55m60K15P05n07k75
2613a73%K68K58p80K49L68p1k75j52N04L07q14j59P67j28m46j23O82K08n71J35
$$ plain form
2634 54 54 134 -120 -365 4 426 94 -251 -272 512 89 -131 -95 131 -176 -213 10 202 -120 -274 243 -53
2656 -53 199 -78 -317 -62 43 -272 288 317 100 -196 -250 -5 -17 41 -80 0 -282 -83 -116 -41 -118 -242 22
2679 22 178 170 117 76 -329 235 -92 42 173 85 -286 -11 -114 207 175 44 -90 215 -25 232 -201 -120 74
2702 74 -126 7 189 191 -77 -43 1 18 -98 38 -187 -252 117 70 11 -253 42 58 -218 -41 339 -40 -260
2725 -260 102 100 440 -43 26 -194 332 42 -112 -142 -196 -211 -164 243 114 90 -245 36 242 -214 126 19 226
2748 226 -150 -143 247 21 111 -230 -97 279 137 -10 33 213 80 -235 43 455 -72 -130 -222 87 262 -106
2770 -106 34 130 255 -347 -410 309 333 -175 -206 143 339 -83 37 86 -14 -301 -199 402 135 -143 -4 249
2792 249 19 0 -399 -127 642 -123 -372 -57 -135 155 -188 -26 162 -66 -111 -58 576 114 -252 79 62 208
$$ packed form
2634E4%Q0k54k45L69M22l32l45k1P84m23k20L6K26l07l7K23J92l22j54N17k96
2656e3K52k77k39K55J05l15N60K9k17k96n4K45j2N8j21Q0k82J99l3P5p7j24K64
2679B2J56qn3m1m05N64l27J34J31q8l71K75j03L21l2j31j34L05k40K57m33Q1J94
2702G4k00J33J82Kk68L4M4J7j16J36k25o5L69m7n9k64K95J6k76J77L80l79k20
2725b60L62kL40m83O9k20N26k90j54l0n4j5M7M07j29k4l35K81K06m56L40j07K07
2748B26l76PL90k26R0l41J33L76j42j47M3J80j33l15K78M12n27n8r2L09J75l68
2770a06J40R6J25o02o3P19K4n08l1L49J96m22J20M9j00k87J02O01k67k78J39K53
2792B49k30j9l99K72P69p65k49L15p8K90l43J62J88k28m5N3O34m62l66L31j7J46
$$ plain form
2814 208 -504 -462 364 -202 -153 -54 527 104 -130 -248 238 160 -329 -273 158 -5 -242 -255 200 381 35 -379
2836 -379 -6 353 -265 -81 250 224 -245 -329 244 217 -30 7 144 432 -141 -178 20 118 -185 -92 -97 333 151
2859 151 -417 14 243 -110 -307 -49 139 106 -377 -15 318 148 -372 -349 236 85 -560 -373 181 248 -434
2880 -434 38 420 151 -293 -268 178 294 -60 -96 143 207 -251 -165 108 487 -343 -232 506 204 144 -217 -41
2902 -41 324 28 -281 -157 562 66 -384 159 466 80 -416 -72 34 332 -82 -43 71 230 -140 35 124
2923 124 370 -20 -321 128 -45 -74 -162 113 50 -107 -53 164 71 -239 -222 538 332 -118 -147 253 150 -87
2945 -87 -18 304 22 -349 -232 321 298 -226 -392 -22 181 47 -103 256 263 31 -201 180 90 144 -167 -6
2967 -6 277 247 -175 53 98 -18 41 20 184 90 -210 -30 364 99 -243 -74 -101 -125 6 -110 271 188 -153
$$ packed form
2814B08p12M2Q26n66M9R9N81m23k34j18M86p8m89N6M31j63k37j3M55J81l46m14
2836c79L73L59o18J84L31k6m69q4N73k7k47L7J37K88n73l7J98R8l03R3nM30j82
2859A51n68M31K29l53j97K58J88l3m83L62L33j70n20K3N85j51o45J87N54O7o82
2880d34M72L82k69m44K5M46J16l54l6K39O4m58Q6K73L79q30J11P38l02o0l61J76
2902d1L65k96l09J24P19m96m50N43L07l86m96L44J06K98m14L9J14J59l70J75Q9
2923A24K46l90l01M49j73k9q8K75o3j57N4K17r3l10J7P60k06m50k9M00j03k37
2945h7O9L22k82l71J17N53k3n24j66L70K03j34j50L59Pk32k32L81r0N4l11J61
2967fK83l0m22K28M5j16N9k1J64r4l00J80L94k65l42J69k7k4J31j16L81q3l41
$$ plain form
2990 -153 -143 285 -122 -62 -151 550 169 -93 -354 253 75 108 -21 33 176 -71 -92 72 128 -119 -327 297
3012 297 44 -153 -145 116 267 -196 -232 -59 135 394 -52 -30 185 -148 -278 -26 50 -188 -82 -101 -93 93 -142
3035 -142 -135 0 257 -21 -197 112 37 -1 -279 -32 233 105 -314 254 -314 67 -23 -29 40 185 6 -26 -7
3058 -7 11 6 -255 49 184 -57 54 -148 -5 48 -52 85 288 -110 -326 -300 -264 175 -175 -298 174 -11 -226
3081 -226 49 190 43 91 191 163 215 167 -399 56 229 -109 -15 -57 191 -127 -113 349 -42 -232 -119 25
3103 25 19 244 -134 -151 -196 -138 6 -188 -107 -17 48 102 162 114 -353 -155 -26 9 28 -201 54 -178 24 2 157
3128 157 -5 -51 -91 -146 453 60 100 69 408 -303 -63 -156 85 -73 47 -257 197 250 -220 85 -208 406
3150 406 96 89 440 134 -298 -77 27 471 -334 -269 100 253 52 -72 72 128 506 -254 91 -160 7
$$ packed form
2990a53J0M28m07O0q9P01l81k62k61O07j78L3j29N4J43k47k1J64N6k47k08O24
3012B97k53j97QK61J51m63l6J73J94K59m46K2K15l33j30K52P6k38J06j9QJ86k35
3035a42PJ35K57k78j76L09p5l8k78K47K65j28m19N68n68L81r0oO9J45j79l2J9
3058gJ8nk61L04J35k41J11k02J43N3j00J37K03l98k16K6L6M39l50j23M72j85k15
3081b26K75J41j47M8J00k8N2m8n66M55J73l38R4m2K48l18J4M62l91j90J13J44
3103B5oK25l78j7m5N8J44j94Q1R0O5N4O0m8m67J98J29L5J9k29K55k32K02k2J55
3128A57j62m6m0n5N99l93M0l1L39p11K40r3K41j58J20l04M54N3m70L05k93O14
3150D06l10pL51l06m32K21J04M44q05O5L69J53k01j24J44N6L78p60L45k51J67
$$ plain form
3171 7 -276 -37 190 31 -35 -20 119 85 -107 -145 176 -45 50 -143 460 38 -65 -2 228 -162 24 242 348
3194 348 -73 -16 -8 311 -120 -74 -234 234 326 -210 -209 -287 239 -77 -268 418 159 -490 -116 221 26 -5 -238
3217 -238 -37 80 239 -255 91 38 -191 77 -205 400 -157 -247 -103 398 -53 -122 47 180 -60 -489 -299
3238 -299 75 94 -202 -128 -49 218 -144 -138 -28 72 -10 183 431 354 -223 -16 -62 78 229 57 243 145 -117
3261 -117 -7 248 225 -241 -457 101 105 143 -323 216 140 182 -255 -84 202 -48 -240 -81 209 68 -45 -353
3283 -353 159 112 -191 -126 402 -112 -360 -263 45 62 -238 -35 86 -64 -17 -56 196 137 -180 -44 207 277 -167
3306 -167 204 341 196 38 -174 190 82 -215 81 354 -51 -335 -175 156 55 193 -122 240 438 -110
3326 -110 -236 -164 46 -96 -35 77 430 187 -230 128 -33 -7 6 153 30 92 407 64 181 274 114 300
$$ packed form
3171Gk83K39K27j59o6J5J39l4j92l8L21k21R5j93O03m22j03O3K30l90J86K18J06
3194C48m21N7QL19m31M6j60M68R2n36Jp8N26l16j91O86k59o49L74L37j95l1k33
3217b38K01J17J59m94L46n3k29K68k82O05n57r0J44N01m51o9J69J33k40m29J90
3238b99L74J9k96P4P9K67l62OJ10J00q2J93K48p7n77K07m6J40J51j72J86r8k62
3261a17J10K55k3m66k16N58ML8m66N39p6M2m37J71K86k50j92J59K90j41j13l08
3283c53N12m7l03O5N28n14k48R7L08J7l00K03J21j50M7l9K52n9l17J36K51P0m44
3306a67L71J37j45j58k12L64j08k97K96K73m05k84J60L31j01J38l15L62J98n48
3326a10j26P2K10j42O1J12L53k43m17L58j61K6J3J47j23O2L15l43J17R3j60J86
$$ plain form
3348 300 89 -87 -517 0 -57 162 -244 30 -12 406 359 -239 44 70 -46 -177 286 210 -287 -121 224 120
3370 120 -229 -119 36 -97 -15 -340 4 86 -39 -289 3 -61 35 -277 -105 109 -64 -87 88 107 91 4 -175
3393 -175 337 220 -76 247 128 -128 264 -106 -319 -41 27 73 153 -76 -56 -28 -38 -183 106 -148 -78 3 252
3416 252 186 10 -350 -39 302 -314 8 178 46 -29 117 -112 -125 80 -242 352 -50 -141 -66 -158 -22 -185
3438 -185 65 -8 47 142 216 76 217 -196 -217 479 163 125 -23 -51 -147 -184 -25 158 130 -225 -322 -32 -198 180
3462 180 -175 263 -128 8 -109 -148 -37 384 -235 417 -27 2 -143 -153 -21 -68 -31 -185 -166 229 -162 -213
3484 -213 450 -142 205 70 171 450 -198 45 306 -54 -35 -13 -4 100 279 40 -20 71 -76 18 163 217 -1
3507 -1 -295 -169 328 248 446 165 -10 220 99 44 -56 -76 -129 276 304 52 -203 -31 9 -44 -191 -42 186
$$ packed form
3348C00k11j76m30N17n7K19m06K74m2M18m7n98K83K6j16j31M63p6m97J66L45j04
3370A20l49J10J55j33Q2l25L44Q2j25k50K92o4R6l12J72K14j73k3J75J9j6q7j79
3393a75N12j17k96L23j19k56L92l70k13K78O8M6Q0k29K0K8j0j45K89k54P0Q1K49
3416B52o6j76l60L11L41o16L22J70j32p5J46k29j3K05l22N94m02r1P5r2J36j63
3438a85K50p3N5R5P4j40J41m13k1O96l16l8j48k8r6l7J59J83k8l55r7K90j66L78
3462A80l55M38l91J36j17l9J11M21o19O52m44K9j45j0J32m7L7j54J9L95l91n1
3484b13O63n92L47j35J01K79o48K43K61l60J9K2RJ04J79k39o0R1j47R4J45N4k18
3507ak94J26M97q0J98k81j75K30j21n5j00k0n3M05K8k52k55J72M0n3j47J49K28
$$ plain form
3530 186 99 -183 5 -131 100 -210 -200 79 -24 225 9 30 -146 72 0 -200 -62 -80 -211 -387 15 -146
3552 -146 -70 121 -63 8 -285 -21 -26 53 -85 -110 229 231 -214 -1 267 148 -144 -189 -53 230 -271 -112 108
3575 108 264 -233 -35 -163 137 -57 -163 135 -122 -105 -132 122 195 77 -29 -28 -54 -66 193 -75 295 -79
3597 -79 -215 260 86 -188 -269 -327 138 192 32 -74 77 138 -122 170 293 -307 -180 196 86 68 36 -18 151
3620 151 -30 -33 227 49 -232 363 47 105 41 47 -175 147 -37 195 -122 267 166 -3 98 -134 -322 -216
3642 -216 -61 238 -4 160 -271 248 21 -6 214 120 139 84 -65 -218 26 -82 153 -305 -98 -62 -81 -87 198
3665 198 233 -50 167 143 -149 -104 -106 -206 108 79 28 -146 -123 99 -25 122 -106 64 2 177 117 23 -175 -292
3689 -292 -7 -90 -115 230 -241 203 -45 -263 113 -24 -465 -297 -396 -219 -26 -44 -14 0 -157 -111 -216 -205 -432
$$ packed form
3530A86q7k82J88j36K31l10J0K79j03K49k16K1j76K18p2k00J38j8j31j76M02j61
3552a46P6J91j84P1k93K64nP9j38k5L39Km45K13K68j19k92m5J36K83n01J59K20
3575A08J56m97J98j28L00j94j06K98k57J7k7K54P3j18j06Jk6j2K59k68L70l74
3597g9j36M75j74k74q1n8M65N4j60j06J51O1k60K92J23o00J27L76j10j8l2n4J69
3620A51j81lK60j78k81N95l16N8o4Ok22L22j84K32l17L89j01j69J01k32j88J06
3642b16J55K99k42J64m31N19k27k7K20r4J9n5j49j53K44j08K35m58K07L6j9oK85
3665A98L5k83K17k4k92M5kj00L14k9n1j74K3K22j24J47k28J70o2J75o0r4j98j17
3689b92K85q3k5L45m71M44k48k18L76j37m41J68r9J77J93j8L0J4j57M6j05J1k27
$$ plain form
3712 -432 -186 37 63 -144 24 0 147 -189 -5 345 -105 11 126 126 19 88 -180 129 -203 45 209 67
3734 67 -60 107 90 -124 41 -278 82 -88 -233 58 -96 -218 86 -123 31 -126 64 227 97 13 71
3755 71 175 -157 210 -59 -59 -212 39 -223 -131 -98 -30 -129 -82 -176 -57 111 38 -143 110 -190 164 -124 23
3778 23 -133 465 35 -52 -88 199 -280 -157 155 -212 -134 27 -162 -129 -87 -51 142 -182 -190 136 13 7 182 -126
3802 -126 27 -150 21 15 -144 -151 -18 -327 90 -151 167 133 116 27 -190 -60 -173 257 -221 -20 -316 -216
3824 -216 48 -28 73 -149 30 -228 -150 -7 136 89 55 -138 -227 -49 -55 -321 73 182 -130 128 -94 183
3846 183 130 -153 -145 176 27 -63 45 7 -149 -330 -335 -117 -25 305 222 117 -122 -191 -38 -45 78 13 -241 -170 -117
3871 -117 9 -177 181 33 -131 335 -217 -202 -182 -135 -69 -24 326 10 -236 -98 144 -315 7 446 -49 -69
$$ packed form
3712d32K46K23K6k07J68k4J47l36J84L50m50J16J15%j07O9k68L09l32K48J64j42
3734F7j27J67j7k14J65l19L60j70j45K91j54j22L04k09J54j57J90J63j30q4N8
3755G1J04l32L67k69%j53K51k62R2L3O8r9M7r4J19J68p3j81K53l00L54k88J47
3778B3j56N98m30q7l6K87m79J23L12l67P8J61j89L3M2L6J93l24qL26j23oJ75l08
3802a26J53j77J71oj59pJ33l09M17k41L18l4j7q9k17J30j13M30m78K01k96J00
3824b16K64p6J01k22J79k58P8J43J43m7l4j93q9J78ok66L94J09l12K58k22K77
3846A83n3k83QL21j49r0J08l8j56j81nK18R2L30q3j05k39o9J53pJ23o5k54P1N3
3871a17J26j86L58j48j64M66n52J5K0M7O6M5L50l16k46J38K42m59L22M39m95k0
$$ plain form
3893 -69 -98 -101 -30 -50 -51 -123 148 -22 -74 115 -280 36 -81 -27 -66 57 34 63 -4 -25 49 -25 11 -180 -76 179
3919 179 -260 -28 -30 -152 13 52 104 212 28 80 -149 79 158 51 47 154 57 92 -69 -108 -26 38 28 -214 444
3944 444 -77 7 148 -80 -64 -202 212 147 115 57 -260 170 224 -19 -149 -115 81 -12 -167 -37 -51 145 231
3967 231 -66 -230 93 -69 -286 -176 -188 -142 -8 -198 -240 11 -73 294 -37 198 -132 -167 255 -258 116 101
3989 101 -45 129 -21 104 127 -88 112 64 -94 9 109 -270 8 67 57 -250 -48 251 383 240 117
4010 117 -4 -15 52 -103 -41 -82 80 41 -123 0 17 -169 24 101 58 -176 -171 -122 49 -116 -100 -35 31 121 161
4035 161 -78 -244 -136 -362 196 -11 -130 128 121 303 -217 -62 136 -243 -221 208 7 -11 -51 -70 70 266
4057 266 19 104 -48 10 106 -149 124 -70 195 236 -92 346 -19 37 -278 251 325 -26 -110 76 102 -113 -280
$$ packed form
3893f9k9lP1k0jp2K71j70n2J89l95L16j17N4l9J23k3K9o7k1P4p4L6j91J04K55
3919A79m39K32kj22J65L9N2J08j84N2k29K28P9j07mJ07r7L5j61l9Q2O4j0k42O58
3944D44n21Q4J41k28J6j38M14o5l2n8l17M30N4k43j30L4J96r3j55J30j4J96Q6
3967B31k97j64L23j62k17J10j2M6J34j90m2K51q4L67l31K35l30l5M22n13L74j5
3989A01j46J74j50J25K3k15K00m8j58J03J00l79K78N9j0l07K02K99J32j43j23
4010A17j21j1O7j55O2m1J62l9j64J23J7j86J93P7m3k34NM9J71j65J6O5O6R0M0
4035A61k39j66J08k26N58k07j19K58pJ82n20J55J98l79K2M29k01j8m0j9J40J96
4057B66k47Q5j52N8R6k55K73j94K65M1l28M38l65N6l15N29P4l51q4J86K6k15j67
$$ plain form
4080 -280 -175 51 210 -158 -170 209 339 46 -164 -544 107 77 -81 104 280 3 -31 -132 82 -35 -88
4101 -88 -159 280 -173 -208 217 -22 12 -113 -23 -46 65 -43 58 181 45 -68 -271 322 -444 54 241 -58
4123 -58 182 133 38 -223 -39 43 -57 -164 -94 125 228 16 -150 -181 -265 288 68 92 28 118 -16 -177 -178 72
4147 72 -79 -69 -195 -260 129 -117 -5 -81 122 -216 -174 -177 -21 69 -3 203 90 154 21 150 -142 -176 395 -120
4171 -120 84 39 44 -63 -149 -132 129 -11 -79 -18 80 -18 -135 -186 -40 72 17 -51 -278 -159 -1 101 -37 169
4195 169 -73 180 -25 -13 320 -87 105 40 -217 -192 -100 153 194 146 -51 -312 -96 -16 -10 42 39 -209 296 -24
4219 -24 -74 -194 83 48 60 -102 -68 -14 -16 152 -77 -135 34 84 -142 59 221 -225 -305 -37 205 -64 -67 -92 215
4244 215 312 -95 -45 204 -133 -219 43 76 106 161 19 4 201 31 -353 5 184 101 -84 32 220 -165 -7
$$ packed form
4080b80J05K26J59l68j2L79J30k93k10l80O51l0j58J85J76k77l4j01K14j17n3
4101h8p1M39m53l5M25k39L4j25R0k3J11j08J01J23j36j13k03N93p66M98J87k99
4123e8K40m9r5k61J84Q2j00j07P0K19J03k12j66l1q4N53k20K4o4R0j34j61jK50
4147G2j51J0j26o5L89k46J12p6K03l38M2lJ56R0p2K06j13O4j33J29k92l4N71n15
4171a20K04m5Nj07q6J7K61j40o8O1R8r8j17n1J46J12n5o8k27J19J58J02j38K06
4195A69k42K53k05J2L33m07J92o5k57K5R2K53M1m8j97k61K16Q0ON2lk48N05l20
4219b4n0j20K77l5J2j62L4N4kJ68k29n8J69N0k26K01J62m46q0K68K42k69lk5L07
4244B15R7m07N0K49l37q6K62L3L0N5j42j5J97j70l84L58J79q3j85J16J88l85J58
$$ plain form
4267 -7 -227 39 83 17 98 -493 91 67 -222 -65 207 206 58 130 -73 -41 204 121 -220 37 -67 288 -45 -28
4291 -28 102 202 78 -444 34 -185 60 140 -39 -146 2 290 -116 73 1 130 103 31 96 -163 -171 -16 -168
4314 -168 62 203 147 340 76 4 183 -57 -29 85 123 59 -93 -231 -143 -127 219 -137 39 -146 -208 -89 -66
4337 -66 61 58 195 203 -314 -383 -31 127 310 10 -296 -56 89 -92 -131 111 -85 -31 -102 -159 130 -66 -146 -69
4361 -69 -4 -89 -202 64 454 -203 39 13 -143 155 94 37 -149 -82 50 66 10 28 -242 209 -210 -63 87
4384 87 -98 -18 53 188 -104 -331 -27 -18 235 -41 -36 -81 163 -17 -371 -4 51 233 146 -348 199 -50 145
4407 145 -345 -125 -63 -111 153 -97 -26 -86 63 39 90 171 120 -243 -78 -168 12 51 41 -287 18 -221 -77 -203
4431 -203 -218 85 -156 -76 0 -45 -121 -67 -115 -75 55 141 73 16 187 -143 -294 11 182 -214 -152 44 216 52
$$ packed form
4267gk20K66M4o6Q1n91N84k4k89J57K72jj48P2k03L2K45q3l41K57j04L55l33J7
4291b8J30J00j24n22M78k19K45Q0j79j07J48K88m06J89p2J29k7p2O5k59qJ55j52
4314a68K30J41n6J93k64p2J79k40K8J14L8o4j52j38Q8J6L46l56J76j85o2J19K3
4337f6J27lJ37Qn17o9L52J58J83l00l06K40J45j81l9K42j96N4p1n7K89j96q0P7
4361f9O5q5j13K66L90o57K42k6j56K98o1n7j86O7J32J6n6J8k70M51m19J47J50
4384H7j85Q0P1J35k92k27L04RK53k76Nm5K44j80l54L67N5J82q7m94N47k49J95
4407A45m90K20O2m8K64k50P1o0J49k4N1Q1n1l63J65r0J80L9j0l28L05k39J44j26
4431b03j5L03k41Q0P6m5p6N4m8M0J30Q6o8n7J71l30j51L05J71l96O2J96J72j64
$$ plain form
4455 52 -16 98 -103 214 366 196 -190 -130 142 -143 6 1 -172 -57 -13 -17 9 -301 -49 -70 -72 -155 39 30 -138
4480 -138 -117 -3 -321 -104 10 -300 -155 28 217 -47 185 450 16 -318 66 109 -41 -123 6 -121 75
4501 75 232 69 339 -207 102 196 76 354 240 -113 7 -104 328 -103 -179 152 -130 -217 74 157 -267 58
4523 58 -107 -73 59 179 85 -161 -257 -29 451 -61 -149 47 -250 -23 -51 97 6 -49 90 -45 322 -159 -47
4546 -47 363 -2 84 -239 184 -196 -149 -28 172 52 65 -57 42 -38 -70 90 -13 46 47 -112 96 -211 -27
4569 -27 130 113 -47 -27 7 144 133 272 185 70 -190 -89 35 -45 184 76 -49 -108 143 284 -67 -131 -15
4592 -15 236 111 92 140 49 -30 190 317 218 -67 -56 124 -198 -151 -56 143 -152 -72 -199 -188 158 103 -3 -262
4616 -262 -14 157 -24 116 295 72 92 337 -69 75 -405 -51 -15 147 -9 -44 -101 46 218 89 80 -196
$$ packed form
4455E2o8J14k01L17J52j70l86O0K72k85J49nj73J15M4mK6l10K52k1kq3J94rj68
4480a38K1J14l18K17J14l10J45J83J89k64K32K65m34l34L84M3j50q2J29j27J96
4501G5J57j63K70n46L09R4j20K78j14l53J20j11M32m31p6L31k82q7K91Q3m24L25
4523E8j65L4J32J20r4k46r6K28M80n12q8J96k97K27k8J48r1n5J39j35L67m81J12
4546d7M10l65Q6l23M23l80M7J21K00j20J3j22R9q0l2J60j03N9Jj59K08l07J84
4569b7J57j7j60K0L4J37j1J39q7j15k60J01J24q0K29j08j25n9K51J41l51o4J16
4592a5K51j25j9M8r1p9K20J27r9k85J1J80l22M7R5J99k95Q0j27J1L46n5j06k59
4616b62K48J71j81J40J79k23K0K45m06J44m80L54L6J62j56l5n7J47J72j29rk76
$$ plain form
4638 -196 5 -113 102 -24 85 -167 -3 126 271 -44 140 19 21 -154 15 -51 165 30 -58 78 -167
4659 -167 -142 -49 -368 -151 -254 -11 125 -115 -192 -80 -113 107 46 65 25 20 138 -136 71 185 -408 -46 -36
4682 -36 -6 107 110 1 56 -115 131 3 -217 0 -263 -91 -57 -199 137 200 99 -195 -32 331 -17 -263
4704 -263 -154 118 35 371 -9 -346 244 74 -1 172 127 -133 120 166 7 52 105 -86 -84 54 -73 118 61
4727 61 -46 15 76 -227 7 -231 -115 -10 -47 -61 -78 -149 68 23 -96 203 157 -303 -229 92 -163 39 72 51
4751 51 -138 29 126 2 -43 -59 -19 -58 52 239 -68 -60 -222 -23 59 -24 148 -80 -160 -223 -47 -170 -279 134
4775 134 133 199 255 -191 -180 106 203 67 -221 -10 -251 38 246 -267 14 -67 -87 -269 -5 40 115 -290 84
4798 84 122 -248 -465 -11 -158 147 64 -14 -13 192 198 249 -65 -151 17 132 -58 -106 2 20 -205 -280 54 185
$$ packed form
4638a96K01j18K15j26J09k52J64J29J45l15J84j21Kj75J69o6K16j35q8J36k45
4659a67K5R3l19K17j03K43J36k40p7J12l3K20o1J9m0nJ18k74K07J14n93L62J0
4682c6L0J13Lj09N5j71K46j28k20K17k63J72L4j42L36O3j01k94J63L63l48k46
4704b63J09K72q3L36l80l37N90j70p5J73m5k60K53M6j59M5N3j91KJ38j27J91n7
4727F1j07O1O1l03K34k38J16J05l7j4j7p1K17m5j19K99m6m60P4L21k55K02L3k1
4751E1j89J67R7j24m5j6M0l9J10J87l07Qj62J99Q2q3J72k28q0o3J76j23j09M13
4775A34jO6N6m46J1K86R7j36k88K11k41K89K08n13K81q1k0j82K64M5P5m05L74
4798H4L8l70k17M54j47L05q3p8JK05ON1l14q6J68J15j90m8J08J8k25p5L34J31
$$ plain form
4822 185 35 -204 -179 -113 -64 -68 -184 -78 217 -82 136 104 -231 -161 -47 -5 -116 63 -38 -51 -260 78 69 -23
4846 -23 -93 -140 195 135 -142 239 147 -8 34 -98 -144 -6 357 30 152 -506 12 237 -68 76 312 25
4868 25 -478 192 322 -149 90 211 -21 -267 171 89 -115 102 -20 29 -56 -94 -183 51 -20 174 -208 -23
4890 -23 -222 -309 13 -205 -179 -351 46 365 -134 175 94 -29 145 214 -8 -138 -192 -204 8 -272 211 184 35
4913 35 -31 324 160 -96 -217 11 -79 133 56 -176 -52 177 -254 190 -90 -235 264 -137 208 113 107 6
4935 6 -29 25 -40 131 17 -226 27 -98 -177 107 92 34 64 87 79 -10 91 -2 -223 -142 27 37 159 -195 -28
4960 -28 137 -71 -5 -9 174 36 -535 189 225 -82 48 196 164 204 -222 161 97 -84 -192 -230 103 118 -11
4983 -11 -202 235 -119 71 -287 82 44 -5 8 70 -224 -451 -14 64 212 -154 137 -183 -34 157 192 123 105
$$ packed form
4822A85j50k39K5O6M9mj16J06K95k99K18l2l35P0J14M2j11J79j01j3k09L38rr2
4846b3p0m7L35o0k77L81r2j55M2j32m6J38L63l27J22o58N18K25l05J44K36k87
4868B5n03O70J30m71K39J21k32k46M38q2k04K17j22M9q5l8q9K34p1J94l82J85
4890b3j99q7L22k18K6j72L97L19m99L09q1j23J74O9k22j30n4j2K12k80M83k7j49
4913C5o6L55j64k56j21K28r0K12p7k32J24K29m31M44k80j45M99m01L45r5oj01
4935Fl5N4o5J71j14k43K53j25p9K84j5n8L0K3qq9J01r3k21Q1J69J0J22l54J67
4960b8J65k08O6mJ83j38n71P24L6l07J30J48l2M0m26L83o4j81j08l8L33J5j29
4983a1j91M37l54J90l58L69l8m9J3O2k94k27M37P8J48l66K91l20J49J91L5o9j8
$$ plain form
5006 105 208 -51 166 -272 -261 -180 -71 148 -73 -121 -89 207 -88 -10 -47 331 62 -2 152 49 46 185 77
5029 77 46 45 -5 -32 -5 5 61 91 79 -177 -79 -204 47 32 -376 -2 -59 -119 219 -22 -236 66 104 121 -331 316
5055 316 -42 60 -131 3 -289 407 27 93 156 -114 -34 22 -42 -7 -128 74 -10 -7 156 -74 76 321 104
5078 104 -196 66 -234 27 -154 24 130 14 -57 301 -157 -72 83 61 -235 83 -23 -249 -80 -122 -177 -320
5100 -320 179 176 -53 -64 31 -40 132 -111 -2 -84 183 -53 -23 -221 105 41 -85 33 223 -245 -175 -186 128
5123 128 -77 -3 25 225 155 33 17 -43 298 -291 -137 -33 -109 331 -183 105 -202 -141 -53 -221 -123 46 -19
5146 -19 -262 -53 191 256 60 -31 -62 141 58 -53 18 -4 110 -32 -59 -30 -61 128 35 137 -167 -49 -73 276
5170 276 -77 -111 -145 -89 -168 307 191 -87 235 190 -147 178 -54 -153 -232 141 -376 -69 12 280 47 71 -92
$$ packed form
5006A05J03k59K17m38J1Q1J09K19k21m8L2K96k95P8l7L78k69o4J54j03lJ39j08
5029G7l1jn0k7K7J0N6L0j2k56R8j25K51j5m08L74n7o0L38k41k14L02L8J7m52O47
5055C16l58J02j91J34k92O96l80O6O3k70Q0N6o4L5j21K02q4LJ63k30J50K45k17
5078A04l00K62l00K61j81J78J06j16p1L58m58Q5J55k2k96L18j06k26J69m2n5j43
5100c20M99lk29j1R5p1J72k43J09q2K67k36L0j98L26o4j26J18J90m68P0j1L14
5123A28k05P4K8K00p0j22j6o0L41n89J54J04p6M40n14K88l07O1Q8j68R8J69o5
5146a9k43K09K44O5j96r1l1K03q3j11P1k2J14j42k7K9l1J89r3J02l04J18k4L49
5170B76l53l4l4N6p9M75j16k78L22m5l37L25k32r9p9L73n17L07Q1K68k33K4j63
$$ plain form
5193 -92 128 -51 205 -212 -190 -72 -68 48 92 50 -82 0 -64 -100 -111 1 43 -70 102 120 336 -74 -99 17
5217 17 158 -211 278 -60 132 31 117 94 -131 -107 256 160 -14 -110 21 18 170 -153 34 -192 95 -98 -30
5240 -30 22 136 0 -189 44 112 337 130 -142 119 -152 198 237 -284 527 64 176 -39 -254 -104 -115 -3
5262 -3 -117 -4 139 -110 0 -92 -74 156 -49 -23 101 -156 28 53 -195 173 91 126 -59 -46 299 168 45
5285 45 8 211 12 -23 -56 -210 -79 -79 -359 -137 -231 -339 65 -101 -7 99 -22 172 -211 -325 -129 -189 -112
5308 -112 63 95 133 149 -159 20 67 153 135 43 74 193 -246 -161 288 99 -167 -102 100 -72 -73 -232 -33 281
5332 281 100 -170 25 -113 -32 167 -296 448 -72 -57 -22 174 -77 -89 -69 143 161 54 12 43 29 -71 -65 -266
5356 -266 -116 293 -51 -133 36 177 -206 -331 -60 -416 103 261 142 -236 94 2 -79 42 250 116 -43
$$ packed form
5193i2K20j79K56m17K2J18MJ16M4m2j32Q2o4l6j1J12M2j13J72J8K16m10k5J16
5217A7J41l69M89l38J92j01Q6k3k25K4L63r6j74r6J31lJ52l23J87k26K87j93O8
5240c0N2J14j36j89K33O8K25k07k72K61k71L50L9n21Q11m63J12k15k15J50j1J12
5262cj14J13J43k49J10r2J8K30k05K6J24k57J84K5k48L68q2L5j85J3L45j31j23
5285D5l7K03j99l5l3j54J31%k80K22r4j08M04j66R4J06j21J94l83j14J96o0P7
5308a12J75L2L8J6l08J79M7Q6j8r2L1J19m39Q5M49j89k66O5K02j72jj59J99L14
5332B81j81k70J95j38Q1J99m63P44n20J5L5J96k51j2K0K12J8j07m2L1j4j00Ok01
5356b66J50M09l44q2J69J41l83j25K71l56N19J58j19l78L30r2q1J21K08j34j59
$$ plain form
5377 -43 220 -39 -85 -80 118 269 202 273 76 -155 122 -330 -45 160 0 -153 227 65 34 63 278 -39 245
5400 245 2 -56 34 -67 -103 -360 159 47 -66 137 -17 139 -208 149 141 -210 -4 -58 172 -341 49 -62
5422 -62 -61 214 -23 29 223 130 -9 -9 113 200 -9 117 -212 -63 -102 135 196 325 -184 77 24 10 -52 16 264
$$ packed form
5377d3K63k59m6NJ98J51o7P1j97k31K77m52K85K05j60j53L80j62l1K9K15l17K84
5400B45k43n8R0j01l6k57N19j12j13K03j54J56l47L57ql51K06n4K30n13L90j11
5422f2JK75k37N2J94r3j39%J22Q7k09J26l29J49l9K37O1J29n09K61n3j4o2O8K48
$$ [...]
8191A9
##END NTUPLES=NMR FID
##END=
