##TITLE=1H_LR-579-H1-CR9
 D2O, 8 sc, 
 24.6.2019
##JCAMPDX= 6.0         $$ Bruker NMR JCAMP-DX V2.0
##DATA TYPE= NMR FID
##DATA CLASS= NTUPLES
##ORIGIN= UXNMR, Bruker Analytische Messtechnik GmbH
##OWNER= root
$$ XWIN-NMR		Version 3.5
$$ Mon Jun 24 16:08:34 2019 Russian Standard Time (UT+4h)  she@DPX200
##.OBSERVE FREQUENCY= 200.13155
##.OBSERVE NUCLEUS= ^1H
##.DELAY= (6, 6)
##.ACQUISITION MODE= SIMULTANEOUS
##.ACQUISITION SCHEME= undefined
##.AVERAGES= 8
##.DIGITISER RES= 18
##SPECTROMETER/DATA SYSTEM= spect
##.PULSE SEQUENCE= zg30
##.SOLVENT NAME= CDCl3
##.SHIFT REFERENCE= (INTERNAL, CDCl3, 0, 15.7039)
##AUDIT TRAIL= $$ (NUMBER, WHEN, WHO, WHERE, WHAT)
$$ ##TITLE= Audit trail, XWIN-NMR		Version 3.5
$$ ##JCAMPDX= 5.01
$$ ##ORIGIN= Bruker BioSpin GmbH
$$ ##OWNER= she
$$ F:/spectra/data/she/nmr/H-F/1/audita.txt
$$ ##AUDIT TRAIL=  $$ (NUMBER, WHEN, WHO, WHERE, WHAT)
(   1,<2019-06-24 16:07:31.48 +0400>,<she>,<DPX200>,
      <created by zg, POWCHK disabled, PULCHK disabled
       configuration hash MD5:
       00 E9 B6 7A A2 85 ED C7 34 08 36 98 17 FE 4E 26
       data hash MD5: 16K
       F7 5F 31 12 E5 8C 1B 97 CE 91 7A 7D 57 95 93 0F>)
$$ ##END=
$$ 
$$ hash MD5
$$ EC 77 04 73 5A D4 6B AA 14 42 36 73 8D 00 5B F9
##$RELAX= 
##$RELAX= 
##$RELAX= 
##$RELAX= 
##$RELAX= 
##$RELAX= 
$$ Bruker specific parameters
$$ --------------------------
##$DU= <F:/spectra>
##$EXPNO= 1
##$NAME= <H-F>
##$PROCNO= 1
##$TYPE= <nmr>
##$USER= <she>
##$AMP= (0..31)
100 100 100 100 100 100 100 100 100 100 100 100 100 100 100 100 100 100 
100 100 100 100 100 100 100 100 100 100 100 100 100 100 
##$AQSEQ= 0
##$AQ_mod= 1
##$AUNM= <au_zg>
##$AUTOPOS= <>
##$BF1= 200.13
##$BF2= 200.13
##$BF3= 200.13
##$BF4= 200.13
##$BF5= 200.13
##$BF6= 200.13
##$BF7= 200.13
##$BF8= 200.13
##$BYTORDA= 1
##$CFDGTYP= 0
##$CFRGTYP= 5
##$CHEMSTR= <none>
##$CNST= (0..31)
1 1 145 1 1 1 1 1 1 1 1 1 1 1 1 1 1 1 1 1 1 1 1 1 1 1 1 1 1 1 1 1 
##$CPDPRG= <>
##$CPDPRG1= <>
##$CPDPRG2= <>
##$CPDPRG3= <>
##$CPDPRG4= <mlev>
##$CPDPRG5= <mlev>
##$CPDPRG6= <mlev>
##$CPDPRG7= <mlev>
##$CPDPRG8= <mlev>
##$CPDPRGB= <>
##$CPDPRGT= <>
##$D= (0..31)
0 1.2 0 0 0 0 0 0 0 0 0 0.03 0 0 0 0 0 0 0 0 0 0 0 0 0 0 0 0 0 0 0 0 
##$DATE= 1561378050
##$DBL= (0..7)
120 120 120 120 120 120 120 120 
##$DBP= (0..7)
150 150 150 150 150 150 150 150 
##$DBP07= 0
##$DBPNAM0= <>
##$DBPNAM1= <>
##$DBPNAM2= <>
##$DBPNAM3= <>
##$DBPNAM4= <>
##$DBPNAM5= <>
##$DBPNAM6= <>
##$DBPNAM7= <>
##$DBPOAL= (0..7)
0.5 0.5 0.5 0.5 0.5 0.5 0.5 0.5 
##$DBPOFFS= (0..7)
0 0 0 0 0 0 0 0 
##$DE= 6
##$DECBNUC= <off>
##$DECIM= 24
##$DECNUC= <off>
##$DECSTAT= 4
##$DIGMOD= 1
##$DIGTYP= 9
##$DL= (0..7)
0 120 120 120 120 120 120 120 
##$DP= (0..7)
150 150 150 150 150 150 150 150 
##$DP07= 0
##$DPNAME0= <>
##$DPNAME1= <>
##$DPNAME2= <>
##$DPNAME3= <>
##$DPNAME4= <>
##$DPNAME5= <>
##$DPNAME6= <>
##$DPNAME7= <>
##$DPOAL= (0..7)
0.5 0.5 0.5 0.5 0.5 0.5 0.5 0.5 
##$DPOFFS= (0..7)
0 0 0 0 0 0 0 0 
##$DQDMODE= 0
##$DR= 18
##$DS= 0
##$DSLIST= <SSSSSSSSSSSSSSS>
##$DSPFIRM= 0
$$ [...]
##$SUBNAM2= <"">
##$SUBNAM3= <"">
##$SUBNAM4= <"">
##$SUBNAM5= <"">
##$SUBNAM6= <"">
##$SUBNAM7= <"">
##$SUBNAM8= <"">
##$SUBNAM9= <"">
##$SW= 24.9336996594482
##$SWIBOX= (0..15)
0 0 2 0 0 0 0 0 0 0 0 0 0 0 0 0 
##$SW_h= 4990.01996007984
##$TD= 16384
##$TD0= 1
##$TE= 0
##$TE2= 300
##$TE3= 300
##$TEG= 300
##$TL= (0..7)
0 120 120 120 120 120 120 120 
##$TP= (0..7)
150 150 150 150 150 150 150 150 
##$TP07= 0
##$TPNAME0= <>
##$TPNAME1= <>
##$TPNAME2= <>
##$TPNAME3= <>
##$TPNAME4= <>
##$TPNAME5= <>
##$TPNAME6= <>
##$TPNAME7= <>
##$TPOAL= (0..7)
0.5 0.5 0.5 0.5 0.5 0.5 0.5 0.5 
##$TPOFFS= (0..7)
0 0 0 0 0 0 0 0 
##$TUNHIN= 0
##$TUNHOUT= 0
##$TUNXOUT= 0
##$USERA1= <user>
##$USERA2= <user>
##$USERA3= <user>
##$USERA4= <user>
##$USERA5= <user>
##$V9= 5
##$VALIST= <valist>
##$VCLIST= <CCCCCCCCCCCCCCC>
##$VD= 0
##$VDLIST= <DDDDDDDDDDDDDDD>
##$VPLIST= <PPPPPPPPPPPPPPP>
##$VTLIST= <TTTTTTTTTTTTTTT>
##$WBST= 1024
##$WBSW= 4
##$XGAIN= (0..3)
0 0 0 0 
##$XL= 0
##$YL= 0
##$YMAX_a= 212402
##$YMIN_a= -362813
##$ZGOPTNS= <>
##$ZL1= 120
##$ZL2= 120
##$ZL3= 120
##$ZL4= 120
##$ABSF1= 10
##$ABSF2= 0
##$ABSG= 5
##$ABSL= 3
##$ALPHA= 0
##$AQORDER= 0
##$ASSFAC= 0
##$ASSFACI= 0
##$ASSFACX= 0
##$ASSWID= 0
##$AUNMP= <proc_1d>
##$AZFE= 0.1
##$AZFW= 0.1
##$BCFW= 1
##$BC_mod= 2
##$BYTORDP= 1
##$COROFFS= 0
##$CY= 11.3945322036743
##$DATMOD= 1
##$DC= 2
##$DFILT= <>
##$DTYPP= 0
##$F1P= 18.9103706918063
##$F2P= -1.10871071338519
##$FCOR= 0.5
##$FTSIZE= 0
##$FT_mod= 4
##$GAMMA= 1
##$GB= 0.15
##$INTBC= 1
##$INTSCL= 1
##$ISEN= 128
##$LB= 0.24
##$LEV0= 0
##$LPBIN= 0
##$MAXI= 10000
##$MC2= 0
##$MEAN= 0
##$ME_mod= 0
##$MI= 1.114404
##$NCOEF= 0
##$NC_proc= 0
##$NLEV= 6
##$NOISF1= 3.799351
##$NOISF2= 2.8
##$NSP= 1
##$NTH_PI= 0
##$NZP= 0
##$OFFSET= 15.70392
##$PC= 1
##$PHC0= -8498.031
##$PHC1= 5.000971
##$PH_mod= 1
##$PKNL= yes
##$PPARMOD= 0
##$PSCAL= 0
##$PSIGN= 0
##$REVERSE= no
##$SF= 200.130013532006
##$SI= 16384
##$SIGF1= 3
##$SIGF2= 2
##$SINO= 400
##$SIOLD= 16384
##$SREGLST= <1H.CDCl3>
##$SSB= 0
##$STSI= 0
##$STSR= 0
##$SW_p= 3612.71676300578
##$SYMM= 0
##$S_DEV= 0
##$TDeff= 0
##$TDoff= 0
##$TI= <>
##$TILT= no
##$TM1= 0
##$TM2= 0
##$TOPLEV= 0
##$USERP1= <user>
##$USERP2= <user>
##$USERP3= <user>
##$USERP4= <user>
##$USERP5= <user>
##$WDW= 1
##$XDIM= 8192
##$YMAX_p= 0
##$YMIN_p= 0
$$ End of Bruker specific parameters
$$ ---------------------------------
##NTUPLES= NMR FID
##VAR_NAME=  TIME,          FID/REAL,        FID/IMAG
##SYMBOL=    X,             R,               I
##VAR_TYPE=  INDEPENDENT,   DEPENDENT,       DEPENDENT
##VAR_FORM=  AFFN,          ASDF,            ASDF
##VAR_DIM=   8192,          8192,            8192
##UNITS=     SECONDS,       ARBITRARY UNITS, ARBITRARY UNITS
##FACTOR=    0.0002004,     1,               1
##FIRST=     0,             0,               0
##LAST=      1.6414764,     0,               0
##MIN=       0,             -362813,         0
##MAX=       1.6414764,     212402,          0
$$ Real data points
##PAGE= N=1
##DATA TABLE= (X++(R..R)), XYDATA
0 0 0 0 0 0 0 0 8 -8 8 -8 16 -16 24 -24 32 -40 48 -57 70 -80 96 -112 128 -151 169 -197 224 -255 289 -325
30 -325 368 -414 462 -519 580 -646 721 -798 888 -984 1088 -1205 1333 -1477 1636 -1813 2017
47 2017 -2245 2507 -2813 3171 -3600 4127 -4787 5649 -6820 8520 -11219 16189 -28429 124698
61 124698 72885 -236038 -213309 -102477 -3873 32098 144488 212402 137039 -70958 -197475
72 -197475 -185649 -85753 13408 129145 204710 157507 -28617 -193994 -216800 -111286 10255
83 10255 109385 168159 145766 12237 -142434 -200988 -137940 -29077 73697 150649 162437
94 162437 65241 -96756 -200938 -169332 -46625 73908 142277 148544 81430 -44944 -155239
105 -155239 -165758 -76202 40384 123824 155521 116902 1786 -130181 -176052 -98835 33693
116 33693 126408 145056 104094 22846 -74898 -139523 -120456 -21873 91935 151000 130930 48159
128 48159 -59391 -138460 -135176 -43737 73730 140129 125925 51555 -41048 -111354 -124379 -71758
140 -71758 20284 104639 135548 89746 -13562 -113895 -146422 -89751 13948 96239 115557
151 115557 75796 3471 -74277 -123646 -110015 -30276 66634 117742 97093 25025 -60186 -117828
163 -117828 -114963 -48063 45514 109104 107867 45806 -42417 -106412 -111101 -56254 26053 91349
175 91349 107550 65428 -11647 -83068 -109264 -74953 2392 79381 112588 83457 8295 -68892
187 -68892 -104101 -76782 -6958 62446 96380 85599 34877 -36761 -93569 -95584 -33355 51757
199 51757 102796 91392 34147 -30646 -74676 -83206 -49732 17474 82541 99382 55171 -16923
211 -16923 -72356 -87426 -58815 1642 63711 91577 66067 1290 -63516 -90717 -67337 -9330
223 -9330 49072 78419 64419 16171 -41851 -79751 -77014 -32977 30460 76157 74652 26886 -35312
236 -35312 -74454 -74007 -37911 15687 61305 73301 41900 -14384 -62288 -75303 -48170 4013
248 4013 53034 73755 53202 2141 -50150 -72147 -53041 -6052 43625 70294 59114 15254
260 15254 -35691 -63508 -54233 -16838 28824 61702 64156 31946 -19232 -58517 -61504 -27221 22770
273 22770 57647 60704 33908 -7909 -45085 -58200 -38904 3619 46214 63286 44665 126
285 126 -43147 -59830 -42799 -4030 34972 54494 44737 10555 -29891 -55591 -50859 -18299 23968
298 23968 50929 47832 18223 -20573 -49912 -53083 -27445 13332 45432 49263 24549 -12997 -42229
311 -42229 -49492 -31939 1705 34342 48844 35242 322 -35414 -50943 -37681 -4400 30370
323 30370 47677 38855 8695 -25590 -45136 -39818 -12535 22608 45207 42433 16753 -16713 -39772
336 -39772 -39899 -18546 12976 38773 44322 25775 -7897 -35902 -41749 -22903 6933 32531 40821
349 40821 29119 1849 -26897 -40514 -31253 -2632 27900 41472 31716 5396 -22358 -37100
361 -37100 -31696 -9889 17447 35907 35410 14083 -15647 -36821 -36422 -15271 12393 31464 32650
374 32650 16889 -8074 -29596 -36024 -22683 3494 26981 33863 20994 -3534 -25465 -33641 -24618
387 -24618 -3561 19187 31612 25600 4830 -19575 -33416 -28176 -7771 15768 29302 26914 9926
400 9926 -12329 -28508 -29007 -13391 10211 28109 29862 14803 -7143 -23986 -26560 -14727 4394
413 4394 21931 29267 21256 954 -19221 -27716 -18932 430 19367 28054 22382 5904 -13370
426 -13370 -24909 -21996 -5368 14336 26624 24441 9076 -9907 -23041 -23209 -11218 7690 22880
439 22880 24726 12432 -6728 -21942 -25511 -15160 2335 17983 22723 14547 -2136 -18819 -25886
452 -25886 -19278 -2305 14254 21579 15688 1040 -14321 -22650 -20040 -7684 9468 20707 19860
465 19860 6020 -10690 -21223 -20177 -8723 6809 18700 20510 11104 -4737 -17644 -20565 -11342
478 -11342 4967 18671 21667 13024 -1182 -12919 -16963 -12243 -529 14269 22334 18026 2925
491 2925 -12764 -17848 -11899 -1046 10015 17179 16712 7807 -6455 -17508 -17722 -6649 8674 17574
505 17574 15711 6331 -5482 -13980 -16256 -10301 1133 12459 16815 10578 -2990 -15463 -18394 -11614
519 -11614 -310 9218 13722 10573 706 -10494 -17677 -14659 -3673 8267 14257 11725 2360 -7706
533 -7706 -14254 -13846 -6242 5037 12374 13881 8056 -3009 -12932 -14885 -7356 4576 12782 14308 8652
548 8652 -256 -8806 -12929 -9404 769 11633 16378 11489 1157 -7394 -10948 -9473 -2885 7202
562 7202 14799 13888 4584 -7084 -13069 -10180 -1835 5780 9864 10503 6696 -1926 -11571 -14168 -7279
577 -7279 3704 11178 10485 5090 -1984 -8562 -12186 -10330 -1686 8923 12777 7230 -2362 -8900 -11339
592 -11339 -8910 -2758 4728 10246 9206 2451 -6506 -11935 -10104 -3158 4703 9407 9204 4163 -3701
607 -3701 -9327 -9670 -4986 2281 9027 10618 6100 -1419 -7665 -9310 -5762 1783 8771 10280 6265
622 6265 818 -3811 -7560 -7753 -2269 6428 12387 9477 767 -6738 -7354 -5256 -1962 2650 8387 10219
638 10219 4128 -4346 -8476 -6589 -2684 1549 5694 7816 5487 -767 -7367 -9573 -6217 861 7173
653 7173 7394 3314 -1428 -4878 -6793 -7091 -3374 3593 9097 7112 -558 -7054 -7072 -3708 -2723 -694
669 -694 5408 9395 4837 -4682 -9867 -6605 -383 2970 3846 5264 5041 829 -5755 -7677 -3706 2324
685 2324 5232 6369 5714 1289 -4885 -7349 -4010 1502 4289 5190 5440 3300 -2099 -6878 -7065 -1828
701 -1828 5184 8275 5353 208 -3141 -4115 -4062 -2159 -414 3407 7022 6110 -590 -8298 -8499 -1610
717 -1610 4081 3246 1674 3208 3135 -2782 -8635 -6922 731 6514 5880 1243 -985 -1581 -3361 -5057
733 -5057 -3564 1772 6431 6172 1684 -3341 -6330 -4884 -537 3008 3311 3141 3189 508 -4689 -6490
749 -6490 -2701 2210 4192 4453 3261 337 -3582 -5922 -3698 1083 4929 4471 1806 142 -1065 -3615
765 -3615 -5251 -2325 3216 5842 3887 359 -2450 -3519 -3914 -1708 1618 4319 4210 1546 -1655 -3376
781 -3376 -3490 -2352 274 3299 4653 2785 -906 -3380 -3658 -2707 215 3139 4029 2078 382 -1438
797 -1438 -3636 -3780 -683 3322 4059 1958 57 -643 -1213 -3490 -3817 236 5420 5396 583 -4079 -3358
814 -3358 -801 -584 -1555 753 3508 3800 521 -3759 -4857 -2501 1061 2968 2240 695 84 -1026
830 -1026 -2529 -3078 -1858 727 3392 3443 624 -2501 -3086 -1727 -1340 -9 2938 3741 1650 -1367 -2647
847 -2647 -2326 -1314 316 2234 3170 2041 139 -1882 -2447 -1580 -230 2040 3239 3224 1014 -2461 -3628
864 -3628 -1904 1064 1739 1576 1978 1536 -404 -2533 -3374 -1492 1934 3068 2432 -136 -1408 -1394 -1874
881 -1874 -1884 -528 2080 3155 2258 -845 -3119 -2928 -720 694 833 1670 1998 951 -2122 -3585 -2253
898 -2253 267 2057 1602 1004 263 -235 -1327 -2350 -1930 664 2710 2653 540 -863 -1672 -1580 -746 316
916 316 1891 2300 1564 -80 -1827 -1711 -737 151 1235 2019 2146 560 -893 -2225 -1685 180 1525
933 1525 2303 1628 71 -969 -1516 -1550 -591 961 1955 1879 471 -691 -1742 -1778 -712 487 1435 1403 920
952 920 -87 -1314 -1697 -1454 -242 872 1906 1585 -513 -1751 -1694 -696 -405 588 1208 1764 345 -1392
970 -1392 -2546 -1510 143 1472 1040 599 738 62 -1141 -2096 -1266 802 2367 2173 250 -1173 -1567
987 -1567 -721 -192 122 369 1486 1977 531 -1331 -1929 -818 771 1336 970 580 717 -307 -1246 -1327
1005 -1327 -597 1344 1852 1468 -80 -1093 -1303 -907 58 528 912 1042 804 -213 -1140 -1246 -987 151
1023 151 816 925 412 -316 -759 -1356 -1122 -605 381 1050 949 46 -1002 -1307 -898 -39 574 944 875 609
1043 609 -224 -1124 -874 -322 690 1035 1006 674 246 -398 -845 -519 351 1245 1278 632 -217 -519 -566 -532 -43
1064 -43 473 1362 1039 348 -494 -1001 -310 -284 238 594 853 501 -146 -1370 -1294 -524 382 1038 1013 -65 -637
1085 -637 -561 -847 -760 -292 696 930 608 -662 -1011 -948 -775 290 454 502 635 714 10 -1142 -1267 -303 1017
1106 1017 1418 563 113 -264 -370 -570 -679 49 693 1129 533 -397 -666 -546 -70 304 381 655 611 380
1126 380 -196 -1407 -642 404 1024 1195 261 -444 -701 -310 -271 -222 -185 466 982 575 -672 -1100 -553 26
1146 26 224 96 229 60 137 -763 -1419 -884 296 776 523 -313 -553 -255 -44 -189 -192 231 818 1029 193
1167 193 -610 -995 116 556 728 465 -169 296 203 -171 -776 -446 698 873 551 314 -123 -126 -128 -120 -216 82
1189 82 230 574 127 -575 -342 -522 -120 276 655 358 -368 -102 -563 -537 -488 225 778 241 -320 -576 -828
1210 -828 -41 75 -167 71 437 625 -77 -641 -701 -350 304 719 231 338 -46 -53 -512 -693 345 756 784
1231 784 81 -64 52 -106 -221 -230 -82 765 1066 170 -562 -411 81 452 130 -379 680 760 -118 -1034 -912
1252 -912 -147 581 652 -3 -9 27 -254 -384 -788 -237 453 882 171 -397 -556 -294 -87 -253 -196 255 551 34
1274 34 -913 -877 -2 278 537 256 -106 -25 -301 97 395 -91 42 344 526 575 352 -293 -800 95 977
1295 977 186 -402 101 305 502 -598 -761 255 901 448 -90 -350 -128 -13 -83 -679 -487 306 506 -86
1315 -86 -577 -740 -312 855 483 -812 -557 378 843 -324 -1387 -429 947 615 -424 -733 -86 111
1333 111 376 -1042 -848 104 784 483 -596 -504 179 -40 -293 -199 300 98 123 421 -92 -250 64 78 230
1354 230 500 79 408 6 49 22 330 260 342 229 147 271 -219 -388 157 593 780 -203 -447 421 361 -591
1376 -591 -1159 214 1015 568 -716 -875 275 408 -87 -845 49 750 876 -133 -1152 -414 717 308
1394 308 -107 -287 152 42 -441 -441 -514 -91 164 276 -477 -400 419 -53 -611 -628 -33 408 363 -391 -936 -236
1416 -236 437 426 -440 -333 739 620 -450 -259 -118 734 341 66 112 56 340 126 -281 -345 239 517 221
1437 221 -214 -419 391 -5 -210 56 305 204 430 69 -25 -435 4 -17 -183 193 318 -444 -490 -172 525
1458 525 176 -306 -313 393 531 50 -621 -655 243 611 -278 -886 -249 694 209 -652 -631 1 559 111 -470
1479 -470 -476 372 532 232 -605 -801 765 545 -13 -611 -359 641 244 -97 -357 199 783 489 -264 -630
1499 -630 110 501 370 -107 194 347 297 -201 -370 -113 -282 62 -155 -94 -209 302 -233 -420 317 243 210
1520 210 -507 -99 -264 89 -13 -207 149 123 170 -91 -705 -399 38 186 -639 -117 231 245 -23 -451 -164
1541 -164 11 83 -207 8 123 230 -140 -346 -296 499 445 -112 -528 -241 312 -4 -83 -223 272 477 393 -294
1563 -294 -306 128 11 -30 -469 21 552 242 -287 -113 -30 420 26 -77 -469 -130 416 221 -703 -121 226
1584 226 438 -334 -295 -70 250 102 -183 -303 -57 125 315 30 -468 -484 -81 170 -209 -174 -113 171 15
1605 15 -43 8 179 180 185 116 -197 -35 -250 -232 241 26 -112 270 -280 -104 -325 -395 154 245 197 214 -525 -93
1629 -93 544 40 -454 -409 200 641 129 -406 -426 15 173 97 -454 -366 -77 365 -178 -43 -4 243 370 126
1651 126 -169 -211 118 179 -276 -451 210 80 106 -275 117 -83 562 -307 123 188 240 177 110 -296 70 -3 161
1674 161 406 -90 -91 -147 34 -10 223 -442 -72 52 212 -100 -173 43 -59 -109 -110 -279 68 -242 -119 -64 -193
1697 -193 41 163 122 72 -188 -120 405 19 -82 171 -248 -293 -13 -29 -90 250 147 -341 -141 32 363 28
1719 28 -268 -220 -48 492 170 107 294 -446 504 69 -296 -198 283 377 95 -440 42 342 56 162 -159 165
1741 165 427 424 41 -106 36 370 304 7 -81 -55 -41 64 -77 -48 -21 206 -8 -272 -199 33 -156 107 -553
1764 -553 -289 -15 334 326 215 -158 -355 298 180 28 -217 -106 206 261 -99 -46 -356 56 218 190 168 -155
1786 -155 191 157 -51 80 -162 106 486 -20 -151 -269 167 379 204 -200 -24 231 148 5 -295 198 237
1807 237 254 -29 -259 219 21 60 146 -1 -50 -8 -7 -378 -126 6 -25 -53 -388 -208 -382 -102 -167 -28 51 24
1831 24 395 -88 -46 160 -244 -47 73 -161 85 -131 -195 -103 3 4 223 132 204 -394 47 363 25 115 150
1854 150 -18 157 139 158 145 57 -75 -106 -185 50 302 53 -89 -232 -1 46 -406 245 253 107 385 -151 237
1877 237 -150 180 -105 -52 -168 -558 -116 -265 30 116 -334 -180 -95 104 -102 29 -92 -182 273 -354 -346 -85
1899 -85 -261 -134 -469 -545 -392 315 93 14 -398 178 -127 141 165 -383 380 252 -6 -43 -125 109 404 45
1921 45 139 -269 79 213 284 -96 -218 -127 199 195 -150 -56 -5 4 -63 -182 -50 -212 29 136 -73 -132 23 93
1945 93 109 160 -38 -24 52 16 -328 69 45 -30 253 -63 -210 -168 87 -32 218 -201 -301 -191 290 149 17
1968 17 -151 66 379 118 -281 -11 15 81 83 -233 -328 326 267 -12 -423 -247 519 206 118 -453 115 392 92
1991 92 -264 -228 242 244 -23 44 -205 220 41 -439 -51 232 164 -33 -172 119 17 202 198 -212 -96 -250 -9
2014 -9 -279 -131 -124 14 -201 8 -91 -239 47 -27 -50 8 32 282 -221 -371 -24 362 -103 -182 -61 -17 375 -105
2038 -105 -366 114 3 105 -286 -112 51 121 284 -22 83 222 44 49 -6 289 -104 -2 -87 -127 -59 97
2060 97 249 -25 30 114 479 -482 -87 -22 51 199 -425 -59 86 318 82 -405 -123 211 261 43 -243 308
2082 308 342 77 -205 -548 63 -213 48 28 -227 138 494 -159 -322 -122 94 321 -46 -64 -343 210 246
2103 246 115 17 -213 64 -180 -184 -145 148 170 -5 -211 160 5 -327 -316 119 356 57 90 -354 174 192 -5
2126 -5 -231 -170 413 145 -222 -422 -31 542 -172 -146 -350 -152 275 348 -342 -174 -74 85 -91 -128 91 70
2148 70 362 5 -101 -283 384 285 -219 -316 61 407 63 -390 -205 358 161 -9 -311 8 508 219 -222
2169 -222 -191 374 481 -28 -245 -71 583 162 18 -210 219 -106 172 -148 263 -97 479 70 -177 66
2189 66 183 397 -64 -60 -84 -19 -122 -6 -176 12 -170 -36 -212 130 -27 -223 -181 -110 -222 196 -149 -188 30
2212 30 171 -151 -342 -152 186 -86 36 -332 -102 106 388 3 -192 -301 157 -60 -212 90 -33 373
2232 373 222 -109 -213 202 329 79 -64 160 391 438 32 -248 -104 296 -11 -79 -70 -200 188 197 -74 37
2254 37 1 245 166 -1 -85 -57 49 -3 -98 -14 55 -77 237 -254 -357 183 -435 -52 1 -36 237 -82 -155 -43
2278 -43 -107 -182 193 315 -29 -205 -61 31 39 63 -192 -80 107 164 41 -115 -152 150 337 -63 -121 -92 -61 148
2302 148 296 -330 72 29 75 -315 -128 -101 -14 -72 81 -3 144 209 115 -166 -88 245 181 -173 -290 -116 -190 -45
2326 -45 357 -269 -99 -237 71 -443 -270 6 -200 189 -122 96 39 185 -88 -37 75 35 -66 127 -162
2347 -162 168 62 119 -130 29 -40 -15 325 -75 -40 100 76 -101 72 38 -57 -46 150 191 1 191 -29 -2
2370 -2 150 264 47 -12 79 59 188 -259 20 344 -49 113 -138 -226 46 -295 -58 -33 21 40 -311 -231 42
2393 42 217 58 7 -190 229 -83 -28 -85 -136 65 165 172 -256 -59 -47 173 187 284 -262 -159 -11 71 156 73
2417 73 119 151 267 153 -217 -38 -214 57 -70 -239 -120 258 67 -30 -89 145 243 -138 -156 -99 127 173 -116
2440 -116 142 -103 46 106 -32 23 -256 -71 92 43 -175 -268 9 80 196 -39 -197 -41 124 102 -145 130
2462 130 -175 187 -136 -374 -40 -116 203 384 -157 163 106 -124 5 -174 -53 56 128 234 16 -37 46 -28
2484 -28 273 56 148 -82 -187 -155 -140 -132 106 2 -49 330 206 231 114 -208 46 219 -75 -172 -142 -81 303 389
2508 389 -115 -172 266 -31 -29 -72 -188 213 114 106 -267 -37 -115 -170 141 -327 -51 5 -232 -373 7 -33 -356 -38
2532 -38 99 -38 58 -113 -17 -203 234 57 -66 179 -39 122 196 456 122 -77 -54 -200 106 280 -141 68
2554 68 250 -18 -38 142 78 -113 117 -93 199 311 -176 -172 -81 205 -229 -368 -126 132 66 -218 -164 -33 120
2577 120 223 -23 102 -7 78 169 -152 -32 -127 -145 215 -82 163 96 184 213 102 -314 -94 151 -395 291
2599 291 -283 84 -81 17 -187 239 138 46 229 47 149 62 -232 94 -163 -251 -28 -228 12 -97 -57 152
2621 152 -67 -52 1 45 -8 64 -74 39 -61 51 183 139 149 24 231 48 201 82 45 -16 166 4 -139
2644 -139 28 58 -248 -154 -331 -194 50 133 -154 -84 147 117 -254 222 -18 158 193 -400 -11 9 -104 31
2666 31 -230 -92 -129 -140 62 190 -171 191 117 123 71 -64 394 208 -248 -73 -214 274 270 -35 29 -74 -87 -56
2690 -56 -312 -399 -306 85 69 -332 45 185 39 -116 -121 -172 -69 -56 -351 276 148 -118 -40 -58 73 -237 26
2713 26 199 -138 149 -276 -58 -214 29 70 -77 -128 -215 336 289 93 -70 131 264 220 157 -82 -28 233 219
2736 219 62 206 288 182 35 -58 -351 -105 220 -44 0 181 -38 112 16 -220 117 51 -17 -226 -10 -5 -61
2759 -61 6 71 -82 -55 -65 -110 -146 125 152 32 -27 32 -103 69 -234 5 -213 190 -50 -183 -36 361 -56
2782 -56 42 46 -6 194 -233 12 -74 -127 369 49 -264 -36 171 -48 -115 -188 -172 -15 -114 126 201 -24 25 68 -91
2807 -91 -286 -91 48 -41 -2 -169 97 259 -20 -70 -136 175 158 51 -47 -119 184 110 -67 -6 -54 144 200 -44
2831 -44 -227 160 -51 -266 -68 257 -124 96 -73 -159 -292 433 12 -142 -167 236 257 -160 -104 62 76 64
2853 64 -27 -204 -97 -49 38 153 7 310 58 -7 -51 118 -167 9 56 138 328 214 208 87 50 305 -159 -149
2877 -149 -96 259 93 -35 -143 265 141 190 226 -148 49 257 9 -99 -334 -190 143 5 -119 -472 -181
2898 -181 -109 66 86 25 317 -245 73 53 202 92 185 -143 -348 -87 -56 -87 -22 15 -350 148 -275 18 221
2921 221 -19 278 114 3 117 -27 101 -44 -72 230 186 -33 35 -29 240 -209 -11 -6 -67 55 -229 32
2943 32 33 -9 -188 -289 -20 31 72 49 90 -278 11 35 160 -198 77 -8 -35 -111 281 65 42 -70 -18 3 -29
2968 -29 -91 -182 -12 -58 137 -186 -103 -326 128 86 -79 94 73 -191 -251 3 -369 59 95 38 -32 -159 177 75
2992 75 -335 0 118 213 103 -34 126 -178 238 -65 215 -24 -78 265 -62 -171 -124 375 260 -226 -192 153
3014 153 -132 -92 154 -182 -87 -57 89 -175 -115 68 -177 -74 163 -133 81 109 5 -4 -1 -35 45 170 -215 -55
3038 -55 59 250 219 93 60 277 151 143 -114 199 -307 -42 -34 10 287 28 101 -89 39 60 205 128 -204 146
3062 146 -155 -20 146 44 -206 -144 -35 234 264 -177 -290 -233 61 50 -145 -278 -129 229 84 183 123 143
3084 143 163 86 -300 57 355 62 201 -90 55 -24 -262 144 8 -81 473 182 113 -26 -20 -110 110 115 -21
3107 -21 26 155 172 9 112 -110 -188 22 -10 -4 136 -289 229 34 144 -175 -44 -201 112 32 16 -188 21
3130 21 -49 -63 -43 -437 392 26 -420 -51 -34 171 -195 143 33 339 133 0 73 -100 69 35 99 -207 370
3153 370 231 -129 86 278 65 183 192 -307 -41 -19 -128 -395 -231 57 -62 77 -6 -68 -339 255 -38 26
3175 26 48 200 140 -148 128 -120 -246 -98 -170 -473 47 51 68 62 -42 -33 -140 249 -150 -5 -385 114 174 58
3199 58 51 118 113 -20 48 26 264 -123 -99 169 95 -100 -247 -143 -277 52 145 34 124 307 -29 15 -11 127 49
3224 49 92 -69 -167 209 -45 74 28 339 25 -37 -110 53 -228 -111 181 105 -20 51 275 -119 10 -102 -242
3247 -242 -212 -25 -111 177 311 -123 191 114 76 183 -84 -93 89 175 141 -56 -29 -50 323 -23 77 15 -102 -23
3271 -23 140 39 158 100 13 192 174 -70 -83 62 -100 157 -126 -51 204 -113 7 -195 -120 105 113 -54 86
3294 86 -125 54 154 -76 391 171 -53 -171 -76 -54 34 -26 -2 -51 -81 -193 -163 32 165 135 -1 280 230 -42
3318 -42 261 230 113 -143 -19 48 -204 -40 269 -121 -170 -162 240 23 -95 296 323 -91 49 -156 -64 -96 214
3341 214 278 38 -99 -205 123 -139 -115 162 -19 -14 175 -46 143 -86 146 -5 -122 -44 -45 104 -43 -211
3363 -211 325 -321 -4 151 -229 -216 108 251 62 121 221 -140 -234 64 -66 106 261 -139 26 -42 -150
3384 -150 49 -177 -148 60 -223 77 127 -222 -45 -262 239 -140 261 38 -268 102 -73 -3 -141 -256 193
3405 193 21 -91 -124 94 123 142 56 73 6 -206 202 -145 -13 -17 190 -142 243 29 54 -158 -88 -74 -78 -151 -108
3430 -108 148 -170 -210 104 -78 -46 23 30 57 -172 -35 56 140 0 157 -79 32 0 -51 -82 78 8 11 194 -227
3455 -227 -142 267 -50 95 27 85 -32 197 1 -161 53 -56 13 -3 15 216 66 -104 114 2 -161 -151
3477 -151 -235 136 -77 -18 -22 123 -176 -174 -51 -125 96 196 16 -70 64 -29 -30 159 12 -187 -107 161 -117 -232
3501 -232 169 82 248 -110 387 -9 -20 277 -72 187 -159 -98 315 -271 -310 156 -55 50 53 123 -483 85
3523 85 -145 -70 -80 126 -65 -47 -81 274 183 49 -33 128 107 -73 -46 -155 307 -131 -133 197 135 33 110 -14
3547 -14 15 116 104 106 -340 -326 -187 -19 -3 174 21 0 11 193 -89 187 238 168 18 -76 -143 210 193 107 -50
3572 -50 -5 -139 -167 -1 121 214 -9 312 12 -102 -4 35 -35 -100 -20 147 29 -5 200 -51 48 -235 21 284
3596 284 -19 216 -296 -258 -113 216 342 -273 18 44 257 6 54 442 176 271 174 52 153 -168 282 -49
3618 -49 210 88 -117 49 70 284 73 249 -59 42 -65 -111 27 100 -419 -237 162 121 -351 190 -411 -130
3640 -130 -213 -87 -33 174 61 -189 -106 -73 -16 -10 -119 -37 125 -8 -100 -142 -303 2 164 -400 65 -24 31 132
3664 132 98 261 -245 -72 124 135 260 -136 -166 -335 19 41 139 -212 63 86 -112 34 -85 25 10 -36 -34
3687 -34 157 -242 111 -121 212 194 43 43 -1 -34 39 164 -212 -44 41 -146 -56 109 -173 164 326 -56 15
3710 15 30 43 131 -96 -191 -113 42 222 188 -32 -186 46 -13 -201 -170 23 -398 229 -47 -246 -92 -56 95
3733 95 -126 17 258 -23 4 -2 64 -28 40 180 8 -30 213 -87 -254 55 -8 39 -139 339 -21 -93 -149 42
3757 42 119 -215 317 -103 -31 193 224 -145 222 -17 -51 -13 169 -105 -126 200 -20 214 -13 -66 177 -63 -517
3780 -517 36 157 -149 -129 9 50 102 -16 -106 -222 84 -38 -55 29 212 272 364 -43 -117 287 191 -49 111
3803 111 -184 -115 115 130 113 174 -17 355 296 -28 -283 128 1 61 73 -40 31 11 73 -145 24 17 -179 84
3827 84 -76 -287 419 -354 54 -550 -58 -156 -86 -185 156 186 -7 198 -58 -43 -296 120 -250 -133 168 282
3849 282 22 -78 -398 -87 -115 -24 251 -339 145 -32 24 -31 -66 -152 -90 -18 25 -32 309 66 -36 107 169 41
3873 41 -97 -198 -93 11 -173 77 -246 -194 -104 -57 3 233 -63 -157 35 -46 189 99 8 -199 -74 -115 31
3896 31 -87 -218 431 122 -187 -103 229 92 77 -260 134 -6 -193 201 -296 23 -129 -219 -248 -403 -242 221
3918 221 77 119 -326 20 -257 -6 -117 -223 135 -94 227 -139 182 168 79 74 -47 231 -617 -105 172 -23
3940 -23 216 -193 -170 137 -76 21 -110 -14 -96 230 183 -93 32 -72 57 -7 146 189 23 -85 -445 -72 -416
3963 -416 -199 -225 -194 -55 -110 -45 235 -46 -308 236 -167 100 94 48 91 -81 177 -366 -221 49 124 274 -177
3986 -177 266 -106 -118 356 75 208 -27 -12 86 -426 -99 6 -111 55 -264 -134 -13 -79 155 138 66 88
4008 88 -248 -45 118 -12 269 -13 3 -80 77 -12 67 91 -103 311 -43 -95 24 154 -56 -190 160 213 155
4031 155 136 88 -112 -160 59 -80 40 91 -37 -197 -149 169 225 32 -106 -8 110 82 63 -83 -84 -247 6 -251
4055 -251 305 -120 -80 -100 -291 -62 123 -30 119 -36 -204 -83 183 -209 -17 151 213 8 -66 -171 -47
4076 -47 -347 52 -172 -155 -51 39 90 -75 -44 164 -66 -232 67 165 -77 -156 -69 30 39 129 202 -72 -92 149 144
4101 144 -200 -9 -87 504 -1 -202 94 163 -69 349 -63 -288 43 71 84 -295 -214 12 102 -294 -82 -170
4123 -170 -112 21 -39 -205 -7 9 -14 -321 -96 315 -12 10 -126 -77 55 154 152 -125 -222 59 137 -85 202 -8
4147 -8 -52 -238 386 -233 301 -138 160 -227 40 91 -288 49 242 42 -117 273 100 99 -130 270 138 8
4169 8 446 -142 -29 160 -117 243 45 -20 511 112 -113 -72 -45 19 69 239 137 -95 -295 140 -266 -130
4191 -130 -102 242 -68 -59 142 -22 -117 181 -94 140 178 -302 -161 -318 -22 -134 -10 77 -86 -168 298 -103
4213 -103 -112 -191 -47 75 -74 -170 -46 292 -226 41 44 66 -15 76 -166 88 11 330 366 -478 -22 101 -51 144
4237 144 -399 -151 -89 -175 64 -60 292 85 122 224 -53 117 30 61 7 -231 -158 166 5 -156 -30 -79 -35
4260 -35 -122 285 -13 281 -238 -35 -49 6 105 -122 -46 64 143 -107 78 -233 -11 -260 216 107 89 -161 222
4283 222 96 -72 27 36 146 163 -287 252 -303 -253 176 -76 114 -44 104 -255 255 -202 -223 175 206 -59
4305 -59 -241 62 29 227 74 -324 -96 -11 126 -235 93 241 131 69 17 41 194 -161 255 -121 -217 -64
4327 -64 45 10 -193 116 93 -66 -61 -28 -209 220 -100 206 -70 43 150 100 218 185 160 -74 -253 -89 35
4350 35 0 -215 271 44 -23 -209 -277 -52 -229 216 412 -227 -51 -206 224 78 -15 71 -111 122 -36 177
4372 177 92 176 272 -132 -86 195 172 162 -85 81 -112 -38 -158 -47 -158 179 138 181 49 109 68 -2 -94 -70 -263
4397 -263 -113 288 -60 34 -126 174 160 232 -182 36 28 107 16 145 421 286 -155 -268 -42 59 12 30 12
4420 12 -231 39 216 -239 -83 144 106 -187 -56 255 101 -1 -79 16 47 -97 -34 -54 35 183 -220 -16 104
4443 104 -41 -12 129 -55 170 -197 129 58 8 -297 -100 -30 -108 27 156 78 -151 111 -32 -220 111 36
4465 36 -38 -150 -169 68 -156 368 -187 -53 -56 -236 390 33 212 -208 37 -63 -139 26 -200 -556 -30 -21 161
4488 161 -83 -149 70 -34 62 10 54 -382 132 -59 32 122 -222 10 -84 345 224 -312 -20 185 94 195 223
4511 223 -158 -402 35 22 156 41 -223 81 215 -225 69 -147 181 279 32 21 -260 57 -96 55 -45
4532 -45 -74 -130 268 213 194 267 41 150 14 93 111 252 -329 175 -58 -154 -242 -350 246 -23 -64 -97 -68 -5 82
4557 82 259 234 16 -72 -397 -318 -374 -268 18 252 338 31 -45 -74 23 160 -192 -263 -221 -39 5 -50 -242 -267 8
4582 8 33 -99 38 178 82 63 -122 -184 -54 73 -97 -128 -225 -10 25 -190 46 116 81 77 -110 -10 -4 -52 44 25
4608 25 68 36 78 214 -215 48 -116 183 -46 125 155 13 179 -51 -120 207 -177 -53 52 -48 -42 154 -45
4631 -45 37 89 208 297 322 -66 -100 -61 -120 139 -31 -168 -413 -208 216 238 96 90 -39 227 -90 54 -120 -94
4655 -94 -192 57 -30 94 -290 -167 -63 40 130 -37 -221 62 -34 136 -125 -334 -73 -197 -413 -55 230 -117
4677 -117 -3 184 -53 -50 -38 367 147 -53 -106 -92 47 -183 116 -227 176 -218 -57 -142 -120 -112 85 -95 73
4700 73 165 -65 19 71 524 -232 27 -4 128 -112 -69 -192 172 -152 -129 -42 105 -287 -169 -303 66 82 437
4723 437 -91 -136 45 60 -44 -311 -178 -241 -179 -81 -202 -282 -293 -13 -450 57 -237 52 43 -64 -67 -321 -69 -107
4747 -107 17 -119 -43 106 216 -144 255 189 71 -97 -106 39 -284 -95 36 -254 42 127 103 -120 -283 -172
4769 -172 -20 88 -84 51 -182 -373 19 -41 -73 -287 10 241 122 -41 13 176 -139 119 -253 -33 63
4790 63 44 -28 -150 -152 32 56 -124 167 -96 -101 331 -18 415 56 54 -4 -236 148 128 120 -101 82 68 185 -90
4815 -90 100 149 40 -66 -99 70 46 59 113 284 -95 -102 121 295 -64 -40 -150 94 70 -170 102 359 263 157
4839 157 156 7 154 14 137 -203 191 278 -186 -177 161 110 -113 -44 -58 146 398 60 130 -148 137 -231 -193
4862 -193 88 -39 -58 34 127 7 3 239 -112 121 -95 140 -157 79 108 6 222 316 95 -47 -135 97 -253
4885 -253 -201 55 -494 -340 -97 9 26 60 169 138 300 128 72 160 -250 17 64 308 32 -60 -103 124 -204
4908 -204 -267 16 -21 98 -187 -194 -37 356 -88 -7 -47 93 -85 54 -75 49 -266 89 -236 100 41 -185
4930 -185 170 -163 144 212 -92 55 -11 -56 45 4 44 410 312 148 80 -67 106 345 -1 138 19 49 190
4953 190 149 16 44 -144 -151 -186 -149 -39 94 121 -9 5 210 -51 -1 236 -43 -227 -59 134 -273 -245 213
4976 213 364 -50 -68 276 -8 293 -10 -344 26 313 11 -41 312 -167 19 27 -52 171 179 265 -74 216 156
4999 156 -68 -137 137 -277 -174 1 67 66 -328 117 -11 171 -89 -226 153 176 219 205 -72 -83 -189 55 198
5022 198 347 132 175 -69 -52 143 -194 -4 16 14 184 89 248 27 -141 171 -234 34 -172 50 161 80
5044 80 58 -203 49 231 -121 -77 11 -32 -31 -194 -160 116 -190 350 156 51 -35 11 38 159 136 -90 -65 -131 -36
5069 -36 7 -89 32 71 -132 -187 -237 113 -14 -349 6 45 -165 8 -210 -101 -116 -8 89 -231 -188 -60 -59 -245
5093 -245 -194 -232 77 24 -35 224 12 -47 -119 55 -84 185 47 -27 222 -22 -200 89 34 415 -70 -43 348
5116 348 -150 51 90 173 65 -26 -130 184 155 -41 -126 -89 183 -82 -103 382 277 181 247 65 -123 -25 0 -113
5140 -113 -193 30 125 -149 -77 244 56 5 107 -63 -206 -170 -197 110 -17 162 -162 -1 322 -187 32 -107
5162 -107 91 -67 -59 246 246 97 122 -93 -23 188 -64 -209 216 -141 -65 52 -17 -103 42 35 33 -99 345 79
5186 79 -52 -24 105 245 -32 408 -8 231 -63 113 103 1 251 -114 82 -146 15 -17 117 386 -118
5207 -118 325 -63 -187 299 51 98 -47 51 -76 -66 99 14 -98 -136 -217 193 -145 -240 95 233 -13 129
5229 129 48 -114 -282 3 124 233 -317 -51 -87 -244 33 -228 -6 -105 46 -95 -28 28 29 -55 43 79 200
5252 200 54 218 -208 -91 -34 -78 -235 283 -185 226 -91 12 77 -355 169 198 54 -220 8 -3 193 -234
5274 -234 -188 -206 -107 66 213 122 -67 44 -90 36 28 -93 -183 -255 302 100 13 112 222 225 53 -55 135 -132
5298 -132 -112 -228 -174 46 75 -282 -460 201 -282 255 3 19 134 -247 88 -4 -233 -59 -87 153 -83 132
5320 132 45 53 -40 85 -305 102 -107 325 -248 28 -9 36 169 64 250 13 -462 63 -233 -139 193 107 34
5343 34 59 -126 375 110 -43 10 -132 -180 -146 30 -38 242 126 0 -45 63 -183 -39 -100 191 29 25 -365
5366 -365 -43 349 56 -107 -9 184 -99 -221 74 -69 207 26 99 -52 188 -120 149 -64 62 15 -3
5387 -3 -117 96 213 68 -154 294 -5 3 -180 -45 12 -260 232 186 242 -133 164 6 252 -51 193 -240
5409 -240 -54 -298 34 -90 -219 -152 97 19 -193 148 329 -26 -44 -268 4 -255 88 -138 -108 266 -202
5430 -202 134 101 355 -275 107 249 -128 82 -168 187 131 -60 64 306 -98 -287 -304 104 -109 -12 311
5451 311 -22 -70 304 -3 -5 246 -36 141 -189 -361 -98 40 -70 198 -101 -86 -168 -206 36 -32 -11 -256 -25
5474 -25 550 155 57 315 -269 178 89 -24 -15 46 -169 -95 -111 242 162 253 101 39 -144 -278 -9 80 -76 -198
5498 -198 130 91 131 -185 -11 -213 19 112 -146 74 215 32 91 97 18 169 196 304 285 74 0 331 -68
5521 -68 -214 -85 -191 97 -341 -109 116 -149 40 203 74 6 174 286 -73 -271 -49 -264 64 -20 197
5542 197 -148 275 -96 -56 -156 183 82 -98 18 -189 -35 -210 22 -184 21 -97 158 139 -67 -42 86
5563 86 10 -103 -140 -102 138 297 -2 88 14 140 -424 159 69 -112 -41 301 103 -166 -352 -120 16 -9 1
5586 1 342 -261 165 -87 406 -5 -115 63 -179 -78 -217 92 -265 -110 190 -142 88 -327 50 66 -71
5607 -71 -132 8 -37 49 119 -277 -244 213 333 198 -86 -46 35 -342 263 184 42 19 150 -25 287 -62 -342
5630 -342 -51 -107 -11 -267 83 133 -187 49 -218 -111 -41 -108 -225 61 -11 54 -98 9 89 195 -322 -81 -47
5653 -47 -24 -128 -87 -101 147 282 238 13 111 -110 -218 -297 -213 63 324 99 82 290 -221 249 -96 -212 22
5676 22 90 -211 85 -72 -56 9 201 -159 64 30 43 -73 145 -22 55 -306 -423 136 -387 393 264 108
5698 108 -216 120 -90 129 7 -89 145 167 224 150 -124 -10 25 -65 -237 -72 -145 -222 16 34 -173 8 88
5721 88 -372 -285 87 17 -239 160 -95 -113 213 -18 -130 212 136 50 143 128 124 -208 -80 70 200 99 -54
5744 -54 49 247 -92 173 12 -40 121 176 5 -112 142 -369 108 261 -74 -118 83 14 81 -142 162 71
5766 71 174 -65 -99 20 303 -166 -302 -55 -49 40 -123 102 292 21 58 -103 -216 -99 -73 -84 -60 -95 -189 -66
5790 -66 -14 -153 226 259 -70 -117 -159 62 7 -181 -30 97 -24 -280 110 200 -112 133 -296 113 46 -253 79
5813 79 23 -98 169 -193 -121 -340 -92 -199 86 -239 -90 106 -133 -30 -101 83 26 113 -22 238 -117 42
5835 42 54 -165 8 53 24 50 178 -183 214 211 31 -152 47 -5 147 -2 4 -72 332 -132 -39 -7 -8 -176 -11
5860 -11 -81 -6 122 -8 -65 93 -265 237 -45 117 31 -136 -197 3 67 148 -26 123 -29 -55 74 27 -238
5883 -238 -97 -260 -235 -53 -52 194 143 -240 -137 186 96 64 -199 -67 -7 57 20 -192 216 59 15 263 -133
5906 -133 82 30 139 -117 18 31 -257 203 -174 -407 -34 -259 -228 145 102 -4 159 -26 222 413 159
5927 159 -33 -269 -272 -7 -46 -399 350 -1 -173 -159 -2 -135 191 -45 156 19 -179 -52 -278 -18 -202
5948 -202 110 -43 -13 -193 -139 51 156 -212 112 -170 131 92 -123 -33 -198 -7 -239 57 -90 -122 64 -8
5970 -8 214 -134 99 -33 74 156 163 -34 -49 -418 -92 -130 164 139 123 -51 -212 147 -87 -66 -15 175 -15 167
5994 167 -106 172 218 -102 10 -15 12 97 -95 -33 -80 358 -56 82 -227 -56 118 -203 -1 -1 86 229 59
6017 59 -23 0 109 -22 -196 181 309 -10 251 86 55 -146 -44 -167 6 0 111 333 143 70 416 -286
6039 -286 389 100 -148 88 -356 -184 4 305 152 -274 -157 121 -67 -95 40 66 56 -40 65 262 12
6060 12 301 46 -48 238 -79 206 119 41 -50 -184 209 261 118 28 129 21 -367 -74 -171 -316 77 -75 77
6083 77 -75 -75 222 37 -68 -28 140 -38 -186 70 44 75 2 78 -313 -180 304 243 -22 48 225 125 289
6106 289 96 -134 121 -377 32 179 72 75 -59 16 392 39 -143 54 -66 -251 209 117 132 108 186 -187
6128 -187 167 -72 21 8 -149 -24 -86 310 181 234 -160 -58 -93 -204 145 -47 -425 82 -286 -54 139 64
6150 64 5 253 -168 -143 354 200 151 171 -180 -160 -260 32 -236 55 299 -158 53 -23 -118 73 313 -60 22
6173 22 35 287 164 -149 168 74 -139 10 -32 -22 134 -111 -39 -122 -72 8 -118 27 63 34 41 28 -136 211 -401
6198 -401 -3 177 235 195 -306 33 -65 68 90 -182 8 612 2 -172 161 68 -262 -163 77 -285 12 37
6220 37 -85 189 182 -42 -16 -252 70 -215 -201 223 127 129 -52 164 176 -26 205 -164 116 271 -109 -24 -115 130
6244 130 26 -147 96 27 -76 22 -6 106 -33 -95 178 30 13 121 -135 266 -39 106 -94 -66 -18 -137
6266 -137 -16 110 -178 -255 185 -196 -136 -238 -228 -31 -74 -10 96 -37 188 146 -79 -318 180 225 -44 -98 -49
6289 -49 60 -38 -113 -9 -207 -236 -113 259 80 148 -199 -126 114 -142 92 57 -6 -90 -301 -494 -121 -270 237
6312 237 176 175 -211 -24 135 -116 -172 253 17 -120 112 -348 114 -110 -165 44 -135 -372 188 225 223 -131 245
6335 245 -387 -13 71 84 -325 117 133 -93 326 -59 52 -34 106 -136 187 -157 59 35 123 -129 31 66
6357 66 -221 187 277 -40 41 34 245 440 -157 39 214 143 19 -205 -113 167 -198 133 289 -199 -140 230 -48
6380 -48 -142 -152 -111 77 9 -60 -92 -71 -48 -171 239 67 -240 9 -81 -54 227 21 -220 -118 29 194 -104 197
6404 197 201 -106 -181 56 124 127 -68 65 -128 -83 -32 42 -329 138 -264 27 85 118 211 137 -194 259 -77 -57 14
6429 14 -24 -74 336 141 224 58 72 -99 -244 35 -18 -279 -70 -36 292 -24 83 -314 242 407 -71 169
6451 169 26 109 -7 29 -149 128 -299 224 81 282 36 102 86 -280 104 -304 178 -193 292 -34 34 92
6473 92 -103 -82 -117 6 -64 146 -45 58 19 -165 -120 -30 -81 41 118 -150 6 -123 85 1 94 168 177 -71 -98
6498 -98 -288 -46 43 -75 -28 -55 58 -210 -121 -213 -259 78 -34 127 -57 -26 26 -426 -148 45 -133 -304 168
6521 168 -110 -323 230 161 -376 -3 -120 52 235 147 -125 140 89 181 135 24 67 -367 -6 133 24 420
6543 420 220 -5 -70 26 -59 -21 170 19 265 -201 439 -92 -7 87 -223 39 93 132 170 143 15 68 215 73
6567 73 96 69 -188 449 -87 18 -228 -113 0 -64 -140 152 205 -81 55 33 223 30 -378 43 -8 -164 -315
6590 -315 -195 229 34 193 -168 112 -81 -63 94 247 133 53 -75 90 -59 -139 90 -51 279 -156 281
6611 281 161 -110 -349 -28 -110 52 -1 -163 -13 -278 178 133 142 60 21 -17 333 -304 -88 -151 194 -84 -471
6634 -471 -29 288 -102 -283 -149 32 -123 -63 -239 13 -223 41 31 -421 70 76 133 16 -24 177 4 -83
6656 -83 67 -20 53 -130 -269 12 133 80 156 -21 90 -63 38 -153 71 41 -168 231 -86 250 -100 314
6678 314 -280 -257 -219 -218 204 -190 -83 183 -135 108 -250 -129 114 -150 152 -216 -82 -21 45 -97 140 56
6700 56 -87 -182 136 258 -148 76 -287 -75 -51 231 343 108 -142 95 -296 198 -43 -179 182 201 90
6721 90 -347 35 249 -190 -88 -103 65 142 -37 -238 -260 131 6 -97 0 70 191 -60 -47 164 120 -134 156
6744 156 -101 12 83 -111 237 -152 16 97 -189 135 -83 -181 138 141 260 62 82 -120 85 -254 243 7
6766 7 -4 41 -88 80 -192 -22 -386 -93 25 -247 -46 -10 76 174 -123 180 -223 101 -49 -138 222 96 -101
6789 -101 407 3 -47 233 75 -270 6 255 92 117 279 -106 -184 118 46 33 -130 -80 -86 -162 97 -10 -285
6812 -285 339 -84 34 20 -93 157 60 -186 -11 46 76 -140 -221 49 311 367 -61 -77 62 -196 97 -43
6834 -43 14 90 176 325 190 -136 51 159 -89 66 179 -182 -174 -43 -144 161 -165 17 -28 18 -73 -62 -246
6857 -246 49 243 -149 -107 -133 149 416 53 27 16 -220 101 358 100 245 -13 14 -347 14 74 259 45
6879 45 107 73 193 50 53 179 -96 -64 12 -340 -74 -167 -25 -119 -295 223 219 -89 -67 37 -335 -38 -189 -142
6903 -142 -130 132 -128 193 -23 385 115 -84 -151 -66 -217 84 108 -94 -20 193 -81 -242 115 96 47 27 320
6926 320 -154 -71 -185 68 -171 -22 229 147 41 82 185 -105 7 -9 -106 -60 -103 12 149 -30 -255 195
6948 195 40 74 -41 -281 24 -78 -215 -124 147 155 -136 -37 88 176 411 -149 314 -8 -144 42 2 -72 26
6971 26 -170 461 6 152 -65 -134 392 194 -147 88 99 30 179 35 -226 101 -29 -161 -2 -132 -94 -95
6993 -95 -249 -344 94 46 133 -28 -50 169 -61 -306 177 -64 -55 82 35 36 12 3 -182 142 -182 -335 -339 -89 27
7018 27 -27 152 -94 -32 -59 216 338 -119 119 224 74 169 129 64 -164 37 -21 -44 208 27 -390 69 182
7041 182 -25 -195 314 -269 32 70 -56 -12 12 -179 398 -29 -81 54 159 -26 -118 51 -107 -350 177 -77
7063 -77 5 -193 171 178 -86 223 162 292 -11 100 -395 200 74 -4 109 227 -47 -100 264 331 280 -97 -116
7086 -116 49 264 24 88 26 21 190 22 23 77 -188 199 -63 58 243 97 -68 -163 58 -113 85 110 193
7109 193 95 74 -258 59 -117 -69 -69 -88 -180 148 24 57 -111 21 -62 -156 -46 53 20 -155 -123 -155 -112 61 225
7134 225 -167 48 224 -41 -91 323 211 27 -113 164 -38 -70 -194 18 122 -191 244 -218 -107 -264 -263
7155 -263 215 136 -237 24 117 28 -65 60 202 107 -4 142 -167 -253 147 -106 -20 29 -24 194 176 -46 242
7178 242 -49 -469 -40 -292 -95 -174 -65 -14 36 -59 137 -88 -10 144 29 174 -79 -117 6 -85 112 136 20
7201 20 -41 -169 -214 200 193 -198 -102 -119 171 -93 -262 5 173 62 249 98 295 12 -145 18 190 236 119
7224 119 -34 146 171 26 267 -73 -209 -66 8 -146 -141 -105 -216 -103 -94 15 -211 -69 219 115 87 304 -279
7247 -279 112 43 -43 -7 -91 -195 6 19 -75 57 32 107 73 -50 35 -428 52 -360 -54 230 -233 -140 -242 379
7271 379 230 98 -16 85 34 -212 291 173 -100 -46 85 -209 -89 -356 -244 -76 16 27 95 65 -189 126
7293 126 210 142 -12 9 60 -346 107 -151 18 17 -78 471 -137 82 -86 8 -171 284 24 102 -78 -83 -282 -360
7317 -360 -159 152 -59 304 -14 -111 -122 -183 -28 59 26 47 339 -45 -178 137 -99 335 -59 95 202 -118
7339 -118 -94 32 -54 -8 61 -101 -106 51 312 210 -197 -179 -33 -72 25 -48 -11 -43 405 -66 -56 214 167 -14 17
7364 17 -136 -37 166 -24 -275 165 -9 162 213 -64 -352 309 95 100 138 262 -13 -150 100 -66 -74 -66 59
7387 59 -25 -228 82 -39 -84 -242 136 -10 125 95 -18 -76 -238 49 -12 126 244 -286 -256 224 -204 -95
7409 -95 -193 -102 -133 95 139 141 165 364 -163 -98 372 80 -218 -304 34 -90 -47 80 -47 -74 243 39 0 -98 -13
7434 -13 207 86 -351 -84 45 -110 -58 126 167 267 94 -5 -7 21 -320 -40 1 216 142 54 -70 75 -11 -339
7458 -339 84 133 310 136 -246 -156 17 155 -111 -206 55 -137 104 -155 37 117 248 29 -35 139 68 72 8
7481 8 38 -375 -130 49 -84 119 152 17 -83 -177 158 -146 120 -41 241 -133 40 77 -51 -77 53 283
7503 283 6 -11 -18 -191 -6 -179 -179 -217 -95 -3 -133 -248 169 23 132 -6 149 134 108 106 -3 383 -105 85
7527 85 -243 -54 -289 202 -85 -109 -47 55 -187 -4 85 186 327 -117 0 -107 -192 91 -38 72 -46 34
7549 34 144 -233 226 184 -214 21 -143 69 -51 47 191 48 -80 63 -33 209 -246 -81 20 210 -45
7570 -45 -42 -141 -223 -40 82 92 150 39 -86 13 -156 -107 -196 -96 -5 -201 65 -8 66 120 80 -77 -46 155 1
7595 1 -172 91 152 127 -97 267 -39 -55 105 231 -24 -35 55 2 -59 -269 233 40 -315 -125 256 -253 -123
7618 -123 135 -138 86 65 38 105 -108 58 -291 325 98 -36 -32 -43 166 165 171 -98 6 -115 -42 -117 231 18
7642 18 141 -70 -232 223 -175 33 155 -97 -119 -44 -195 -286 173 235 123 71 -107 350 -76 -227 -43 -172
7664 -172 -184 -9 78 11 -161 -122 162 156 9 -50 118 105 -117 -29 6 -154 -19 -56 292 -323 -5 178 -133 -161
7688 -161 45 203 -36 138 -66 265 93 92 -166 -3 212 -112 -109 -126 -166 -32 367 -41 194 -12 207 -18
7710 -18 -327 194 -80 -50 298 -157 -49 -54 -88 393 82 -38 -133 183 160 201 -31 -107 16 -162 23 215 -289
7733 -289 -147 132 1 -362 -93 118 41 -358 -288 -159 85 103 -143 -1 -58 -64 -452 211 -259 155 -146 248
7755 248 85 144 101 48 -60 280 -24 113 243 21 -111 185 80 83 -262 156 -17 -197 217 -47 184 159
7777 159 256 -1 60 96 -50 16 168 91 115 -45 351 77 -17 239 -14 -209 -117 134 261 -129 -30 0 276
7800 276 115 140 193 -5 36 44 -151 -19 -32 180 -146 -24 9 42 -72 -21 173 384 275 95 -136 197 -129
7823 -129 -129 -20 -27 -109 202 85 64 298 -144 203 22 48 -129 -72 200 -130 59 20 -85 99 88 -83 -142 166
7847 166 -103 -137 179 7 -62 -176 131 87 16 2 -60 -52 -60 -314 -178 47 -311 81 -106 109 -31 -4 59 110
7871 110 -32 39 -59 -268 109 17 -8 4 -612 109 179 49 58 -107 -41 83 309 -163 -83 -98 -162 -109 251 -110
7895 -110 -219 94 -96 170 224 -13 114 -322 -36 126 -205 204 12 232 -102 -1 215 -129 -230 79
7915 79 -194 8 -177 70 -33 129 118 96 30 37 61 -354 90 -122 -360 -52 -116 57 -90 -101 -11 98 362
7938 362 50 176 -33 -28 95 -47 -31 -219 -140 -273 -373 -18 -46 -103 59 -246 -180 35 -50 58 24 -13 100
7961 100 137 407 -75 71 12 -64 -20 247 -145 312 -83 -156 77 73 109 -9 0 -66 -274 13 164 -54 -189 -184
7985 -184 105 -146 -279 47 100 131 72 -71 178 -141 -180 -85 -73 183 -28 160 396 -5 475 55 155 -87
8007 -87 170 -23 -240 47 135 184 9 0 -59 159 -167 -162 -144 -31 -166 139 -155 -55 45 -132 -53 43 -166 -25
8031 -25 -76 213 4 189 131 133 -145 88 20 -156 -190 56 -43 -128 285 304 -24 -80 124 296 248 -25 97 -114
8055 -114 -12 -10 -181 -149 214 138 -387 -202 -191 499 -159 -8 -59 109 93 23 -60 -111 259 -133 108 -15 -154
8078 -154 -20 13 239 -7 63 21 -74 -195 -55 -240 -55 211 -98 -39 113 -129 96 -122 -120 -64 76 0 -115
8101 -115 -58 241 26 67 -200 11 47 269 -54 -183 9 30 -27 -156 85 40 47 -345 98 -80 23 131 -125
8124 -125 90 289 25 -56 169 44 164 -7 6 45 73 89 -39 449 6 -36 18 36 275 -80 -446 65 -78
8147 -78 250 -459 253 -206 -100 -148 -53 -44 46 -9 -48 -125 -132 1 -108 -137 -97 146 -357 -282 -32 102 203 62 88
8172 88 -53 95 363 -192 177 38 271 136 -48 -228 67 -59 59 51 -183 24 57 -111 -5
8191e
$$ Imaginary data points
##PAGE= N=2
##DATA TABLE= (X++(I..I)), XYDATA
0 0 0 0 0 0 0 0 -8 8 -8 8 -8 16 -16 16 -24 24 -32 40 -43 56 -61 72 -83 95 -109 124 -141 161 -181 205 -232
31 -232 259 -291 325 -362 405 -450 498 -554 612 -680 752 -832 921 -1022 1136 -1262 1405
48 1405 -1575 1769 -2000 2282 -2624 3067 -3650 4458 -5674 7681 -11615 22298 -113372 -362813
62 -362813 -193612 29731 136225 115461 128063 102948 -29143 -206989 -233275 -100993 61531
73 61531 140650 162152 124042 47 -173253 -243782 -141972 39524 151839 166403 116395
84 116395 16613 -120234 -202972 -152354 -5331 119338 163473 139966 61426 -66665 -178738
95 -178738 -177778 -48613 106799 179601 151379 66242 -40717 -135735 -160434 -78155 59368 153053
107 153053 157087 94372 -3315 -110119 -168262 -116312 24332 145948 165481 93055 -7267
118 -7267 -90153 -133597 -115994 -28554 85348 150917 124122 28974 -76598 -142079 -136949 -55510
130 -55510 63500 142410 127898 37785 -65153 -127279 -127031 -67635 24142 101805 124288 76603
142 76603 -18539 -112643 -148515 -97836 11107 106516 129814 75734 -12237 -84990 -115582 -94716
154 -94716 -24433 67603 125146 105632 23803 -64619 -113909 -103295 -37844 52600 116788 114899
166 114899 48707 -41574 -105045 -107100 -47648 38497 102901 112043 64472 -14391 -82511 -104460
178 -104460 -67240 9768 84139 114646 82575 6382 -71727 -106585 -78995 -5176 69882 102266
190 102266 79023 19661 -45495 -90781 -91913 -39104 43328 101991 95811 30299 -46722 -89547
202 -89547 -83891 -41590 18183 73284 92242 54490 -21376 -83966 -95324 -56055 6273 62540
214 62540 86412 61878 -1449 -67273 -95047 -69030 -6841 55017 82295 63236 10728 -46642
226 -46642 -79411 -71268 -25601 34344 77463 77485 31317 -33798 -77381 -73440 -29056 26166 67150
239 67150 74330 43089 -12771 -60891 -73293 -42433 11908 59637 76306 53200 2728 -49050
251 -49050 -71788 -51720 -623 49375 72619 57856 13524 -37561 -66881 -55810 -13550 34514
263 34514 62242 59007 25983 -22114 -59918 -64195 -30489 21557 59073 60668 28618 -16808 -51425
276 -51425 -59573 -37886 3568 43823 59658 40904 -3035 -46308 -64193 -45163 -3109 37578
288 37578 55148 41181 5507 -33640 -56396 -49942 -16599 25501 52397 48702 16732 -23852
300 -23852 -50269 -50607 -23740 15543 47488 52475 26763 -13651 -44038 -48294 -26522 7895 38467
313 38467 49532 35106 1173 -33826 -49192 -35442 -1126 34059 50238 39218 7821 -26700
325 -26700 -45254 -37841 -9339 24873 46480 42706 15967 -19213 -41643 -40244 -16542 15666 39025
338 39025 42413 23027 -9449 -37314 -43772 -24186 8182 34317 40260 24937 -2770 -29161 -41086
351 -41086 -31393 -3474 26796 41158 30497 2777 -26139 -40293 -32612 -8218 19048 35066
363 35066 32413 11442 -17110 -37244 -37402 -15631 13696 34050 33198 14638 -11018 -30335 -34558
376 -34558 -20691 4545 28007 35314 21646 -3870 -26541 -33452 -22481 197 22344 32553
388 32553 25762 5277 -18863 -32136 -26601 -5042 19189 32470 28041 9693 -13205 -27789 -27035
401 -27035 -10844 12181 29418 31312 15459 -8264 -25482 -27134 -13746 6991 23431 28274 19311
414 19311 -787 -20111 -28765 -19892 82 20002 27607 20121 2302 -16896 -26514 -23239 -6731
427 -6731 13198 25334 22335 6240 -13228 -26112 -24851 -11397 7764 21555 23198 10790 -8499
440 -8499 -23684 -26096 -14657 3598 19099 23209 13903 -2903 -18812 -25009 -17631 -677 16475
453 16475 23785 17242 1350 -14517 -21427 -17106 -3994 11745 21979 21302 8239 -9271 -20504
466 -20504 -18794 -5970 9884 20901 21425 11466 -4015 -16776 -19203 -10427 5754 19427 22600
479 22600 13115 -2809 -15184 -18241 -11219 900 12746 19748 15888 2442 -13713 -21351 -15373
492 -15373 -1226 11318 15742 12742 3817 -8048 -17463 -19043 -8794 6018 17043 15789 4724
505 4724 -8672 -16914 -16778 -9433 1952 11620 15585 9910 -2623 -14714 -19033 -11576 1772 12385
519 12385 15328 10067 926 -9337 -15502 -12888 -2582 10160 17075 13939 3377 -7439 -13129 -11451
533 -11451 -3644 6852 14561 14799 8075 -2788 -11423 -13709 -7361 4982 14739 15726 8506 -1840
547 -1840 -9858 -12513 -8585 533 10418 15275 11403 -115 -10496 -13487 -9465 -1660 6502 11998 11947
562 11947 3740 -7832 -15139 -12951 -3757 6672 10711 8603 3077 -3591 -10644 -13840 -8781 2239
576 2239 11213 12088 4755 -4421 -9904 -11149 -8123 -1172 7803 13093 9178 -965 -10365 -12054 -7283
591 -7283 -299 6461 10446 9480 3276 -5255 -11066 -9620 -2184 6620 11317 9647 4338 -2963 -9028
606 -9028 -8835 -3543 3761 9488 10877 6475 -1419 -7322 -9216 -5311 1903 8412 10550 6494 -1158
621 -1158 -6496 -7843 -6199 -2023 4549 10115 9680 1874 -7455 -10987 -6988 -239 3717 6095 6937 4323
637 4323 -3754 -10478 -9588 -2734 3186 5707 6335 3872 -1540 -6931 -9377 -6766 165 6842 9064 4764
653 4764 -2092 -6265 -6857 -4931 -1528 3278 7684 8030 2301 -6132 -9622 -4819 967 3810 4123 6238
669 6238 5909 -859 -8512 -9042 -1354 6221 7386 4973 2455 385 -3581 -6989 -5433 1697 7233 6854
685 6854 3513 351 -3837 -7263 -5672 522 5962 6186 3499 805 -2275 -5716 -7169 -3493 3477
700 3477 7669 6629 376 -5185 -6673 -4328 -1147 1002 3089 4237 4198 525 -5868 -9556 -5268 3566
716 3566 7564 3756 -168 -349 -904 -4977 -7639 -2386 5825 8937 3932 -2757 -4694 -2931 -2428 -2066
732 -2066 627 5334 6874 2967 -3038 -6279 -5346 -1101 3930 5548 3660 1066 -326 -2964 -5454
747 -5454 -4196 1531 5490 5206 2176 -619 -2934 -4962 -4279 48 4662 5744 2787 -1334 -2813 -2808
763 -2808 -2946 -2540 1476 5619 5530 847 -3429 -4468 -3394 -1052 1505 3879 4235 1977 -1773 -4422
779 -4422 -3797 -1382 944 2694 4151 3172 -478 -3672 -4322 -2328 445 3078 4248 2507 -614 -2269
795 -2269 -2838 -2894 -1551 2134 4892 3565 -478 -2751 -2393 -1667 -1896 -835 2821 5267 3403 -2789 -5763
812 -5763 -3353 983 1764 535 1232 2976 1440 -2642 -4754 -3367 839 3709 3910 1373 -918 -1767
828 -1767 -1926 -1951 -1287 1031 3147 3443 1269 -1514 -3330 -2543 -207 1257 2160 2905 2627 -677 -3219
845 -3219 -3113 -820 957 2376 3146 1996 -478 -2242 -2772 -1650 -24 1787 2764 2314 781 -1968
861 -1968 -3709 -2995 338 2782 2222 613 245 -923 -1765 -2774 -1574 690 3031 2816 405 -2118
877 -2118 -2718 -1683 -1182 42 1094 2254 1987 -398 -2948 -3302 -1367 1015 2264 1309 599 684 -747
894 -747 -2566 -2587 -208 2715 2978 1201 -424 -1024 -1338 -968 -1065 433 2191 3108 1437 -1087 -2340 -1242
912 -1242 -146 556 1518 2189 1624 -180 -1576 -2233 -1062 499 1585 1559 825 162 -1068 -2291 -1971 -303
930 -303 1558 2228 1735 -301 -1629 -1817 -1484 -804 727 1842 1585 272 -1453 -1617 -1820 -1000 486 1418
948 1418 1040 941 -405 -1761 -1630 -1077 -278 832 1862 1461 -284 -1674 -1951 -797 753 1115 1209 1085
966 1085 652 -625 -2107 -2074 -158 1952 1965 846 31 -155 -571 -1220 -1192 53 2137 2604 999 -1128
984 -1128 -2069 -867 396 811 776 598 1282 794 -1168 -2298 -1577 379 1712 1418 472 -517 -683 -793
1002 -793 -1287 -1051 278 1740 1154 11 -1267 -1697 -1042 -150 426 1095 763 113 -542 -1107 -1397 -973 206
1021 206 955 1172 276 -382 -798 -720 -885 -242 815 1354 1369 80 -857 -1392 -945 243 599 686 1058 304
1041 304 -89 -696 -1047 -182 868 1028 1199 582 -207 -786 -832 -222 262 693 1192 517 -106 -1022 -1012 -447
1061 -447 -171 328 1015 758 317 -781 -1172 -960 -60 410 646 320 240 -1 -1155 -1409 -911 111 828
1080 828 698 -12 -784 -871 -614 -422 37 327 743 638 290 -729 -969 -332 609 791 990 538 32 -143
1100 -143 -523 -746 -310 783 1730 683 0 -654 -697 27 -11 -134 482 1272 848 -135 -1232 -1127 -115
1119 -115 21 873 8 -40 -59 -421 -963 -1281 -371 924 1161 242 -724 -1459 -647 -62 195 170 -31 525 424
1140 424 -432 -1060 -869 -55 954 595 365 -187 14 -117 -943 -1055 -225 1211 1350 282 -608 -634 48
1159 48 566 56 63 598 859 476 -395 -816 -415 310 1081 429 -41 -37 -2 137 -372 -658 -2 610 750 -64
1181 -64 -700 -569 -213 -381 371 410 145 126 -88 -608 -624 -443 -343 150 530 222 -185 -438 -333 -318 -306 186
1203 186 443 552 154 -163 -567 -433 209 320 237 195 443 217 -26 -636 -389 460 963 533 71 239 37
1224 37 -295 -271 -90 417 1041 267 -304 -229 -190 177 -104 30 256 584 527 -519 -643 -645 89 369 15 -396
1246 -396 144 199 -584 -1304 -671 307 977 317 -298 -782 -322 -662 -261 -195 217 891 613 131 -331 -253 -260 22
1268 22 23 113 601 420 -64 -703 -245 515 732 523 198 91 -23 -83 142 -1 271 272 252 481 351 -83 -436
1291 -436 -224 453 942 47 -511 -207 559 -448 -549 -116 521 762 211 -383 -775 -196 205 17 -100 0
1311 0 -33 612 -5 -876 -757 107 600 203 -590 -335 512 586 -759 -1144 -67 827 621 -435 -966 18
1331 18 595 12 -725 -328 655 922 367 -409 -684 198 229 50 32 245 346 138 438 195 -136 15 325
1352 325 501 159 -149 -362 56 -237 255 46 -27 103 -54 0 -21 -249 -355 11 788 355 -465 -332 31
1373 31 666 -590 -684 645 1021 387 -1002 -861 125 604 85 -445 -276 376 350 -506 -767 -197 472 382
1393 382 -151 -53 272 230 -306 -162 -23 156 556 77 -448 -224 193 318 -453 -313 444 923 434 -644
1413 -644 -264 488 620 380 -29 -113 598 572 -442 -438 32 741 610 -46 116 53 -4 -62 -25 -282 334 770
1435 770 -31 -577 -759 181 -34 -120 -322 -110 123 -162 -148 -189 -413 -218 -16 -41 21 -82 -432 -480 15 393
1457 393 -223 -527 -87 238 421 -289 -804 -275 844 782 -316 -423 51 568 -8 -812 -465 852 502
1476 502 -22 -400 -248 539 591 87 -443 -383 665 593 -155 -706 71 433 274 -58 -460 13 794 427 -579
1497 -579 -278 137 505 299 -397 -387 254 322 -306 -725 129 294 -71 -214 -370 -356 -145 -50 -153 91 149 117
1519 117 -371 63 345 32 -242 -44 -34 195 116 -238 -442 -172 339 165 -149 -72 263 5 32 -159 169
1540 169 380 188 -39 351 143 215 -62 -432 176 700 578 -432 -404 57 408 284 -83 -275 106 445
1560 445 -51 -302 -546 101 377 -174 -373 -7 519 -216 -425 -550 200 410 218 23 -442 73 394 -65
1580 -65 -324 -222 379 395 -360 -476 -254 210 90 -444 120 -16 479 268 5 -152 -96 196 462 221 -141
1601 -141 -187 -209 137 -143 58 302 401 110 -12 -396 42 138 -11 101 -346 137 1 -121 -105 -42 143 192
1623 192 484 59 -225 -301 -13 225 148 -235 -558 48 797 -205 -380 -471 286 433 10 -164 -360 -37 520
1644 520 39 -127 115 488 590 -129 -111 44 826 343 -399 -99 13 287 218 -166 -491 135 68 271 -57
1665 -57 -270 98 141 14 -388 121 -130 125 303 -342 -83 189 74 -84 -173 17 92 63 -9 -140 -9 -80
1687 -80 -275 153 28 126 -338 -89 -324 129 163 24 -111 307 104 86 -27 -195 -82 89 -21 256 150
1708 150 140 -89 38 179 35 91 -185 270 151 158 -77 -394 48 120 -93 -212 122 361 83 85 -243 119
1730 119 126 177 85 -128 -290 -107 -36 -53 22 -179 -143 125 110 -309 -329 20 288 -267 -275 141 33 148 -259 -282
1754 -282 -125 142 -223 23 -362 -20 277 -96 -374 -85 491 126 257 -96 -371 -119 -189 379 40 -63
1774 -63 87 247 93 315 -160 -105 423 190 317 -68 -203 185 382 205 -148 76 397 579 87 -123 -18
1795 -18 226 107 23 -68 -27 114 -3 -278 41 209 239 175 -374 -384 -83 267 -222 -205 -378 -297 -122 -93 -110 -307
1819 -307 -162 -86 25 -75 -69 -117 -141 -129 -63 -79 -40 305 44 120 83 -6 -51 -92 228 -105 -18 215 -235 54 189
1844 189 139 -86 222 -100 -97 412 92 -59 513 71 67 59 294 95 131 -142 -98 6 183 292 -28 -83 28
1867 28 71 -104 248 -411 -115 15 -132 -104 -178 -305 -202 28 -242 -2 62 -248 28 -302 294 -111 -118 -17
1889 -17 26 181 -201 -243 8 262 305 -157 -289 315 -21 50 -253 13 508 574 -53 41 428 396 188 119 22
1912 22 105 474 21 11 196 217 267 91 -253 -125 184 457 74 22 -404 -456 263 241 -215 -183 -29 29 206
1935 206 -224 -224 174 117 29 129 -34 -97 -31 -309 -486 36 37 51 -227 328 -14 -266 -154 364 72 177 24
1958 24 185 418 180 -135 -146 -10 405 328 6 208 57 18 -26 85 -104 12 119 303 -21 -1 215 12
1980 12 86 17 39 115 18 -55 -201 79 98 -52 -267 -300 212 248 87 -343 -267 247 75 -378 -72 32 359 -278
2004 -278 -184 30 -240 -62 -2 -310 -101 375 1 -143 -488 95 -87 -68 31 -23 -35 62 -48 5 -205 105 7
2027 7 -287 -132 -168 156 23 -139 -31 341 -109 -368 255 -17 260 68 -70 -124 142 11 -3 -102 -13 142
2049 142 -139 -81 -146 -259 -14 1 -85 199 25 -265 34 -57 -142 451 95 -237 -321 10 348 98 -506 36
2071 36 233 295 -87 -389 -73 402 286 -30 -425 179 205 -79 -286 -94 369 385 -92 -380 -147 159 148 -206
2093 -206 -342 -263 -48 109 -248 -75 -36 64 -5 -93 -437 -24 196 -46 -253 -273 183 -1 -203 172 -101 9
2115 9 -444 -38 -17 46 115 -380 -231 76 165 -120 -446 261 170 233 -236 -132 264 422 41 16 -236 29 165
2138 165 151 -109 -261 252 297 -198 -354 108 343 181 -64 -346 -8 334 48 -477 -73 123 474 149 -176
2159 -176 26 426 -108 -186 -142 -87 235 104 -180 -75 183 142 -51 -87 -122 91 -89 -34 -143 125 -31 -182
2181 -182 263 -185 65 -107 -61 -371 146 182 -88 13 27 -158 16 -68 -218 -38 -83 110 66 -173 348 -216
2203 -216 132 -124 -236 -32 62 -100 -56 320 197 165 -2 66 0 291 81 -178 -5 264 48 -57 -87 -232
2225 -232 623 575 -181 -16 517 318 -215 -132 -266 64 222 125 -540 -9 232 104 -134 -309 18 337 319
2246 319 -44 54 -32 120 234 -392 -220 208 302 54 -291 139 102 65 -23 -24 205 100 -179 -274 277 -77 -101
2269 -101 238 -298 -37 247 163 65 73 229 83 -79 257 89 16 387 -65 394 178 107 -460 -177 -27 -63
2291 -63 249 80 149 2 -29 -285 -319 108 183 -414 -174 238 -26 351 325 -338 -292 -196 -47 170 -160 -180 77
2314 77 -110 161 -168 -218 -6 286 -55 -482 196 -229 140 -119 -278 -25 197 -189 -179 33 64 280 -338
2335 -338 66 172 98 388 75 -247 94 195 113 108 114 159 23 -28 -123 -116 243 -18 73 300 -158 -146 300 -124
2359 -124 107 -48 -12 251 -33 90 46 -116 69 140 -18 -18 62 -110 354 -242 -258 -47 191 49 -365 -256
2381 -256 -78 23 135 79 30 -206 4 269 120 -126 -274 -6 -68 198 -293 28 28 289 208 -144 -163 160
2403 160 37 -278 175 84 -15 -1 91 -124 245 115 -27 94 16 41 215 279 155 87 56 -4 106 -36 27 345
2427 345 108 -169 -37 76 161 453 -288 -158 -9 109 14 41 19 21 -40 230 8 -375 -111 213 128 -61 -37
2450 -37 -226 36 19 35 123 -340 265 275 -259 -35 133 -23 75 209 -96 -123 122 17 160 -144 -31 146
2472 146 -82 233 -205 137 137 168 -90 -187 177 269 -108 -157 -362 73 146 -50 109 252 167 -94 31 164 2
2495 2 -26 251 -267 -157 -155 -109 33 -7 107 -88 237 428 -103 -214 -308 -250 124 -178 32 37 -33 -69 -57 51 -204
2520 -204 269 -213 52 51 -51 -1 -152 -10 100 170 -40 -317 116 142 -219 313 76 8 -219 356 170 -136
2542 -136 -227 -54 53 55 38 115 100 -216 116 -29 198 -294 434 260 -154 -25 -6 -122 37 210 -90 158
2564 158 -77 349 -13 71 -11 32 -102 43 -20 -336 -4 163 131 123 -65 252 458 6 -124 -234 -53 -201
2586 -201 152 -377 31 50 34 -85 -153 257 -19 153 -62 -18 42 82 -89 -84 43 244 -45 -45 -7 -75 -100 -439
2610 -439 199 -39 71 63 111 99 16 -58 128 135 -117 -271 -161 50 225 -44 -67 375 -35 -159 -132 -263 25
2633 25 115 -15 -20 55 -10 292 -255 -125 -145 -170 25 66 248 189 -19 -29 69 126 218 -206 279 128 -276 -23 270
2658 270 -176 -42 -87 -258 32 -188 69 31 14 168 242 115 -197 -52 213 253 23 -297 -88 11 -66 -229
2680 -229 -65 22 -3 -82 -179 170 -65 -2 -122 -167 -131 95 89 51 83 -338 103 146 -161 -377 315 310 134 -395 -148
2705 -148 -55 -349 -243 -208 170 -9 257 -2 -394 36 -567 13 19 -163 287 -1 -105 -2 120 143 -80 -54
2727 -54 -162 112 43 -140 -6 -33 -117 -124 -66 -150 -158 -10 89 4 223 -8 169 74 -120 -138 354 -41 -122 -329 -112
2752 -112 492 -259 60 -63 -209 25 224 -65 -34 122 182 -71 -297 -162 -58 -47 -128 -75 333 114 -98 30
2774 30 10 24 50 42 366 91 8 -93 2 181 332 -163 84 -58 194 381 -18 150 176 458 -122 -189 -169 -49
2798 -49 -256 40 -55 50 197 120 -249 -200 -279 -48 16 55 144 -110 -174 32 -71 -150 -27 88 -103 -182 -27 185
2822 185 195 -247 3 -92 -198 155 -318 -29 -1 -395 351 101 -186 161 -58 -237 -205 41 135 37 132 -3
2844 -3 107 -84 13 -21 251 -70 170 84 -40 185 419 133 36 -324 272 -40 -148 114 141 -40 -162 44
2866 44 -319 83 102 172 463 35 107 75 -67 -14 -39 122 171 36 1 167 139 -186 -404 -138 0 291 297 -239
2890 -239 -139 176 79 -306 -50 -137 -117 219 4 -220 -121 124 242 19 133 126 115 34 -43 -46 217 -192 5 410
2914 410 104 18 453 -10 -57 -65 157 249 -99 -20 -65 57 28 -26 51 184 -113 -119 -98 162 60 14 -347 -23 164
2939 164 49 57 135 -183 -20 -10 297 33 259 -120 -55 -242 -84 -30 -128 292 10 -115 -16 -107 -62 -346 84
2962 84 222 -150 -272 18 -57 149 -233 -270 39 124 40 -251 134 63 -91 59 -97 -3 414 -182 -166 93 146
2985 146 141 40 159 -65 -115 186 -115 -79 179 69 211 -232 -84 147 -12 32 -85 36 128 -40 104 -46
3007 -46 -4 143 74 -13 -25 -276 356 -288 -33 188 -125 -202 -111 33 -83 59 74 21 -89 135 -9 188 -313
3030 -313 250 -226 -135 -62 105 -58 76 -127 -148 -203 14 -152 46 -148 219 -145 -118 102 -34 316 -172 -107
3052 -107 -15 106 16 -184 -68 29 -341 109 11 -103 178 236 -122 -19 -47 47 -108 -82 193 -169 -123 -204 -124 -86
3076 -86 -283 -158 64 -190 -151 -134 161 2 -130 -167 123 171 4 274 -6 -150 134 105 44 -119 -153 3 207
3099 207 -54 142 138 178 197 -258 -52 -140 38 38 179 237 219 195 54 106 140 18 -209 -15 -204 -104 13 -80
3123 -80 107 -168 116 -47 299 -95 161 -20 215 -84 275 8 -276 -227 -92 26 167 55 -15 -301 88
3144 88 -16 75 131 32 73 261 21 -129 -32 -189 336 -192 105 -9 169 -223 -126 204 588 225 78 -99
3166 -99 22 -66 -3 -339 -55 78 -20 -75 -204 42 -75 90 24 -211 0 -93 -94 -28 5 -145 6 93 45 -13 -75
3191 -75 165 -7 100 37 -6 21 218 91 153 -348 344 -144 -71 -38 85 68 -119 113 422 -124 261 240 134
3214 134 133 -232 203 15 167 -175 -44 247 46 76 -41 108 -31 -98 -3 25 -84 -130 202 104 -186 118 -160
3237 -160 -115 -77 -61 -132 203 62 -265 39 -25 -89 158 -82 -58 131 -134 -258 -3 -335 -150 -140 150 402 -335
3260 -335 -211 -311 -24 188 178 227 -219 -172 60 -119 -155 -158 347 151 122 225 33 206 285 -55 64 115 167
3283 167 -193 85 -149 -109 -26 124 -133 175 -16 140 223 25 -136 -76 -22 -4 142 289 -134 -47 -137 -70 -136
3306 -136 136 -141 -122 98 50 -306 -132 119 -87 336 -285 203 -91 -41 22 -227 -112 25 157 -404 -226
3327 -226 -29 171 33 71 -332 -42 -280 27 112 -146 -260 87 -94 12 -107 -234 -85 169 -29 -309 257
3348 257 -85 -120 -243 -32 -148 -19 164 43 103 78 -50 55 103 227 38 89 272 8 -297 195 -253 -371
3370 -371 294 -266 -131 401 -66 15 25 -22 83 275 216 -62 12 180 19 -10 198 173 132 -96 61 -166 158
3393 158 119 -154 24 -274 -354 -33 49 -86 -139 177 207 23 -186 -91 -458 -48 -185 -18 160 -294 22 -64
3415 -64 70 86 -336 -164 214 -172 81 -7 232 230 408 -33 15 -11 -43 -152 174 -82 245 -41 -71 190 -163
3438 -163 -74 47 -53 -221 -44 50 167 3 147 220 -75 -332 -134 16 -80 15 -202 -17 -139 57 -82 -79
3460 -79 -38 132 9 50 -311 -31 -58 -183 170 -101 -246 -117 91 99 -193 145 -236 -324 121 -86 27 -105
3482 -105 -138 271 -87 117 -59 28 42 278 -356 -3 -23 -126 -89 -67 215 -32 148 -11 -37 253 -110 -76 95
3505 95 -247 62 -189 -10 -319 -121 -163 -82 -15 68 -9 102 99 -14 -36 29 57 -100 -211 -115 138 -267 -61 -54 -124
3530 -124 156 281 98 -37 -246 82 251 191 15 -143 18 -69 -388 -72 -95 -170 -51 -183 161 53 22 -17
3552 -17 95 76 345 21 -98 -8 -60 -277 -47 -116 79 -33 120 73 -252 -22 -165 -33 113 -23 223 -59
3574 -59 -211 27 -63 -111 0 -61 -283 -105 102 -89 95 122 -64 72 -83 186 59 223 204 -100 299 -146
3596 -146 -224 -80 -22 94 82 93 -305 158 -165 46 150 196 16 72 88 -207 -7 -88 135 -221 53 -194 -77
3619 -77 -66 -237 -289 -85 -34 -256 -246 -115 -118 168 53 -16 -145 26 64 -335 5 -107 -40 -75 -563 -216 193 239
3643 239 29 228 -68 -63 -87 -7 13 40 59 31 28 18 6 75 46 406 -135 -146 -90 -186 -94 -105 350 288 81 133 45
3670 45 -101 169 -65 31 -117 -5 -177 95 -26 -119 57 87 -247 366 -97 -157 196 48 132 15 -1 19 201
3693 201 -264 207 10 -69 85 -75 -96 -187 -166 -186 68 -107 142 137 -19 16 -52 -12 11 115 74 -111 236 211
3717 211 186 33 316 -26 35 -21 -46 232 202 42 -120 -253 -100 190 112 -203 -143 21 -45 -64 335 -245 1
3740 1 167 233 -141 259 0 49 99 119 -13 -419 -127 285 170 223 19 263 -69 -68 165 159 122 -207 241 -54
3764 -54 -70 -18 -33 -31 91 -65 -275 336 127 -468 349 -55 -51 -61 -73 -162 -161 2 -88 -22 -236 259 181 154 395 85
3790 85 125 -220 -42 233 60 -180 -34 161 157 293 -4 182 -17 218 135 175 17 74 25 -288 -111 225 -315
3813 -315 -101 201 62 -187 -30 -145 -141 -220 -39 97 -37 58 15 102 115 -107 -32 301 -44 193 234 90 -98
3836 -98 284 -215 -504 -195 53 104 34 -156 200 105 65 -129 139 -14 -62 95 110 138 42 -34 -87 90 153 -88
3860 -88 87 -227 -70 -153 270 -89 233 1 -59 170 -218 -69 -321 -13 3 -6 213 69 50 -211 -23 -47 -10
3883 -10 231 -189 -188 78 -217 -36 85 -55 70 -358 -31 -90 -78 -91 52 101 45 -154 232 -125 -181 84 185
3906 185 -45 42 115 -59 -83 53 155 229 -47 22 212 -13 7 75 -216 -18 -438 -204 -164 -63 -39 -372 -50
3929 -50 -206 -35 -489 -354 -113 -81 32 199 -36 -249 -65 -78 -386 116 -67 -179 -184 1 130 -26 179 113
3951 113 128 -199 104 60 -138 -79 90 210 -68 0 82 -2 -96 168 -112 301 16 -86 -21 -121 84 71 -92
3974 -92 108 16 -69 102 46 -215 -213 -78 127 -218 -208 231 -211 -111 44 -17 -267 68 -236 -190 -197 -88 85 59
3998 59 -280 -45 7 -157 -302 -98 241 59 -11 -100 279 -319 -51 -3 91 18 -156 -66 -147 -169 59 72 48 72
4022 72 52 -42 -97 -79 99 212 -106 293 -57 42 35 -242 -1 -133 -165 -172 -105 73 183 36 -165 66 317 49
4046 49 -104 -231 -77 -191 243 -152 -145 -78 35 132 -79 -120 39 -18 52 170 29 113 1 -134 90 247 -95
4069 -95 -143 386 49 -236 112 257 -203 -172 -16 -122 40 -147 -34 -270 -91 36 -26 132 279 89 327
4090 327 108 -46 -33 76 -176 134 174 -80 35 31 -386 37 -185 122 130 -19 172 11 308 0 243 105
4112 105 188 200 248 19 -237 75 -34 228 200 159 36 169 -28 72 -54 -308 -206 90 -301 -131 -289 -122
4134 -122 -173 27 -25 57 -28 141 -13 -58 -76 16 -181 -9 63 -11 442 39 117 3 -282 -32 -81 -70 -61 41 -211
4159 -211 187 -158 77 -33 223 -43 150 283 261 -198 94 105 374 -41 209 -272 273 -182 161 98 -30
4180 -30 -176 335 -71 -259 141 -220 -165 -312 25 18 90 282 208 -78 21 202 147 -60 -368 137 387 75 183
4203 183 -208 36 -58 93 79 -120 83 147 -81 230 -8 -305 -100 -3 -77 -327 -182 32 171 -64 35 -129
4225 -129 -249 202 200 36 96 50 -31 220 -85 188 34 -107 108 55 -55 231 83 69 10 306 -199 -151 305
4248 305 145 19 -168 -101 13 198 214 215 241 72 -74 -7 -78 209 121 -129 -43 -356 -120 -137 42 -43 148 -186
4272 -186 303 255 70 125 -11 148 -183 156 -58 80 -113 -49 -34 -1 -95 -34 144 331 -255 -69 -161 52 -92
4295 -92 -156 229 12 110 24 260 194 -188 49 64 -115 15 400 -48 141 49 -84 -74 58 66 -145 10 -253
4318 -253 -108 -22 37 281 260 46 95 -443 -125 95 -101 -121 191 -153 258 -110 507 91 151 212 -16 115
4340 115 282 -143 144 26 135 307 -212 50 -151 94 303 -182 -179 204 -48 125 -38 -193 104 -14 58
4361 58 -174 -133 230 -15 -32 -3 -144 -25 628 110 -55 27 29 -314 303 -123 -68 251 -112 -258 2 -38 -336
4384 -336 -74 130 36 19 124 220 47 136 287 52 -77 -13 250 39 -115 118 81 9 -45 -113 -111 182 -55 -11
4408 -11 390 -11 79 -280 43 149 283 -108 37 -41 383 -146 -269 -68 134 -12 117 157 145 12 68 -162
4430 -162 -288 175 20 336 59 95 -131 111 210 117 166 -237 274 255 -8 -9 6 -125 151 151 -28 -2 -153 -34
4454 -34 16 -11 -220 16 198 211 -70 172 -143 30 30 -148 72 -149 23 -73 -314 -150 -242 -207 -117 -43 177 -143
4478 -143 271 82 -149 23 -185 31 -79 62 57 2 -142 -156 73 207 168 -314 22 262 207 -318 12 -5
4500 -5 -175 87 -203 185 227 -113 -51 2 -99 -37 117 105 133 -53 77 85 97 -53 -2 108 -1 74 104 -50 -74
4525 -74 33 208 -80 25 -76 194 -27 -97 -4 251 -135 -6 -243 -281 -124 39 45 161 226 -154 41 52 -171
4548 -171 158 116 -95 -4 -125 -28 30 -177 -225 69 -48 86 -103 -243 -136 -172 -115 98 -246 -160 186 -19 8
4571 8 259 62 89 -93 98 123 -20 -161 5 258 40 67 259 177 -147 -116 -156 -92 -216 -147 250 31 -167
4594 -167 -146 3 10 -219 -67 136 9 292 119 -130 -232 -430 -114 -326 51 -98 -171 -123 13 -27 -1 -265
4616 -265 -158 -428 55 -176 -94 10 19 -62 -237 152 -402 29 65 -167 -146 -101 -378 -1 70 324 -131 170 -145
4639 -145 23 55 -320 -257 -141 197 -54 -153 133 -52 -41 291 253 10 -18 -3 -342 90 -180 83 -288 205
4661 205 -65 -20 196 172 42 129 -155 -159 -49 -87 -64 -6 -122 78 161 127 66 116 -354 305 -173 -72 302 11
4685 11 -234 91 77 126 -309 -433 163 -83 14 165 -177 47 -234 -71 -3 -247 422 -168 -222 24 -223 -137
4707 -137 19 -207 -134 4 156 10 123 118 28 107 -10 96 68 40 236 -53 154 22 -124 -269 -274 -231 -107
4730 -107 -321 -266 1 32 -309 60 123 -37 12 259 45 -120 151 -182 -60 -164 129 81 287 133 170 48
4752 48 85 143 -143 130 175 -38 110 23 109 398 48 81 -73 -175 -231 5 126 83 218 -3 -19 68 54 -75
4776 -75 -253 66 176 223 -146 69 219 286 -110 -71 167 152 -3 297 -154 -314 -96 -61 -32 80 -85 -37 39
4799 39 -50 -121 -58 -269 -152 -114 -60 -119 -76 -143 16 -440 -144 103 -184 267 105 57 -35 98 339 38 -127 125
4823 125 -217 70 -5 11 277 -37 230 -7 -129 173 -94 -100 -233 -161 147 -48 -88 -165 -2 -150 24 37 -207
4846 -207 156 125 78 90 -26 50 36 44 50 116 -2 -27 -253 239 75 342 -186 -17 234 -135 -152 12 32 -209
4870 -209 144 -75 -20 -60 164 157 119 131 136 -349 -311 33 47 -43 49 164 3 49 48 -141 -288 112 14 -129 17
4895 17 -100 -226 94 -233 110 167 -260 124 121 -211 -175 47 -22 131 -52 18 -9 -131 -2 -148 -60 -130 -189 -42
4919 -42 -83 31 -16 -6 3 -228 10 -107 -99 208 329 78 186 276 33 -172 -18 109 -355 96 -73 33 -76
4942 -76 87 378 -20 164 -192 59 -215 -68 -52 269 72 -95 -55 -17 109 138 -114 224 297 28 -11 266
4964 266 -108 199 91 42 37 -291 -199 167 65 -43 121 -15 67 -116 325 149 -123 170 221 -150 -102 -26 55
4987 55 -316 170 112 -139 139 -95 187 -415 259 99 -28 153 -12 39 -185 -167 -70 210 -182 -63 -196 -16
5009 -16 -125 45 77 9 36 -24 210 164 -56 121 -229 167 -67 92 -56 -89 83 -61 -8 -174 -60 70 39
5032 39 -131 146 -31 141 -60 172 -41 161 64 -200 81 -117 -126 -214 -18 -32 -82 183 -53 341 103 100 237
5055 237 84 -5 -158 137 -85 18 123 -221 -117 240 -115 12 -37 -170 246 117 -297 -86 -158 -118 -143 87
5077 87 64 264 64 -18 4 158 85 -7 -97 70 3 -73 -172 94 -226 66 -86 -50 -90 51 237 -76 167 158 -162
5102 -162 110 -227 258 -220 -79 -142 388 18 6 7 -19 -95 -261 31 -68 -124 -66 -121 -38 -117 -90 -107 -18 57 -225
5127 -225 132 -235 67 248 38 -22 202 -295 30 -188 -226 33 172 132 -96 -65 -233 -126 -75 -87 82 67
5149 67 -187 -166 -180 -92 62 -83 -286 -29 72 -144 107 56 -124 87 -183 -122 147 -180 -118 111 189 130 -193
5172 -193 149 -115 155 -39 291 94 157 -72 -50 51 51 -113 -218 124 -332 -21 78 202 -149 -156 85 -79
5194 -79 -99 3 -6 -75 -105 64 -83 22 81 20 -52 -75 80 -189 -156 101 -223 44 8 -48 123 -64 -282 -136
5218 -136 -202 34 -99 120 51 -83 -442 -179 -57 -149 -19 -157 60 -152 -140 33 127 -117 116 -200 31 -66
5240 -66 -55 -80 -119 29 172 2 1 -117 -69 -44 -11 -79 -149 96 -413 -78 187 -30 -44 63 8 -97 -26 -179 301
5265 301 -80 -111 23 -166 90 150 22 -191 134 -102 -1 -230 -67 -272 35 -50 -19 105 -104 159 -164
5286 -164 76 -205 -5 -152 136 11 -247 -81 -169 82 -63 -113 41 88 154 -184 -113 7 -250 26 225 167
5308 167 15 13 232 26 253 -144 147 56 158 9 284 32 -287 175 64 95 -213 -97 67 -40 322
5329 322 258 298 -311 -349 280 -58 -312 207 -61 -357 -179 184 15 0 -208 284 -217 90 -128 -19 -51 -252
5351 -252 333 134 -21 -50 43 -157 -59 -58 73 183 -375 -25 -115 -70 -10 182 37 -92 -243 -86 97 -44 79
5374 79 -57 -2 30 263 -7 -228 -190 -99 115 -7 -289 -50 -235 -84 47 -58 130 83 141 191 94 -157 -134
5397 -134 -162 -86 -24 24 -93 38 193 65 84 108 -115 -103 203 -163 -101 2 -2 194 128 -95 80 35 9 272
5421 272 -58 -30 50 -86 -176 -158 -90 -27 193 -101 -29 -257 -1 -328 34 28 126 202 -521 282 86 -21 25 49
5445 49 -11 -22 54 -246 201 -272 -98 51 -13 35 -51 -77 474 115 -19 355 -147 77 89 128 30 48 -314 -201
5469 -201 -55 -111 -251 69 -36 105 -266 210 -7 -31 -220 21 -124 -16 211 -256 115 -192 64 -261 -67
5490 -67 251 -206 -5 -63 206 145 -247 49 82 184 79 144 189 -30 -178 156 39 327 62 -234 0 49
5512 49 -311 99 270 98 215 -21 -52 139 37 -235 -188 -30 217 306 -152 251 12 -34 -34 108 -309 176
5534 176 -29 -134 -46 -41 91 -79 -166 -199 -348 -460 86 290 -89 18 63 -29 176 19 -324 -111 13 132
5556 132 13 47 98 60 -23 -34 57 254 21 -76 345 -164 -360 33 -30 -79 -204 206 241 -44 -42 99 -86 144
5580 144 29 62 57 -293 -49 222 -338 -70 37 50 -100 86 -81 336 129 -88 -10 -65 345 -95 -28 193
5602 193 87 -120 76 -7 40 110 367 83 271 124 -102 -219 -59 297 -302 136 -211 -83 -65 -54 -219 11
5624 11 216 -172 63 -234 224 -21 -30 56 -147 272 -87 295 250 -36 111 230 -429 -58 -46 54 -98 -224
5646 -224 281 -229 -54 -52 32 -288 -108 -72 -37 -32 -141 -94 -222 359 -22 -76 173 37 291 279 120 119 58 71 114
5671 114 200 -27 -133 -154 -2 22 -267 -209 166 -125 280 -120 167 -245 -29 -136 -225 -154 495 -189 -245 -24
5693 -24 94 64 8 37 87 -26 102 166 150 184 -114 -218 1 105 217 129 -245 -198 -45 131 -41 28 -32 82
5717 82 -21 42 -62 152 42 258 -401 89 23 -57 -85 -129 -38 -194 42 140 85 157 8 -83 225 -61 -310 -129
5741 -129 408 -100 -188 19 -113 -115 -76 194 53 -45 264 288 -193 -46 -86 10 -238 -147 388 262 -257 176 158
5764 158 -50 -239 -42 76 57 -31 42 -283 351 282 207 -152 -28 170 -21 -84 87 2 111 0 181 116 -110
5787 -110 -256 -229 22 -343 214 -58 -34 -174 323 -246 -119 19 -172 193 -92 -4 508 8 -111 41 -50
5808 -50 -101 36 98 34 -160 -13 -124 -70 174 212 -252 99 -301 -413 -286 -122 -56 -119 46 172 224 -22 -214
5831 -214 -212 41 -138 96 7 -270 169 -203 62 137 156 -23 -15 -188 -312 -42 -373 146 59 244 -112 253 -73
5854 -73 116 -5 -366 90 64 -221 103 -143 289 132 -121 15 -1 -88 -82 171 58 13 101 -267 -80 183 -145
5877 -145 -499 42 -283 165 -242 63 -11 -209 93 114 -204 -84 134 36 -47 239 -127 -68 81 60 -284 -253
5899 -253 7 64 -233 125 -138 244 -68 -243 251 -205 57 -17 -134 328 31 171 -229 -94 -212 171 242
5920 242 -195 -245 265 -14 -149 19 -129 30 315 -420 110 -43 190 262 215 -240 116 -137 -60 -54 -127 171
5942 171 -89 25 15 235 2 -268 140 -17 132 190 96 -219 182 91 -53 55 101 219 24 -187 71 52
5964 52 175 -297 -124 -155 -377 338 291 41 -232 189 163 67 196 -141 -80 106 -54 116 -44 25 -214 3
5986 3 -56 97 -245 323 0 6 1 223 14 -34 73 111 -65 254 76 142 307 -205 51 68 220 13 -58 -274
6010 -274 40 130 -211 -166 98 161 0 104 -99 58 -122 89 -123 -216 51 58 -43 -18 17 87 -215 25 -73
6033 -73 -59 -166 -94 107 203 -67 245 160 18 -72 123 304 115 -271 52 6 179 -109 -36 155 2 -27 -147
6056 -147 448 -59 -185 -271 53 -73 -183 -221 68 43 -279 11 66 137 -111 178 121 114 15 158 -56 89 -411
6079 -411 -88 -199 135 -125 35 -68 51 -137 -23 -111 -1 -269 -62 -236 68 108 200 359 222 136 223 106
6101 106 141 -53 85 -234 40 -212 -224 135 230 -56 184 -19 -153 184 30 4 -111 -99 -154 160 78 -154
6123 -154 100 255 9 -258 -85 -123 111 216 -98 -68 -107 -127 -153 -5 -20 -21 -244 -120 154 135 -36 -70 -184
6146 -184 -170 223 -36 -177 -59 -114 -5 233 84 404 -126 -111 312 -22 -247 209 300 10 164 -143 -40
6167 -40 101 122 152 -53 -231 23 225 40 -139 -276 -25 41 142 36 96 -61 -5 90 161 164 -47 -57 123 -181
6191 -181 -162 24 -88 181 -180 -268 -297 -117 19 182 -13 -83 38 15 -207 7 42 145 17 -22 13 303 286
6214 286 -313 -104 105 64 -140 105 124 135 -83 -20 -196 -230 129 65 196 139 -46 -138 42 420 246 60 83
6237 83 -118 -7 -5 -88 107 32 -48 -124 -249 39 -59 120 238 -187 -170 -177 -211 -116 -36 266 -163 146 83 -77 30
6262 30 39 -12 246 131 45 261 -28 -162 -69 380 60 -54 -2 247 206 72 -48 117 79 72 199 94 -15 136
6286 136 60 -20 -59 -1 -110 -188 137 227 -15 -136 57 251 179 75 13 50 -200 129 67 -32 -29 -83 160 -107 123
6311 123 92 -177 158 -202 24 362 -30 -18 -60 210 89 -233 221 128 131 -165 -56 103 156 -21 -192 39
6333 39 -210 340 -23 -38 -187 -37 10 469 -85 -14 -93 -96 115 -172 136 113 231 17 -54 102 -182 20 -124
6356 -124 -38 201 141 247 -72 35 185 87 51 -71 -173 189 -284 128 211 -235 68 -82 -198 26 11 25
6378 25 22 -24 -30 -28 264 142 128 50 262 -228 73 -266 54 -111 -304 -226 161 180 -9 209 -184 -84 219 -90
6402 -90 -124 65 -288 3 -105 38 -21 177 -160 -88 -41 -58 0 169 85 109 -33 170 -86 197 54 118 91 35
6426 35 66 64 225 59 7 201 27 -77 -115 274 125 183 80 37 -247 48 15 -192 -76 -46 -38 141 13 -149
6450 -149 -293 -51 -50 -63 87 -26 45 255 192 -9 183 140 124 56 370 43 136 136 28 141 -96 13 21 -62 -134
6475 -134 197 180 66 -83 -215 362 -33 -206 -86 121 88 -14 5 50 71 42 -76 319 213 -17 -300 -365
6497 -365 1 287 -60 -155 88 -47 -363 -361 83 94 -95 -266 229 -145 285 -27 33 -135 -109 77 215 120
6519 120 -12 -147 -152 272 204 98 -150 -89 -139 -109 0 -70 -92 101 42 -184 -209 167 -9 164 311 -13 173
6542 173 -145 208 107 -239 -197 41 92 -4 383 -257 141 -6 59 183 22 231 36 -190 -22 89 -96
6563 -96 -546 -20 60 206 -209 -23 -94 51 95 -1 -11 189 127 -127 -72 36 275 -114 -152 -38 64 9 58 132
6587 132 219 37 155 -4 -174 83 198 -20 -59 271 -54 110 10 4 -48 -195 -126 19 -42 -149 108 -208
6609 -208 66 -117 -2 126 35 23 -66 -226 88 -132 70 162 311 158 208 -305 106 16 -154 115 70 -100
6631 -100 -242 32 -116 -19 -299 -129 129 -19 34 393 -57 -44 -30 -62 -77 -69 -66 304 129 -139 102 83 -26 -242
6655 -242 -179 -147 -169 229 -93 30 -202 -55 108 145 -26 64 -124 -88 -295 191 2 274 -142 94 81 -56
6677 -56 -23 -275 155 171 71 -169 -205 -182 125 204 -76 9 -215 28 -99 -82 224 91 122 86 128 40 39 60 192
6702 192 -168 -91 158 -29 -142 -91 -187 -34 28 288 -52 -73 -69 -278 20 -243 17 183 -25 69 -71 -192 -6
6725 -6 -114 -211 -223 53 28 -56 143 -42 -66 257 54 362 36 245 119 -90 258 98 -72 -115 94 -57 140
6748 140 115 77 -287 -331 117 162 -9 -52 -2 16 -96 -229 -82 -231 61 -130 115 157 -23 -2 -131 0 -117
6771 -117 -262 -358 249 -99 -31 10 22 187 78 322 149 91 -63 86 105 137 87 -109 247 45 -35 98 -107
6794 -107 -174 -317 107 -195 204 -247 12 106 59 -59 -45 30 -100 262 -75 -104 -145 -31 -23 162 -5 -153 177
6817 177 -3 -221 -257 106 -361 146 135 -238 -33 163 149 28 -279 -191 -60 -24 -19 -234 -65 327 -246 -182 110
6840 110 86 19 -48 174 -115 -134 190 -134 -46 88 -279 -272 324 -89 -41 93 -253 63 181 6 85 188 -100
6863 -100 -394 -56 -133 -217 -86 87 -475 -17 102 108 249 117 -3 -176 222 101 133 106 87 85 177 154 -1 49
6887 49 -333 136 111 31 42 50 -73 -231 2 -30 -10 -157 241 -50 293 260 -177 -15 -135 117 -18 108 -4
6910 -4 3 105 -143 -10 5 -213 -75 165 32 234 83 126 192 72 -115 148 -155 -235 -9 -10 -180 -19 -85 230
6934 230 13 2 53 -55 26 91 123 -1 -10 -42 44 229 101 -99 13 81 186 112 21 -204 -169 -25 147 208 145
6959 145 -70 395 -17 277 -124 220 139 149 82 -128 -33 26 -31 44 -9 -123 47 109 254 -179 188 39 87
6982 87 67 -213 183 -50 -97 -7 -58 -432 -21 -99 75 53 159 -148 311 -56 -160 126 -15 -158 169 98 -229
7005 -229 -113 -25 98 -82 -185 -221 81 1 166 48 -118 155 161 -313 58 32 -203 -95 -272 -124 -155 47
7027 47 110 74 168 -58 -270 50 -54 -170 -241 -69 -63 62 204 -19 318 91 -297 84 -254 107 -39 -176
7049 -176 -324 5 20 131 -166 12 -507 -15 38 360 -166 -129 -300 73 175 -156 -134 246 -271 -176 -62 -189
7071 -189 -32 167 139 311 168 -32 104 41 116 153 290 81 68 -137 83 24 -240 146 -53 -146 -134 283 59
7094 59 124 -136 -161 -95 197 20 167 289 133 206 195 132 -317 195 165 -286 127 429 -96 195 225 206 -96
7117 -96 277 547 13 106 -55 -35 -39 -16 -249 125 108 78 -104 -140 -11 251 -26 -19 -7 -222 104 294 -129 -198
7141 -198 36 178 -107 -94 20 -247 -141 103 52 51 -78 397 156 103 -99 13 -21 186 -198 484 158 37
7163 37 11 45 156 142 211 -226 108 -66 -59 141 232 82 -27 -61 -264 137 27 174 161 -30 -123 -82 112 -23
7187 -23 52 -185 -24 227 17 -143 208 -387 -264 345 67 144 67 -27 3 143 301 91 -58 109 81 -187
7209 -187 -543 140 -88 42 55 15 -139 251 -219 -116 172 -32 -71 191 -257 11 -142 -120 74 -113 -110 128
7231 128 -76 70 -65 179 -54 102 -56 -58 87 108 173 26 -52 -155 106 -81 242 326 149 420 99 -1
7253 -1 -38 267 -129 -5 206 200 337 -122 -114 205 328 70 11 125 178 -91 104 254 61 -75 14 -152 121
7276 121 268 -107 191 -94 -164 -112 -153 50 72 91 194 -90 -391 28 -25 -125 9 -209 -66 317 -18 -11 19
7299 19 70 -41 -75 2 -589 14 229 84 131 73 292 -339 -278 -133 -167 138 -100 -33 -163 -24 -62 118 -188
7322 -188 -143 95 -204 -105 124 164 189 -13 -61 -13 125 -56 -9 72 97 64 -31 -56 17 -44 121 24 -34 67 -93
7347 -93 -254 -226 55 48 170 -126 -45 169 280 203 34 156 -25 277 -28 -53 34 183 -157 147 -50 -118 -5
7370 -5 -108 -148 297 58 138 54 160 182 384 32 108 -64 -115 -184 72 -10 21 9 -44 -190 154 -274 -46 -130 -47
7395 -47 24 288 -150 -91 -124 32 -140 -26 -208 286 -20 254 -30 209 107 36 199 98 -54 83 -195 150
7417 150 -350 71 321 -153 160 65 417 -149 -207 -135 49 -44 -143 -149 -356 71 95 134 -25 -79 -197 -68 25 12
7441 12 109 4 103 -198 -101 116 -50 -77 271 -114 -326 68 171 -214 298 187 -316 59 118 -209 50 84
7463 84 316 -78 -108 -177 18 26 24 124 234 315 59 -90 126 166 -107 -43 -411 3 56 -149 224 22 -280 -221
7487 -221 -139 47 93 -51 -256 -197 -307 21 -179 -67 -257 161 557 47 183 -238 -16 -78 -38 140 67 -114
7509 -114 210 -14 14 -98 102 147 91 61 234 220 -151 53 227 -251 16 -11 -28 -215 -158 -124 -11 125 164
7532 164 244 -226 -119 -63 -112 477 20 -18 123 -142 -206 225 -53 180 -4 -171 104 -37 -28 -165 -120 83 -83
7555 -83 46 -369 -287 290 -329 -14 186 -87 34 -294 299 -61 -184 -10 309 34 245 -114 27 187 63
7576 63 111 39 71 72 59 48 392 -101 -245 -44 -6 -82 -34 218 108 -28 223 346 -208 205 98 25 5 -170
7600 -170 11 26 -317 -197 367 237 -16 -175 281 194 111 65 -93 -354 71 -251 -451 73 -152 -61 -140 174
7622 174 184 -198 -146 175 277 -189 -148 89 63 -272 71 -85 -55 49 -94 -34 -25 -76 -138 -14 -49 -303 -84 -22
7646 -22 -30 -180 -46 -120 -94 134 230 -84 69 -154 -285 -132 50 -296 -55 53 -75 33 -95 -207 -113 145
7668 145 342 -17 2 70 114 -10 138 -90 140 74 -96 -30 -70 220 -16 -349 61 236 25 -38 105 21 105
7691 105 -93 177 37 -73 87 -231 160 208 177 15 235 11 256 -34 207 -125 232 -69 214 -17 105
7712 105 123 -87 93 -245 1 84 214 67 233 -31 -105 -54 -76 104 150 67 223 -257 16 -17 332 -90 -429
7735 -429 208 162 266 -193 -237 -2 154 -176 -220 153 -270 -356 -59 43 -10 199 99 531 -17 261 -147 57
7757 57 -124 -239 -86 99 -21 90 -140 -48 93 -41 -187 25 -36 -436 277 -148 -32 -48 202 175 -209 -115
7779 -115 55 -4 -236 179 -5 -29 -38 157 -28 301 16 -148 -183 32 15 20 160 602 -70 -75 335 -86 -76 -59
7803 -59 94 105 -156 37 -290 -45 246 -51 59 -230 66 5 137 133 3 92 125 11 -124 -16 80 -245 16
7826 16 53 -210 -167 62 251 156 22 49 1 -259 -47 -153 -48 -76 47 288 -218 12 166 124 230 161 -213
7849 -213 48 -35 143 402 -214 -43 419 465 147 -94 33 163 132 8 -322 -13 293 191 -167 133 308
7870 308 54 190 -309 -48 215 39 -35 -67 28 48 -94 -305 -17 -123 -111 -37 -41 57 7 -96 -125 371 -137 54
7894 54 26 0 76 53 -67 39 99 -278 -61 -103 59 157 -7 119 -192 -265 -301 -272 -193 -182 -206 -40 216 183 9
7919 9 -161 112 6 -2 -84 96 218 -150 32 136 -93 101 -80 -268 264 -169 -191 85 -114 -50 280 -364
7941 -364 -89 79 -67 157 100 140 -143 92 -5 123 114 -298 -42 61 84 15 -4 62 52 73 -8 -123 -116 -238 -97
7966 -97 -4 -231 37 -301 -6 66 163 -46 43 -252 57 44 114 180 -226 -35 -263 18 28 211 46 53 148 -151
7990 -151 -160 -115 105 213 -130 -184 60 -17 -84 -122 -59 201 -253 26 -94 -60 -38 -119 -166 -173 146 -224 -105 -38 -39 -84
8016 -84 197 147 49 -279 76 -7 -183 4 -140 -279 172 -246 242 146 -105 -191 -178 382 -44 205 -76 -50 -47
8039 -47 -135 -103 -363 91 -292 -100 35 -193 -132 -228 11 -301 26 179 -304 100 -49 117 111 188 -35 239 60
8062 60 75 186 -84 242 -237 -33 32 -82 83 32 357 -73 -188 -85 -50 -190 -134 -102 -93 -110 216 -14 33 34
8086 34 206 -219 63 213 -142 234 -190 -91 -38 -182 56 -228 134 -12 21 103 -2 -114 -111 34 16 109 -55
8109 -55 140 -275 -229 184 -56 13 -154 -47 -102 26 112 -61 -155 -218 -6 -293 -406 -129 -120 -209 52 218 -58
8132 -58 -149 138 21 107 -76 -135 -276 -196 66 -22 165 -144 -301 7 -34 -85 -241 -297 222 -281 166 -246 -63
8155 -63 238 -293 -64 135 166 147 178 58 215 -42 -28 299 -117 -54 -262 -300 13 -29 246 -23 -69 -156 -14
8178 -14 92 -21 -193 -101 30 -112 -132 -19 5 127 360 -52 -71
8191g1
##END NTUPLES=NMR FID
##END=
