##TITLE=1H_LR-579-H1-CR8
 D2O, 8 sc, 
 24.6.2019
##JCAMPDX= 6.0         $$ Bruker NMR JCAMP-DX V2.0
##DATA TYPE= NMR FID
##DATA CLASS= NTUPLES
##ORIGIN= UXNMR, Bruker Analytische Messtechnik GmbH
##OWNER= root
$$ XWIN-NMR		Version 3.5
$$ Mon Jun 24 16:00:28 2019 Russian Standard Time (UT+4h)  she@DPX200
##.OBSERVE FREQUENCY= 200.13155
##.OBSERVE NUCLEUS= ^1H
##.DELAY= (6, 6)
##.ACQUISITION MODE= SIMULTANEOUS
##.ACQUISITION SCHEME= undefined
##.AVERAGES= 8
##.DIGITISER RES= 18
##SPECTROMETER/DATA SYSTEM= spect
##.PULSE SEQUENCE= zg30
##.SOLVENT NAME= CDCl3
##.SHIFT REFERENCE= (INTERNAL, CDCl3, 0, 15.7039)
##AUDIT TRAIL= $$ (NUMBER, WHEN, WHO, WHERE, WHAT)
$$ ##TITLE= Audit trail, XWIN-NMR		Version 3.5
$$ ##JCAMPDX= 5.01
$$ ##ORIGIN= Bruker BioSpin GmbH
$$ ##OWNER= she
$$ F:/spectra/data/she/nmr/H-F/1/audita.txt
$$ ##AUDIT TRAIL=  $$ (NUMBER, WHEN, WHO, WHERE, WHAT)
(   1,<2019-06-24 15:59:08.15 +0400>,<she>,<DPX200>,
      <created by zg, POWCHK disabled, PULCHK disabled
       configuration hash MD5:
       00 E9 B6 7A A2 85 ED C7 34 08 36 98 17 FE 4E 26
       data hash MD5: 16K
       BA 49 32 B3 FA E6 6D B9 E0 E9 80 D3 E1 59 20 F8>)
$$ ##END=
$$ 
$$ hash MD5
$$ 96 40 75 B4 8E E3 1A 4A 6B 2A 25 EC 91 3F 01 3F
##$RELAX= 
##$RELAX= 
##$RELAX= 
##$RELAX= 
##$RELAX= 
##$RELAX= 
$$ Bruker specific parameters
$$ --------------------------
##$DU= <F:/spectra>
##$EXPNO= 1
##$NAME= <H-F>
##$PROCNO= 1
##$TYPE= <nmr>
##$USER= <she>
##$AMP= (0..31)
100 100 100 100 100 100 100 100 100 100 100 100 100 100 100 100 100 100 
100 100 100 100 100 100 100 100 100 100 100 100 100 100 
##$AQSEQ= 0
##$AQ_mod= 1
##$AUNM= <au_zg>
##$AUTOPOS= <>
##$BF1= 200.13
##$BF2= 200.13
##$BF3= 200.13
##$BF4= 200.13
##$BF5= 200.13
##$BF6= 200.13
##$BF7= 200.13
##$BF8= 200.13
##$BYTORDA= 1
##$CFDGTYP= 0
##$CFRGTYP= 5
##$CHEMSTR= <none>
##$CNST= (0..31)
1 1 145 1 1 1 1 1 1 1 1 1 1 1 1 1 1 1 1 1 1 1 1 1 1 1 1 1 1 1 1 1 
##$CPDPRG= <>
##$CPDPRG1= <>
##$CPDPRG2= <>
##$CPDPRG3= <>
##$CPDPRG4= <mlev>
##$CPDPRG5= <mlev>
##$CPDPRG6= <mlev>
##$CPDPRG7= <mlev>
##$CPDPRG8= <mlev>
##$CPDPRGB= <>
##$CPDPRGT= <>
##$D= (0..31)
0 1.2 0 0 0 0 0 0 0 0 0 0.03 0 0 0 0 0 0 0 0 0 0 0 0 0 0 0 0 0 0 0 0 
##$DATE= 1561377547
##$DBL= (0..7)
120 120 120 120 120 120 120 120 
##$DBP= (0..7)
150 150 150 150 150 150 150 150 
##$DBP07= 0
##$DBPNAM0= <>
##$DBPNAM1= <>
##$DBPNAM2= <>
##$DBPNAM3= <>
##$DBPNAM4= <>
##$DBPNAM5= <>
##$DBPNAM6= <>
##$DBPNAM7= <>
##$DBPOAL= (0..7)
0.5 0.5 0.5 0.5 0.5 0.5 0.5 0.5 
##$DBPOFFS= (0..7)
0 0 0 0 0 0 0 0 
##$DE= 6
##$DECBNUC= <off>
##$DECIM= 24
##$DECNUC= <off>
##$DECSTAT= 4
##$DIGMOD= 1
##$DIGTYP= 9
##$DL= (0..7)
0 120 120 120 120 120 120 120 
##$DP= (0..7)
150 150 150 150 150 150 150 150 
##$DP07= 0
##$DPNAME0= <>
##$DPNAME1= <>
##$DPNAME2= <>
##$DPNAME3= <>
##$DPNAME4= <>
##$DPNAME5= <>
##$DPNAME6= <>
##$DPNAME7= <>
##$DPOAL= (0..7)
0.5 0.5 0.5 0.5 0.5 0.5 0.5 0.5 
##$DPOFFS= (0..7)
0 0 0 0 0 0 0 0 
##$DQDMODE= 0
##$DR= 18
##$DS= 0
##$DSLIST= <SSSSSSSSSSSSSSS>
##$DSPFIRM= 0
$$ [...]
##$SUBNAM2= <"">
##$SUBNAM3= <"">
##$SUBNAM4= <"">
##$SUBNAM5= <"">
##$SUBNAM6= <"">
##$SUBNAM7= <"">
##$SUBNAM8= <"">
##$SUBNAM9= <"">
##$SW= 24.9336996594482
##$SWIBOX= (0..15)
0 0 2 0 0 0 0 0 0 0 0 0 0 0 0 0 
##$SW_h= 4990.01996007984
##$TD= 16384
##$TD0= 1
##$TE= 0
##$TE2= 300
##$TE3= 300
##$TEG= 300
##$TL= (0..7)
0 120 120 120 120 120 120 120 
##$TP= (0..7)
150 150 150 150 150 150 150 150 
##$TP07= 0
##$TPNAME0= <>
##$TPNAME1= <>
##$TPNAME2= <>
##$TPNAME3= <>
##$TPNAME4= <>
##$TPNAME5= <>
##$TPNAME6= <>
##$TPNAME7= <>
##$TPOAL= (0..7)
0.5 0.5 0.5 0.5 0.5 0.5 0.5 0.5 
##$TPOFFS= (0..7)
0 0 0 0 0 0 0 0 
##$TUNHIN= 0
##$TUNHOUT= 0
##$TUNXOUT= 0
##$USERA1= <user>
##$USERA2= <user>
##$USERA3= <user>
##$USERA4= <user>
##$USERA5= <user>
##$V9= 5
##$VALIST= <valist>
##$VCLIST= <CCCCCCCCCCCCCCC>
##$VD= 0
##$VDLIST= <DDDDDDDDDDDDDDD>
##$VPLIST= <PPPPPPPPPPPPPPP>
##$VTLIST= <TTTTTTTTTTTTTTT>
##$WBST= 1024
##$WBSW= 4
##$XGAIN= (0..3)
0 0 0 0 
##$XL= 0
##$YL= 0
##$YMAX_a= 213898
##$YMIN_a= -368121
##$ZGOPTNS= <>
##$ZL1= 120
##$ZL2= 120
##$ZL3= 120
##$ZL4= 120
##$ABSF1= 10
##$ABSF2= 0
##$ABSG= 5
##$ABSL= 3
##$ALPHA= 0
##$AQORDER= 0
##$ASSFAC= 0
##$ASSFACI= 0
##$ASSFACX= 0
##$ASSWID= 0
##$AUNMP= <proc_1d>
##$AZFE= 0.1
##$AZFW= 0.1
##$BCFW= 1
##$BC_mod= 2
##$BYTORDP= 1
##$COROFFS= 0
##$CY= 11.3945322036743
##$DATMOD= 1
##$DC= 2
##$DFILT= <>
##$DTYPP= 0
##$F1P= 18.9103706918063
##$F2P= -1.10871071338519
##$FCOR= 0.5
##$FTSIZE= 0
##$FT_mod= 4
##$GAMMA= 1
##$GB= 0.15
##$INTBC= 1
##$INTSCL= 1
##$ISEN= 128
##$LB= 0.24
##$LEV0= 0
##$LPBIN= 0
##$MAXI= 10000
##$MC2= 0
##$MEAN= 0
##$ME_mod= 0
##$MI= 1.114404
##$NCOEF= 0
##$NC_proc= 0
##$NLEV= 6
##$NOISF1= 3.799351
##$NOISF2= 2.8
##$NSP= 1
##$NTH_PI= 0
##$NZP= 0
##$OFFSET= 15.70392
##$PC= 1
##$PHC0= -8496.44
##$PHC1= 2.600971
##$PH_mod= 1
##$PKNL= yes
##$PPARMOD= 0
##$PSCAL= 0
##$PSIGN= 0
##$REVERSE= no
##$SF= 200.130013532006
##$SI= 16384
##$SIGF1= 3
##$SIGF2= 2
##$SINO= 400
##$SIOLD= 16384
##$SREGLST= <1H.CDCl3>
##$SSB= 0
##$STSI= 0
##$STSR= 0
##$SW_p= 3612.71676300578
##$SYMM= 0
##$S_DEV= 0
##$TDeff= 0
##$TDoff= 0
##$TI= <>
##$TILT= no
##$TM1= 0
##$TM2= 0
##$TOPLEV= 0
##$USERP1= <user>
##$USERP2= <user>
##$USERP3= <user>
##$USERP4= <user>
##$USERP5= <user>
##$WDW= 1
##$XDIM= 8192
##$YMAX_p= 0
##$YMIN_p= 0
$$ End of Bruker specific parameters
$$ ---------------------------------
##NTUPLES= NMR FID
##VAR_NAME=  TIME,          FID/REAL,        FID/IMAG
##SYMBOL=    X,             R,               I
##VAR_TYPE=  INDEPENDENT,   DEPENDENT,       DEPENDENT
##VAR_FORM=  AFFN,          ASDF,            ASDF
##VAR_DIM=   8192,          8192,            8192
##UNITS=     SECONDS,       ARBITRARY UNITS, ARBITRARY UNITS
##FACTOR=    0.0002004,     1,               1
##FIRST=     0,             0,               0
##LAST=      1.6414764,     0,               0
##MIN=       0,             -368121,         0
##MAX=       1.6414764,     213898,          0
$$ Real data points
##PAGE= N=1
##DATA TABLE= (X++(R..R)), XYDATA
0 0 0 0 0 0 0 0 6 -8 8 -8 16 -16 24 -24 32 -40 48 -59 71 -80 96 -112 130 -151 173 -198 227 -257 293 -328
30 -328 372 -417 466 -523 583 -652 726 -804 893 -989 1096 -1213 1341 -1489 1649 -1827 2032
47 2032 -2262 2526 -2832 3192 -3627 4154 -4819 5685 -6863 8566 -11269 16227 -28366 121506
61 121506 56492 -256114 -204737 -71813 7421 6709 116263 213898 154514 -68945 -209911
72 -209911 -187199 -73040 21933 125995 199692 156464 -27991 -190470 -206343 -102554 7790
83 7790 102785 172782 159876 19443 -146655 -202686 -131391 -25547 70380 154823 178902 72828
95 72828 -108948 -209356 -156136 -36221 58430 126547 169669 118733 -46266 -197704 -190271
106 -190271 -53861 67863 113756 129995 123805 33528 -124842 -212448 -134675 34408 150512
117 150512 161567 105252 16781 -86193 -155290 -132929 -27037 89817 155416 147452 66369
128 66369 -64249 -168546 -162506 -46122 87417 150881 133765 64100 -35203 -126808 -152254
139 -152254 -85138 28608 119192 148678 109219 3723 -125208 -185610 -116911 28540 131012
150 131012 133502 76821 9454 -64402 -135592 -143844 -50852 85817 159526 125304 27849 -71739
162 -71739 -134214 -135080 -62540 51473 136019 137771 60559 -46223 -127229 -140546 -76426 29400
174 29400 115020 133355 80895 -11312 -99496 -139258 -104021 -6184 97771 144533 108386 12868
186 12868 -89717 -142852 -111176 -12560 86518 126755 98940 33851 -41331 -107964 -129335 -69486
198 -69486 50574 144686 139809 47855 -54595 -109423 -108014 -61576 18121 99977 132687 86510
210 86510 -11579 -99006 -127240 -85015 3552 90920 128597 93462 8101 -79049 -121741 -98363
222 -98363 -21175 68249 118561 102093 30404 -55221 -112775 -112886 -51041 45124 116627 115506 43381
235 43381 -47437 -103787 -105731 -60307 15064 88396 117442 74222 -17924 -97137 -116978 -73614
247 -73614 2483 74261 108665 86117 11481 -74265 -118107 -92841 -15546 66507 108200 90329
259 90329 24535 -51586 -99185 -94545 -39243 39335 100069 106459 51577 -32920 -96209 -101542 -50045
272 -50045 27698 90007 104100 61908 -12252 -76810 -97472 -65913 683 70136 105548 83881
284 83881 11072 -69730 -106078 -77602 -7724 60235 93436 80465 27050 -42670 -93214 -92296
296 -92296 -36557 40396 92104 90180 39233 -31298 -84363 -93740 -52532 18241 78790 94053
308 94053 55061 -15624 -76252 -93974 -62145 1167 62216 89628 68432 7516 -59892 -94741
320 -94741 -75767 -14948 52225 88471 75537 22094 -43194 -85310 -81477 -32513 35063 83262
332 83262 84201 38935 -27645 -77519 -84181 -44267 20169 72825 86209 52863 -9468 -65550 -84948
345 -84948 -56499 3661 62084 86149 63505 6538 -53254 -82705 -66383 -12995 48160 83378
357 83378 72513 21016 -41357 -78985 -72053 -26111 32954 73812 75662 36350 -24154 -71705
369 -71705 -79451 -41754 19135 68188 78188 45485 -11591 -61885 -78269 -52423 1856 55276
381 55276 77800 56628 3914 -51512 -77899 -60905 -11403 42971 73191 62942 18247 -37459
393 -37459 -73836 -68392 -25266 30614 68258 67523 30224 -23843 -65450 -71847 -38465 16693 61282
406 61282 71593 42099 -10857 -57057 -71411 -46410 3789 51165 70406 51657 4473 -44919
418 -44919 -69703 -55538 -9315 41753 68934 57928 16649 -32461 -63804 -60115 -22803 28521
430 28521 65025 65355 28823 -22188 -59560 -62746 -32036 16217 55915 65322 39310 -8086 -51080
443 -51080 -65077 -42614 3038 46664 64884 47269 3636 -42014 -64605 -51759 -10047 36717
455 36717 62735 53372 13972 -33380 -61461 -55402 -20852 24059 55160 56543 26072 -20121 -56498
468 -56498 -61602 -32182 14060 50791 58158 33863 -8702 -46744 -60535 -41554 1074 43675
480 43675 61682 43647 1647 -39921 -58184 -44298 -7533 32773 56660 50614 16597 -27522
492 -27522 -56831 -52495 -16668 27153 54748 52658 23331 -16676 -47855 -53700 -29090 13793 49263
505 49263 57325 33113 -7925 -43464 -54742 -35146 3539 40846 54880 39177 3231 -34519
517 -34519 -54053 -44272 -9096 31640 54844 45490 10479 -29316 -51395 -45581 -16763 19357 45451
530 45451 48026 24017 -16204 -49281 -54307 -26768 15277 44528 47208 25554 -7104 -37205 -51282
543 -51282 -37342 -22 38404 52733 34881 -939 -32898 -46817 -38248 -9505 26539 50508
555 50508 44099 11339 -26484 -46841 -41187 -14866 18996 44177 46519 23064 -15285 -44352 -46573
568 -46573 -21194 15064 40101 43171 26140 -2285 -31499 -47730 -36639 798 40206 52488
580 52488 30632 -4936 -29732 -37871 -32323 -11759 20634 47033 45005 11589 -27809 -45983 -36721
593 -36721 -11903 16482 38006 41562 21234 -14206 -41565 -44098 -21218 11132 35876 41520 24718
606 24718 -5978 -34637 -44571 -29137 2186 31223 42125 28678 688 -26311 -40167 -35296
618 -35296 -11047 23397 46408 38226 4798 -27273 -37912 -29087 -12012 9332 33025 44098
630 44098 25146 -15130 -44575 -40721 -13267 14225 30196 34490 24749 -566 -29980 -42436 -27324
643 -27324 3197 30671 40252 28803 2083 -26180 -38629 -29506 -4483 22772 38425 33209 9160
656 9160 -19922 -35972 -31355 -12010 12754 33620 39214 20347 -15510 -40536 -35980 -10580 12260
669 12260 23835 29634 25847 2785 -30958 -45981 -26050 9141 30543 30454 19650 3936 -18207
682 -18207 -37171 -33933 -6448 24392 36767 27069 5696 -17568 -33183 -31633 -11602 14851 31161
695 31161 31176 15041 -9718 -30966 -34936 -17245 9758 28973 32942 20814 -3377 -28654 -37050
708 -37050 -20300 8619 25584 25709 19561 9254 -12093 -36813 -37593 -5207 31686 38845 18829
721 18829 -1953 -11893 -20503 -28266 -19120 10383 36417 35091 10477 -15229 -27865 -27325 -15453
734 -15453 6084 26445 31466 17517 -4901 -23597 -31214 -22327 1176 24757 31429 19473 -162
747 -162 -18064 -28857 -27023 -6921 20046 33429 23754 1723 -14640 -23718 -25987 -15637 10117
760 10117 33278 32481 7358 -16605 -23832 -20606 -14737 -299 21927 35209 22391 -8462 -29544
773 -29544 -28473 -12874 4053 16946 25684 22288 3804 -18828 -29811 -22686 -3391 16677 28492
786 28492 24091 5599 -15465 -26662 -23276 -8699 11055 26173 26249 10257 -10668 -23725 -23386
799 -23386 -14015 2793 22595 31163 18677 -7988 -26794 -25039 -10587 2914 13643 22983 23288
812 23288 6216 -19344 -32029 -20650 1811 17894 22265 18609 7642 -9883 -25252 -25995 -9110
825 -9110 13600 26677 22375 6920 -9738 -20750 -22127 -12898 4143 20315 25917 15540 -5066
838 -5066 -21931 -25024 -14150 2081 16448 23698 18270 1707 -17731 -26204 -17742 -607 13801
851 13801 20471 19217 8124 -10155 -24958 -24657 -6985 13870 23588 18783 6242 -6579 -17182
864 -17182 -21475 -14036 4089 21432 25161 12942 -5876 -19039 -20673 -12979 822 15094 23148
877 23148 18205 1122 -16804 -23241 -15683 -829 12545 19288 18114 7607 -9166 -22764 -22104
890 -22104 -6713 12419 21528 17907 6689 -6637 -17209 -20464 -12424 3891 19141 22529 11538
903 11538 -4934 -17378 -19583 -13031 115 14019 21659 16409 83 -15995 -21550 -14453 -1506
916 -1506 11299 18479 17026 6077 -9678 -21146 -19620 -5381 10720 19305 17091 7568 -6132
929 -6132 -17154 -19434 -10369 5689 18032 19346 10470 -3332 -14448 -18656 -13188 293 14643
942 14643 20642 13917 -634 -14261 -18865 -13494 -2062 10703 18267 16351 4743 -9953 -19134
955 -19134 -16692 -4507 8494 17129 16354 7799 -5308 -16626 -18337 -9119 5921 16675 16721 9061
969 9061 -2908 -13100 -17334 -13007 -31 14355 19932 12889 -1291 -13196 -16815 -11752 -1956 9117
983 9117 16382 15547 5228 -9329 -18433 -16310 -4557 8724 15911 14873 6554 -5578 -15101 -16737
997 -16737 -8870 4686 15058 16201 8981 -3195 -13319 -16538 -10870 865 12237 16918 11509
1010 11509 197 -10862 -16091 -12695 -2189 9795 16672 13980 3019 -8883 -15290 -13581 -4399
1023 -4399 6754 14496 14699 6663 -5638 -14809 -15134 -6839 4683 13518 14989 8250 -2201 -11820
1037 -11820 -15104 -10275 1057 11966 15910 11155 -155 -10666 -14994 -11029 -1665 8756 14399
1050 14399 12568 2879 -8020 -14336 -13151 -4462 6096 13356 13668 5689 -5612 -13783 -14135 -6778
1064 -6778 4246 12448 13529 7759 -2494 -11361 -14740 -9442 1281 10601 14468 9974 -212 -10193
1078 -10193 -13932 -10192 -1458 8289 13749 11554 2798 -6980 -13452 -12309 -3693 6668 13242 12292 5245
1093 5245 -4737 -11609 -12760 -6252 3626 11818 13657 7136 -2965 -10695 -12396 -7722 1295 9558 12873
1108 12873 9176 629 -9022 -13698 -10290 -1667 8267 12988 9901 1777 -7036 -12323 -11029 -4168 5093
1123 5093 11923 11793 4968 -5294 -12043 -11892 -5266 3718 10259 11651 7028 -2118 -10103 -12599 -7908
1138 -7908 1096 9772 12364 8522 -188 -8171 -11552 -8945 -1038 7504 11983 10104 1950 -6417 -11412
1153 -11412 -9687 -2543 5166 10511 10797 5207 -3672 -10895 -11933 -5318 3892 10192 10726 5870 -1982
1168 -1982 -8639 -11144 -7279 1196 8801 11098 7609 -173 -7758 -11200 -8653 -1528 7017 11087 8596
1183 8596 1608 -6034 -10449 -9327 -3353 4950 10365 10304 4036 -4784 -9970 -9782 -4199 3099 8993 10207
1199 10207 5901 -1650 -8682 -10879 -6082 1436 8134 10284 6864 337 -6286 -10489 -8392 -1507 7168
1214 7168 11359 7721 600 -6160 -9135 -7774 -3207 3696 9557 10502 3954 -4791 -10051 -8867 -3418
1229 -3418 2649 7560 9508 6408 -1482 -9001 -10852 -5449 2431 7936 8096 5809 562 -5620 -9696
1244 -9696 -8065 -749 7239 10013 7143 680 -5551 -8590 -7441 -2699 3837 8688 8447 3781 -3485
1259 -3485 -9022 -8674 -3810 2832 7607 8514 4975 -1514 -7735 -9460 -5373 2303 7400 8113 5156 466
1275 466 -5447 -9282 -7787 -743 6730 8753 5733 604 -3952 -7419 -8132 -3788 4239 9810 8066
1290 8066 1905 -4508 -7196 -6539 -3968 925 6900 9134 4753 -2514 -7971 -8007 -4010 1335 5900 7615
1306 7615 5516 537 -5390 -8680 -6574 -277 6318 8288 5625 545 -3679 -6728 -7271 -3631 3876
1321 3876 9396 7779 1075 -4373 -6315 -5506 -3577 388 6441 9574 5188 -2848 -8003 -7221 -3244
1336 -3244 1065 4569 7370 6582 451 -6605 -8716 -5122 412 4720 6917 5658 1628 -3848 -7451
1351 -7451 -6738 -2314 4286 7867 6598 1492 -3434 -5945 -6218 -3891 1298 6900 8530 3833 -3334
1366 -3334 -7143 -5842 -2295 -87 3456 7439 7057 652 -7502 -9174 -3854 2311 4461 4314 4508 3310
1382 3310 -2801 -8057 -8075 -1568 5653 7498 5073 980 -2684 -5067 -6303 -3982 1315 6586 7607
1397 7607 3569 -2720 -6476 -5622 -2512 502 3644 6381 6144 623 -6051 -8448 -3803 1819 4603
1412 4603 4477 4229 2895 -2160 -7488 -7402 -878 5630 6597 3759 1208 -997 -4294 -6708 -4354 2447
1428 2447 7130 6556 1807 -2493 -4631 -4999 -3651 -222 3992 6890 5038 -567 -5647 -6598 -3559 573
1444 573 3910 4682 4223 1747 -2912 -7056 -6470 -1159 4557 5592 3234 1370 -1102 -4187 -6495 -4296
1460 -4296 2570 7613 5815 879 -2443 -3600 -3648 -4108 -1408 4298 7823 4684 -1545 -5579 -5214 -2832
1476 -2832 120 2708 4932 5255 2007 -3497 -6595 -5338 -454 3978 5438 4164 1692 -1098 -4352
1491 -4352 -6216 -3180 2246 6432 5524 1556 -2282 -3487 -4035 -3609 -518 4044 6634 4198 -1229 -5097
1507 -5097 -4831 -3226 -377 2470 5183 5401 1358 -4447 -6500 -4284 346 2802 3871 3559 2672 -1214
1523 -1214 -5207 -5648 -2593 2796 5332 4334 1257 -1099 -3018 -4824 -3940 550 5129 6052 3140 -1606
1539 -1606 -3887 -3877 -2632 -651 2472 5372 5106 908 -4092 -5585 -3311 123 2435 3753 4137 2582
1555 2582 -1287 -4959 -5342 -2128 2791 5125 4151 1412 -1139 -3308 -4523 -3524 239 4829 5282 2149
1571 2149 -1672 -3201 -3746 -2509 -730 2564 4899 4550 286 -3792 -4619 -3174 -84 2005 3758 4023
1587 4023 2149 -1572 -4875 -4584 -1330 1934 3948 3772 1935 -762 -3411 -4472 -2936 968 3994
1602 3994 4451 1775 -1069 -3153 -3869 -3459 -995 2681 4960 3665 -163 -3216 -3895 -2569 -540 1318
1618 1318 3448 4129 1871 -2313 -4713 -3794 -831 1718 3114 3443 2595 -118 -3511 -4760 -2731 1579
1634 1579 3666 4209 2032 -458 -2280 -3342 -3041 -419 2759 4617 3755 460 -3062 -4046 -2576 -398
1650 -398 1625 3079 3900 1573 -1654 -4305 -3764 -1145 1783 3419 3171 1751 -879 -3141 -4135 -2340
1666 -2340 854 3137 3394 2312 -235 -2816 -3909 -2774 3 2782 3776 2442 -156 -2613 -3467 -3315
1682 -3315 -763 1966 3783 3312 1117 -1860 -3533 -3142 -1411 1389 2946 3217 1629 -1241 -3066 -3718
1698 -3718 -1940 1080 2843 3146 2370 -461 -2381 -3525 -2698 53 2554 3911 2809 21 -2150 -3063
1714 -3063 -2899 -618 2114 3249 3236 635 -1631 -3199 -2975 -958 983 2941 3363 2116 -778 -3008
1730 -3008 -3065 -1827 627 2941 3179 1958 -386 -2471 -2792 -2179 -12 2003 2940 2586 248 -2093 -3433
1747 -3433 -2640 -425 1795 2975 2853 576 -1433 -3014 -2886 -1312 1386 2902 2898 1104 -1086 -2489
1763 -2489 -2940 -2021 209 2768 3261 1610 -698 -2417 -3123 -1791 39 1766 2764 2146 633 -1639
1779 -1639 -3042 -2867 -503 2002 3180 2649 577 -1365 -2456 -2429 -1156 1092 2765 2705 1534 -769
1795 -769 -2930 -2485 -1533 732 2319 2630 1638 -446 -2146 -2891 -1663 42 1891 2472 1919 334 -1923
1812 -1923 -2769 -2137 -691 1231 2775 2653 720 -1308 -2927 -2162 -819 969 2251 2267 1256 -877
1828 -877 -2258 -2804 -1501 652 2267 2632 1347 -372 -2292 -2957 -1698 155 1581 2408 1937 135
1844 135 -1566 -2641 -2245 -542 1647 2629 2449 783 -1084 -2319 -2225 -779 1161 2320 2671 871 -819
1861 -819 -2064 -2392 -1087 320 1738 2532 1776 -434 -1819 -2538 -1616 741 1983 2308 1469 295 -1390
1878 -1390 -2489 -1973 -734 1377 2334 1842 353 -1187 -2179 -2099 -1123 744 2071 2495 890 -1309 -2323
1895 -2323 -1896 -1026 346 1204 2108 1601 -228 -2016 -2573 -1282 529 1707 2234 1649 333 -1192 -2332
1912 -2332 -1459 -185 1290 2276 1965 689 -1206 -2011 -1827 -624 664 2177 2476 1203 -1011 -2222
1928 -2222 -1975 -475 567 1612 2024 1745 -71 -1908 -2051 -969 688 1282 1645 1663 730 -1283 -2713
1945 -2713 -1875 -41 1626 1727 1217 676 -348 -1964 -2563 -1128 1157 2220 1770 601 -1012 -1523 -1723
1962 -1723 -868 286 1542 2191 1451 -392 -2220 -2576 -1120 518 1040 1577 1324 459 -1025 -2640 -2397
1979 -2397 287 2198 1582 940 62 -350 -1378 -2105 -1292 1120 2442 1615 160 -969 -898 -1434 -1187 316
1997 316 1914 2380 1026 -704 -1648 -1797 -893 -100 1037 1715 1690 359 -944 -2070 -1303 350 1401
2014 1401 1478 961 366 -790 -1150 -1921 -1184 1071 2207 1827 104 -865 -979 -1317 -1475 -545 1748 2549
2032 2549 1224 -1363 -1703 -984 -397 -174 596 1799 2175 186 -1720 -2043 -945 451 811 1188 1332
2049 1332 786 -713 -1626 -1688 -592 898 1953 1325 -38 -767 -645 -1323 -881 -366 1840 2263 806 -933
2067 -933 -1758 -766 51 -380 288 1952 2027 499 -2115 -1840 -478 695 1057 710 1187 906 -229 -1672
2085 -1672 -1555 -218 1209 1282 796 342 -304 -912 -1664 -1207 66 1510 1985 594 -744 -1466 -930 -748
2103 -748 -285 769 1703 1532 131 -1659 -1577 -503 459 387 878 1152 929 -566 -1907 -1505 123 1220
2121 1220 890 241 762 459 -1086 -1932 -1143 611 1812 1709 163 -535 -612 -761 -1015 -383 731 2027
2139 2027 1442 -391 -1681 -1466 -526 266 420 918 1385 918 -566 -1902 -1489 242 1182 1045 656 659 188
2158 188 -823 -1664 -1370 855 1741 1273 43 -678 -631 -1158 -1263 -146 1007 1818 1072 -574 -1036 -785
2176 -785 -470 -250 262 1254 1748 464 -738 -1642 -768 218 789 1031 698 517 224 -1424 -1627 -745 596
2195 596 1609 807 15 -78 -541 -897 -1329 -492 1419 1704 609 -585 -1160 -467 -630 -241 91 1071 1499
2214 1499 489 -772 -1321 -551 133 511 731 813 773 -260 -1174 -1545 -287 903 1273 794 476 -12 -336
2233 -336 -775 -1256 29 1091 1371 648 -632 -819 -868 -502 -381 305 1004 1055 142 -783 -1138 -749 -266 604
2253 604 586 952 698 -206 -969 -1218 -547 440 1290 737 509 -332 -951 -1312 -973 170 1122 1101 505 -141
2273 -141 -597 -645 -974 -453 600 1017 950 -277 -569 -831 -470 -452 10 791 1471 544 -1031 -1119 -663 -143
2293 -143 293 426 943 722 -74 -748 -1108 -928 212 635 1262 520 -165 -200 -666 -574 -175 551 1271 1096
2313 1096 40 -911 -823 -620 -163 286 810 1394 607 -546 -1108 -674 9 34 369 737 498 -247 -492 -1064
2333 -1064 -483 445 670 418 326 -147 -564 -1095 -884 -81 591 740 569 -93 -509 -755 -824 -235 129 674
2353 674 939 190 -305 -867 -602 -189 24 236 847 502 -369 -1046 -1180 -231 217 607 501 483 320 -530
2373 -530 -965 -781 -145 687 906 645 243 -109 -547 -864 -153 546 1118 728 58 -404 -776 -562 -463 363
2393 363 600 869 511 -426 -500 -671 -480 169 205 429 727 132 -601 -680 -616 -139 668 907 421 -53 -186
2414 -186 -756 -649 -294 156 733 738 -114 -336 -499 -605 -538 -118 714 582 302 -543 -773 -777 -162 -313 598 659
2436 659 282 -433 -361 -771 -616 77 425 680 710 199 -528 -713 -701 226 122 705 892 130 -336 -430 -411 -277
2458 -277 8 1115 887 244 -203 -490 -441 -358 188 463 705 573 65 -357 -664 -348 206 479 370 487
2478 487 -76 -748 -769 -383 -113 495 708 317 170 -325 -595 -592 -399 185 387 266 136 -12 -588 -741 -187
2499 -187 384 414 551 483 99 -761 -733 -743 -6 777 648 424 -2 -350 -479 -665 -210 224 626 345 255 -303
2521 -303 -512 -479 46 -69 499 795 -2 -306 -478 -565 -364 166 502 703 190 -16 -249 -494 -534 197 278
2542 278 597 339 -188 -549 -562 -669 -53 547 872 524 -86 -215 -259 -243 -620 -270 540 712 439 39 -504
2563 -504 -762 -174 384 623 487 603 -11 -364 -515 -315 79 341 531 604 -18 -348 -454 -421 1 433 314
2584 314 184 259 -447 -247 -717 -74 225 427 676 -87 -274 -355 -343 -206 143 146 698 441 253 -189 -510 106
2606 106 -100 150 356 475 304 -377 -509 -632 -12 385 153 158 189 -17 -152 -451 -249 -224 360 499 304
2627 304 -236 -327 -307 281 -288 30 566 536 19 -355 -595 -363 -96 287 444 673 328 -195 -916 -301 252
2648 252 488 216 16 104 -307 -438 -738 -338 202 563 422 262 -73 -851 -654 -448 -32 670 667 432 78
2669 78 -281 -274 -176 156 114 207 349 11 79 -685 -428 47 26 282 17 505 24 -440 -557 -529 240 827 155
2692 155 -81 -71 -291 -388 -362 11 627 510 123 -357 -353 -559 -84 -97 -47 349 571 117 -468 -679 -551 249
2714 249 324 -73 -112 117 98 -341 -486 -406 415 536 192 -50 -128 -131 -508 -526 -129 621 592 73 -438 -440 -307 9
2738 9 -517 422 200 507 105 -146 -190 -249 -145 306 199 450 266 3 -282 -407 -77 323 560 157 210 -64
2760 -64 59 -447 -297 -44 394 388 -46 92 -564 -294 -147 -464 161 201 444 193 -322 -411 -64 170 -120 240
2782 240 143 477 -232 -782 -602 -4 499 68 49 -104 119 -202 -458 -567 222 740 477 -51 -231 -4 105
2803 105 -137 -176 227 419 458 -230 -308 -514 -73 157 71 255 306 354 -398 -608 -354 360 324 314 372 183 315
2826 315 -74 -222 -457 331 515 -19 -77 -102 -255 -327 -409 -453 315 566 617 -240 -425 -138 -122 -164 214 232 513
2849 513 252 -587 -568 -56 178 -153 249 151 432 90 -507 -393 -128 464 207 311 118 75 44 -460 -236
2870 -236 -43 488 700 279 -150 -368 -241 -110 -303 66 126 457 348 -294 -425 -136 234 52 375 162
2890 162 369 20 112 -332 -20 287 358 -102 -25 -5 69 -415 -561 -101 421 495 414 96 -158 -260 -38 -58 102
2913 102 355 549 -189 -244 -147 -405 133 18 155 235 205 106 -240 -175 -2 245 330 410 188 338 -357 -313 -618
2936 -618 317 383 156 198 -97 -155 -164 -264 -60 84 557 312 112 -316 -118 -239 -88 65 227 454 261 -246
2958 -246 -223 -196 -121 55 203 291 435 102 -127 -136 -260 -149 308 238 -53 -35 -1 3 -406 35 50 343 127 -53
2982 -53 -498 -112 12 -304 -52 206 390 154 -153 -328 -71 91 198 79 47 186 174 -123 -392 -600 21
3003 21 56 -29 448 -83 -79 -137 5 -180 464 209 352 -8 94 -107 -87 -99 -71 299 -108 77 -224 -271 -66
3026 -66 108 -341 140 408 294 -69 -389 -397 65 186 125 305 78 -42 -163 -223 -78 -82 69 466 -172 -236 -381
3049 -381 -152 -241 -117 -7 75 499 133 41 -212 -56 -207 -254 84 -38 251 129 -167 -336 -198 -159 338 51
3071 51 16 -188 131 -358 -244 216 144 261 58 178 -230 -249 -314 -146 -14 336 411 -35 -409 103 63 256
3093 256 32 267 254 -14 -255 -555 -67 170 -62 -18 342 162 141 -380 156 -162 -82 97 43 62 35 -78
3115 -78 -367 -197 -373 47 263 151 292 -194 -82 70 -15 -238 0 -73 -49 -66 -407 -360 -309 -50 -105 248 127
3138 127 -61 42 117 -352 -156 -104 208 382 411 -188 -203 -406 -195 11 252 -61 287 -35 -205 -271 -92 235
3160 235 269 96 -107 67 -404 -110 -410 -447 111 146 150 -87 -119 -282 145 8 152 354 -51 -158 -227 -255 -128
3183 -128 -263 49 316 152 450 20 -195 -119 -270 -131 315 -146 146 -200 -435 -188 7 70 -16 213 125
3204 125 300 -220 -360 -51 -174 -86 -184 -192 -253 -211 -185 -160 -122 382 183 77 83 157 19 -322 -102 -27 -46 106 -152
3229 -152 1 -249 -154 -94 65 23 48 57 -63 18 -6 -368 26 193 341 -16 106 -38 -70 23 -16 237 466 142
3253 142 -151 -15 -145 -157 -159 37 389 86 10 -86 -282 -187 -223 -61 187 127 179 -144 -94 -294 -4 -63 121 106
3277 106 94 13 130 -270 -117 98 177 135 -31 100 -356 -287 -277 17 -131 198 305 -107 -48 -95 -148 142 -240
3300 -240 19 334 97 84 -89 -154 66 -16 -22 8 98 -231 -10 -499 -147 -68 282 66 20 -162 293 13 -346
3323 -346 -119 95 46 61 -64 -116 -3 -229 -24 56 80 164 -142 161 -331 153 32 -40 90 138 158 -52 -123
3346 -123 -484 19 -234 293 -176 -85 83 -168 -267 -124 31 362 -6 66 -106 -124 -23 30 25 -127 -167 257 6
3369 6 -118 -364 -14 127 -113 246 244 155 116 -126 -70 -166 24 51 -252 -42 192 201 37 -155 -221 -130 -10 -98 -254
3394 -254 -111 -131 -321 -101 -107 369 179 273 -5 -210 -103 -90 -69 -19 528 -4 -149 323 183 198 245 -176 -142
3417 -142 -3 -74 42 -136 83 9 -1 125 -103 -24 -94 65 -35 -240 -64 113 349 91 -420 50 255 72
3439 72 -160 -269 155 -58 45 -27 -211 -10 -66 -512 -171 176 0 107 -240 -60 -106 98 -119 93 -2 218
3461 218 -220 -624 37 22 506 -298 -256 -312 -37 50 -214 -513 174 184 -7 -27 -55 65 48 185 14 414 478
3484 478 -5 82 -390 -71 -154 -85 -151 -90 -164 -7 -252 -298 74 -116 -34 212 -123 6 -197 151 -240 86 -167
3507 -167 245 -115 -180 -129 -75 308 1 -200 56 115 219 -286 -72 43 2 117 -401 -161 -212 173 -331 -304
3529 -304 -166 164 127 -103 24 123 -20 76 -71 -133 102 176 -22 -234 90 50 -100 -105 -16 -194 146 184 -342
3552 -342 2 33 187 -107 -101 48 147 85 -29 93 60 65 22 371 -245 -42 -79 -187 -61 -50 -54 15 -128 -167 48
3577 48 -307 194 128 191 -101 117 -49 -63 22 2 -251 -88 -156 279 24 -64 19 -37 -88 85 -140 -156 13 90
3601 90 -110 -208 -142 151 7 -159 -122 -63 -7 -43 -78 258 -80 413 -5 110 -229 -141 320 -92 -62 0 228 188
3625 188 -56 -344 -8 -21 98 -138 65 -223 -213 -159 -175 -251 171 -226 93 -34 -244 -21 -153 74 -91 387
3647 387 216 99 41 -103 -81 -92 149 -77 -38 -137 -239 111 -101 24 109 -97 0 233 161 -7 -240 -146 21
3670 21 -62 74 -168 -152 -152 -245 34 158 135 184 -169 115 119 260 53 142 -89 -120 284 114 129 -99 182 -158
3694 -158 -46 45 36 -98 -32 -17 -372 -241 162 -153 -8 104 109 32 214 -62 -393 96 151 104 -99 -76 239 -370
3718 -370 -187 -166 -54 32 -96 -96 -78 -162 -392 61 -87 -168 160 33 91 -135 -39 -54 -57 241 -228 -45 -162 505
3742 505 247 70 -45 -51 36 -117 110 19 -129 18 -401 348 -133 -45 -8 -211 45 -178 14 101 -70 -115 -4
3765 -4 -36 -254 65 -182 -46 427 53 76 68 -12 -80 5 -212 -45 -119 79 -218 119 -115 -87 318 -112 -45 163
3789 163 20 -166 -18 90 -99 164 158 -236 116 86 -229 -186 -66 276 -286 -354 318 99 217 -357 25 -279
3811 -279 -102 -71 -121 113 -164 208 -170 46 253 50 -6 133 -111 -86 173 -169 -163 65 28 232 33 -242
3833 -242 208 -197 -139 15 91 -7 -146 -47 -7 -3 -52 -164 222 175 -69 63 -225 -296 179 8 -44 -201 224 92
3857 92 -150 9 318 161 -73 63 -64 -33 59 123 62 71 -354 -12 -65 -187 -44 52 -183 31 -113 247 27
3880 27 -282 -40 -10 -132 -131 67 90 73 -45 260 -158 18 92 -47 89 -25 -105 -38 130 3 121 76 45 248
3904 248 78 -142 1 90 -16 -136 -56 -17 153 -44 108 -92 -208 115 24 -12 -33 67 -29 -93 -83 98 130
3927 130 -365 132 100 -80 247 -41 -144 491 176 -63 25 -227 189 -83 344 72 -10 -101 283 91 -317
3948 -317 -214 -197 159 278 -113 -70 78 331 -74 13 94 9 273 265 -133 -132 -12 -301 -146 44 -61 -60 98 17
3972 17 166 -168 26 151 -211 -94 0 200 22 -97 -64 -209 98 227 35 -104 -106 16 -127 179 -308 -12
3994 -12 -40 -15 -167 30 -172 -31 246 60 140 70 140 -112 -90 47 274 -116 -11 100 -8 -108 36 -45 98
4017 98 -34 328 35 -74 -175 -54 -126 -194 -41 55 51 -27 74 27 299 -69 208 207 100 -110 -91 121 -229 -9
4041 -9 -55 -57 296 26 -96 5 -182 -9 -144 202 105 -29 -130 119 -111 -58 -86 95 -85 10 -9 111 -119
4064 -119 -47 95 111 -215 -220 -129 151 172 -269 65 -121 -20 235 -25 -92 21 -125 -203 -88 -106 -8 -220 -285 115
4088 115 -158 293 -1 104 -42 29 -1 94 -44 -280 -127 340 131 -149 197 -99 50 -126 -144 -88 72 164
4110 164 244 28 -145 207 275 -245 -118 109 -32 97 33 -330 159 -103 -117 90 -8 -190 334 151 -219 5
4132 5 371 -4 19 102 -67 23 -198 10 -48 282 338 5 192 40 165 2 25 -83 -47 194 -35 25 -14 -217
4156 -217 275 -87 26 -4 85 -165 121 93 48 -133 -29 263 42 82 287 51 -366 -31 148 150 176 9 -168
4179 -168 303 276 172 -22 17 94 161 -262 -194 -59 121 4 74 -421 141 113 -193 29 7 5 -160 -138 204 31
4203 31 -162 -49 2 -193 -208 -13 6 -43 -115 -138 115 213 -38 -233 22 95 142 374 77 -213 31 -135 35
4226 35 -82 94 102 -104 -2 54 124 -230 72 54 199 42 49 345 94 103 10 -22 -66 68 -175 -164 -59 303 122
4251 122 -43 -58 -114 17 -251 -108 -32 14 -140 0 124 -10 39 128 85 -21 -255 -30 -138 44 -119 257
4273 257 -114 -160 -194 -86 127 140 109 -305 206 64 -49 9 15 -131 422 -104 53 159 193 136 -28 120 57
4296 57 22 189 -194 -104 -123 31 -235 -246 -205 303 1 78 93 382 -86 -385 -102 -3 66 222 -135 -81 82 33
4320 33 -182 159 -133 37 15 11 -149 219 -110 -152 -82 271 119 -390 -258 67 -44 117 214 -157 102 218
4342 218 284 -37 -106 20 -45 83 106 142 -150 -101 -141 70 263 66 194 188 -66 -9 80 51 167 -1 -17 -219
4366 -219 -58 276 -134 85 18 -135 -133 -53 268 99 92 208 31 180 -16 216 -2 -34 82 -179 -50 134
4388 134 -204 233 121 11 280 -166 -121 202 267 94 145 -240 58 -292 -35 207 -18 -83 -6 116 -82 -154
4410 -154 318 62 -26 72 -92 108 -355 -148 190 280 19 -23 160 261 26 162 -70 -87 59 -51 -204 -77
4432 -77 -168 86 -60 -334 336 91 86 123 -115 174 8 126 105 199 115 -421 -46 -151 -84 220 -305 -16 -9 -59
4456 -59 -66 -95 89 86 -120 -433 28 -87 -121 203 69 -18 83 177 156 120 131 104 88 9 148 -182 201 194 34 18
4482 18 -97 176 95 -23 228 306 -170 138 -51 164 195 103 -75 151 -215 -163 197 269 -195 228 -102 -101 -82
4505 -82 190 -143 99 38 -75 138 -81 -17 -110 18 214 -67 -389 347 226 150 -89 20 -85 106 141 261
4527 261 267 176 246 -74 47 -111 41 -288 -84 103 -73 112 -66 127 -51 -89 50 -140 45 -102 118 171
4549 171 -264 71 -125 75 182 -146 352 184 89 -33 -130 -306 -107 21 -348 -129 -123 76 73 -310 -47 90
4571 90 -102 140 -54 -28 74 102 -174 -234 -49 49 -3 -82 73 -81 138 81 -174 -142 144 0 -321 -187 -228
4594 -228 -56 -87 -254 67 -74 -42 96 -64 -291 -149 -230 -124 16 -99 537 71 57 19 -285 -97 256 77
4616 77 67 -35 28 137 28 4 -98 -112 192 -307 -58 -64 -91 56 -283 27 -34 -66 186 48 -59 -321 -200
4639 -200 -62 5 47 228 -317 151 6 -96 234 157 25 -293 -86 -80 -36 -257 5 -96 -47 45 -376 99 -154
4662 -154 -93 -228 -37 69 -149 -83 -65 154 57 56 -333 369 68 -15 101 85 -100 16 -135 53 -177 -7 28
4685 28 -53 -42 12 -62 109 -48 406 204 167 144 -314 132 96 28 38 89 25 -267 -378 148 6 -52 65 250
4709 250 174 36 -462 -125 68 -65 -114 178 183 262 157 32 88 -339 190 121 197 106 -129 -292 -100 158 81
4732 81 -18 124 25 -134 -42 -27 34 65 -120 183 -14 459 337 -22 62 65 -96 -12 26 37 -44 267 91 -27 -89
4757 -89 143 45 -81 -387 213 -259 85 -25 -152 206 -60 -82 133 -216 154 39 -138 -207 29 29 -388 -72
4779 -72 73 77 55 -142 -12 -59 -164 105 -2 226 -76 129 -30 -55 156 -17 -448 -346 344 -98 137 -238
4801 -238 -5 0 21 7 146 -29 -111 203 -51 -58 301 20 65 -111 -327 5 69 197 -183 89 206 66 -12
4824 -12 0 27 -248 155 173 -19 -72 -23 42 20 13 108 -40 -73 60 -89 258 50 109 205 387 -75 61 230 27
4849 27 134 -270 -26 28 180 283 -186 252 -35 -176 -161 146 -254 108 176 -24 -20 -50 -58 45 -94 191 375
4872 375 -280 9 -49 44 207 -41 62 30 -77 -46 -216 -310 190 190 -50 23 3 -111 365 244 57 78 165 183
4896 183 290 -56 -64 -297 -306 -77 -188 236 215 -21 333 240 181 245 2 6 -335 -145 174 8 79 246 -17 11
4920 11 7 54 -40 -50 -59 177 5 -278 -175 87 224 226 131 14 209 -45 -32 9 -66 297 64 136 81 247 -161
4945 -161 -111 1 56 122 196 368 -146 48 -123 -81 86 -41 14 233 182 312 148 176 167 25 -174 191 172 -165
4969 -165 114 -118 14 -446 116 106 189 -300 23 169 -258 198 -174 271 205 124 -129 25 -20 114 129 -155
4991 -155 -191 171 97 -74 -85 479 73 -49 297 196 370 -70 316 33 -116 -64 -23 -185 9 244 -61 186
5013 186 -30 67 7 228 -220 -235 112 16 161 77 108 323 27 56 118 237 -15 64 -144 -94 -77 -323 332 -256
5037 -256 -34 8 84 -33 136 -181 -93 -171 -12 224 63 -425 188 234 169 2 -513 228 271 -439 -112 -139 -173
5060 -173 -11 -302 141 37 -84 44 26 -7 -21 -169 -166 94 113 37 -143 -172 -27 27 -61 104 -254 -189 -30 59
5084 59 -234 101 21 105 15 -38 146 49 149 281 188 -126 -131 -12 283 94 -128 140 4 -120 103 51 219
5107 219 322 137 -56 212 320 66 13 -73 -49 -124 254 -2 -42 -291 -104 110 131 102 10 -236 174 -348 -370
5130 -370 53 -96 -92 -43 -249 -101 -33 -191 -227 -9 179 -378 61 150 288 94 -210 107 38 7 72 -38 58
5153 58 -112 233 -248 130 161 41 0 3 54 -74 -128 -20 378 188 -41 -93 186 200 162 58 48 -216 -16 -234
5177 -234 -468 87 292 -93 23 -80 108 31 75 -73 -24 140 5 192 -142 -197 28 -157 -278 319 73
5198 73 54 -149 -117 145 292 -15 87 -4 -110 74 16 160 275 96 176 -156 -50 24 -155 243 152 33 -313
5221 -313 53 411 333 -62 -192 246 71 -86 -106 44 119 -99 111 -87 -22 -283 -94 -221 330 -37 255
5242 255 40 -30 180 57 -15 172 81 -210 -41 -201 200 -7 262 -359 245 -178 -76 -34 118 123 -53 267
5264 267 100 -156 107 -131 216 -152 -45 226 -58 53 -148 26 426 70 -208 260 -26 79 -47 147
5284 147 19 -356 -78 183 -98 -334 29 21 253 -288 -16 -349 -5 67 -124 -44 -51 -208 -174 242 -205 -78
5306 -78 143 197 171 15 -51 69 93 137 152 -153 -186 44 -187 -113 -22 69 156 38 145 163 138 101 55 -37 -45 -93 80
5333 80 143 -212 -194 81 89 23 -131 218 -39 106 -110 268 -50 7 307 -125 -9 -85 -277 -72 -373 -133 58
5356 58 317 335 95 128 -252 213 -55 -124 148 173 -155 -186 64 56 18 34 -402 -12 167 167 58 145 235 71 84
5381 84 194 -12 -70 -12 332 27 52 -95 50 78 -66 223 245 -309 28 -44 -285 -331 154 191 7 -39 -166
5404 -166 -141 -191 198 -14 40 -3 351 -261 -221 -16 79 -8 -187 74 184 59 -263 247 170 -50 -13 -267 -175
5427 -175 97 -123 -124 56 111 306 97 -193 156 157 -48 49 -190 171 123 197 176 21 -7 91 -65 -31 26 48 162
5452 162 -172 -219 172 135 240 -217 -47 116 -368 135 155 111 -370 -93 -350 106 -67 -53 0 3 1 -202 344
5475 344 100 63 -316 60 34 209 -58 -167 -39 -125 475 269 139 154 -158 -148 -201 25 -252 -128 279 -200
5497 -200 76 139 -21 -59 -220 -313 -74 121 -221 -209 114 138 -2 129 -101 -76 278 -45 -239 -63 -126 -125 200
5520 200 138 -60 49 -490 -179 56 -64 -107 -69 87 104 -189 -174 -48 -27 38 -233 -75 256 -146 -187 95 -132
5543 -132 -102 51 -151 41 174 56 142 -255 -46 33 100 222 1 49 -157 257 -285 -71 68 92 -154 98
5565 98 -169 -114 110 -37 -51 75 23 -159 369 -336 -107 -158 -83 -71 -124 -5 -175 366 25 90 -54 -54 76 -147
5589 -147 -30 -112 -67 30 46 -201 -126 410 279 -47 -14 -170 57 123 218 10 358 -282 -182 65 11 -1 97 -176
5613 -176 -57 -129 -96 182 116 29 150 124 81 22 -58 -99 -147 -21 -53 112 39 169 8 102 -13 341 -6 -275
5637 -275 -32 -10 52 -52 -148 199 238 -117 86 131 -4 -115 117 50 298 20 82 257 66 -113 -79 -253 -31
5660 -31 -107 148 55 -84 -208 -103 251 -238 27 -35 179 310 104 -19 220 266 -233 -213 93 65 1 5 -30 -39
5684 -39 114 70 108 -365 -16 -279 -93 44 68 116 -159 -387 28 15 3 -41 61 51 89 30 -164 260 -97 229
5708 229 -69 -55 -207 -179 -207 169 125 105 -219 173 178 216 14 -313 -86 -126 205 98 -54 -79 151 160 -204 -46
5732 -46 159 -45 -85 143 179 180 -84 81 229 32 -200 102 -36 102 109 -29 84 137 -11 -123 -180 -88 108
5755 108 -99 -127 253 132 -51 -6 209 1 -205 223 75 243 92 -237 80 -342 -14 -157 373 -44 87
5776 87 48 33 13 140 156 250 31 240 -70 -48 100 -95 -126 16 -116 379 -56 315 269 -60 105 -117 181
5799 181 -2 79 85 -39 20 32 -194 -297 218 65 137 14 48 47 -29 -104 -251 17 -36 -308 -85 -493 125 264
5823 264 12 -48 168 -128 -133 -85 29 4 -189 -140 -40 33 144 -65 -31 -1 64 63 226 -8 -51 159 -169 -48
5847 -48 -61 -211 -113 44 -25 -2 87 -133 -250 28 -67 -1 -533 -121 10 2 24 174 -10 202 -189 -194 -165 201 92
5872 92 -175 -130 -68 -3 17 110 173 -123 -198 -72 211 114 84 48 -7 19 -129 -122 177 -285 -148 151 95 191 -97 66
5898 66 125 138 -8 -82 121 111 20 49 118 92 -21 2 6 -75 -54 -74 -64 229 58 247 79 -114 -67 102 -189 -13
5924 -13 -54 -173 341 92 -190 -247 212 -321 46 -315 -61 155 -156 -45 -199 27 -111 -36 185 -73 -302
5945 -302 161 -83 140 12 123 -281 -160 293 -168 92 -184 135 98 -217 199 33 197 13 -6 227 135
5966 135 163 20 196 -64 -283 -429 202 -128 23 151 -191 143 48 -188 -135 467 -130 378 214 24 11
5987 11 140 -139 -304 -16 -185 -90 46 67 59 29 113 29 -150 -184 -215 123 -118 71 236 123 65 -69 -26 -31 229
6012 229 331 5 74 -61 -234 -211 50 -169 69 95 -79 -49 71 120 -112 158 364 -235 194 -27 -261 138
6034 138 -111 118 54 151 150 -3 10 -76 121 27 144 -211 -109 -177 27 22 -137 -62 -65 50 116 84 52 68 34 107
6060 107 161 71 416 91 19 -168 -26 -24 40 97 -423 153 -113 346 -284 242 -119 -140 184 75 -179 -90 46
6083 46 192 41 -428 277 63 -181 124 100 194 292 -306 252 -214 47 -96 14 32 64 32 11 -190 -282 59
6106 59 156 68 293 14 -115 254 -12 167 426 351 68 -88 15 -250 0 211 -253 241 117 -212 90
6127 90 49 56 -204 186 -203 153 20 -236 -172 -442 -62 6 246 -56 117 67 126 84 -27 191 113 -186 -25
6150 -25 103 294 -89 203 24 -205 -54 -84 -180 -182 32 -327 13 -410 32 -227 223 65 84 70 -64 -59 -66 7
6174 7 -85 103 88 12 127 158 -223 239 -26 112 -121 -55 -117 163 -16 96 26 125 -38 -111 200 331 6 -72
6198 -72 205 268 207 -53 -75 101 57 -71 245 -478 153 -157 64 283 125 149 52 113 112 82 342 56 156 146
6222 146 -358 114 75 -10 15 26 -7 400 -3 -157 -122 15 8 236 -121 50 117 -11 -194 110 -150 33 125
6245 125 -154 -61 -232 54 5 -46 37 51 2 46 202 181 36 184 117 30 -149 -39 -306 -13 -315 141 -49
6268 -49 7 -85 -43 -212 107 14 -452 -192 -18 -22 137 -136 -64 -12 449 119 63 -186 177 -17 -55 155 157 142 -15
6293 -15 30 205 165 30 -82 81 478 121 -292 -143 -128 -171 -63 -103 303 391 -162 -8 -220 -252 5 48 7
6316 7 -31 -201 -167 -15 -37 188 -167 -101 -128 142 -27 150 -57 -141 128 -166 -205 -243 -96 -27 35 -34 270 41
6340 41 -56 275 81 -126 -138 17 -84 -4 -12 10 -23 -62 331 117 -169 221 -57 123 220 -36 52 -27 207 -81
6364 -81 -43 16 177 71 -82 -281 331 220 224 -298 153 -142 -203 -90 -277 121 204 -376 -152 176 321 55
6386 55 13 49 -461 -192 290 272 -6 75 -192 145 67 -107 -245 293 199 81 -8 265 -29 106 57 152 -140
6409 -140 66 75 389 76 -39 323 -225 -1 124 322 -10 -197 142 80 288 -120 6 -120 -233 -61 -66 -23
6431 -23 237 -173 -4 44 102 348 -67 15 163 1 -49 -82 -163 -8 -56 184 82 -124 62 102 -108 -159 118
6454 118 73 -25 262 -231 -254 150 0 -259 55 173 -70 -66 136 202 84 -151 -181 -60 -142 119 190 131 -295
6477 -295 12 126 7 22 220 159 -148 19 275 235 212 162 -258 117 49 -181 60 7 192 7 -19 -45 181
6500 181 60 -132 31 -94 17 -81 -23 -359 -61 158 -71 -41 169 -169 -286 -251 -40 73 -124 -198 467 -40
6522 -40 198 -152 36 -5 154 80 -286 -11 -172 108 154 -112 18 199 -115 -16 6 217 113 30 162 -187
6544 -187 85 -65 160 185 165 3 -45 53 77 -174 -140 44 -253 -12 -212 211 125 248 104 48 -13 46 -157
6567 -157 53 68 -19 18 -25 125 -45 -101 -127 227 98 -52 -367 131 -214 -46 -103 105 173 -79 -55 -13 -72 6
6591 6 466 228 -82 -186 380 -157 139 148 199 -189 99 -326 170 -22 -72 -100 -383 95 -134 -5 -136 24
6613 24 111 -98 -168 104 -3 176 56 -177 63 132 -58 181 25 -11 2 -179 152 295 195 -190 6 -12
6635 -12 0 -25 -10 153 -225 -381 106 279 66 120 -6 113 -2 129 -130 279 40 25 24 -292 261 -2 99
6658 99 -41 -6 16 -230 -72 -67 44 170 -131 31 -308 144 -262 102 21 -65 284 -10 125 363 253 -328
6680 -328 -5 444 -65 16 224 76 22 106 183 25 -107 239 36 176 88 -16 233 -105 -34 -195 -158 -117 240
6703 240 -92 0 198 -81 -33 -242 103 -89 54 -97 -35 10 21 54 253 -101 -327 181 24 61 -459 109
6725 109 -22 39 204 334 -218 151 -57 -35 -141 -38 94 132 282 -133 -10 -11 329 -236 -62 -104 -50 48 130
6748 130 -80 -322 19 -254 -225 -103 -212 -12 3 191 190 203 203 71 165 101 -165 56 16 7 -420 -225 108 -132
6772 -132 -106 84 114 -151 89 185 21 184 164 7 -398 -20 193 18 21 -301 -373 -112 131 266 -196 135
6794 135 -118 128 -32 -247 98 -41 -135 6 -281 -253 -88 -141 198 39 230 -163 -72 71 58 293 149 83
6816 83 -28 240 -35 -153 -38 323 -26 -47 140 -26 37 -23 5 -28 51 -121 -124 167 123 -3 -200 -53 0 -69
6840 -69 -198 -103 -30 160 94 -18 151 264 -287 -82 282 246 17 25 136 -18 286 -168 -441 37 -36 -90 -125
6863 -125 -53 -113 -136 -45 63 26 -67 -45 -30 -133 -31 -104 -118 63 -143 -172 -154 -181 -109 -159 -176 -27 198 15 75 -9
6889 -9 -101 5 79 277 86 79 216 65 12 -213 262 173 113 -108 -140 314 -39 25 -83 -2 120 -65 222 314
6913 314 -123 87 -330 55 -53 -24 59 -148 235 101 3 54 -67 -187 -137 -191 1 108 86 -14 55 -128 -108
6936 -108 124 62 -90 -238 -27 -260 85 41 246 -254 150 6 -169 80 70 68 -241 -59 -85 111 -18 56
6958 56 24 140 -152 -56 135 -125 99 169 -27 158 -50 -327 46 -132 268 -151 240 95 -123 138 -17
6979 -17 -104 -57 0 264 47 -140 -47 337 98 -63 -145 69 128 -218 -50 -133 -197 -84 -34 100 21 -164 -140 27
7003 27 -9 228 123 166 -128 70 -304 -228 9 -101 76 -207 62 233 -85 178 158 63 17 168 161 47 -49
7026 -49 -366 12 -39 62 -33 -19 -40 -361 -178 -133 -252 -43 -8 7 -20 55 -237 -162 -284 -266 -39 9 -190 -267 -164
7051 -164 -106 140 656 -269 116 54 30 -177 -5 260 200 0 -164 -27 223 241 -54 476 -54 403 -27 113
7073 113 94 -99 299 475 -20 108 205 200 -28 110 -191 34 120 121 406 -80 -114 -37 76 1 169 -135 158
7096 158 -200 -60 36 47 -127 40 91 217 85 -19 263 37 -59 284 11 176 42 162 61 -142 -59 296
7118 296 147 201 117 -185 -94 96 -94 -203 -183 142 -72 167 135 -46 54 146 -241 -131 278 -242 361 -169
7140 -169 422 188 -226 -189 133 -15 -191 27 -159 -17 139 76 -81 -73 201 -161 59 67 -199 97 -10 -38
7162 -38 -10 202 -109 -42 34 -21 239 50 -297 269 118 -18 48 36 -106 -129 77 -197 -45 264 78 -276 -3
7185 -3 91 53 -118 316 -5 72 -200 -24 15 -127 48 22 73 112 -61 -144 -96 132 94 259 -235 -65 -259 107
7209 107 45 27 2 31 100 19 -41 -177 -160 96 35 380 148 -124 -194 -45 39 -161 -131 194 -139 -6 -195 -10
7233 -10 53 -82 -22 -286 152 233 -129 40 73 -143 -279 -44 117 58 40 -23 48 -95 -155 9 98 32 -192 8
7257 8 155 -32 -67 -6 68 -65 155 -46 -188 -259 12 70 60 -52 -125 -5 -283 67 -93 59 223 -7 -61
7280 -61 -235 326 -163 -71 206 144 -128 -227 -18 6 -57 -162 -202 -137 55 41 -9 -27 -100 212 -129 76 211 -104
7304 -104 5 36 107 138 34 -175 -110 -67 218 -143 130 176 -143 63 95 -115 148 168 -198 19 -122 38 225
7327 225 -98 -410 11 247 -138 222 -110 -474 179 -46 129 -28 -108 42 110 -145 -33 -87 -108 -16 -27 -150
7349 -150 -12 -8 -81 1 -118 26 -166 403 92 84 38 -158 99 21 -405 55 270 -139 203 67 -7 123 -57
7372 -57 98 -112 205 221 -370 -240 -264 -251 -75 278 -166 -22 -87 -79 -111 -322 -305 50 84 -203 -53 182 -114
7395 -114 8 -57 -293 88 -167 15 111 345 -403 168 -24 -153 80 -266 -83 -124 -44 125 -226 0 160
7416 160 -10 -231 91 -5 -76 -50 -19 -77 -29 30 42 4 20 419 20 -165 -135 -128 -312 141 69 135 -57 -412 93
7441 93 200 -316 -247 186 -26 273 -200 83 -161 -39 186 -43 -137 -111 -79 -21 16 -276 -4 194 172 190 105
7464 105 -50 -4 57 -5 -235 -51 -97 -58 -233 -174 56 -184 94 253 -34 163 202 65 -41 -181 -37 136
7486 136 262 41 129 111 -224 188 47 -147 310 -166 -230 -73 -74 126 97 179 3 176 51 184 67 1 -196
7509 -196 -206 142 -167 -90 155 289 20 -26 -194 21 157 -192 -380 -5 -7 -45 38 298 -110 -172 210 -115 -31
7532 -31 106 258 -57 -2 -98 -13 -85 -97 47 105 95 275 131 195 -137 -120 213 -175 175 60 -84 -89 196 -29
7556 -29 0 169 160 233 153 92 -48 47 -120 -177 115 16 12 -87 2 -265 261 81 198 -63 -38 -146 -266 78 -11
7581 -11 382 110 172 92 99 -24 -19 -56 99 5 -36 127 108 -53 -60 159 -200 26 -99 -185 79 -48 142 -118 50
7606 50 -341 -129 159 -89 73 -135 -149 -108 -1 219 -89 -161 74 -34 235 -142 -189 106 180 67 -297 -152
7628 -152 -185 75 -57 -13 -131 134 35 -26 26 104 -142 -481 28 340 -53 -104 171 193 -208 49 -81 -128 45
7651 45 261 12 -320 48 -69 -107 -94 -110 -261 57 35 -177 190 -55 -90 -132 243 18 -9 -287 291 343 -269
7674 -269 237 60 20 -10 -60 127 -78 -54 233 0 -123 -5 87 -244 46 -28 -54 108 175 14 -209 -52 -289
7697 -289 350 -44 340 91 -43 66 256 -242 -97 99 -81 16 -31 57 15 -7 -190 118 -101 9 -307 -87
7719 -87 49 -1 216 235 -118 -169 -397 261 73 -81 -141 -181 -96 34 -248 4 -150 -153 203 -122 136 -241 68
7742 68 335 53 -156 -125 -17 -181 -31 -65 -88 93 38 -144 146 -116 7 167 -116 35 -42 -33 54 239 169
7765 169 -24 201 -120 -77 -355 -27 -158 -38 153 164 -195 34 79 80 71 16 13 221 -153 -127 66 -151 22 161
7789 161 53 57 45 -178 -35 107 -378 57 243 43 -70 -190 55 -40 170 -80 -142 -104 -51 -136 365 78 -129
7812 -129 -70 -98 78 -31 -252 292 28 -146 265 -48 -15 2 153 -195 84 -215 30 114 -78 335 225 260
7834 260 137 -195 225 -349 -124 -208 109 -10 424 130 -69 -204 -152 31 -190 19 -40 -24 368 -183 123
7855 123 -233 332 90 -8 -56 -98 -5 6 335 -107 200 18 -158 107 15 -88 32 124 -144 -34 -19 -4 128
7878 128 -99 18 126 75 -46 -125 -238 -57 -117 -69 -30 34 0 -110 -262 25 -116 -97 -315 -37 156 -170 -71
7901 -71 214 -40 -257 -63 -25 292 99 148 162 251 -95 -156 92 132 122 14 59 169 152 15 81 -198 192 -113
7925 -113 25 134 -28 -101 80 243 95 -199 148 293 -78 134 190 -114 176 42 93 8 134 -68 262
7946 262 -27 255 -155 108 -176 -221 144 -152 11 -24 242 35 -135 46 -152 -4 159 75 3 95 28 -87
7968 -87 -377 -135 59 -9 300 -124 71 203 110 10 -133 -357 -162 -388 -164 -136 -178 162 -5 22 80 225
7990 225 -108 -160 -4 -67 115 -74 76 -15 -39 -366 -6 108 -122 37 -137 -9 293 -116 -71 265 49 82
8012 82 193 72 -54 68 -28 348 -54 224 -162 9 141 -160 -119 47 242 -116 -75 186 -224 194 -154
8033 -154 261 128 86 69 -214 225 -101 22 26 -158 -178 307 -10 -171 -223 321 114 16 37 301 7 74 -38
8056 -38 87 -88 54 160 31 267 182 -9 19 -4 285 125 -213 82 56 0 17 85 -244 16 -236 101 -115
8079 -115 -51 -22 23 -10 58 128 150 148 125 -245 -10 106 186 -1 -1 -97 -124 -248 -21 97 25 -89 -26 -49 -24 -51 -125
8106 -125 -143 162 -243 22 32 -180 37 105 98 -125 -169 126 130 -115 65 60 36 -145 -69 312 -124 241 64 27
8130 27 -231 -105 284 167 -204 -51 69 43 -101 -135 164 -178 107 -100 216 -74 -409 -313 90 353 -13
8151 -13 -301 -198 -219 173 -189 158 -74 202 -128 93 28 -53 -15 -44 42 -285 347 -207 -186 87 65 280 284 49
8175 49 109 -19 124 130 216 -22 -255 162 139 -149 23 -10 57 244 -42 220
8191B20
$$ Imaginary data points
##PAGE= N=2
##DATA TABLE= (X++(I..I)), XYDATA
0 0 0 0 0 0 0 0 -8 8 -8 8 -8 16 -16 16 -24 24 -32 40 -45 56 -64 72 -84 96 -112 128 -147 163 -187 211
30 211 -238 264 -296 332 -370 411 -458 510 -565 626 -693 766 -850 943 -1042 1158 -1288 1435
48 1435 -1607 1808 -2043 2330 -2683 3135 -3732 4563 -5810 7873 -11927 22933 -116836 -368121
62 -368121 -174428 59214 138809 86448 107143 117994 -2833 -202338 -244640 -99351 76822
73 76822 148645 156215 118160 2548 -168122 -238072 -133900 43922 146801 160053 121467
84 121467 29105 -117550 -212236 -157474 -260 121967 158604 139922 70358 -67529 -196114
95 -196114 -189041 -38499 113527 163905 137938 83452 -17718 -153127 -206657 -94550 90139
106 90139 179737 140734 66670 2557 -85380 -174145 -155858 45 165784 199540 104363 -18838
118 -18838 -105524 -145917 -124543 -29807 93329 161316 134436 41484 -70090 -156336 -165285 -67595
130 -67595 81246 170498 142742 40354 -63135 -130719 -144459 -85736 28409 127246 146544
141 146544 86184 -13512 -113466 -169475 -130131 4298 140772 169647 83684 -28349 -94492
152 -94492 -117550 -109973 -48130 66966 158815 144029 30923 -89077 -143324 -122339 -47002 55101
164 55101 135996 142171 62648 -51658 -131540 -135784 -67568 37543 123616 140176 79257 -20951
176 -20951 -104269 -131234 -90823 874 99435 146680 109374 9889 -92435 -140563 -109331 -13730
188 -13730 92299 141775 105852 16659 -65461 -107586 -106451 -57005 36649 129315 147052 62349
200 62349 -62009 -134109 -117689 -46104 34176 96312 119153 79351 -13139 -103935 -133818 -85373
212 -85373 7707 92554 125647 88825 771 -87897 -127375 -96966 -16632 70759 118607 99305
224 99305 23338 -65152 -116902 -106530 -42577 45496 113146 117235 48411 -50818 -115688 -109409
236 -109409 -46909 30440 90330 109832 71346 -12682 -95998 -120905 -72062 14821 86733 110314
248 110314 79309 8433 -70849 -113257 -90169 -11927 73817 116004 92402 20638 -57546 -101461
260 -101461 -89665 -30145 46029 99596 102500 48595 -33936 -98431 -104307 -49105 32657 93873
272 93873 102873 56775 -19572 -83652 -101231 -63115 7376 71777 98991 74833 7482 -69809
284 -69809 -110094 -84535 -9007 66877 98300 74765 14809 -50561 -92976 -89184 -36103 39328
296 39328 93184 90763 35283 -38450 -88835 -91729 -47060 22752 80604 94228 54069 -17709
308 -17709 -78957 -94708 -57815 9157 69122 91027 65034 4819 -60005 -91999 -72834 -10740
320 -10740 57833 93073 76278 18546 -46690 -85529 -77066 -26557 39537 85571 84590 36994 -30614
333 -30614 -79583 -83118 -40197 24729 76137 85939 49561 -13688 -68725 -85465 -54315 6685
345 6685 64240 85953 60369 1529 -57683 -84691 -65070 -9902 50375 82604 69162 17035
357 17035 -45410 -82557 -73300 -23840 36749 75692 72568 30417 -28423 -73625 -78957 -40506 20911
370 20911 69990 78344 42536 -16474 -65309 -78589 -49401 5961 57564 77426 54354 1004
382 1004 -53808 -78489 -59626 -7357 47512 75539 61461 14507 -39881 -72982 -66252 -22014
394 -22014 34431 71714 68087 27634 -26864 -66375 -69195 -34141 20130 64172 72547 40366 -13324
407 -13324 -58587 -70945 -43222 7959 55068 71594 49875 1141 -47520 -69349 -53224 -7019
419 -7019 44596 70844 57587 13113 -37111 -65864 -58465 -19636 29593 64119 63293 26165 -25757
432 -25757 -62946 -64423 -30190 19288 56867 63258 35096 -12434 -53711 -66088 -41986 4939
444 4939 48195 64257 44118 -454 -45135 -65673 -50476 -7887 38754 63035 51865 11107
456 11107 -35739 -63171 -55351 -17388 28678 57640 55319 23134 -21701 -55537 -59361 -29647 17655
469 17655 54388 60577 33212 -11117 -48174 -58377 -36878 5403 45452 62445 44387 975
481 975 -41583 -59595 -42993 -3030 37488 57588 47874 13464 -28426 -56153 -51986 -17094 28744
494 28744 57435 52780 19453 -21966 -50278 -51897 -26668 14061 48817 55788 30798 -11799 -47200
507 -47200 -55997 -34658 5017 41151 54096 36405 -1377 -38310 -54580 -42325 -7750 31800
519 31800 53657 44876 9357 -32061 -54618 -45959 -13168 24383 47444 45574 19993 -17134 -47185
532 -47185 -52368 -26721 15848 48489 51202 24945 -12489 -39656 -46621 -31649 1754 37867 54188
545 54188 37764 -1325 -36861 -48396 -34119 -3385 28630 48640 43333 12471 -26952 -49538
557 -49538 -41675 -11178 23749 45080 43945 20051 -15749 -44076 -47217 -22562 16074 43815 44750
570 44750 21977 -9755 -34317 -43193 -32189 -1537 34738 53068 35603 -5271 -39280 -44668
582 -44668 -27759 -2734 21049 39763 40359 14665 -25860 -50558 -41322 -8875 23016 39260 36959
595 36959 17182 -13570 -40806 -44846 -21977 13495 39264 41782 22698 -7872 -34768 -43455 -27343
608 -27343 3919 33171 43757 28975 -1187 -29370 -40302 -30229 -5778 23145 42973 40055
620 40055 10332 -27451 -44961 -32154 -3590 19117 31346 34852 22963 -8008 -40635 -46591
632 -46591 -18356 19947 39260 33793 16974 -4569 -27214 -39459 -28637 2457 32361 41608
644 41608 27439 -788 -27724 -39451 -29561 -2811 24229 37753 31007 7167 -21245 -38211
656 -38211 -33044 -9669 16352 32673 33385 17570 -11557 -38945 -42041 -15722 18002 33341 27809
669 27809 14440 -1412 -23407 -40452 -31751 3030 35941 39731 18318 -5663 -21265 -30310 -28824
682 -28824 -8943 22410 40337 31133 3767 -21421 -33122 -28444 -9588 16053 33721 31205 12432
695 12432 -11503 -29932 -33086 -17155 10629 32211 33863 17735 -5434 -26468 -35029 -23549 5999
708 5999 31201 33026 15575 -2864 -15075 -25856 -31083 -13901 22262 45076 30615 -4725 -26201
721 -26201 -25281 -18014 -10845 4828 28252 36593 16136 -16990 -34727 -28706 -10572 9217 24675
734 24675 30042 17721 -6613 -25955 -30480 -19175 1490 23455 32976 21732 -2775 -22897 -28658
747 -28658 -21570 -5292 16811 33008 27866 3488 -20918 -27964 -20864 -8115 8717 26973 33098
760 33098 14270 -16655 -32803 -24079 -5646 7495 17707 27029 23027 -1397 -29135 -35080 -15285
773 -15285 9693 22998 23882 17362 2573 -16909 -29389 -23413 -2887 18458 28767 23214 5020
786 5020 -16303 -28143 -23960 -6585 13259 25450 25251 10694 -10971 -26101 -24780 -10211 7091
799 7091 20851 26620 18564 -3642 -26516 -30871 -13410 9233 20687 19973 15143 4785 -13783
812 -13783 -29672 -25672 -1561 21903 27538 16754 1559 -11996 -21815 -23260 -10476 11579 27315
825 27315 24762 7057 -12962 -23656 -21364 -9677 6080 19725 24328 14976 -4160 -21801 -26666
838 -26666 -14810 4905 19414 23009 15771 463 -16199 -25427 -18890 -464 17481 23243 16658
851 16658 4180 -10334 -21615 -22583 -8879 12778 26664 22225 4915 -11305 -19376 -18540 -10397
864 -10397 3842 19041 24936 14873 -5461 -21484 -23345 -12018 4052 16281 21120 16024 1476
877 1476 -15724 -24529 -17464 -25 15508 20734 15504 3741 -9985 -20353 -21379 -8553 10855
890 10855 23355 19966 4779 -10505 -18474 -18178 -9816 4118 17996 21985 12672 -5099 -19237
903 -19237 -21001 -11291 2962 15095 19922 15166 926 -15261 -22371 -15648 134 14124 19411
916 19411 15256 4316 -9399 -19658 -19246 -6498 11052 21149 17979 5268 -8312 -17295 -17848
929 -17848 -9222 4815 17998 20320 10102 -5293 -16315 -18320 -11239 1444 14222 20265 14703
942 14703 -601 -15274 -20231 -13498 -279 12251 17950 14958 3896 -10032 -19065 -16917 -5036
955 -5036 9984 18437 16134 5767 -6763 -16335 -17768 -9080 5176 17047 18344 8669 -5296 -14621
969 -14621 -16273 -10405 470 12938 19123 13574 -652 -14570 -18671 -11992 557 10760 15737
982 15737 13498 4026 -8705 -17910 -16594 -4841 9549 17447 15421 5015 -6934 -15114 -15694 -7746
996 -7746 4775 15209 16906 8680 -4380 -14323 -15996 -9732 1897 12416 16915 11566 -557 -11746
1010 -11746 -15975 -11827 -1492 10279 16489 13796 3233 -9809 -16060 -13545 -3092 8285 14871
1023 14871 13874 5952 -5505 -14751 -15284 -6982 5303 14282 15260 7439 -3544 -12513 -14726 -9461 1486
1038 1486 11642 15665 10536 -782 -11546 -15908 -10993 -665 9615 14207 11586 2311 -8033
1051 -8033 -14698 -13066 -4090 6983 13925 13372 5299 -5346 -13571 -14320 -6483 4796 13207 14040 7088
1066 7088 -3362 -11460 -13916 -8504 1512 11550 14782 9660 -421 -10284 -13853 -9937 -323 8855
1080 8855 13620 11232 2528 -7395 -13321 -11984 -3545 6863 13802 12155 4433 -5618 -12141 -12126 -5850
1095 -5850 3593 11887 13283 7019 -3282 -11759 -13319 -7267 1822 9479 12390 8390 -292 -9563 -13446
1110 -13446 -10026 -694 8649 12982 9841 1428 -7807 -12167 -10123 -2866 6208 11809 11545 4819 -5011
1125 -5011 -12390 -11866 -4639 4765 11297 11246 6179 -2507 -9752 -12018 -7566 1572 10021 12991 8179 -671
1141 -671 -8654 -12150 -8321 -172 7917 12037 9414 1817 -6806 -11733 -9849 -2305 6049 10986 9798
1156 9798 3780 -4093 -10480 -11240 -5526 3617 10928 11300 5011 -3498 -9626 -10745 -6807 1165 8492
1171 8492 11468 7196 -674 -8177 -11241 -8279 -635 6946 11023 8673 1586 -6780 -10778 -8705 -2447
1186 -2447 4987 10510 10209 4148 -4432 -10503 -10196 -3729 4274 9639 9658 5302 -2301 -8714 -10305 -6457
1202 -6457 1674 8931 10610 6486 -931 -7123 -9663 -7571 -1138 6359 11147 8980 957 -7290 -10086
1217 -10086 -7247 -1509 4540 8449 8872 3980 -3953 -10342 -9801 -3275 4289 8374 8293 4608 -1183 -8006
1233 -8006 -10836 -6777 2228 9275 9429 5116 -1638 -5949 -8565 -7272 -1348 6214 10748 7888 346
1248 346 -6539 -9174 -6875 -1230 4463 8294 8217 3498 -3532 -9045 -8691 -3444 3633 8122 8250 4228
1264 4228 -1877 -7265 -9384 -5333 1942 7672 9046 4565 -1119 -6009 -8120 -6546 -1202 6044 9738
1279 9738 6765 -166 -5557 -7394 -6460 -2860 3424 8976 8986 2826 -5254 -9172 -6740 -2002 2533 6381
1295 6381 7748 5243 -1623 -7886 -9123 -4571 2123 6892 7488 4519 -122 -5170 -7988 -6574 -848
1310 -848 5995 9145 6515 -20 -5363 -7025 -5794 -2514 2727 8313 8792 2843 -5465 -8625 -5799
1325 -5799 -1181 1523 4986 7711 5589 -1341 -8363 -9160 -3243 2901 5976 5890 4378 584 -5335 -8787
1341 -8787 -6276 939 6345 7570 4692 605 -3941 -7246 -6617 -2233 4105 7901 7075 1677 -3891
1356 -3891 -6941 -6147 -2477 2255 5543 7394 4791 -1921 -7896 -7713 -2724 2929 4948 5008 4807 1531
1372 1531 -4885 -9565 -6674 1694 7430 6395 2731 457 -2208 -5673 -7171 -3376 4415 9313 6537
1387 6537 587 -4159 -5828 -4911 -2536 1626 5889 7552 4368 -2024 -7135 -7347 -2629 2302 4811
1402 4811 5116 4681 1268 -4183 -8332 -5918 1360 6593 6391 3027 130 -2119 -5066 -6784 -2630 4296
1418 4296 8765 5404 -503 -3339 -4490 -4869 -3748 894 6199 7431 3025 -3487 -6385 -5068 -2304
1433 -2304 1052 3897 5476 4729 348 -5447 -7257 -4767 703 5020 5379 3213 476 -2563 -5305
1448 -5305 -5968 -2067 4375 7501 4889 -46 -2857 -4067 -4657 -3581 971 6447 8052 2716 -3915
1463 -3915 -5967 -3695 -1190 74 2688 5860 5672 5 -5808 -6833 -2956 1342 3965 4422 4214 1676
1479 1676 -2729 -6112 -5905 -1553 4107 6325 4322 196 -2361 -4385 -4618 -3217 809 5470 6664
1494 6664 2575 -2926 -5537 -4332 -2126 369 2981 5835 4628 -100 -5291 -6356 -2800 944 3317
1509 3317 4091 3894 1451 -2894 -6882 -5402 -71 4340 4858 3105 1328 -1062 -3863 -5165 -3082 2362
1525 2362 5918 5462 1411 -2246 -4297 -3833 -2753 -211 3607 6129 4098 -893 -5026 -4921 -2323 536
1541 536 2741 3832 4476 1346 -3172 -6044 -5080 -173 3752 4485 2864 820 -1314 -4045 -4843 -2812
1557 -2812 2306 5557 4957 883 -2419 -3702 -3303 -2366 -173 3786 5559 3460 -1148 -4741 -4862 -2258
1573 -2258 332 2245 4205 3881 1263 -3365 -5385 -3762 179 3184 3805 3038 1443 -1131 -4266 -4548
1589 -4548 -1865 2223 4423 4129 1375 -1275 -3608 -3987 -2854 965 3750 4699 2446 -927 -3664 -3982
1605 -3982 -2560 158 2320 4088 3723 529 -3210 -4880 -3130 -105 2140 3024 3400 1847 -1386 -4560
1621 -4560 -4214 -1112 2483 3897 3183 1281 -723 -3020 -3836 -2845 699 4234 4792 2215 -1142 -3263
1637 -3263 -3410 -2076 -349 2344 4122 3434 571 -3211 -4505 -3183 -26 2248 3325 2718 1479 -1734
1653 -1734 -3692 -4354 -1531 1863 4063 3463 1083 -815 -3199 -3888 -2325 846 3468 3885 1947 -675
1669 -675 -2840 -3689 -2521 23 2653 3885 2838 421 -2553 -3856 -3017 -896 2082 3373 3112 1088
1685 1088 -2071 -3818 -3184 -590 1560 3160 3032 1341 -934 -2966 -3550 -2003 925 3536 3695 1628
1701 1628 -641 -2803 -3130 -2466 110 2973 3811 2911 -17 -2346 -3491 -2639 -380 1979 3359 2840
1717 2840 663 -1856 -3301 -2932 -1183 1609 3055 3061 1626 -1417 -2907 -3711 -2193 905 3034 3383
1733 3383 1655 -697 -2803 -3190 -2040 -202 2175 3486 2406 392 -2441 -3629 -2380 -433 1740
1748 1740 3501 2456 553 -1204 -3162 -2682 -1032 1410 2756 3152 1196 -1148 -2577 -2790 -1457 460
1764 460 2731 3157 1814 -678 -2737 -3271 -1739 633 2435 2676 2054 320 -1767 -2974 -2264 -472
1780 -472 1959 3142 2539 633 -1960 -3104 -2605 -945 1179 2349 2834 1059 -1030 -2760 -2679 -1338
1796 -1338 527 2468 2698 1578 -492 -2158 -2913 -2114 138 2505 2814 1874 -121 -1979 -2509 -2088 -158
1813 -158 1558 2588 2316 612 -1488 -2831 -2683 -856 1173 2084 2459 1226 -892 -2448 -2357 -1327 590
1830 590 2383 2817 1610 -680 -2081 -2372 -1350 562 2284 2987 1978 94 -1542 -2512 -2072 -294
1846 -294 1480 2715 2054 594 -1246 -2160 -2048 -601 1164 2618 2268 1151 -1096 -2500 -2484 -1023 554
1863 554 1648 2424 1151 -190 -1993 -2903 -1858 223 2031 2471 1484 79 -1257 -2328 -2273 -670 1589
1880 1589 2698 1951 29 -1377 -2338 -2171 -683 769 2263 2532 1290 -919 -2509 -2475 -710 467
1896 467 1920 1900 1568 217 -1725 -2674 -1588 276 1812 2332 1473 -125 -1685 -2160 -1722 -286 1451
1913 1451 2542 1940 335 -1228 -2125 -1891 -275 845 1929 2182 1081 -506 -2133 -2367 -673 750
1929 750 1879 1448 992 153 -1612 -2843 -1398 332 2165 1723 975 12 -986 -2033 -1882 -744 1351
1946 1351 2670 1127 -67 -1279 -1425 -1799 -1235 413 2328 2334 421 -1258 -1902 -1453 -719 514 1587
1963 1587 1838 1331 33 -1186 -2040 -1560 567 2056 1712 939 59 -478 -1426 -2068 -292 1436 2690
1980 2690 1396 -490 -1165 -1353 -1020 -1148 280 2235 2674 542 -1339 -1844 -810 -635 28 1076 2082
1997 2082 1554 -543 -2044 -2141 -640 403 1217 1683 1216 179 -1285 -1898 -1178 88 1370 2153 1346
2014 1346 68 -898 -1143 -1310 -1000 288 1891 2058 615 -1728 -1816 -840 -460 -109 1235 2170 1946 -660
2032 -660 -2436 -1831 -126 739 601 953 1547 955 -1146 -2205 -1743 546 1887 1432 610 -172 -655 -1189
2050 -1189 -1950 -869 599 2227 1915 310 -1381 -1617 -668 -526 92 973 1989 1480 -268 -2238 -1777
2067 -1777 -215 723 578 852 1592 902 -955 -2615 -1393 555 1973 1149 637 82 -239 -1245 -1924
2084 -1924 -675 899 1943 1510 251 -604 -1009 -1138 -677 9 1534 1598 1049 -959 -1849 -1553 -740 188
2102 188 565 1089 1240 399 -1208 -2177 -1186 532 1313 793 246 497 -326 -1286 -1770 -657 1529 1990 683
2121 683 -493 -384 -466 -1279 -1296 227 1713 1691 374 -969 -1380 -744 -190 -430 622 1555 1408 103 -1641
2140 -1641 -1996 -1006 513 1132 782 860 251 -258 -1567 -1628 -233 1433 1731 785 -228 -587 -409 -987 -1170
2159 -1170 -243 1757 1620 424 -939 -1295 -1005 -488 -330 485 1530 1306 -212 -1381 -1736 -471 293
2176 293 607 663 1007 882 -546 -1702 -1631 -71 1089 1048 701 209 -11 -961 -1276 -1439 -40 1515 1263
2195 1263 313 -758 -903 -930 -699 -87 773 1759 1278 -247 -1352 -1245 -277 347 430 804 1123 544 -740
2214 -740 -1506 -1379 10 1509 1095 425 742 -354 -799 -1468 -844 304 1556 1024 125 -646 -473 -456 -551
2233 -551 -345 688 1305 1055 -362 -1305 -1254 -456 64 245 1057 1206 549 -796 -1351 -872 41 1073 676
2252 676 737 230 -511 -926 -1264 -525 271 1063 870 293 -255 -628 -638 -1159 -38 993 1194 543 -242 -796
2272 -796 -677 -478 -140 363 1038 1171 33 -705 -1134 -520 62 484 694 892 712 -377 -1157 -1413 -219
2291 -219 330 626 996 512 -221 -494 -903 -896 76 1081 1063 361 -392 -715 -904 -380 -70 482 655 1039 49
2312 49 -893 -963 -963 -10 114 666 629 524 -219 -1271 -918 13 858 806 747 251 51 -697 -1117 -702 269 1033
2334 1033 847 317 20 -463 -726 -652 -148 557 1200 642 25 -669 -1255 -512 35 249 1010 712 330 -342
2354 -342 -857 -878 -20 643 546 540 206 11 -503 -952 -733 277 1120 784 289 -548 -254 -637 -883 -58 834
2375 834 1130 544 -117 -421 -562 -476 -191 244 704 771 363 -443 -760 -1070 -576 132 443 762 269 -193 -722
2396 -722 -944 -666 402 667 598 452 -261 -378 -1140 -680 -176 417 511 543 107 -545 -822 -519 312 190 748
2417 748 632 73 -544 -959 -852 -51 127 737 429 530 -356 -479 -689 -293 287 600 947 379 81 -418
2437 -418 -835 -780 -1 685 850 737 -156 -321 -588 -610 -207 582 1040 820 54 -245 -509 -580 -353 50 621
2458 621 602 594 -87 -655 -435 -161 144 528 434 219 -213 -307 -522 -460 199 336 413 454 124 -338 -466 -791 -61
2481 -61 367 493 455 5 -357 -810 -565 -336 276 673 801 333 85 -711 -668 -464 256 332 686 508 -118
2502 -118 -428 -754 -459 59 444 909 373 -135 -486 -431 -498 45 470 608 473 186 -452 -588 -527 -360 268
2523 268 491 282 198 -264 -856 -518 -292 360 488 401 459 77 -430 -517 -507 207 595 541 392 -124 -407 -335
2545 -335 -566 -212 547 707 816 189 -461 -673 -366 -139 87 498 596 294 -349 -931 -273 -308 212 469 327
2566 327 456 -1 -320 -478 -118 13 348 772 393 -91 -375 -256 -413 130 344 379 722 269 -257 -522
2586 -522 -353 -104 -145 419 802 359 -99 -599 -647 -459 -10 293 440 208 233 -512 -644 -516 235 248 397
2607 397 214 153 -130 -336 -470 -232 402 618 595 -43 -479 -346 -375 -176 248 589 511 597 -290 -497 -160 -250
2629 -250 214 340 392 652 391 -293 -649 -383 -101 630 271 428 245 -48 -1010 -294 -211 373 684 374 -277
2650 -277 -212 -520 -416 -89 138 630 596 326 -262 -491 -101 199 -97 565 160 229 130 -300 -480 -122 464
2671 464 417 457 287 185 -268 -418 -485 -150 722 721 111 -197 -415 170 -328 -372 121 349 558 138 -418 -343
2693 -343 -99 -439 -123 332 498 505 -260 -241 -218 31 89 -302 387 499 67 -113 -487 -426 219 108 427 232
2715 232 70 -504 -238 -386 -315 14 691 752 86 -83 -385 -14 -235 -411 97 687 168 -402 -627 -315 154
2736 154 67 -141 -85 509 294 -244 -452 -392 185 391 486 168 333 155 -271 -217 -47 455 461 374 51 -146 -196
2759 -196 -375 -310 -180 404 527 304 -228 -169 -508 -205 245 306 120 345 474 -486 -489 -324 120 333 211 -1
2781 -1 393 393 -741 -658 86 120 384 271 -289 -19 -19 -232 -486 -289 211 253 618 -284 -291 84 -87 -213 80
2804 80 379 438 245 -343 -452 -350 183 165 184 58 268 270 -602 -488 -159 461 515 -11 -30 431 222 -476 -366
2827 -366 35 572 380 90 -234 -223 -47 -89 -333 40 177 460 -29 -353 -494 -94 281 64 -27 26 448
2848 448 178 -315 -535 230 412 312 94 132 33 43 -107 -98 -64 533 532 -130 -185 -191 -73 -271 -603 1 344 465
2872 465 -226 -342 -422 111 128 -177 425 553 467 -29 -512 -389 41 489 180 59 30 357 -255 -314 -348 162
2894 162 560 232 -129 -420 -112 69 -397 16 57 682 127 -285 -355 -289 -178 199 33 278 390 338 -116
2915 -116 -294 -484 -194 273 248 144 240 44 97 -501 -48 113 214 -9 -3 -11 -375 -247 3 87 440 517 304
2938 304 98 -184 -55 -295 -108 306 448 342 -30 -259 -555 -123 119 -47 331 262 468 314 -168 -218 -102
2959 -102 251 366 23 18 198 -371 -508 -288 214 216 381 248 -39 -249 107 301 45 144 152 233 -15 -335 -314
2982 -314 -187 291 -29 -171 249 143 -8 -243 -287 24 368 186 -195 162 169 28 -303 -201 110 336 349
3003 349 -74 198 25 -117 -318 9 143 298 182 -80 -473 -463 -138 -96 -92 101 261 10 3 -442 246 -325
3025 -325 12 110 183 225 -54 -143 -609 -232 92 -147 440 -101 162 79 126 -10 -157 216 468 397 -433 52
3047 52 -188 -158 60 91 312 460 89 10 -154 20 -71 426 207 30 150 32 -50 -276 -133 84 179 383
3069 383 -81 -230 89 -14 -69 -159 153 168 453 192 8 -302 -86 -430 142 -210 319 347 -199 -154 -44 -169
3091 -169 203 41 34 401 -77 -215 -171 60 -19 -77 346 303 308 20 -18 -184 58 67 63 177 -16 -62 -140 -149 -268 176
3117 176 239 295 72 -1 -356 -99 -112 27 275 157 154 47 -196 -59 48 -238 261 278 91 52 106 -18 -136
3140 -136 -8 107 237 79 199 29 -254 160 -371 128 312 301 -3 -271 -61 59 79 323 204 125 114
3161 114 189 178 58 -159 -3 385 -1 -125 184 -46 -270 -173 -41 -139 307 20 -50 117 211 -88 207 272
3183 272 163 191 134 -15 -29 -164 -64 95 -147 451 62 19 56 -132 -32 -290 -55 437 127 -118 -450 -192
3205 -192 -88 -38 -35 -136 63 86 146 -78 -116 111 -30 357 186 37 36 -166 45 89 -170 -17 264 169 -40
3228 -40 -30 232 -135 117 352 273 -47 9 -43 -154 -138 79 132 -13 -215 299 -392 -223 -432 238 256 -10 50
3251 50 -9 -73 -121 -21 58 -64 122 -245 -20 -379 -58 -272 -121 155 -160 -2 337 66 -36 -13 276 -43
3273 -43 -251 -53 3 158 -144 -75 -570 -297 73 209 -145 -53 35 -180 61 101 18 117 354 -458 -126 50 -310
3296 -310 132 23 18 353 -78 -131 196 -322 109 -10 -63 46 144 530 -151 -203 10 -75 -78 322 103 157 30
3319 30 -50 -45 151 54 -59 248 124 36 -18 -180 185 127 -6 113 207 143 -209 15 -223 248 230 116 212 173
3343 173 126 277 -353 130 74 71 271 -51 -58 -183 -389 127 -117 -73 -155 15 -199 -52 -21 118 -118 161 465
3366 465 12 -164 -202 -217 123 320 -263 317 132 274 -181 -289 -109 54 380 -56 19 52 -113 -142 -228 -146
3388 -146 -6 68 213 -305 -72 -85 109 4 -4 72 543 169 -72 -207 1 -70 -181 63 -37 217 66 -58
3410 -58 -164 127 146 -8 86 -60 39 -127 -52 -238 4 213 167 -106 -46 95 21 -199 -138 -194 59 266 48
3433 48 -285 147 52 -120 94 -105 -16 147 -43 10 71 -102 -188 51 -45 65 78 -37 -234 -43 -166 156 82
3456 82 108 30 72 118 -115 21 72 377 173 457 -264 -52 179 -39 -181 -247 34 -59 -165 -207 -269 -50 111
3479 111 -134 225 26 170 0 -395 -494 468 -30 79 -188 -66 149 -349 -71 -327 100 288 205 -200 -134
3500 -134 347 43 88 -2 150 -141 47 -12 43 -56 -57 19 -55 -93 48 -32 -135 132 -236 -265 -30 -15 19 150 108
3525 108 -130 -10 61 307 173 67 -79 -70 -16 85 71 -308 148 294 249 -29 -245 -101 -44 143 -83 -5 109
3548 109 153 -136 -342 -123 135 -25 -127 -77 -117 -106 -179 15 -36 149 118 165 232 -45 -106 -4 58 -5 132 269
3572 269 171 94 -3 -148 -343 113 67 -212 -92 -113 -365 32 -41 243 -148 -82 85 -218 -114 -79 0 -132 117
3595 117 -12 -76 -2 -182 -23 18 -262 -38 74 83 -55 -184 -16 -156 41 -268 151 196 302 -162 47 -81
3617 -81 246 13 -233 127 186 269 -12 -81 -126 -194 109 -20 -17 52 -90 166 -151 -144 -1 123 -19 237 -201 -27
3641 -27 -119 233 373 -415 -83 315 199 34 54 -62 -173 313 -75 53 146 -297 -503 -265 179 141 -87 -97
3663 -97 -78 -136 -52 46 -47 81 279 197 30 232 -49 6 -27 -226 276 464 83 87 11 153 -318 133 244 23
3687 23 60 60 49 -247 -82 -66 333 138 175 -70 -196 -410 127 -203 -164 -332 76 -98 -15 47 -28 92 130 72
3711 72 104 -155 -53 41 124 -101 95 2 -275 94 -340 39 -197 152 148 170 -20 74 -113 242 55 -225 -29
3734 -29 -271 -27 131 19 27 -287 17 208 218 -35 145 227 42 342 -10 -312 -157 -171 -31 -218 2 -112
3756 -112 194 -51 166 -126 180 93 -188 54 92 -48 -433 -286 131 -177 122 121 57 457 -170 129 77 197
3778 197 61 -57 -193 36 -219 15 -113 254 167 111 -194 -291 -206 -300 156 -296 -127 97 -105 142 21 108
3800 108 -19 89 -121 -188 199 -227 -27 -175 -322 -65 -78 141 -61 -52 217 -160 45 103 10 -25 -41 40 -115
3823 -115 -11 -281 61 130 -5 80 107 -26 -31 -141 26 112 213 127 -87 -69 28 -150 -272 332 208 -194 -164
3846 -164 -17 -8 -29 -238 190 210 203 -68 -177 -207 358 20 -154 150 223 -11 -70 -216 196 -98 -311 10 -51
3869 -51 -57 -117 -276 17 310 89 -97 139 -111 154 -99 121 85 -33 -43 240 1 -172 -251 -39 35 -27 88
3892 88 -66 307 -44 143 -63 -148 133 108 171 -151 380 -39 -61 28 -150 407 64 98 101 20 265 150 -184
3915 -184 9 -12 256 141 -60 -205 79 -274 -252 99 265 -135 -87 34 206 13 52 -395 189 109 -61 5
3937 5 -297 38 131 -142 6 118 53 128 250 -23 188 -67 -116 -15 43 -45 19 92 379 21 97 -4 400 -2
3961 -2 -178 28 -140 -36 -156 -54 341 108 54 -82 -134 -90 129 380 -136 -115 -94 -61 59 98 60 -66 -75 -181
3985 -181 -22 -224 -104 154 -41 247 140 -138 325 141 -30 -182 -40 27 181 -129 -62 -31 60 82 236 143
4007 143 98 -27 -86 -176 -136 -307 -192 81 328 144 176 106 -307 183 197 -187 189 20 31 -90 -338 -506 176
4030 176 12 -1 40 321 -49 -60 -125 133 -97 130 225 -10 58 -163 -130 -49 -33 -278 -277 52 173 -204 2 -165
4054 -165 -199 142 -39 155 -11 -184 -152 197 35 27 -160 -10 -147 423 -58 188 88 -253 8 -29 165 -44
4076 -44 -6 -154 74 191 160 -277 185 122 109 -87 -18 -194 -189 336 186 -163 -4 -60 38 -282 -380 -46 -48 290
4100 290 13 -154 -156 -72 -120 62 175 180 -48 200 87 -114 -188 111 259 27 -166 18 -223 -80 -23 -36 8
4123 8 279 0 -31 -66 268 -104 171 -61 -13 -148 -136 43 -277 64 148 64 -126 310 -153 29 -202 -167 75
4146 75 -89 68 -24 239 -165 -104 -8 46 -256 54 120 -8 1 159 168 -86 89 137 -137 3 114 -138 -239 -16
4170 -16 169 -238 -236 92 -211 238 -185 -201 38 179 -95 -221 187 -5 103 103 191 -209 159 23 -48 -27 59
4193 59 319 81 -10 93 41 5 -139 72 -108 118 74 -52 210 35 3 -32 -160 11 114 193 -198 -135 -183
4216 -183 52 -196 -58 65 -179 118 218 -173 26 132 108 163 -113 255 47 -267 -97 449 -10 233 -177
4237 -177 131 -102 156 -387 -216 16 -50 -31 -383 129 145 267 54 26 -22 -103 -143 224 162 -37 -262 -368 -189
4260 -189 99 -156 57 -133 337 54 -149 186 -32 -21 -9 80 -270 -3 -373 -171 -282 39 88 -137 30
4281 30 114 206 -225 -17 -223 94 141 -152 236 -106 195 -5 -125 -64 29 111 -31 -55 29 -95 16 -99 -378
4304 -378 177 -85 -118 61 131 -155 167 59 -157 -264 137 -37 100 -300 -74 183 -14 -8 53 92 278 401
4326 401 5 -150 129 231 -169 208 -156 -35 29 -126 217 -22 46 213 -48 -182 133 299 -41 49 71
4347 71 -23 49 -212 91 302 -96 -210 173 165 108 -40 -224 -86 197 -169 -33 -74 7 205 -329 340 -10 -68
4370 -68 71 -137 -10 -248 -309 -31 63 -136 -132 231 -117 113 -25 176 -519 -183 -30 200 204 -32 431 231
4392 231 47 163 -161 45 125 5 242 34 -152 50 140 13 -117 -340 129 22 22 84 -10 20 -13 -44 -251
4415 -251 186 -62 -118 150 36 -147 130 339 -341 75 -116 156 0 -171 466 -21 -230 351 -13 69 -68
4436 -68 -333 -74 -35 109 -82 24 261 126 -151 218 -162 195 -43 -76 48 -192 28 11 110 116 -321 -239 110
4459 110 -52 118 79 35 32 -246 -215 75 107 -26 -80 81 -117 7 219 145 -148 -81 -7 20 -143 196 -9 186
4483 186 -131 -33 275 -1 -83 121 -253 92 -22 -216 9 -227 37 -180 317 24 426 -178 21 185 210
4504 210 38 343 141 -95 51 -296 93 -34 89 -290 -27 -115 197 82 -25 -137 22 -65 94 3 135
4525 135 24 191 -32 -230 -48 -115 -38 11 12 89 -36 28 -38 -98 -209 -61 110 31 -69 209 -27 99 0 -80
4549 -80 -96 -10 -51 230 31 385 313 -37 118 -334 -51 32 -28 -147 -401 35 306 -134 -29 136 108 26 75
4572 75 156 69 -93 -183 255 251 122 54 131 -98 64 190 201 202 56 -137 179 -15 16 -238 -112 -109 262 -98 -140
4597 -140 56 -253 101 11 234 -84 -4 -189 393 -20 232 67 115 -156 86 55 -38 201 100 191 -248 75
4619 75 36 77 62 -305 107 245 13 -129 -20 24 228 -177 30 396 -30 4 -63 -431 -271 28 196 -11
4641 -11 149 39 -121 98 233 -43 -78 373 58 82 -93 -61 -278 -108 -267 -231 339 -155 141 -270 49 -29
4663 -29 51 -272 124 312 106 129 -215 -347 -13 29 -109 -12 154 14 115 117 113 193 -75 -110 95 -28 -58 231
4687 231 73 -9 -266 -3 -308 -2 16 -331 -42 -22 154 64 -54 60 82 439 -96 37 -85 235 131 -266
4709 -266 -17 36 231 -51 11 -26 -6 -200 74 -112 23 -30 -252 -155 -69 125 94 -19 38 -288 -63 250 -39
4732 -39 375 -50 -230 -109 -76 36 197 -39 402 148 144 -139 -65 -219 -62 -140 -79 191 134 -80 -109 -1 -157
4755 -157 113 106 -82 295 33 -164 -2 52 9 -91 29 -132 -56 -30 21 171 -129 -190 249 105 -234 -283 -147
4778 -147 177 -193 -126 208 -345 -158 252 -108 -59 184 -128 -287 -20 63 -18 33 223 148 13 249 168 109 -145
4801 -145 -143 -311 70 199 144 268 244 -199 -23 159 -57 -89 -247 -24 -106 -111 86 -110 7 -150 257 -13 27
4824 27 -99 49 4 196 46 -199 -58 -49 -45 -13 48 -282 25 36 12 -20 217 159 149 -83 -220 79 133 -247 -319
4849 -319 209 -265 99 -154 9 149 209 -80 -194 335 83 11 -188 -65 -108 -185 292 -184 102 313 -272
4870 -272 2 -60 248 140 36 -347 -344 175 -120 92 173 -165 112 -30 -69 -87 -328 -182 110 318 132 -90
4892 -90 -95 217 -88 44 -290 -9 239 99 32 -387 -96 -220 -71 170 317 195 -159 -118 -29 -16 -132 2
4914 2 -12 191 217 -133 -282 -45 190 -90 144 -75 -39 238 -382 -5 166 -203 -96 -432 33 220 231 -289
4936 -289 -33 -62 129 -10 222 324 -56 59 -154 -273 281 -298 -265 324 109 -205 -163 230 -10 -12 -368 -504
4958 -504 -233 -145 175 -268 6 -12 112 144 -102 149 -309 -58 -264 140 0 123 7 97 53 299 -186 278
4980 278 -41 -63 105 -34 -243 218 158 -135 82 47 -56 118 -50 -131 185 -488 131 73 322 52 -78 -27
5002 -27 -92 -37 116 -233 168 -33 -8 -26 174 -86 242 -150 -178 -49 -93 -185 -13 150 -253 64 242 -59 170
5025 170 -188 -78 -206 22 179 -63 8 -234 47 -111 -43 -242 85 -52 -41 -129 -30 -55 -251 84 -32 30
5047 30 -154 -476 116 29 30 -77 -317 79 60 265 271 -64 -198 64 117 59 363 112 24 318 -2 -4 144 -88
5071 -88 54 37 -85 52 328 -146 -255 214 277 104 171 40 179 123 -173 58 10 -80 -61 81 -116 99 -91
5094 -91 -66 -72 -203 139 48 -94 -110 -135 -3 -271 -334 138 157 219 -207 -32 -28 99 113 -184 22 103 -403 109 -48
5119 -48 324 107 17 -122 156 -2 167 -32 332 40 -111 27 16 365 -61 -128 96 170 134 -34 -63 46
5141 46 -265 202 -125 -188 311 -54 94 -47 -273 227 29 78 -255 -41 -61 49 -157 336 -73 -98 -128 41
5163 41 55 -320 199 -18 -8 168 84 229 155 137 56 147 -26 516 130 -205 61 42 -97 0 -170 306 157
5186 157 -226 94 -25 -38 60 -17 180 -20 232 360 5 0 318 -122 189 -89 -198 65 -161 208 -343 153
5208 153 170 -60 1 -173 46 130 184 154 -73 177 -324 150 -271 -173 76 68 153 -360 -13 -173 48 -56 97
5231 97 123 70 -46 26 138 -77 -223 -143 200 -158 117 445 -36 -124 73 -58 147 -158 100 -9 73 -144
5253 -144 50 -119 -112 264 -199 -12 -37 41 -156 48 239 -96 -361 89 -116 -96 -18 121 206 -106 -60 -111 -148
5276 -148 -31 -307 24 -30 -58 72 -67 419 -87 -60 -63 12 227 -8 -352 -18 -53 -178 47 -201 266 -126
5298 -126 11 92 123 21 112 117 -151 -141 -62 -109 -129 -300 -65 -182 199 184 -310 106 -25 -15 187 -142 218 -82
5322 -82 57 270 -82 156 95 75 70 131 35 -102 71 -186 57 5 -103 -32 -24 -146 137 2 115 111 -257 312
5346 312 -63 148 36 148 -144 9 152 60 -6 -112 127 103 35 -267 -161 168 116 32 21 -238 -173 289 63
5369 63 -39 155 195 119 -80 209 -66 -137 -34 154 39 109 -7 -151 -35 -178 146 303 -195 168 -207 96
5391 96 281 -141 78 116 141 162 -25 259 -198 7 -67 -3 117 -72 194 307 173 129 33 121 -27 -276 -45
5414 -45 -103 157 -139 205 124 108 -334 108 14 -137 116 98 89 13 117 -90 -197 -463 53 257 58 164 122
5437 122 -22 -45 22 45 196 -106 -203 62 -328 -245 124 -54 326 6 229 110 -168 -180 280 231 -244 75
5459 75 -214 -238 122 22 231 12 44 -71 -126 -45 -484 80 -150 -142 -74 -101 105 95 -418 -354 56 -247 -75 -147
5483 -147 175 56 -35 40 -160 58 405 86 -58 317 -206 -174 -55 -97 118 -105 7 -212 -253 -67 -16 70
5505 70 34 107 47 256 127 226 92 52 -255 126 246 -45 -147 1 219 143 -245 -205 -152 189 -12 -146 -25
5528 -25 -139 -159 185 115 -123 -96 -216 -27 -13 14 -55 -79 261 217 278 -234 107 11 77 75 156 -84 -10 -97 3 -57
5554 -57 172 98 -316 -88 197 -72 55 193 187 -311 47 -39 -109 -274 -94 -67 206 62 79 162 121 27 -148 -17
5578 -17 -172 350 225 55 -120 61 -181 -276 -87 -115 25 -224 -122 228 -55 29 -16 147 -9 8 -45 70
5600 70 35 52 -95 286 -88 114 70 28 -42 -44 -243 232 131 -186 42 -65 -179 91 13 -131 -45 -173 -60
5623 -60 183 252 152 74 -84 -189 149 17 -190 26 -222 -309 209 -244 -207 -15 91 70 120 -98 25 -161
5645 -161 15 84 40 -413 -98 9 -22 163 296 244 198 80 -98 204 -45 31 -59 60 -9 -193 -156 255 -58
5668 -58 106 -277 283 44 260 43 -178 294 -39 -171 -32 -296 131 -86 -219 -51 0 33 125 -27 -87 -339
5690 -339 -13 143 -82 192 53 -81 -180 158 59 58 -65 -48 -7 -122 -39 166 -95 -10 39 -311 -154 -89 287
5713 287 20 35 284 -89 -316 262 -19 93 -485 -349 -22 73 -92 -108 170 -130 -33 -120 -139 342 114 180
5735 180 2 197 132 83 8 -12 -35 47 28 168 -28 -30 -82 -3 -9 118 210 -361 132 390 176 95 -72 -22 82
5760 82 116 30 -148 -30 -4 133 80 -112 181 34 228 245 374 -66 -231 -13 -168 -90 379 135 -71 -81 -124
5783 -124 196 84 5 -46 221 186 -148 290 22 -66 -199 -117 451 -306 -15 -110 309 -200 196 257 -351 103
5805 103 -62 -173 -82 -283 -266 -372 -13 69 146 124 -80 -116 -43 -25 348 -5 207 46 296 247 -139 -220 -23
5828 -23 217 -140 224 -26 6 13 -12 -275 141 162 -77 85 -104 -262 -84 -109 188 -184 -33 -59 -116 13 -65
5851 -65 -256 85 271 4 -322 72 158 389 -122 264 -7 -35 -81 57 -61 -257 29 -10 -63 84 52 -222
5873 -222 22 10 157 12 -220 -168 243 -51 109 232 29 -27 -284 -187 -128 -67 -202 -68 134 28 -166 -43
5895 -43 159 0 254 60 -152 -171 -57 14 -90 -175 34 -17 -213 -86 42 163 -40 -159 236 -19 -7 6
5917 6 101 192 -24 14 -243 100 -91 -73 82 -3 -43 -211 177 33 -140 -208 -108 -4 16 40 92 -122 -135 127
5941 127 159 -102 -331 -233 -55 96 309 41 -17 -221 -44 -40 163 -234 143 183 159 150 69 -32 70 -172 -159 15
5965 15 295 20 -110 308 -341 394 -80 70 -299 -5 -37 -124 -178 -96 181 -75 293 -155 78 174 18 -310
5987 -310 150 123 -98 131 -145 148 51 -72 5 55 -229 -273 -55 -124 -2 139 -135 -13 -254 -60 -175 67
6009 67 62 125 65 -71 15 -152 269 -225 -107 -184 -5 66 -107 -178 418 -26 -223 -54 -231 109 -96 -65 -77 38
6033 38 109 -215 145 -134 244 -13 -244 134 -302 69 -56 222 -291 -107 -189 59 -56 -106 91 -36 -84 -18
6055 -18 307 -5 36 184 148 297 -78 77 -362 18 66 -123 -102 16 133 152 223 100 -121 91 144 -207 138
6078 138 16 -6 112 -10 -31 190 -97 -175 39 87 -95 -116 -539 -47 182 -83 -118 -149 -13 172 -172 -197 -162
6101 -162 212 -49 196 54 89 -53 -71 147 45 112 -52 -130 -66 -101 -267 -271 160 -90 -291 266 86 178 12
6124 12 -105 3 30 17 -350 -49 0 8 141 84 -22 -35 206 -174 -9 -147 99 -148 128 78 15 -45 101 170
6148 170 191 -305 87 199 95 -131 197 101 32 -66 7 43 -165 -117 -105 203 -111 115 170 25 -316 -159 4
6171 4 -63 93 -239 -134 130 -5 70 107 -9 -110 -179 -194 -70 221 -84 -77 19 -59 -105 3 -80 143 11 170
6195 170 -178 204 206 -10 -24 210 90 -161 -64 7 58 129 47 246 -58 351 228 -124 9 -5 12 -54 181 -199
6219 -199 86 -22 -242 75 17 100 162 172 -13 203 49 425 -7 36 -231 -79 -236 -172 -107 -331 -269 226 4
6242 4 246 279 -259 49 222 81 54 -207 163 252 497 31 -136 -1 -48 36 50 -58 322 -96 -118 -180 -44
6265 -44 141 37 -5 -35 94 -173 -22 99 -18 -16 220 20 84 91 -367 -110 -72 -111 199 249 238 -89 -63 -91 56
6290 56 -245 -74 -65 -61 59 307 30 263 45 274 173 5 -201 -54 -79 -95 47 152 168 -181 -140 128 168
6313 168 270 113 75 -38 107 -55 -45 -21 12 16 72 -103 36 -95 -208 -194 121 -97 -26 11 36 174 -75 -5
6337 -5 183 275 29 -47 -63 162 -192 -94 -82 53 83 182 39 -192 44 147 137 112 1 25 -47 93 -4 -22 84
6362 84 -193 -202 -182 -51 46 -117 -149 488 -146 -178 4 -237 -104 -134 -135 -27 221 -350 269 227 -248 -130 -172 -282
6386 -282 31 140 17 173 234 132 306 285 -85 285 -44 135 370 187 137 132 -486 74 203 -229 242 -98
6408 -98 -1 160 224 121 -44 279 92 -360 312 235 -121 -52 53 -5 349 -106 -202 8 274 -465 -203 116
6430 116 -26 -178 150 29 -21 -60 -82 -129 -250 50 221 301 -29 79 -21 -225 -169 -107 167 -225 -172 -56 2
6453 2 -354 -148 205 -74 -120 -277 -111 -93 35 -110 -323 -26 284 114 75 51 341 -56 -131 232 -85 -12 -83
6476 -83 141 359 259 -78 -182 -68 282 -74 -21 -299 -54 66 135 -225 -70 -239 76 -58 256 -186 -70
6497 -70 -164 -124 241 34 17 -160 318 -163 45 234 4 158 -37 150 -379 -54 -159 -83 -18 113 -54 -11
6519 -11 246 -97 174 157 -46 291 -137 159 -35 -124 2 217 170 70 -192 -61 -163 446 -31 -31 -165 -88
6541 -88 -182 -49 -57 -53 92 -127 75 179 102 -75 -26 -235 -105 -51 -109 -173 178 -230 -161 -73 176 161 -58 -28 -117
6566 -117 210 165 -56 -13 142 -2 -101 16 -307 -85 12 5 129 -12 -154 -133 2 -140 104 240 104 130 202
6589 202 -234 1 64 -6 -150 -255 -141 -284 -194 -131 235 202 413 -101 -7 -63 -59 -68 241 -16 222 68 -115 -67
6613 -67 -195 312 -140 31 144 58 205 -23 -24 -150 1 -243 -222 78 -152 20 -92 137 125 -59 -18 -60 -156
6636 -156 -156 -95 99 -292 -59 -87 0 154 174 29 4 12 137 -13 -268 -44 -26 -175 -195 -204 -255 20 -97 34 -195
6661 -195 -6 -40 -136 -253 -54 -37 -95 -55 -51 -37 75 -118 -140 -174 92 -78 71 50 -56 -48 -238 90 -55 199
6685 199 -106 -97 -19 162 100 -260 -11 165 -69 -274 276 192 -20 82 -83 376 145 -262 -259 -33 -48 -308 -2
6708 -2 -34 95 -49 271 -8 60 -1 -32 -196 41 -1 -83 -208 -160 -9 -106 -107 -187 -41 277 -67 -66 78 -316 153
6733 153 26 -60 42 143 -24 66 137 -101 162 -89 48 121 -165 5 -14 101 129 -88 89 66 -113 205
6755 205 -19 149 -202 -2 -298 110 225 -22 205 273 -220 -206 -103 -47 80 -467 100 -94 293 345 -43
6776 -43 -73 237 61 202 -204 188 -214 -124 -152 -9 -321 -11 -58 -186 -130 38 -115 -93 -79 -29 -326 -235 190
6799 190 233 107 -360 188 12 79 76 -117 -182 170 334 -45 -150 -67 358 97 -115 233 63 237 -20 120
6821 120 -82 -23 -194 119 19 166 -210 -2 293 351 246 -215 152 75 -129 -68 387 -88 -271 -120 -26 52
6843 52 145 247 -80 122 20 -35 128 71 146 237 3 -146 -141 26 91 -198 -140 -92 -168 -117 108 -55 -22 39 54
6868 54 214 130 -51 66 56 247 169 -159 -14 -83 22 191 90 -84 -55 -2 -323 111 -8 -167 30 30 405
6891 405 -141 89 -216 -258 107 98 -69 -259 -107 -97 49 233 -243 44 -95 101 -171 180 -328 345 11
6912 11 -142 62 266 -93 -1 -119 129 277 63 158 -26 59 -237 256 -144 159 -165 2 130 -45 -46 74
6934 74 206 281 -46 -114 117 85 -168 47 -32 182 270 28 78 -132 -386 -63 54 -69 -179 118 145 11 61
6957 61 124 97 72 -71 258 -137 -92 -6 14 -9 -391 -521 -24 94 -103 191 191 222 181 188 -29 113 -240 295 -320
6982 -320 -42 138 32 50 20 -28 -100 38 136 406 326 -78 -272 -374 -159 -10 155 -227 -12 -113 -96 57
7004 57 219 -72 -99 119 -179 76 157 28 -83 47 -282 88 -41 -28 43 174 -76 37 -73 197 49 219
7026 219 253 190 -211 -62 79 -98 10 190 175 152 110 -168 47 86 200 -76 -401 -114 80 -19 47 99 149
7049 149 -234 128 -112 -112 -166 -81 -56 8 -45 -66 -159 15 -148 96 32 -112 91 210 19 221 2 11 161 98
7073 98 -33 -110 4 12 108 -37 -124 -69 -99 121 -268 0 228 -55 -205 -94 -47 -52 244 103 56 -196 -208 -59
7097 -59 73 69 -33 179 -13 73 59 -57 -210 276 93 105 3 -72 30 155 -342 56 23 60 -78 84 20
7120 20 62 3 162 -203 383 54 -228 259 211 87 -163 53 -97 23 5 -32 -39 -126 9 -13 62 -129 -248 -89
7144 -89 231 8 -89 89 64 -11 1 -82 211 18 -192 244 1 -312 17 174 219 60 -378 -210 131 105 34
7167 34 -365 2 -122 194 -61 -128 -316 -111 -307 -99 151 42 -91 57 106 109 13 188 -1 7 -112 168 -58
7190 -58 -125 -25 -185 -126 201 134 33 262 -201 80 -155 -191 105 224 -31 -54 59 29 188 -224 15 71 86
7213 86 -9 26 -16 -306 -177 92 44 -148 110 -59 155 177 -182 191 333 97 -213 -26 -125 -16 -67 175 170
7236 170 -150 232 21 -76 -80 -64 -31 -177 42 133 -25 -55 -91 -209 50 33 -106 117 -96 20 170 148 297
7259 297 200 -7 -109 -141 134 -164 -122 -274 -25 20 -16 -69 154 -113 -27 88 -70 -138 -6 49 -149 -183 52
7282 52 22 -180 -278 -103 -304 93 106 -99 165 -1 -152 -203 -169 230 19 -259 -242 22 153 10 131 180 270
7305 270 208 -138 -132 55 19 -32 47 53 270 13 3 -108 89 -83 -174 -6 -168 -159 -87 -156 35 14 -8 121 10
7330 10 356 -10 72 271 -181 166 90 -44 476 -21 -144 -108 -4 192 -164 -111 77 28 -247 15 370 -10
7352 -10 13 -473 170 64 -93 296 -40 -176 -235 86 -253 103 1 127 52 -318 205 -209 -248 26 61 124
7374 124 277 -299 54 132 45 -267 -21 231 -297 93 181 193 78 -69 -371 -121 1 102 -94 -108 -112 13
7396 13 -365 49 180 53 148 19 -151 -118 -329 -255 59 89 -49 15 151 -225 -120 46 46 -36 -68 -81 88 297
7420 297 56 -99 167 52 196 9 113 135 -174 107 -177 16 135 215 169 205 -335 -15 95 75 86 -15
7442 -15 62 92 21 -23 47 -357 56 -254 258 -43 -318 33 123 -65 83 252 7 39 -213 82 -72 -137 86
7465 86 84 13 27 -31 -4 -11 142 -83 24 73 -1 30 129 127 69 135 64 168 -188 -252 53 -30 83 -24 -51 -310 166
7492 166 -91 -291 -61 33 -74 -93 -230 -27 -196 149 -433 38 18 -345 233 -157 56 -331 -123 -67 207
7513 207 -44 -75 -183 -8 115 -125 -89 56 -44 -11 -159 -46 -156 -98 94 144 389 -50 43 -298 -223 -42
7535 -42 -65 -47 23 -159 -143 -287 68 12 -25 1 13 -117 200 -106 4 -367 172 -106 -438 -99 -60 -30 67 336
7559 336 -188 277 202 129 107 105 210 -49 -118 -176 11 -243 -149 109 134 -73 -32 -76 -54 255 -87 -327 -42 184
7583 184 -235 -182 -78 45 -49 -110 -173 -104 -34 212 50 141 -300 -67 -5 260 13 35 -150 319 18 -42 215
7606 215 -163 17 -40 133 103 -70 -50 141 23 112 -101 309 -63 53 83 72 -37 169 12 -179 47 138
7628 138 73 200 -40 -8 -4 -157 -85 -239 21 184 88 -213 -79 -71 -86 -59 111 22 -21 -114 -198 -118 172 -432 38
7653 38 14 -203 -100 -94 -91 313 204 154 385 -123 13 104 46 369 -34 145 -46 -91 -75 -300 231 88 35 -109
7677 -109 -1 -25 84 -173 -259 -253 225 -209 -49 21 72 -29 -52 131 -1 -108 -3 62 -85 -157 -171 -148 -233 -41
7701 -41 -139 -18 71 48 -142 76 21 -14 11 91 281 -158 191 206 39 36 80 209 -268 54 -250 -19 122 -309
7725 -309 165 -115 163 -9 84 70 -233 -35 -84 -66 -93 191 34 138 -83 61 -137 -116 -16 -241 -320 7
7747 7 -208 22 120 -60 342 -92 11 172 119 64 -32 30 -5 171 281 113 -45 108 -37 -64 29 63 94 -182
7771 -182 -128 -86 143 34 -271 97 516 29 -189 86 -102 -33 62 129 131 -98 -120 -221 35 64 120 -234 133
7794 133 10 -49 -218 -1 82 -56 111 11 -103 93 14 -94 -102 -11 -110 -7 10 -5 -121 -62 -303 89 132 -115
7818 -115 -225 -28 -145 -10 27 89 -233 79 86 -337 -106 -250 187 361 17 -107 -211 353 2 -5 180 60
7840 60 147 65 -14 36 78 -143 -103 -43 -119 -218 119 86 -188 29 183 37 60 -115 -19 -62 71 25 421 92 -103
7865 -103 117 17 -1 -105 102 -163 375 325 149 -201 269 -107 -220 -113 150 198 136 -137 -160 -165 -189 82 -241
7888 -241 -52 -19 12 -164 -88 -148 0 -128 122 122 33 -305 -144 -182 32 165 -106 -121 -178 169 129 103 116 -22
7912 -22 -54 312 26 75 -134 -71 -73 -217 59 183 183 2 18 -129 -106 42 37 290 -3 -107 102 315 119 -147
7936 -147 -218 -37 29 345 7 39 -53 -91 209 -116 -118 -23 99 -145 312 228 -112 -270 52 0 3 -122 114 -103
7960 -103 45 4 -22 82 123 128 -94 -62 -38 184 -204 -63 8 47 122 -176 19 88 213 49 -65 -392 70 119
7984 119 -61 12 42 -138 -16 -244 -151 -127 185 149 262 52 233 227 99 382 202 18 13 140 510 -210 62
8007 62 21 -130 232 -110 -118 -218 285 11 219 -51 -120 275 433 324 -80 -145 -120 15 -42 -367 149 168 199
8030 199 -27 -35 -145 -182 -177 -117 -23 -309 0 -180 -98 21 -149 60 52 86 55 -56 -138 -91 71 53 35 158 95 -1
8056 -1 -261 -8 -117 98 144 99 -52 -212 -236 -53 -198 -54 -326 -69 -111 30 -133 -131 169 -60 25 -48 129
8079 129 -198 -35 48 -147 112 3 145 31 -50 42 -172 193 -12 53 70 -59 59 -108 -356 204 -167 -134
8101 -134 -130 162 -27 89 3 41 -210 -171 33 247 134 -158 30 191 -48 175 -38 251 -237 -160 40 195
8123 195 31 211 114 -89 125 211 207 -153 -211 -237 221 -279 -68 295 103 -57 186 -31 -7 -57 -163 54 145
8146 145 -74 38 -139 -39 141 70 -52 -31 30 232 206 104 83 -98 244 64 -152 113 334 -69 -107 -6
8168 -6 -248 -497 -161 277 -23 39 -31 -86 -139 -15 176 83 -26 -62 -185 53 157 -293 155 159 -76 75 15
8191A5
##END NTUPLES=NMR FID
##END=
