##TITLE=1H_LR-579-H1-CR6
 D2O, 8 sc, 
 24.6.2019
##JCAMPDX= 6.0         $$ Bruker NMR JCAMP-DX V2.0
##DATA TYPE= NMR FID
##DATA CLASS= NTUPLES
##ORIGIN= UXNMR, Bruker Analytische Messtechnik GmbH
##OWNER= root
$$ XWIN-NMR		Version 3.5
$$ Mon Jun 24 16:20:21 2019 Russian Standard Time (UT+4h)  she@DPX200
##.OBSERVE FREQUENCY= 200.13155
##.OBSERVE NUCLEUS= ^1H
##.DELAY= (6, 6)
##.ACQUISITION MODE= SIMULTANEOUS
##.ACQUISITION SCHEME= undefined
##.AVERAGES= 8
##.DIGITISER RES= 18
##SPECTROMETER/DATA SYSTEM= spect
##.PULSE SEQUENCE= zg30
##.SOLVENT NAME= CDCl3
##.SHIFT REFERENCE= (INTERNAL, CDCl3, 0, 15.7039)
##AUDIT TRAIL= $$ (NUMBER, WHEN, WHO, WHERE, WHAT)
$$ ##TITLE= Audit trail, XWIN-NMR		Version 3.5
$$ ##JCAMPDX= 5.01
$$ ##ORIGIN= Bruker BioSpin GmbH
$$ ##OWNER= she
$$ F:/spectra/data/she/nmr/H-F/1/audita.txt
$$ ##AUDIT TRAIL=  $$ (NUMBER, WHEN, WHO, WHERE, WHAT)
(   1,<2019-06-24 16:19:24.56 +0400>,<she>,<DPX200>,
      <created by zg, POWCHK disabled, PULCHK disabled
       configuration hash MD5:
       00 E9 B6 7A A2 85 ED C7 34 08 36 98 17 FE 4E 26
       data hash MD5: 16K
       0F BD 79 8E 07 3E 4E F8 EE 59 B0 99 07 2A 0C 6A>)
$$ ##END=
$$ 
$$ hash MD5
$$ 0C E4 47 CA 27 7B F2 1A 7F 31 1A 7D 11 7A 30 DD
##$RELAX= 
##$RELAX= 
##$RELAX= 
##$RELAX= 
##$RELAX= 
##$RELAX= 
$$ Bruker specific parameters
$$ --------------------------
##$DU= <F:/spectra>
##$EXPNO= 1
##$NAME= <H-F>
##$PROCNO= 1
##$TYPE= <nmr>
##$USER= <she>
##$AMP= (0..31)
100 100 100 100 100 100 100 100 100 100 100 100 100 100 100 100 100 100 
100 100 100 100 100 100 100 100 100 100 100 100 100 100 
##$AQSEQ= 0
##$AQ_mod= 1
##$AUNM= <au_zg>
##$AUTOPOS= <>
##$BF1= 200.13
##$BF2= 200.13
##$BF3= 200.13
##$BF4= 200.13
##$BF5= 200.13
##$BF6= 200.13
##$BF7= 200.13
##$BF8= 200.13
##$BYTORDA= 1
##$CFDGTYP= 0
##$CFRGTYP= 5
##$CHEMSTR= <none>
##$CNST= (0..31)
1 1 145 1 1 1 1 1 1 1 1 1 1 1 1 1 1 1 1 1 1 1 1 1 1 1 1 1 1 1 1 1 
##$CPDPRG= <>
##$CPDPRG1= <>
##$CPDPRG2= <>
##$CPDPRG3= <>
##$CPDPRG4= <mlev>
##$CPDPRG5= <mlev>
##$CPDPRG6= <mlev>
##$CPDPRG7= <mlev>
##$CPDPRG8= <mlev>
##$CPDPRGB= <>
##$CPDPRGT= <>
##$D= (0..31)
0 1.2 0 0 0 0 0 0 0 0 0 0.03 0 0 0 0 0 0 0 0 0 0 0 0 0 0 0 0 0 0 0 0 
##$DATE= 1561378763
##$DBL= (0..7)
120 120 120 120 120 120 120 120 
##$DBP= (0..7)
150 150 150 150 150 150 150 150 
##$DBP07= 0
##$DBPNAM0= <>
##$DBPNAM1= <>
##$DBPNAM2= <>
##$DBPNAM3= <>
##$DBPNAM4= <>
##$DBPNAM5= <>
##$DBPNAM6= <>
##$DBPNAM7= <>
##$DBPOAL= (0..7)
0.5 0.5 0.5 0.5 0.5 0.5 0.5 0.5 
##$DBPOFFS= (0..7)
0 0 0 0 0 0 0 0 
##$DE= 6
##$DECBNUC= <off>
##$DECIM= 24
##$DECNUC= <off>
##$DECSTAT= 4
##$DIGMOD= 1
##$DIGTYP= 9
##$DL= (0..7)
0 120 120 120 120 120 120 120 
##$DP= (0..7)
150 150 150 150 150 150 150 150 
##$DP07= 0
##$DPNAME0= <>
##$DPNAME1= <>
##$DPNAME2= <>
##$DPNAME3= <>
##$DPNAME4= <>
##$DPNAME5= <>
##$DPNAME6= <>
##$DPNAME7= <>
##$DPOAL= (0..7)
0.5 0.5 0.5 0.5 0.5 0.5 0.5 0.5 
##$DPOFFS= (0..7)
0 0 0 0 0 0 0 0 
##$DQDMODE= 0
##$DR= 18
##$DS= 0
##$DSLIST= <SSSSSSSSSSSSSSS>
##$DSPFIRM= 0
$$ [...]
##$SUBNAM2= <"">
##$SUBNAM3= <"">
##$SUBNAM4= <"">
##$SUBNAM5= <"">
##$SUBNAM6= <"">
##$SUBNAM7= <"">
##$SUBNAM8= <"">
##$SUBNAM9= <"">
##$SW= 24.9336996594482
##$SWIBOX= (0..15)
0 0 2 0 0 0 0 0 0 0 0 0 0 0 0 0 
##$SW_h= 4990.01996007984
##$TD= 16384
##$TD0= 1
##$TE= 0
##$TE2= 300
##$TE3= 300
##$TEG= 300
##$TL= (0..7)
0 120 120 120 120 120 120 120 
##$TP= (0..7)
150 150 150 150 150 150 150 150 
##$TP07= 0
##$TPNAME0= <>
##$TPNAME1= <>
##$TPNAME2= <>
##$TPNAME3= <>
##$TPNAME4= <>
##$TPNAME5= <>
##$TPNAME6= <>
##$TPNAME7= <>
##$TPOAL= (0..7)
0.5 0.5 0.5 0.5 0.5 0.5 0.5 0.5 
##$TPOFFS= (0..7)
0 0 0 0 0 0 0 0 
##$TUNHIN= 0
##$TUNHOUT= 0
##$TUNXOUT= 0
##$USERA1= <user>
##$USERA2= <user>
##$USERA3= <user>
##$USERA4= <user>
##$USERA5= <user>
##$V9= 5
##$VALIST= <valist>
##$VCLIST= <CCCCCCCCCCCCCCC>
##$VD= 0
##$VDLIST= <DDDDDDDDDDDDDDD>
##$VPLIST= <PPPPPPPPPPPPPPP>
##$VTLIST= <TTTTTTTTTTTTTTT>
##$WBST= 1024
##$WBSW= 4
##$XGAIN= (0..3)
0 0 0 0 
##$XL= 0
##$YL= 0
##$YMAX_a= 279560
##$YMIN_a= -499396
##$ZGOPTNS= <>
##$ZL1= 120
##$ZL2= 120
##$ZL3= 120
##$ZL4= 120
##$ABSF1= 10
##$ABSF2= 0
##$ABSG= 5
##$ABSL= 3
##$ALPHA= 0
##$AQORDER= 0
##$ASSFAC= 0
##$ASSFACI= 0
##$ASSFACX= 0
##$ASSWID= 0
##$AUNMP= <proc_1d>
##$AZFE= 0.1
##$AZFW= 0.1
##$BCFW= 1
##$BC_mod= 2
##$BYTORDP= 1
##$COROFFS= 0
##$CY= 11.3945322036743
##$DATMOD= 1
##$DC= 2
##$DFILT= <>
##$DTYPP= 0
##$F1P= 18.9103706918063
##$F2P= -1.10871071338519
##$FCOR= 0.5
##$FTSIZE= 0
##$FT_mod= 4
##$GAMMA= 1
##$GB= 0.15
##$INTBC= 1
##$INTSCL= 1
##$ISEN= 128
##$LB= 0.24
##$LEV0= 0
##$LPBIN= 0
##$MAXI= 10000
##$MC2= 0
##$MEAN= 0
##$ME_mod= 0
##$MI= 1.114404
##$NCOEF= 0
##$NC_proc= 0
##$NLEV= 6
##$NOISF1= 3.799351
##$NOISF2= 2.8
##$NSP= 1
##$NTH_PI= 0
##$NZP= 0
##$OFFSET= 15.70392
##$PC= 1
##$PHC0= -8500.672
##$PHC1= 8.800971
##$PH_mod= 1
##$PKNL= yes
##$PPARMOD= 0
##$PSCAL= 0
##$PSIGN= 0
##$REVERSE= no
##$SF= 200.130013532006
##$SI= 16384
##$SIGF1= 3
##$SIGF2= 2
##$SINO= 400
##$SIOLD= 16384
##$SREGLST= <1H.CDCl3>
##$SSB= 0
##$STSI= 0
##$STSR= 0
##$SW_p= 3612.71676300578
##$SYMM= 0
##$S_DEV= 0
##$TDeff= 0
##$TDoff= 0
##$TI= <>
##$TILT= no
##$TM1= 0
##$TM2= 0
##$TOPLEV= 0
##$USERP1= <user>
##$USERP2= <user>
##$USERP3= <user>
##$USERP4= <user>
##$USERP5= <user>
##$WDW= 1
##$XDIM= 8192
##$YMAX_p= 0
##$YMIN_p= 0
$$ End of Bruker specific parameters
$$ ---------------------------------
##NTUPLES= NMR FID
##VAR_NAME=  TIME,          FID/REAL,        FID/IMAG
##SYMBOL=    X,             R,               I
##VAR_TYPE=  INDEPENDENT,   DEPENDENT,       DEPENDENT
##VAR_FORM=  AFFN,          ASDF,            ASDF
##VAR_DIM=   8192,          8192,            8192
##UNITS=     SECONDS,       ARBITRARY UNITS, ARBITRARY UNITS
##FACTOR=    0.0002004,     1,               1
##FIRST=     0,             0,               0
##LAST=      1.6414764,     0,               0
##MIN=       0,             -499396,         0
##MAX=       1.6414764,     279560,          0
$$ Real data points
##PAGE= N=1
##DATA TABLE= (X++(R..R)), XYDATA
0 0 0 0 0 0 8 -8 8 -8 13 -16 16 -24 32 -40 48 -56 65 -80 96 -112 135 -152 179 -208 237 -273 311 -354
28 -354 401 -451 510 -574 642 -720 803 -896 996 -1104 1230 -1362 1506 -1672 1848 -2047
44 -2047 2266 -2515 2794 -3109 3473 -3898 4390 -4985 5714 -6624 7811 -9420 11746 -15423
58 -15423 22139 -38412 160264 34967 -388561 -224778 12438 47009 -62306 76892 264060
69 264060 196153 -110914 -239177 -138594 -38112 -52853 42341 245658 279560 -1101 -277285
80 -277285 -265772 -65872 47652 77864 143358 186158 55440 -147018 -203643 -106773 -38998
91 -38998 -9464 111190 262377 190049 -109324 -303886 -186310 29389 82383 48445 118198
102 118198 198472 70895 -188376 -274078 -106554 79346 122686 118891 145295 92467 -97430
113 -97430 -243080 -169962 24024 129389 119833 108489 97884 -3190 -162353 -215960 -101337
124 -101337 66066 168243 185504 117502 -39187 -195134 -201310 -51761 82788 93105 69034
135 69034 102878 102043 -45374 -225599 -219991 -22531 153070 174368 112246 46419 -53895 -180477
147 -180477 -200017 -47917 130378 161623 77548 24178 12742 -56592 -169870 -173693 -11390
158 -11390 170601 208498 105130 -29504 -126658 -165047 -118906 6041 124547 148670 90229
169 90229 19123 -44844 -117506 -157107 -88891 67255 180257 158267 46190 -60250 -124442
180 -124442 -144475 -93473 33306 151482 160167 64985 -38352 -91460 -114614 -113351 -42994 93369
192 93369 187693 141797 -6280 -125421 -142000 -88688 -19415 52663 117766 133063 66327 -50365
204 -50365 -139695 -145703 -69336 44238 133964 147780 73471 -43147 -127215 -133237 -70530 18339
216 18339 92225 121260 92911 16161 -75142 -133858 -122937 -39274 77222 153565 133395 26403
228 26403 -91262 -140269 -104227 -23357 52355 99922 107573 66833 -16070 -101275 -134456 -88075
240 -88075 13586 110321 144108 93394 -12625 -107844 -133916 -81091 9240 83001 111550 90556
252 90556 28348 -52757 -114935 -115322 -46720 52922 122645 122366 53353 -45786 -118570 -121421 -54298
265 -54298 38081 101270 108001 64456 -7830 -80807 -119728 -93388 -7755 86433 126924 91419
277 91419 6153 -77389 -117079 -94617 -22803 59765 107067 96969 37750 -40760 -102411 -113325
289 -113325 -58925 34261 109307 116020 54933 -30282 -92598 -106196 -66671 8614 82122 110394
301 110394 77417 4096 -68721 -106034 -88865 -21998 63874 116434 99197 22672 -61372 -104090
313 -104090 -88632 -30409 40374 91672 97505 50746 -25586 -89228 -104430 -61791 15824 86759
325 86759 108816 67567 -11523 -80706 -102479 -68894 -2300 63293 96391 79107 18113 -54064
337 -54064 -97885 -88940 -30875 45448 97435 93349 35678 -40538 -91386 -91666 -44334 24844 81070
350 81070 93825 54751 -13737 -74416 -94362 -64658 985 67523 98119 73192 5999 -63635
362 -63635 -94560 -73427 -14485 50384 88766 81147 28536 -40353 -88047 -85764 -35518 33168
374 33168 83165 87347 44658 -21666 -75769 -88206 -52659 10964 69101 90348 62431 -787
386 -787 -63583 -90347 -66424 -6924 55002 87307 72163 17559 -46547 -84485 -75292 -25698 35507
399 35507 77758 79914 38513 -25644 -77005 -85527 -45486 19189 71705 83506 49624 -10264
411 -10264 -63529 -83246 -58036 -1229 55799 81641 63290 10368 -47961 -80489 -70437 -20868
423 -20868 40350 78315 72889 27771 -31955 -73779 -76400 -36625 24048 70768 77844 42409 -15146
436 -15146 -63249 -76781 -48746 5692 56755 77597 56655 5477 -49028 -77191 -62378 -12400
448 -12400 45262 77366 66221 19202 -36761 -72211 -68422 -26791 29555 69434 69246 31864 -19387
461 -19387 -59306 -69906 -45369 5592 58651 78720 50894 -6627 -57284 -73054 -51206 -4975
473 -4975 44288 71336 58602 11920 -41257 -69992 -60696 -20260 28978 63812 65298 30508 -22453
486 -22453 -63706 -70546 -37217 17381 62359 70527 38313 -12160 -52745 -64886 -44582 -1051
498 -1051 46127 71001 54448 5191 -44503 -65015 -51095 -13904 30848 64234 65284 25367
510 25367 -32496 -67951 -60519 -21057 23550 54362 61348 36058 -12482 -56018 -66822 -38631
522 -38631 8580 49017 63047 44088 1600 -43131 -64685 -51203 -10651 36970 65735 57021
534 57021 12522 -38113 -62509 -50814 -17710 20187 50919 60522 35154 -17871 -61134 -62761
546 -62761 -27689 14814 43735 55125 43896 4913 -45741 -71428 -47386 5678 47534 57186
558 57186 40236 8856 -28392 -55793 -53196 -17779 28268 56971 54755 24012 -19986 -54631
570 -54631 -57931 -28023 16820 50711 58081 34785 -8838 -49809 -60565 -33602 9431 39633
582 39633 47909 38181 12109 -27825 -60696 -56643 -12254 39312 60260 44205 9986 -24033 -48880
595 -48880 -52127 -25376 19814 53177 52088 23003 -14364 -42309 -51191 -35238 2056 41629 57779
608 57779 39928 -1784 -41498 -56828 -39314 -1092 34311 49574 40040 12842 -22771 -50649
620 -50649 -51611 -19421 25686 53368 47785 18110 -17400 -42789 -48622 -28671 9792 43313 52007
633 52007 32220 -3878 -37464 -52634 -38161 -226 38535 52710 37128 3867 -28916 -47738
645 -47738 -42134 -12439 25440 47224 41860 16617 -14854 -42005 -51637 -30124 14889 51891 52141
658 52141 20075 -16411 -38054 -41812 -29569 -1170 32652 49111 35356 1768 -29778 -45904
670 -45904 -41620 -13923 27042 54007 45130 7368 -29272 -43808 -36033 -15391 12937 39386 45943
683 45943 24632 -11321 -38897 -44544 -28721 2768 36555 52067 34642 -5237 -38914 -45563
695 -45563 -27554 345 25564 40014 36128 12848 -19172 -43597 -43722 -17414 21035 47433 44195
708 44195 14678 -20126 -39000 -37590 -20225 6921 33387 43808 28480 -4684 -34150 -43322
720 -43322 -30333 -2654 28327 46346 36759 2850 -32141 -44085 -30662 -4795 19184 35003
732 35003 36130 18173 -12932 -39486 -43975 -21746 14174 41922 43691 19228 -13928 -34069 -34570
745 -34570 -21716 -654 25356 42614 34571 2441 -30781 -41412 -28795 -5801 19312 39627
757 39627 41016 13583 -26185 -45700 -31863 -3451 16166 25459 30172 25464 490 -34075 -49202
770 -49202 -28594 11232 39751 40330 19516 -6762 -27224 -34854 -26681 -4329 21918 37733 32732
783 32732 8264 -21713 -38076 -33195 -11923 14908 36614 39492 17850 -18055 -41241 -35045 -9599
796 -9599 13500 24675 28551 24467 4302 -26082 -44429 -31461 3466 32688 39620 24023 -662
809 -662 -22837 -33831 -28099 -7374 17321 33906 32341 13026 -14746 -34683 -34691 -15112 11890 31879
823 31879 35427 20235 -8359 -33539 -36545 -17100 9241 24710 27664 22293 7631 -17467 -39165
836 -39165 -35784 -4903 28668 39114 24663 1568 -17037 -28181 -28486 -13895 11034 31008 32903
849 32903 16088 -8496 -28828 -34315 -20889 5593 29231 35704 20714 -5135 -26745 -32061 -20725
862 -20725 230 19131 28822 25534 9158 -14666 -33313 -33147 -11280 18432 35293 30079 8460
875 8460 -14633 -28215 -27449 -13886 6889 24545 30565 20120 -1852 -24108 -34052 -23959 1419
888 1419 25416 33863 22817 613 -20737 -30358 -23964 -5000 16191 28366 25993 11035 -10480
901 -10480 -28467 -32163 -15318 11850 31438 30335 12676 -8851 -24457 -28419 -18148 2603 22419
914 22419 30098 20962 619 -19734 -30372 -25623 -4656 20001 32265 24492 3269 -16826 -26445
927 -26445 -23976 -10041 9738 26142 28423 14151 -8397 -25709 -29363 -16800 5186 25973 30716
940 30716 16860 -5182 -21837 -26349 -18883 -1874 16901 28285 23709 5205 -16134 -28064 -25308
953 -25308 -8461 13811 28828 26254 8222 -12891 -24733 -23535 -12467 5246 21932 28606 17680
966 17680 -4742 -23346 -27777 -16823 1435 19021 27300 20745 1529 -18805 -27235 -19920 -3814
979 -3814 13279 24448 23963 10179 -11185 -26825 -26242 -10038 10749 24475 24657 11937 -6840
992 -6840 -21875 -24942 -14794 2485 18788 26264 19171 436 -19222 -27304 -19702 -1428 16489
1005 16489 25010 20754 5755 -13240 -25117 -22528 -7391 11202 22519 22540 11566 -6057 -22084
1018 -22084 -26275 -14114 6495 22413 24761 13943 -3083 -17339 -23681 -17868 -1606 16386 25695
1031 25695 19506 2854 -15042 -24341 -20335 -5345 12158 23107 21508 8032 -9346 -21347 -22655
1044 -22655 -11884 6166 21566 24291 12803 -5532 -19741 -22956 -14631 1789 17676 23416 16424
1057 16424 -298 -15507 -22006 -17635 -4680 11329 23052 21627 6449 -12605 -23703 -20021 -6815
1070 -6815 9093 19982 21008 10782 -6070 -19368 -21566 -12074 3439 16936 22688 16149 -707
1083 -707 -17500 -23422 -15077 135 14008 20579 17233 4599 -11562 -22385 -19694 -5613 10221
1096 10221 19814 19257 8416 -6891 -19905 -22191 -10288 6664 18940 19664 10890 -1754 -14714
1109 -14714 -21215 -16261 -1077 15627 22964 15814 597 -13856 -20317 -16025 -4073 10801 19735
1122 19735 17835 6756 -8100 -18482 -19378 -10297 5695 18920 21323 11000 -5022 -17660 -19768
1135 -19768 -11736 2568 15621 19865 13385 108 -12432 -19043 -15661 -3648 11023 20701 18107
1148 18107 4753 -11335 -19499 -16818 -6218 7243 17659 18542 8510 -6236 -16555 -17528 -10812
1161 -10812 1792 14534 20659 14180 -1941 -16053 -19207 -11899 -165 11230 17803 15471 3838
1174 3838 -10644 -18994 -16384 -4651 8792 17714 17813 7328 -8172 -17551 -16776 -7252 4470 14347
1188 14347 17787 11886 -2578 -15838 -18582 -10578 1104 10927 17612 16086 2948 -14030 -21296
1201 -21296 -12924 1386 10174 12588 12434 8004 -4071 -17881 -20126 -7331 8854 16660 15051 7898
1215 7898 -2393 -14274 -19064 -11306 4094 15736 16028 9158 -161 -9517 -16003 -13749 -2720 10508
1229 10508 17303 14744 4794 -9260 -18365 -16246 -3542 9756 15091 11999 6024 -2356 -13107 -18467
1243 -18467 -10902 5163 16611 15476 6918 -1445 -9212 -15780 -15089 -2079 13659 18967 10692 -1502
1257 -1502 -9726 -12969 -12619 -6511 6413 16830 16231 5331 -7811 -15087 -14042 -5777 4901 12789
1271 12789 14450 8653 -1349 -11411 -16510 -11997 838 13850 17268 9652 -1834 -9188 -12983
1284 -12983 -12853 -4683 8879 17780 14049 959 -9285 -11713 -10330 -7237 1213 13438 18722 10012
1298 10012 -7372 -17135 -13837 -4810 3232 9287 13057 10689 820 -10986 -15992 -11082 -439 9150
1312 9150 13944 11612 3154 -7270 -14707 -13458 -4408 6962 14552 13718 4402 -6450 -12783 -11482
1326 -11482 -5571 1339 9207 14726 11586 -898 -13789 -16465 -7504 3632 9498 10744 9646 3815
1340 3815 -6792 -15175 -13587 -1900 9776 13655 9707 3583 -4014 -11410 -14029 -7516 5090 14337
1354 14337 13422 4872 -4306 -10362 -11353 -7910 163 8780 14048 10715 911 -10299 -15136 -10017 118
1369 118 9208 11850 8790 3158 -4507 -11654 -13355 -5741 6091 13890 11582 4129 -3649 -9869 -12360
1384 -12360 -8516 1757 12777 14441 6259 -3355 -9195 -10062 -8294 -2742 6504 13989 11844 1703
1398 1703 -9039 -13573 -9745 -2404 6118 11972 10855 4003 -5167 -10871 -10937 -5792 2648 10668 13234
1413 13234 7248 -2867 -10300 -12052 -7401 605 9091 12987 8983 -614 -8695 -10690 -7840 -2475
1427 -2475 4650 11193 12797 4674 -7138 -13101 -10527 -2684 5036 9536 10803 6236 -3276 -10772 -11305
1442 -11305 -5244 1890 7508 10700 9192 1144 -8978 -13644 -8426 937 7858 10364 8524 2277
1456 2277 -5674 -11183 -10041 -2834 4804 9458 10301 5972 -2760 -10929 -12013 -5197 4040 9658 9608 6156
1472 6156 -509 -8129 -11382 -7370 513 7765 10103 8166 2314 -5434 -11911 -10710 -1517 7550 10548
1487 10548 7672 3065 -2991 -8800 -11025 -5727 3658 10250 10279 4977 -1739 -8043 -11102 -7466 1220
1502 1220 9427 10851 5815 -705 -5853 -9092 -8914 -3151 5891 11497 9482 1997 -5570 -9888 -9563
1517 -9563 -3833 4515 10280 9424 3379 -3671 -7746 -9030 -6394 474 8121 10957 6946 -877 -7672
1532 -7672 -10593 -6957 -466 7249 10591 7478 860 -5677 -8530 -7754 -2924 3259 9329 9998 3954
1547 3954 -4076 -9714 -9696 -4680 2600 8334 9251 5429 -2059 -7531 -9081 -5733 9 5823 9481 7697
1563 7697 1225 -6305 -10007 -7903 -1166 5522 8748 7847 2782 -3596 -8955 -8964 -4226 2943 8406 8520
1579 8520 4463 -1540 -7140 -9472 -5831 1081 7376 8852 5606 -216 -5251 -7927 -7169 -2645 4745
1594 4745 9314 8478 2469 -4975 -9022 -7600 -2351 3931 7859 7701 3666 -2064 -6952 -8761 -5817
1609 -5817 1526 7766 9082 4987 -702 -6037 -8353 -6626 -1058 6224 9749 6876 235 -5692 -7243
1624 -7243 -6126 -3680 2569 8514 9187 3651 -4408 -8727 -7469 -3037 2016 6275 7781 5330 -794
1639 -794 -6675 -8830 -5572 -334 5994 8809 6366 -5 -5666 -7997 -6444 -1961 4117 7944 7383
1654 7383 2656 -3977 -7666 -6664 -2729 1660 6429 8381 5621 -1820 -8324 -8602 -3374 2359 5435
1669 5435 6457 5539 1349 -4720 -8704 -6791 -565 5246 7810 6229 1767 -3673 -7474 -7212 -2396
1684 -2396 3557 7267 6865 2993 -2276 -6105 -7536 -4597 1245 6441 7774 5248 -574 -5957 -8240
1699 -8240 -4995 525 4852 6252 5285 1878 -3196 -7163 -7568 -2540 4361 7894 6927 1969 -2775 -5773
1715 -5773 -6617 -4081 1625 6471 7062 3388 -1399 -5049 -6696 -5247 -487 5295 8074 5986 -56
1730 -56 -5652 -7303 -4799 -999 3641 5729 5825 2681 -2387 -6727 -7020 -3273 2785 6900 6949 3096 -2169
1747 -2169 -5978 -6766 -4149 874 5261 6680 4509 -133 -4455 -6564 -5565 -1411 4112 7619 6519
1762 6519 1021 -4528 -6771 -5520 -1781 2729 5517 5941 3368 -1410 -6000 -6991 -3704 1630 5798
1777 5798 6748 3917 -826 -5222 -6752 -4255 -248 4214 6122 5081 1156 -3701 -6476 -6193 -1947
1792 -1947 3203 6605 6432 1572 -3374 -6202 -5451 -1929 1884 4770 5588 3871 -430 -5036 -7058 -4256
1808 -4256 658 5015 6937 4169 53 -3979 -5995 -4330 -357 3487 5703 5007 2017 -1901 -5568
1823 -5568 -5970 -2987 2321 6177 5991 2580 -2230 -5260 -5378 -3288 774 4270 5699 4162 107 -4278
1839 -4278 -6152 -4583 -521 3832 6419 5006 975 -3787 -6305 -4764 -1512 2492 4812 4995 2651
1854 2651 -1515 -5322 -6023 -3081 1458 5091 5893 3647 -787 -4864 -5761 -3331 664 3626 4948 4427
1870 4427 1643 -2955 -6175 -5229 -801 3568 5348 5028 1989 -2070 -5409 -5264 -1947 2199 4573 4595
1886 4595 2529 -513 -3833 -6052 -4629 757 5051 5287 3499 -197 -3431 -5437 -4252 -907 3744
1901 3744 5236 3958 1391 -1683 -4884 -5879 -2776 2211 5813 5102 1674 -1834 -4006 -4509 -3007 889
1917 889 4068 5207 3594 -372 -3866 -4948 -4223 -351 3764 5709 4014 769 -2880 -4660 -4362 -1021
1933 -1021 3040 4863 4126 1497 -1259 -3762 -5155 -3923 1023 5367 5872 1911 -2107 -3896 -4076 -2879
1949 -2879 -456 3188 5645 3514 113 -3068 -4729 -4220 -1675 2326 5385 4964 1264 -2952 -4742
1964 -4742 -3935 -1929 1757 4526 4516 2207 -1304 -3155 -4227 -3937 -516 4076 6122 3379 -1326 -4305
1980 -4305 -3972 -2472 -1196 1658 4798 4852 1336 -3606 -5032 -3330 -1254 1062 3795 5230 2758 -1771
1996 -1771 -4771 -4359 -1819 888 3503 4289 2919 -223 -3345 -4643 -3507 -392 3204 5059 4173 120
2012 120 -3515 -4424 -2750 -646 1313 3452 4248 2492 -1970 -5035 -4192 -1401 1494 3450 3944 3457
2028 3457 -516 -4625 -4702 -1859 1247 2713 3262 2708 1132 -2347 -4525 -3984 -886 2549 4691 4044
2044 4044 1169 -2712 -4800 -3245 -524 1787 3083 3488 2655 -209 -4200 -5042 -2177 1519 2906 3438
2060 3438 2921 845 -2655 -5214 -3121 662 3685 3261 2172 861 -1141 -3789 -4523 -1516 2484 4673
2076 4673 3520 1177 -1182 -3427 -3769 -2209 1243 3442 3389 2160 -74 -2840 -4316 -3464 467 3573
2092 3573 3862 2256 392 -2083 -3746 -4056 -1136 2752 3646 2703 547 -844 -2703 -3949 -2972 1211
2108 1211 4450 4327 1392 -1955 -2888 -3180 -2299 -140 2817 4060 2630 35 -1927 -3446 -3415 -1182
2124 -1182 2358 4516 3309 508 -2166 -3489 -3164 -1787 1253 3684 3525 1190 -1530 -2711 -2757 -2190
2140 -2190 -225 3118 4467 2832 -813 -3133 -3241 -2075 -15 2122 3737 3371 100 -2283 -3444
2155 -3444 -2641 -1028 1227 3385 3689 1213 -1730 -3539 -2773 -1262 718 2764 3434 2302 -883 -3355
2171 -3355 -3598 -1683 110 2029 3363 2853 379 -2739 -4186 -2099 -109 1889 2815 2488 1329 -1330
2187 -1330 -3382 -3407 -1210 1473 2907 3189 1797 -715 -3201 -3622 -1335 838 2237 2978 2106 439
2203 439 -2213 -3678 -2797 7 2280 3028 2601 1219 -1415 -3264 -3148 -941 2146 3138 2582 1050 -378
2220 -378 -2511 -3568 -1881 1232 3154 3026 1255 -424 -1946 -3135 -2477 7 2273 3308 2084 -19
2236 -19 -1519 -3129 -2970 -943 1770 3431 2789 525 -1378 -2579 -2572 -1443 687 2779 3052 1144 -502
2253 -502 -2103 -2958 -2421 -49 2528 3686 2079 -470 -2253 -2824 -2053 -606 1690 3533 2638 262
2269 262 -1844 -2344 -2136 -1483 384 3006 3456 916 -1115 -2558 -2052 -1188 103 2008 3094 1904 -468
2286 -468 -2688 -2905 -1758 233 1767 2871 2927 507 -1917 -2674 -2481 -871 1184 2510 2675 1476 -1210
2303 -1210 -2950 -2527 -1045 374 2040 2581 1633 -602 -2446 -2687 -1620 485 1131 2545 2454 488 -1883
2320 -1883 -3170 -2119 17 1477 1964 2375 1158 -939 -2893 -2617 -340 1178 1795 2213 1766 -268
2336 -268 -2210 -3421 -1782 541 2057 2427 1437 71 -1784 -2811 -2014 -206 1581 2049 2245 646
2352 646 -1187 -2826 -2181 -539 1567 2238 2249 1279 -276 -2308 -3149 -1575 1175 2493 2065 836 123
2369 123 -1162 -2736 -2541 90 2541 2806 1701 -445 -1104 -1843 -1988 -1352 606 2378 2487 704 -1690
2386 -1690 -2358 -2335 -908 778 2190 2337 1068 -373 -2063 -2181 -1220 176 1648 2566 1395 -281 -1296
2403 -1296 -2237 -2125 -528 1637 2909 1918 344 -1419 -1949 -1854 -951 567 1860 2531 1429 -818 -2349
2420 -2349 -2337 -944 547 1680 2305 1399 -39 -1681 -2502 -1306 8 1574 1927 1650 214 -839 -2135
2437 -2135 -2351 -887 1012 2405 1947 714 -1007 -1612 -1945 -1128 112 1909 2490 1519 -416 -1845 -2014
2454 -2014 -1049 -64 1240 2063 2205 267 -1732 -2184 -1498 -343 913 1712 1598 804 -755 -1927 -2231
2471 -2231 -1274 1069 2244 1704 741 -555 -1285 -1695 -1684 -90 1713 2529 1794 -29 -1717 -2149 -1442 -219
2489 -219 1304 1982 1894 330 -1100 -1977 -1425 -488 713 1381 1645 1095 -222 -1906 -2263 -1222 417 1962
2507 1962 1970 1143 -430 -1081 -1478 -1344 -154 945 2053 1845 43 -1460 -2064 -1250 -265 509 1654 2032
2525 2032 999 -719 -2097 -1861 -298 547 736 1438 1338 548 -1781 -2170 -1432 712 1771 1686 866 103
2543 103 -844 -1511 -1717 -568 769 1829 1640 665 -782 -1541 -1706 -743 323 1650 1569 733 -486 -1676
2561 -1676 -1785 -807 242 1249 1843 1328 82 -1016 -1944 -1376 402 1445 1895 949 230 -714 -1202 -1755
2579 -1755 -1113 836 1885 1818 544 -695 -1586 -1555 -976 252 1650 2062 1032 -491 -1513 -1556 -926 -199
2597 -199 1103 1538 1353 734 -920 -1879 -1751 -366 1283 1615 1456 54 -661 -1037 -1599 -860 270 1587
2615 1587 1769 695 -480 -1418 -1404 -1057 -248 1153 2023 1212 -71 -1379 -1768 -981 -227 685 1361 1640
2633 1640 256 -856 -1470 -1679 -561 472 1591 1874 352 -692 -1311 -1303 -697 140 1196 1535 893 -394
2651 -394 -1562 -1633 -914 -52 955 1433 1519 282 -1151 -1355 -1248 -384 640 1175 873 723 -530 -1605
2669 -1605 -1439 -762 53 871 1631 584 -223 -1411 -1294 -943 -78 1102 1350 1208 125 -1186 -1532 -1075
2687 -1075 -524 586 1430 1327 476 -684 -1279 -1265 -622 494 1110 1198 994 -32 -1165 -1692 -778 435
2705 435 1316 1398 646 -19 -1026 -1280 -956 -31 729 1437 1035 161 -763 -1339 -1345 -424 433 1045 1218 397 -616
2726 -616 -1231 -1175 -507 104 1386 1424 735 -50 -888 -1678 -1311 185 993 1337 763 174 -741 -1304 -1164 -354
2746 -354 755 1187 1016 235 -344 -1112 -1244 -889 368 1536 1338 655 -449 -836 -1158 -490 51 721 1229
2765 1229 1356 110 -713 -1418 -1032 49 741 1074 972 488 -653 -1100 -1107 -376 325 1210 983 612 -77
2784 -77 -1083 -1164 -705 12 902 1403 813 27 -1061 -1116 -558 -87 486 1219 900 307 -482 -1436 -907 -270
2804 -270 372 863 853 566 -193 -805 -1307 -865 589 1082 902 546 -399 -824 -1384 -1089 27 668 1218 864
2824 864 172 -425 -806 -886 -446 212 1270 1201 542 -543 -1211 -1095 -536 115 745 654 639 -408 -617 -1173
2844 -1173 -705 -129 996 1075 707 119 -456 -949 -866 -195 626 1370 1129 165 -418 -776 -800 -729 408 724
2864 724 802 928 -241 -860 -1232 -310 346 747 938 516 133 -467 -1027 -1127 -289 808 1184 730 -240 -413
2884 -413 -723 -994 -526 408 1126 1171 65 -508 -847 -819 -302 8 547 1321 587 -194 -945 -1250 -475 66
2904 66 577 939 740 11 -239 -706 -926 -92 542 1053 1057 -2 -595 -302 -704 -387 -72 893 1353 292
2924 292 -654 -937 -500 -323 -76 277 945 1133 145 -622 -1117 -816 63 482 930 589 282 -554 -747 -785
2944 -785 -464 230 1072 970 513 -425 -656 -838 -198 73 662 920 810 -377 -991 -939 -575 140 361 753
2964 753 1081 404 -675 -1134 -840 489 511 489 747 730 -131 -833 -1219 -177 351 793 735 333 -368 -643
2984 -643 -899 -736 287 329 884 540 277 -495 -925 -527 -183 883 693 484 321 -489 -1317 -975 -18 495
3004 495 568 474 285 -71 -698 -961 -835 37 840 659 385 207 -529 -641 -758 5 706 564 442 -166 -334
3025 -334 -450 -820 -254 355 854 713 181 -594 -503 -689 -617 222 932 731 249 -114 -407 -599 -957 -2 652
3046 652 848 583 64 -327 -558 -432 -534 367 985 664 126 -535 -384 -937 -589 179 764 1024 460 -129
3066 -129 -572 -512 -464 19 525 942 593 41 -429 -250 -353 -240 86 792 864 -47 -643 -640 -229 -90 366 541
3088 541 766 498 -244 -751 -583 -510 -83 642 579 593 73 -883 -884 -184 5 451 754 945 363 -528 -664 -829
3110 -829 -160 338 425 754 215 -413 -732 -623 -99 425 569 481 541 -192 -284 -582 -543 97 336 617 562 91
3132 91 -12 -597 -489 -117 636 649 518 306 -143 -553 -674 -344 347 516 619 141 210 -399 -879 -548 337
3153 337 422 365 518 27 -366 -936 -425 18 498 628 111 13 -191 -349 -618 -277 344 897 557 -32 -91
3174 -91 -430 -423 -509 320 574 646 367 -104 -528 -700 -563 105 431 252 362 88 -460 -367 -782 -327 268 839
3196 839 516 140 -320 -403 -544 -513 182 720 956 234 -314 -358 -180 -279 125 28 509 668 237 -709 -356 -239
3218 -239 -188 101 657 512 449 -297 -516 -550 -150 482 605 451 265 -140 -691 -505 -701 337 467 395 617
3239 617 -164 -449 -313 -551 -162 81 637 712 261 -300 -639 -383 375 245 338 755 148 130 -235 -435 -233
3260 -233 264 802 555 451 -12 -313 -484 -314 77 713 316 166 -147 -297 -325 -285 -122 91 495 959 37
3281 37 -270 -413 -296 -22 153 302 459 328 -323 -292 -461 -451 -162 152 616 259 -359 -275 -526 -122 -244
3302 -244 362 795 292 139 -96 -106 -271 -247 -107 86 473 184 -472 -332 -431 -129 -144 316 421 372 361 -578
3324 -578 -341 -557 256 524 345 574 -179 -339 -515 -739 -40 450 401 386 274 -118 -316 -632 -33 63 311
3345 311 164 -100 122 -252 -451 -656 125 -23 442 163 59 -70 -707 -663 -168 0 481 503 2 -230 -379
3366 -379 -280 -146 513 470 399 -66 -301 -236 -615 115 -88 455 427 173 -85 -469 -564 -582 262 15 387 510
3388 510 -55 -146 -729 -804 -334 466 170 436 136 -355 -195 -378 -44 1 577 246 181 94 -74 -448 -178 72
3410 72 183 719 595 197 -445 -273 -374 -219 273 538 -128 126 -334 -273 -238 -6 152 367 306 303 -217 -354
3432 -354 -407 -209 133 195 292 346 118 -381 -523 -324 22 132 746 276 170 -71 -520 -337 -195 239 531
3453 531 295 168 46 -444 -240 -421 259 349 747 266 -12 -194 -555 -368 -31 128 278 257 32 -367 -143
3474 -143 -59 -381 119 401 205 -36 -492 -504 -363 -167 -48 367 311 3 41 -97 -158 -136 -95 102 267 78
3496 78 -54 -200 -688 -373 106 -111 357 346 169 -384 -296 -145 -6 94 398 290 460 -299 -268 -64 -211
3517 -211 101 -104 225 390 126 -290 -270 -168 -148 284 124 277 339 -57 -226 -126 75 15 225 390 297 -334
3539 -334 -354 -179 -278 4 -12 253 227 -62 21 -304 -297 18 56 230 323 124 -137 -338 -195 -108 -9 188 100 -164
3563 -164 -321 -179 -571 147 51 348 -90 369 -9 -36 -533 -59 91 318 483 126 205 -230 -225 -191 53 65
3585 65 336 280 -227 -185 -367 -321 -348 206 378 177 78 -120 -421 -468 17 370 289 473 63 -124 -197 -347 -24
3608 -24 226 236 158 189 -319 -399 -286 -263 -191 196 457 295 4 26 -87 -46 59 35 154 272 117 29 -220 -292
3632 -292 -485 116 326 9 133 -38 142 -367 -278 -135 -77 444 407 -310 2 -311 -194 58 153 261 231 150
3654 150 38 -83 -427 -362 -319 314 488 142 -39 -235 -329 -12 -126 142 -20 96 288 -78 -87 -425 -87 73
3676 73 236 204 299 -261 -105 -103 -106 296 172 141 98 -195 -420 -145 -121 36 41 509 498 17 -151 -417 -204 18
3700 18 227 103 375 -105 8 -255 -384 -240 117 65 424 -35 -52 -56 -334 -189 -16 204 259 19 -53 -264
3722 -264 -504 -317 131 -7 225 70 25 -315 -54 -103 -20 2 42 506 176 -102 -133 -306 -185 -125 427 141
3744 141 408 50 -2 -237 -61 84 165 -171 171 -237 -274 -189 -299 -314 142 365 -132 69 -34 -110 -100 243
3766 243 11 251 175 575 58 -286 -155 69 -71 239 393 -9 -292 -189 -363 -79 92 -37 159 378
3786 378 -132 78 -82 -92 -81 122 52 216 253 -57 -162 -205 -34 341 367 137 150 116 -412 -107 -91 -136 359
3809 359 227 356 -212 52 252 -249 -134 161 157 357 23 -5 -162 -61 -323 18 -25 48 57 132 199 -361 19
3832 19 -225 8 181 22 298 -92 43 -63 -147 -79 172 19 237 -66 111 -198 -107 221 309 311 -162 -103 -471
3855 -471 -234 -289 57 -166 -65 -131 94 -17 -113 -113 149 169 -28 216 -12 -204 -255 -155 -150 73 -86 390 7
3878 7 -172 -398 -282 -137 20 -56 174 148 137 -161 -288 -247 148 94 445 -66 382 -57 -283 -125 -10 322
3900 322 -91 29 -73 -169 -21 -102 -313 -7 188 -4 214 253 -138 -323 218 80 200 101 -157 -135 -90 -352
3922 -352 -325 -20 228 -65 -53 213 -87 -109 -189 175 -72 250 -63 149 9 -240 -148 83 -184 251 404 -110
3944 -110 93 -126 -139 -71 36 210 311 86 253 -164 -29 64 -242 148 244 236 -44 -421 -104 -136 -120 42 -30
3967 -30 -29 255 -13 173 -130 -55 -110 73 329 60 82 -64 168 -22 -233 156 98 -204 -95 -1 -260 64 -339
3990 -339 -129 1 136 133 456 -513 -197 131 103 289 103 158 -80 -24 -195 59 -34 251 163 122 120 -95 -309
4013 -309 161 85 372 95 -61 142 -80 -295 -162 -129 -181 186 542 121 94 -234 165 74 -182 127 241 166
4035 166 -96 -19 -72 -186 -111 263 159 194 32 -78 -59 -178 -100 32 108 33 215 -137 -173 345 -13 -65 95
4058 95 125 145 -331 104 -8 -6 -8 168 261 214 -306 -304 40 -86 -24 107 171 97 -83 -236 52 -146 -190 -64 -148
4083 -148 -71 129 44 -28 -274 -279 276 103 -132 63 151 -145 -316 202 176 4 0 78 -243 -114 -166 -162 -148 152 283
4108 283 -87 72 -198 96 -80 -153 -97 317 98 65 -1 33 -59 90 83 287 63 76 2 -164 -114 -199 -127 230
4132 230 399 277 -44 -133 -161 65 -99 18 204 241 416 -185 -246 -196 -76 272 298 375 114 -123 -274 131
4154 131 -72 -225 -50 42 186 219 -36 -68 -447 262 223 124 188 264 -153 9 68 -48 -171 519 343 166 -41
4177 -41 -132 -119 -185 -188 -84 136 113 79 194 -322 -146 -56 -126 58 -146 -38 -176 -341 -311 -144 100 129 -13 154
4201 154 -189 -479 -160 -223 -269 349 81 169 241 -7 -107 83 183 -103 -9 -71 232 -335 -160 -138 -72 -175 495
4224 495 230 -298 -228 -273 -216 -236 -20 106 83 -28 -115 -115 -271 -139 -215 -115 252 232 184 -58 -304 -73 -105 -94
4248 -94 85 81 -185 220 -84 -211 320 119 177 -110 113 -48 -242 -180 -78 -141 -227 55 152 218 -74 -326 -75
4271 -75 59 188 32 120 148 -121 -134 -221 -202 -214 -43 170 74 -46 124 -184 136 91 124 23 166 -187 304
4294 304 -153 -151 -71 69 95 -165 316 10 191 299 229 154 237 107 -61 156 71 -108 -247 -48 65 -186 370
4317 370 -122 -225 115 -464 114 52 128 206 39 -163 52 -31 -69 -227 45 28 24 -108 -370 100 -167 -264 -31
4340 -31 142 122 -145 -127 -26 -74 41 -114 99 217 106 -22 163 15 271 72 199 33 -36 -172 -223 99
4362 99 137 27 176 -5 74 -74 -100 -88 286 105 207 255 120 72 54 115 77 -30 215 -130 0 -64 75 157
4386 157 140 249 528 253 205 93 -98 134 -272 57 -162 112 -32 175 -161 116 16 52 -302 -54 -43
4407 -43 275 -33 -32 -106 -5 -26 178 178 116 111 -68 166 17 97 -26 26 -25 6 -180 -264 74 -187 10 122 99
4432 99 215 128 -11 -134 -175 -195 168 291 321 40 -78 -352 -23 321 125 -86 -49 3 -271 -179 -244 126 173
4455 173 -13 201 -68 -96 -39 -353 143 195 -43 -1 330 -102 -91 -145 3 56 136 117 128 35 -83 33 -73 101
4479 101 -289 121 -91 235 84 222 104 -70 -12 228 -88 26 -22 -48 48 -152 13 -128 4 -110 256
4500 256 -99 -19 15 -16 -11 -86 210 101 -55 -76 -221 -136 -268 158 -298 112 121 94 -33 96 81 122 -49 -18 -178
4525 -178 -162 3 -155 -117 -96 -217 248 143 -103 -114 46 49 54 69 219 72 47 -173 -158 -5 -136 -81 68 162
4549 162 135 20 -224 -67 -1 62 -250 -217 -32 -12 -220 -80 -162 -116 280 120 33 -9 -21 -5 -103 -58 4 174 -171
4574 -171 12 76 -176 -99 -54 -321 -112 -166 3 3 8 109 -41 35 317 -196 11 -115 54 -71 278 127 -141
4597 -141 174 -280 274 -174 129 18 -106 31 182 158 -129 82 14 193 57 249 -32 -94 -171 -167 -115 -141 -70
4620 -70 63 -263 -15 323 33 68 40 -40 155 123 25 -136 59 99 -132 -37 -32 -319 159 258 -113 -284 -124 -112
4644 -112 -97 119 184 266 -15 48 -155 -579 87 249 -178 -308 171 -95 -240 -143 19 -160 -109 -119 -160 -291 79
4667 79 5 -255 -79 -54 -285 -56 -120 -90 -304 141 -197 159 246 202 -81 -246 -224 -70 -241 -138 158 88 -21
4690 -21 50 167 -110 -5 101 91 -164 -50 208 -248 56 28 29 84 -54 25 92 60 298 263 52 -120 7 1
4714 1 -36 305 -354 103 198 -9 167 0 141 -72 -26 -8 -203 -164 -163 -47 -70 63 -144 -81 117 220 -125 135
4738 135 58 115 29 39 421 216 131 61 158 -120 -202 -89 18 -3 -71 91 -59 -187 -34 -199 35 -145 39
4761 39 178 -115 184 -202 149 -42 -221 -190 -176 65 51 -202 -141 -200 228 -47 240 43 -42 49 65 -291 -217
4784 -217 180 253 -46 -188 -127 -120 146 -234 -37 -161 197 104 228 51 141 -177 -20 76 -236 30 46 256 -94
4807 -94 64 -45 28 -24 89 91 -323 -13 266 21 87 -51 -100 178 52 -76 -42 -46 -9 -168 188 182 40 -103
4831 -103 57 -25 172 90 -259 -157 -46 -17 -77 161 -128 312 204 -234 130 20 92 -88 5 -237 21 18 -156
4854 -156 55 109 76 -348 100 -20 164 -94 298 -269 -380 -288 -77 -119 -144 -147 -116 -15 85 -258 -66 -219 -12
4877 -12 60 -86 80 134 88 -177 -155 -94 -50 156 -154 -103 -220 -128 -78 -107 177 90 -74 52 -38 36 -18 -184 187
4902 187 75 159 73 -116 344 -113 -21 122 -47 50 -218 -138 80 77 6 -74 267 220 19 1 110 314 -82 91
4926 91 29 -88 66 -134 -65 -10 -212 -6 37 -151 -80 229 156 -74 -150 -9 60 -198 -69 80 -24 -167 51
4949 51 52 -34 31 190 139 182 121 22 -21 158 -232 -227 -19 -64 124 -19 78 -10 -308 100 -319 -173 -128 -57 91 19
4975 19 -54 -104 -193 121 -26 90 -41 -245 206 -106 396 5 260 -113 43 58 35 -23 -78 -94 -44 197 37
4998 37 -38 -178 242 6 -319 81 -86 180 228 -20 -53 15 128 -91 52 -59 180 316 -304 133 38 176
5020 176 378 88 -21 -92 -97 -89 117 387 -31 172 -145 -76 -260 278 96 -96 -115 -112 187 -75 137 22 99
5043 99 26 -101 15 29 205 103 -180 -266 -62 129 -263 -145 118 -79 -110 -229 52 -38 -141 121 172 -220
5065 -220 13 -202 19 81 -235 78 89 -223 -84 81 -278 -16 22 123 -66 24 85 -144 -45 0 -160 -368
5087 -368 -104 197 7 -226 198 21 169 -106 -312 159 -237 -10 -361 16 355 98 104 -82 -31 43 206
5108 206 -266 86 81 49 151 -69 120 146 -43 42 142 89 113 182 -89 100 146 65 -132 277 -67 -54 -50 126
5132 126 -10 -73 -101 297 78 -177 -215 -45 71 -155 -195 -55 -351 -155 -64 -61 101 195 123 45 38 -81 83 -228
5156 -228 -204 79 231 -258 -153 111 193 -147 -50 51 106 -149 -249 -72 -263 -271 157 -124 -75 -32 121 -133 220
5179 220 -97 -3 -36 185 -92 6 -40 139 115 131 -157 -104 97 65 161 -284 -25 -155 -76 -134 -76 204 -53 -317
5203 -317 -159 -73 191 -361 -141 -97 -119 188 61 32 222 187 33 274 -135 -48 -155 -161 -237 231 -25 -231 28
5226 28 189 225 -99 -353 191 90 120 163 -125 -100 -95 286 91 -203 -281 -138 -120 -89 99 386 311 122 -141 157
5250 157 83 28 60 -115 69 -133 -107 471 99 -29 -221 -218 -49 34 59 317 125 -414 -194 -159 -64 -56 315 57
5274 57 -48 124 -26 -224 119 144 310 275 -385 -241 368 61 93 141 15 -462 207 -285 29 110 59 216
5296 216 1 -95 334 235 19 59 -56 -104 -177 -22 -136 -283 -142 38 130 136 -24 -344 123 133 -38 -144 220
5319 220 22 125 -57 56 278 -235 242 203 308 -394 -135 110 134 -62 26 113 -137 -80 -162 -5 -50 184
5341 184 322 15 218 -98 167 -230 -136 -191 -114 273 254 -34 -224 -196 -271 243 85 -139 -214 -138 -11 42 29
5364 29 -394 -19 46 -123 -315 -133 175 3 -177 157 241 29 240 64 -113 -261 -14 138 93 6 104 82
5386 82 129 -95 266 82 273 -272 -78 -167 -134 147 45 -49 444 126 -91 -35 -143 20 33 151 175 -95 182
5409 182 -64 246 -20 -200 -22 -165 193 108 4 278 -71 69 -24 102 147 -150 -87 379 260 -190 -142 -227
5431 -227 -93 -143 -38 -55 -91 -302 -197 -393 -105 39 -52 -55 39 -61 -35 22 26 278 294 -75 -64 147 -34 49 -359
5456 -359 206 -24 -150 175 160 97 -103 188 166 -214 -107 -74 -17 -4 80 53 -22 -38 -68 -202 86 8 -2 -276
5480 -276 -99 114 264 53 170 161 -182 -140 -138 -103 18 60 313 96 -260 -235 173 198 -15 -53 42 99 -70 -309
5504 -309 -146 216 -48 289 -7 46 -15 146 -51 -161 -84 177 -224 -23 -108 -251 257 -78 14 -51 -82 -179 -134
5527 -134 77 113 0 -237 -183 -138 -225 263 -28 8 154 122 21 -118 19 -146 -93 417 -52 68 -293 39
5549 39 67 -56 -63 83 -26 114 -358 156 398 -150 348 7 8 211 38 -222 84 -55 268 -312 -13 51
5571 51 -43 -55 -39 -188 102 -98 27 -43 172 -223 208 -16 244 189 72 148 -71 304 211 168 205 -25 -105 154
5595 154 -44 -138 -54 39 178 92 223 -150 -143 -30 -124 150 -93 -274 -91 -16 151 -200 145 -101 -106 107 104 379
5619 379 -128 -32 -72 -43 -156 -88 56 -52 -338 -10 -20 -63 -48 267 -213 -211 125 -169 118 186 -18 71 -233 -14
5643 -14 112 -245 248 -220 -100 153 132 -62 -51 -423 -131 76 17 191 48 -17 -130 -46 -65 41 -131 105
5665 105 107 -59 -78 475 152 -142 61 -33 267 311 99 -461 126 -113 204 -61 -92 100 -155 -20 204 -180
5687 -180 -151 -17 -100 157 -242 118 278 217 -18 221 -50 238 -279 237 153 525 57 111 -42 -377 -193 -71
5709 -71 -92 -35 -31 -27 33 90 -14 31 158 -126 -112 132 79 -140 217 -254 -254 -92 406 -181 15 -166 199 -94 -208
5734 -208 -17 -27 -102 118 128 -224 50 -300 -194 -131 95 108 129 213 151 -63 -90 -196 56 174 6 11 352 -80
5758 -80 -8 349 -11 -100 70 -280 -106 -114 -82 215 212 -336 93 -75 -158 -122 -84 -22 -56 49 -60 -28 125 -66 247
5783 247 127 -162 -79 184 61 -88 -82 93 90 28 14 -193 -51 -28 56 185 -88 -148 -74 -60 -83 -148 169 129 -106
5808 -106 -40 22 40 -209 301 80 270 111 -154 146 -117 155 -83 257 -47 -80 -40 132 113 -212 -68 -341
5830 -341 -71 -103 -133 277 312 -91 -289 -81 63 -217 175 -13 -202 134 89 -59 -117 -271 -80 119 -49 -179
5852 -179 -242 21 68 -260 118 -95 58 -22 -74 10 -4 157 138 31 -51 -238 -80 -117 -342 -153 104 113 -106 -112
5876 -112 -121 162 -57 95 -192 252 115 -89 -116 -127 161 186 106 182 -23 317 319 -145 -50 37 202 190 -22 -34
5900 -34 254 -114 11 -158 -392 -268 -132 -34 -85 8 135 123 93 -56 508 -36 74 140 94 72 135 336 -81
5923 -81 -80 -85 293 65 40 -385 -21 -154 136 -77 -119 43 118 40 -141 -41 123 68 117 -100 192 244 -178 -209
5947 -209 -147 -232 -61 -45 63 -191 -136 52 11 -121 81 17 40 -146 13 43 -140 115 199 -167 132 -118 -94
5970 -94 132 -247 116 21 78 210 -131 107 33 143 68 182 152 364 -156 -21 -73 -84 12 -20 180 -167 55
5993 55 96 -51 -42 319 149 -273 -230 112 -119 160 46 63 385 -97 -149 -137 -247 259 96 234 -294 -8 -216
6016 -216 278 19 -280 42 152 84 190 -153 -217 436 -64 66 108 -291 12 -546 -335 8 -282 -143 -174
6037 -174 -148 -29 -168 -35 -83 -185 -100 -35 -105 -199 309 17 120 -72 97 -38 13 147 -267 27 -149 -145 27
6060 27 -111 142 144 100 17 -73 12 -159 -57 8 177 -61 -302 -174 -114 -126 51 -325 474 156 -97 186 147 -172
6084 -172 -33 23 76 263 -151 -119 -355 -79 143 -262 106 96 220 145 144 251 -125 -127 1 158 -47 -117 166
6107 166 -66 133 217 151 170 231 68 106 -121 -41 63 -244 -258 226 314 14 -94 -160 -87 16 195 146 -66 -113
6131 -113 221 114 -236 116 -63 139 -56 -148 -164 247 53 -4 -264 133 59 -152 -58 -31 -17 -33 -249 -66 96
6154 96 21 -26 22 120 -164 -49 -77 79 16 -3 19 -50 228 119 -111 0 294 -144 -178 213 267 145 -207 73
6178 73 -297 -269 80 237 32 299 -32 144 -11 -96 99 -23 -315 108 -366 14 277 137 207 -234 58
6199 58 -109 -27 67 72 -157 144 56 -276 168 258 27 -40 73 33 -184 67 -45 -119 162 -15 -146 112 -85
6222 -85 123 218 -102 22 75 140 64 139 -47 279 -96 28 -92 232 142 39 -18 69 39 71 -87 -169 -125 -294
6246 -294 -9 -87 83 -285 134 9 249 14 -15 159 -150 334 -155 159 -12 307 -19 17 -343 15 171
6267 171 11 -117 305 -111 81 -95 7 177 -57 -50 47 -113 147 60 216 -58 1 -108 -119 -180 154 -40
6289 -40 79 113 39 13 -15 64 53 201 -42 -129 -48 13 -134 -247 73 238 83 127 -162 -255 -199 -171 52 286 102
6314 102 5 215 133 17 270 62 -139 -15 277 -429 -138 50 -82 -165 20 -326 -117 -151 19 116 215 -241
6336 -241 -310 -183 30 129 18 -267 21 -213 31 76 -175 50 142 93 182 -146 220 -105 -240 115 23 8 -327
6359 -327 226 -192 -219 93 -98 7 71 -81 -45 78 -133 -369 -72 288 -130 -154 -143 -59 51 304 -136 19
6381 19 185 -5 -49 40 -62 -115 31 223 75 8 -10 -124 107 -57 22 109 -172 -163 -134 -66 -348 -54 74 98
6405 98 -63 -61 242 28 -19 -89 56 -55 120 -35 208 -198 107 -14 199 -107 156 -55 -364 115 243 -39
6427 -39 331 -9 -25 -159 218 368 180 100 -10 160 -34 -53 -5 -132 110 -164 210 167 -301 263 -95 -146
6449 -146 -171 27 -92 -289 135 -242 -86 97 185 -16 -63 183 223 82 -163 94 -201 146 312 11 -225
6470 -225 151 21 116 264 -125 16 -79 296 -323 121 -138 117 -147 -51 110 -236 260 -155 161 254 -255
6491 -255 -7 82 266 13 234 67 -90 9 -14 48 120 -165 -120 31 184 -61 -11 -82 -32 -143 -267 -58 -124
6514 -124 -329 -203 -231 143 -184 -141 -32 -339 68 -13 -281 -39 143 -90 113 -2 -74 61 102 52 162 20
6536 20 -126 -111 -5 218 -207 -47 -58 -31 -20 -98 113 -49 -251 -169 100 78 -52 -124 57 310 350 -11 72 241
6560 241 -142 -340 -64 -74 209 160 15 -247 -218 -96 -11 189 93 -198 0 160 -88 99 102 -62 -146 332 112
6583 112 -397 144 323 58 -67 -69 168 4 71 -11 -33 -3 185 -17 -123 354 -209 20 -226 -98 315 239
6605 239 144 -36 -2 -183 32 13 -157 352 -187 -239 127 -248 106 -159 -158 -97 31 85 -82 177 44 34 394
6628 394 -25 -61 -21 56 -216 -120 119 -56 -193 115 -254 -294 -67 215 87 -232 18 229 235 -183 -94 68 23
6651 23 161 134 145 131 -232 -45 -107 45 -188 33 -128 -258 115 -9 -254 -112 -11 -7 232 -31 -44 -84 -256
6674 -256 6 -288 -118 117 232 -46 -491 217 -205 3 -208 41 134 -44 8 136 -162 34 -308 170 -57
6695 -57 119 -82 -141 65 -4 -304 35 -125 -56 -93 -411 201 2 1 202 -394 72 -46 -43 -280 -160 29 41
6718 41 114 17 60 -135 78 -138 -162 225 -206 297 54 -134 94 -255 -29 -20 210 42 -31 -197 -1 95 -282
6741 -282 7 32 155 -429 49 352 87 -108 -4 -8 -6 90 114 -165 -187 89 125 -65 -85 135 -33 59 214 -263
6765 -263 83 -161 -121 132 49 159 -237 -205 145 -245 51 370 -96 24 60 -344 15 91 -62 -106 -65 -4 97
6788 97 -308 -129 107 8 -257 7 47 -196 -221 -124 -175 93 -297 161 285 -250 186 -100 -257 -8 -50 -306
6810 -306 107 -106 205 -302 1 -180 163 -68 -4 25 -151 -1 -43 -131 -39 69 -186 -47 -161 -47 173 110
6832 110 -200 -87 -17 -162 -35 -127 -155 2 -150 -37 14 -199 -163 -49 48 -236 -256 -20 283 28 12 150 165
6855 165 31 -124 75 -244 -47 17 18 -163 96 265 -123 213 51 73 20 -99 286 73 -44 62 -20 -192
6877 -192 149 -256 -105 1 29 73 -166 -5 -294 196 -277 71 -9 183 43 -279 -257 33 -163 5 -86 -174
6899 -174 173 79 -197 92 181 110 11 81 165 81 -36 -120 115 -50 55 25 31 15 186 -105 -88 -87 133 -203 -204 -60
6925 -60 -208 29 185 270 10 25 139 -61 87 -30 263 41 74 -305 242 179 -119 21 -172 207 -247 209
6947 209 -145 51 -47 -254 -37 -77 101 -370 -16 147 -118 -109 77 190 0 72 72 7 110 152 -90 266 371
6970 371 -60 -99 80 -223 164 -275 65 -51 42 18 104 -299 -159 -109 -192 197 113 0 99 97 229 172 -313 73
6994 73 -81 263 37 -95 -191 55 42 -11 -231 -23 140 159 -224 277 -305 116 182 48 -122 -100 19 -143
7016 -143 -210 79 141 -212 -138 295 78 99 207 111 311 6 -115 -131 203 3 205 -6 -183 27 -92 23
7038 23 -70 241 -187 -172 -67 -155 104 79 190 122 -162 -377 35 203 -1 51 -21 4 108 175 -20 -118 11 -83
7062 -83 235 162 35 107 113 -20 -169 -46 -206 -405 92 103 188 -71 -188 150 -97 -133 -86 40 -310 51 -55
7085 -55 227 -7 -7 90 112 376 -228 -26 31 -85 -15 -19 -52 -41 -15 -206 43 139 28 86 -21 -107 46 22 224
7110 224 -38 62 97 -78 -169 189 233 -79 -224 -19 131 318 13 134 47 -125 -198 51 136 167 203 -141 53
7133 53 -120 -38 -154 161 -145 143 111 171 116 -206 253 -14 -135 294 88 95 22 6 149 8 -125 -14 170
7156 170 -108 86 109 209 -79 60 145 187 -215 37 -446 -309 88 -85 9 231 -225 61 -44 -103 -445 -153
7178 -153 40 -156 -2 113 246 -85 -192 -125 13 120 -170 -200 21 149 160 -355 -342 182 -21 -287 -296 -193
7200 -193 -212 141 84 -84 1 -66 92 126 -84 -65 183 6 37 -154 -464 -35 383 -95 -273 345 386 119 -194
7223 -194 150 -13 80 154 30 -136 41 -18 -57 -160 324 21 1 63 -177 -157 -78 64 -88 83 -27 108 -194
7246 -194 59 -21 -229 -128 61 -240 0 -351 91 13 -203 -12 -89 0 -128 -129 96 164 -49 89 -153 7
7268 7 101 -183 19 -92 40 202 -189 -177 427 85 -114 230 255 26 -101 93 148 41 13 -68 1 -86 95
7291 95 -191 -145 120 76 -244 19 78 120 -45 10 224 -177 89 428 -77 147 -52 -228 209 -42 83 -102
7313 -102 -79 95 59 29 -38 -95 312 -396 43 36 163 -64 -423 9 -188 193 349 -238 -290 322 376 -72 15
7336 15 286 -3 -122 27 -147 93 -120 55 69 176 -24 -33 146 -89 -165 -34 54 -288 13 178 159 -112
7358 -112 31 310 22 -350 -86 -175 67 -228 -135 -8 320 226 245 2 5 -9 -161 -85 314 -19 99 49 -219
7381 -219 304 -238 -154 -18 88 -148 -193 73 0 -50 136 -128 -67 83 127 -81 399 -30 -34 208 6 -96 339
7404 339 -37 148 219 177 -108 71 125 -147 8 126 -8 388 17 -142 -324 -158 73 21 249 -148 217
7425 217 3 -2 -46 141 54 -152 -179 59 369 -105 -340 -178 259 -47 -159 130 123 -219 -42 45 -150 139 -188
7448 -188 -130 124 -57 -159 -151 -10 -161 -129 126 87 -72 45 169 31 -113 82 -85 -113 50 35 -125 164
7470 164 -67 -114 190 -122 -172 184 -225 -115 -24 -80 -68 -35 129 67 350 -71 109 -109 -280 -49 253 4
7492 4 4 89 -162 37 59 55 45 -235 -245 -34 -175 216 -7 -78 112 56 40 70 179 -292 -207 145 -44 -165 -20
7517 -20 325 -72 -81 -64 334 -121 -87 -137 284 117 -95 -20 0 -56 145 -97 -3 -78 -447 -96 164 -120 -21 -189
7541 -189 131 0 109 -80 159 66 -84 154 -38 54 -210 -45 15 114 242 207 -34 68 -222 -46 156 -163
7563 -163 126 39 13 -49 169 85 -52 179 172 84 124 -33 197 -272 -119 -72 -197 -3 -194 -88 -204 145 269
7586 269 -146 -73 16 166 140 -118 58 212 98 -99 81 11 265 -225 110 6 -21 54 236 135 201 43
7608 43 6 -29 86 -77 25 -10 132 -125 159 -426 -156 -17 -168 195 135 300 129 91 -101 50 24 69 -98
7631 -98 -139 449 -83 8 -168 113 87 54 79 -6 -87 46 70 139 -153 187 60 -65 -16 67 -255 -247 -66 11 -53
7656 -53 -109 25 -45 -119 -123 128 -128 -114 -150 -139 229 -98 -59 -20 -223 -120 -224 -287 231 -108 29 -252 306 -181
7680 -181 96 -82 -30 -83 -96 -61 28 238 -246 -96 -219 -66 78 -41 -266 9 -116 40 -116 -54 -138 30
7702 30 88 -35 -5 -64 393 -163 34 -157 259 -9 -63 65 -22 -140 -296 178 -62 181 -126 -197 -44 -15 264
7725 264 147 69 119 -91 295 -372 -96 177 29 117 199 209 20 -44 -53 104 -128 177 209 95 330 -157 -31
7748 -31 -189 -52 -6 -141 18 -378 -91 -64 -256 -113 201 -222 -24 -204 39 225 1 124 -182 27 -13
7769 -13 69 357 -104 267 -234 -159 -182 -45 72 -62 -126 -44 182 21 148 138 216 -289 -43 -34 -17 116 -54 -85
7793 -85 -218 293 77 -22 320 159 -177 -128 236 -14 -91 200 66 331 -74 -2 293 34 -392 95 -76 67
7815 67 -148 -101 -191 -6 -22 -53 -57 -361 -145 -212 169 -89 -45 -101 -134 33 -64 231 114 -194 34 -81 201 -7
7839 -7 17 -36 173 -68 -121 -135 40 102 -207 33 218 147 -320 -41 70 54 -201 8 164 80 94 469 -118 279
7863 279 -161 19 29 100 -12 20 318 -270 -164 -137 81 -58 -14 -225 -50 -297 -44 69 223 -184 98 -153
7885 -153 -244 98 -27 211 -151 38 8 -23 -57 -109 222 -45 123 70 179 -131 -198 187 10 120 -13 282
7907 282 284 -10 -110 -28 179 97 53 25 11 49 -308 111 -102 -117 123 -124 74 -406 -8 49 32 -111 -196 -225
7931 -225 197 -150 -101 -42 93 12 -47 -136 188 162 54 45 -112 121 -183 -234 194 -369 -42 33 84 37 124 -126
7955 -126 81 -16 62 372 225 -60 137 -265 -65 -164 205 -109 -228 25 -134 -105 123 3 16 70 -226 137
7977 137 209 -112 -126 33 -398 -105 -41 -45 82 -97 -52 204 -192 474 -192 42 -189 38 -189 98 111 297
7999 297 -121 -136 261 178 -86 -415 44 105 220 12 133 17 -354 -106 -103 22 38 -356 -3 187 153 404
8021 404 -68 -70 45 151 240 -86 76 -372 -47 102 -229 120 -116 376 -119 135 187 -161 -66 81 -171 -118
8043 -118 76 118 253 53 48 -59 -111 130 28 108 63 -293 90 95 -65 70 46 139 83 -274 76 237 -128 295
8067 295 252 82 48 234 -104 80 -160 -9 -172 28 94 85 195 17 -226 87 -89 37 -200 81 -10 -50
8089 -50 256 182 -77 -65 59 194 -128 23 11 148 133 -96 -203 -479 -112 81 69 132 77 -43 -116 -111 119 -284
8113 -284 -121 54 -40 -208 27 -119 55 -16 78 -34 122 29 5 -182 -3 174 -146 -334 56 -75 -67 -210
8135 -210 76 202 -49 88 -72 -125 -280 -49 -26 -119 187 -166 0 -150 -130 -72 80 -22 135 -235 99 56
8157 56 118 255 -63 -120 352 129 119 -91 118 136 -270 -67 -185 -26 7 93 -298 251 255 -134 9 -172 -172 151
8181 151 13 -154 475 -212 -64 -119 -43 -287 -25 79
8191G9
$$ Imaginary data points
##PAGE= N=2
##DATA TABLE= (X++(I..I)), XYDATA
0 0 0 0 0 0 0 0 -8 8 -8 8 -16 16 -19 24 -32 38 -43 52 -64 72 -83 98 -115 130 -151 171 -195 224 -251 284
30 284 -321 358 -403 451 -500 560 -620 691 -766 846 -938 1039 -1151 1274 -1411 1567 -1742
47 -1742 1943 -2176 2445 -2766 3157 -3637 4255 -5069 6209 -7917 10751 -16332 31497 -158313
61 -158313 -499396 -169790 167403 177173 12627 71910 178412 42224 -245882 -278279 -57085
72 -57085 106482 85999 103687 189692 116237 -175927 -348310 -184063 105104 201237 137275
83 137275 93943 59895 -80360 -222576 -178469 5089 108952 107068 134915 165699 21238
94 21238 -240367 -305336 -63935 187708 189992 70362 54019 69863 -65623 -249889 -210597
105 -210597 43929 220847 176250 64967 16508 -49358 -178581 -214046 -46745 164896 203996
116 203996 95234 5037 -35686 -107948 -184196 -134428 43927 189309 190585 88661 -41664
127 -41664 -164830 -214559 -113036 80010 182246 120609 25415 4976 -16689 -126428 -208883
138 -208883 -99279 131224 241894 146803 -6992 -93369 -137332 -161176 -87737 91886 215666
149 215666 151673 -6138 -83339 -72674 -85875 -119065 -51915 119747 226692 147990 -34266
160 -34266 -158472 -169192 -103043 6155 122727 172392 108929 -10959 -91980 -112838 -108374
171 -108374 -69884 35969 158783 180775 65107 -85480 -155190 -132557 -64954 29273 130789
182 130789 169081 89095 -52170 -137093 -124680 -69233 -10395 67713 149597 150431 27430 -128262
194 -128262 -181944 -105312 11043 86478 113880 106106 52658 -45375 -134092 -145683 -66986 49704
206 49704 135545 145910 73955 -42443 -134515 -144243 -69515 35207 109721 123466 79668 430
218 430 -81067 -126243 -108131 -29554 73418 144231 134186 38140 -86590 -154386 -120040 -17405
230 -17405 78732 117700 98893 44453 -27994 -95555 -122169 -80693 14186 107644 141428 92160
242 92160 -11946 -109877 -142058 -88489 14160 99782 121749 80526 7692 -64442 -109568 -104728
254 -104728 -41885 51450 120715 119804 48815 -50097 -121167 -124083 -55943 42944 112479 114163 54386
267 54386 -26460 -88160 -110123 -81140 -5390 82389 127369 94879 4720 -85280 -121778 -91433
279 -91433 -13992 68062 113226 96157 28940 -50688 -101988 -102739 -49916 34985 107458 120030
291 120030 59217 -35654 -103006 -107851 -56848 19200 85374 109557 75073 -2372 -77291 -107162
303 -107162 -80296 -13098 63507 111012 98065 24696 -65228 -113722 -93369 -23455 51467 95269
315 95269 91203 41438 -31828 -91028 -102310 -57166 20133 86845 106672 65763 -13841 -86141
327 -86141 -107706 -67903 5928 71946 97516 72745 10645 -58353 -97560 -84706 -24743 49175
339 49175 97215 92284 34385 -43457 -95904 -92432 -38398 33618 85686 92434 50423 -18898 -78103
352 -78103 -94086 -58956 7597 70030 96503 70582 3825 -65858 -97624 -73086 -8549 57207
364 57207 90810 76344 21976 -43743 -88439 -84443 -32499 37631 86373 86360 39509 -27441 -79236
377 -79236 -87838 -49162 16208 72355 88990 57378 -5323 -66440 -91173 -65023 -2578 59854
389 59854 88446 68541 12588 -50839 -86520 -74512 -21633 41644 80744 76188 32007 -29772
401 -29772 -77504 -83411 -43391 22448 75035 85010 47219 -15180 -67875 -83299 -53691 3875
413 3875 59226 82959 61078 5802 -51907 -80927 -66465 -15836 43999 80467 72043 24425
425 24425 -35872 -75698 -73987 -32227 27821 73102 78300 39590 -19590 -66758 -76821 -44890
437 -44890 10656 60306 77314 52745 -321 -52594 -76950 -59803 -9437 46964 77837 64702
449 64702 15602 -41760 -75096 -67375 -23910 32166 70585 69083 28772 -26442 -65291 -68882 -37997
462 -37997 10646 56241 74662 50652 -6239 -60680 -77861 -49513 2546 49631 70509 55702
474 55702 9966 -43198 -72092 -59149 -14690 36021 66244 62560 26453 -24590 -63611 -67944
486 -67944 -33892 20280 63987 71870 38744 -15859 -58650 -66680 -39376 6095 47843 67169
498 67169 51668 5065 -46898 -70592 -51599 -6616 37648 61499 57235 22562 -29997 -69350
510 -69350 -66109 -22087 31209 60932 57458 27538 -15530 -54885 -66693 -39223 11310 53290
522 53290 63407 40125 -3629 -45612 -64508 -47889 -5850 39632 64612 54597 13415 -37911
534 -37911 -67128 -54589 -12118 31261 53837 52267 28308 -14247 -56374 -66427 -31986 21332
546 21332 55271 55174 32123 -1402 -39481 -64180 -51405 -315 52280 66921 40510 -2003 -35555
559 -35555 -52866 -47328 -16207 28050 58711 54084 19543 -24328 -54905 -56896 -27321 18697 53737
572 53737 57102 29747 -12038 -48874 -60751 -37204 10062 48524 54274 31127 -439 -29933
584 -29933 -51154 -50981 -17461 34362 65637 51151 6309 -33930 -51331 -45417 -20009 18743 52003
597 52003 55456 23824 -19891 -48090 -49203 -27354 6534 40338 55478 39322 -1602 -42272
609 -42272 -57876 -39617 531 39062 53781 38652 5855 -27269 -47222 -45645 -18695 23386
621 23386 54504 51930 17468 -23470 -47407 -45937 -23331 11551 43038 52034 30536 -7913 -40678
634 -40678 -51403 -35371 194 37875 54239 38174 -7 -34859 -49270 -38682 -9560 25769
646 25769 48841 43426 12909 -22131 -43335 -44521 -25226 10701 46983 56258 26182 -19797 -48101
659 -48101 -44322 -21466 6192 31998 46228 35212 1307 -33681 -47539 -35503 -7931 25382
671 25382 49932 47410 12762 -30856 -51592 -38456 -7795 20701 38096 41058 23050 -11240
683 -11240 -41101 -45965 -24403 7671 35454 47161 34166 -2381 -39448 -51738 -30488 5863
695 5863 32669 40195 30124 7187 -21358 -41662 -40743 -16572 19303 46032 45563 16605 -22450
708 -22450 -45318 -40218 -15651 12939 33766 39904 26193 -4792 -35117 -44780 -28306 2276 30030
721 30030 43266 34749 4882 -31018 -47929 -34387 -1143 27460 37829 31316 12289 -13769
733 -13769 -36126 -40828 -20788 13344 41436 45313 21236 -15035 -40008 -39122 -17276 8126 27024
746 27024 36203 30209 5109 -28713 -45640 -31799 -266 25805 36766 33650 13387 -20262 -46302
759 -46302 -40796 -6324 26718 35415 25462 11661 -3869 -25572 -42244 -31574 4757 40564 46799
772 46799 21743 -11733 -33172 -35823 -22481 417 23452 36006 30182 7251 -21400 -39374
784 -39374 -33484 -8906 18473 35719 35699 16549 -14326 -40395 -40965 -13588 19951 34619 28100
797 28100 13855 -1390 -20952 -37117 -32482 -2148 32698 44500 26564 -4046 -27958 -35472
809 -35472 -25584 -3913 19877 33717 30142 10741 -15371 -34209 -34624 -14351 14148 33730 34616
822 34616 17309 -9024 -31893 -37970 -20503 10269 31873 31750 16066 -1664 -17516 -30889 -31868
835 -31868 -10615 24035 43442 31123 -357 -25259 -31668 -24205 -8631 11677 29925 32127 15242
848 15242 -10855 -30260 -33092 -18385 6359 28891 36067 21399 -5649 -28719 -34482 -20487 3288
861 3288 23285 30403 22308 4247 -15482 -30457 -30202 -11611 16197 35680 32786 9187 -17885
874 -17885 -31638 -27417 -10409 10457 25904 28618 17116 -3933 -24024 -32503 -22526 684 25016
887 25016 34834 23317 -1250 -23402 -31913 -23470 -2933 18316 29835 24843 7355 -13498 -27444
900 -27444 -28519 -14663 10266 31085 32772 13670 -12490 -28352 -28291 -14803 4669 22455 29526
913 29526 19878 -1080 -21619 -29541 -23077 -3741 19166 32155 26131 3574 -19767 -29806 -22617
926 -22617 -5827 12322 25764 26583 13196 -9275 -26542 -28881 -15094 6599 25157 30616 17985
939 17985 -5396 -24903 -28893 -16352 2014 18531 26601 21660 4549 -17056 -28772 -24043 -6301
952 -6301 14475 28156 26764 9004 -14232 -28081 -24669 -8793 8755 21850 25511 16357 -3856
965 -3856 -23575 -29415 -17045 4235 21182 26473 19019 824 -18719 -28183 -20794 -1338 16962
978 16962 24830 21033 7249 -10945 -25380 -26099 -10129 11608 26417 25208 10226 -8773 -22962
991 -22962 -24674 -13153 4674 20167 25330 17176 -510 -18726 -27219 -19774 -478 18507 26113
1004 26113 19257 3264 -14630 -25070 -21952 -6620 12720 24084 22047 8640 -8385 -21775
1016 -21775 -23962 -13955 5485 22976 26299 13630 -5571 -20022 -23195 -15328 -5 16246 25280
1029 25280 19582 1796 -16281 -25289 -19520 -4086 13264 23749 20801 6685 -10707 -22673 -21587
1042 -21587 -9904 7477 21059 23929 12829 -6011 -21219 -23887 -13370 3268 18328 23236
1054 23236 15661 -430 -17007 -23298 -16033 -1730 13063 21664 19935 6540 -11939 -24198 -21423
1067 -21423 -5413 11548 21512 19842 8935 -6807 -19559 -22033 -11069 5081 18286 21697 13901
1080 13901 -798 -16867 -23922 -16258 870 16423 21933 15488 2177 -12188 -21125 -19055 -5810
1093 -5810 11405 21448 18843 6611 -8332 -19343 -20813 -10586 6539 20014 20943 10214 -5194
1106 -5194 -16241 -19675 -13825 -438 15240 22647 16801 285 -15454 -21139 -15492 -2552 11672
1119 11672 20065 17393 5001 -9220 -18893 -18510 -8381 6246 18395 20909 11124 -5639 -18667
1132 -18667 -20720 -11149 3696 16031 19624 12811 -1102 -14645 -19386 -14397 -2404 11200 19213
1145 19213 17782 4898 -11764 -20996 -17622 -4917 9402 17948 17571 7844 -6889 -17820 -18434 -8934
1159 -8934 4430 14952 18479 13216 -1050 -15862 -21266 -12954 2122 14037 17906 13164 2763
1172 2763 -10177 -19161 -16459 -3810 10330 18325 16336 6248 -7886 -17993 -17950 -6962 7185
1185 7185 15780 16319 9842 -2691 -14839 -19483 -11750 3127 13963 16446 12244 2276 -10967 -20718
1199 -20718 -16554 -50 14595 17166 10044 2235 -4837 -13444 -17980 -9890 7611 19531 16859 5508
1213 5508 -5790 -13348 -16234 -11175 2375 15905 18709 9537 -3474 -11702 -14672 -11695 -2160 9860
1227 9860 17196 14330 3537 -8959 -17242 -16005 -5087 9819 18129 13776 3484 -5996 -12234 -14471
1241 -14471 -10359 2289 16339 18933 7988 -5546 -12555 -13062 -10692 -2540 10348 19203 14273 -833
1255 -833 -13361 -15420 -9746 -2857 6071 14515 15863 6809 -7775 -16828 -15120 -4935 6472 13914
1269 13914 14074 7087 -3223 -11861 -14733 -10534 455 12921 18335 11201 -2261 -12613 -14268 -9327
1283 -9327 -1889 7036 15598 15768 3668 -10697 -16173 -10290 -1760 4084 9888 14671 11146 -3566
1297 -3566 -17518 -17872 -5899 7232 12450 11485 7509 57 -9435 -15334 -11816 -134 10792 14838
1311 14838 10692 1959 -8043 -14041 -12721 -4159 7152 14739 13950 4772 -6865 -14123 -12617 -4038
1325 -4038 4794 10162 11879 9099 543 -11414 -17029 -10748 3783 13327 13083 6636 -81 -6424 -12615
1340 -12615 -13018 -4053 8903 15748 11293 1241 -7000 -10948 -11329 -6530 3599 13326 14763 6045
1354 6045 -5605 -12442 -11637 -5962 1699 8669 12519 9818 969 -9676 -15017 -10927 -70 10465
1368 10465 13881 8815 425 -6593 -10777 -10921 -6012 4599 13863 13364 4314 -6233 -11157 -10732 -6375
1383 -6375 1079 10943 14705 8463 -3492 -12304 -11671 -5996 325 6397 11316 11267 3095 -8612 -14882
1398 -14882 -10892 -1356 7327 12041 10412 3624 -5881 -11825 -10897 -4467 3946 10253 12282 7544 -2381
1413 -2381 -11260 -12549 -6553 2053 9201 12064 8629 -320 -9634 -12588 -7786 371 6255 9779 9960
1428 9960 4982 -5345 -13459 -12558 -2660 7144 10890 9481 4588 -3084 -10336 -12202 -5992 3553 9771
1443 9771 10048 6561 563 -7489 -12912 -10120 185 9947 12072 7660 444 -6131 -10355 -9807 -2816
1458 -2816 5809 10585 9353 4392 -2974 -9209 -11672 -6359 3875 11065 10947 4947 -2168 -7799 -9978
1473 -9978 -7593 235 8675 10926 7134 599 -5764 -10191 -10006 -3141 6877 12569 8766 1181 -5501
1488 -5501 -8558 -8970 -5315 2550 10186 11188 4676 -3296 -8973 -9627 -6544 896 8591 11928 6641
1503 6641 -2028 -7948 -8964 -6821 -1668 4971 10285 9582 2681 -6326 -10723 -8774 -2749 4462 9908
1518 9908 9732 3477 -4259 -9408 -8802 -4255 1536 7460 10174 7119 -755 -8614 -10793 -7156 562
1533 562 7317 10104 7523 471 -6760 -9364 -7470 -1608 4337 8706 8903 4119 -3745 -9415 -9739 -4066
1549 -4066 3343 8798 9481 4778 -2065 -8063 -9092 -5725 1079 6718 9044 7038 920 -6036 -10306
1564 -10306 -8209 -761 5993 9181 7499 2100 -4198 -8534 -8481 -3900 3380 8882 8923 4353 -2609 -7928
1580 -7928 -8975 -5390 1105 7337 9379 5898 -1101 -6718 -8321 -5854 -1099 4269 8428 8275 2741
1595 2741 -5355 -9621 -7927 -2250 4671 8334 7797 3079 -2822 -7023 -7838 -4494 1441 7145 9419
1610 9419 5748 -1264 -6949 -8466 -5512 -262 5281 9256 7491 640 -6798 -8769 -6097 -1250 3347
1625 3347 6996 8102 4618 -3235 -9549 -9075 -3070 3650 7261 7165 3950 -932 -6705 -8476 -5555 602
1641 602 6205 8677 6227 78 -6095 -8633 -6137 -795 4487 7814 7239 2561 -4190 -8509 -7378
1656 -7378 -1978 3480 6601 6944 4631 -847 -7419 -9542 -4546 2947 7583 7021 3825 14 -4230
1671 -4230 -7314 -6784 -1219 5503 8597 6203 539 -4307 -7434 -6691 -2430 3601 7660 7125 2752 -2740
1687 -2740 -6861 -7086 -3743 1505 6201 7482 4496 -1018 -5920 -7783 -4939 417 5801 7148 5083
1702 5083 318 -3813 -6457 -6714 -2539 3565 8045 7511 1785 -3708 -6595 -6112 -2962 2052 6277 7379
1718 7379 4090 -1894 -6306 -6891 -3987 212 4884 7469 6128 542 -5426 -7908 -5015 156 4648
1733 4648 6624 5222 1858 -2530 -6465 -6921 -3422 2442 7179 7197 3183 -2219 -6264 -6856 -3709 1450
1749 1450 5365 6808 4393 -486 -4949 -6411 -5010 -975 3859 6743 5816 1482 -4574 -7659 -5752
1764 -5752 -1161 3596 6030 5587 2311 -2019 -5483 -6823 -3492 1686 5911 6767 3674 -1455 -5498
1779 -5498 -6832 -4060 476 4704 6287 4841 608 -3759 -6406 -5252 -1377 3369 6704 5877 1936
1794 1936 -3221 -6689 -5921 -1622 2694 5243 5307 3223 -795 -4797 -6381 -4471 589 5462 6713 4245
1810 4245 -305 -4876 -6556 -4646 -283 4005 6055 4377 1053 -2833 -5378 -5617 -2539 1982 6146
1825 6146 6551 2639 -2160 -6189 -5965 -2651 1568 4548 5338 3466 -212 -4134 -6031 -4453 -336 4029
1841 4029 5850 4871 863 -3764 -6385 -5104 -1214 3233 5326 4563 2130 -1353 -4617 -5935 -3195
1856 -3195 1674 5527 6140 3254 -1221 -4883 -5914 -3601 986 4624 5161 3543 833 -3125 -5436
1871 -5436 -5337 -1405 3527 5742 4879 1041 -3068 -5012 -5336 -2143 2424 5259 4679 1988 -1479 -4067
1887 -4067 -4970 -4159 302 4797 6304 3589 -952 -4168 -5368 -4039 -511 3766 5710 3997 381
1902 381 -2813 -4582 -4376 -2312 1720 6093 6241 2095 -2754 -4601 -4458 -2082 1121 4355 5075 3208
1918 3208 -916 -4054 -5108 -3451 -261 3431 5781 4384 273 -3952 -5095 -4130 -1044 2652 4927
1933 4927 4530 1211 -1975 -4141 -4037 -2844 218 4578 6180 3322 -2647 -5342 -4641 -1716 418 2736
1949 2736 4868 4219 370 -3511 -5197 -3529 -539 2197 4857 4729 1917 -2655 -5404 -4536 -1063 2397
1965 2397 4449 4359 2062 -1598 -4121 -3996 -2370 122 3061 5375 4376 -480 -5077 -5259 -2141 1024
1981 1024 2297 3629 4091 1943 -2556 -5984 -4509 -157 2494 3452 3981 2259 -1250 -4669 -5343 -1835
1997 -1835 2023 3999 3596 2182 -149 -3068 -4756 -3422 108 3246 4946 3824 297 -3588 -5139
2012 -5139 -3422 208 2536 3359 3476 1952 -1089 -4464 -4842 -1824 2109 4081 3635 1674 -445 -3612
2028 -3612 -5227 -3014 1352 4317 3711 2021 29 -2076 -3386 -4013 -994 2667 4553 3644 966 -2365
2044 -2365 -4507 -3976 -830 2542 3685 2869 1577 -619 -3159 -4511 -2588 1467 4138 3889 1857 -341
2060 -341 -2214 -4399 -3822 -428 3940 4958 2333 -482 -2096 -2812 -3482 -2114 1596 4627 3989 719
2076 719 -2290 -3644 -3247 -1900 1035 3625 3952 2034 -1002 -2885 -3889 -3027 -342 3453 4535 2924
2092 2924 -474 -2553 -3252 -3166 -1187 2070 4354 3577 193 -1963 -2750 -2659 -2096 231 3608 4914 2730
2109 2730 -1762 -3981 -3347 -1441 658 2725 3814 2772 6 -3253 -3656 -2510 -716 2127 3965
2124 3965 3705 588 -2855 -3732 -2654 -676 1615 3480 3819 1176 -1710 -3407 -2946 -1257 270 2471
2140 2471 3803 3314 -729 -3555 -4034 -2055 806 2366 3031 2574 687 -2619 -3806 -2817 -422 1849
2156 1849 2966 3195 1410 -1597 -4275 -3653 -732 1815 2794 2923 1674 -366 -2806 -3810 -1912 788
2172 788 2976 3084 2210 370 -2163 -4127 -2990 173 2538 3236 2204 419 -1201 -3040 -3375 -1104
2188 -1104 1588 3319 3221 1548 -878 -2870 -3491 -1676 981 2993 3075 1931 115 -2013 -2916 -2713 -278
2205 -278 2467 3664 2050 360 -2000 -3078 -3264 -890 1823 3269 2867 503 -1315 -2174 -2939 -2146
2221 -2146 392 3248 3702 1663 -1057 -2524 -2745 -1984 -171 2106 3172 2210 -200 -2487 -2638 -2114
2237 -2114 -640 1351 3343 3125 926 -1848 -2708 -2268 -777 1211 2442 3111 1623 -981 -2802 -2658
2253 -2658 -1585 -239 2345 3403 2446 -351 -2581 -3028 -1709 -43 1439 2752 2607 639 -2135 -2939
2269 -2939 -2411 -805 697 2466 3051 1640 -1059 -3258 -2823 -953 1093 2334 2175 1968 -109 -2473
2285 -2473 -3454 -1681 647 2265 2486 2225 521 -1935 -3405 -2348 79 1539 2539 2246 1142 -1063
2301 -1063 -2733 -2738 -1223 919 2409 2456 1204 -411 -2233 -3150 -1240 780 2108 2146 1958 619 -1602
2318 -1602 -3009 -2620 66 1753 2659 2088 826 -985 -2774 -2958 -1050 1249 2684 1870 626 -326
2334 -326 -1644 -2655 -1811 126 2660 2891 1365 -657 -1809 -2451 -1803 -342 1658 2504 1947 614 -1119
2351 -1119 -2391 -2619 -1225 1728 2855 2249 714 -689 -1871 -2310 -1451 658 2638 2621 1015 -1023
2367 -1023 -1620 -1884 -1830 -653 1454 3289 1859 -324 -1923 -2392 -1532 -637 973 2126 2465 1011 -1412
2384 -1412 -2456 -1970 -920 1180 2484 2175 1284 -587 -2301 -2410 -1349 56 1789 2396 1514 -263
2400 -263 -1657 -2134 -1676 -248 1406 2521 2193 -1 -1789 -2397 -1420 -676 532 1587 2111 1455 -790
2417 -790 -2392 -2426 -1187 742 1587 2121 1234 -64 -1660 -2371 -1478 332 1601 2171 1447 445 -1259
2434 -1259 -2070 -2125 -711 1012 2197 2367 926 -1171 -2270 -1896 -357 711 1463 2121 1264 -167 -1653
2451 -1653 -2356 -1260 395 1660 1904 1369 343 -1158 -2430 -1807 -220 1327 1957 1538 653 -636 -1940
2468 -1940 -2440 -1362 1036 2022 2137 753 -912 -1747 -1327 -971 -153 1415 2039 1659 45 -1919 -2147
2485 -2147 -1305 88 1313 2426 1870 350 -1267 -1871 -1929 -582 998 2066 1847 743 -389 -1628
2501 -1628 -2179 -1424 451 1980 2292 1382 -408 -1838 -1708 -649 118 952 1783 1755 161 -1499 -2256 -1675
2519 -1675 114 1225 1401 1497 633 -753 -1974 -2246 -835 851 1278 1153 790 29 -1059 -2147 -1686
2536 -1686 -42 1914 2446 1099 -381 -1075 -1205 -1238 -430 1255 1853 1542 598 -908 -1968 -1788 -686
2553 -686 819 1773 1804 655 -592 -1480 -1761 -1181 322 1664 1509 942 -223 -948 -1810 -1783 -322 1337
2571 1337 2258 1036 -224 -1140 -1472 -1249 -792 634 1684 2047 819 -627 -1520 -1609 -685 347 1667
2588 1667 1631 1261 -554 -1672 -1728 -972 -7 896 1625 1090 138 -1072 -1746 -1452 -413 903 1849 1717 312
2607 312 -1235 -1471 -778 -730 87 1385 1942 1018 -587 -1587 -1612 -793 119 627 1809 1203 -25 -1487
2625 -1487 -1653 -1158 276 912 1084 1168 563 -513 -1700 -1398 -580 583 1805 1347 874 -745 -1509 -1621
2643 -1621 -323 849 1080 1515 890 36 -1286 -1739 -614 180 1069 1059 957 131 -1004 -1658 -1307 -324
2661 -324 1140 1188 1397 446 -552 -1212 -1706 -675 807 1327 1314 683 -361 -1231 -1442 -769 -172 1184 1411
2680 1411 1022 280 -589 -1420 -1303 -86 659 1524 1608 236 -620 -1255 -1353 -566 661 1049 1124 664 174 -851
2700 -851 -1192 -678 470 1205 1439 929 -183 -1134 -1553 -1211 -147 1076 1241 1051 74 -702 -1395 -1400 -432
2719 -432 427 1237 884 624 -614 -1200 -1204 -492 197 886 1175 781 -39 -996 -1418 -1073 -155 924 1420 888
2739 888 100 -997 -1318 -1125 -467 365 1576 1116 183 -653 -625 -1469 -813 222 1297 1584 592 -345 -1070
2758 -1070 -928 -428 507 725 1124 972 -14 -999 -1281 -1518 -119 1009 1380 815 -39 -561 -835 -994 -436
2777 -436 105 989 1154 402 -396 -962 -1019 -492 66 1328 1614 1003 62 -1114 -1085 -525 -38 566 1119 1082
2797 1082 438 -495 -1266 -1187 -114 929 1000 994 586 -465 -821 -1109 -688 2 1166 1351 415 -346 -729 -1192
2817 -1192 -855 -246 704 1516 706 -47 -796 -1125 -896 76 233 1221 978 931 -416 -1348 -1589 -572 378
2836 378 1224 765 502 -429 -726 -776 -593 -308 769 1392 920 -11 -584 -754 -767 -447 715 1035 1025 274
2856 274 -676 -918 -1086 3 346 677 815 638 -127 -1202 -1231 -707 416 981 1006 503 -34 -1047 -728
2875 -728 -976 -263 605 1211 914 -272 -1110 -665 -514 22 138 631 1104 573 -938 -1186 -454 -163 426
2894 426 630 894 551 200 -1080 -1332 -691 162 958 1042 559 -61 -263 -658 -559 -422 474 988 875 250
2914 250 -922 -1018 -540 -411 61 528 892 729 -7 -1074 -932 -315 181 799 600 615 299 -647 -1288 -1053
2934 -1053 142 886 828 579 -28 -392 -749 -582 -468 201 809 740 673 -64 -997 -606 -198 -85 457 996
2954 996 619 18 -965 -723 -416 291 609 476 529 129 -241 -935 -1011 -71 528 987 519 145 94 -849 -947
2975 -947 -724 520 1060 909 233 -276 -525 -816 -653 -36 526 725 504 -138 -492 -834 -593 -29 641 733
2995 733 561 -61 -269 -748 -940 -454 604 1029 577 372 -25 -446 -636 -541 22 920 852 188 -107 -583
3015 -583 -677 -810 -139 788 931 450 -1 -645 -561 -756 -380 428 1122 802 118 -536 -902 -504 -233 139 825
3036 825 980 250 -408 -872 -123 -548 -79 390 891 582 -384 -668 -665 -160 -235 183 418 752 102 -704 -588
3057 -588 -354 -18 88 452 668 563 -114 -991 -772 -478 -45 418 727 716 -30 -742 -891 -271 -55 438
3077 438 376 874 375 -448 -508 -450 -13 64 526 599 718 -184 -959 -1018 -211 249 527 708 601 64 -597 -697
3099 -697 -482 452 462 527 409 251 -600 -784 -717 -334 117 789 577 498 -433 -799 -929 -429 763 666 140
3120 140 213 -218 -651 -673 -665 -89 601 618 191 48 -697 -724 -671 -371 529 490 578 -138 -388 -157 -822 -124 104
3143 104 474 735 -110 -175 -303 -915 -649 259 588 707 262 -134 -178 -372 -368 -112 494 551 530 -259 -237 -459
3165 -459 -299 -459 304 437 669 295 33 -150 -508 -384 107 617 728 402 -258 -661 -604 -275 149 463
3185 463 289 310 118 -564 -296 -166 -360 83 606 390 313 -415 -665 -749 -209 124 464 723 486 -229 -631
3206 -631 -720 -174 394 454 645 885 255 -488 -813 -412 49 429 277 365 182 -42 -512 -667 -325 143 602
3227 602 278 276 -274 -655 -328 -182 -157 563 586 322 -336 -676 -682 -223 237 608 513 458 3 -365 -537 -788 -341
3250 -341 551 509 432 189 -176 -469 -617 -247 304 440 716 328 -394 -367 -589 -485 98 482 430 238 -100
3271 -100 -642 -606 -93 -280 179 494 206 161 -488 -765 -454 96 165 435 330 358 -319 -780 -289 -376 34 605
3293 605 610 198 17 -407 -266 -529 -71 450 407 584 540 -208 -484 -530 -127 252 402 418 450 -263 -385 -303 -153
3316 -153 82 607 496 137 -105 -432 -562 -371 -115 98 255 207 -39 -170 -413 -492 -126 -57 510 412 30
3337 30 -318 -597 -532 -359 -74 294 294 602 -188 -598 -491 -77 395 507 209 434 -192 -129 -224 -220 -14 97 161
3360 161 11 189 -364 -223 -373 -199 270 396 593 81 -76 -269 -531 -81 384 521 480 209 71 -494
3380 -494 -561 -312 -47 596 485 75 -6 -175 -314 -332 -145 318 566 411 351 -323 -247 -355 -173 145 261 348
3402 348 190 13 -367 -322 -417 260 369 219 190 130 -445 -440 -134 -124 234 588 273 -36 -105 -234 -594 -129 356
3425 356 469 561 206 -118 -118 -559 -263 -118 166 389 394 177 87 -482 -442 -142 399 569 350 -9 -325 -26
3447 -26 -324 243 216 87 325 20 -368 -501 -399 -170 -133 56 500 207 -57 -584 -264 -617 -149 196 516
3468 516 122 -115 -128 -73 -391 -268 346 578 425 283 -226 -405 -311 124 444 436 380 -165 -243 -368 -355 -69 50
3491 50 194 531 189 139 -444 -628 -40 31 90 160 428 -61 -182 -396 -211 -182 72 389 357 525 -294 -353 -320
3514 -320 -226 -83 270 205 117 187 -353 -637 -170 112 388 232 242 -121 -174 -66 -105 -390 -11 594 308 62
3536 62 48 -324 -123 -133 280 538 70 209 -19 -272 -23 -301 69 -178 286 222 112 -88 -394 -82 -152 128
3558 128 417 585 284 8 -102 -407 -43 87 339 154 -170 43 -459 -57 -64 374 252 110 199 177 -81
3579 -81 -182 -312 -50 307 482 52 -86 -127 -267 -7 -49 -121 412 342 -71 85 -257 -266 -92 320 360 225 -138
3602 -138 130 -156 -140 -18 -114 -129 307 526 -371 -414 -235 -220 -83 378 227 100 -143 -131 -173 -172 -11 162 41
3625 41 171 12 -120 65 -459 190 345 267 381 94 189 -216 -418 -360 -179 119 242 187 -88 -160 -250 -27
3647 -27 6 116 216 76 162 -39 -519 -518 -168 54 162 315 9 -348 -68 -174 -213 -9 128 8 142 26
3669 26 186 -207 11 50 252 123 487 117 -20 -228 -146 33 -487 93 303 -107 94 -346 -545 -48 80
3690 80 230 -316 129 -62 -329 -195 -308 -265 170 375 165 63 -300 -299 -156 -410 154 122 267 151 -87 -54
3712 -54 -196 -202 3 153 316 70 21 -65 -222 -103 -98 227 180 301 -242 -208 -105 -59 235 203 169 138 163 -227 -341
3737 -341 -56 -445 58 105 191 87 -143 -255 -385 -69 139 300 247 272 167 37 -92 -69 -33 145 157 276
3759 276 -28 -8 -76 -29 28 115 -6 51 -105 -65 72 55 -120 120 225 350 6 -173 -432 -248 -159 158 114
3782 114 192 228 116 -144 -435 -213 50 -246 248 193 57 -259 -51 -382 -137 10 161 213 415 -162 -244 -150
3804 -150 142 24 -101 119 57 -3 -46 -163 -40 245 147 343 172 46 -119 -254 60 -349 -99 278 235 190
3826 190 62 -374 -321 -201 130 259 149 158 -48 -34 -433 -435 -269 256 315 -60 -31 -53 96 -428 578 257 143
3849 143 159 -21 24 -78 -59 45 77 106 54 83 169 -192 -254 -34 53 -41 256 85 -143 -188 -318 -312 48 128 322
3874 322 66 62 -239 -240 -149 48 -90 350 117 221 -161 -142 -248 194 -303 34 142 -40 -120 -117 24 -250 75
3897 75 103 138 128 -57 93 142 25 -88 266 8 184 112 -65 -419 -357 -11 92 59 128 317 -5 117 -286
3920 -286 146 413 102 75 396 40 -104 -180 -88 -215 116 -346 236 306 31 82 -224 106 244 -11 308 114
3942 114 -204 -241 -234 -163 25 224 291 78 310 -72 -209 -192 -40 1 153 193 -115 -179 118 -19 -124 -35 82
3965 82 143 -10 36 116 -397 -124 250 180 299 -361 168 -97 -134 -13 181 -115 324 197 271 -310 -10 -309
3987 -309 -39 271 297 182 -33 -216 -184 -178 140 -111 -45 13 444 -61 -181 -116 -298 9 -149 205 33 173
4009 173 -137 96 -232 -88 105 232 397 199 119 -37 -229 38 161 75 100 -66 -141 -212 -153 -217 94 -57
4031 -57 234 124 32 230 -53 -374 -92 28 -41 202 -77 77 -171 -287 -223 173 -41 101 -40 -281 -40
4052 -40 -134 -320 -190 131 -67 -108 119 33 -112 -290 -160 438 161 -120 177 -151 -109 -123 -90 -90 315 214 -140
4075 -140 28 68 25 -171 113 152 214 -62 62 -64 -231 -71 138 -190 62 82 -40 89 -214 -113 -105 261
4097 261 118 18 130 -117 29 -162 88 222 43 -10 -304 -251 28 -215 245 107 -137 102 78 -54 284
4118 284 110 -8 -113 14 183 52 179 105 -38 -170 106 105 121 431 -132 129 121 -432 -112 135 23 211
4140 211 -183 71 -78 -83 -133 -76 96 -264 348 -79 186 148 -119 190 223 138 -179 41 86 -55 -25 94 33
4163 33 -76 388 189 72 -167 -155 -321 -36 -67 78 119 -135 -159 -118 43 140 45 135 359 262 106 -217 211
4186 211 150 -19 -55 -152 42 -154 -242 -70 75 22 2 -22 297 -13 -380 -219 -149 -284 86 80 109 82 57 -163
4210 -163 -232 -106 178 -40 -55 -79 68 69 -28 -225 -174 66 67 -122 33 48 -116 -131 75 285 -45 40 -148 1
4234 1 310 -421 -214 -144 56 188 -102 68 156 -56 -100 -196 -8 112 -522 192 80 118 141 -67 449 -17 56
4257 56 150 -291 1 73 -165 -1 126 -211 -192 -235 -190 -28 150 480 123 158 -115 -142 -27 -258 -28 -63 124
4280 124 -165 -88 -217 37 5 -83 42 106 -30 -19 -8 -190 -107 -34 -34 74 -165 281 14 230 -82 -68 15 163
4304 163 50 18 7 -280 -24 -199 -121 386 -127 331 -4 -44 -116 -126 3 -179 21 119 60 -172 327 92 -265
4327 -265 -222 255 121 23 -157 81 -177 -270 176 106 -239 -51 202 250 -69 59 74 3 45 -7 9 -36 -23 -119
4351 -119 -112 -214 177 253 103 30 -103 -309 -117 60 -75 -172 275 101 173 -76 -104 -13 -341 156 151 -175 -55
4374 -55 -282 -39 114 193 92 -156 119 9 -110 -109 -277 230 -93 182 102 -157 129 199 -101 3 -21 -18 -17 -118
4398 -118 76 -315 -86 7 -9 -16 -192 228 -72 -28 -69 -95 -117 -28 63 35 207 54 76 48 -260 207 -29 -55 -25
4423 -25 -113 -293 21 -132 -163 61 -223 55 18 -80 104 -164 85 -226 393 -79 -306 -57 -124 -107 -72 -128 32
4446 32 18 -84 126 -346 5 -6 173 136 186 -121 41 -293 -63 -259 233 -77 120 -179 -119 -66 -208 230
4468 230 173 11 -78 108 -343 196 -230 -140 29 97 168 -124 -71 71 216 -125 91 108 -231 162 601 -82
4490 -82 58 -232 -43 -24 127 14 38 314 -167 223 -36 -35 -13 -40 -67 85 -180 -115 214 26 -125 160 -104
4513 -104 281 76 32 104 -203 -17 419 97 326 160 -28 -23 -186 -79 0 21 99 -131 135 39 45 -237 21
4536 21 48 -57 36 -271 131 -105 316 -128 -47 238 193 27 -155 8 211 75 -44 -224 -171 61 -114 -263
4558 -263 -335 -505 -101 -115 -115 176 22 -219 -319 293 -127 -61 112 -61 -127 -32 112 -241 -79 116 -76 1 99
4581 99 90 -37 25 307 186 77 -77 -41 154 -220 -242 -229 33 -317 -50 108 -21 184 -111 -11 -8 326 268
4604 268 -141 -235 43 -283 -104 15 -33 -5 -22 -144 260 -179 7 -235 66 209 -162 -61 -115 128 -183 -175
4626 -175 -156 -297 143 348 18 235 19 -10 -336 -27 -41 277 19 -33 -38 3 -202 -266 -134 262 210 -480 -142
4649 -142 215 -19 -72 -178 48 54 118 29 -123 39 7 -122 26 -116 -302 12 -87 233 -213 382 252 -45
4671 -45 252 -144 -164 116 162 185 -105 68 344 18 -22 40 260 139 57 154 -52 -270 8 24 -27 -40 157 -162
4695 -162 318 216 190 24 -188 31 -73 12 403 -150 -36 71 -339 -103 48 11 175 164 -187 -287 -114
4716 -114 79 143 64 272 69 -211 -20 27 90 -464 -75 86 -275 -54 -255 29 -214 151 134 -379 40 -58
4738 -58 -50 -71 -296 -8 -59 -277 -82 -143 168 -282 -14 189 -141 334 57 -238 184 -250 67 -240 -34 -5
4760 -5 -242 310 253 77 -93 -77 -117 3 -180 126 -254 -304 -194 188 -226 -65 4 203 64 -131 -247 -250 -159
4783 -159 63 72 185 -34 -315 -66 -93 -64 -70 186 83 93 -57 -34 -8 62 154 262 -98 328 154 -23 -267 12
4807 12 323 145 13 254 79 11 -75 -60 -200 54 -11 -53 -70 178 410 73 -121 -27 -286 189 22 238 -194
4830 -194 94 31 -189 110 -62 -130 177 101 -284 73 38 49 2 248 -209 279 122 30 135 -133 149 127 268
4853 268 28 120 160 -150 -29 145 12 89 -176 -11 -337 31 123 -35 -91 -261 95 8 151 339 108 278
4875 278 161 73 -59 -52 -71 -298 -560 -147 66 36 -214 235 -165 291 122 -19 -37 106 92 131 96 -265 267
4898 267 -166 123 218 226 43 153 -28 -474 -282 -159 -171 -1 22 -48 161 -189 -177 -76 -112 -98 -49 143 -122
4921 -122 22 162 60 -84 -377 239 -103 113 46 -205 124 -110 148 86 14 -166 -57 -205 136 -221 -52
4942 -52 242 350 228 -210 -44 195 19 -41 211 240 0 96 120 -44 138 -82 200 -55 68 -43 276 -97
4964 -97 8 38 -41 -31 56 -155 -103 -175 -3 249 101 3 -111 -211 -81 -25 -261 100 -98 -3 6 -72 3 -281 63
4989 63 -95 -158 153 -123 10 -167 226 -44 -153 -207 104 -27 79 64 17 -180 -77 21 55 -126 -363 -60
5011 -60 163 -241 -277 -31 104 203 240 -24 -152 139 -41 25 -27 -306 -174 -4 0 85 -139 -245 72 -5 -403
5034 -403 -350 90 -190 176 3 105 72 139 37 139 311 -163 153 -112 156 -198 -50 194 219 -79 -245
5055 -245 80 -144 61 291 46 -320 -125 66 340 116 -218 303 163 -3 -130 -24 -28 -67 -137 -56 237 215
5077 215 -146 -56 -204 -163 335 41 -280 231 298 49 -39 276 -223 53 -179 179 36 137 45 -215 -8 105
5099 105 -427 -190 280 -157 1 -156 309 -64 85 89 -273 127 129 13 -251 -29 -11 267 183 -149 -1 150
5121 150 124 243 -29 16 -515 58 -139 -152 56 285 -278 -1 81 33 -143 -18 13 -77 -38 -92 83 -19 98
5144 98 -70 395 54 -297 97 -60 12 -196 -30 -82 -81 339 -252 338 79 83 -17 -51 216 -236 -41 -271 -127
5167 -127 180 491 -54 -187 183 33 83 279 -77 -197 -8 99 -172 335 124 40 -22 84 -102 -31 205
5188 205 -29 -165 169 138 295 -219 -204 -3 9 7 -69 -94 -68 -246 -261 7 156 -26 -36 -149 -262 35 78 111
5212 111 -292 -7 -104 -130 199 128 100 -69 -311 -247 13 63 108 38 100 107 240 -59 72 206 233 170 -63 -51 -14
5237 -14 106 157 -44 83 34 310 82 -45 83 10 71 -18 -86 231 168 -171 84 -62 -67 -103 111 -217 -216 -152 155
5262 155 -10 211 -11 -19 147 -60 259 -247 143 122 333 -29 -100 209 234 52 -61 24 96 67 208 -152 -45
5285 -45 -74 -63 29 -68 -51 -190 46 -195 -34 137 21 -173 19 223 147 253 150 133 -192 175 261 -112 36
5308 36 -56 -214 -162 -268 89 103 9 29 76 -181 -283 306 -26 -72 -91 179 -209 -219 21 -213 -262 25 127 5
5332 5 -155 138 -47 -318 456 191 -127 439 -106 48 -97 61 277 -201 -83 -61 -181 7 57 52 -157 -123
5354 -123 5 281 151 -49 -4 337 -276 -157 -10 -33 7 -25 -178 -175 233 -9 -44 76 73 131 31 116 149 -29
5378 -29 -27 72 36 -203 -105 172 83 -67 69 84 76 -160 -197 -85 23 -258 -260 -322 -354 -193 29 36 82 -113 132 -141
5404 -141 -10 30 -102 -187 177 -155 -121 -238 -83 -49 18 370 -177 177 -130 27 -37 -335 -76 -147 -90 84 -216
5427 -216 67 107 -43 -95 113 18 -157 -300 52 -134 32 -149 76 187 -497 -115 -4 187 -193 142 -82
5448 -82 -43 52 217 -242 -304 156 126 135 -98 12 108 -42 -117 -26 194 226 -94 -48 42 140 -342 221 120 43 5
5473 5 78 20 -94 183 -35 152 43 93 135 -103 -196 -208 140 175 -155 -100 -16 -94 -41 210 17 222 0 123
5497 123 78 100 111 -242 -16 2 162 -131 119 67 22 -249 35 68 26 -85 -1 233 -233 -122 -14 43 -49 211
5521 211 -273 182 75 -241 -158 -210 -118 -28 133 37 98 -225 29 -247 -501 -159 -267 -199 24 -49 157 42 52
5544 52 257 -142 -3 -134 357 192 -9 78 85 76 -107 57 -252 99 -136 197 -131 112 176 130 19 -51 -100
5567 -100 4 -326 -35 61 275 -14 -31 -251 -109 -33 -67 43 250 -186 -218 -246 12 250 -136 -291 64 78
5589 78 -71 -107 -31 37 132 -123 -22 125 -129 -132 27 -331 -305 -20 407 -207 43 -18 -179 259 29 8 -30 -326
5613 -326 20 268 -29 -16 -2 317 -177 95 -202 285 -123 79 -158 -40 23 -166 -1 217 75 34 -13 -157
5635 -157 16 -18 -101 -54 105 5 -208 -171 -16 -11 278 190 139 -201 260 67 149 276 -166 95 57 -67 142
5658 142 -116 68 120 -33 0 -55 -71 -172 102 18 -144 -37 43 -247 432 303 23 86 -140 49 -18 60 32
5681 32 37 309 -150 -245 268 85 -33 100 -331 -375 -5 151 2 -88 249 -128 -100 -15 -55 39 254 -129 -65 -42
5705 -42 -24 309 -435 22 -42 -7 -250 -13 -113 27 206 -58 28 233 241 8 -22 31 -198 21 -13 -122 45
5728 45 236 156 -104 62 -88 158 92 35 -224 -186 145 -186 66 107 -109 -136 -50 120 -212 56 151 42 82
5751 82 -16 -36 166 30 256 -47 -338 -97 -74 106 13 231 -77 1 -72 202 -216 -234 -27 -98 99 -144 81
5774 81 106 74 88 321 36 398 -260 106 -87 -76 66 114 151 275 -282 -298 228 166 73 -328 138 279 -23
5797 -23 -252 -47 216 -261 126 107 -106 -266 -114 -36 42 -302 -64 -184 -283 142 -58 134 -108 -110 -85 194 -192
5820 -192 -59 337 153 127 82 -256 213 95 374 -116 -32 85 -67 -24 93 21 -39 -21 230 55 -25 -14 155
5843 155 224 -33 -245 511 -29 -141 22 -158 1 -156 39 -76 16 165 -201 -44 -46 187 275 156 -22 -69
5865 -69 4 150 -28 12 390 -396 479 -115 26 131 -44 -96 18 -271 192 27 27 -35 -193 19 -79 -19 -248
5888 -248 -60 -261 -21 -116 -66 -90 -144 73 226 110 -218 131 213 -270 64 -190 61 -60 72 -35 -23 46
5910 46 292 -178 -336 -159 148 -212 -98 17 -32 93 135 94 306 -230 -145 76 -42 9 257 65 -136 171
5932 171 -33 97 -86 170 -167 -55 -186 107 -120 -126 -77 -103 70 -104 -276 -132 41 99 -31 -31 -54 152 140
5955 140 -145 231 -128 -86 -70 -101 275 -162 27 60 11 196 280 -94 54 181 47 -188 245 -43 71 -24
5977 -24 -195 -38 104 -136 35 -1 -251 -83 182 63 -159 -83 -19 3 -121 -16 -14 134 -122 54 108 -234 55
6000 55 -82 -85 140 189 -220 224 -168 -379 -174 -147 145 64 -362 -126 -29 51 444 -137 -61 -82 66 -20 -218 -209
6024 -209 2 28 -66 -41 -223 -246 113 -12 18 43 108 -195 261 -132 -320 -13 82 -46 -42 39 -69 33 159 -105
6048 -105 261 -13 -323 -195 149 138 263 190 -45 -60 41 -130 39 157 -137 -150 -111 -49 -122 59 108 -40 -32
6071 -32 -203 -246 -108 -163 158 -79 -31 -57 327 162 -43 8 107 -120 132 -160 153 -52 -144 35 -171 40 170
6094 170 139 -53 193 -127 -36 -300 232 -117 -91 -116 -270 -208 -97 -123 6 -107 -63 -36 -96 16 -45 -374 194
6117 194 -169 194 152 61 -144 -461 -19 12 4 295 94 -316 -63 -265 47 -166 109 -95 113 -52 -244 113
6139 113 212 -18 -92 -136 24 -10 45 91 -130 -21 -245 -44 45 305 324 -351 -103 -49 -103 -39 98 -55 355 115
6163 115 57 26 156 102 -287 55 -13 -135 -79 -109 -91 -40 -135 -129 63 -140 -11 -224 -48 -374 0 -50 140 183
6187 183 1 98 -45 114 -78 78 -49 -181 122 -238 178 6 -179 -119 269 180 38 -69 124 97 43 108
6209 108 101 50 68 68 -9 243 364 133 -76 36 0 138 36 33 -66 302 -30 159 -182 116 19 -37 -5 115 -119
6234 -119 -199 118 70 -141 -3 -95 376 -156 -137 231 -169 -175 -212 225 -16 127 247 61 -231 120 27 -203 -205
6257 -205 20 35 256 57 187 -30 -26 245 12 -11 -238 113 -258 88 -135 -15 -53 -4 -160 -206 48 37 8
6280 8 71 78 142 -113 72 6 209 124 160 -21 6 274 -26 209 130 -249 96 114 -72 100 70 59 154 68 105 -385
6306 -385 126 -15 -74 421 74 -37 -46 40 87 -80 -449 -25 -294 15 -52 53 -37 86 68 113 -53 52 -176
6329 -176 50 -56 -177 -280 -38 121 51 -26 173 100 27 -84 -146 246 57 -137 84 43 -143 98 -88 -14
6351 -14 -65 302 30 294 -42 -185 -60 -25 66 -158 68 76 -20 -106 377 -135 -110 77 -293 111 10 231 -48
6374 -48 74 72 76 14 -236 -396 234 23 -235 3 -84 -125 13 -11 230 -71 -241 -6 -64 -1 -81 57 -39 313
6398 313 168 -204 -104 307 114 -71 -88 251 89 35 -315 321 174 120 124 -451 -128 48 -79 6 5 143 122
6421 122 -173 229 -35 171 -78 -116 -233 288 14 -31 -113 -125 319 45 176 -159 24 -413 -122 -95 -64 231
6443 231 152 -171 -122 -75 236 -106 0 -58 -145 90 40 -236 -374 76 3 -104 -143 280 52 80 -203 158 -307
6466 -307 -93 -212 193 137 -80 -228 26 173 34 -151 16 -129 132 -21 56 -16 25 -145 -69 110 138 117
6488 117 -131 -2 -2 -63 -165 -52 -98 -49 -237 -32 81 106 15 -349 -205 50 -165 -85 171 -276 -34 -261 -108
6511 -108 -144 204 -170 -116 153 -127 100 200 -87 -100 28 -30 121 74 -259 -288 -11 -233 226 -103 67 -138
6533 -138 132 166 -107 8 -41 -181 260 95 -88 38 -222 37 17 -113 -3 216 278 -192 46 139 123 29
6555 29 -299 -91 107 89 -371 54 4 -67 -42 188 -184 118 -29 33 286 -77 157 -65 -83 112 161 31 56
6578 56 -180 -19 -24 191 -342 167 7 39 204 -39 292 -143 -154 290 -172 67 -269 -114 -25 -161 123 -8
6600 -8 -86 -175 41 -121 208 -225 -125 223 88 -274 93 -51 -80 361 -83 -434 187 126 114 -253 200 -45
6622 -45 -80 -14 131 36 80 -13 -90 180 -68 52 117 174 -59 -103 -42 -349 -148 53 136 -89 107 152 73 -8 -63
6647 -63 153 48 23 -118 64 90 -246 -168 58 63 -38 177 -278 -104 28 -358 8 -35 2 91 2 -72 90 -43
6671 -43 -54 -43 72 -11 -181 -68 9 82 -31 -20 35 -10 -160 -315 76 250 27 -43 175 62 -89 -89 -150 -39
6695 -39 -255 24 150 -273 -258 54 -325 29 -189 -216 79 -132 17 -125 -139 -198 -298 126 -14 47 72 83 377
6718 377 7 5 -372 -108 152 -206 135 -102 211 161 -128 132 60 -105 -64 -57 -56 -86 -149 -213 180 4 -14 38 -258
6743 -258 -103 14 -427 38 10 83 -148 63 64 -218 -1 -27 -86 89 -57 -164 160 131 -248 159 -220 42
6765 42 -13 323 -68 79 134 -166 -186 -87 78 42 -214 82 20 57 66 -367 178 -6 118 -174 45 -64 -65 -254
6789 -254 -223 40 112 -78 -169 286 -146 71 -427 -196 62 -40 86 71 -124 244 154 -184 -2 316 -215 -41
6811 -41 -145 -180 97 -192 206 113 335 -77 130 -183 -424 216 -7 -258 -171 -177 236 -212 -46 94 -102 -135
6833 -135 -103 -116 176 17 208 121 7 -223 -252 -105 80 -69 63 -101 -117 212 -106 -90 37 229 67 -180
6855 -180 38 -24 8 -7 -169 18 -65 296 74 230 -66 104 145 113 13 -4 127 -194 118 168 -12 95 230
6878 230 241 90 80 -52 -214 -190 -107 -23 31 -456 308 -15 -58 -15 60 -97 -204 112 -159 -100 -127 191 173 -46
6902 -46 63 82 217 -158 113 -249 -6 304 -20 -355 -188 18 -10 -99 -268 5 -104 -60 -99 -363 81 78 -177
6925 -177 191 -272 37 -142 14 -125 10 -214 -57 -129 -32 -30 -45 50 -3 -16 -173 -347 -312 -61 35 191 199 -102
6949 -102 -62 214 132 156 91 -267 52 -315 -56 -274 108 123 -100 -73 -138 -119 229 42 -273 -206 -132 210 -188
6972 -188 -212 -400 97 -67 -62 259 88 -171 -220 -8 118 34 -12 -52 -55 109 -193 8 132 36 -145 92 94 109
6996 109 106 343 -398 -99 93 14 65 49 187 15 34 -18 145 3 149 -30 44 79 137 103 -204 133 83 -273
7020 -273 52 22 43 -132 -179 -50 7 133 -175 -21 -44 116 14 95 117 -265 -308 -91 151 205 4 189 68
7043 68 219 -59 -66 235 232 -35 -116 103 -53 138 -307 48 -55 97 -229 -69 -100 154 -159 -26 -125 128 -84
7066 -84 -248 -290 41 -123 -103 -83 89 207 -34 -62 -161 -33 174 56 87 226 -52 336 -201 85 -114 324
7088 324 10 10 168 -39 -118 92 28 -446 -279 318 -31 1 245 -242 169 -140 -21 -148 -157 126 119 41 104 55
7112 55 -78 -68 -77 61 162 -76 -277 -10 178 126 -53 -7 -102 26 134 9 72 11 148 -153 -184 -250 167 -78
7136 -78 77 91 -94 -283 -86 -73 117 57 110 -285 -31 3 -167 -63 104 142 68 -131 -8 -104 15 53 119 63
7160 63 -63 43 74 -80 -24 357 243 -156 -130 21 -173 -7 162 -194 -16 89 80 161 -44 402 -59 -8 222
7183 222 -95 -184 -23 194 -228 87 -215 -89 159 175 -68 -56 -48 32 -197 139 37 249 71 76 -30 372 -23
7206 -23 204 87 97 33 66 -175 136 56 -66 -327 109 -37 19 21 25 55 -47 -116 9 251 -120 -119 -267 -195 106
7231 106 188 122 -66 5 244 118 -54 -7 55 -12 -274 123 -44 -215 191 -50 -291 98 -20 -87 291 -133
7253 -133 11 52 -136 292 -11 -51 52 -192 -32 92 213 216 -70 19 -25 191 -97 236 279 69 124 71 96
7276 96 22 -94 334 -69 -124 355 -384 6 -34 -244 -142 -25 -425 -120 -226 -31 -231 32 127 -129 -104 -159
7298 -159 330 118 141 -295 129 81 9 -212 288 -54 -183 -42 94 172 69 -16 1 39 228 45 -89 -15 -8
7321 -8 27 15 -46 127 92 -176 455 211 286 -117 -147 103 148 -64 235 -271 -88 -80 -215 74 -63 -13 -322 142
7345 142 187 76 146 50 -55 57 232 -266 -140 36 -147 178 -128 -49 150 54 5 -182 -43 220 188 -69
7367 -69 244 216 -212 -57 -274 19 -147 67 -123 -37 -98 -156 -267 59 -165 392 -53 7 -5 9 -18 -49 30 -50
7391 -50 -14 -99 -178 52 237 159 -114 -328 -167 80 42 77 -120 -128 -42 -90 30 95 11 86 -1 -17 15 -12 -116 -135
7417 -135 -45 75 212 7 232 -11 -8 179 -274 43 100 116 66 39 98 55 43 -63 -213 192 35 225 229 15
7441 15 -49 -9 -92 -90 23 32 -309 130 254 -101 6 -121 20 -62 129 67 -111 -45 11 -34 -187 -15 151 3
7465 3 -98 45 116 -27 -86 -53 -131 -204 -331 176 106 -141 143 239 232 134 155 -53 -31 -52 -152 62 85 13 51 191
7491 191 183 -248 -187 -149 -20 52 -27 -18 -153 30 -107 -258 83 62 32 -58 199 -39 -17 -77 40 -93 -296 53
7515 53 -118 153 -144 202 147 285 116 220 77 37 197 68 -19 -2 -177 225 -136 377 -61 -144 -48 44 230
7538 230 83 -125 -180 105 -58 -27 -188 102 66 5 144 -13 -71 -70 451 -40 188 62 150 -147 128 100 -54
7561 -54 -208 -24 -134 155 -60 -114 91 -225 279 -130 -50 -298 -187 178 -135 128 -43 -121 191 84 89 33
7583 33 -67 -171 -161 104 117 -93 122 96 143 -258 56 -328 -34 55 -116 83 178 -252 -195 -149 191 -87 51
7606 51 -130 -69 61 136 -159 -42 -11 113 -248 204 152 -437 -227 -315 121 210 40 -152 84 -99 54 244
7628 244 151 -83 39 -177 -68 -110 156 -70 -302 68 334 -199 96 49 -70 -198 147 -4 38 -54 250 -130
7650 -130 65 -141 387 314 136 159 106 -68 -246 -283 262 -26 54 42 -22 -26 221 -54 -207 23 -35 -72 130 -279
7674 -279 5 -53 16 156 -196 -58 7 -23 -13 -71 21 -160 -3 -6 -257 -79 165 -95 -15 -99 84 115 -172 -152
7698 -152 53 32 17 -348 -229 70 34 174 -70 236 35 210 5 -78 182 108 83 -34 -227 -281 -236 -55 -122
7721 -122 148 -30 -110 133 13 104 358 -290 87 -196 68 387 -384 221 -108 97 115 -13 88 -40 88
7742 88 -29 128 63 -157 -91 -171 -71 -69 -34 -56 -22 -89 248 -46 245 -105 -254 313 -160 -8 -315 -134 126
7765 126 -234 38 -140 239 28 -67 65 154 -104 -268 78 -134 182 7 27 -3 -203 -107 119 88 -37 -190
7787 -190 -54 -244 4 -137 206 148 50 240 74 114 -134 -250 58 44 267 -13 183 -248 -51 197 436
7808 436 196 234 163 -91 67 -150 -131 -166 175 136 -57 -204 -38 -71 29 -102 65 -65 -396 -136 129 -475
7830 -475 -179 -199 -59 -90 44 -60 -284 -104 38 40 -283 -59 -68 -64 226 466 101 -51 7 28 -93 -227 126
7853 126 -210 -71 -36 145 -207 -3 -69 53 -438 -82 33 -30 193 -74 150 116 127 241 139 79 49 57 46
7876 46 -33 68 27 136 144 -42 19 -28 -58 237 52 -144 -333 -85 217 91 -65 113 186 170 172 254 -12 97
7900 97 96 -146 100 -23 -86 -168 292 60 112 -118 -109 -183 -111 3 1 74 -15 267 102 154 -40 -72 -183 -122 200 -188
7926 -188 -51 97 -63 49 -114 92 -156 -40 321 -210 -306 -93 -153 -176 80 -128 -85 -55 -211 -78 -116 92
7948 92 17 57 147 320 90 172 42 98 68 58 62 -137 56 -202 -34 101 -331 -433 -17 -254 32 -141 -256
7971 -256 -250 -48 47 -199 153 -64 -88 103 -5 114 -12 -100 -89 -54 -324 -128 -156 48 118 90 14 187 -37 193
7995 193 -152 125 83 31 206 148 -132 -222 277 -213 5 -292 67 -89 272 -215 41 46 -189 -220 -45 294
8017 294 -15 -97 -89 -83 -50 -224 -204 -30 -138 -40 228 -26 -22 -6 -217 -139 12 65 -421 -180 62 -181 9 -234
8041 -234 288 38 132 89 -10 -63 -149 249 77 143 -73 -68 224 -99 17 45 -81 -40 174 -286 18 127 -68
8064 -68 402 48 -27 88 8 -128 -6 307 -34 153 108 113 152 23 -42 486 206 108 85 -276 -100 -25 -114 -175
8088 -175 35 58 173 72 211 193 -300 32 -45 180 -412 360 73 -156 188 -187 224 10 -198 -135 105
8109 105 30 126 109 -11 203 7 69 -5 12 -227 -68 27 -148 143 101 296 -26 19 -225 -5 204 -59 -73
8132 -73 -87 -133 31 0 151 183 24 -167 109 142 -116 111 -58 -17 -82 -336 -118 32 49 149 120 140 288 306
8156 306 -128 -64 3 96 -87 -55 -67 -141 -137 -306 194 -24 -341 -140 -10 350 157 -62 -189 -203 -196 466 51 -105
8180 -105 -226 28 -74 -11 -88 -157 13 -107 -103 -126 -73
8191g3
##END NTUPLES=NMR FID
##END=
