##TITLE=1H_LR-579-H1-CR5
 CDCl3, 8 sc, 
 24.6.2019
##JCAMPDX= 6.0         $$ Bruker NMR JCAMP-DX V2.0
##DATA TYPE= NMR FID
##DATA CLASS= NTUPLES
##ORIGIN= UXNMR, Bruker Analytische Messtechnik GmbH
##OWNER= root
$$ XWIN-NMR		Version 3.5
$$ Mon Jun 24 14:16:20 2019 Russian Standard Time (UT+4h)  she@DPX200
##.OBSERVE FREQUENCY= 200.13155
##.OBSERVE NUCLEUS= ^1H
##.DELAY= (6, 6)
##.ACQUISITION MODE= SIMULTANEOUS
##.ACQUISITION SCHEME= undefined
##.AVERAGES= 8
##.DIGITISER RES= 18
##SPECTROMETER/DATA SYSTEM= spect
##.PULSE SEQUENCE= zg30
##.SOLVENT NAME= CDCl3
##.SHIFT REFERENCE= (INTERNAL, CDCl3, 0, 15.7039)
##AUDIT TRAIL= $$ (NUMBER, WHEN, WHO, WHERE, WHAT)
$$ ##TITLE= Audit trail, XWIN-NMR		Version 3.5
$$ ##JCAMPDX= 5.01
$$ ##ORIGIN= Bruker BioSpin GmbH
$$ ##OWNER= she
$$ F:/spectra/data/she/nmr/H-F/1/audita.txt
$$ ##AUDIT TRAIL=  $$ (NUMBER, WHEN, WHO, WHERE, WHAT)
(   1,<2019-06-24 14:14:40.07 +0400>,<she>,<DPX200>,
      <created by zg, POWCHK disabled, PULCHK disabled
       configuration hash MD5:
       00 E9 B6 7A A2 85 ED C7 34 08 36 98 17 FE 4E 26
       data hash MD5: 16K
       11 91 F6 5D 5C F8 9F 28 38 60 A1 5A 46 99 AF C4>)
$$ ##END=
$$ 
$$ hash MD5
$$ 71 65 2B 2B A1 50 1C D2 14 9F 99 C1 77 58 8F B0
##$RELAX= 
##$RELAX= 
##$RELAX= 
##$RELAX= 
##$RELAX= 
##$RELAX= 
$$ Bruker specific parameters
$$ --------------------------
##$DU= <F:/spectra>
##$EXPNO= 1
##$NAME= <H-F>
##$PROCNO= 1
##$TYPE= <nmr>
##$USER= <she>
##$AMP= (0..31)
100 100 100 100 100 100 100 100 100 100 100 100 100 100 100 100 100 100 
100 100 100 100 100 100 100 100 100 100 100 100 100 100 
##$AQSEQ= 0
##$AQ_mod= 1
##$AUNM= <au_zg>
##$AUTOPOS= <>
##$BF1= 200.13
##$BF2= 200.13
##$BF3= 200.13
##$BF4= 200.13
##$BF5= 200.13
##$BF6= 200.13
##$BF7= 200.13
##$BF8= 200.13
##$BYTORDA= 1
##$CFDGTYP= 0
##$CFRGTYP= 5
##$CHEMSTR= <none>
##$CNST= (0..31)
1 1 145 1 1 1 1 1 1 1 1 1 1 1 1 1 1 1 1 1 1 1 1 1 1 1 1 1 1 1 1 1 
##$CPDPRG= <>
##$CPDPRG1= <>
##$CPDPRG2= <>
##$CPDPRG3= <>
##$CPDPRG4= <mlev>
##$CPDPRG5= <mlev>
##$CPDPRG6= <mlev>
##$CPDPRG7= <mlev>
##$CPDPRG8= <mlev>
##$CPDPRGB= <>
##$CPDPRGT= <>
##$D= (0..31)
0 1.2 0 0 0 0 0 0 0 0 0 0.03 0 0 0 0 0 0 0 0 0 0 0 0 0 0 0 0 0 0 0 0 
##$DATE= 1561371279
##$DBL= (0..7)
120 120 120 120 120 120 120 120 
##$DBP= (0..7)
150 150 150 150 150 150 150 150 
##$DBP07= 0
##$DBPNAM0= <>
##$DBPNAM1= <>
##$DBPNAM2= <>
##$DBPNAM3= <>
##$DBPNAM4= <>
##$DBPNAM5= <>
##$DBPNAM6= <>
##$DBPNAM7= <>
##$DBPOAL= (0..7)
0.5 0.5 0.5 0.5 0.5 0.5 0.5 0.5 
##$DBPOFFS= (0..7)
0 0 0 0 0 0 0 0 
##$DE= 6
##$DECBNUC= <off>
##$DECIM= 24
##$DECNUC= <off>
##$DECSTAT= 4
##$DIGMOD= 1
##$DIGTYP= 9
##$DL= (0..7)
0 120 120 120 120 120 120 120 
##$DP= (0..7)
150 150 150 150 150 150 150 150 
##$DP07= 0
##$DPNAME0= <>
##$DPNAME1= <>
##$DPNAME2= <>
##$DPNAME3= <>
##$DPNAME4= <>
##$DPNAME5= <>
##$DPNAME6= <>
##$DPNAME7= <>
##$DPOAL= (0..7)
0.5 0.5 0.5 0.5 0.5 0.5 0.5 0.5 
##$DPOFFS= (0..7)
0 0 0 0 0 0 0 0 
##$DQDMODE= 0
##$DR= 18
##$DS= 0
##$DSLIST= <SSSSSSSSSSSSSSS>
$$ [...]
##$SUBNAM2= <"">
##$SUBNAM3= <"">
##$SUBNAM4= <"">
##$SUBNAM5= <"">
##$SUBNAM6= <"">
##$SUBNAM7= <"">
##$SUBNAM8= <"">
##$SUBNAM9= <"">
##$SW= 24.9336996594482
##$SWIBOX= (0..15)
0 0 2 0 0 0 0 0 0 0 0 0 0 0 0 0 
##$SW_h= 4990.01996007984
##$TD= 16384
##$TD0= 1
##$TE= 0
##$TE2= 300
##$TE3= 300
##$TEG= 300
##$TL= (0..7)
0 120 120 120 120 120 120 120 
##$TP= (0..7)
150 150 150 150 150 150 150 150 
##$TP07= 0
##$TPNAME0= <>
##$TPNAME1= <>
##$TPNAME2= <>
##$TPNAME3= <>
##$TPNAME4= <>
##$TPNAME5= <>
##$TPNAME6= <>
##$TPNAME7= <>
##$TPOAL= (0..7)
0.5 0.5 0.5 0.5 0.5 0.5 0.5 0.5 
##$TPOFFS= (0..7)
0 0 0 0 0 0 0 0 
##$TUNHIN= 0
##$TUNHOUT= 0
##$TUNXOUT= 0
##$USERA1= <user>
##$USERA2= <user>
##$USERA3= <user>
##$USERA4= <user>
##$USERA5= <user>
##$V9= 5
##$VALIST= <valist>
##$VCLIST= <CCCCCCCCCCCCCCC>
##$VD= 0
##$VDLIST= <DDDDDDDDDDDDDDD>
##$VPLIST= <PPPPPPPPPPPPPPP>
##$VTLIST= <TTTTTTTTTTTTTTT>
##$WBST= 1024
##$WBSW= 4
##$XGAIN= (0..3)
0 0 0 0 
##$XL= 0
##$YL= 0
##$YMAX_a= 9995
##$YMIN_a= -15188
##$ZGOPTNS= <>
##$ZL1= 120
##$ZL2= 120
##$ZL3= 120
##$ZL4= 120
##$ABSF1= 10
##$ABSF2= 0
##$ABSG= 5
##$ABSL= 3
##$ALPHA= 0
##$AQORDER= 0
##$ASSFAC= 0
##$ASSFACI= 0
##$ASSFACX= 0
##$ASSWID= 0
##$AUNMP= <proc_1d>
##$AZFE= 0.1
##$AZFW= 0.1
##$BCFW= 1
##$BC_mod= 2
##$BYTORDP= 1
##$COROFFS= 0
##$CY= 11.3945322036743
##$DATMOD= 1
##$DC= 2
##$DFILT= <>
##$DTYPP= 0
##$F1P= 18.9103706918063
##$F2P= -1.10871071338519
##$FCOR= 0.5
##$FTSIZE= 0
##$FT_mod= 4
##$GAMMA= 1
##$GB= 0.15
##$INTBC= 1
##$INTSCL= 1
##$ISEN= 128
##$LB= 0.24
##$LEV0= 0
##$LPBIN= 0
##$MAXI= 10000
##$MC2= 0
##$MEAN= 0
##$ME_mod= 0
##$MI= 1.114404
##$NCOEF= 0
##$NC_proc= 0
##$NLEV= 6
##$NOISF1= 3.799351
##$NOISF2= 2.8
##$NSP= 1
##$NTH_PI= 0
##$NZP= 0
##$OFFSET= 15.70392
##$PC= 1
##$PHC0= -8582.316
##$PHC1= 13.80097
##$PH_mod= 1
##$PKNL= yes
##$PPARMOD= 0
##$PSCAL= 0
##$PSIGN= 0
##$REVERSE= no
##$SF= 200.130013532006
##$SI= 16384
##$SIGF1= 3
##$SIGF2= 2
##$SINO= 400
##$SIOLD= 16384
##$SREGLST= <1H.CDCl3>
##$SSB= 0
##$STSI= 0
##$STSR= 0
##$SW_p= 3612.71676300578
##$SYMM= 0
##$S_DEV= 0
##$TDeff= 0
##$TDoff= 0
##$TI= <>
##$TILT= no
##$TM1= 0
##$TM2= 0
##$TOPLEV= 0
##$USERP1= <user>
##$USERP2= <user>
##$USERP3= <user>
##$USERP4= <user>
##$USERP5= <user>
##$WDW= 1
##$XDIM= 8192
##$YMAX_p= 0
##$YMIN_p= 0
$$ End of Bruker specific parameters
$$ ---------------------------------
##NTUPLES= NMR FID
##VAR_NAME=  TIME,          FID/REAL,        FID/IMAG
##SYMBOL=    X,             R,               I
##VAR_TYPE=  INDEPENDENT,   DEPENDENT,       DEPENDENT
##VAR_FORM=  AFFN,          ASDF,            ASDF
##VAR_DIM=   8192,          8192,            8192
##UNITS=     SECONDS,       ARBITRARY UNITS, ARBITRARY UNITS
##FACTOR=    0.0002004,     1,               1
##FIRST=     0,             0,               0
##LAST=      1.6414764,     0,               0
##MIN=       0,             -15188,          0
##MAX=       1.6414764,     9995,            0
$$ Real data points
##PAGE= N=1
##DATA TABLE= (X++(R..R)), XYDATA
0@%%%%%%%%%%%%%%%%%%%%%%%%%%mJ2j6J6j6J6j6J6j6J9k3K8l2L2l6M1m5M9n3O0
46C2o8P6q4R6j09J23j42J63j92K33k95L95n82J064m502j1396O168J0733L373k449
66B637J585K570m356r555l079N689O229J647J432K550k279r294p108L006Q809
81D83N094J61o89j403n033n828m20N118M722J916J656Q45m579q723l830N700Q096
98C286K371j708j87j75m947o863l55P333O892Q82k305j883l038m960k282M208
114c731O917L080j471k260k119l637l634O71N665N830J730k222m249m765k863
129g058J726N412M195K16j412p37j982m686l413K898P297M618j220l783l173k775
145c877k200J351N536M936j13l447k557j266k109j825K261O083M417j275m960
$$ plain form
0 0 0 0 0 0 0 0 0 0 0 0 0 0 0 0 0 0 0 0 0 0 0 0 0 0 0 0 -4 8 -8 8 -8 8 -8 8 -8 11 -12 16 -16 16 -20 21 -24 25 -28 32
46 32 -36 40 -44 52 -57 66 -76 87 -105 128 -167 228 -354 710 -3792 -15188 -9020 1713 5086 2637
66 2637 4222 6792 2436 -7119 -10198 -4509 1720 3367 4799 7349 5070 -4224 -11332 -8326 483
81 483 5577 5738 5049 3646 -1387 -7215 -7635 -2517 2205 4121 5777 6622 2043 -6680 -10510 -4810 3286
98 3286 5657 3949 3762 3587 -1360 -8223 -8578 -1245 5647 6529 4224 2341 -697 -5657 -7939 -3731
114 -3731 3186 6266 4795 2535 416 -3221 -6855 -6184 -519 5311 7041 4819 570 -4195 -7058
129 -7058 -5332 80 4275 4491 3079 2342 360 -4326 -7739 -4841 2456 7074 5854 2071 -1102 -3877
145 -3877 -6077 -4726 810 5746 5633 2186 -371 -1637 -3746 -5571 -3310 2773 7190 5915 955
160I55m270j734M05K456M061L134j08k755l158k351j407O07L672M815J880k472
176C730m316l005r51O53K560M012K729q88l656l453j522L7J484L480L875R44l211
193B502m708k407O12J962K281K507J762o36l326l918j728J254L278L501J879q20
209C995l130l542j699P61K370K761K072M58j604l142k966r41J658L473L301J035
225D860j885l600k932n51J535K497K344J412k01k109l179k314Q3K447L416K316
241D139r1k335l275k221J5J903K690K141P13j057k567k832j358R92K851K962J356
258D026r03k564k848j532N77K281K682J685m1j745k708k271m64J790L021K368
274C354L55j673k609k174p21J047K337K449J207o98k255k654j594M69K311K809
$$ plain form
160 955 -3315 -5049 -4644 -2188 1873 5007 4899 2144 -1014 -3365 -4772 -4165 -493 4322 6202 3730
176 3730 -586 -3591 -4542 -3889 -1329 2683 5412 4524 868 -2585 -4107 -4070 -2586 894 4769 5713 2502
193 2502 -2206 -4613 -4001 -2039 242 2749 4511 3875 549 -3369 -5097 -3843 -565 2936 4815 3995
209 3995 865 -2677 -4376 -3615 -1245 1516 3588 4046 2442 -700 -3666 -4607 -2949 524 3825 4860
225 4860 2975 -625 -3557 -4108 -2573 -76 2268 3680 3479 1370 -1809 -4123 -4040 -1593 1823 4139
241 4139 4048 1713 -1562 -3783 -3768 -1865 825 2966 3679 2622 55 -2777 -4135 -3143 -292 2670 4026
258 4026 3123 559 -2289 -3821 -3244 -963 1719 3404 3363 1618 -1090 -3361 -3825 -2035 986 3354
274 3354 3709 2036 -573 -2747 -3468 -2421 -84 2365 3572 2874 619 -2035 -3629 -3160 -849 1960
290A960J579m43k054k427j613j07J476K436K067N00j352k469k230p92J120K493
306A44K414R01j093k321k193r57N74J839K227J507j15j782k503j748KJ738K459
323A093J785J76j490k303j819m48J116K109K014Q51q40k076k197j072O36K008
339d57K290J204m88j820k147j334Q7J503K193J665J62j399k178j722m19J118K112
356C70J918O46r96k019j897p93O26J768K031J170l98j772k116j255K52J552J996
373A083J409Q9j329k020j585k90J099J916J762N94r18j969j828o90P46J735J813
390A617R89m33j656j924j100K55J410J858J366R1j289j982j510j53J147J827J525
407B038M43q49j764j702o60P14J672J731Q12m62j488j776j089K44J418J806J190
$$ plain form
290 1960 3539 3096 1042 -1385 -2998 -3105 -1629 807 2874 3374 2022 -447 -2677 -3469 -2349 144
306 144 2558 3459 2366 45 -2148 -3105 -2531 -692 1535 3042 2927 1145 -1358 -3106 -3104 -1366 1093
323 1093 2878 3054 1564 -739 -2558 -3006 -1890 219 2233 3084 2244 168 -2029 -3101 -2465 -457
339 -457 1833 3037 2549 729 -1418 -2752 -2665 -1162 1031 2696 2858 1459 -719 -2441 -2860 -1742 370
356 370 2288 2934 1938 -81 -1978 -2771 -2145 -377 1654 2824 2426 654 -1462 -2717 -2465 -913 1083
373 1083 2492 2581 1252 -768 -2353 -2643 -1544 372 2134 2728 1810 -159 -1987 -2677 -1931 -196 1617
390 1617 2606 2173 517 -1407 -2507 -2252 -842 1016 2382 2473 1184 -798 -2308 -2461 -1314 513 2038
407 2038 2481 1632 -132 -1834 -2494 -1780 -108 1623 2435 1973 485 -1291 -2380 -2136 -718 1088 2278
424B278m3j215j787j409j74J133J792J399L17q95j616j504o11O58J574J623P81
441B301m71j476j690r77K91J413J731J068j65j252j626j156j07J028J613J341
457A866K80q40j524j428n85O25J616J616O58o71j470j412p36K16J219J652J054
474B136j72j300j531r68m4Q75J452J337L88q96j658j336l32P57J369J345O19m77
492A564j384j490p13L85J230J420Q76j43j126j441r88n5Q93J488J268K55r86j574
510e21j145j64O98J204J237O35m44j400j446n42N05J102J200Q13J8j015j563j085
528a913J08J158J417Q82L1p69j249j117l39O48J303J215M43n42j215j231n94L16
546a448J094J344Q42j94j193j456p47K88R76J074P79K27n92j295j228l04Q08J324
$$ plain form
424 2278 2235 1020 -767 -2176 -2350 -1217 575 1974 2291 1396 -220 -1724 -2335 -1677 -103 1520 2301
441 2301 1830 354 -1336 -2313 -2022 -609 1122 2190 2025 773 -853 -2009 -2116 -1088 525 1866
457 1866 2146 1306 -218 -1646 -2231 -1606 10 1626 2284 1613 143 -1269 -2005 -1789 -570 1082 2136
474 2136 1964 664 -867 -1835 -1879 -1004 448 1785 2173 1277 -381 -1717 -2049 -1292 77 1422 2041 1564
492 1564 180 -1310 -2023 -1638 -408 1012 1888 1745 619 -822 -1810 -1865 -972 516 1784 2039 1053 -521
510 -521 -1666 -1830 -1132 72 1309 1944 1500 100 -1346 -1888 -1383 -281 919 1732 1750 735 -828 -1913
528 -1913 -1805 -647 770 1652 1683 914 -335 -1452 -1791 -1143 160 1375 1818 1276 61 -1170 -1764 -1448
546 -1448 -354 990 1832 1638 445 -1011 -1758 -1470 -494 580 1359 1586 994 -301 -1529 -1833 -1025 299
564B99J029L15m94j104j206o24M35J237J239N16l61r90j065p04lQ11J243R89J06
583A668q79j340r28o2P42J087R10L65m32j110j196n19N11J170J061M53k87q63
601C51j086p44L4R06J239P86n8p91j094q47k00N99J154J060K85o80j172r16k12
620a386M36Q16R23O40j01r45j253p02K63R44J078O70j2q04j138p84N1O99R14P25
640A034L24l38j049j131l79N50J038R32M33k52r47j148n35M22R18P69M34J11m46
659G40j077j034j35R22J155O22J6m37q63r79l87N95J064P45J70j81n72j003q71
678a510J74J160J116K87l22n15o96q20k92P46J225O73j71n21n67p71o16L08J240
697A28J112Q7o93p43n02m14n4O86J078O28k40p38p93o42j43O47J164P30k08p15
$$ plain form
564 299 1328 1643 1149 45 -1161 -1785 -1350 -113 1126 1642 1281 291 -774 -1478 -1481 -670 573 1562 1668
583 1668 789 -551 -1479 -1541 -799 288 1198 1563 1131 21 -1175 -1694 -1183 -13 1048 1501 1214 351
601 351 -735 -1479 -1445 -539 700 1486 1428 637 -457 -1304 -1504 -905 249 1309 1594 914 -258 -1174 -1386
620 -1386 -950 -134 789 1429 1328 383 -870 -1572 -1309 -365 713 1383 1371 567 -571 -1355 -1304 -605 309 1034
640 1034 1358 1020 -29 -1160 -1539 -989 49 981 1414 1162 215 -933 -1468 -1046 -128 641 1075 1186 740
659 740 -337 -1371 -1506 -584 571 1193 1209 772 -91 -1070 -1457 -862 202 947 1117 936 364 -639 -1510
678 -1510 -1336 -176 940 1227 905 390 -306 -1126 -1418 -672 553 1226 1055 534 -33 -804 -1420 -1112 128
697 128 1240 1327 634 -109 -611 -1025 -1079 -393 685 1313 1073 335 -458 -1100 -1243 -596 568 1298 1090 375
717C75o33m67l57J56R41J031K65n91p56n72m39q2P36J258O15n50j018n39r8q7
737h12J25Q03J004K44p95j033n58mL52P41Q32L41n36q88n80j38R7M78Q79O69j83
758A038q76p94l26L7L84Q70Q61M7r39r21k05J96R7L00Q67P60l38j264r18J11N75
779d38M18M38N39J18p74j017l81L63N58M67M99K88m04j008p72Q0O38O70M62K17
799I61k96p63p12j25L48M75N26N53J01p52j120m38N04P82M04J88J52j91p93q18
819a014n3O70P37L62J24j41o07q90l53M88Q92N71L9k49m21n68m47K7N32P34M67
840I00M3n14q32n89Q4O44O64L06K2j91n24o79l50L60P75N76J36k05m64o53n04
861i95J40P67P15K10k47l88m38m69j96L83Q01N89J8m84o29m98j48L46O48N43J38
$$ plain form
717 375 -258 -725 -1082 -926 15 1046 1311 720 -36 -608 -1047 -1129 -393 865 1480 930 -88 -627 -725 -812
737 -812 -687 116 1120 1364 569 -464 -1022 -1026 -674 67 899 1240 704 -184 -764 -902 -805 -327 552 1221 1038
758 1038 162 -632 -958 -921 -537 333 1194 1241 302 -619 -824 -628 -531 -231 636 1396 1058 -206 -1124 -1013 -438
779 -438 -20 418 957 1075 301 -716 -1097 -734 -176 291 790 1078 674 -334 -1106 -1026 -388 282 744 961
799 961 665 -98 -810 -935 -587 -112 414 967 1068 316 -804 -1242 -738 44 448 636 788 597 -196 -1014
819 -1014 -1067 -397 340 702 826 685 78 -812 -1165 -677 215 786 825 576 155 -413 -860 -833 -301 433 900
840 900 943 429 -403 -992 -908 -264 400 706 728 537 13 -666 -1016 -656 119 695 831 626 162 -491 -995
861 -995 -855 -88 627 837 590 202 -236 -705 -901 -518 283 872 890 406 -223 -721 -869 -523 125 668 806
882H06k65m79n24l74O9N78P37L70j81n68n72l54K0M30O47M45k5m04n29m14k13
903h00K16O15O74K35l80o42n12j73K03M73N62L09j17m83n44l52k4M01O22M88M6
924H17m62o41m36kL38M80M75J84k24n23n40k55J80N07N77L18j36n34n70k90J06
945f31M03N07L85M5l52n60m44r3L10N57M95J84l09o00m68j27K35M40M42K84o2
966F41m53n80l46J09M36N27L47Pl76n53m08l7L46N17L70J27k14m91n01k03K29
987e06M94M85K23j52m49m97k72R8L91M72L36K1l51n23m34j0L75M90L56Q6k33m66
1009f6m48j74K20M75M41J89j15m02m91l09R7M55N01K66n9l60m37l47m7L14M79
1030A82L79R2k60m72m34j42K29M77M24J49j76l93m15k56P8L90M79K77m3l72m47
$$ plain form
882 806 541 62 -462 -836 -767 -189 548 918 737 169 -403 -757 -737 -307 340 785 760 356 -173 -587 -800
903 -800 -584 31 705 940 560 -82 -594 -767 -564 -91 471 780 663 180 -364 -716 -740 -339 283 771 817
924 817 355 -286 -722 -724 -386 94 569 753 529 6 -534 -789 -609 -102 475 793 657 123 -447 -737 -631
945 -631 -228 279 664 709 357 -203 -647 -740 -430 127 622 806 497 -103 -571 -698 -463 -23 419 703 641
966 641 188 -392 -738 -629 -193 334 681 688 312 -241 -649 -686 -340 177 547 674 460 -31 -532 -735 -506
987 -506 -12 473 696 544 95 -402 -674 -576 -185 287 623 644 293 -230 -664 -674 -299 191 547 633 400 -66
1009 -66 -514 -688 -468 7 448 637 522 120 -371 -680 -583 -128 373 639 580 220 -217 -564 -611 -297 182
1030 182 561 653 393 -79 -513 -655 -426 51 475 624 448 55 -360 -616 -538 -148 331 608 565 193 -254
1051b54l25j3L05M65L61M4k69m23l81j25J98M40M23J79j80m08m20k16J17L78M32
1072C28K44o4l17m07l15rK78M58L62M5l14m04l66q1K28L99L67J41j67l73l66k36
1094e69R2L68M47K54r8l49l98k76PL10M22L06kk73l50l10j23J54M11M18J53k28
1116C66m24l24j34J06L15L73K53o1l39m04k53N7K77L89K82M2k65m16l04k3K19
1137b68L47L09J36j42l56l86j87J54L66L74J80q6l28l68k21N6K88L38K47K3k16
1158B60l70l39o0K37L74L28P4j93l63l16j22J54L22L34J26o7k47l56k68J3L32
1179a47L96K23n1k61l04k51p7K09L77L13M3k20k96k81j31J18K94L57J92j16l46
1200D1l31j35O7K52L09K19L0k35l57k78m6K68L67K48ok08k53k19j64P9L37L72
$$ plain form
1051 -254 -579 -592 -287 178 539 583 314 -109 -490 -615 -417 23 446 625 445 37 -383 -599 -482 -104 328
1072 328 572 508 191 -216 -531 -540 -262 196 558 603 289 -115 -481 -562 -334 65 432 573 406 33 -333 -569
1094 -569 -477 -109 338 592 494 145 -253 -529 -522 -212 210 516 514 241 -109 -419 -542 -388 23 441 594 366
1116 366 -58 -382 -516 -410 -95 278 531 470 131 -273 -526 -469 -192 197 479 521 256 -160 -464 -487 -268
1137 -268 79 388 524 382 26 -360 -547 -393 -27 347 527 441 113 -255 -476 -420 -132 206 453 476 260
1158 260 -110 -449 -509 -272 102 430 504 311 -52 -368 -490 -336 -14 320 446 379 132 -224 -492 -479 -147
1179 -147 249 472 421 160 -144 -395 -472 -263 114 427 470 250 -46 -327 -458 -340 -46 311 503 387 41
1200 41 -290 -425 -358 -106 203 422 452 217 -140 -418 -464 -196 171 419 413 205 -48 -267 -431 -352 -15 357
1222C57J41j94k98k46j36nK13L95K86q1l71l15j09N5J20K29K86J27j74l61l02
1243c83n9J75L00K80J09j35k86k81j16O8K25L31K00o7k88k71j25j3J23K89L35
1264D11R1k82m07j81P4J44J53K10K07m0l35l65j17J88K70J93J17Rj80l16k50J9
1286c87K57L15J74Kj92k59k06o2J12K60K92J27j59l42k39l4J29J45J97K19M4k63
1308A30l88j85J33K53K25J17K7j08k75k67m2J88K91J98L6r8k19k43j40Q4K61K99
1330B77J42j26k77k46p0P7J49J82J98O6j64l38k59N7K24K04J59O8r9k30k78j01
1352c85J53K71K16M5n8j71k39j68PK31K79J61m4k25k37j30L0J20J76K06J13j15
1374B36l02k67k6J95K26J36Q3k2j88k80j50R9K44J89J03jj30k46k12kK00K72J36
$$ plain form
1222 357 498 304 6 -240 -376 -381 -168 227 513 432 61 -254 -363 -308 -188 41 327 454 280 -81 -383
1243 -383 -442 -267 33 313 422 287 1 -280 -396 -328 -103 228 428 361 73 -198 -323 -336 -213 76 411
1264 411 502 220 -187 -368 -294 -150 3 213 420 380 45 -320 -437 -249 21 214 331 340 160 -156 -406 -387
1286 -387 -130 185 359 361 169 -90 -296 -358 -246 14 306 433 274 -68 -307 -341 -212 -67 130 349 393 130
1308 130 -258 -443 -310 -57 168 285 312 204 -71 -338 -380 -192 99 297 333 235 16 -227 -367 -283 -22 277
1330 277 419 293 16 -230 -300 -223 -74 108 306 372 208 -130 -389 -332 -108 96 255 323 224 -6 -284 -385
1352 -385 -232 39 255 300 242 71 -168 -336 -329 -98 181 342 298 73 -164 -294 -264 -144 32 238 351 236
1374 236 -66 -333 -359 -164 62 198 281 259 71 -209 -359 -260 -16 173 276 275 145 -101 -313 -315 -115 157 293
1397B93jj30k14j85n5J07K15J68R3m2j86k69j50J00K55K03N2l3j20k14j82j2J93
1420a14K42J16Mr8j77k33r4J45K83J94oj14j38j76j19L3K10K28R2o6j30j95j71
1443b84k8K10K78J09o1j34j38j37p5P6K30K20L3j22j75j66j12M2K20K55O0j08
1465A93j69j23j04l5J17K42J73l8j72j78j25m6P7K34K20J7j67j92r3n7K5J35K22
1488A56J51p0k22j91o8M2J13K00J31mj62j86r7qP9J78J97O2j31k17j52k5R0J43
1512IJ76R2p2j81j68o5K2J27J71J44jj50k44j07N1J27J43J36J9j00j68j54l9P1
1536a61J56J55R6o0j72k10o9P3J74J33R3j6j28j66j10qR7J80J45K4r8j81j62k6
1560b41J10J88J16K7o3j15j51r1M3J47J68R8m3j35j42j20J1J24J63J03L2j21j52
$$ plain form
1397 293 292 162 -52 -237 -292 -185 30 198 291 249 63 -206 -356 -256 -1 202 254 221 101 -113 -295 -307 -114
1420 -114 128 244 248 150 -27 -260 -354 -209 74 268 262 148 10 -166 -285 -252 -42 186 278 212 82 -113 -284
1443 -284 -312 -102 176 285 224 90 -48 -185 -260 -184 46 266 299 177 2 -164 -276 -234 -14 241 301 193
1465 193 24 -99 -203 -238 -121 121 294 256 84 -94 -219 -265 -188 46 266 283 116 -76 -169 -226 -201 -66 156
1488 156 307 237 15 -176 -244 -202 -89 111 242 238 76 -110 -207 -215 -136 42 239 301 170 -47 -199 -224 -134 9
1512 9 185 277 205 24 -144 -209 -187 -60 111 255 254 104 -140 -247 -196 -69 74 210 229 129 -39 -193 -232 -161
1536 -161 -5 150 246 186 14 -196 -265 -192 -18 115 208 192 64 -102 -212 -220 -123 57 202 226 128 -53 -215 -241
1560 -241 -131 57 173 200 137 22 -129 -220 -177 -30 138 236 193 58 -84 -204 -193 -69 94 197 229 108 -44
1583d4j48k5Q0J69J56L9o1j63j51o4O7J27J58N8l4j15j45r0k0J11J73J45j4j42
1607F7j73q5LP2J29J25Q2p7j56j51l5O9J05J35R2j4j43j65q6M6J25J28P8J9r0
1632A00j50j26k7J03J59J24K8q2j60j24nM5J07J23Q7j0j41j64r7N5J28J24O6Q
1656A71p0j71j34J4J27J26Q7Nm8j05j48p5O6J67J42J7o2j12j06o1%J06J40R6K
1681A74j20j46r7J0R5J46J01Qn1j37j32m0P7J40J13L5m1j10j20r0M4J17J45O8
1705A89m2j09j06o5k3P0J26J31K3j01j53j02rP5J15R8L6l8j16j17n8M3R7J35O6
1730A65k3j05j29r3J4J06J47P1k4p4j10p6k8N6R7J41M4p1j31j03l7N0J04J12O5
1755A68k7j03j26o1K0Q0J07R5J9r0j34r6lQ6J10Q2L4n6j05r8o2L4J17J11O0l2
$$ plain form
1583 -44 -192 -217 -137 32 188 227 166 3 -148 -212 -145 -18 140 198 164 49 -96 -186 -206 -95 78 223 209 67
1607 67 -106 -191 -188 -116 13 138 220 143 -13 -164 -199 -130 -25 110 202 188 45 -120 -206 -160 -35 93 171 190 100
1632 100 -50 -176 -203 -100 59 183 211 129 -31 -155 -160 -115 -8 115 202 192 51 -113 -210 -155 -27 97 163 171
1656 171 101 -70 -204 -190 -63 63 150 155 107 2 -146 -221 -155 12 154 171 109 -3 -109 -170 -170 -64 76 172 174
1681 174 54 -92 -189 -179 -84 62 163 171 120 -17 -149 -189 -112 28 141 176 135 25 -95 -185 -141 -24 121 189
1705 189 147 38 -68 -133 -156 -86 40 171 194 93 -60 -162 -171 -96 19 117 153 115 -1 -118 -176 -133 -36 99 165
1730 165 142 37 -92 -185 -171 -65 82 153 129 55 -55 -131 -159 -103 -6 135 179 108 -23 -126 -163 -113 -9 103 168
1755 168 141 38 -88 -149 -129 -49 58 153 172 82 -52 -148 -151 -65 45 127 161 105 0 -98 -160 -126 -9 102 162 130
1781A30j13j15p2L1J03J03N9Pp2j20p6k7O6J20R9L6o7j17j24j0N9J17Q1L7o0n1
1807B4q5q0jQ9J42P2k8r1j11o4RN7J12R3J3q2p7q6l2K1R1J25N5m7j19r6l5L5P9
1836a7Q5O0j1o7j05p6KN7J02R1J9o6j25q7nO8Q5P5L5k2j01j09m1K8R9R4O5qr8
1865B7j01o5K2Q3P8N7K0m8q3r4l2N9J04Q8L4n4q6j05l9N7R1P7L0Mo2j00r4KR4
1894c6R7P5k1o1q5q0k1N2J13O7J1m1p1q2n7K6Q6J13N1n2r3o7m7J0P1P9N8qm0p1
1924b4j00k3P3J16P1mm9o5p8m0K4J01J03Nn1l0o0o2k6P0J37P5m2j06p0k3MJ6P6
1953A8Q8Rm5q8o5l4K9R4Q4L7m6p5o5m7lP0J03M9k8p0o6k7k4LJ18J14qr6r6j3k
1984h2lM9R4P0k2j05r6j7M2N6O2N4Ko7p2o2J4N4O1O8Om4o4p1j9QR0J07K2o7j05
$$ plain form
1781 130 17 -98 -170 -139 -36 67 126 133 61 -59 -135 -162 -96 24 123 159 92 -25 -149 -159 -100 17 98 135 75 24
1807 24 -61 -141 -142 -53 89 161 133 42 -69 -133 -124 -67 45 138 151 69 -8 -94 -126 -105 -14 111 166 119 0 -96 -131 -96 -17
1836 -17 68 128 117 50 -55 -131 -129 -72 30 121 140 74 -51 -138 -143 -75 10 85 120 98 -3 -112 -153 -125 -26 68 133 125 27
1865 27 -74 -139 -117 -34 44 101 121 73 -10 -104 -136 -77 27 115 149 95 9 -96 -135 -78 13 90 120 124 62 -38 -132 -130 -36
1894 -36 61 136 115 54 -31 -111 -132 -80 33 100 111 70 -1 -83 -140 -114 -28 85 136 84 -9 -76 -123 -113 -42 37 95 87 47 -24
1924 -24 -124 -147 -74 42 113 109 60 -5 -83 -123 -99 2 105 110 59 29 -31 -93 -119 -49 88 163 121 15 -55 -78 -74 -58 18
1953 18 106 115 70 -18 -83 -117 -88 6 90 127 81 6 -59 -106 -109 -39 64 113 85 15 -51 -78 -102 -99 19 133 125 29 -67 -80 -82
1984 -82 -85 -36 58 128 106 1 -95 -112 -70 -14 48 102 104 37 -35 -97 -83 -29 32 100 106 62 -2 -73 -92 -84 6 113 135 68 -37
2015c7l7NK0J6N0Q3J9q4j12m2M7M2N4O5J9p1q7n4kM2O9M7L8l4p0o5k5OO3R2M4
2046A01k3r3o0j9L7J1N3O5M2m8j19n4J7O2M8L8M2j2q6q3j5M6O3M3K8Pm8q7n6K6
2076g4O5O2L7km5p7n7QM0M1N4M9k1p9r5k1N1P1K4J9Om5q2m3J7P9M5K7K0l1o3r4
2108a14lP0P7M2Ll9n1o4jL1M6N6PK3n2q1o0L3Q3N2NOk6o5n6j7P4P2K4lk8m3o1
2141f0k0K4P7M9%k7m7m5l7K0M0P2K4Jn9n6m9j0P2N9M6j5l8m2l6m3K2P0P4J1k4
2172E3o2m9j7NN2N6N3l7n6l1m2QL8N2N3J6m1o5n1ML1N4N2Pl5n3l2k8J1L7O9N1
2204A03l0l9p5j8J3L6M8L0ml6n6l4JK3L5N2J9qp8m6k0L8N8K0K7kk8p2k6PL1O4
2236C3K3J1m1n5l9KM6N2K0J6k7k3o8k4L5N5M9J2lm8n3m2K8M7M4J9ml3m2m2qM3
$$ plain form
2015 -37 -74 -69 -49 -33 17 100 119 35 -77 -119 -72 -30 24 89 108 37 -50 -104 -106 -64 5 52 90 56 -14 -79 -104 -98 -35 57 101
2046 101 78 -15 -75 -94 -57 -46 7 72 114 66 -53 -107 -90 -28 20 58 100 88 2 -81 -96 -50 13 56 84 91 43 -44 -100 -74
2076 -74 -9 53 90 88 43 -34 -91 -83 -43 -2 52 101 80 1 -94 -115 -64 7 31 50 56 11 -71 -114 -97 -18 27 54 74 43 -20 -114
2108 -114 -117 -47 30 72 75 36 -15 -79 -80 -49 -3 53 60 83 31 -50 -110 -77 6 58 63 69 43 -22 -78 -95 -21 51 75 72 44 1 -60
2141 -60 -80 -56 21 70 70 43 -4 -49 -86 -66 -26 46 70 71 12 -44 -93 -103 -31 28 74 59 21 -21 -57 -100 -78 -8 66 77 53
2172 53 -9 -58 -75 -70 -18 38 91 54 -2 -33 -75 -67 -29 23 76 92 51 -14 -65 -61 -30 24 76 83 48 -5 -37 -65 -54 -17 52 103
2204 103 73 34 -41 -59 -46 -10 38 68 64 28 -28 -62 -61 -38 -3 49 68 60 -18 -64 -84 -46 12 32 59 57 29 -43 -69 -62 -31 33
2236 33 56 67 26 -29 -68 -66 -20 32 52 68 41 18 -50 -74 -39 16 65 77 74 26 -27 -69 -41 6 50 69 65 32 -10 -52 -60 -17
2268a7M3M5j6k0n1m5k0K1O6L7lpm2k3m4rN7N5L0j1m4k9l1j0K4N1M9Kl6m2l6j0
2300f6K7M1M4J7k9l1k9k7KM6M6K3j7k4l4l4j0K8O5M3lm6m4k2j2J1K3P4J7k7n9
2331gl7kJ4J4M6L9j7m9m7k2RL7L8L3jl0m6k2nPM5N6J7l2o5l0NOK1N1M5j2m4m6
2365c1k4K9K3J4M5J4k8n9l6J1M2K4KK5J4m7o6j9L6N4J8K0k3k4l9l1J8J6N8J3L
2396E2l8l4l0kK0M5K9lj0m6l2k3L4L4K6J1J2m4l7l4J0N1N1Qk6k0j3j6l9K9N2M3
2428F0nl3k7j5j2RL5L0L0j6m1m3q%L9L6PJ3k6n3k5QK1N1J7j1j5l0k4l2RM6M5P
2462D7k5l2k4j7kK4M8K9j3l4l5j2QML6K5L3k4o3k2KK0L8K1%Kk8l6j6J6L2L9K0
2495F1j7k6l4k3J1K5L0K5Jl3k3k0pJ9J4L2K4j4m1m2j4L2K9J9%mqm0k7kM4L0Rj9
$$ plain form
2268 -17 26 71 55 35 -16 -61 -81 -60 6 43 40 33 -9 -32 -76 -85 -28 27 57 46 2 -27 -58 -68 -44 7 56 58 22 -20 -56 -66
2300 -66 -39 2 46 63 34 3 -26 -53 -51 -5 41 64 47 23 -11 -45 -55 -27 38 81 78 32 -12 -34 -46 -35 -12 62 79 52 -7
2331 -7 -44 -46 -32 -18 28 67 50 1 -46 -68 -59 -22 16 49 48 18 -28 -50 -55 -48 -3 53 70 38 -27 -57 -52 -46 -25 26 71 59 15 -31
2365 -31 -55 -26 -3 11 56 70 42 -17 -53 -42 0 24 26 51 65 18 -48 -67 -31 23 41 61 38 14 -25 -56 -38 -22 36 49 52
2396 52 14 -20 -50 -52 -32 13 42 39 29 -17 -49 -72 -38 -4 22 33 45 1 -36 -70 -60 -9 42 50 24 4 -9 -25 -64 -35 17 60
2428 60 55 22 -5 -20 -32 -23 12 42 72 56 15 -28 -36 -36 3 39 46 59 33 -20 -45 -37 -16 35 52 41 26 -4 -28 -60 -51 -5 40 47
2462 47 22 -10 -34 -51 -53 -29 19 48 35 1 -34 -46 -38 -34 2 27 60 36 -27 -49 -47 -27 11 32 32 34 6 -30 -46 -30 2 41 61
2495 61 44 18 -16 -39 -28 -3 27 52 53 20 -3 -23 -30 -11 3 35 59 45 4 -38 -52 -20 9 28 28 24 16 -24 -51 -53 -9 21 30 11
2529A1%j9k7j4J8M3K4pj4l5nrqL5L9K0j6k8m1pK2J9K0K4J2k9k8j6k5K5M3K5lr
2563D0k1l4j1PM1K6J0l2j7j6kj9J8K5K9kl4m0jJJ2K4K9Oj9m3j1j0L1J7K4J3j7
2596B4l2k3qL0j2L2L0nj7m6PRpK3L3J2j9l4l3J6J6J1K1J1J0k3m1k2K9J2K4J0J2
2629E0j9m5k0J9J7K1J5j0j1j8l1k0M3K2J0Oj7k4k7j1K0K8J1LJ3pm2l0OK9L1J5
2661B7Mj2l0k8lL0L0kJ2Mk2l1j9OL6K8Nj7k0oj6rK6L6Qqj7qj5k6L0K5K0jj4k8
2697ek4%KM2MJ2j3rk7k6lK2M0J1oj9j7j4kJ2K2K3qrk5j4mmK3L3J9j5j6k4mMKL8
2735B1J1jk1j3j6MRK1K2Kk7%k4qkK9L5kj3l5Jj4R%K3J8kj8k7j4MJ5J3J8J3j7k7
2772a3j5%QRK9klj7k6%jK1J3L0kk9j7j3jJ7K0K7%j3k8j6J4NJ0OK7lk4j8k6K2K1
$$ plain form
2529 11 11 -8 -35 -49 -31 12 36 29 15 -20 -25 -34 -42 -7 32 52 36 8 -33 -40 -18 1 21 45 57 28 0 -16 -41 -16 27 52 49 40
2563 40 19 -15 -26 -19 22 48 58 26 9 -7 -9 -28 -10 15 44 42 8 -32 -33 -32 -20 4 33 39 20 -23 -34 -44 -13 4 28 41 24
2596 24 -8 -31 -39 -9 -21 11 41 36 19 -27 -20 -11 -18 5 38 50 31 -3 -36 -20 -4 7 28 39 49 26 -15 -37 -8 4 28 38 50
2629 50 31 -14 -34 -15 2 23 38 28 17 -1 -32 -52 -9 13 23 29 12 -12 -39 -50 -30 -2 9 12 25 18 -24 -54 -48 -19 12 27
2661 27 31 19 -11 -39 -42 -12 18 16 28 32 10 -21 -40 -34 2 30 35 18 -2 -8 -24 -33 -7 29 37 29 12 4 -11 -37 -7 18 38 37 23 -5
2697 -5 -29 -29 -27 15 19 31 18 9 -18 -44 -47 -25 15 26 20 1 -16 -30 -32 -20 2 25 17 8 -17 -31 -35 -39 -16 17 36 21 5 -19 -23 -19 -17 21
2735 21 32 31 10 -3 -19 -15 -6 15 37 39 12 12 -12 -20 -22 7 42 40 27 -8 -7 -21 -12 -12 11 29 27 9 -18 -32 -28 -13 0 18 31 14 -13
2772 -13 -28 -28 -20 -11 18 16 13 -4 -30 -30 -31 -10 3 33 31 2 -15 -28 -29 -12 8 35 35 22 -6 -22 -8 -3 7 13 40 37 13 -5 -31 -9 12
2809A2J7Joj0j9j1j1J1K3K8j6%k4nj3J8KK4Mmm2qNPJ1NK0jk1k4j4J0K1K2Nnlk4
2847a5j3pKM0K1Jol0j5pJ9J1K4PLl1j0oMJ0OJ5MNl7j9RK2RJ4oqqj8j3oL4J0K0
2886C5k4j3nLj7NK6J1ok5o%j1J6RJ0MMl4jj4J7J5J0Lljk7j3JK2K4K9j9j8j3Ln
2924h%J6K0K0j8l3rJ3j0J6RK6Nl9j8%OJ6pJ5Nqk0k6KJ7J9NJ1k3k1j0LJJ8K6lj
2962A5j2j2j9K5J4kNJoj6j9J2J0J5KKqPk7j2K1J6K0j1j0jqrnK1J9J8j6k0lk6J2
2999gRK1J4l1Qj2jl3K2J5J0Mrnk5pPJ6J0Mmj6qNjNlL2j2j1ppnLK7RQj9j8J2qj1
3041a9J8J5K4j2k7j7J4kPJ2J7qj4k9J0L%OK9Lk0j0KlqK4rK8j9j7j2j3QNJ9J5o
3078A4j3k5JNqJ6J1K0ll8j0K0MqK5Qj2Ml3KK4pJ6oNLj7rJ2qK7PNj6nj6j3RK7L
$$ plain form
2809 12 29 30 24 14 -5 -16 -27 -16 7 35 19 19 -5 -10 -23 -5 -3 21 25 21 -21 -29 -24 -17 -6 -1 19 18 -3 -27 -41 -31 -10 12 17 12 9 -15
2847 -15 -28 -35 -33 7 28 29 23 -7 -22 -29 -10 1 25 32 35 4 -6 -12 -8 2 8 23 27 32 -5 -24 -15 7 16 30 24 16 8 -10 -23 -29 5 15 35
2886 35 11 -2 -7 -4 -21 -16 10 21 15 -10 -16 -16 -27 -11 -2 8 12 16 -18 -19 -33 -16 -1 9 12 9 8 -19 -32 -31 -9 15 44 25 7 -6 -3 -8
2924 -8 -8 8 28 48 30 -3 -12 1 -9 7 16 42 47 8 -10 -10 -4 12 5 20 25 17 -3 -29 -27 -10 9 14 25 2 -19 -29 -26 -25 -7 19 16 15
2962 15 3 -9 -28 -3 11 9 14 15 9 -7 -26 -14 -4 11 13 15 7 14 -13 -25 -4 12 32 21 11 10 2 -7 -12 9 28 46 30 10 7 -19 -7
2999 -7 2 23 37 6 14 2 1 -32 -10 5 15 19 10 5 -20 -27 -20 -4 6 10 6 -10 -18 -13 -14 -9 -12 20 8 -3 -10 -17 -22 -19 8 17 25 6 -12 0 -8 -19
3041 -19 -1 14 38 26 -1 -18 -4 -6 1 13 30 22 8 -21 -11 -8 -8 -2 27 30 10 0 2 -1 -9 15 6 34 15 -2 -14 -27 -19 -14 5 20 14
3078 14 1 -24 -23 -18 -26 -10 1 21 18 -20 -30 -10 -6 -14 11 19 7 11 -22 -20 4 -3 13 7 12 15 -2 -11 1 -7 20 27 32 16 11 -5 -18 -9 18 21
3118B1Pjj8j1j2J4RJ0JLlj7j5NJ3jKno%j0j4kL1J5j8rJ1j8KnJ3J4K6k2k1Jj4N
3157a9NPJ9Lj2j2pKOJ0J5OKj2oonK5J4nmj9j6JmK1ORmj0j2J1k1MJ1J0J9k0qol0
3198c2K0J3pJ8Nj5j4j1kJ8RQj2knrQJQQJ0j5mLoLRnK3j3kk3jJ7NNLMkj2k0LJ7
3241FJ0Nj6J3j0j3Nj3K2OMqj0j2oj6K6J0JOk5mJrJK7Nl%j8pmK2jNKKqj3j0%J6
3283a1K6jj3nOrj4J4J6K0pj0k7LRnK1NOJk0j2ONnJ6oQpk0Lj0J9OPrnj1Mj8RKK1
3326HLj8Qj2LKj0J0RKrj2J8j7J8KkOoj1mkJ9MJ4Ljj1j9LlJ0J8mQk0j3MKJJ7mJ2
3369B6j5j0j3kPRJ0rJ1k0Qk1J5ROmJlj1oJ1kPNjj4j0j%POJ6lqlq%MMK0pkj2lK
3414djJ1J3rQopjlJ2jjQ%j9RKj0K0nkkjj9nK3j1KlJ8k3klmPQNklj1mj4J7J2P%
$$ plain form
3118 21 28 27 9 -2 -14 0 9 19 20 23 20 3 -12 -7 6 5 7 2 -4 -4 -14 -28 -30 1 16 -2 -11 0 -18 -16 -21 -8 6 32 10 -11 -10 -24 -19
3157 -19 -14 -7 12 15 3 -9 -16 -14 -8 2 17 23 25 13 7 1 -4 21 35 30 26 7 -9 -8 -12 9 15 24 20 10 -2 9 -12 -8 3 13 32 12 4 -2 -32
3198 -32 -12 1 -6 12 17 2 -12 -23 -25 -7 2 10 -2 -4 -9 -18 -10 -9 -1 7 17 2 -2 1 -5 -2 7 2 25 12 10 -13 -14 3 8 13 16 20 18 6 -14 -11 6
3241 6 16 21 5 18 8 -5 0 -13 9 15 19 11 1 -11 -17 -33 -7 3 4 10 -15 -19 -18 -27 -26 1 6 3 3 -15 -22 -26 -4 -5 0 2 4 -4 -17 -27 -27 -11
3283 -11 15 14 1 -4 2 -7 -21 -7 9 29 22 12 -15 -12 -3 -8 13 18 24 25 5 -7 -1 4 -1 15 9 17 10 -10 -7 -17 2 8 15 6 1 -10 -6 -24 -15 -13 8
3326 8 11 -7 1 -11 -8 -6 -16 -6 3 5 -4 -16 2 -15 3 5 3 9 3 -8 -12 -14 5 9 23 26 25 14 -5 -2 -5 5 23 19 27 7 -6 -2 0 1 18 14 26
3369 26 11 1 -12 -14 -7 2 12 3 14 -6 2 -19 -4 5 11 7 8 5 -6 -12 -1 -3 4 9 8 -6 -16 -17 -17 -10 -4 12 9 1 -2 -10 -10 -6 -2 18 11 9 -3 -6 -4
3414 -4 -5 6 19 10 18 12 5 4 1 13 12 11 19 19 0 9 11 1 21 16 14 12 11 -8 -13 10 -1 1 -2 16 -7 -9 -12 -16 -9 -1 4 2 -1 -12 -16 -30 -13 -1 6 6
3460Fnr%qJ4J3JmKj1OnmLjJ4j6NJ3j9%OOMJ9j2pj9PnP%J5rLKk0kJ5KMj1%kooP
3507gkJ9Mk0KrmmNOK1j4oJ0j1%J6j0J3KJ1k4m%mK0kRpqoJROjJjJ1j7%LjJ0KpJ3
3553B5%k5O%lLjQkj9j5J7Oj0J9%nj1nlNQKJloj2%K6j4J4qQj1qQPrJ3nRqOj0LM
3599EPKj1QLjqLKJ8j3p%poNlQK1j7ooOrJ1qlJ5j0j1%MoJ3Mj7OmrPJ0jnPnj3J8
3646clrJJ1J%kmjJ5J0j1QMpj2J2j3J7kJ1opOj7Rj0lJ4OmjonoqL1olLmj1jkJqO
3693iRj6MljONMKjqj0JjK5kj8J2koj5K2kJ8LlnqpJJ2MJ5j5Jj0MjmJ1ojnKnqJ4
3740CJRklj3%Mj0K0o%kppoMPJ3pNj4MpKQOKKqnqQlPK0mqj0%j0JK0kJ6rnmMJNK
3791A4lJ1j2ppOlJ0j2K7k6Lq%OnJ1Jlj0Rk1NLkJ0Omj1OklOJ3j8QJkjomK9kj7O
$$ plain form
3460 6 1 -8 -8 -16 -2 11 12 8 10 -1 5 0 -4 -1 -2 12 -4 1 14 -5 -5 1 7 11 30 18 11 -8 -1 -6 1 1 16 7 10 12 -8 -10 5 7 11 0 0 -2 -8 -14 -7
3507 -7 -9 10 14 -6 -4 -13 -17 -21 -16 -10 11 -3 -9 1 -10 -10 6 -4 9 11 22 -2 -6 -6 -10 10 8 17 10 2 -4 -3 6 12 11 12 11 22 5 5 8 7 17 19 12 25
3553 25 25 0 6 6 3 6 5 13 11 -8 -23 -6 0 -10 9 9 4 -7 -12 -15 -10 -2 0 1 -2 -8 -20 -20 6 -8 6 -2 6 -5 -13 -5 2 -7 6 1 10 2 8 -2 1 5
3599 5 12 14 3 11 14 13 5 8 10 28 15 8 8 1 -5 0 -3 5 26 9 3 -3 3 -6 5 -3 -6 9 -1 -12 -12 -8 -14 -1 3 -14 -8 -12 -21 -14 -4 -5 -10 -3 -8 -21 -3
3646 -3 -6 -15 -14 -3 -2 -2 -4 -8 -9 6 16 5 13 17 10 -2 10 -3 14 12 23 17 10 16 -1 8 -2 -5 9 15 11 10 4 -1 -7 -15 16 10 7 10 6 -5 -6 -8 -7 -15 -9
3693 -9 0 -16 -12 -15 -16 -10 -5 -1 1 0 -8 -18 -17 -18 7 5 -13 -1 -3 -9 -24 -2 -4 14 17 14 9 1 -6 -5 7 11 26 11 12 2 6 5 1 12 6 5 0 2 -3 -11 3
3740 3 4 13 11 8 -5 -5 -1 -11 9 3 3 1 -6 -13 -19 -15 -8 5 -2 3 -11 -7 -14 -12 -4 2 4 6 -2 -7 -15 -7 -10 -3 17 13 5 -5 -5 -15 -14 6 4 20 11 6 2 6 7 12 14
3791 14 11 22 10 3 -4 2 -1 9 -3 24 -2 1 -7 -7 -1 -6 5 6 3 -7 2 -19 -14 -11 -13 -3 3 -1 -12 -6 -8 -11 -5 8 -10 -2 -1 -3 -4 -10 -14 15 13 -4 2
3836BpJLJ2qJ2kj0Qj0rJ5QmNNrj0%%NJ3Lj3lj1RnjJ2lqLKk3K5k5J9%j0pPnMJ0
3881@j0J1j3NJolj6J9J0KKmopPLJ4mjmOLkmMNJ2k0kJ6k2KJ0PojqLNj3J2LnRrj0
3928eJjLjJ4j5j0J7nq%ONmnJj0oJ6Mj1OLjpQk%MLNJ0k8J0j2J3kJNJ4Lk1QM%Qo
3975A2J0k1%%mJ3kJ4j5J4j2rjJ0qJ5j3%mOk0OQkNoqJ2j1%J9j1nQjpPpkkJ3Ppj
4019@l%NPnLKNnmjJ8rj8J4Nj6QNkLj1J1Rj0k0J0J0j2J3loKrOjOj1MjKj7NK0j3
4064dpJ5j0N%oj1%OOOOj1pJJQMPOj3kkjOJ1j3Q%nMoJ2mQj0J0j2LoMjLMj0J0rn
4112alMoJ7jpk%rRj0J1lrRlj5J6pJ1j7PlMnnJ1lRLljQlj2J4PKKj0qJ1KmQj1J4
4159A8lKj2L%kNKj4lKJmQJNj5%lrNJ1OpmlMj0JKjjJ0qLNJj0J0Qj4LJ1j0KPjLo
$$ plain form
3836 2 -5 -4 -1 11 3 15 13 3 11 1 -8 7 15 11 16 21 12 2 2 2 7 20 23 10 7 -4 5 0 -1 11 8 0 3 5 -18 7 -18 1 1 -9 -16 -9 -14 -10 0
3881 0 -10 1 -12 -7 -6 -12 -15 -31 -12 -2 0 2 -2 -8 -15 -8 -5 9 5 4 0 6 9 7 3 7 12 24 4 2 18 -4 -2 8 15 9 8 0 3 8 -5 7 10 5 14 5 -5
3928 -5 -4 -5 -2 -3 11 -4 -14 3 -2 -10 -10 -4 1 -3 -8 -7 -17 -23 -7 -3 -14 -8 -5 -6 -13 -5 -7 -7 -3 0 5 15 -13 -3 -15 -2 -4 -3 2 16 19 -2 6 10 10 18 12
3975 12 22 1 1 1 -3 10 8 22 7 21 9 0 -1 9 1 16 3 3 -1 5 -15 -9 -1 -3 2 -4 -12 0 -11 -11 8 -3 -8 0 -1 -8 -1 -8 -10 -12 1 8 1 0
4019 0 -3 -3 2 9 4 7 9 14 9 5 4 22 13 -5 9 14 -2 6 11 9 12 1 12 21 11 -9 1 11 -1 12 9 3 5 -4 2 1 7 -4 0 -1 1 -16 -11 9 -4
4064 -4 -11 4 -6 -1 -1 -7 -18 -18 -12 -6 0 6 -5 -12 -11 -10 -2 2 9 15 2 0 -2 -3 3 14 1 9 9 4 8 2 14 10 18 8 18 6 9 3 7 6 9 13 3 13 4 -1
4112 -1 -4 0 -6 11 10 3 1 1 -8 1 -9 2 -1 -10 -1 -4 -19 -3 -10 1 -16 -9 -12 -8 -13 -18 -7 -10 -1 2 -1 -2 6 3 -9 5 12 14 16 6 -2 9 11 7 15 4 18
4159 18 15 17 5 8 8 6 11 13 -1 -4 -2 -1 -5 3 4 9 -6 -6 -9 -18 -13 -2 4 -3 -7 -10 -6 -16 -15 -13 -14 -15 -5 -13 -10 -5 -4 -14 -4 4 -10 -7 4 -6 -4 3 2 5 -1
4208aJ0j1KQj3KJ1J0pJ0j0klk%J8jj2j9J4Olj1oQOnpkMlJ2jlLnorP%Qojo%jKL
4256a2J0NpMLj8OOMQOmqkoJ0QpOmMj3QLJ4j7%QLpNlj2OLm%j2J3j0J0r%Oj6llM
4304a4LOjnL%o%PkomLJ9j0JJ4k0QJ1j0rQOnJ1j5LnP%jJ6j0%jQO%j2nP%PnJ5pj9
4352cJLlJ0pJ8j5jop%MJJ5j8jKjj4PQMkpjLJ6j2NJLj9QNoM%PPj1mJ1mmkK2%j4
4400CJ1oNPj9NMJpjPj8QmJ5lj1J4rmKjOj6J0qLk%kO%nNk2PPKMPj3J3lk0J2j3J5
4447hOj1J7jqJ1j7J0K0j0nmkPrQQKqlJ4j1mLjj4J4Lkj4PkJ3Mk0ROJj9Nj2OPjJ
4492dmOm%KmKOkkjLrJ3kk%LLj0KRrJ9mjj4KR%mJ1pJ0Nj3qmK0qlo%J8k2RnJ4j1
4541CpLk%PJoJ2j3joKoRnJj1NnOMqOJLJ9k2nOkJ9j0J2pj7J5%KlQJRj0OPrkmNq
$$ plain form
4208 -1 9 -2 0 8 -5 -3 8 18 11 21 11 9 6 4 4 22 21 9 -10 4 10 7 -4 -10 -2 4 -1 -8 -10 -6 -9 3 2 -1 2 -3 -9 -18 -11 -11 -3 -9 -10 -16 -16 -17 -15 -12
4256 -12 -2 3 -4 0 3 -15 -9 -3 1 9 15 11 3 1 -5 5 13 6 12 8 12 -1 7 10 24 7 7 15 18 11 16 13 1 7 10 6 6 -6 7 -3 7 -2 -2 4 -12 -15 -18 -14
4304 -14 -11 -5 -6 -11 -8 -8 -14 -14 -7 -9 -15 -19 -16 3 -7 -6 8 -12 -4 7 -3 -12 -4 2 -3 8 -7 -4 -9 -2 -2 -3 13 3 3 2 10 16 16 4 -1 6 6 13 8 23 16 -3
4352 -3 -2 1 -2 8 1 19 4 3 -3 -10 -10 -6 -5 10 -8 -9 -7 -8 -22 -15 -7 -3 -5 -12 -13 -10 6 -6 -1 0 3 -16 -8 -3 -9 -5 -5 2 9 -2 -6 5 1 -3 -5 17 17 3
4400 3 14 8 13 20 1 6 10 11 4 3 10 -8 0 -4 11 8 -3 11 2 -2 0 -1 5 -11 -1 -9 -6 -8 -8 -10 -4 -4 -9 -4 -26 -19 -12 -10 -6 1 -12 1 -2 -22 -10 -23 -8
4447 -8 -2 -13 4 3 -5 6 -11 -1 19 9 4 0 -2 5 -4 4 12 14 6 3 17 6 2 5 4 -10 4 7 5 -9 -2 -4 9 13 -7 2 8 9 -10 -5 -17 -11 -4 -5 -4
4492 -4 -8 -2 -6 -6 -4 -8 -6 0 -2 -4 -5 -2 -11 2 0 -2 -2 1 4 -6 -4 5 -4 15 11 10 -4 -2 7 7 3 14 7 17 22 9 1 -3 17 9 6 0 0 18 -4 5 0 14 3
4541 3 -4 -1 -3 -3 4 5 -1 11 -2 -3 -9 -7 -13 -4 -9 -8 -19 -14 -19 -13 -9 -17 -11 -10 -7 12 -10 -15 -9 -11 8 -2 10 3 -14 1 1 3 0 8 9 18 8 14 21 12 10 6 11 3
4591CRj2NMmMJ4j6j2J3j3J0lJlrJ1j5OqLqNnJ5mJLj0%J6rj4J6j1J1mJ1j2J4mK
4633Aj0jJOP%kmQj8M%J6mqJ1MolJ4j5Qj0J1j2KJqNoJ5j4%J4j4qJ3j4kJ0qpK1o
4677hrmKJ8qLmj7LKRlmJ7j2lJ5j6J0kRPj9J5njKKJ3nMol%oKJ1m%qkOlMPj7NOj0
4726gQk0K0j3jjljJ2j3J2Rmjj3QnlJ1pMn%JlRjRKqKQj3J1kOPoj0PQj0j2J8nj3
4772hJ2J0Jpo%KmJ3mj6PL%klj5J4OlqOj3LLLLkj3N%pJ0OljMJLpPj6J4pJ1J2k1
4819gJ0lPJ1Jmmjp%MKLJj3J7j1MmPKrkqJQNoqJ0j3oJ6j6K0j0nNpjLj2KQ%lKJJ1
4868Ak1NMoK0j1KrMJ0LpPp%J5j2qK0j0%PlJ3j9J6pJjNmOj1KJjqPnPKj2jJ%ONj1
4916dmMpK%KjLoNPk1J6j3rJ5LlRpj1L0j3LjNKn%oNJ1rMpJ3rmJ5j7J6%Jj0QnLO
$$ plain form
4591 3 12 0 5 9 5 9 23 7 -5 8 -5 5 2 3 0 -9 2 -13 -7 -15 -12 -20 -15 -20 -5 -9 -8 -5 -15 -15 1 -8 -22 -6 -17 -6 -10 1 -11 3 -1 1
4633 1 -9 -10 -9 -3 4 4 2 -2 6 -12 -8 -8 8 4 -4 7 11 5 2 16 1 9 -1 10 -2 0 1 -7 -2 -8 7 -7 -7 7 -7 -15 -2 -16 -18 -8 -16 -23 -2 -8
4677 -8 -17 -21 -19 -1 -9 -6 -10 -27 -24 -22 -13 -16 -20 -3 -15 -18 -3 -19 -9 -11 -2 5 -14 1 -4 -5 -3 -1 12 7 11 5 2 2 -4 -2 9 5 5 -3 -5 1 -2 2 9 -8 -3 3 -7
4726 -7 1 -19 1 -12 -13 -14 -17 -18 -6 -19 -7 2 -2 -3 -16 -8 -13 -16 -5 -12 -8 -13 -13 -12 -15 -6 -7 2 4 -4 -2 6 -7 4 2 8 15 9 -1 6 14 4 -8 10 5 -8
4772 -8 4 14 15 8 2 2 4 0 13 9 -7 0 3 3 1 -2 -17 -3 3 0 -8 -2 -15 -12 -9 -6 -3 -5 -18 -13 -13 -20 -10 -4 -7 -8 -4 -3 0 -7 0 -16 -2 -9 2 14 -7
4819 -7 3 0 7 18 19 15 11 10 3 3 7 9 12 13 0 17 6 10 6 13 15 6 4 -4 -3 5 10 4 -4 6 -7 -13 3 -13 7 -3 -8 -3 -10 -11 -8 -20 -18 -10 -10 -13 -11 -10 1
4868 1 -20 -15 -11 -17 3 -8 -6 -15 -11 -1 2 -5 2 -5 -5 10 -2 -10 10 0 0 7 4 17 -2 14 7 8 7 12 8 14 3 5 6 5 -3 4 -1 6 8 -4 -5 -4 -4 2 7 -4
4916 -4 -8 -4 -11 -9 -9 -7 -8 -5 -11 -6 1 -20 -4 -17 -26 -11 -8 -11 -2 -9 -20 10 -3 0 -1 4 6 1 1 -5 0 11 2 6 -1 12 3 -1 14 -3 13 13 14 4 12 7 10 16
4964A6rj5L4k6Nj6NJ3j0Qj7JJ3j6K0j1kJ0qjLmj6J1rJ0J0j4MKl%RoKlPj2K1j9
5004a3J4MrO%QJj0nJJ8Oj2%JPJkqlP%j5MLkj0J0%Jkm%LOlrLj4mJ4Pj9K3j9J6j7
5051a6OL%mJ3kj2JRj1m%J3Rj0J2rKnOJOnJOj8J0QLLoKj8POmJJj4J0%KjnoMqOn
5100a2%QJk1J0J0Mpj6QrJ4oPklPj1J5plJ0jNQnpQj3Q%mjjJ3mJ0qjMKpLmJ0jj1
5147@Pkj0NpKJ1ln%LMpKj4QkJJrKKlKKQprLQPk0J1JMJQmkkPJj5L2k6%jOOj2J1
5198F%JnpJ0%MqQr%J0j2JoKJ%k%PlkKOmmOrj1Nj1J3JrpRmJ6j%kj3J4kj2L0j6k
5247iLKj2J7j3J6mqOPljJ6oroJ4j4NM%n%KqJ8j0j1MnKKJ0JnnJ4j6qMnOlJrJ0l
5294a4lKKpnK0NroLmRPplnRJ0qKlJJ1j4PQnMoP%lOrRplmOkkJ2j6KjKmL%kj0J4
$$ plain form
4964 16 7 -8 26 0 5 -11 -6 7 -3 5 -12 -11 2 -14 6 -5 -7 3 -5 -6 -3 -7 -23 -12 -21 -11 -1 -15 -11 -9 -12 -12 -3 -9 -7 -10 -3 -15 6 -13
5004 -13 1 5 -4 2 2 10 11 1 -4 -3 15 21 9 9 10 17 18 16 8 5 12 12 -3 1 4 2 -8 2 2 3 1 -3 -3 0 6 3 -6 -3 -17 -21 -7 0 -19 4 -15 1 -16
5051 -16 -10 -7 -7 -11 2 0 -12 -11 -2 -13 -17 -17 -4 5 -5 7 -2 0 -5 1 2 8 3 4 10 -8 2 10 13 16 10 12 -6 1 7 3 4 5 -9 1 1 3 2 -3 -9 -5 -13 -7 -12
5100 -12 -12 -4 -3 -24 -14 -4 0 -7 -23 -15 -24 -10 -16 -9 -11 -14 -7 -18 -3 -10 -13 -3 -4 1 9 4 -3 5 -8 0 0 -4 -5 -6 7 3 13 5 4 8 10 3 6 2 12 11 0
5147 0 7 5 -5 0 -7 -5 6 3 -2 -2 1 5 -2 0 -14 -6 -8 -7 -6 -15 -13 -11 -14 -12 -10 -2 -9 -18 -15 -7 0 -20 -9 -8 -4 -3 5 1 -1 -3 4 5 -10 22 -4 -4 -5 1 7 -5 6
5198 6 6 7 2 -5 5 5 9 1 9 0 0 10 -2 -1 -7 -5 -4 -4 -6 -6 1 -2 -4 -2 4 0 -4 2 -7 -18 -13 -24 -11 -10 -19 -26 -17 -21 -5 -6 -6 -8 -21 -7 -9 -21 9 -7 -9
5247 -9 -6 -4 -16 1 -12 4 0 -8 -2 5 2 1 17 11 2 -4 10 -4 1 5 5 0 0 2 -6 12 2 -9 -5 -10 -8 -6 4 5 0 -5 9 -7 -15 -11 -16 -10 -13 -12 -21 -11 -14
5294 -14 -17 -15 -13 -20 -25 -5 0 -9 -15 -12 -16 -7 0 -7 -10 -15 -6 4 -4 -2 -5 -4 7 -7 0 8 3 7 1 8 8 5 11 2 11 4 1 -3 3 1 -1 11 -5 -3 -4 -2 -6 -3 -3 -5 -15 -1
5346ak0J6j2QmlkQKqRj0MMjMoJ3j1oQnN%J4oj1pJ7j0RLRJqjPrlJ5%j2RMnJkj4
5394goJ1OlKoPj5QOj3kJ0mrLKKj6MJ3Jj3K1j9Rj4ROj4QjJ1qLNpNjlmJP%mkJ1K
5442BjQkNj4OjOpMj0LPjpoJ8j2oOOj5MJ1j4%PkOj6mJPoJ0ppOLmJLMpJ6pJ0j1j1
5491a8J4mJkJ2j%%jmNmJ3k0QJM%%Lj6K1mlqlJJ2j5J0mMNrkQKj4Llj0kJ3mkKjP
5539ep%nnROqnJ5k0J0OnJ7Jj0J2pJoJ3j4J1lM%kN%j0mJ4oOKnpPMJQpJqJ%nOr%
5589clKjLj7MjJ1nM%qjjm%J5nnJ2lj5PQpkJ2%PmnLQkoRqQJlNo%J1Jk3QMMM%no
5642BNjm%rJ2lmkRnjKj2LnRqJ4poNpJ2j2Rj2LKJ0k%JmJoJ1j2R%LnRj0NJ1Oj3k
5691AlQNoj2QOkLNj1%oKK%mRmjj1nPjJ1mMj2Mj1JjlJ0oJRj2%J2rPlOkMj1PNj5
$$ plain form
5346 -1 -21 -5 -17 -9 -13 -16 -18 -10 -8 -16 -7 -17 -13 -9 -10 -6 -12 1 -10 -16 -8 -13 -8 -8 6 0 -11 -18 -1 -11 -2 1 10 11 3 2 9 0 -3 12 12 0 9 13 8 9 7 -7
5394 -7 -13 -2 4 1 3 -3 4 -11 -3 3 -10 -12 -2 -6 -15 -12 -10 -8 -24 -20 -7 -6 -19 2 -17 -8 -22 -13 -7 -21 -13 -14 -3 -11 -8 -3 -10 -5 -6 -9 -13 -12 -5 -5 -9 -11 0 2
5442 2 1 9 7 12 -2 4 3 9 2 6 -4 -1 6 5 -2 -8 10 -2 -8 -2 4 -11 -7 4 -10 -10 -3 -5 1 -15 -19 -18 -11 -17 -7 -14 -21 -15 -12 -16 -15 -12 -8 -15 1 -6 4 -7 -18
5491 -18 -4 -8 -7 -9 3 2 2 2 1 -3 2 -2 11 -9 -1 0 4 4 4 7 -9 12 8 5 -3 -6 -5 7 -8 2 -2 2 7 -2 -4 4 6 -8 -5 -8 -18 -20 -7 -11 -13 -11 -12 -5
5539 -5 -12 -12 -17 -22 -13 -7 -15 -20 -5 -25 -15 -9 -14 3 4 -6 6 -1 0 -6 7 -7 4 1 5 5 3 8 8 -2 -6 8 2 8 10 5 -2 5 9 10 18 11 12 4 5 5 0 6 -3 -3
5589 -3 -6 -4 -5 -2 -19 -15 -16 -5 -10 -6 -6 -14 -15 -16 -20 -20 -5 -10 -15 -3 -6 -21 -14 -6 -13 -15 -3 -3 4 0 -5 -2 6 4 -2 7 -1 7 8 5 10 4 4 15 16 -7 1 5 9 13 13 8 2
5642 2 7 6 2 2 -7 5 2 -2 -4 5 0 -1 1 -11 -8 -13 -4 -12 2 -5 -11 -6 -13 -1 -13 -4 -16 -13 -11 -1 -3 -3 -2 -6 -5 -11 0 -12 -3 -3 0 -5 4 -6 -1 10 16 3 1
5691 1 -2 6 11 5 -7 1 7 5 8 13 2 2 -4 -2 0 0 -4 5 1 0 -11 -16 -9 -10 1 -3 1 -11 -7 -18 -17 -18 -21 -11 -17 -16 -7 -19 -19 -7 -16 -9 -12 -6 -8 -4 -15 -8 -3 -18
5741a8J4J0mJ0j6J5pMKKKnj0J2j2J0JpJ0pJj1JpK0lj6KkOkj3NJ6j4JPoPkLpOr
5785a1nJRjrJ5oQj3J0j4LKJ2%kJ0j4KNonJ1OnjJ5j1J1lkPj2JQqjJ1j6oJ7j7MN
5829EJOpnrOoQpkJ3polmJ3j5ORj3KQmkRLrkJ3pPkJJ3j1j1K0kjmjJJ1rjK0j3%k
5878A0Mjojj1J0KRkokLJmjk0K9j5%nNj3J6Kj8NlMlPrO%mjKlLoJ1j0KJ8olN%km
5927ekJ8%j4jJ0jjkOJLNopkJ1%jKj2OjmjmQnKmlRnpMkJlJ4j2rOJpqJ9mlMjJ1j2
5979hJ1JqJ8k5J8mQlJj0PJ1j1mJ3j0J3j5J7ojL%j7J6Pk1J2Kj1jMjLMj1nJN%mR
6022HrqOOj7JNpMoPlnK3k1MJ1jLj5J1kNOqlPjjMpJ2Kj8QJ2kOj0NpK0j1jKj5JM
6070ENj6NkKmQqNJ1nj7j0KJ7rpR%%MqnJ5j3LJmL%NmK%JRmqJ3JKj2OJ3j0KNj1R
$$ plain form
5741 -18 -4 6 2 12 -4 11 4 8 10 12 14 9 -1 11 -1 9 10 3 13 6 7 -4 -3 -10 10 7 -9 -7 -9 -3 -5 -18 -13 3 -11 -10 -3 -9 -2 -4 -1 -8 -2 -11
5785 -11 -16 -15 -6 -7 -16 -1 -7 1 -12 -2 -16 -13 -11 1 1 -1 9 -5 -3 2 -4 -9 2 8 3 2 17 6 17 14 12 19 7 8 16 8 7 18 2 -4 13 -4 0 5
5829 5 6 12 5 0 -9 -3 -9 -1 -8 -10 3 -4 -10 -13 -17 -4 -19 -13 -4 -17 -15 -7 -11 -13 -4 -1 -10 -12 1 -6 1 -1 0 13 2 -9 11 9 8 4 3 4 15 6 5 25 12 12 10
5878 10 14 13 7 6 -5 5 7 16 14 8 6 9 10 6 5 -15 14 -1 -1 -6 -1 -14 2 4 -14 -9 -12 -8 -11 -4 -13 -7 -7 -11 -12 -10 -13 -10 -16 -5 -15 -13 5 -1 -4 1 1 -1 -5
5927 -5 -7 11 11 -3 -4 6 5 4 2 8 9 12 17 11 4 2 13 13 12 14 2 8 7 3 2 -2 6 1 3 -1 -4 5 0 -7 -3 -5 -4 -7 7 -5 -14 -8 -7 -14 -22 -3 -7 -10 -6 -7 4 -8
5979 -8 3 4 -4 14 -11 7 3 11 8 9 -1 6 17 6 2 15 5 18 3 20 14 13 16 16 -1 15 22 1 13 15 4 3 7 6 9 13 2 -3 -2 3 3 -1 8
6022 8 -1 -9 -3 3 -14 -13 -8 -15 -11 -17 -10 -13 -18 5 -16 -12 -1 -2 1 -14 -3 -5 0 6 -2 -5 2 1 0 4 -3 9 11 -7 1 13 11 17 7 12 5 25 14 13 15 0 1 5
6070 5 10 -6 -1 -3 -1 -5 3 -5 0 11 6 -11 -21 -19 -2 -11 -18 -9 -9 -9 -5 -13 -18 -3 -16 -13 -12 -16 -13 -13 -8 -12 -10 -10 -9 0 -4 -12 1 2 4 -8 -2 11 1 3 8 -3 6
6119FNnJ0j1MnOMj0mL%njJooJ8j4MJ2oj0qRjKl%MqKmJ3j2PrJ3j4PKlMqJ2%ll%
6168a1KpPnLMRpnJ8Jj3PmjJOjlo%J5rKj1J0qJ3qkOj0MqOoOmPj6NqJ6nLNj5KLp
6218a9OLj4J0QmKJ2qkjpJ2j4J4MqJ3j0OQj0klRQqqNPOj9QoNrmRPj4PkJ0j8Rro
6265a7JoK1lkpKnrJ5r%LKoJ2kkPmj2%NJ1j5J3Oj8QKOJ1krO%j0J1qJ6plNj0jJ5
6311A1JJJqJnKj8QQmNj2J0kjoj2KJ5J1k1Rj1kQk%jlJ1kkj3OOj1jP%J0nRj6J1J
6357dJ8mjjj5J7m%n%pQOkOnj2LRrJ3j0mJ4j1j1MlJ4%rLmOonNmnKqNMkMlJL%j0
6407a9oJ2JNqKQJk%MPmLLMlJ1j7MKQmpMjkPnkj2J6j3JPj2KOlOj7KNRmr%PqkLJ
6459ij3KOKllJ8mqPj3RJ0j6OkOJ1j2ORkj5QNKnJ1pkQrPrOMNj7QRKpj0jPoj0LL
$$ plain form
6119 6 11 6 16 5 9 4 10 14 4 0 3 3 -2 -3 -2 -8 -14 4 -10 -6 6 0 -10 -18 -9 -10 -8 -11 -11 -7 -15 -13 -17 -4 -16 -9 -18 -5 -19 -12 -10 -13 -9 -17 -5 -5 -8 -11 -11
6168 -11 -9 -16 -9 -14 -11 -7 2 -5 -10 8 9 -4 3 -1 -2 -1 5 4 1 -5 -5 10 1 3 -8 2 -6 7 -1 -3 3 -7 -3 -11 -5 -11 -5 -9 -2 -18 -13 -21 -5 -10 -7 -2 -17 -15 -12 -19
6218 -19 -13 -10 -24 -14 -6 -10 -8 4 -4 -6 -7 -14 -2 -16 -2 2 -6 7 -3 3 11 1 -1 -4 5 13 5 -3 2 9 15 -4 4 -2 3 -6 -10 -1 6 -8 -1 -3 7 -11 -2 -11 -17
6265 -17 -16 -22 -1 -4 -6 -13 -11 -16 -25 -10 -19 -19 -16 -14 -20 -8 -10 -12 -5 -9 -21 -21 -16 -5 -20 -7 -1 -19 -11 -9 -3 8 6 -3 3 3 -7 4 -4 12 5 2 7 -3 -4 11
6311 11 12 13 14 6 7 2 4 -14 -6 2 -2 3 -9 1 -1 -2 -8 -20 -18 -3 8 -13 -4 -15 -17 -9 -11 -11 -12 -15 -4 -6 -8 -21 -15 -9 -20 -21 -14 -14 -4 -9 0 -16 -5 -4
6357 -4 14 10 9 8 -7 10 6 6 1 1 -6 2 8 6 12 7 -5 -2 7 -2 11 1 -3 11 0 -11 -7 -10 4 4 -5 -2 -6 0 -6 -11 -6 -10 -15 -13 -21 -16 -12 -14 -10 -13 -12 -9 -9 -19
6407 -19 -25 -13 -12 -7 -15 -13 -5 -4 -6 -6 -2 5 1 4 7 11 8 19 2 6 8 16 12 5 9 8 6 13 8 6 -6 10 -3 -2 5 -7 -5 1 -2 4 -13 -11 -6 3 -1 -10 -10 -3 -11 -13 -10 -9
6459 -9 -22 -20 -14 -12 -15 -18 0 -4 -12 -5 -18 -9 1 -15 -9 -11 -5 6 -6 0 9 7 -8 0 5 7 2 13 6 4 12 3 10 1 7 11 16 -1 7 16 18 11 1 0 7 1 -9 -6 -3
6508cQmnnKJjKnO%lLljkoLJqJ3j2NpJ5KkLOJj0PKJmPj1%J3kj5OlQKkJ1%k1OMK
6560EmJ1j8QJ0j3kQopmlOJ0j1j1J2%J1j0qMMpNnrQjkJ4j7J8j7J5Nj4Rj1J4J0j4
6602gKQRj2j4%K5pMjNj1J3nKlrmJ8j1qJ7loLj8RNlmoJ4klkj2ORj3mQMrONqnJJ9
6651Boo%jJ6j1lPLlkQkrRnk%J1mlJMrPOOkqpNOm%oQj1MlPlqJ7jk1LJ0kpJqNMj0
6705a7O%Mj4J4k4J2J1%mM%MqJ0lJ0o%JJjMmjlNkKJ1oKqNJ1nnnK0j4oO%j1LnMO
6753Dj2J6rnj3J6nQj1%%j4ORlpJ1pKlPJ2kj1Pkl%j1OK0mLpJKOjkkJ2oMMrkpML
6802EOj1M%j1k%J2Qj4J7lmoMj1Rj1LlOmmJ3lMj5KkJ2k6J1%NlK5j7KJ1l0J1LMJ
6846bJLj3J6PpL%LpNjJK%j4KJ2jNj0MpJ1qNrLO%Nj3j0K2j0qpkJ0KKj0Oj4oJ6r
$$ plain form
6508 -3 5 1 -4 -9 -7 -6 -7 -5 -10 -4 -4 -7 -4 -7 -8 -10 -16 -13 -12 -20 -7 -19 -14 -21 -6 -4 -6 -3 3 4 -6 1 3 4 0 7 -4 -4 9 7 -8 -2 -5 3 5 3 14 14 -7 -1 3 5
6560 5 1 12 -6 2 12 -1 -3 5 -1 -8 -12 -15 -9 1 -10 -21 -9 -9 2 -8 -16 -12 -8 -15 -10 -15 -24 -16 -17 -19 -5 -22 -4 -21 -6 -1 -15 -6 -17 -3 7 -7
6602 -7 -5 3 12 0 -14 -14 11 4 8 7 12 1 14 9 11 8 -1 -5 13 2 -6 11 8 2 5 -13 -4 1 -2 -6 -12 2 0 -3 -5 -17 -11 -2 -15 -19 -11 -7 -16 -10 -5 -13 -18 -17 2
6651 2 -4 -10 -10 -11 5 -6 -9 -2 1 -2 -4 4 2 -7 2 -3 -5 -5 6 2 -1 0 4 -5 2 8 14 12 4 -3 2 8 4 4 -2 6 -5 -1 -4 3 0 -8 9 8 -13 -10 0 -2 -9 -8 -16 -11 -7 -17
6705 -17 -11 -11 -7 -21 -7 -31 -19 -8 -8 -12 -8 -8 -4 -12 -2 -5 5 -1 -1 0 1 0 4 0 -1 -4 1 -1 1 12 6 8 0 5 16 11 6 1 21 7 1 7 7 -4 -1 -6 -2 4
6753 4 -8 8 -1 -6 -19 -3 -8 0 -11 -11 -11 -25 -19 -10 -13 -20 -9 -16 -14 -17 -10 2 0 -11 -4 -6 -9 -9 -20 -14 6 2 5 -2 -1 1 7 6 4 2 14 8 12 16 7 5 -2 2 5
6802 5 11 0 4 4 -7 -9 -9 3 11 -3 14 11 7 1 5 -6 3 -8 -5 -8 -2 -6 -10 3 0 4 -11 -9 -11 1 -25 -14 -14 -9 -12 13 -4 -2 9 -21 -10 -7 -3 -2
6846 -2 -1 2 -11 5 12 5 8 8 11 4 9 8 9 11 11 -3 -1 11 10 15 5 9 2 13 5 10 1 4 10 10 15 2 -8 14 4 -4 -11 -13 -3 -1 1 -9 -3 -17 -23 -7 -16
6893a6J0mJlJ1lJlLMjnJjlORKmPJj4LJ7rJ8j6JnJ3j6JOoOj1J0qRmrNqMJ1j9Qo
6941fjpPJkkqLJ1kjOj5J1oJJ1nkmQlKjLknJ4Kj6oJ6OojQj5J4Ljj0J3kklnNQj2
6990B%j3J4Kj4J1kMlpjnNJjRoKKk4K1mLnMJLj5kLJ6pKp%J2lj4QJ3qJ1mJ2qj5J9
7037A2j5J3JljOllRj2PPj2jQj9K0j2mNOnKkJj6KOrmNJ0k0PJPlmKJ0jjjk%pJ1l
7085enJ1koJ0qQLj%j0J4j4J0jKKkMj2J1j2J1JjLo%J2j8%KQNrOjn%lLkj3lJ1jk
7132ej2PJNqJ8rj0J4k2J2oJRoOnRjQj1QNjM%mMlKj7QRmrJ3Kmj3JK3rjj3J4KrL
7180FnoLJ4j5%QklmjjOj0OJj0J4Lj6LoJ0KrjNqJ1OmOj1J1KlKmLLJ5k1J3j0MOj5
7227bJ0kknK6k0MlQmOmpNmllmjmPkMLjorjPNom%KKqN%mNKrJJ1j5K3lLmMlrRnM
$$ plain form
6893 -16 -6 -10 -9 -12 -1 -4 -3 -6 -3 1 0 -5 -4 -5 -8 -2 7 9 5 12 13 -1 2 19 10 28 12 13 8 21 5 6 12 6 12 1 11 3 12 8 -1 4 -4 0 11 -8 0 -6
6941 -6 -7 -14 -7 -6 -8 -10 -18 -15 -4 -6 -7 -1 -16 -5 -11 -10 1 -4 -6 -10 -2 -5 -3 -4 -1 -3 -8 6 8 -8 -14 2 8 2 1 9 -6 8 11 10 0 13 11 9 6 1 6 14 2
6990 2 2 -11 3 5 -9 2 0 4 1 -6 -7 -12 -7 -6 -7 2 -4 -2 0 -24 -3 -7 -4 -9 -5 -4 -1 -16 -18 -15 1 -6 -4 -11 -11 1 -2 -16 -8 5 -3 8 4 16 8 -7 12
7037 12 -3 10 11 8 7 13 10 7 16 4 11 18 6 5 13 -6 14 2 -2 3 9 4 6 4 5 -11 -9 -3 -12 -16 -11 -1 -21 -14 -13 -6 -9 -13 -11 -1 -2 -3 -4 -6 -6 -13 -2 -5
7085 -5 -10 1 -1 -7 3 -5 3 6 5 5 -5 9 -5 5 4 6 8 6 10 -2 9 -3 8 9 8 11 5 5 17 -1 -1 1 9 14 5 11 10 5 5 2 5 3 -10 -13 -2 -3 -5
7132 -5 -17 -10 -9 -4 -12 6 -3 -13 1 -21 -9 -15 -14 -5 -11 -5 -10 -1 -2 6 -5 3 8 7 11 11 7 11 8 10 -7 1 10 6 -3 10 12 8 -5 -4 19 10 9 -4 10 12 3 6
7180 6 1 -5 -2 12 -3 -3 5 3 0 -4 -5 -6 0 -10 -4 -3 -13 1 4 -12 -9 -15 -5 -3 -12 -13 -8 -16 -5 1 -3 3 -8 3 5 2 4 0 3 6 21 0 13 3 7 13 -2
7227 -2 8 6 4 -1 25 5 9 6 14 10 16 12 5 10 6 3 0 -4 -5 -9 -2 -4 0 3 2 -4 -13 -14 -7 -2 -8 -12 -12 -10 -8 -16 -11 -11 -15 -10 -8 -17 -16 -5 -20 3 0 3 -1 3 0 -9 0 -5 -1
7282aJ0j0jPkjMKnNoJlPlKlKLk0nJ7%j3J5Mj6%RlKqJNLj6NLjJm%J0Monj4QKMm
7333a4J2MmlQqRKJPj4J2oljJ3plMMkKmoJJ0lkopJMnmPRqj4PqLONLj1N%o%OqQn
7386imnJ5k%OjojJ6j7J4jlnONm%%Pj3J3oJ3jj1NOpMplPon%KjO%%j0J0rrMLnjp
7437a7JPMk%mJ5k2J4pkRkMj3JQNpJ0lJ1mnLKoLJj0J1%LqKkJ%N%OOlkj3QMj2NN
7487A0qjMJ%moj4J7nj0J5oJ3j5mrJ5lJ1j2pK0jqnJ0j3J0KrJ4kkjMkOlPj1J0mP
7531A1om%J6%Oj2oJ1j7OMlQnj0OlLOmLoKlLpMoPj9J1lPnPoj8J0%OKqJJ0lnPjo
7581ijJ6j1NjmJ6npJ5j1lJ5k0J6jnLjOpNkLm%pNJ0qJqqPJJ7k0mMnRj7PrJ0joQ
7629fmM%PjNj2JjKJLlPkpLJ6j4Q%pJ4j2jkJ0j0J1j4J5oKJkoQjJnmJ1rjLlmKkj4
$$ plain form
7282 -1 9 -1 -2 5 3 2 6 8 3 8 2 3 0 7 4 6 3 5 8 -12 -17 0 0 -13 2 6 -10 -10 -1 -4 -2 -10 -9 -4 -1 -17 -12 -9 -10 -9 -13 -13 -3 1 -5 -10 -24 -16 -14 -10 -14
7333 -14 -2 2 -2 -5 3 -5 4 6 7 14 0 12 6 3 2 15 8 5 9 13 11 13 9 3 4 14 11 9 3 -4 -3 1 -4 -8 -1 8 0 -14 -7 -15 -12 -6 -1 2 -9 -4 -4 -10 -10 -4 -12 -4 -9
7386 -9 -13 -18 -3 -5 -5 1 0 -6 -7 9 -8 6 5 2 -3 3 8 4 4 4 11 -2 11 5 18 17 6 11 17 10 14 7 4 11 5 0 0 2 1 7 7 7 -3 7 -2 -11 -7 -4 -9 -10 -17
7437 -17 -16 -9 -5 -7 -7 -11 4 -18 -4 -11 -13 -4 -6 -2 -15 -14 -6 -1 -8 2 -1 10 6 1 4 6 0 3 4 -6 5 5 8 0 2 0 1 1 6 6 12 18 15 13 0 8 12 0 5 10
7487 10 2 1 5 6 6 2 -4 -18 -1 -6 -16 -1 -7 6 -9 -13 -22 -7 -10 1 -11 -18 2 1 -7 -12 -2 -15 -5 -3 -12 2 0 -2 -3 1 -1 5 2 9 -2 8 4 11
7531 11 5 1 1 17 17 23 11 5 16 -1 5 9 6 14 9 -1 5 2 5 11 7 10 4 6 3 6 -1 3 -3 4 -15 -4 -7 0 -5 2 -4 -22 -12 -12 -6 -4 -12 -11 -1 -4 -9 -2 -3 -9
7581 -9 -10 6 -5 0 -1 -5 11 6 -1 14 3 0 15 -5 11 10 5 8 7 13 6 11 9 12 8 8 1 6 16 8 9 1 -7 0 1 18 -2 -6 -2 -7 2 -15 -8 -17 -7 -8 -14 -6
7629 -6 -10 -6 -6 1 0 5 -7 -6 -7 -5 -4 -1 -4 3 1 -6 -3 13 -1 7 7 0 14 2 1 -1 9 -1 10 -4 11 5 7 8 6 0 8 7 8 3 -1 10 1 0 3 0 -4 -2 -4 -18
7679a8K4rJ0j1Lj0OKqnPLJj1J0JKjoQmMnRpJ2rKJj0NnJ3kMJ6j2oj1K4mPp%jlJ
7726A0mPoMj1JPqkRrJj0J4mJQk6J9j5JKJNmjOnMpJ0oOKj1J2j1PNkj0J0kLNJpJ1
7774A1mkOJ5pj0QpLj0QL%q%QnlmKjJ6oj1MnJj0MpLQj2Rr%LlPnQjnmMOqPJ%oNj
7827dOMojQMnqJ%NJ0j5%J4kMj2MPjj0J2Ok6J1%%J0j9QlJlmNJj6K0knJj1j1J9M
7873A%lrO%j1QoK0j9OOJ0nL%mj1PPnKLlQjqllmK3%j1Pj4J3pJ0JQj4jlJ0j2L%o
7921aPqMlpNlNOrj0jJ0Lj3%J0k5K6kjMQqlnJ3oJ7jj0QlLjkPmOmlNjRj1jjKnMj
7972ILj0OmpMlRnLOlpj0QJqJRj3PoNnJMmjmPNj7K3j1QnNkqJ8MkJkMlmQkjq%Pm
8026G%J0oKj1lJ1npQlLJM%rlkMj1MOj0J3qjjjMpqKJLJ2nl%rJ1j1QJ1qqPQJ5j2
$$ plain form
7679 -18 6 -3 7 -4 -1 -11 -5 -3 -11 -16 -9 -6 -5 -16 -6 -5 -3 -4 -10 -2 -6 -2 -7 2 -5 7 -2 0 1 -9 -4 -9 4 2 6 22 10 4 -7 17 13 20 13 13 12 9 10
7726 10 6 13 7 11 0 1 8 0 -2 7 -2 -1 -11 3 -1 0 8 -18 1 -14 -13 -11 -10 -5 -9 -10 -4 -9 -5 -12 -2 -8 -2 0 -11 1 -10 -3 2 0 -10 0 -2 1 6 7 0 11
7774 11 7 5 11 26 19 9 17 10 13 3 11 14 14 6 6 14 9 6 2 4 3 19 13 2 6 1 2 -8 -4 -11 -8 0 -12 -3 -12 -12 -9 -12 -5 -10 -2 -3 -8 -12 -8 -2 -10 -3 -2 -2 -8 -3 -4
7827 -4 2 6 0 -1 7 11 6 -2 -1 -1 4 14 -1 -1 13 11 15 3 7 14 13 3 15 21 -5 6 6 6 16 -3 5 2 3 0 -4 1 2 -14 6 4 -1 0 -11 -22 -3 1
7873 1 1 -2 -11 -5 -5 -16 -8 -14 6 -13 -7 -1 9 4 7 7 3 -8 -1 6 1 3 6 3 11 10 2 -1 -4 -8 15 15 4 11 -3 10 3 13 14 22 8 7 4 14 2 5 5 -1
7921 -1 6 -2 2 -1 -8 -3 -6 -1 5 -4 -14 -15 -5 -2 -15 -15 -5 -30 -4 -6 -7 -3 5 -3 -6 -11 2 -4 13 12 2 10 7 10 9 7 14 10 16 12 9 14 13 22 11 10 9 11 6 10 9
7972 9 12 2 8 4 -3 1 -2 7 2 5 11 8 1 -9 -1 0 -8 -7 2 -11 -4 -10 -5 -10 -9 -5 -9 -10 -14 -7 -2 -19 4 -7 1 -4 1 -1 -9 9 13 11 12 10 14 11 7 15 13 12 4 4 11 7
8026 7 7 17 11 13 2 -1 10 5 -2 6 3 6 7 11 11 2 -1 -3 1 -10 -6 0 -10 3 -5 -6 -7 -8 -4 -11 -19 -17 -16 -13 -1 -6 -9 -9 -18 -7 -18 -10 1 -7 -15 -8 0 15 3
8075CNlj4OKPloJ4pMnkjJ1pRmjkm%lJ1j4J1kjOj7mjJ0NrKOj5KPLlmoRlPpqJ0o
8126a2kJ5j1QMRj1LjPLokRqNk%N%k1K3noJJ1j7LJ4nNj1oPjjmq%lJ2j1J5k5RJ0
8172aNpj%j5J0OoJ7oj1lLJ0qJ8j7K%
$$ plain form
8075 3 8 5 -9 -3 -1 6 3 -3 11 4 8 3 1 0 11 4 13 9 8 6 2 2 -1 10 -4 7 5 4 10 -7 -11 -12 -2 3 -6 -4 2 -13 -11 -4 -1 -4 -8 -14 -5 -8 -1 -8 -16 -6 -12
8126 -12 -14 1 -10 -2 2 11 0 3 2 9 12 6 4 13 5 10 8 8 13 13 -8 15 10 4 5 16 -1 2 16 11 16 5 -1 6 5 4 0 -8 -8 -11 1 -10 5 -20 -11 -1
8172 -1 4 -3 -4 -4 -19 -9 -3 -9 8 2 -9 -12 -9 1 -7 11 -6 -4 -4
8191d
$$ Imaginary data points
##PAGE= N=2
##DATA TABLE= (X++(I..I)), XYDATA
0@%%%%%%%%%%%%%%%%%%%Mj2J6j6J6j6J6j6K0k8L2l2L6m4M8n2O0o4P2q1Q9j00J09
42E7j21J35j48J62j82K05k28K53k85L25l72M31n04N98p36R52j325K167p409R87
62e038J5033j124n583k802J377m898o135J004R551O028r19l066q59l889o842k273
78a0435P860R731K350m698m216k642l206k279L464P046L919j314k308k193m682
93c603n392J159Q830P562j056n516k752p53l188l044L566Q711M681l382n850l037
109c064j413j522J428O111N777l83n050m126j586j048j54L518O092L237k458n445
125h6m509j957J157M580N561J909k848l845j786j189k027J31N187O525J112n140
141B775n681k155K24J234L454N056K123l391n433k360N82N28P20L451M779R47
$$ plain form
0 0 0 0 0 0 0 0 0 0 0 0 0 0 0 0 0 0 0 0 0 4 -8 8 -8 8 -8 8 -8 12 -16 16 -16 20 -24 24 -28 32 -32 40 -41 48 -52 57
42 57 -64 71 -77 85 -97 108 -120 133 -152 173 -199 232 -272 326 -410 542 -783 1384 -6025 -5038
62 -5038 9995 8871 3288 486 1863 -3035 -9170 -8166 1385 7413 6494 3428 2569 -1320 -8162 -10435
78 -10435 -2575 7156 9506 4808 592 -2050 -5256 -7535 -4071 2975 6894 5580 3272 1079 -3603
93 -3603 -8995 -7836 994 8556 7500 1984 -768 -1521 -4709 -7753 -4187 4524 9205 5823 -27 -3064
109 -3064 -4477 -5999 -4571 1540 7317 6934 1884 -2242 -3828 -4876 -5030 -1512 4580 7817 5359 -86
125 -86 -4595 -6552 -5395 -815 4746 6655 3807 -38 -1824 -3013 -5040 -4909 278 6803 7915 2775
141 2775 -2906 -5061 -4837 -3603 -149 4907 7030 3639 -1794 -4154 -3572 -3044 -2324 1127 5906 6853
157F853m732o091k392J711L328L467K682L33k858m176k463j6J446K653L661K483
173E889j394m790m250p50K055K895K956K248j68l382m390j960J171K537K713K570
189C950J196k005m733l723K80L309L322J752N18p43k550l600k065J115L569L660
205C252J614r58l084l637j916Q87K949L106J666j96j811k837k605q15J612L361
221E88L161J033j709l636l266p93J925L183K458P88q14k097k700k040J8K334L418
238A851K332j18k411l362k306M4K221L025K100K52j457k491k456j157R49K760
254b24L010J351j016k729k879j430P26K447K804J573l74k018k588j945l05J676
270a921K929K436L96j837k865k209m73J356K424K279J001q42k312k547j389N29
$$ plain form
157 6853 2121 -3970 -6362 -4651 -1323 2144 4826 5159 2301 -1875 -4338 -4354 -2908 -255 3406 5889
173 5889 4495 -295 -4545 -5295 -3240 -345 2611 4859 4691 1309 -3081 -5041 -3870 -1333 1380 3950
189 3950 5146 3141 -1592 -5315 -5035 -1726 1596 3348 3866 3123 573 -3027 -5092 -3977 -408 3252
205 3252 4866 3908 824 -2813 -4729 -3842 -893 2213 3879 3683 1872 -965 -3570 -4385 -2773 588
221 588 3749 4782 3073 -563 -3829 -4622 -2697 486 2944 3732 2918 821 -1879 -3919 -3901 -1567 1851
238 1851 4183 4065 1654 -1708 -4014 -3970 -1749 1276 3376 3628 2171 -320 -2776 -3933 -2984 -224
254 -224 2786 4137 3121 392 -2487 -3917 -3191 -744 2060 3633 3259 1241 -1347 -3292 -3597 -1921
270 -1921 1008 3444 3840 2003 -862 -3071 -3544 -2188 236 2515 3516 2674 362 -2185 -3574 -3045
286c045K255K786J661m84k285k633j513K33J701K357J861L70j404k495k159o14
302c408J207K460K350R21j125k491k342q63R07K056K131J217k75j760k398j678
318c091M6J783K513J773P0j623k403j799k83J306K196J890O60r34k099k127r82
335c104P14K054K257J188n68j981k228j224L18J637K107J536R2j469k230j692
351b593k56J275K094J832N71j056k100j934o76Q38J870J911J012m55j769k128
367a564j232L46J689K067J294q6j410k017j526j90J244J966J639M61r58j958j837
384b072o65Q87J867J786Q07n60j650j905j067L72J569J857J196o7j308j929j476
401b358j48J259J946J475K80r89j763j602o07P76J752J725P23o16j578j708r59
$$ plain form
286 -3045 -790 1996 3657 3173 888 -1745 -3258 -3025 -1324 1033 2894 3264 1860 -635 -2794 -3408
302 -3408 -2201 259 2609 3530 2405 -86 -2428 -3291 -2384 -328 1803 3020 2745 985 -1413 -3091
318 -3091 -3045 -1262 1251 3024 3094 1471 -932 -2731 -3014 -1708 488 2378 3038 2104 5 -2122 -3104
335 -3104 -2390 -336 1921 3109 2541 560 -1668 -2892 -2574 -937 1170 2706 2798 1329 -901 -2593
351 -2593 -2849 -1574 520 2352 2923 1867 -233 -2167 -2843 -2005 -135 1776 2788 2333 564 -1564
367 -1564 -2796 -2450 -761 1306 2600 2514 1104 -913 -2439 -2629 -1385 581 2220 2681 1723 -235 -2072
384 -2072 -2737 -1850 17 1803 2610 2050 400 -1505 -2572 -2200 -631 1226 2422 2355 1047 -882 -2358
401 -2358 -2506 -1247 699 2174 2454 1465 -298 -1900 -2507 -1731 21 1746 2469 1853 275 -1433 -2392
418b392L08J475J828J129j60j336j771j278j09J153J825J446K16j052j681j429
434a828m60P33J600J580P00n77j517j657q78L74J443J734J017k35j342j690j095
451b098M2J116J624J252K20r64j601j330m12O81J534J574O86o68j633j535n98
468b110M80J253J475R76j32j292j685j013J65J092J409J120K92q25j600j424l37
485b156R17J504J291M43n63j343j456o98M56J328J457P71k56j150j471r23P0J004
503g75J409J118K32r06j596j275j56R46J349J093L92m86j244j449o58N64J350
520i2J240N82k14r50j360j066nJ166J561R55j20r79j263r79k27O82J296J193L88
539A808o00j278j209n14M45J150J260P06k02j103j466q67K79J199J265O54q9o79
$$ plain form
418 -2392 -2084 -609 1219 2348 2188 852 -919 -2197 -2306 -1153 672 2118 2334 1282 -399 -1828
434 -1828 -2288 -1555 45 1625 2325 1748 231 -1426 -2304 -1930 -487 1247 2264 2029 687 -1003 -2098
451 -2098 -2056 -940 684 1936 2156 1192 -409 -1739 -2151 -1470 64 1638 2324 1656 23 -1512 -2110
468 -2110 -1630 -377 1098 2074 1942 650 -1035 -2048 -1883 -791 618 1738 2030 1205 -395 -1819 -2156
485 -2156 -1239 265 1556 1999 1436 93 -1363 -2061 -1605 -277 1180 1951 1695 545 -926 -1849 -1779 -775
503 -775 634 1752 1984 1078 -518 -1793 -1949 -1003 346 1439 1831 1345 101 -1348 -2006 -1442 -92
520 -92 1148 1730 1516 566 -794 -1860 -1865 -699 862 1817 1697 718 -545 -1524 -1751 -1069 227 1420 1808
539 1808 1208 -70 -1279 -1793 -1348 -198 1062 1768 1566 463 -1003 -1870 -1591 -392 873 1527 1438 759
557G59j100j067l69P24J413J156K07o93j142j077m91L88J178J300N75m49j139
574A73j141n66J85Q58J124Q62R5q21j328j004o5Q59J230Q75J68n47j035j070n16
593a664M52J198J190M50m69j010r92n96J09Q36J205Q41p9q95j176p80n0O64J072
612C06R72L10o27j224j029k19O26J014Q24L83j93p99j136p67J99J030J172O23
630A465j79p98j078q02K3Q06J058O69P8m52q60r97m59M68J163J008L09m08q94
649A20j018n93K83J068J039L57k70n82p57q10l01O86J320Q74j09p57q64o87l29
668a330L80J095R82J85n52p38o67n60p2Q73J308O36m80r67p05l72j40M02J099
687C77R71j0q78q85m49j83J39Q02J196N00o97j199o73j1K40M79Q25P06o3q91r70
$$ plain form
557 759 -341 -1408 -1777 -1053 360 1516 1723 1030 -112 -1189 -1680 -1292 -114 1186 1761 1312 173
574 173 -968 -1534 -1349 -491 633 1495 1590 769 -559 -1563 -1628 -769 461 1336 1504 957 -78 -1148 -1664
593 -1664 -1212 -14 1176 1626 1157 147 -845 -1441 -1332 -496 709 1550 1471 576 -600 -1380 -1430 -766 306
612 306 1278 1588 961 -263 -1292 -1511 -885 129 953 1336 1143 344 -792 -1559 -1360 -330 842 1465
630 1465 1286 488 -590 -1392 -1369 -563 495 1164 1242 790 -70 -1067 -1526 -1058 105 1113 1422 1014 120
649 120 -898 -1491 -1208 -140 899 1256 986 404 -353 -1163 -1464 -778 542 1416 1307 550 -314 -1001 -1330
668 -1330 -950 145 1127 1312 760 22 -645 -1205 -1277 -404 904 1540 1060 93 -612 -984 -1124 -722 377
687 377 1348 1338 460 -425 -874 -1057 -918 -116 1080 1580 883 -316 -989 -1000 -760 -281 544 1250 1187 296 -674
708f74m79O2N41R55Q47L9q58j004m28O5K92O07Q73N10m32j082p71j06K51M84Q73
729E65P97j21j143j094j26M87M33L66O20M49m40j165q59Q5O68P28N98L13l41r59
749a39q43j01M71N65N64M88M9p37j026m61L10O07O09N99K30n89j167o66L46P21
769a70L86K29M58J36q50j246l78P84R82L89L3pl76q81p01K37Q98P01J93k5k80
790E12o83q21k02O80R57M82k7l73o17o78k73M10P39N23J82k4m15q90p32J90J027
811c3Q35P4l18k97m04o39l01M89R75N85j11m46m72n72m14K30Q95Q46J05n14o12
832i9m30k42K6M72P00M72m6n09p22n81l7O14Q53M38j47m55m52m38k98J75P28P56
854G78J73l91n96m86l29N3N80Q21M13l05o61m98k33k1K65O36O36J22n23p36n02
$$ plain form
708 -674 -1153 -1091 -550 405 1252 1291 433 -571 -999 -934 -642 -35 838 1348 916 -166 -937 -1043 -792 -308 565
729 565 1362 1241 98 -996 -1122 -635 -202 164 784 1233 793 -372 -1231 -1146 -478 250 848 1161 820 -139
749 -139 -982 -1083 -612 -47 517 1005 1054 317 -709 -1170 -860 -253 356 955 1185 596 -571 -1237 -891 -170
769 -170 216 445 903 1039 189 -1057 -1435 -651 331 720 753 746 370 -511 -1212 -975 -77 624 817 792 512
790 512 -171 -992 -1194 -514 443 925 898 525 -92 -770 -1043 -633 106 629 811 787 372 -518 -1250 -1060 -33
811 -33 802 876 558 261 -143 -782 -1083 -594 381 966 855 409 -63 -635 -1049 -819 76 922 1027 513 -99
832 -99 -529 -771 -745 -273 427 899 853 344 -378 -959 -996 -382 471 909 762 307 -145 -583 -881 -706 22 778
854 778 951 560 -36 -522 -851 -798 -218 603 1016 711 50 -448 -681 -702 -437 199 835 957 434 -302 -804
875h04m2L62O32N67J24l29n84m70k30J17M74O62M43j45o29o64l02J00M56N94M47
896G79K0m78o12l84m0K53N00N76K89k89o97o21j45L28N16N03K79j33n05n74l26
917g61Q6M13N56M53P1m35o83m60KM18N52M09J11k51n08n34k11K00N35N37K72j41
939F31n14n80l31J50M86N20L03%l66n34m34p4L39N60M64J40k86n73n37j40L12
960d64N15M38J81j28m04n24l60Q6M84N65L17o5l94n23l88l4L79N49L75N7k73m75
982h6m28k03K06N30N12K01k05m66m88k70J29M35M86K84l7l52m87l89o0L66N45
1003B23L97K6l15m44m09j61K26M81M57J88j94m54m28k50Q4M28N35K96j17m21m52
1024c04k83PL12M55L70P3k93m73l93j35K33M83M53J49k31m36l97j98J11L63M68
$$ plain form
875 -804 -846 -484 148 715 839 510 -74 -544 -774 -657 -183 479 922 777 148 -516 -818 -718 -262 332 779
896 779 799 321 -291 -675 -715 -462 38 614 903 614 -83 -704 -849 -521 -5 498 777 644 139 -435 -761
917 -761 -675 -262 294 747 818 383 -300 -760 -758 -340 212 621 732 481 -27 -561 -772 -572 -37 500 772 631
939 631 117 -463 -794 -644 -158 362 665 665 299 -235 -669 -743 -404 156 620 760 474 -99 -636 -776 -464
960 -464 51 489 670 542 138 -386 -746 -660 -176 389 706 641 247 -276 -664 -698 -319 230 605 662 389 -86
982 -86 -514 -717 -511 19 531 732 527 61 -427 -697 -568 -133 353 637 600 248 -239 -628 -688 -322 223
1003 223 620 646 331 -113 -522 -683 -457 24 481 669 475 21 -407 -657 -573 -145 390 686 569 148 -304
1024 -304 -587 -580 -268 187 557 630 337 -136 -529 -664 -431 52 505 654 423 -13 -410 -608 -497 -134 334
1045C34K91q9l79m48l11K8L10M68L51N5l20m41l59q9K24M20M13J69j94m40m15
1066d22j93J59L85M17K32r3l74l97k64RK97M42L37N2l04m45l64o2K58M18L68J04
1088E60k01l79l66j80J05L73M30K54j03l80m21k39N0K99M16L04Rl00m10k85m0
1109e04K00L40L81J62j82m38m01j11J81L54L31K05p5l18m18k54O4L20L88K53J1
1130D89k59m11l01o1K72L89K83Q5j91l18l54j63J29L83L84J68j26l50l67j91P5
1151d35L12L53K26j5k44l42k98o4K44L84L35M5k16l71l14r6J73L46L14J38j39
1172C36k81l03k21K2K83M11K71o4l14l64j98kJ98L15L36O3k40l52k72n4J39K72
1194a9L29J83j06l48l70j45J20K91L05J82l5k29l28k57l2K35L88K83rk51l28j92
$$ plain form
1045 334 625 536 157 -291 -602 -574 -264 204 555 610 290 -151 -510 -599 -375 45 458 627 433 -7 -422
1066 -422 -615 -456 -71 346 578 485 111 -286 -550 -541 -244 198 535 587 283 -162 -526 -588 -330 88 456 560
1088 560 359 -20 -386 -566 -461 -88 342 596 493 113 -308 -547 -497 -198 218 522 531 231 -179 -464 -504
1109 -504 -304 36 417 579 397 -41 -442 -553 -372 -18 313 518 443 125 -293 -547 -483 -163 225 478 489
1130 489 230 -181 -482 -543 -271 118 401 486 295 -23 -377 -540 -411 -28 356 524 398 48 -319 -510 -435
1151 -435 -123 230 456 441 197 -145 -443 -507 -263 121 456 501 285 -86 -400 -496 -323 23 337 475 336
1172 336 55 -248 -469 -447 -164 247 518 454 140 -224 -422 -424 -226 89 425 488 248 -104 -376 -430 -291 -19
1194 -19 310 493 387 39 -331 -476 -356 -65 240 422 387 158 -170 -427 -459 -224 164 447 438 187 -141 -333
1216c33m5R7K47L45J92j52l63l17q3J25K02K69K64J5l27m29j79J31K47K26J58
1237B90R3j06l29l33q7K14L31K71P2j38l04k77j06R6K55K64K05m9k65l39j58Q7
1259c13J99K23K13J20j78l98l22L3L07K46J10O7k2k07l46k27J55L76K68M1q9j73
1281H3k31k16k3K34L40K02k2k35k62k02k5J59K47K46J12j32l05l12n9K01K38J67
1303B05P6L5j65l11k90N1L26L08J09q6j44j98k16q3J66L18K42Qj75k13k12r9P9
1326b69K30K85J40r4k78l00q1J15K28J76J22Qj10k65k70m1K51L19J56k8j43k00
1348d9k04j06J00L02K48M4j23k03j97j19K1J91K71J95m9k33k74j57O0J87J96J44
1370B45L9j03k07k72r3J69L02K06kj05j69j95j44M6K52K43J03r4j56j81j65m7
$$ plain form
1216 -333 -378 -281 -34 311 503 351 -12 -329 -412 -287 -85 184 448 463 136 -293 -472 -341 -94 132 290
1237 290 383 277 -52 -385 -472 -258 73 344 416 278 -26 -303 -409 -313 -58 206 411 362 97 -242 -400 -313
1259 -313 -114 109 322 442 264 -134 -456 -423 -116 130 240 307 285 78 -268 -495 -340 36 304 345 256 83
1281 83 -148 -364 -387 -153 187 389 367 132 -130 -332 -357 -198 49 295 407 275 -30 -342 -401 -200 38 205
1303 205 281 316 151 -160 -450 -399 -73 235 344 258 114 -84 -300 -383 -217 101 343 351 176 -37 -249 -348 -269
1326 -269 -39 246 386 292 14 -286 -367 -252 -24 152 274 282 172 -93 -363 -404 -153 166 322 294 151 -49
1348 -49 -253 -359 -259 43 291 335 212 9 -188 -307 -286 -95 176 371 322 89 -185 -342 -282 -95 101 245
1370 245 284 181 -26 -298 -391 -222 80 286 284 179 10 -185 -329 -283 -31 212 315 221 65 -116 -281 -328
1392c28J64K91K04m2j72k22j50m4J20K19K04M3r5j65k13j44M7K49K59J09j22j82
1414C0j69j15k0J47K53J80n4j46j74j51p7Q1K59K49K9j78k07j31o8L6J63K37J35
1437C09q0k11j70j07qJ36K66J89m8k09k06q0%N4J69K30P1j29k29j56m5N8J63K39
1461B06J23j05k32j67m2L1Q5J75J94J5j79k39j17J2J04J71J97O9j39k46j48J6
1483b16R7J23J29J27j0k04k46q5R7J58J50J08J4j47k13j23K5J27J55J38L7p5k15
1506d9j83l4J28J61J52N6n8j68j78p8O5J56J43J14lj19k20j50M0J62J81J00qq4
1530A26j63j47m3Q8J66J33P5l8j69j81r6O1J74J81O3l9j43j49j00j0J27J72J12
1553B00J9r7j65j57m4J13J82J62Lq0j54j23p6L7J48J73Q9m4j61j58r0L2J23J52
$$ plain form
1392 -328 -164 127 331 289 117 -105 -255 -299 -179 40 244 287 192 27 -186 -330 -283 -34 225 334 212 30
1414 30 -139 -254 -274 -127 126 306 252 106 -68 -219 -296 -215 44 293 322 144 -63 -194 -262 -226 -63 174 309
1437 309 229 18 -152 -259 -267 -131 135 324 276 67 -139 -219 -219 -165 4 234 305 176 -53 -209 -254 -196 -33 206
1461 206 329 224 -8 -175 -217 -186 -101 74 268 283 104 -135 -252 -240 -136 35 232 301 162 -84 -232 -216
1483 -216 -119 4 133 260 250 46 -200 -285 -188 -30 120 228 242 95 -118 -241 -216 -89 66 204 241 166 -49
1506 -49 -232 -266 -138 23 175 231 173 5 -173 -251 -186 -30 113 227 224 105 -115 -265 -225 -63 118 218 210 126
1530 126 -37 -184 -227 -139 27 160 235 197 28 -153 -249 -188 -14 167 230 191 48 -101 -201 -211 -84 88 200
1553 200 219 122 -43 -200 -244 -131 51 213 216 136 -18 -141 -217 -180 -32 141 230 186 25 -133 -223 -191 -68 84
1577H4J12rr9j48j16l3R4J72J32N0r2j72j37l4N4J41J46P3n0j32j51o5RR5J60
1602H4J21K2j27j97j15K3J18J14R6M6m8j43j68n1Q1J49J34M6l4j10j53j18O6J31
1626c3J72M9k3r8j27j15k6R7J64J28Mp8j64j06l5Q2J23J17L4j0j15j50j22M5J71
1651a6J46M0k7p5j23j07k1J08J70J04l5q3r6j06o9L6J50J62N3q4j53j07l3M7Q1
1676c8J29P6lr8j52r0J4R9J44R7j1q2j19j05n0O0J47J39K2n8j22r5p1K0J13J58
1702A24P7n0j22j30n9K3Q0J00R5M2q8j39j14j5Q8J42Q2L6o0j13j11m1M3J05J12
1727A07O2j4r8j39r1K0Q9J49Q7k9p9j41o8J3M8J09R0N0m4j37j36k9O4J15J15M3
1753A56j4j06j41m7K2J04J10N4%n5j27j19j9J06J29R3lo7j13p6l5L3J11J14N1
$$ plain form
1577 84 196 187 88 -60 -176 -209 -115 57 189 239 147 -25 -162 -196 -142 -1 145 218 168 36 -115 -180 -171 -76 84
1602 84 205 227 100 -97 -212 -189 -71 43 139 185 137 -6 -174 -225 -144 5 139 185 151 41 -112 -230 -164 -33
1626 -33 139 188 165 67 -60 -175 -201 -104 60 188 192 114 -50 -156 -191 -109 14 131 165 155 40 -110 -232 -187 -16
1651 -16 130 170 143 68 -55 -162 -183 -75 95 199 164 81 -15 -121 -190 -154 -4 158 211 127 -26 -133 -166 -119 -38
1676 -38 91 167 164 66 -86 -176 -162 -63 81 178 167 85 -34 -139 -189 -129 18 157 179 121 -1 -96 -167 -147 -34 124
1702 124 201 151 29 -101 -160 -137 -57 43 138 180 92 -47 -161 -176 -88 54 136 172 112 -1 -112 -153 -110 -5 107
1727 107 169 155 57 -82 -173 -153 -64 85 172 143 64 -77 -145 -132 -84 25 115 165 121 -16 -152 -181 -117 -2 113 156
1753 156 142 36 -105 -152 -130 -26 84 138 138 83 -44 -163 -182 -76 53 146 143 76 -37 -113 -148 -115 -4 110 161
1778A61l9r7j20n6K4J04J07N8j1r1r7o5j6O0J25R2K3o7j17r0m2O2J13J01K3n7
1804H8q3q1n5%O5J31R5k0r7j34n3J2P9J05P8Po2j07p0k6M6Q1R5O3k4j15j28m0
1832a50L7J11R1M8k6n8j08p2mP6R4Q1K4o4j08j04qO8J08Q4mk5p8j04n5L8R7R4
1860H3N1j4q9j07n8jJ08Q9N4k4m9p8n9m3M5J19R0J4n7p3j02l5L2J09Q9K6l0o3
1888B7p0p0rP3J21O9j4j00p7n2j9N0J03R1Oo3r0m2m4NP3J27M9l3j03r6k6J5P6
1917b3Q7N7k5m5q2p3k2M8J03J03Ko9q7n5k0K1O8R4M7n3j00m4k4KL5R3R9mr7j26
1947i0k6L4M8O1M7L5k8j04o6j6L5Q6Q3L2n1o7q5l2K4O3P9P3k7q5r4k6J4L7N6R1
1977A01L6o9j20q0K8P5M8K2M2K6r4j00m5M1Q4P8K2j5n0q7n0K5M2P9N7Jm6p9p3
$$ plain form
1778 161 122 25 -95 -151 -127 -23 84 142 131 40 -57 -122 -138 -78 47 139 162 95 -22 -112 -154 -92 21 122 145 88
1804 88 5 -76 -131 -131 -66 65 160 140 43 -91 -144 -132 -53 52 130 137 75 -32 -102 -128 -82 -1 94 157 133 18 -110 -150
1832 -150 -113 -2 89 137 111 53 -55 -127 -131 -55 39 120 144 80 -28 -132 -140 -72 36 120 116 91 13 -91 -146 -108 -11 83
1860 83 134 120 31 -76 -134 -135 -27 62 116 92 43 -35 -94 -137 -92 27 117 131 74 1 -101 -136 -104 5 94 120 90 27
1888 27 -43 -113 -122 -49 72 141 127 27 -50 -102 -121 -71 32 123 129 66 -24 -66 -110 -105 -32 95 144 111 8 -88 -114 -99 -23
1917 -23 64 121 96 51 -31 -104 -126 -78 25 128 130 61 -26 -81 -101 -80 -12 82 129 76 -24 -68 -92 -90 -55 38 137 133 36 -90
1947 -90 -116 -82 -34 27 74 109 81 -23 -89 -105 -70 16 99 131 80 13 -72 -104 -80 -17 62 135 108 23 -71 -97 -83 -46 10 101
1977 101 137 68 -52 -132 -104 -29 19 41 83 109 15 -85 -130 -89 -5 73 95 80 30 -57 -107 -82 -40 39 96 97 51 -28 -101
2006a01ML5O3P9K9k3j11q3OO9M2L4J9M0m9j05p1L4P7P4L0pk5q7o7j5P9N7M5K7
2036I9m9o4n3k4J8P2N9M3kq1r4m6M2Q5L4K9Rj1p8r7j0R4Q6K6j9j5l8q0m9M3R0
2067A9O6lk7l8o7m7J1O8P0M7j9n3o5m9OM9O5K2K3k0m4q3l6K7J10N1ml9l3m3n2
2098h8%O4R5Qk2k9m9n9l2M7J06M8jm8o8m3k8M8O0N9Oj8n3m5n5NP0R1J4l1n5m5
2130d8k2k1M7O4P0j8n1m6k9k4J3O4P2K1m7n9m4k3K7K6O8N1j2o9m2m3J2L8P0M6
2160I1j1m9o2k3j5K0M6N6L8l8o9n1j1K5M4M9M8k3o2n1j8J2K6N7M4Qk2q3n5nM3
2191d1N4N0J7k6n6o6KK6L3M8L7j0l5q4l6K1M9N6J5J1l6n8n0ML9M6L9K8j9n7o5
2222f4j2K8O0M1J1k6l4n1k3LL3P0L1ml3o3l2j0L2P6K5j3l2l9k5l9L6M4O3J7ro1
$$ plain form
2006 -101 -97 -62 1 80 109 86 -25 -108 -102 -33 9 43 62 102 53 -52 -123 -89 -12 62 92 85 60 -27 -94 -109 -30 27 72 99
2036 99 50 -14 -67 -91 -73 -1 58 101 99 18 -76 -122 -80 5 39 68 77 66 -12 -109 -119 -25 61 87 68 53 15 -65 -114 -71 19
2067 19 85 82 55 17 -50 -97 -86 -18 52 99 80 27 -38 -87 -81 -32 33 55 78 58 14 -69 -105 -78 32 83 79 40 7 -36 -88
2098 -88 -88 -24 71 79 57 28 -21 -80 -112 -65 41 89 88 40 -28 -71 -99 -51 9 68 74 56 3 -42 -97 -92 -22 69 83 52 -3 -48
2130 -48 -70 -91 -44 20 90 72 21 -25 -54 -78 -65 -1 71 92 45 -14 -58 -81 -54 -28 40 91 79 10 -32 -75 -63 -25 45 91
2160 91 80 31 -31 -54 -69 -49 -3 53 91 53 -16 -67 -78 -53 -9 40 88 65 3 -48 -66 -54 -28 29 73 81 59 -24 -79 -84 -41
2191 -41 13 63 80 54 -2 -68 -66 -40 -7 41 78 68 33 -51 -87 -66 -17 39 54 65 29 -29 -79 -75 -36 10 49 77 58 1 -64
2222 -64 -76 -48 12 53 64 38 4 -47 -70 -67 -34 36 67 63 30 -33 -65 -75 -43 33 58 45 13 -26 -51 -90 -54 -10 53 70 61 0
2254@m5k4RM9O6J7j8m1m9k3j1K4O6N8ln3l3m1j3J4N1N4J2k7m6k7k0%K6O0O1k1
2286G2o3m8j9OL4L0M4J6m7o0k1pK8L7M4L3l0o3n3J4kM4L8L3Oo2n2jlK2M2N5J3
2319H0m0o1n2K4L2K4K6M8k2n9o1mL1K5L6J8J0l3n5m1L6L6L7J9Lk8m8m4%L4N0K3
2351D4Pj2m0n1MK2L4K1K5jk9o3m1L4M2K9K1j1j4k9o1nM9N2M%prm9l3K0N2N8mk7
2386C2l1j8j7%J2O1K5ql4m1j2j5L4L4L1Pm0j6m1j9K7L6K7Mnl9k4k7%M1N3K5k7
2419C5j9l7j7LJ4L5K9J7l9m3l9J4J6L6K4K8k3l4n9JJ9K5L8J6ok3l7j9j4L2O4J6
2451E3k0j9k6k6NlL8M2K3l8m7j4j8L0J5L0K1Om5n0k5L8J4L1J4J6k2k4m5j6L4N2
2483B4J3Oj2l8k4k4J5M2L5lqj4m2j5J5J0M1K6oj6m9l0J9J7K5L0Mj0l3l2k3K4M3
$$ plain form
2254 0 -45 -69 -60 -11 55 72 54 13 -36 -59 -70 -46 20 78 75 22 -11 -52 -65 -51 0 54 66 39 -7 -34 -54 -54 -28 32 93 72
2286 72 9 -39 -58 -52 -18 12 56 72 25 -35 -56 -63 -35 2 46 79 49 -14 -67 -53 -55 -11 27 60 66 4 -48 -49 -52 -30 12 67 80
2319 80 40 -21 -73 -49 -17 7 33 81 59 0 -61 -65 -34 -9 27 45 55 22 -33 -74 -38 -2 35 54 57 29 -19 -63 -63 -29 21 44
2351 44 51 39 -1 -52 -48 -26 8 29 54 53 24 -39 -80 -46 -4 25 46 35 21 -8 -69 -74 -25 27 31 31 24 15 -34 -67 -47 5 63 59 32
2386 32 1 -17 -34 -34 -22 39 64 56 22 -19 -31 -46 -12 22 53 60 20 4 -37 -56 -29 7 34 38 33 -6 -30 -57 -57 -16 37 62 35
2419 35 16 -21 -38 -35 -21 14 43 60 21 -22 -61 -47 -31 5 29 57 34 0 -59 -58 -39 -14 24 40 34 11 -26 -45 -59 -27 37 53
2451 53 33 14 -12 -38 -33 -36 2 44 67 29 -18 -32 -50 -20 -5 25 46 52 7 -43 -68 -30 -16 15 29 45 23 -1 -46 -62 -28 24
2483 24 37 43 31 -7 -31 -55 -40 2 37 34 26 12 -30 -45 -30 -20 21 47 41 25 -24 -54 -35 -18 7 37 41 31 -2 -34 -57 -33 10
2516A0L8pj5k2pk9j4K4M8K0qk4k4j9pPL2L9lj5m2k1JQJ6L0K1nl9l5j2J2M2K8j
2551B7jrl3j6rK9K2L7Kk6m0j5mnM4K3J9j0n1j2nQ%K2L9%k7l8j0J5K7J6K2Kk3l5
2587a5j4j0J9K7L0J4j0l3l8j5K5J5J7K2Ql2m3j8J2K7K1oK7j3k5l5KK7L6J1plo
2620A7m0rlM7L2ok5Jl7j8JL6M3j1lqk1k4j4K5L1L1j2j2j1m5rJ2L4L7Lj3k9j0j8
2655b8pL4J9J8ok5j7ql4K8L8J9qj6ok1j8J4J8L3Mnl2nj7KJ3L1K3j2k1j9j4lKL2
2691FJ2K3j4m3j2R%J1K8Q%j6k9j1QPK3K9mm0j4j5J2RJ6K9Kj2l0prJ1J4K3Qnk6
2728Am1JK4LJ8J6jj6l1j5LK5J1K8Kj4k8roPK0J8J7j1k4k4J1oJ2L0J9jl0k7j4O
2764b6L1%K2Oj1l0k7QJ1K3J8pjj4j9lOJ1K0J8ok0l8mNK3J0J7J5j6l6k3J2K0QJ1
$$ plain form
2516 10 48 41 26 4 -3 -32 -46 -22 26 46 38 14 -10 -29 -36 -29 3 42 39 24 -18 -39 -38 -30 -14 16 37 32 -7 -42 -54 -42 0 28 27
2551 27 26 17 -16 -32 -41 -12 10 47 49 23 -17 -32 -36 -41 3 26 45 35 -16 -28 -33 -25 -25 -3 36 36 9 -29 -39 -24 3 19 41 43 20 -15
2587 -15 -29 -39 -20 7 37 51 41 8 -30 -45 -20 -5 12 34 42 10 -33 -51 -39 -12 9 3 30 17 -8 -43 -41 -14 22 33 26 23 17
2620 17 -23 -32 -35 12 44 38 13 14 -23 -41 -40 -4 39 28 25 17 -4 -28 -42 -17 14 45 33 21 10 -35 -44 -32 2 39 42 29 0 -10 -28
2655 -28 -35 -1 18 36 30 5 -12 -20 -54 -26 12 31 23 7 1 -20 -38 -24 -6 27 31 26 -6 -11 -28 -26 -13 18 41 29 8 -11 -25 -28 -26 6
2691 6 18 41 27 -16 -28 -19 -19 -8 20 28 28 12 -17 -28 -20 -13 10 39 35 -5 -19 -34 -22 -13 3 32 34 22 -8 -15 -24 -13 1 24 32 27 1
2728 1 -40 -39 -15 -12 6 22 21 5 -26 -41 -38 -13 -2 26 28 14 -14 -23 -29 -22 -2 16 33 22 -2 -26 -15 -21 -9 21 40 39 9 -18 -32 -26
2764 -26 5 5 27 33 22 -8 -35 -27 -16 7 25 18 17 3 -16 -19 -13 -2 18 36 30 10 -28 -32 -27 -4 6 23 38 22 -14 -37 -25 -5 3 14
2800A4J9nj6l3j6NK3L0Jk2J4k7pj6K2L6J1nj8j1j9OQMK8O%k9k4p%L5ONmoj4k5
2838c1nL0K5kprj7nrPK1L2Pk1j6l6OJ1J9K1MNj7l2nJJ8J1%Kjk1qoJ0K3L1j8k0
2877bj3%Rk3K7K8Rj1k8j5MKJ0PJ2Qj4k7moJ8K7jJ0j5j5k3pJ2J2K6J4k3ok8kLJ3
2915a2J9J8j3pl5QLQLL2%j8j7k5RJ6K0LNqj0k8j1K2J7J9pOj0j3j2k0J8L5Npj4
2952aj4oJJ3J8NOj5j8j5%MK3J1Jj1%j7j6rK8K5pj0OrrrmL7J8j0k2Lj5Nj3J2K4
2991A0K0ok1l7MQJ6J2J0Jj5j0k1LJ0QJ2J4pj6j1nj2K8J8mPk4j0mN%K0K3Ok8j9
3028a5jqJQK9jj1l3J0mQPJ5J0j8jk6NJ3OROMrk5jRJ4pK4lJk2l1PK5jQK1k3Kk6
3070b4%LJ8KMK2j2m4JJ8K0kJ2Pj4j5roQJ8N%Nj2j2k4NK8J2lj7Qqj2j4J8J2RLn
$$ plain form
2800 14 33 28 12 -21 -37 -32 -9 21 22 0 14 -13 -20 -36 -14 22 33 28 10 -1 -20 -14 -6 -2 26 32 32 3 -21 -28 -28 7 13 18 14 8 -6 -31
2838 -31 -36 -6 19 17 10 1 -16 -21 -30 -23 -2 30 37 16 0 -36 -30 -19 0 21 25 30 13 -19 -24 -23 -5 6 6 8 7 -14 -22 -28 -18 5 36 18 -2
2877 -2 -15 -15 -6 -29 -2 26 35 24 -4 -19 -15 -13 -3 4 16 24 10 -17 -21 -27 -9 18 17 27 12 -3 -26 -33 -21 -9 17 31 8 2 -26 -28 -25 -12
2915 -12 7 25 12 5 -30 -22 -19 -11 -8 24 24 6 -11 -36 -27 -11 9 12 17 9 -1 -29 -40 -18 -1 18 11 17 7 -6 -18 -38 -20 15 20 13 -1
2952 -1 -15 -21 -20 -7 11 16 22 7 -11 -26 -26 -22 1 12 13 2 2 -15 -31 -40 -12 13 6 -4 2 -7 -16 -25 -29 8 26 16 -6 -3 -18 -13 -26 -14 10
2991 10 30 24 3 -34 -30 -22 -6 6 16 17 2 -8 -29 -26 -16 -8 4 18 11 -5 -16 -21 -33 -5 13 9 16 -8 -18 -22 -17 -17 3 26 32 4 -15
3028 -15 -16 -24 -23 -15 14 13 2 -31 -21 -25 -17 -10 5 15 -3 -4 -30 -25 -12 -6 3 9 13 4 -21 -22 -13 1 -6 18 15 16 -6 -37 -30 -5 -6 2 23 0 2 -24
3070 -24 -24 -21 -3 -1 3 25 13 -31 -30 -12 8 6 18 25 11 -4 -13 -19 -11 7 12 12 17 5 -7 -31 -26 2 14 11 -6 2 -6 -18 -32 -14 -2 7 10 5
3110Eok1kJ6PJ4J0j8jj9rNJ8MO%nll1kK1J5J9k7Jj3nlKQL8j6pj2kqJPQJ7lk6o
3153b3OJ4nJ4J1%j9j5ojJ1J6jljj3j4JmJ6K5Qj0j3j8OjK7jJ1Jmk5j4J7JJ2j5K0
3192A1Nj4j9jOK7pj5OKj4pjMJ7K0k3Lj2okJK5JJ3ok2j7J5%OJ4lpoj9j6K1J3J0
3232Cjj1Rmpj0QK5o%nJj2ljLL0j0jj6mMmQQJ6lqj3j1nJ9RJpMj8j9QJ4Q%Ojj0j2
3278a8MJJ1J7Qj7j2%lmNNJ8Nrj3j7J5%jkJ2mLj5j5J0POJ9qnk0PmJ3RMlmpoRJK
3323DPJ1j2j5j5J8qjLK0Jj0j6lNJ0JMn%j3koNJ8J1Nl2MJ0j2mJ2J5oQj9qjJ9j6
3364a3J9kJ6mk1nrQJ0J0Klj1o%MJ1KJ2j9pjjJ3nJ1KMqqj1Nj9K5OJ6j8Jj0k0OJ3
3406eLQrorpJ8%J4qJ0j6Nj7J4j4J7qK3k3J%pJ1JJ3nLj1JooQRJ5rMj2j3lJ2KJ2
$$ plain form
3110 5 -1 -22 -24 -8 -1 13 23 5 4 -15 -24 -19 -1 3 9 9 4 1 -30 -32 -11 4 23 -4 -3 -16 -21 -24 -22 -14 24 8 1 -11 -13 -21 -20 -13 -5 12 9 -17 -23
3153 -23 -17 -3 -8 6 17 17 -2 -17 -23 -24 -13 3 2 -1 -2 -15 -29 -28 -32 -16 9 17 7 -6 -24 -18 -19 8 7 18 19 15 -10 -24 -7 -6 6 -9 11
3192 11 16 2 -17 -18 -12 15 8 -7 -1 1 -13 -20 -21 -17 0 20 -3 0 -12 -18 -20 -19 6 7 20 14 -8 -25 -10 -10 -4 10 7 0 -6 -25 -41 -20 -7 3
3232 3 2 -9 0 -4 -11 -21 -13 12 6 6 1 2 -10 -13 -14 -11 19 9 8 -8 -12 -8 -12 -4 4 20 17 9 -4 -15 -20 -1 8 9 2 6 -12 -31 -23 -9 -1 -1 5 4 -6 -18
3278 -18 -14 -13 -2 15 23 6 -6 -6 -9 -13 -8 -3 15 20 11 -2 -19 -4 -4 -5 -7 5 1 4 -11 -26 -16 -9 -3 16 8 3 -17 -10 -14 -1 8 12 9 5 -2 -8 1 2 4
3323 4 11 22 10 -5 -20 -2 -10 -11 -8 12 13 3 -13 -16 -11 -1 0 4 -1 -1 -14 -16 -22 -17 1 12 17 -15 -11 -1 -13 -17 -5 10 4 12 -7 -15 -16 3 -13
3364 -13 6 4 20 16 -5 -10 -19 -11 -1 9 11 8 -3 -9 -9 -5 6 8 20 1 -6 -7 -8 5 0 11 13 17 9 1 -10 -5 -24 1 7 23 5 6 -4 -24 -18 -5
3406 -5 -2 6 -3 -9 -18 -25 -7 -7 7 -1 9 -7 -2 -19 -5 -19 -2 -10 13 -10 -9 -9 -16 -5 -4 9 4 7 -4 -3 -9 -15 -7 2 17 8 12 0 -13 -16 -4 -2 10
3449A0olj0lJ4j1J0J2Jj7PqnJlJ9Kpj1mnLKQNJ6j8j4mpJ8J3qJ8lj5lqJ1LKJ0p
3492Ek1KJ2pLoJ6KOk3nKPlJ4pmLmJJ4KmlJ2j6j2OpJ5JJ2pLk1nNoJ6KMKj6LjkJ2
3539BoJ8lk1Jj4K0qJ4MQj5mqoJ2K1Llj5jkqJ2pJ3J0j2lj1OmNlMJ0mj3lKJ0QRN
3583B3j5kj5J0lMK0jk3%lj4J7j1J8Rooj6j2J2%J1jJ0Lk1%LQNJkJrjO%%LKNLj9
3627fLj1kK9krLrjrkJ7nP%rNk1QJ1PrK2j5%mjJ3l%lNj9J1k2MJ2J1lj6J1j3JJ5
3671ArJ0Olj2nJ2jMJ0nnJj3%ONLOqK%Kj7QPqPqJnJ1k0LJ1L%kon%jJ2jMLpj4JK5
3721IorKNj1mj0kJ7J7j4Lj4J6nqMR%J9k2joJKjRJ0pmmoJNJ4LnpmLj3J1MKkLnp
3769hkQJ3j4jQpj2MJ5oQjRrj1JMKmJ0lJ1qj2mJ3kJ1qj2J5k6lLJ9Okj1Qj0mNKJ7
$$ plain form
3449 10 4 1 -9 -12 2 -9 1 13 14 -3 4 -4 -9 -8 -11 8 10 3 -8 -12 -17 -14 -12 -4 1 17 -1 -15 -19 -26 -8 5 -3 15 12 -3 -6 -14 -3 0 2 12 5
3492 5 -16 -14 -2 -9 -6 -12 4 6 12 -11 -16 -14 -7 -10 4 -3 -7 -4 -8 -7 7 9 5 2 14 -2 -14 -8 -15 0 1 13 6 9 -12 -17 -12 -18 -2 0 4 6 -10 -7 -8 -10 2
3539 2 -4 14 11 -10 -9 -23 -3 -11 3 7 15 0 -4 -12 -18 -6 15 18 15 0 -1 -3 -11 1 -6 7 17 5 2 -9 -3 -7 -2 -5 -1 9 5 -8 -11 -9 1 9 18 23
3583 23 8 6 -9 1 -2 2 22 21 -2 -2 -5 -19 -2 -13 5 14 8 2 -14 -26 -14 -14 -3 -4 6 9 -12 -12 -9 -1 4 5 3 4 -5 -6 0 0 0 3 5 10 13 -6
3627 -6 -3 -14 -16 13 11 2 5 -4 -5 -14 -16 1 -4 3 3 -6 -1 -22 -14 -3 4 -5 17 2 2 -2 -3 10 7 7 4 9 -10 1 -21 -17 -5 6 3 -13 -2 -15 -14 1
3671 1 -8 2 8 5 -7 -12 0 -1 3 13 8 3 4 -9 -9 -3 2 5 11 3 5 5 7 -10 -2 5 -3 4 -4 -3 -8 3 -17 -14 -3 0 0 -2 -8 -13 -13 -14 -2 -3 1 4 -3 -17 -16 9
3721 9 3 -6 -4 1 -10 -14 -24 -26 -9 8 -6 -3 -17 -1 -6 -14 -10 -1 -1 18 -4 -5 -11 -10 -8 -9 0 10 3 -1 -5 -11 -10 -5 9 12 7 0 -4 -1 -14 -3 1 3 1 4 -1 -8
3769 -8 -10 -2 11 -3 -4 4 -3 -15 -11 4 -2 6 5 14 5 -6 -5 -1 1 -3 7 4 15 7 -5 -9 4 2 13 5 -7 8 -18 -21 -18 1 7 5 -6 2 -8 -12 -7 -5 12
3814A2q%Mj6J1kJOnjRk0KKMoRqJ5j0%pqJ0%LkNj3kKQMMoR%j4NJ3qRRj9OqKnJl
3864fKKNpj5PJ0jJ3oj0MlPKMj1Rjr%%MkmMJ4k0%JlnJ8n%J9j8j8J6j1nJ5mmJ3o
3910eqpJ3J2oKJ0j3rKPL%Rnj5nOjoK4lNj2Oj7KQMJ0j0lmLqPoJJ0LnjnJKRj8NJ1
3959Cqj3J1nPPopMQqOkoOoLj2QJ4lMJ6k0Lpj3RjJ7j1KO%j2KJ0j3P%JJ0k7J0Oo
4005fkJ0Mj6RnkPMklQk5LJ5j0J8j1lLkj0OJ3nomRj1PoLmK8j8pjJJj6K1RmOmoO
4052BkmLJ1kolrNJ%%rJ0rJJK0j9LPr%MoJ1mJ0j2J2j5kKlLNj0K0kjqj5LJ3J2qm
4099cmlNqJ0%rQkOlrnK5j0j1J5plkLJ1Lj8J6nj0QjpKMKkj2PM%nJJ1j8J0j4J1j
4145a0JJ4j0kJ4nrLPQlkkj7jKOMJmj6RLQlPnJ1oj7K4j7J5njKMkj3%P%mmJ9Mj5
$$ plain form
3814 12 4 4 8 -8 3 1 2 8 3 2 11 -9 -7 -5 -1 -7 2 -6 9 -1 -1 -8 -16 -6 -6 -3 -5 0 -13 -15 -13 -5 -1 3 -3 6 6 -8 -3 10 2 11 20 1 7 -1 1 -4 -3 -6
3864 -6 -4 -2 3 -4 -19 -12 -2 -3 10 4 -6 -2 -5 2 4 8 -3 6 5 -4 -4 -4 0 -2 -6 -2 12 -8 -8 -7 -10 -15 3 -2 -2 17 -1 -19 -3 -14 -19 -4 -8 -12 1 -5
3910 -5 -13 -20 -7 5 -1 1 11 -2 -11 -9 -2 1 1 10 5 -10 -15 -9 -10 -16 8 5 10 -2 4 -13 -11 -3 1 11 1 -2 -6 -3 -11 -4 -10 -9 1 4 -1 -2 -7 -6 -4 5 -13 -8 3
3959 3 -5 -18 -7 -12 -5 2 -4 -11 -7 1 -7 -1 -3 -9 -3 -9 -6 -18 -10 4 1 5 21 1 4 -3 -16 -7 -8 9 -2 0 6 6 -6 -4 6 -7 0 0 1 11 -16 -6 0 -6
4005 -6 -8 2 6 -10 -1 -6 -8 -1 3 1 -2 6 -19 -16 -1 -11 7 -4 -7 -4 -6 -16 -10 3 -2 -8 -12 -3 -14 -7 -13 -10 -14 14 -4 -11 -12 -11 -10 -26 -5 4 0 6 2 -4 2
4052 2 0 -4 -1 10 8 2 -1 -10 -5 -4 -4 -4 -13 -3 -12 -11 -10 10 -9 -6 1 -8 -8 -4 -10 1 -3 7 -5 7 -8 -10 -8 -11 -8 -3 -13 7 5 4 -4 -19 -16 -3 9 1 -3
4099 -3 -7 -10 -5 -13 -3 -3 -12 -4 -6 0 -3 -12 -17 8 -2 -13 2 -5 -8 -10 -7 4 7 -11 5 0 -10 -2 -3 -10 -8 -4 -2 -4 -16 -9 -5 -5 -10 -9 2 -16 -6 -20 -9 -10
4145 -10 -9 5 -5 -7 7 2 -7 -4 3 11 8 6 4 -13 -14 -12 -6 -2 -1 -5 -21 -12 -9 -1 -4 3 -2 9 3 -14 10 -7 8 3 2 4 8 6 -7 -7 0 0 -4 -8 11 15 0
4192@K%jKJ4j8J2kj0j0LKj1J6n%MOKj1KRmqMrJ6j8J4LLj2NrJ1o%LOj4PmoQ%J1
4238Gj2MQpNj0oJ4Lkkmj1J4MrMK%Kj7jMPpJ8j7ONj7nJ0J0j4J1NqqkJ5nJ3qJlp
4284a0KJ3nOK%Rk6PNqQMpKjj1kJ0pJ1oKoNj2J7MqJ9j9PMnj3J4OoMj5NkMj1QrJ
4331a0J3j1PkNp%%Pj2J2j3NoJ2K%Mj6JJ3mRjj4J3j4MjKj0J6jl%j9J7jQnQpMlq
4376fRJlO%kqoRqJ5JqrJ0Kj8PPJOonl%Kj5MJ6oJRj7J0PnJ4j8QJj3MKj0J5j3RJ4
4424A1j8JKJ2olJ0nrmRmLlN%Pj4%%kJ4j3%ML%mkJ2Klnjj2J0mNjLjj%J3k2ONqO
4473bJKpMOj2QJ0jmkNpJ1j2NQKk2kJ4kJPLooqOrJ2llmKJ%%oJ5MolnmJJ4j0QJR
4524A4k0lJ5mlrJ2Klj0J2j2J8JlmJj0OOj4PRkqkJ0pJ1j2QMnklMj3J2OpjppJ1l
$$ plain form
4192 0 2 2 1 3 17 -1 11 9 -1 -11 -8 -6 -17 -1 -6 -6 -2 4 6 -5 -3 6 2 -6 -2 -11 5 -13 1 4 7 -5 0 -9 2 -4 -4 -1 5 -9 -2 -6 -12 -4 -4 7
4238 7 -5 -1 7 0 5 -5 -11 3 6 4 2 -2 -13 1 5 -4 0 2 2 4 -13 -14 -10 -3 -10 8 -9 -3 2 -15 -20 -10 0 -14 -3 2 -6 -14 -16 -1 -6 7 -1 0 -3 -10
4284 -10 -8 5 0 6 8 8 17 -9 -2 3 -5 3 7 0 2 1 -10 -12 -2 -9 2 -4 -2 -8 -3 -15 2 6 -2 17 -2 5 9 4 -9 5 11 5 9 -6 -1 -3 1 -10 -2 -11 -10
4331 -10 3 -8 -1 -3 2 -5 -5 -5 2 -10 2 -11 -6 -12 0 2 2 6 -10 -9 4 0 9 8 -6 7 -7 -3 -4 -2 -12 4 3 0 0 -19 -2 -3 5 0 8 1 5 2 -6
4376 -6 3 4 1 7 7 5 -3 -9 0 -8 7 8 0 -9 1 3 -15 -8 -1 0 6 0 -5 -8 -8 -6 -21 -17 -1 -7 -6 3 -14 -4 3 -2 12 -6 2 3 -10 -6 -4 -14 1 -12 -3 11
4424 11 -7 -6 -4 8 2 -1 9 4 -5 -9 0 -4 -1 -4 1 1 8 -6 -6 -6 -8 6 -7 -7 -3 0 0 -4 -6 6 8 5 0 -1 -13 -3 -7 -2 -3 0 -1 -2 -2 11 -11 -5 0 -8 -2
4473 -2 -1 1 -6 -2 4 -8 0 10 9 5 3 8 1 12 0 5 13 15 -7 -9 5 3 4 11 14 8 2 -6 0 -9 3 0 -3 -7 -5 -4 -4 -4 -10 5 9 3 0 -5 -9 -8 6 -4 4 5 14
4524 14 -6 -9 6 2 -1 -10 2 4 1 -9 3 -9 9 10 7 3 4 -6 0 6 -8 -1 8 6 -2 -4 6 -1 10 -2 6 10 5 3 0 4 -9 3 9 2 1 -6 -13 -2 -5
4569enQMMoj5J1ORj5PjnKj%kNj4J7oj1J5j1jJ6JrKNrMrMJ0pJ0Kj0Oj9J4onJ5k
4615Cm%Rj5JLKJ3k5JQqjJ3pJj0J7lkKnJ8k6J5j1jRlKKMj3OLmOPlJpQj1jkJLMm
4664dMlJrPmNQj0Lj9J8MK%J1kj5oJMkNLJ0j0OopOlmJrPMj2RMKoNj3oJ7ojJ6ol
4714cj2J0QJj0PJ3rnj1J6njnLJ2knKkJ6j3rNNnj1PkOmJ6j5JkOoPpnMMpmJ4j3J3
4761CkPk1J4Jj3oJ2Nj0kJ1kJ0poJ2lQjj3P%Jjj0KPklljKJ3k0J1Ooj3J0mj2PKP
4806cLpRJqRRj4LNrPonJ1rjkJ2j8J4j3Oq%koJ7rNM%OrJ6jk1J8kj0L%%LPLjjMp
4856CjJjklMQj4oJ3j3OL%NLpqJ1Oj1LJ4j0lpJJJ0j1NJ0j4J0nJ2j3NOj1NooNj0
4901a2mK2j0MLrLj1J5LLqjKj4K6j2mJ4Jj6j0J6jjnmJ5kkmrJ2Kkj1J4jj1Q%j1K4
$$ plain form
4569 -5 -10 -2 2 6 0 -15 -4 2 11 -4 3 2 -3 -1 -2 -2 -4 1 -13 4 -2 -13 2 -9 -10 6 7 -2 0 5 -4 0 -9 -5 5 -2 8 10 0 6 -13 1 -5 -10 5 3
4615 3 -1 -1 8 -7 -6 -3 -1 12 -13 -12 -4 -12 -13 0 -7 -6 -16 1 -2 -4 -2 -7 11 -15 0 -11 -12 -3 -6 -4 -2 2 -11 -5 -2 -6 0 7 4 5 -2 6 -5 -6 -8 -7 -4 0 -4
4664 -4 0 -3 -2 -11 -4 -8 -3 5 -5 -2 -21 -3 1 3 3 14 12 -3 -9 -8 -4 -6 -1 2 12 2 8 2 -5 1 -2 -6 -5 -14 -7 -3 -15 -6 -2 0 -6 -1 -14 -20 -3 -9 -10 6 0 -3
4714 -3 -15 -5 3 4 -6 1 14 5 0 -11 5 0 -1 -6 -3 9 7 2 4 2 18 5 -4 1 6 1 -10 -3 -5 1 -3 13 -2 -1 -3 3 -3 4 -3 -8 -4 0 -7 -11 3 -10 3
4761 3 1 8 -13 1 2 -11 -17 -5 0 -10 -12 -1 -3 7 0 -6 6 3 11 10 -3 4 4 5 4 -6 -4 3 1 -2 -5 -6 -4 9 -11 0 6 0 -13 -3 -7 -19 -12 -10 -3
4806 -3 0 -7 2 3 -5 4 13 -1 2 7 -2 5 -1 -6 5 -4 -5 -7 5 -13 1 -12 -6 -14 -14 -16 -22 -5 -14 -9 -5 -5 1 -8 8 7 -14 4 2 -8 -5 -5 -5 -2 5 8 7 6 10 3
4856 3 2 3 2 0 -3 1 9 -5 -11 2 -11 -5 -2 -2 3 6 -1 -9 2 8 -3 0 14 4 1 -6 -5 -4 6 -5 0 10 -4 6 1 13 0 5 11 0 5 -1 -7 -2 -12
4901 -12 -16 6 -4 0 3 -6 -3 -14 1 4 7 -1 -2 0 -14 12 0 -4 10 11 -5 -15 1 0 -1 -6 -10 5 3 1 -3 -12 0 2 0 -11 3 2 -9 -1 -1 -12 12
4944A2kqlLoJJpJ0oJ1j1PjQjj2KjRj2MjmJ8j0j3RJ%J1qRj1LQqMLrPmj1J2KlpM
4992@lN%LJ0nk0LN%j4QNqK0rrRJ1j4J0kj1J2mKKrPqJnPOnoMnJ5k2pK9k1PRojj1
5040a5K0jj1NPLqJJJOj0PJ2k5J0j4J1Nm%%%J%mqOJlNMj0QlmlQ%Oj4jJ1%oJ0nP
5088Gnj0%J9Lj8lJ4pNlMJmJj2OOmn%kK1j0rNllqJ4oJ4kl%pOj1oJ0J5nqNMrjoJ1
5137AqlLJ2j1lNj1RLloJ6qQnLnoJ4o%rQmQqJ0LmokjkJ1j2JOMmJ0j3JkRJj6K0p
5186Aj1J2Qj5PJj2J0nlJ4j5%%OqjQljOJLj0ORj6J2jQj4OrJ4%lmLNkj2%J2j1MK
5232BoNNj2Ljm%KJ4%j6KLj0J3kkkNjJ3rkOj1RqqkOJjqJ4%J5j8RpJlOpRlNm%jo
5283fjPKmMjqLJ1pmLJ9j9j1J3KqNjlkKjnJlKRrJ1jjKj9J6Mj9J3pNjoJ1ojLnmQ
$$ plain form
4944 12 10 2 -1 2 -4 -3 -2 -9 1 -5 6 -5 2 1 9 8 -4 -2 -3 6 -6 -2 -3 -7 11 1 -12 -3 -2 -2 9 1 10 -1 2 10 2 6 9 0 7 3 -8 4 6 3 -4 0
4992 0 -3 2 2 5 15 10 -10 -7 -2 -2 -16 -8 -3 -11 9 0 -9 0 11 -3 7 5 -6 6 2 4 6 -3 4 -4 -3 -8 -1 5 0 -6 -2 -7 8 -14 -21 8 -13 -6 3 -3 -4 -15
5040 -15 5 4 -7 -2 5 8 0 1 2 3 9 -1 6 18 -7 3 -11 0 5 1 1 1 1 2 2 -2 -10 -4 -3 -6 -1 3 -7 1 -2 -6 -9 -1 -1 5 -9 -10 1 1 -5 5 0 7
5088 7 2 -8 -8 11 14 -4 -7 7 0 5 2 6 7 3 4 -8 -2 4 0 -5 -5 -7 14 4 -5 0 -3 -6 -14 0 -6 8 6 3 3 -4 2 -9 -15 -5 10 5 -3 2 6 -3 -4 -10 1
5137 1 -7 -10 -7 5 -6 -9 -4 -15 -6 -3 -6 -12 4 -4 4 -1 2 -3 -9 5 -1 -1 -10 -2 -6 2 -6 4 7 3 -3 -5 -6 -8 3 -9 -8 -2 2 -2 8 -5 -4 -6 3 4 -12 8 1
5186 1 -10 2 10 -5 2 3 -9 1 -4 -7 7 -8 -8 -8 -2 -10 -11 -3 -6 -7 -1 0 3 -7 -1 8 -8 4 3 11 -3 3 -6 8 8 5 1 4 9 7 -5 -5 7 -4 0 2
5232 2 -4 1 6 -6 -3 -4 -8 -8 -6 8 8 -8 -6 -3 -13 0 -2 -4 -6 -1 -2 11 2 0 6 -5 4 -4 -12 -14 -8 -7 -8 -16 -2 -2 13 -5 4 -3 -2 -5 1 -6 3 0 5 1 1 0 -6
5283 -6 -7 0 2 -2 2 1 -7 -4 7 0 -4 -1 18 -1 -12 1 3 -5 0 -1 -4 -6 -4 -5 -10 -9 -12 -10 -1 -10 1 0 -1 1 -18 -2 2 -17 -4 -11 -6 -7 -13 -2 -8 -9 -6 -11 -15 -7
5333gj6J8oJ1nNrmJ5j1kK0k1mNKQ%JkJ0oJj0kOLRj8mJ2nk1L1opJ8j7nQRj4NNK
5378BqKqNPJ0rj0RoNN%j0kKMjmJ1j9Pj0J3PpJrNJKnPJJ5k3MJ2qKjQj5J1qkKJ%
5427dM%j4J1jj1J2pKLrLmkNRMj5J5j1mJ3pJ0qKnRJ3k0MmJ4j4Kj2J9oknpJ9mKL
5472BmMmoJ3mmJ0j3OOpqKJ0j0KJ4rrRj4LmJ0OrMj4mJ5%LLJj1%J0JjkQplK2j0m
5519CMjl%Jmj3Mj%%kJ1mj0J3mjJ2k2J8j0NJJj0JOJ1Pj2%RLpj2JOnJLj1PqJ4pn
5566a0J4j3PPomNQj1PqJOmKK%MoMk%kjl%KKNlMLk0K0j0lJ0jjj0J1j5OjjLkJ6j4
5615bpJ2NlqoJ0jL%m%Rj0jJ4j5%ljPLlpjOJ%NKJqPqMRkj1NRj3LoPK%%jpMkLmL
5669@MKkpPpJ1kLqpKJ%P%j0JMOnkLmPloJ0oklJQlj4K2j2J0j1J2onJ3j1lQJOlk
$$ plain form
5333 -7 -23 -5 -11 0 -5 0 -9 -13 2 -9 -11 9 -12 -16 -11 -9 -1 -1 0 -2 8 2 3 -7 -9 -3 0 9 -9 -13 -1 -6 -27 4 -2 -9 9 -8 -13 -5 4 -10 -5 0 2
5378 2 -6 -4 -12 -7 0 10 1 -9 0 -6 -1 4 4 -6 -8 -6 -2 -3 -7 4 -15 -8 -18 -5 2 -5 -4 -13 -8 -7 -5 -10 -3 -2 13 -10 -6 6 -2 0 -1 7 -8 3 -5 -7 -5 -4 -4
5427 -4 0 0 -14 -3 -4 -15 -3 -10 -8 -5 -14 -11 -15 -17 -12 -3 1 -14 1 -10 -14 -1 -8 2 -6 -4 -9 0 13 -7 -3 -7 7 -7 -5 -17 2 -4 -6 -11 -18 1 -3 -1 2
5472 2 -2 2 -2 -8 5 1 -3 7 -6 0 6 -1 -9 -7 3 -7 -5 9 0 -9 0 -14 -11 -15 -5 1 -8 -4 -18 -22 -7 -7 -4 -1 0 -11 -11 -1 0 -1 -3 5 -2 -5 17 7 3
5519 3 7 6 3 3 4 0 -13 -9 -10 -10 -10 -12 -1 -5 -15 -2 -6 -7 5 -17 1 -9 -4 -3 -2 -12 -11 -5 6 13 1 1 10 13 6 -6 -5 1 -4 -3 0 -11 -4 -12 2 -5 -10
5566 -10 4 -9 -2 5 -1 -5 0 8 -3 4 -4 -3 3 -1 1 3 3 7 1 5 3 3 1 0 -3 -3 -1 1 6 3 7 10 -10 10 0 -3 7 6 5 -5 6 -9 -3 -4 -5 -2 -4 12 -2
5615 -2 -9 3 8 5 -3 -9 1 0 3 3 -1 -1 8 -2 -3 11 -4 -4 -7 -8 -1 2 -1 -8 -9 -3 -2 -2 3 5 6 -2 5 -3 1 10 8 -3 2 11 -2 1 -5 2 4 4 4 3 -4 0 -2 1 -3 0
5669 0 4 6 4 -3 4 -3 8 6 9 1 -6 -4 -3 -3 4 4 -6 -5 -1 5 0 -2 1 -3 4 1 -5 5 -1 -3 -6 -5 3 0 -14 8 -4 6 -5 7 1 -4 9 -2 -5 3 4 10 7 5
5719EknJkOrKJrJ2nnRnlqQkRj3J3lJ0mj0NJ1j0oPMMj3JLJ0kMNk2NJ1JmrjOJ2p
5768FOlrjONPj7J0nj2J3j3%LJ8lqj1QJ2%j8PPp%KOj3j8RJkMJ3pROj9K0j4jQJq
5814bJrNNjpJj1K3omJJ1j6J9lj0KOj5%%J4rjNrQ%mJ7j4jJPjPjQj2opLJ3j9J5j5
5861a1%mMlJ8j1J1pJ%mK%JJ2j4OjlOoLJ0j7JLJ8j8mNJ1nj5OJ5nqljkQlj0J8mO
5907Fk1J7j0K1j5Lj3K5mrj1OkKlQmlj1KJJ8j2Rk4J9ljJ2rNKnKjkMJ0k3J7Jj0M
5950bJ4j6J1npPqQProjJ1oJj2J2kkLoORpPjqPKpnPJ2k0J2qjQj2Nn%OMqmJ0jj0
5999a0kJ0%knJ7mj4%QLlRrNj0OJJj2NMrJ3pLkjJQpRj7RJj6PnJ6j2PKj3K0mnlQ
6047AnMJ5nj6OkqJ3j2%PoQJj0lJmJ0Jj1J4j7J9j3PlLKOnJmKJOqJ0pLJoJqJ6nn
$$ plain form
5719 5 3 -2 -1 -3 3 -6 -4 -3 -12 0 -5 -10 -1 -6 -9 -17 -9 -11 -2 -15 -2 -5 5 1 -9 -4 7 -3 -9 -2 2 6 -7 -6 -3 7 5 9 14 -8 -3 8 9 5 -4 -5 1 13 6
5768 6 12 9 0 -1 5 10 17 0 10 5 -7 6 -7 -7 -4 14 11 3 -8 0 12 12 -6 1 8 1 1 3 9 -4 -22 -13 -12 -14 -10 3 -4 5 11 -8 12 -2 -3 5 6 -2
5814 -2 -1 -10 -5 0 -1 -8 -7 -18 5 -1 -5 -4 7 -9 10 7 -3 -1 5 -10 -10 -10 4 -5 -6 -1 -10 -2 -2 -6 11 -3 -4 -3 4 3 10 9 17 5 -1 -8 -5 8 -11 4 -11
5861 -11 -11 -15 -11 -14 4 -7 4 -3 -2 -2 -6 -4 -4 -3 9 -5 1 0 -3 3 -3 0 10 -7 -6 -3 15 -3 -7 -2 9 4 -11 -5 10 5 -3 -6 -7 -9 -1 -4 -14 4 0 6
5907 6 -15 2 -8 13 -2 1 -12 13 9 0 -11 -5 -7 -5 -8 0 -4 -7 -18 -16 -15 3 -9 0 -24 -5 -8 -9 3 -6 -1 1 -4 -2 -3 -5 -1 9 -14 3 4 -6 -2
5950 -2 12 -4 7 2 -5 2 -6 2 9 0 -6 -7 4 -2 -1 -13 -1 -3 -5 -2 -8 -2 7 0 7 6 -2 5 7 0 -5 2 14 -6 6 -2 -3 5 -7 -2 -7 -7 -1 3 -5 -9 1 0 -10
5999 -10 -12 -2 -2 -4 -9 8 4 -10 -10 -2 1 -2 7 -2 3 -7 -1 0 1 -11 -6 -2 -11 2 -5 -2 -4 -5 -4 4 -3 6 -11 -2 -1 -17 -10 -15 1 -11 -4 -2 -15 5 1 -4 -7 1
6047 1 -4 0 15 10 -6 0 -2 -10 3 -9 -9 -2 -8 0 1 -9 -12 -11 -15 -5 -4 -15 -1 -18 1 -12 -5 -8 -5 -3 3 -2 -1 -5 -3 -2 4 -4 6 -1 2 3 -3 -2 -10 6 1 -4
6095dlmOjNpj0J5mqJ5qJ4oNjj2NnJ4loNLqqkJ8j3j8J5NJrNK%J5j6jJ4j7OlJQp
6142gPJnRj0PKOj1jKnj9K9nNj0OL%rj%P%mlJ%QLJj0OonJ5nNmj1kJJ4lLj4J1qL
6192cMJkrJ4j4OlPlOnjo%J0jnJRj1J5J5l0J2j0oJ2j3J0qOmnkJ3nOmOokj0J3nM
6238ckLpMJ0j1KOkmJ6J2k7J4n%Pj0KrOpNo%mPMJoKPOj4JMLLj0lPkLkj5J3kJ2q
6287A%%mJ1pj3RMj0OMlj3LKmP%Pj1PLRj3J3roQkNoojQKr%%LOknLlQlMMo%oPkO
6341Fj8J3j%mlJ1NpJOqPrKLj0QrJ0j2PrpJ2J4qOj5KO%J1Mj1kj7POljO%lJ0j3N
6388b%OoJ3qkkmLRqLrKNjjRj0LLLpLKNk6K4mrJ2pj2QOJj3J0NKkj2RPj3JqJ0jQ
6438EokkLQjj1J1OLKnpJ0rJPmlMjj2RnjOOj5mMRRnj4J2j1NPrmNL%jjKLnMJ1oj1
$$ plain form
6095 -4 -7 -11 -5 -6 -1 -8 -18 -3 -7 -15 0 -8 6 0 5 4 -8 -3 -8 6 3 -3 2 5 -3 -11 -13 5 -8 -26 -11 -6 -5 -14 -9 -7 -7 8 -8 -9 5 -12 -6 -9 -8 0 -7
6142 -7 0 1 -4 5 -5 2 4 10 -1 -2 0 -5 -24 5 0 5 -5 1 4 4 -5 -6 -6 1 1 -3 -6 -5 -5 3 6 7 -3 3 -3 -8 7 2 7 3 -8 -10 -9 5 2 5 -9 2 -6 -3
6192 -3 1 2 0 -9 5 -9 -3 -6 1 -2 4 -1 -2 -8 -8 2 1 -4 -3 6 -5 10 25 -5 7 -3 -9 3 -10 0 -8 -2 -6 -11 -13 0 -5 1 -3 3 -3 -5 -15 -2 -7 -3
6238 -3 -5 -2 -9 -5 5 -6 -4 2 0 -4 12 24 -3 11 6 6 13 3 5 -4 2 -5 0 -6 -6 -10 -3 1 2 -4 -2 5 11 -3 -2 2 5 8 -2 -5 2 0 3 1 -14 -1 -3 9 1
6287 1 1 1 -3 8 1 -12 -3 1 -9 -3 1 -2 -15 -12 -10 -14 -7 -7 0 -11 -4 -1 8 -5 8 -1 -7 1 -1 4 -2 -8 -9 -1 1 -8 -8 -8 -5 1 -1 -6 -3 -6 2 -1 3 7 1 1 -5 2 0 6
6341 6 -12 1 0 0 -4 -7 4 9 2 3 9 1 8 -1 1 4 -6 2 -7 3 -9 -2 -11 -18 -6 8 0 6 -9 -7 -1 -1 10 14 3 1 -16 -9 -3 -6 -7 -1 -1 -4 6 -7 -2
6388 -2 -2 4 -2 11 3 1 -1 -5 -2 7 -1 2 -7 -5 0 -1 -2 7 -3 0 3 6 -1 2 4 9 -17 7 3 -6 6 -1 -13 -5 1 2 -11 -1 4 6 4 -8 1 8 -5 -4 -12 -2 -3 5
6438 5 -1 -3 -5 -2 6 5 -6 5 11 14 16 11 4 14 5 6 13 9 6 10 9 -3 6 1 0 6 12 -3 -7 -3 6 15 10 -4 8 -3 2 9 0 -4 1 4 4 3 2 4 7 2 6 17 11 0
6490@KJoj%%PrKJNmJ8rlnmJ4nRppJJ5rj0QJ0j4j0J3ljj0NLMoPj0PJ1nmJ5j8kK
6538bklJ1ljRj9QKLLkmKLonjR%j2J2Jj1J4MKpnj0PRLkmoQJlJ5rj1J3k0QmJ0kO
6587ImJRqj1J7j1KoJjnJ1rJ4mj1J3lj2J0j1%J8mnLJ0oMoNj7J0mqKj5K1jJrJ3j0
6631gj0J3%mK6j6j1J2JMKkkj2kJ0LJ0k0K1j2lLj%mKkOj5kpJ3lMmN%pJ3%kJ4j2
6675BokJ1Pj3kPRj0J1lqpJ1qNjn%QmkrPkj0PMn%RJlOrMJMLomnNPmj4J8p%kOj1
6727iKJ5qj7K7rmJ0j6J2opQLjJoJJ6j1NJ1k0K3j9J1j2J0j0J0p%oNMk0K7k0J1J
6767Ej1JPRmnnJ2%kj6J3oJKMPpJql%MJ2qPonNppljJ2l%J3j6J3kjOomJ0JKrj3J5
6817D%mRj6JJ4pnJ4ppRoOj2NKRj1m%NJjOj2J7mjoJ1j0OlMnMlj2J2Knj1J3qRjo
$$ plain form
6490 0 2 3 -3 -4 -4 -4 3 -6 -4 -3 2 -2 16 7 4 -1 -5 9 4 13 6 -1 0 15 6 -4 4 14 0 -10 3 0 -1 -11 -6 -3 1 -5 2 -8 -1 10 5 1 16 -2 -4 -2
6538 -2 -4 -7 4 1 0 9 -10 -2 0 3 6 4 0 2 5 -1 -6 -7 2 2 -10 2 3 -8 6 10 12 5 0 -10 -3 6 9 7 3 -3 5 6 3 18 9 -2 11 -9 -1 -5 5 3 9
6587 9 5 6 15 7 -4 13 2 4 -2 -1 -2 -7 4 -5 9 5 -6 7 4 -8 2 -9 -9 9 5 0 3 13 7 11 5 10 -7 3 -1 -9 -7 -22 -1 -2 -1 -10 3 -7
6631 -7 -17 -4 -4 -8 18 2 -9 3 4 8 10 8 6 -6 -8 2 5 15 -5 16 4 1 4 3 3 -1 1 -1 5 -10 -12 -19 -6 -9 -5 -9 -4 -4 -11 2 2 0 14 2
6675 2 -4 -6 5 12 -1 -3 4 13 3 14 11 3 -4 7 -1 4 3 -2 -2 6 2 0 -9 -2 -4 -14 -7 -3 -8 -8 1 2 -1 5 -4 0 1 5 8 2 -2 -7 -2 5 1 -13 5 -2 -2 -4 2 -9
6727 -9 -7 8 0 -17 10 1 -3 7 -9 3 -3 -10 -2 1 0 1 -5 -4 12 1 6 17 -3 20 1 12 0 10 0 10 3 3 -3 2 6 -14 13 -7 4 5
6767 5 -6 -5 2 11 7 2 -3 9 9 7 -9 4 -2 -1 1 5 12 5 6 -2 -5 -5 -1 11 3 10 4 -1 4 -3 -10 -13 -14 -2 -5 -5 8 -8 5 3 2 8 2 -2 8 9 11 2 -11 4
6817 4 4 0 9 -7 -6 8 1 -4 10 3 -4 5 -1 5 -7 -2 0 9 -2 -6 -6 -1 0 -1 5 -7 10 6 5 -1 10 0 6 3 7 2 6 3 -9 3 5 0 -11 2 -6 3 2 -4
6865dQrjRlj1J5nJ1LKKj8J2j4QMJ0lmJ6k0NrJKnPRorMkm%PpkR%j1POroJ3lMrP
6915Gj1QKpNj1Rj2J2oJ1j6J0kkkRpqORj2J2mnJ0oJ5j8QlQKj4ONNlj0KJ2j3kJN
6960EqMjj3J4j5PJ2mlKj%K%MjnmLKoPJj1J0mJLlKOjj2Rq%lmOK0okJj1MmJ6rJ1
7010A3k3J4kMRj7lN%%kQJj2MoK1rj2JPj0OJq%N%j2K1jmmknJ4mmJ8k0K4k5J2kp
7055fQoQj1kRj3lK2%lj0OJKj2MMlJ8j5O%NqJ%LjkLpJ2mQj1Oj5J4mkjqJ3j0mJ3
7102EPolJLkj2K1j0LpnNKjjJ4pJpLk0J5JoPj0L1j9jrJ0lpPJPllnkmJ7KljpOrO
7152Bp%kJ0njnRMmj0KLqNLkPNrLQpNkJmmJPRqpJ5j1J0j9KJ1kkjoRj5J0Jj3J0K
7202@j0MnLKMPpJ3kNj9QkJOoNrMj5Ql%J0llJ6j2oJ4j5Rj0JPQj3jJ0oPqJ0%L%%
$$ plain form
6865 -4 4 -5 -6 3 0 -11 4 -1 10 13 15 17 -1 11 -3 5 9 19 16 12 28 8 13 4 5 7 2 9 18 12 3 7 5 1 1 8 1 -1 8 8 -3 4 10 1 -5 8 5 9 0 7
6915 7 -4 4 6 -1 4 -7 2 -10 2 -4 7 -9 1 -1 -3 -5 4 -3 -11 -5 4 -8 4 0 -5 5 -1 14 -4 4 1 9 11 -3 3 8 13 10 0 2 14 1 -1 0 5
6960 5 -3 1 0 -13 1 -14 -7 5 1 -2 0 -1 -1 1 1 5 4 -1 -5 -2 0 -6 1 2 -9 1 -3 -2 1 -2 0 6 5 -7 2 -6 -6 -9 -13 -7 13 7 5 6 -5 -1 -5 11 2 13
7010 13 -10 4 2 6 15 -2 -5 0 0 0 -2 6 7 -5 -1 -7 14 5 -7 -6 1 -9 -3 -2 -10 -10 -5 -5 -17 4 3 -1 -5 -7 -12 2 -2 -6 12 -8 16 -9 3 1 -6
7055 -6 2 -4 4 -7 -9 0 -13 -16 6 6 3 -7 -1 0 2 -10 -6 -2 -5 13 -2 4 4 9 1 2 2 5 4 2 5 -2 10 6 14 3 9 -6 8 4 2 1 -7 6 -4 -8 5
7102 5 12 6 3 4 7 5 -7 14 4 7 0 -5 0 2 1 0 14 7 8 1 4 -16 -1 0 -6 1 -9 22 3 2 -7 3 0 -7 0 1 8 5 2 -3 -5 -9 8 10 7 6 -1 5 -4 2
7152 2 -5 -5 -7 3 -2 -3 -8 1 5 1 -9 -7 -4 -12 -7 -4 -6 1 6 -3 0 8 1 6 4 5 1 -3 -2 5 14 6 -1 14 3 13 -6 -4 7 5 3 2 -4 5 -10 0 1 -12 -2 0
7202 0 -10 -6 -11 -8 -6 -2 5 -2 11 9 14 -5 3 1 2 8 2 7 -2 2 -13 -5 -8 -8 2 -1 -4 12 0 -6 8 -7 2 -8 -7 0 8 -5 -6 4 -2 5 -3 7 7 10 10 10
7250A0%nJ0j5JmNnJO%Oj0pJ1JqkJ3Qj5nPPkpj4RLkMKKj1QMLj0MnOKJ2j7nMj0J4
7298Dj5J2mJKLjmpRLMj5KJ4j5RMlkOj5QqOoRj7J2QpkKMj%j2LJjoJ4ljJ6nj7RN
7347Cj0J1%mRj7J0j3PNrJ0j0LJ4j2LjlKNNj2QJ2j6OpM%Pj6J2qMqJ2LpJJRLj1o
7392aLJmj%%LLkJ2j0j0J0j2J1QNj8K1k4jJ5j6J%J1m%JLrNRj3kNOJJRqrmJ6j6P
7438CJ0j7PlJ5j1j3K0KjJrPJ3j6j%Mj1j1J4Nj2kjNJ1j1%Qj0J6pNOj4rLK3rooR
7481GmJ4nnjnj%Lj0J8jj1Kpj%rRJ3pNKj3MJ4j3QjjJ0j4MlQKoJ0j7MLk5J5RnkN
7528BmmPLjlmoQNnqoJ5RrpJ2j1NoJ0j1J0MJqrJ3jj1kK0j5J6lj8PJ1j5kRRrJMM
7575GopkJ6j3J5pJ0mpkJ3poNllNoj4OKLMrOoJPLKKjJ1Jj4Qk4J5mNoQnPk6RJ2o
$$ plain form
7250 10 10 5 15 0 1 -3 2 -3 -2 4 4 10 0 -7 4 5 -3 -5 8 16 1 -4 3 10 8 1 -13 -4 -1 -3 1 3 5 -6 2 6 9 -1 3 -2 4 6 18 1 -4 0 -10 4
7298 4 -11 1 -3 -2 0 3 2 -2 -9 0 3 7 -8 -6 8 -7 2 6 3 1 7 -8 0 -8 -2 -8 1 -16 -4 4 -3 -5 -3 1 0 0 -12 -9 -8 -9 -15 -1 -4 -5 11 6 -11 -2 3
7347 3 -7 4 4 0 9 -8 2 -11 -4 1 -8 2 -8 -5 9 -3 0 -1 -4 -2 3 8 -4 4 16 0 6 -1 3 3 10 -6 6 -2 2 -6 6 9 2 3 4 13 16 5 -1
7392 -1 2 3 -1 -2 -2 -2 1 4 2 14 4 -6 4 -8 3 11 16 -2 19 -5 -6 9 -7 -6 -6 5 1 1 2 5 -4 1 10 -3 -5 0 6 7 8 17 9 0 -4 12 -4 3
7438 3 13 -4 3 0 15 4 -9 11 13 12 13 4 11 24 8 7 7 11 0 -11 3 8 -4 -6 -7 -2 9 -2 -2 6 -4 12 5 10 16 2 -7 -4 19 10 4 -2 7
7481 7 3 17 12 7 6 1 0 0 3 -7 11 10 -1 1 -6 -7 -7 -16 -7 6 -1 4 6 -7 -3 11 -2 6 5 4 14 0 4 1 9 11 5 15 -2 2 5 -20 -5 4 -1 -3 2
7528 2 -2 -6 1 4 3 0 -4 -10 -2 3 -2 -10 -16 -1 8 -1 -8 4 -7 -2 -8 2 -9 1 5 6 -2 -11 2 1 -10 -12 8 -7 9 6 -12 -5 6 -9 -11 -2 7 -2 -1 3 7
7575 7 1 -6 -8 8 -5 10 3 13 9 2 0 13 6 0 5 2 -1 4 -2 -16 -10 -8 -5 -1 -10 -4 -10 -9 -2 1 3 5 4 15 16 2 10 -14 1 -3 2 -4 4 -1 6 -20 -11 1 -5
7624eNjKnNJ2pOmj0Rj4OjPmLlnJ5l%MrmJ3j2j0J1nNj1PmNJ8nj0oJ1%j2MmmJ2k
7671@%j7J2NJ1pJ2j3J5j9JJ1j3%mJ2j0%MKMqj1J7q%lRnJ2mj1%QoJ1qLJ%kMJ1k1
7715eLJj8J0NLJj0LMpLMJ0n%Rj6JJ0kj3POJlkNlKMKmMj0jJNpJJOpRj1J1lj%jJ
7766DnJ0qOnlJ5j9J3j6J4lojLNkkMoM%onjMJ3rQj4nJ0NloJ1j3J2JOJj3Q%oMLo
7814AqLMMJ1Jk1J%LNmj0NJ5mpMklrPrJ2jj5RJ3MjnK%Jj6MQj4mJ0n%QoJ2mqQKj1
7864a0J9j9J5nmlK0pj0MjJ0pomLoJ1JMMmlp%QLLk0J2j2J3nJpPjMr%J5p%LrnOJ6
7912A1j3NrKQJ%rNj0MJ5qj1LLJ4j4MJnKjQj3%J8oplJ4j5K1j0m%J7pj7J1qK0j1
7955F%oMrKjNjl%jKj0J2Rj4J1mJn%J1mk%j5J6oj1K1j0%lrPkjMJ1ljPppNrJ6nJ
$$ plain form
7624 -5 0 -1 1 -4 1 13 6 12 8 -2 7 -7 -1 -2 5 1 4 1 -4 11 8 8 12 3 -1 12 0 -10 1 -4 1 -10 -3 -7 -2 16 11 1 -5 6 6 -6 -2 -6 -10 2 0
7671 0 0 -17 -5 0 11 4 16 3 18 -1 0 11 -2 -2 -6 6 -4 -4 0 2 6 -2 -13 4 -4 -4 -7 2 -3 9 5 -6 -6 2 -4 7 -1 2 3 3 1 5 16 -5
7715 -5 -2 -1 -19 -9 -4 -1 0 -10 -7 -3 -10 -7 -3 7 2 2 11 -5 -4 6 4 -9 -2 4 5 2 0 5 2 4 8 10 6 10 0 -1 0 5 -2 -1 0 6 -1 8 -3 8 5 4 4 3 4
7766 4 -1 9 1 7 2 -1 14 -5 8 -8 6 3 -3 -4 -1 4 2 0 4 -2 2 2 -4 -9 -10 -6 7 -2 6 -8 -13 -3 2 -1 -7 4 -9 3 4 10 11 -2 6 6 0 4 7 1
7814 1 -7 -4 0 4 15 16 -5 -4 -4 -1 4 0 -10 -5 10 6 -1 3 1 -2 -11 -4 -13 -1 -2 -17 -8 5 9 8 3 5 5 6 -10 -6 2 -12 -16 -6 -11 -11 -3 -9 3 -1 -9 -1 1 -10
7864 -10 9 -10 5 0 -4 -7 13 6 -4 0 -1 9 2 -4 -8 -5 -11 0 1 5 9 5 2 -5 -5 3 6 9 -11 1 -11 2 -3 -2 -9 -2 -3 1 -8 -8 7 0 0 3 -6 -11 -5 11
7912 11 -2 3 -6 -4 4 5 5 -4 1 -9 -5 10 2 -9 -6 -3 11 -3 1 2 -3 -1 -2 6 -7 -7 11 5 -2 -5 9 -6 15 5 1 1 18 11 -6 5 -3 17 6
7955 6 6 0 4 -5 -3 -4 1 0 -3 -3 -4 -2 -12 0 9 -5 6 2 3 -2 -2 9 5 3 3 -12 4 -2 -13 8 -2 -2 -5 -14 -7 -9 -10 -6 5 2 1 8 1 -6 -1 -10 6 1 2
8004BJ1j4lQpPLj7J8rRoLnKoj0JJ0j1mJ8MoPlj6J7JplJ0j6J2pOKj1jJ4j7J6Lk
8048CjmLknQnj0K1rrOOKmpJ2r%pJ2j4K4j6K0j8NqMLoJ3rOoQj7LJ5j6MJ6k3J2j2
8093a1%NlmNk%RpNJjjPn%P%j1J0mMlrkJ4j0jJ1j7J2lJPj0Op%Mj1J6rKJ7j6Jjk
8141fjPJ4j6lJ0Nk1J9j0NJljlNj7J6jk3J9oQ%%nOJ2rMMj3J1jRj6KpJ4KrpRKqN
8187CKlkj
$$ plain form
8004 2 13 -1 -4 4 -3 4 7 -10 8 -1 8 2 5 0 2 -4 -14 -13 -3 -14 -18 0 4 -2 5 2 -14 3 4 -3 -6 4 -12 0 -7 -1 1 -10 -11 3 -14 2 5 3
8048 3 2 -2 1 -1 -6 2 -3 -13 8 -1 -10 -4 2 4 0 -7 5 -4 -4 -11 1 -13 11 -5 15 -3 2 -6 -2 1 -5 8 -1 5 -1 7 -10 -7 8 -8 -4 12 -11 1 -11
8093 -11 -11 -6 -9 -13 -8 -10 -10 -1 -8 -3 -2 -3 -4 3 -2 -2 5 5 -6 4 0 4 1 -8 -10 4 -6 -7 4 -13 -1 -4 -3 4 -6 0 -7 -7 -3 -14 2 -7 -5 12 -4 -3 -4 -6
8141 -6 -7 0 14 -2 -5 5 10 -11 8 -2 3 4 1 0 -3 2 -15 1 0 -23 -4 -10 -2 -2 -2 -7 -1 11 2 6 10 -3 8 7 16 0 2 -5 9 11 2 -5 4 6 -2 3
8187 3 5 2 0 -1
8191a
##END NTUPLES=NMR FID
##END=
