##TITLE=1H_LR-579-H1-CR4
 D2O, 8 sc, 
 24.6.2019
##JCAMPDX= 6.0         $$ Bruker NMR JCAMP-DX V2.0
##DATA TYPE= NMR FID
##DATA CLASS= NTUPLES
##ORIGIN= UXNMR, Bruker Analytische Messtechnik GmbH
##OWNER= root
$$ XWIN-NMR		Version 3.5
$$ Mon Jun 24 14:25:03 2019 Russian Standard Time (UT+4h)  she@DPX200
##.OBSERVE FREQUENCY= 200.13155
##.OBSERVE NUCLEUS= ^1H
##.DELAY= (6, 6)
##.ACQUISITION MODE= SIMULTANEOUS
##.ACQUISITION SCHEME= undefined
##.AVERAGES= 8
##.DIGITISER RES= 18
##SPECTROMETER/DATA SYSTEM= spect
##.PULSE SEQUENCE= zg30
##.SOLVENT NAME= CDCl3
##.SHIFT REFERENCE= (INTERNAL, CDCl3, 0, 15.7039)
##AUDIT TRAIL= $$ (NUMBER, WHEN, WHO, WHERE, WHAT)
$$ ##TITLE= Audit trail, XWIN-NMR		Version 3.5
$$ ##JCAMPDX= 5.01
$$ ##ORIGIN= Bruker BioSpin GmbH
$$ ##OWNER= she
$$ F:/spectra/data/she/nmr/H-F/1/audita.txt
$$ ##AUDIT TRAIL=  $$ (NUMBER, WHEN, WHO, WHERE, WHAT)
(   1,<2019-06-24 14:23:59.87 +0400>,<she>,<DPX200>,
      <created by zg, POWCHK disabled, PULCHK disabled
       configuration hash MD5:
       00 E9 B6 7A A2 85 ED C7 34 08 36 98 17 FE 4E 26
       data hash MD5: 16K
       61 70 08 9B FB B5 48 5C 72 A7 26 7F C6 2C DB 8F>)
$$ ##END=
$$ 
$$ hash MD5
$$ 68 E5 8B FC 3D 11 11 D1 00 1E F8 BE DC A7 77 87
##$RELAX= 
##$RELAX= 
##$RELAX= 
##$RELAX= 
##$RELAX= 
##$RELAX= 
$$ Bruker specific parameters
$$ --------------------------
##$DU= <F:/spectra>
##$EXPNO= 1
##$NAME= <H-F>
##$PROCNO= 1
##$TYPE= <nmr>
##$USER= <she>
##$AMP= (0..31)
100 100 100 100 100 100 100 100 100 100 100 100 100 100 100 100 100 100 
100 100 100 100 100 100 100 100 100 100 100 100 100 100 
##$AQSEQ= 0
##$AQ_mod= 1
##$AUNM= <au_zg>
##$AUTOPOS= <>
##$BF1= 200.13
##$BF2= 200.13
##$BF3= 200.13
##$BF4= 200.13
##$BF5= 200.13
##$BF6= 200.13
##$BF7= 200.13
##$BF8= 200.13
##$BYTORDA= 1
##$CFDGTYP= 0
##$CFRGTYP= 5
##$CHEMSTR= <none>
##$CNST= (0..31)
1 1 145 1 1 1 1 1 1 1 1 1 1 1 1 1 1 1 1 1 1 1 1 1 1 1 1 1 1 1 1 1 
##$CPDPRG= <>
##$CPDPRG1= <>
##$CPDPRG2= <>
##$CPDPRG3= <>
##$CPDPRG4= <mlev>
##$CPDPRG5= <mlev>
##$CPDPRG6= <mlev>
##$CPDPRG7= <mlev>
##$CPDPRG8= <mlev>
##$CPDPRGB= <>
##$CPDPRGT= <>
##$D= (0..31)
0 1.2 0 0 0 0 0 0 0 0 0 0.03 0 0 0 0 0 0 0 0 0 0 0 0 0 0 0 0 0 0 0 0 
##$DATE= 1561371839
##$DBL= (0..7)
120 120 120 120 120 120 120 120 
##$DBP= (0..7)
150 150 150 150 150 150 150 150 
##$DBP07= 0
##$DBPNAM0= <>
##$DBPNAM1= <>
##$DBPNAM2= <>
##$DBPNAM3= <>
##$DBPNAM4= <>
##$DBPNAM5= <>
##$DBPNAM6= <>
##$DBPNAM7= <>
##$DBPOAL= (0..7)
0.5 0.5 0.5 0.5 0.5 0.5 0.5 0.5 
##$DBPOFFS= (0..7)
0 0 0 0 0 0 0 0 
##$DE= 6
##$DECBNUC= <off>
##$DECIM= 24
##$DECNUC= <off>
##$DECSTAT= 4
##$DIGMOD= 1
##$DIGTYP= 9
##$DL= (0..7)
0 120 120 120 120 120 120 120 
##$DP= (0..7)
150 150 150 150 150 150 150 150 
##$DP07= 0
##$DPNAME0= <>
##$DPNAME1= <>
##$DPNAME2= <>
##$DPNAME3= <>
##$DPNAME4= <>
##$DPNAME5= <>
##$DPNAME6= <>
##$DPNAME7= <>
##$DPOAL= (0..7)
0.5 0.5 0.5 0.5 0.5 0.5 0.5 0.5 
##$DPOFFS= (0..7)
0 0 0 0 0 0 0 0 
##$DQDMODE= 0
##$DR= 18
##$DS= 0
##$DSLIST= <SSSSSSSSSSSSSSS>
##$DSPFIRM= 0
$$ [...]
##$SUBNAM2= <"">
##$SUBNAM3= <"">
##$SUBNAM4= <"">
##$SUBNAM5= <"">
##$SUBNAM6= <"">
##$SUBNAM7= <"">
##$SUBNAM8= <"">
##$SUBNAM9= <"">
##$SW= 24.9336996594482
##$SWIBOX= (0..15)
0 0 2 0 0 0 0 0 0 0 0 0 0 0 0 0 
##$SW_h= 4990.01996007984
##$TD= 16384
##$TD0= 1
##$TE= 0
##$TE2= 300
##$TE3= 300
##$TEG= 300
##$TL= (0..7)
0 120 120 120 120 120 120 120 
##$TP= (0..7)
150 150 150 150 150 150 150 150 
##$TP07= 0
##$TPNAME0= <>
##$TPNAME1= <>
##$TPNAME2= <>
##$TPNAME3= <>
##$TPNAME4= <>
##$TPNAME5= <>
##$TPNAME6= <>
##$TPNAME7= <>
##$TPOAL= (0..7)
0.5 0.5 0.5 0.5 0.5 0.5 0.5 0.5 
##$TPOFFS= (0..7)
0 0 0 0 0 0 0 0 
##$TUNHIN= 0
##$TUNHOUT= 0
##$TUNXOUT= 0
##$USERA1= <user>
##$USERA2= <user>
##$USERA3= <user>
##$USERA4= <user>
##$USERA5= <user>
##$V9= 5
##$VALIST= <valist>
##$VCLIST= <CCCCCCCCCCCCCCC>
##$VD= 0
##$VDLIST= <DDDDDDDDDDDDDDD>
##$VPLIST= <PPPPPPPPPPPPPPP>
##$VTLIST= <TTTTTTTTTTTTTTT>
##$WBST= 1024
##$WBSW= 4
##$XGAIN= (0..3)
0 0 0 0 
##$XL= 0
##$YL= 0
##$YMAX_a= 2990
##$YMIN_a= -4414
##$ZGOPTNS= <>
##$ZL1= 120
##$ZL2= 120
##$ZL3= 120
##$ZL4= 120
##$ABSF1= 10
##$ABSF2= 0
##$ABSG= 5
##$ABSL= 3
##$ALPHA= 0
##$AQORDER= 0
##$ASSFAC= 0
##$ASSFACI= 0
##$ASSFACX= 0
##$ASSWID= 0
##$AUNMP= <proc_1d>
##$AZFE= 0.1
##$AZFW= 0.1
##$BCFW= 1
##$BC_mod= 2
##$BYTORDP= 1
##$COROFFS= 0
##$CY= 11.3945322036743
##$DATMOD= 1
##$DC= 2
##$DFILT= <>
##$DTYPP= 0
##$F1P= 18.9103706918063
##$F2P= -1.10871071338519
##$FCOR= 0.5
##$FTSIZE= 0
##$FT_mod= 4
##$GAMMA= 1
##$GB= 0.15
##$INTBC= 1
##$INTSCL= 1
##$ISEN= 128
##$LB= 0.24
##$LEV0= 0
##$LPBIN= 0
##$MAXI= 10000
##$MC2= 0
##$MEAN= 0
##$ME_mod= 0
##$MI= 1.114404
##$NCOEF= 0
##$NC_proc= 0
##$NLEV= 6
##$NOISF1= 3.799351
##$NOISF2= 2.8
##$NSP= 1
##$NTH_PI= 0
##$NZP= 0
##$OFFSET= 15.70392
##$PC= 1
##$PHC0= -8578.5
##$PHC1= 10.80097
##$PH_mod= 1
##$PKNL= yes
##$PPARMOD= 0
##$PSCAL= 0
##$PSIGN= 0
##$REVERSE= no
##$SF= 200.130013532006
##$SI= 16384
##$SIGF1= 3
##$SIGF2= 2
##$SINO= 400
##$SIOLD= 16384
##$SREGLST= <1H.CDCl3>
##$SSB= 0
##$STSI= 0
##$STSR= 0
##$SW_p= 3612.71676300578
##$SYMM= 0
##$S_DEV= 0
##$TDeff= 0
##$TDoff= 0
##$TI= <>
##$TILT= no
##$TM1= 0
##$TM2= 0
##$TOPLEV= 0
##$USERP1= <user>
##$USERP2= <user>
##$USERP3= <user>
##$USERP4= <user>
##$USERP5= <user>
##$WDW= 1
##$XDIM= 8192
##$YMAX_p= 0
##$YMIN_p= 0
$$ End of Bruker specific parameters
$$ ---------------------------------
##NTUPLES= NMR FID
##VAR_NAME=  TIME,          FID/REAL,        FID/IMAG
##SYMBOL=    X,             R,               I
##VAR_TYPE=  INDEPENDENT,   DEPENDENT,       DEPENDENT
##VAR_FORM=  AFFN,          ASDF,            ASDF
##VAR_DIM=   8192,          8192,            8192
##UNITS=     SECONDS,       ARBITRARY UNITS, ARBITRARY UNITS
##FACTOR=    0.0002004,     1,               1
##FIRST=     0,             0,               0
##LAST=      1.6414764,     0,               0
##MIN=       0,             -4414,           0
##MAX=       1.6414764,     2990,            0
$$ Real data points
##PAGE= N=1
##DATA TABLE= (X++(R..R)), XYDATA
0@%%%%%%%%%%%%%%%%%%%%%%%%%%%%%%%%%%%KoRj0J1j2J3j5J6j6J6j8K2k5K7l0
51a6L6m1M7n7O8q4J13j67L04j252l365J744L219J050q30L20P82j175k745r14J707
72a256J915M49K63O24o30k674k070R26K765J691o6n81p61j460j339K41J627J282
90I46L57K89R4j394k527j018J953K812Q70r09q68n14j114j242L55K082J823N4
108B049j000r39r48j073k16J481K142R49p66j560j301o35J83J034J391R04N3p72
126I76j383j464m73J186K077J191m11j152r43p11n96J32J409J795O13r51j506
143b11j102m45K49J127J644R67n99j635j333l26M52Q19R97Q87K68p73j537j315
161a866j99J152J752J131k01j163j300p51n9N81J071J106M54m81j196j257o49
$$ plain form
0 0 0 0 0 0 0 0 0 0 0 0 0 0 0 0 0 0 0 0 0 0 0 0 0 0 0 0 0 0 0 0 0 0 0 0 0 2 -4 5 -5 6 -6 7 -8 8 -8 8 -10 12 -13 14 -16
51 -16 20 -21 26 -31 37 -47 66 -101 203 -1049 -4414 -2670 549 1599 769 1089 1871 696 -2049 -2963 -1256
72 -1256 659 1108 1371 1995 1365 -1309 -3379 -2453 312 2003 1937 1356 595 -865 -2204 -1963 -336 946
90 946 1303 1592 1686 292 -2235 -3253 -1300 1512 2382 1473 605 91 -1023 -2265 -1910 172 1995 2049
108 2049 1049 110 -838 -1911 -2127 -646 1496 2445 1679 119 -1182 -1817 -1634 -600 791 1695 1748 976
126 976 -407 -1871 -2344 -1158 919 2110 1699 547 -396 -1107 -1703 -1571 -162 1633 2246 1295 -211
143 -211 -1313 -1758 -1509 -382 1262 2229 1630 -5 -1338 -1664 -1212 -393 604 1491 1759 986 -551 -1866
161 -1866 -2065 -913 839 1970 1769 606 -694 -1445 -1504 -923 148 1254 1708 1227 31 -1226 -1875
178a875L90J310J487O89n46j447j352m62N62J168J021M56j56o73j004j023l49
195a804Q29J624J247o4j208j389p64L1P27J135J002K54p02j169r46l11L75R83
213a50J226P49l82j375j378m65N95J171J010M67k50q65j072p34J3Q23J227R22
231A532M9r06j324r09K0Q49J184Q53J04o51j102r34k71N15J074J050M49m41j142
250aj155m61M66J108J072M73l43r23j043n94J15Q41J131P83k5q77j209q16N8Q24
270e76J124P78N2o79j032q72k04N23J044R71L63m87j075j068m00M74J070J013
288A019L84l68r21r56n31J86Q25J058O70p8q23j105p48L2Q17J113P48k0p38j003
308d39p29j27N39R70Q82L08m94j036r48l33M59R89R65M04l95r47r49m31K72Q13
$$ plain form
178 -1875 -1485 -175 1312 2001 1455 8 -1344 -1806 -1244 -76 945 1401 1245 572 -432 -1455 -1804
195 -1804 -975 649 1896 1832 624 -765 -1529 -1498 -771 364 1366 1620 918 -251 -1197 -1508 -1133 -150
213 -150 1076 1825 1443 68 -1310 -1775 -1180 -9 1001 1468 1218 353 -719 -1453 -1440 -617 610 1532
231 1532 1581 675 -649 -1558 -1538 -689 495 1348 1452 801 -301 -1235 -1506 -991 83 1133 1582 1141 -1
250 -1 -1156 -1617 -1151 -43 1029 1502 1159 236 -807 -1401 -1286 -445 686 1469 1444 567 -642 -1458 -1400 -576
270 -576 548 1326 1378 699 -333 -1205 -1409 -886 158 1129 1492 1005 -70 -1138 -1538 -1064 6 1019
288 1019 1403 1035 114 -842 -1373 -1187 -362 696 1366 1288 465 -640 -1388 -1356 -539 574 1322 1302 564 -439
308 -439 -1168 -1295 -756 214 1096 1404 910 -126 -1074 -1407 -948 41 1006 1410 1015 68 -881 -1312 -1040 -227
328b27R46N78j04p96j046o79Q3P82J042O98k6p23r95p16p6O09R49P89J89n19r45
349a87q63k86M31R66R14L50l98r34q94l90L04Q25R21N05j93p82r50n90J22P40
369c89R59O39l2o78r65p06l8O19R40P52J23n37r24p95k04M61R00Q39K96l86q99
390b5q49l53L17Q02Q64M73k11p99r19n20J70P42R06N53o9o67r05o45mO03Q92O97
412A053J01n37r03p35j76M80Q82P76K59m29q49p92l00L29P97Q15L98k33p68q62
432f94m85J98P35Q62N30j16o62q82n81K7O27Q77O14K4n30q41o86j45M71Q67P38
453I48J94m40q02p52k69L31P70P93L83k82q09p81l87K09O82P96M92j03o72q56
473e55n14O8N96Q17N98M4n58q56o35q1N05Q03O86J75m60q07o51k26L37P10P54
$$ plain form
328 -227 719 1297 1193 397 -649 -1328 -1245 -463 579 1277 1251 528 -467 -1183 -1259 -650 299 1088 1277 758 -187
349 -187 -1050 -1336 -905 61 975 1325 927 -7 -901 -1291 -987 -162 759 1264 1071 289 -661 -1251 -1129 -389
369 -389 570 1209 1177 499 -466 -1172 -1210 -591 349 1101 1224 687 -237 -1032 -1236 -775 125 964 1260 874 -25
390 -25 -874 -1227 -910 -108 756 1229 1018 219 -700 -1220 -1050 -308 598 1151 1082 415 -490 -1135 -1139 -536 356 1053
412 1053 1154 617 -286 -1021 -1197 -717 165 941 1200 771 -78 -870 -1170 -841 -44 771 1169 936 168 -694
432 -694 -1179 -981 -246 616 1146 1030 368 -514 -1095 -1068 -441 436 1050 1074 544 -297 -983 -1128 -657 210 948
453 948 1142 702 -100 -852 -1121 -790 -20 773 1156 874 65 -716 -1103 -894 -212 584 1076 973 301 -555
473 -555 -1069 -1001 -405 412 1010 1054 496 -360 -995 -1076 -571 232 918 1093 633 -174 -825 -1051 -714 -4 750
494G50L81k69q17q10l25K85O88P25M27j06o45q62n10J72O32P44M69J4m67p82o54
515i60j15N52Q28O22J12m76p66o39j80L91P08O66K79k56p43p66l27L12O84O64
535E90L71q9n93q24n46J46P24P84L93j25n02o55n51j19M73Q30O25O7m85p41n91
556h18j54L49P16O91K64l46p58o96k53L23O75O09L17j40n43p32n19R6O65Q16M36
577I98j54n82o56m71l8M73P40N81O4m94p41n31j04L78O32O20K75k85p46p66k49
598a056M11P32N68J97j70n02o68m88R0O85P86L78j92n31o24m67m2M88P69N46K
619I12n06o91n00r9L86O59N97J76l28o59o53k64L22P09O39J90k63n58n72l82Q0
640h05N79P65M47j74o35o50l69M5M53O59N31L9m91p18m86m6M04O27N55J69l35
$$ plain form
494 750 1131 862 45 -765 -1090 -805 -117 608 1035 929 284 -578 -1088 -916 -284 460 929 943 476 -306 -960
515 -960 -1075 -523 305 927 1039 563 -203 -842 -1022 -631 77 743 1022 766 23 -743 -1070 -758 -74 590
535 590 961 872 279 -545 -1091 -945 -221 563 956 831 329 -326 -877 -996 -523 307 932 999 514 -227 -818
556 -818 -972 -623 93 784 1048 702 -56 -752 -1005 -682 -7 602 919 779 236 -496 -1015 -919 -254 562 998
577 998 844 262 -394 -865 -903 -430 310 891 955 461 -280 -811 -915 -537 95 715 990 705 -41 -807 -1056
598 -1056 -645 87 655 852 682 180 -488 -976 -886 -201 585 963 771 240 -384 -851 -893 -405 364 910 912
619 912 406 -285 -785 -884 -498 161 758 934 606 -53 -706 -970 -648 61 700 890 627 69 -503 -885 -805
640 -805 -226 539 986 812 177 -473 -842 -797 -344 315 846 885 394 -324 -810 -856 -452 175 730 899 564
661E64o77o38j99L54P11N93J50k86n39n50l29R4N74P16L99j71n94o49l80P7N17
682b63O82M50o0n05o13m45l5L73O21N47J41l87o40n95j80L48O78O33J31l42o07
703f8m99k32J50N08O45L68j45n72o22l94P4N21P15M35j30n45n86l59pL44N98N52
725G51J10m30o40m87j34K74O19O46K18l85p09m79r9J98M51N71L76j25o10o31k91
746h06J33M43O11M84l5o00p05l12J48L82M54M49K04l47p33n48l2M21N08M68K49
767H36k27o79o63j22L92N32M21K17p1m75o57l69J63N79N61L25n6m65o59m08J09
788g16N16N08L38O3l02n83n57r4M26O05M47J06k58n61n80k19L51O29M87J04j89
809E21m22n34l50R7N54O41K91j43m71n81l81O4N12N85L19m0l58n05m63j36L85
$$ plain form
661 564 -113 -751 -950 -596 115 708 858 572 33 -517 -846 -752 -178 538 937 766 172 -477 -857 -780 -263
682 -263 419 869 809 304 -309 -754 -789 -416 205 752 893 506 -134 -729 -909 -561 117 750 881 539 -68
703 -68 -567 -799 -649 -141 504 872 727 155 -467 -861 -787 -266 449 884 754 209 -377 -736 -743 -399 199 751
725 751 861 431 -209 -696 -830 -556 63 709 927 542 -167 -646 -745 -547 -96 475 851 726 116 -515 -806
746 -806 -673 -230 381 865 830 230 -475 -787 -639 -257 197 646 850 503 -230 -778 -810 -389 119 587 836
767 836 609 -70 -733 -855 -463 69 490 707 636 161 -496 -865 -702 -123 438 763 707 242 -417 -825 -716
788 -716 -200 308 646 709 407 -176 -733 -827 -401 204 651 757 499 -62 -642 -861 -510 119 606 710 521
809 521 99 -435 -785 -688 -134 507 798 655 184 -397 -778 -714 -202 383 702 662 304 -201 -664 -800 -415
830d15O29M76M3l34n31m84j86K87O08N20J20k76m79m33k54P5M78O11L58j68n41
851A04n67k94J08M60N59L42n9m10n31l54l5L24N36M74J16l71n77m72j08L26N48
872A19M75J43k81n02m76j95J87M75N09K95j31n19n64k95J45M63N56K94o8m21n29
893c20l57K7L71M97M12O7l18n46m96q0L52N44M27J14k51m96m82k05K33N05M91
914D89K02j53m41n19l11J10N00N50K85j05m33m90l20ML69N15L92K6l31n11m43
935f15r2L35N55M30P8l06m64m26j94K03N02N06J96k27m55m55k43Q9M36N39L29
956G21j15m90n11k50P4L44M48L89L4l54n24m12k6L31N18L90R0k82m79m39j40K42
978d41M84M65J72k12m75m53j99J55M08M90K95r9m52n16k77J12L89M58K97J2l31
$$ plain form
830 -415 214 690 733 399 -132 -616 -802 -515 93 613 733 457 -22 -455 -709 -634 -156 455 813 645 104
851 104 -463 -757 -649 -189 370 712 653 243 -288 -642 -677 -353 183 657 773 402 -175 -647 -755 -429 119
872 119 594 737 456 -46 -522 -717 -530 -55 454 749 618 99 -465 -760 -615 -152 404 698 630 209 -320
893 -320 -677 -650 -279 218 630 697 379 -167 -663 -743 -391 153 580 694 443 -53 -535 -740 -507 -2 489
914 489 691 538 97 -422 -733 -623 -123 427 712 607 174 -316 -636 -632 -263 252 644 670 339 -172 -615
935 -615 -707 -372 183 613 691 385 -79 -505 -699 -496 6 512 708 481 26 -429 -672 -583 -147 392 721
956 721 606 116 -395 -645 -571 -227 221 610 644 290 -234 -646 -672 -341 177 567 657 375 -104 -543 -683 -441
978 -441 43 508 680 468 -7 -460 -659 -504 -96 394 689 590 138 -378 -655 -543 -154 304 601 613 282
999B82n16l96k5L75N23L48J5k70m65l97j32K31M96M42J62k55m60m26j86J54M26
1020g4M75K65j42m54m64k66J07M24M43K94l1l61m72l55k1L53N07L60L0l25m58
1041a65l63q6K37M74M13J47k47m73m10j53J81M29M48K29j39m57m54k44J32M01
1061a00M49K64n8l68m72l21ML69M87L39Ql42m63l39n9K60M40M00J44k46m88m01
1083d93j28K00M25M22K03j66m38m51k00J53L99M10K43n4l58m75l06O8L51M57L10
1104E72Ll20m74l34l8L15M38L42P6k25m36l90j52K40M51L99J46j82m24m06k01
1125f00J49M20M15K02j28l34m08k95N3L44M58L06l5l51m42l00k7K97M65L32L7
1146E58k78l99l60j05J98M39M04J45k17m22l97j58J63M05M05K01j34l86l87k20
$$ plain form
999 282 -234 -630 -655 -280 243 591 606 336 -129 -526 -658 -427 69 511 673 418 -42 -468 -654 -500 -74
1020 -74 401 666 524 70 -394 -660 -553 -129 314 608 577 216 -256 -611 -632 -279 228 588 618 293 -165
1041 -165 -528 -614 -377 97 510 657 410 -63 -473 -626 -445 -16 432 661 522 65 -389 -633 -501 -100
1061 -100 349 613 555 187 -285 -606 -602 -233 254 593 601 259 -204 -543 -602 -342 98 498 642 396 -92 -493
1083 -493 -621 -421 4 426 629 463 25 -426 -626 -473 -74 336 579 525 167 -308 -614 -546 -195 262 572
1104 572 575 255 -219 -553 -591 -276 162 504 580 355 -81 -471 -623 -383 68 467 613 431 7 -399 -600
1125 -600 -451 -31 384 586 458 124 -284 -579 -526 -182 276 582 547 196 -246 -546 -573 -276 189 521 558
1146 558 280 -119 -479 -584 -386 53 457 602 385 -37 -434 -592 -429 -24 381 582 448 62 -325 -545
1166e45O3L29M48K83l9l70m26k78RK89M38L21M9l02m49k97n4K26L83L89J34k35
1188C66m36l77j14J93L66L66K20j26m12m27j84J33L13L83K78j7l62m80k79R2L43
1209a61L72K58L2k47m20l66k0K85L82L26R7j87m09m06j22K48L92L36J55j40l72
1230C3m07j98J80L50L44K10k8l08m52l06P8L81M05K14k4k44l91l36n4K95M48K75
1252D65K9k17l41l60j48K16M19L67R7j71l73l78j66J52L87L74J51j17k92l75k75
1273e56M1L71M41K28j04k78l45k68m8K41M57L39j9k95l46k56p0J41L62L99J42
1294E77k25m16l38j12J82L27L41J82j12l36l81k20J10L36L78K06o7l11l56k41
1314d76qK70M23K91nk97l80k66j9K05L45L22J04j91l91l69r2K03L71L09J21j28
$$ plain form
1166 -545 -482 -153 295 578 539 169 -257 -535 -526 -237 201 522 571 269 -180 -477 -531 -305 78 467 601 366
1188 366 -70 -447 -561 -368 -2 364 584 458 46 -381 -565 -432 -119 264 542 525 163 -317 -596 -504 -161
1209 -161 211 469 501 254 -166 -532 -552 -267 115 441 538 351 -58 -464 -586 -338 54 390 545 405 33
1230 33 -374 -572 -392 -42 302 512 484 176 -276 -582 -504 -123 282 496 472 228 -163 -499 -553 -258 190 465
1252 465 494 277 -64 -424 -572 -356 63 430 527 356 -17 -395 -561 -409 -22 352 503 386 94 -281 -556
1273 -556 -515 -144 297 525 421 143 -202 -470 -518 -277 180 519 500 205 -141 -397 -467 -326 36 435 577
1294 577 352 -64 -402 -514 -332 -5 336 518 406 70 -311 -531 -421 -85 293 499 432 121 -235 -476
1314 -476 -484 -214 209 500 495 198 -182 -448 -467 -262 83 405 509 318 -73 -442 -534 -331 40 349 470 342
1336C42l15l44k16J01L64L92J81j21l08l24k07K0K55L91K93j6l18l70k35JK15
1357b19L32L01R7k01l91l34j03K22L87L04P8j62l13l14j72Q8L54L61J86j18l21
1378F2l31j82L3K51L74K81j2l24l93k17L1K35L00K86O7j97l79l09q3K09L61L21
1400C84J00j88l44l03j39J44L10L30J88j11l27l38j74O8K87L39K44k1k94l87k31
1421d63N6K57L16K35K6j83l37l10q4K20L59L00P5j88l22l15j03J35L33L15J44
1442D66j34l13l11j63Q0K68L46K16n9k90l41k16K2K73L38K27jk40l06k69m2K04
1464b45L23L02Q8k00l47k87r4J63L24K95J20j19l14l05j48R7K95L08J92n3k83
1485A12l47k12N6K78L31K18l1k42l15k42l3K38L14K65M7j91l25k92p2J76L11K88
$$ plain form
1336 342 27 -317 -533 -432 -68 324 505 384 76 -248 -455 -435 -180 211 504 488 170 -200 -435 -434 -219
1357 -219 113 414 511 310 -81 -415 -518 -296 91 395 473 311 -2 -316 -488 -400 -46 315 501 383 62
1378 62 -269 -451 -418 -167 207 488 476 152 -241 -458 -427 -192 108 394 461 264 -115 -424 -507 -298 63 384
1400 384 484 296 -48 -351 -490 -346 -36 294 482 371 44 -294 -468 -400 -113 226 470 449 155 -232 -463
1421 -463 -407 -150 166 401 427 244 -93 -403 -487 -267 92 392 467 279 -43 -358 -461 -326 7 322 466
1442 466 332 19 -292 -455 -375 -107 239 455 396 106 -235 -451 -429 -156 182 409 408 168 -138 -407 -449 -245
1464 -245 78 380 468 268 -79 -366 -460 -297 27 322 442 323 9 -296 -444 -347 -52 256 448 395 112
1485 112 -235 -447 -391 -113 218 436 405 163 -152 -394 -427 -189 125 390 437 246 -79 -371 -443 -267 44 332
1507C32R4j47k89k94j36R8K90L17J60p6k87l08j78L3K61L39K17l8k62l23k04j
1529d02K19K96K66M4k03l21k79n3J96L13K59J01j58l08k77j02J22K65K98J61p6
1550C61k95l24j65P4K68K98J99l0k49l25k10J8K37K92K09L2j74l15k79n2K02L15
1572H7K43P7j60k95k83r3J58K78K73J01q7k50l10j69P6K97K93J61n4k42l02k03
1594d04L1K47L10K00j4j93k91k39n0J86L25K55M1j81k77k59r6J41K91K87R5j27
1616B78k81k54j51Q4K79K97J58q4k56k71j74L4K03L14K04k5k31k66k24j5J86K96
1638A01K51K4j84k86k41n6J56K65K51J00j31k69k61j21J06K53K97J44q8k56k91
1659b36j34O6K11K70J83jk26k97k05K4J89K71K23K7j70k95k21n6J62K77K41P1
$$ plain form
1507 332 426 279 -10 -304 -440 -342 -52 265 425 349 62 -246 -424 -391 -130 209 426 388 126 -197 -401 -402
1529 -402 -183 113 379 423 220 -101 -380 -433 -237 76 335 436 278 -30 -307 -409 -287 -22 276 437 361
1550 361 66 -258 -423 -349 -81 217 416 386 137 -188 -398 -380 -143 149 358 390 216 -99 -378 -430 -228 87
1572 87 330 407 247 -48 -331 -424 -266 12 285 386 299 49 -261 -430 -354 -57 236 397 343 101 -201 -404
1594 -404 -373 -126 184 384 370 177 -114 -353 -403 -217 108 363 404 223 -54 -313 -409 -268 23 310 405 278
1616 278 -3 -257 -408 -324 -45 252 410 326 70 -201 -375 -341 -138 176 380 355 124 -142 -366 -381 -195 101
1638 101 352 376 192 -94 -335 -391 -235 30 281 381 250 -19 -280 -401 -295 -42 255 399 311 55 -236
1659 -236 -370 -304 -93 177 360 359 133 -164 -369 -345 -156 115 338 365 195 -100 -321 -377 -215 62 303 374
1681C74j28k61k64r9J13K45K74J13r0k52k63j41P6K29K63J67m2k06k83j93K0K10
1703a38K77J91pj73k73k07m9J75K81K33M2j45k49k28r1R5K72K67J22j28k53k64
1725b50j13R1K24K47J75n2k38k68j61M4J95K62J95Lk12k75j89l0J89K66J98L8
1747C39j44k55k24p2J38K42K34J09j06k61k66r3R8K41K28J36o1k05k80j60N5K18
1769h9K53J59nj89k73k02rK23K59J80J1j57k31k00p8J24K76K24P5j17k48k29j10
1792c53J17K17K54J14q9k03k60j32N5K24K23J67k6j92k57j93rK04K81J79oj67
1814A48k47j83m7J24K60K14Q1j41k63k10o9J00K24K34J08q0k22k58j13O7K18K41
1836A86J33l1k02k40j66jK02K73J75k7j84k25j62l7J33K49K21M6j38k50k21m8
$$ plain form
1681 374 246 -15 -279 -378 -265 -20 254 367 277 25 -238 -379 -303 -74 189 356 314 108 -175 -368 -348 -138
1703 -138 139 330 323 150 -123 -330 -379 -204 77 310 352 207 -42 -270 -361 -266 6 273 395 267 14 -250
1725 -250 -363 -272 -48 199 374 322 84 -184 -345 -301 -106 156 351 354 142 -133 -322 -352 -163 103 301 339
1747 339 195 -60 -284 -356 -218 24 258 367 261 0 -266 -359 -261 -20 208 344 283 78 -202 -362 -307 -89
1769 -89 164 323 318 129 -144 -346 -355 -132 127 307 318 161 -70 -270 -348 -224 52 276 351 234 -14 -243 -353
1792 -353 -236 -19 235 349 260 57 -203 -335 -280 -56 167 334 308 116 -141 -334 -343 -139 142 321 315 148
1814 148 -99 -282 -329 -205 55 269 350 209 -54 -264 -333 -233 -9 225 333 253 31 -227 -340 -273 -55 186
1836 186 319 288 86 -154 -320 -321 -119 154 329 302 118 -107 -269 -306 -173 76 297 343 205 -45 -266 -314
1858c14J05K34K22J04j03k34k33j03Q3K08K15J32n6j93k26j66J2J88K77J80k7
1879C05k05k34j59PJ31K10K15M9j54k48k04mJ07K04K24Q6r4k56k30q3J08K13K07
1902A95J09n8j89k22j46K2K00K49J71k3k17k46j35J7J68J94J87M2j45k58k03r
1924b97J39K07J92O2q8k27k45p9J24K25K06O9o0j97k16j35L7K22K28J22k4j93
1946G2k30j62M0J76K27J36J2j39k25k02j4J68K32J54K4q7j89k36q5J13K48K29
1968B62K7r2j94j82j22M8K04K41J15o4j81k22j29J6J86K30J62m3j44k24j61k9
1990b96J49K40J84J0j40j94j90o0J02K18K18N5j10k12j93q3P6J89K17J11n5k00
2012C6k17j26L4K00J98J47rj71k22j35KJ42K17J71K8j43k29j75l2J23K03K02N5
$$ plain form
1858 -314 -209 25 247 351 248 14 -219 -322 -239 -31 184 316 260 67 -159 -325 -313 -125 152 332 305
1879 305 100 -134 -293 -286 -155 55 270 319 165 -83 -287 -291 -184 20 244 330 236 -20 -250 -333 -225 -12 195
1902 195 304 246 57 -165 -311 -289 -89 160 331 308 91 -155 -290 -273 -105 89 276 318 173 -85 -288 -297
1924 -297 -158 49 241 303 215 -12 -257 -336 -212 13 219 288 228 31 -185 -320 -283 -61 167 289 265 72
1946 72 -158 -320 -280 -104 123 259 271 132 -93 -295 -309 -141 91 245 269 182 -7 -243 -328 -215 33 262
1968 262 289 197 3 -179 -301 -253 -49 192 307 243 62 -160 -289 -273 -87 143 305 262 118 -106 -267 -296
1990 -296 -147 93 277 287 147 -47 -237 -297 -195 23 241 296 186 -26 -219 -302 -226 -37 180 291 236 36
2012 36 -181 -307 -273 -73 125 272 263 92 -130 -265 -263 -121 96 267 295 152 -77 -252 -284 -161 42 244 299
2035B99j13k05k00n9R0J78J95R9n3j95k10j21N9J92J93J21j3j77k10j58L0J44
2057a14K16J43Pj21k03j89m1J30K21J83K0j02j98j91o7J09K00J87P2o9j91j87
2079a85r5M2J77K19J33n9j76j97j31K3J61K07J53j4j62j89j41k5J23J95J78M9
2101B86j33k18j69l8J15J94J83O8r4j85k05p1O8J74J99Q8l2j81k10j18L8J71J98
2124A28J22j8j41k07j47rJ41K00J54K7j14k05j77l5J20J78J86N1p7j93j90q0P8
2147b08J93J73R0l4j64j92j32N0J70K04J19l8j55j86j28qJ40J97J55Qj31k01j60
2170b38k5J20J97J71L0j02j74j78q1Q3J93J88P8p9j64j78j05M2J53K09J26n3j74
2193C9j82r8MJ23J86J67K0j54k06j54QJ20J77J68L2r7k01j70l7Q7J81J74Q1p4
$$ plain form
2035 299 186 -19 -219 -278 -188 -10 185 284 231 36 -174 -295 -236 -44 149 270 257 80 -130 -288 -258 -114
2057 -114 102 245 252 131 -72 -261 -302 -172 49 232 252 150 -48 -239 -306 -197 3 190 262 193 2 -185
2079 -185 -280 -238 -61 158 291 232 56 -141 -272 -249 -88 119 272 258 96 -93 -234 -259 -136 59 237 286
2101 286 153 -65 -234 -272 -157 37 220 288 194 9 -196 -267 -199 -25 174 262 230 49 -161 -279 -241 -70 128
2124 128 250 232 91 -116 -263 -272 -131 69 223 250 136 -69 -246 -281 -161 17 203 254 177 -16 -206 -286 -208
2147 -208 -15 158 248 214 50 -142 -274 -224 -54 150 269 231 76 -110 -238 -246 -106 91 246 254 123 -78 -238
2170 -238 -263 -143 54 225 255 153 -21 -199 -280 -197 -4 184 262 183 19 -159 -264 -222 -69 140 266 213 39
2193 39 -143 -241 -237 -114 72 239 259 105 -101 -255 -247 -127 50 218 250 153 -48 -218 -255 -168 13 187 268 194
2217A94j88j69q1O7J46J84J06j2j97k02j00O0J27J67J40Nj27k15j49OJ38J73J27
2240B00M5j00k00j72m1J09J88J48N5o6j83j68p6P3J64J84P8k9j69k02j11O3J57
2263e3J64R8%j10j93j59PJ42J97J16J4j02j65j70m1J18K04J53J9q2j64j49q6O2
2287a80J77J73P6n3j48j84j09L4J80J68J01k5j29j88j34mJ50J99J11qj19j54j38
2310b04m5R2J87J87J6j23j39j42o1N2J72J75P7n9j87j63o9M0J45J72J20m1j61
2333D1j55j17J8J18J95J41k1j32j76j04l2R8J73J58M7j14j71j30o7Q8J50J66P2
2356B46o4j77j84o5P6J43J55Q5k0j64j65j09K5J37J87J00kj15j94j20lJ04J78
2379E4J48Qj00j73j30l3Q3J55J53N8p0j77j56n7Q7J39J63P3m0j39j81r4M2J40
$$ plain form
2217 194 6 -163 -244 -177 -31 153 259 247 50 -152 -252 -192 -65 102 242 247 120 -95 -244 -238 -100 73 200
2240 200 245 145 -55 -227 -268 -159 29 177 232 166 -17 -185 -261 -188 -24 160 238 209 40 -162 -273 -210 -53
2263 -53 111 209 209 99 -94 -253 -246 -104 93 209 223 121 -44 -214 -255 -137 67 220 239 157 -7 -156 -242 -180
2287 -180 -3 170 246 193 45 -139 -248 -214 -34 134 235 210 81 -107 -241 -245 -95 104 215 207 88 -66 -204
2310 -204 -249 -157 30 217 233 110 -29 -171 -232 -180 -8 167 244 185 -2 -165 -234 -194 -49 123 243 202 41
2333 41 -114 -231 -213 -95 100 241 220 88 -88 -192 -224 -126 47 205 252 138 -33 -163 -230 -142 8 174 246
2356 246 182 5 -179 -244 -168 -25 130 215 195 31 -134 -243 -218 -81 106 206 204 89 -105 -225 -228 -124 54
2379 54 202 210 110 -63 -193 -226 -143 12 165 223 153 -24 -180 -237 -150 -11 152 225 185 46 -135 -229 -187 -47
2403d7J64Q6j0j18j85j16J1J29J67J12K6j20j54j38j8R3J54J47L0o9j72j49n2
2426b29P7J55J52N3n4j43j52r2L9J47J68Q7n3j03j73r4%J31J62J25Kj27j60j02
2450a84k8R0J69J30L9r0j69j34l9P6J61J39N4n1j58j44p2L9J48J49Q3k2j28j66
2474a08j09L6J17J59J21j2j39j47j18%J06J41J13M1r1j52j42m1R7J45J35M8o9
2497A31j38j55o6O9J30J54O1l6j21j68q2K6J35J44R8qj09j43j21%J06J65J10J2
2521A94r5j30j41m5R9J57J32K7o2j50j26o1N0J50J49N7m7j38j38q8L5J34J39J05
2545B07l1j27j46r3rJ15J46J45k5j02j48j11j0P0J44J29L8q0j49j30l8O8J24J39
2569A26O1m9j33j36q4O0J19J44J04m5j18j57o3LJ00J53J01Nj01j51j01qQ0J31
$$ plain form
2403 -47 117 203 193 75 -110 -226 -215 -86 81 193 219 99 -55 -193 -211 -118 36 183 213 144 -28 -177 -229
2426 -229 -152 3 155 208 154 11 -141 -233 -194 -47 121 208 155 52 -121 -215 -215 -84 78 203 205 78 -82 -184
2450 -184 -212 -122 47 177 216 126 -43 -177 -216 -140 21 160 214 163 5 -139 -211 -172 -24 125 208 186 58 -108
2474 -108 -217 -181 -64 95 216 204 65 -82 -200 -200 -94 47 160 201 110 -42 -184 -225 -128 17 152 200 131
2497 131 -7 -162 -228 -159 -29 125 186 150 29 -139 -221 -195 -60 84 182 174 65 -78 -199 -199 -93 72 182 194
2521 194 99 -31 -172 -217 -118 39 171 198 136 -14 -140 -201 -151 -1 148 205 158 20 -118 -206 -171 -37 102 207
2545 207 176 49 -97 -190 -199 -84 62 207 182 80 -68 -179 -189 -119 25 154 192 112 -37 -167 -205 -137 -13 126
2569 126 187 138 5 -131 -215 -155 -36 108 212 167 49 -108 -171 -168 -68 85 186 191 90 -61 -162 -170 -90 41
2593D1J31K8p6j46j41l1Q4J49J01N1n9j34j27o4K7J38J52O8l7j22j54p0K3R9J49
2618H0J00qj12j53r1RQ9J28J12K6p9j44j33k6R4J30J18M5n9j38j19o3N5J16J52
2643A29N6m2j11j51n7J8J13J38J00k5j03j39j02K4R3J25R6Rp7j31j35j3Q5J42
2667D2J08K5p1j26j30m6N8J40J26M8m6j20j33p1L1J21J31P7j2j06j40p9j1J21
2691f3J33Q2qp2j26j15j1Q6J30J19J6q1j15j15k9N6J15J32N8n3j40j19m6K6J15
2716b5J37P4l5j16j24o9QJ00J28J01j4j04j27r7qR8J15J13J9q3j39j02l4O8J18
2741BJ00N7o4j14j28m9O5J10J32M2j9j10j37o9K5J19J29P4mr7j46q4J1P2J39R8
2767A54Qp8j26j03k5O7J30J12L5o0j24j19l4M4J14J33L8l0j15j26p1K8J13J34
$$ plain form
2593 41 172 200 124 -22 -163 -194 -110 39 140 191 132 -2 -129 -193 -166 -28 124 192 155 33 -121 -191 -168 -69 80
2618 80 180 172 60 -93 -184 -175 -86 42 154 180 101 -43 -176 -202 -108 22 140 185 126 -12 -131 -194 -139 -23 129
2643 129 185 143 32 -119 -176 -158 -45 93 193 168 65 -74 -176 -152 -59 66 162 171 94 -37 -172 -185 -100 42
2667 42 150 175 104 -22 -152 -198 -140 0 126 174 128 8 -125 -196 -165 -44 87 164 152 46 -94 -173 -184 -63
2691 -63 70 152 144 72 -54 -169 -180 -94 36 155 171 90 -25 -140 -169 -113 2 134 192 139 -1 -120 -166 -140 -25
2716 -25 112 186 151 35 -89 -158 -150 -50 78 179 165 61 -66 -163 -171 -73 42 155 174 91 -48 -150 -184 -116 2
2741 2 102 159 95 -19 -147 -196 -131 -21 111 153 134 24 -113 -182 -157 -38 91 165 161 64 -82 -166 -155 -83 56 154
2767 154 162 84 -42 -145 -170 -103 27 139 174 114 -10 -129 -163 -119 -5 128 166 136 21 -105 -176 -148 -35 99
2791I9O3k5j01j27p8J2R9J14Q3Mo7j30j12j5P8J37R4K9o4j26j03l4N0J23J03N1
2817A57l3j18j26m0L6R9J24N6j7r7j37o6PJ04J30Q4oq9j18r1oP5J28R0Oo8j18
2844c4r6l6O2J11J12L5m1j17j15m2M1R4J22O5k8j00j41n5RR5J11P4kq7j22p8k
2871a65R1J05J00Jn9j13j08qN9J03J20K8n6j10j07m1N2J00J04P0m5r8j18n4K9
2896a20J01J08O3j6r0j05q3J5O6J11R3Pq0j22q2j6O8J09R8J8m9j09j01m5N8J05
2922BJ13L8l8j14j07m8J6J08J00O4k0r4j02q0J0Q9J12P5K2r5j23p1j3Q6J01Q9
2948A20L3o2j15q3m6N6J08J00M9n5j01r6m2K2R8J08M7j7r9j07o8K2Q2J21N4Lp5
2975E7j12q2j1Q3J05Q7jo2q2r7l7M4J23R3K7n7r3q9n4L7J08R6N2l9r1r2n5J8Q8
$$ plain form
2791 99 162 137 36 -91 -169 -157 -58 56 139 143 76 -54 -166 -181 -103 34 128 157 93 -33 -136 -170 -120 3 106 157
2817 157 124 6 -120 -160 -124 -25 99 155 138 41 -96 -162 -155 -51 79 163 157 68 -50 -141 -147 -72 56 146 152 84 -34
2844 -34 -130 -166 -104 7 119 154 113 -4 -119 -161 -120 -26 96 161 133 33 -108 -163 -154 -59 52 126 124 37 -85 -163 -165
2871 -165 -74 31 131 132 73 -40 -148 -156 -97 6 126 154 98 -12 -119 -160 -108 -8 96 166 121 23 -95 -149 -120
2896 -120 -19 89 152 136 46 -59 -142 -127 -61 50 143 150 70 -52 -134 -150 -82 27 125 143 94 -15 -116 -161 -103 2
2922 2 115 153 115 1 -106 -154 -138 -30 70 134 114 20 -82 -162 -152 -63 49 124 146 51 -72 -143 -156 -70 31 120
2948 120 153 91 -24 -107 -153 -97 11 111 160 105 4 -92 -134 -112 -14 94 141 124 25 -82 -150 -128 -46 75 129 132 57
2975 57 -55 -137 -148 -65 40 127 126 64 -18 -115 -152 -108 15 108 135 78 -15 -104 -158 -121 -13 83 135 96 5 -87 -142 -124 -36
3004c6R6O9pq2j05p7NQ0J08Q5No9r9q4j8N5J06Q8L1n7j07q5m7N5R2J06L7k9j00
3033A6j05m2J0R5R8N8Jr6j22n5qR3R5Q2Mo3j02r0pN5R2R5L6o4j04q7j7L4J00Q2
3063H4N5m8q6j03m1J7J08Q3N7jq9j11o4J7Q0J04N9Po9j06p0j1O1J14O7J7n1j02
3091b2q2k2M4J01R8J4n0q0r7m1M0Q5Q0O6l7o5j12o4K2P2J06N7j1p0q7o6rN1J12
3120C3Q5Ro9r3p3k1M3R2R7K8l7q1j06l4M6O4J09K6kr1q1p0J7Q9R7O0j3q9p9n7
3150a01j1O7R2R1j2o3r1o3k8N6O4R3L5n5j00q4l0M5Q0R2L5k7q8r5n1K9Q5R8O2
3179A25l2p1r1n2J0O7P9R1j0o8j02n5nO5P6O5M3n5r1q8k7N5R6O4K9k7q5q8l9K6
3209i5R0R7L9k9p6r3n4K1O9R5N6j1o7q0p9j3P5P6O7Ok4j01r4RL4Q9P4J2l4p3o5
$$ plain form
3004 -36 60 129 122 40 -65 -142 -137 -57 51 136 141 72 -27 -111 -129 -74 32 120 151 94 -13 -98 -145 -90 2 108 145 116 16
3033 16 -89 -131 -121 -26 72 130 131 35 -87 -142 -150 -57 38 120 124 61 -41 -131 -138 -83 9 104 140 76 -28 -115 -132 -98 2 84
3063 84 139 91 5 -98 -139 -122 -14 69 126 125 36 -75 -139 -122 -42 62 121 128 59 -47 -117 -128 -67 47 114 131 80 -22
3091 -22 -104 -126 -82 19 117 131 81 1 -96 -137 -97 -12 68 134 97 32 -80 -144 -122 -50 56 113 102 32 -55 -121 -130 -79 33
3120 33 118 127 58 -35 -108 -129 -86 6 103 131 94 13 -93 -127 -81 -17 92 118 116 25 -56 -126 -109 -20 77 137 124 35 -44 -101
3150 -101 -112 -45 47 138 126 63 -28 -91 -119 -63 1 94 129 74 -26 -110 -140 -95 -15 77 112 85 -3 -98 -149 -120 -35 63 125
3179 125 93 22 -69 -121 -111 -44 35 126 116 48 -54 -109 -114 -49 27 92 135 80 -11 -99 -126 -71 25 89 118 91 6 -82 -121 -95
3209 -95 -5 92 131 102 26 -67 -121 -100 -31 64 120 109 42 -38 -117 -130 -55 21 88 94 70 -31 -125 -116 -82 7 81 93 59 -14 -79
3240g9m4J9Q5R0L9k2q2q4m7K4O7Q9O3j7o6q4o3PN9Q4P6mn2q5o7k4N3Q2P3L3m0
3271H3j01p1m2M8Q8O4N3l2q8p7m5J9P4Q8M0Oq5q7o4K0O7P9N4Qn2q6p7oM9R3O2
3302H2J4m3r8m7m0M2Q8Q3K5k6q2q0l2J0R0Q1N8j8p2q8n3J7P1P4N8j3m8p8p0rN3
3333e1Q6O6Pm8q1o4j8K1Q8O2L0k1q1p2l8L0P0P6K8j0n9r6l8J1O0Q8M5oo2q4n3
3364a14LM5Q2O0J4m4p8p7jL7P6P9K5m2q3o4k9L0P6P7M0l3n8q3m0J3P3P1N2ro2
3395C6q0o0lP1P1N9J1n8q3o4rN1P1P2Ql8p0p1j2J9P3P5L0k7p1r0l1L7O4O4M4j2
3427G7o5o1n9J2O0P2N6Kn4p1n9k2P5O8N7K2m7p4p3j7L7O9P4K8k0q8n3m5K0P8N2
3458E1M7j7o3p7n2J8N0Q3K9Nm3o6n6j2M2Q9O0jm5p2o6j8M7P0O4K4l2p8m9l7K3
$$ plain form
3240 -79 -123 -104 -19 71 110 88 6 -78 -125 -101 -34 55 118 101 35 -49 -112 -105 -46 38 114 110 58 -27 -94 -118 -65 17 90 123 83
3271 83 -18 -89 -131 -83 5 69 122 90 2 -75 -120 -101 -27 61 101 107 22 -65 -129 -109 -42 37 91 99 47 -39 -116 -122 -73 20 82
3302 82 96 53 -45 -92 -132 -90 -2 81 106 80 -2 -82 -114 -104 -14 67 125 107 35 -53 -106 -89 -18 56 114 101 53 -25 -95 -104 -51
3333 -51 35 101 108 60 -21 -85 -103 -82 6 68 98 77 -4 -76 -114 -84 -14 62 90 80 21 -75 -113 -102 -42 46 91 85 23 -61 -114
3364 -114 -111 -66 16 76 90 46 -32 -109 -110 -73 3 82 107 65 -18 -82 -111 -81 -5 72 112 79 21 -62 -102 -89 -16 55 107 98 36
3395 36 -44 -104 -107 -36 35 94 105 47 -36 -100 -109 -58 13 85 93 55 -15 -86 -98 -79 -6 69 99 72 1 -89 -120 -83 -19 45 89 77
3427 77 12 -49 -108 -96 -36 36 92 94 40 -31 -90 -112 -37 31 88 110 63 -11 -84 -101 -64 5 79 107 87 -1 -54 -99 -79 -1 51
3458 51 98 81 18 -59 -111 -93 -43 40 69 74 31 -35 -91 -103 -61 28 88 87 42 -30 -96 -114 -67 3 67 91 59 -19 -68 -105 -82
3489h2N9Q5K1rn7q2l6J6O7O9L6nm4p2o0pN8P5O0ll6p3o9j5N8O4P5J9n3o9o3l1
3521a04L9O5P4J8k2o7o4k9QN9O9M5j5n3o4n7MO5N6N2On5p6m1j3N7N6O3J8n0p0
3552b6l9l1K8O7P2K2k5o7o7k7K5O1N4M9j0o8o2m3QN8P7M2rn3p5l7j0M7O0O3J9
3583A03m9p2m4k8L1O6P1J8l0p5o0l1J6O8O4M2j2p7o2m3QN4O5N1Kn9o0m6kN1O9
3614B9N5mk9o6o1j2K8P7N7J5k5o5n8j2K0O5N3K2ro1n9m1RO1P0K9Lp2n9m1J1L1
3646c9Q1L9Jl5o3o4j3L4P1N7Mk8n3o8j7K6O5N6K0k0n7o8j7K3L3O5M3lo1m3m9j
3678h1N2O6M9Ln1n1o0%L1N6O0J8l2o5n0rJ7N5N3K5k2o6m2k6J1M2P8J9j2m8p1l1
3710h2QN3M6N8On5p7l7MM0N6M2J2l9n4o1j3L2N5N7K9m0m9o2k4L4N7N0K9qn8n8
$$ plain form
3489 -82 -23 62 83 74 17 -65 -101 -85 -18 51 87 82 38 -34 -94 -101 -43 32 92 89 53 -20 -89 -104 -46 18 93 112 59 -10 -73 -104
3521 -104 -65 0 74 92 70 3 -61 -90 -82 -23 46 91 76 23 -41 -98 -94 -29 27 79 85 30 -46 -87 -100 -43 13 76 94 44 -26
3552 -26 -65 -96 -68 -1 71 93 68 1 -66 -93 -68 -7 47 96 86 18 -44 -87 -79 -21 56 98 89 36 -39 -76 -86 -39 21 84 103
3583 103 54 -18 -62 -90 -59 7 78 96 66 -9 -69 -100 -84 -16 48 90 78 1 -61 -104 -96 -42 23 74 76 17 -43 -89 -91 -40 29
3614 29 84 80 51 -15 -76 -88 -60 17 74 89 64 -1 -59 -71 -51 14 67 89 80 19 -40 -81 -72 -11 59 88 91 19 -40 -81 -70 -39
3646 -39 42 81 82 47 -16 -80 -93 -59 12 69 73 45 -8 -76 -93 -67 -2 54 74 54 -3 -71 -88 -65 -32 33 76 73 12 -31 -80 -81
3678 -81 -29 37 86 89 38 -13 -73 -73 -42 14 74 92 60 -5 -55 -64 -47 8 61 86 64 -2 -44 -70 -59 -17 61 80 68 20 -51 -82
3710 -82 -74 -21 25 83 89 34 -43 -80 -76 -36 20 62 74 35 -19 -80 -93 -61 -6 51 80 40 -9 -71 -95 -61 -4 46 75 67 9 -49
3742d9m5L2L3O7M8nn1o3l3j0N9N3M0Mk1q1m1pL3O2M1J3l0m8q0rK6N8N7J9k1l9
3774A2p0k9K3M4O1M6k9m7n9l3MN2N0M4Pn2n6l9pL6M7N6Ll1n5m7k3K7N6N2K8k8
3806D3n1m6j9J9M8N8J5j0l1p0l5K0L9N4M2ql5n8m2nL5O6M2jl3o3l5j9K2O1M1K1
3838F5k9n9m3k8K9N5M5K7rn8m7k7J2M0M5M2pm3o1k3oL5N8O1j4l0n6n9QL2N0M2
3870D7K2l0m9n8jK1L9O6Npl7n7l2K1M1M5L9k1l2o3l0J3K4N7L6Pl2o8l6kK8N0L3
3903C9Rk0o0k6j7K4M5M0K7k4l1o0l0K0N4L5M5j8m4n8k7J6L2N5L0Mm0l8l6j4K7
3934d1O3L5Ok9n7l7nL1L3N3J5k4l1n9k6J1N1M9L2k1m1n0l2J6L4N1J2Rl5m8m0J4
3966f1K2L8L9Ll0k6m3k1L1M6M8J1l3m4m5oK4K8M8K7nn6l4j6JM0L7K8Pl1o6j8p
$$ plain form
3742 -49 -94 -62 -29 38 86 81 30 -33 -66 -76 -17 36 76 80 59 -22 -63 -70 -37 25 66 79 49 1 -79 -88 -62 -4 53 72 51 12
3774 12 -58 -87 -64 -20 41 87 58 11 -48 -81 -77 -25 25 69 76 24 -32 -71 -78 -42 5 61 64 33 -22 -69 -92 -65 -9 43 71 43
3806 43 -8 -54 -73 -54 -6 52 67 57 26 -44 -79 -59 -20 34 76 68 33 -25 -67 -72 -37 29 71 70 37 -26 -61 -80 -58 3 44 65
3838 65 36 -23 -66 -94 -65 -10 35 62 53 -5 -52 -79 -67 -27 18 60 53 10 -51 -74 -80 -45 13 74 60 30 -26 -85 -77 -45 5 47
3870 47 69 39 -10 -68 -69 -48 -9 57 62 55 18 -39 -71 -50 -9 36 75 54 22 -41 -71 -58 -34 23 59 66 34 -34 -70 -72 -44 6 39
3903 39 48 28 -32 -58 -75 -51 -6 34 61 37 6 -54 -84 -64 -10 25 70 52 8 -50 -77 -61 -29 26 56 60 20 -18 -54 -68 -41
3934 -41 22 57 63 34 -23 -60 -65 -34 -1 52 67 43 12 -47 -73 -62 -11 38 70 49 8 -42 -74 -58 -24 27 39 48 13 -35 -75 -61
3966 -61 -39 -1 38 41 11 -15 -58 -79 -48 -2 46 57 24 -20 -65 -71 -47 -19 29 56 51 -5 -39 -55 -54 -14 23 51 58 27 -39 -57 -64
3999f4L6N0K5Qk3n8l4LJ9M7M7Jk0m9l3k0M1K6M1K7j4n5m2l1J6L3M9K4kk5o8k1
4031f6NJ8O9J5%k6n5j9j8M1M0L9Ol1l1l8k2L8L7M5KJn5m1mjN7K7K7j6l2n1j8l
4065f0L7N0K9Om0m5m1J2L0M6K7nj2n5l2pJ6M5L8J3j1n6m4qQM6N2Rk3j0n8k9J6
4098e6M0M6Rok1o5qJ3J5M1M0Pl2m4j6l1L0M9L2Pj0l1m1k8J6L6M5J8qm3l9j8JL8
4132a4M0K1ql4l7l9OL8L8K2J3l3l5m6OJ5L2M0K4l7k4l6k3K1M8K9J9j8k9l9l4K4
4164e0K6N1J8km7l8j8QL0M5L8j6l1l6k1mJ2N4L4jk6l0l4j5L3J6M9Oj3m0m5JkL3
4198a5M2J7ql3l2k3NJ9M3K5%k3m9l2jL5N2K8nk9m7k5j7L2L0M3J1l0k6l7NjL3N1
4232C8Kql0l4k6J1N1OM1k4j5l6k2kJ8N4K5Jk6l2j3l6L8L8J5J7j9l9l0j2LL6L5
$$ plain form
3999 -64 -28 22 47 55 32 -26 -60 -57 -38 9 56 57 37 -12 -45 -65 -24 2 43 70 56 1 -41 -72 -56 -23 26 50 48 23 -45 -66
4031 -66 -61 -43 26 41 41 15 -40 -59 -77 -36 4 43 49 18 -13 -51 -73 -35 2 47 49 50 -5 -46 -50 -51 6 33 60 44 12 -39 -57 -60
4065 -60 -23 27 56 62 22 -23 -64 -52 -22 24 51 46 34 -21 -53 -60 -44 1 39 52 41 -15 -59 -67 -59 -13 39 48 25 15 -43 -72 -56
4098 -56 -16 30 39 33 12 -53 -61 -48 -33 8 48 55 23 -21 -37 -68 -38 11 43 50 40 9 -32 -60 -44 -8 37 55 47 4 -35 -53 -52 -14
4132 -14 26 47 39 5 -32 -71 -65 -27 11 33 46 13 -22 -68 -62 -47 -15 25 49 12 -12 -48 -71 -50 -2 27 46 28 -1 -40 -74 -50
4164 -50 -24 27 45 43 -4 -42 -60 -52 -22 23 61 45 14 -22 -43 -47 -35 19 53 52 26 -4 -38 -53 -20 -4 45 51 38 -2 -47 -46 -48 -15
4198 -15 27 44 36 3 -29 -52 -47 -28 15 40 40 17 -32 -64 -65 -30 22 50 45 16 -31 -56 -73 -41 -11 32 43 13 -13 -50 -45 -46 -13 38
4232 38 40 32 2 -32 -58 -47 4 10 51 27 12 -24 -46 -48 -30 24 49 50 24 -8 -21 -57 -19 19 34 51 32 -7 -37 -49 -46 -10 25
4265B5K6l0k8n2%OM1K3K9kl9l3j7kK3L5M2j3k4l8k5mK7L5L6Nk0l5l8pJ9M0L5R
4299D9j2m2l3j7J4L7L9K2j9l0k9j3kL3L3K1Ol2l0k8j3K7L7K0J0l4k9k8nK1L4K9
4331C6Jj1l1l3pJ2J9L3Rll7l0k1L0J2L6K1j6j4k9k6kK8M1K2%j8l6k2j9L6L5L1
4364D7%k1l4k0pJ0K4M4Rj4k9l2k9K1K6L5J8j2l9l2j0jK7L7J7jl2l7j4j3K9L9J7
4397B3%pl6l0NML7J7J7j2l2k4j4J6K0L7K5k5j8k2j5rL9K7J2Ol4j6l5OK5L7K0M
4431D8k8k5k5rK0L2K1J6k6k1l9j2J6L5M1Kk4k5l0k2J7K8M5mqk0l8j6lJ5M5K7m
4464B9j8k6l4lK8K5K4Rol2l0j7J5L9K7oOl1j5k0J4J9K0K1Mk6k6k2LK1K0K7jj3
4498B5m3rj9K2L8K8%l1l2j4j0J7J1M7K0m1k0k6lJL0K8J2%k1m6qqK3M2J3qk1l3
$$ plain form
4265 25 51 21 -7 -59 -59 -53 -12 11 40 38 -1 -34 -51 -53 -30 5 47 34 10 -28 -53 -57 -30 5 41 46 26 -9 -47 -54 -35 5 40 49
4299 49 37 -5 -38 -55 -41 -4 35 57 38 8 -21 -34 -36 -3 30 51 57 25 -5 -33 -46 -19 18 38 48 14 -15 -43 -48 -27 7 36
4331 36 37 26 -5 -38 -45 -33 -14 19 28 25 -12 -42 -63 -33 -21 15 36 20 6 -23 -49 -51 -23 18 40 40 22 -14 -36 -55 -19 16 47
4364 47 47 26 -8 -28 -35 -25 -1 43 52 38 9 -23 -52 -31 -5 30 48 36 -3 -35 -45 -46 -19 18 35 34 2 -35 -49 -62 -33 6 23
4397 23 23 16 -20 -50 -45 -41 -4 13 30 18 -14 -38 -52 -36 -16 21 46 21 3 -19 -34 -43 -4 23 35 41 7 -9 -44 -38 -13 24 44 48
4431 48 20 -5 -30 -39 -19 13 34 50 24 3 -36 -48 -32 3 44 46 22 -3 -33 -55 -38 -10 35 31 23 3 -35 -51 -54 -39 6 33 29
4464 29 11 -15 -49 -52 -24 1 25 34 28 -4 -34 -51 -36 3 30 24 30 -1 -16 -36 -22 -3 17 38 42 16 -10 -32 -29 -8 12 39 38 25
4498 25 -18 -27 -46 -24 14 42 42 11 -21 -35 -45 -28 -17 30 50 9 -11 -37 -40 -39 -9 19 31 31 10 -36 -44 -52 -29 13 26 18 -3 -36
4532c6j4kL3K0K6Lj0k9l4KJ8K5K3J0nk4k7j4J4L5J7J1j6k6k4oOJ4K8J6Km1j1k3
4566c9J5OL2K2pj2m5j9OJ6J7L4Kj8k3k9lJ0K3J7K1lk8k2j8J1J8L6J1j4j5k4k9
4599e1LK9K3K8kk5j5k6PJ9K0J4Rj8j7j7nRL2J8J7k6k4j8j3LJ6L2J0nk5k0k6J7
4633b7J8PK5J0k8k5k5j1K6K5L0ork3l7MJ2K6L6Kj5j7k7qQL5K0O%l0l0j5J7J5L0
4668A9PPk3k4qjJ6K8J3Ok5k1k6QLL0K7%Ll1l6qJ7K5K3Kkl3j7ooK6K8kKl2mk2m
4707d1K5K2J1Qj3l8j2LJ6K4K3J2k0l4k4qK7K7K0jJl0k4Qj3L4J8K5k7ql2j1J1R
4741a2K7J9Kj8l6j7J1K2RL2Nk3k2k9LRJ3J5K0nk9k6j0OJ1L4J6j4k4j7j7J2K2K4
4775A3J1%k8j2j6MK2PK0J5k4k2j8j0K3J7K5J4j2k6k4j1J4K5PJ8ok2k1j3MJ5L9
$$ plain form
4532 -36 -50 -52 -19 1 27 30 20 -9 -43 -41 -23 2 25 35 30 6 -21 -35 -21 14 31 42 26 0 -24 -30 -24 -10 18 34 36 -5 -16 -39
4566 -39 -24 -18 14 36 29 17 -28 -47 -41 -25 -8 26 28 10 -13 -42 -45 -35 -12 5 26 23 -5 -27 -45 -34 -16 20 31 17 2 -22 -51
4599 -51 -48 -19 4 32 30 5 -10 -36 -29 -10 10 24 33 15 -2 -19 -24 -15 17 35 52 26 2 -16 -29 -26 -10 22 32 27 2 -18 -44 -27
4633 -27 -9 -2 23 33 5 -20 -45 -56 -30 -5 25 19 10 -13 -50 -46 -34 -8 28 30 15 -2 -29 -37 -29 6 26 32 32 2 -28 -43 -26 -11 19
4668 19 26 33 10 -14 -22 -23 -7 21 34 40 15 -6 -32 -24 -21 9 36 36 39 8 -28 -36 -19 6 29 31 29 -4 -21 -27 -33 -7 21 19 21 -11 -15 -37 -41
4707 -41 -16 6 17 25 12 -26 -38 -35 -19 5 28 40 20 -14 -38 -46 -19 8 28 27 28 -2 -26 -18 -31 3 21 46 19 11 -21 -32 -21 -12
4741 -12 15 34 36 18 -18 -35 -24 -2 7 39 44 21 -1 -30 -27 -18 -5 10 30 25 -4 -30 -40 -34 -23 11 27 13 -11 -28 -45 -33 -11 13
4775 13 24 24 -4 -16 -32 -28 -6 1 21 36 12 -10 -28 -38 -15 2 27 41 29 3 -21 -32 -18 7 14 32 26 4 -17 -30 -26 -11 28
4808B8J5j7ok5k2J2%K5K2%j9k5j4pMJ0L9Ok0k5k9J7kK6J9J0Lk8l2J%K1L3nJ2j5
4844A2k1k5J1K4K0%J6k1k6j5oK7J7QJ5j6j5k8JjK6K2Kqj0l6OkJ5M2kqk0k3j2O
4880b5K0J6J4%j3l0j3lJ5K2J4Nj4k4k3%J4OL5pmk2rqrL5K6Llk9j4qJ9J3K4Npk
4918A9l1pj2L3K0J4j1ml4mj1J1K5K8mk1pk7pJ2K1J6%j0rl9pJ5L2OJ7j6rk2j2Q
4954b7QL3Llj4j4k3mK5J3J2Nj2k1j8OK0J6K0O%l8okRJ0K5K8l4j4k3mJ6J4J4J2
4990C8j8j2j2k8RJ1J2K6%j9k4k5pL0J3K1Kj1j6j5mJK6K7j3Qk9j3j2jK6J1L%j2
5025gj3k4J9J3J2J9rj1lk1KOK3J4Lpj1k6jK5QK0jJk5oj4pK0J8K7j8j6j7j6J1N
5062gJ8PLj3l6rJ6jJ8J0J0j6k4j6J4NJ4J5J4j4j3k6nJ5K2J1J4j2k1orJ3OJ4K4
$$ plain form
4808 28 43 26 20 -5 -27 -15 -15 10 32 32 13 -12 -26 -33 -29 -19 20 26 6 -19 -48 -31 -33 -7 12 22 25 -3 -35 -34 -34 -13 20 15 27 12
4844 12 -9 -34 -23 1 21 21 37 16 -10 -25 -31 -4 13 21 36 20 5 -23 -22 -23 3 25 27 19 9 -27 -21 -23 -8 34 32 24 4 -19 -31 -25
4880 -25 -5 11 25 25 12 -18 -31 -34 -19 3 17 22 8 -16 -39 -39 -25 -19 16 9 5 -17 -26 -34 -43 -8 18 21 18 -11 -25 -33 -14 -1 23 28 21 19
4918 19 -12 -19 -31 2 22 36 25 21 -13 -17 -28 -17 8 36 32 11 4 -23 -30 -18 3 19 19 9 0 -39 -46 -31 1 7 24 8 -1 -23 -35 -27
4954 -27 -19 14 17 14 0 -14 -37 -41 -16 -3 9 14 2 -19 -37 -31 -11 5 25 31 31 -7 -13 -15 -6 4 29 57 23 9 -14 -18 -2 12 26 38
4990 38 20 8 -4 -32 -23 -12 0 26 26 7 -17 -42 -49 -19 -6 15 17 6 -10 -25 -29 -28 -2 25 12 20 -9 -22 -34 -35 -9 2 5 5 -7
5025 -7 -20 -44 -25 -12 0 19 10 -1 -4 -25 -23 -17 6 20 23 16 5 -21 -22 3 11 31 30 31 6 0 -14 -21 -1 17 44 26 10 -7 -23 -12 -7
5062 -7 11 18 21 8 -28 -37 -21 -22 -4 6 16 0 -24 -40 -26 -21 -7 8 22 8 -5 -31 -36 -21 1 12 26 14 -7 -13 -22 -9 -3 11 35
5097C5j1k0k0j6J2QJ7K3kj3j0k0lJ6K7J3j1rj5j7njL4kJ1pj7k0nOJ0K7Qoj9k0
5133b2rMJ3J2J3jk7Mk1NPJ8K3Jj7j5j6J0MK0J4J1k6Kl1MLJ7K6mOl3rnQPK2J3n
5172B6pk2j3jJ2K1OmMk7oj0J7J5Plll2qJ2oK7kJ1Ll0k0qJ4J1J5J5lk2jj8JK0j
5211a0L0lqqj5lKK5J8j5Lpk6KJ0RQJ2lj7k1JNJ2J9nLlj1l5J9J5KK1pqk0rj0J3
5251a5J7J2lj4ol2MJ2J3K1Lkk2j8lRJ2K2LQk7k2NlJ9PJ8qj0jpj0J8K1jPoj4j5
5290hmJ0mK7Nk0%l2PQK0NOnj1j8j5nK9J0J3Jrk7%nJ9QOjnk5j3PRQJ4kKj0qk2J1
5333b4J3J5J3j7j8kmj1K9J4J2%j1l4RjJ0J9J6lj6k0j6RJ5RJ4qkk6LpjK0J0Jlj0
5371ck0rRlL0Qpj4qjj3J3J5J0Jj7nnoJ5PJ8rqj5lj1J7J1MJ5rJj7j0J2J5PKJ1k5
$$ plain form
5097 35 24 4 -16 -32 -20 -12 5 28 26 13 3 -17 -20 -4 23 36 25 16 1 -16 -21 -22 12 10 21 14 -3 -23 -28 -22 -12 15 23 17 -2 -22
5133 -22 -31 -27 -14 -2 11 10 -17 -13 -34 -29 -22 -4 19 20 3 -12 -28 -18 -14 6 20 31 5 7 -24 -20 -17 0 26 22 28 -5 -14 -19 -11 -4 18 31 26
5172 26 19 -3 -16 -17 -5 16 22 18 22 -5 -11 -21 -4 11 18 15 12 -20 -28 -16 -22 5 3 14 17 -13 -33 -41 -27 -16 -1 14 11 -11 -12 -30 -29 -9 -10
5211 -10 20 17 9 1 -14 -17 -15 10 28 13 16 9 -17 -15 -5 4 12 24 21 4 -17 -16 -11 1 20 15 18 15 4 -31 -12 3 5 26 19 11 -9 -18 -28 -15
5251 -15 2 14 11 -3 -9 -41 -37 -25 -12 9 12 10 -12 -30 -33 -24 -12 10 13 21 -6 -28 -23 -26 -7 0 18 10 0 -1 -8 -18 0 21 20 27 21 7 -8
5290 -8 -12 -2 -6 21 26 6 6 -26 -19 -11 9 14 20 15 4 -14 -29 -34 -5 5 18 19 10 -17 -17 -22 -3 5 11 10 5 -20 -33 -26 -17 -9 5 3 5 -5 -13 -35 -24
5333 -24 -11 4 17 0 -18 -20 -24 -35 -6 8 20 20 9 -25 -16 -17 -7 12 28 25 9 -11 -27 -18 -3 6 20 12 10 -16 -13 -20 -21 -1 9 10 7 -3
5371 -3 -23 -32 -23 -26 4 12 5 -9 -17 -18 -31 -18 -3 7 8 -9 -14 -19 -25 -10 -3 15 6 -2 -17 -20 -31 -14 -3 1 16 7 8 -9 -19 -7 8 15 17 28 3
5412CrjlJ9PJ5oj8nk9RQK2QKqk7KJpJ1J0Qj0j1j0j6K1PK3kj0j8qPj3K2J8%mj5
5453gj1j2J7rK4Rn%k2j0nJ6RK2%%j5qmNJ4J2Kj0Lk2kOPK2Mjk9mnlJ9RMpj2j8k
5496a9J0OmJ8mmj8mj2J2K1nJ5prj6Qm%K5JKj1k5NjJ9RJ3j3j1kmmK0QJ0J1k2j2
5536Bj3nJ2J4NQmlk0lMJ6Rlnj3nk2J0J9MPnj2j6j2LJ0J6Rkj6oj3KK9LRljk1qo
5579b6QK2jRjj5Nj5lK4LK1j9j0j1krJ7K0Plj3kk1jJ8jK1kj3jpj4J4JJ4J2j5k0
5618ipj4J4KK0Rnj8j4kMJ2NNJ2k0k4J2j0J3K0KOrk6JPJ3JMNRk3j7J8NKRRNk9%
5660cj6OJ1J0K0j1rj0Kj6J1J3Pjpj0oj0J0J6J3lj4j2j6QkJ4NP%j1k0nQJ2PQLj7
5700hj4QK%J3OMj4Lj4J2jJ7Mlrj2Mj8J7LJ3J0j2qj6jNMJ5Qpj4j8J2j0J1J0J1M
$$ plain form
5412 3 -6 -7 -10 9 16 31 25 7 2 -27 -18 -10 12 20 22 14 -13 -11 -10 -17 -6 4 12 2 -9 -19 -35 -14 -7 16 14 4 -14 -22 -15 -28 -6 12 12 8 -7
5453 -7 -18 -30 -13 -22 2 11 6 6 -16 -26 -31 -15 -6 16 16 16 1 -7 -11 -6 8 20 22 12 15 -7 -9 -3 4 26 30 29 0 -4 -9 -12 7 16 20 13 1 -17 -19
5496 -19 -9 -3 -7 11 7 3 -15 -19 -31 -19 2 -3 12 5 -4 -20 -12 -16 -16 9 10 12 1 -24 -19 -20 -1 8 21 8 -3 -5 -9 -13 7 15 25 36 14 2
5536 2 -11 -16 -4 10 15 23 19 16 -4 -7 -3 13 22 19 14 1 -4 -26 -16 3 7 14 9 -3 -19 -31 -28 -18 -2 7 5 -11 -17 -30 -28 1 4 13 10 9 -12 -20 -26
5579 -26 -18 4 3 12 11 -4 1 -14 -17 7 10 31 12 2 -9 -11 -20 -3 17 24 21 8 6 -15 -16 2 1 22 20 7 6 -1 -15 -1 0 14 26 11 -9
5618 -9 -16 -30 -16 -14 6 15 10 -8 -22 -24 -20 -8 -3 2 14 -6 -30 -18 -28 -15 5 7 13 4 -22 -21 -14 -1 0 4 9 18 -5 -22 -4 1 3 12 21 26 -3 -3
5660 -3 -19 -13 -2 8 28 17 8 -2 0 -16 -5 8 15 14 7 -3 -9 -19 -9 7 20 17 3 -9 -25 -17 -19 -5 0 7 7 -4 -24 -29 -21 -9 -2 6 9 -8
5700 -8 -22 -14 -12 -12 1 7 11 -3 0 -14 -2 -3 14 18 15 6 -6 -2 -20 -3 0 13 23 11 3 -13 -14 -9 -5 10 18 11 -3 -21 -9 -19 -8 2 13 17
5740A7k0kj2pLJ2RRj7j3OJ%RQMmrj2MpL3KJkj3j6qJ3NJ1J7mj1j9lJJ6J2JKpql
5784aoNK0kJ5j0k6j3LMMJ2jmJk1nKJ9kJ9j0orj6J2J2J4J0j4j2j3pjRPK4j3%pm
5825a1j0LJ1J4Pj5mk4J0QQJ1Qj2Pj1rJ0J2NlqJ4j4j8K0mQMPnk3j0OJJ1QkNk2j1
5866a8mJ7J6J3k0jj1rJNQ%J3j1Qk0Jp%K2PJ0k0pnrJ3J1J0J5l0jj8J3M%K8r%jj7
5907cj1J3MPJPkk7J5j0jK1kMj3j5qJ7pQLLJk4nkPJ5OOj0onqPRjJ9oj4Mj2NOK6
5952B2Jkk9Nj1%J5J2ljnqjnJ1lJ8kJrlk5J2J6KLj1lonKPJ3Mrqj5KKPLJQjj7np
5999b7JJ9RLoj0j3MJ0kK7nkk2kKlK6lJ3pnj2kMJ3qJ4Kj3j4lMPKJ5jpk4LmlJ7O
6043Ckmj5jnPJ9P%oJj9j3JK7j1J6kj5kj1oJ2K3Mmpoj2LJ3J3LMnj0Pk2MJ1J8lk
$$ plain form
5740 17 -3 -5 -17 -24 -21 -9 0 9 -8 -21 -15 -14 -14 -5 3 7 3 -6 -18 -14 -21 12 14 15 13 0 -16 -24 -11 -6 5 22 18 7 -12 -15 -14 2 14 15 17 10 2 -1
5784 -1 -7 -2 18 16 31 21 -5 -18 -15 -11 -7 5 4 0 1 -20 -25 -23 -4 -6 13 3 -3 -12 -28 -16 -4 10 20 6 -6 -19 -26 -27 -18 -11 13 0 0 -7 -11
5825 -11 -21 -18 -7 7 14 -1 -5 -29 -19 -11 -3 8 16 4 11 0 -9 1 13 18 15 7 21 7 -11 9 5 13 17 24 19 -4 -14 -8 -7 4 12 10 15 -7 -18
5866 -18 -22 -5 11 24 4 3 -8 -17 -16 -11 -3 -3 10 -1 7 -13 -12 -19 -19 3 10 20 0 -7 -12 -21 -8 3 13 28 -2 -3 -21 -8 -4 -4 24 15 15 14 -3
5907 -3 -14 -1 3 10 11 18 16 -11 4 -6 -7 14 12 16 3 -12 -20 -3 -10 -2 1 4 5 -19 -24 -26 -19 -4 2 8 -2 -8 -13 -21 -14 -5 -6 13 7 -7 -3 -15 -10 -4 22
5952 22 23 21 -8 -3 -14 -14 1 13 10 9 4 -4 -5 -10 1 -2 16 14 15 6 3 -22 -10 6 8 11 0 -3 -9 -14 -12 -5 8 12 3 -5 -20 -18 -16 -9 -6 -5 3 2 -15 -20 -27
5999 -27 -26 -7 2 5 -1 -11 -24 -20 -10 -12 15 10 8 -14 -16 -14 -17 9 6 19 12 7 -5 -7 -3 10 2 16 18 5 -9 -12 -8 -1 1 16 15 8 -16 -13 -17 -20 -3 3
6043 3 1 -3 -18 -19 -24 -17 2 9 9 3 4 -15 -28 -27 0 -11 5 3 -12 -14 -25 -31 -19 4 8 4 -3 -9 -21 -18 -5 8 11 15 10 0 7 -15 -11 0 18 15 13
6086A3j3mj0J4OPNj0kj7kkJ6%J4mqj0j4J9qPOLjj7r%J1MQPkk0%j3J9lPkJ0ok3
6129b4JOMJ8JJj4NrMqK1J4pqmk1J8mK3Ljkpj5k0J7NMJ9j0nqj4NRj%KJ0k1kKj0
6173b3J9KMqj1rORkJ5Mj2mLk9RK3MKKoj7pJ2OJ8L%j1j0j1J4J1MJ1j2J1j9jJJ3
6214A4pJ4krj0j7PQKKJ%%j6JPjJ3qpLKn%j3K0LKj3mrJ1kmK6pMj1j4RkJ6kMJrj5
6261a7OkJ6ORpj1j9JLOJ4K1qj9J2j7nJ2jJ1qJ0j4kpnJ7LJ4pj8nJj0QROoJj2kl
6304a9PJJ2KNj3j7K1oJ3%nJqLpJRJ0nlLj8rJ6KJ4J7j3j0j7J2nJ6j2J4j0Qk1J7
6344Fj0OJ2J5j4j5jrj1J9KLNj4lorOJ8%nMj4LpJJ2PJ1nkj3Jj2J4ROjqpNj7pK5
6388@POQk1pjqJ1KOKrJJjJ2%J2j5oppKJ8lQLj5j0oKJjJ4j0Lpj5PQRJ4k1J0nrP
$$ plain form
6086 13 0 -4 -14 0 6 13 18 8 6 -11 -13 -15 1 1 15 11 3 -7 -21 -2 -10 -3 3 6 5 -12 -21 -21 -10 -6 2 9 7 -13 -13 -26 -7 -10 -3 -5 5 -1 -24
6129 -24 -23 -17 -13 5 6 7 -7 -2 -11 -7 -15 6 20 13 5 1 -20 -2 -6 17 20 19 17 10 -5 -25 -8 -3 1 20 10 5 -3 -17 -12 -3 -4 -4 -2 8 -13 -15 -13 -23
6173 -23 -4 -2 2 -6 -17 -26 -20 -11 -13 2 6 -6 -10 -7 -36 -27 -4 0 2 4 -2 -19 -26 -14 -8 10 13 13 2 -8 -19 -5 6 10 21 9 20 1 0 1 14
6214 14 7 21 19 10 0 -17 -10 -2 0 2 3 3 3 -13 -12 -5 -6 7 -1 -8 -5 -3 -8 -8 -21 -1 2 4 -9 -13 -22 -11 -13 -17 9 2 6 -5 -19 -10 -12 4 2 6 7 -2 -17
6261 -17 -11 -13 3 9 18 11 0 -19 -18 -15 -9 5 26 18 -1 11 -6 -11 1 0 11 3 13 -1 -3 -10 -15 2 5 19 12 -6 -11 -10 -20 -12 -3 3 -3 -2 -14 -16 -19
6304 -19 -12 -11 1 3 8 -5 -22 -1 -7 6 6 1 2 -6 -3 -10 -9 0 10 5 2 5 -13 -22 -6 -4 10 27 14 4 -13 -1 -6 10 -2 12 2 10 -11 6
6344 6 -4 2 14 29 15 0 -1 -10 -21 -2 0 3 8 -6 -9 -15 -24 -18 0 0 -5 -1 -15 -12 -19 -18 -6 1 12 7 5 -8 -7 -19 -5 4 10 9 1 -6 -1 -18 -25 0
6388 0 7 13 21 0 -7 -8 -16 -5 -3 3 5 -4 -3 -2 -3 9 9 21 6 0 -7 -14 -12 6 3 11 14 -1 -11 -17 -15 -14 -15 -1 -11 -8 -15 -30 -23 -15 -6 8 -13 -3 -8 -17 -10
6435a0j0QQK4j2lj7oQNJ5J0j1rnpKJ3lQOnj3jJRQmRkj2MonQPMj0pLj2mJ2LOq%
6482akj7QQkJNkrMj0kJ7OkqKk2OjJ1J3MNj3Jj1OPJ1jKojj5J0nJ6km%Kj7J4loQ
6529ELj1%j5QJMQLllpl4L4PO%j9nQoQj2J1PJj2roNKJ6JLNj0qKoRJ3%Lj8KMPmK2
6578B0opLqnMjNRlqqLj8J6OjJoj1qoJ2K0Kjj6pMLQqOJ3j4npNrJ5J8Lj6p%njKJ5
6627ARKj0lolPJ5noQqkokJ4J1j0Qj3mNL%kJJ4j4j6JmjJ3Pql%j3MNKJ1jj2lomR
6675a5LNJ7k0Mj1PMkRJ6qnj6KLJ3%Okokj8J0%PK1lmpk1J0pJ5N%jj0pnJ1J5j7J6
6719A2Mj3j4P%mMJ0Ok6j1OJ1j4QK0j3mPkrMRlPKomj8J2NK4ok0Qk1J4Kj3J6J7%
6761A4j0%m%kK0lnqlnNlJ5Oj5lKpj0NK4jlpj5j5OJ0OOnKj4jnMJ1PMl%j2kJ1qR
$$ plain form
6435 -10 -20 -12 -4 20 8 5 -12 -18 -10 -5 10 20 9 0 -5 -12 -10 3 0 8 14 9 -4 -5 -4 5 13 9 18 16 4 8 2 -3 5 12 16 6 -1 2 -10 -14 -2 1 7 -1 -1
6482 -1 -3 -20 -12 -4 -6 -5 0 -2 -11 -7 -17 -19 -2 4 2 -6 -4 -26 -20 -21 -10 3 7 12 -1 0 -11 -5 2 13 12 14 8 7 -8 2 -3 13 11 7 7 9 -8 6 3 -3 5
6529 5 8 -3 -3 -18 -10 -9 -5 3 6 3 0 -7 -41 -7 0 6 6 -13 -18 -10 -16 -8 -20 -9 -2 -1 -13 -22 -28 -23 -21 -5 -4 -1 4 -6 -14 -12 -18 -9 4 4 7 -11 -9 -5 2 -2 20
6578 20 14 7 10 2 -3 1 0 5 14 11 3 -5 -2 -20 -4 2 1 2 -4 -15 -23 -29 -17 3 5 4 -12 -19 -15 -12 -4 -12 -6 7 -7 -12 -19 -14 -23 -8 10 13 -3 -10 -10 -15 -16 -14 1
6627 1 10 12 2 -1 -7 -10 -3 12 7 1 9 1 -1 -7 -9 5 16 6 14 1 -3 2 5 5 3 4 18 4 -12 -11 -15 -16 -3 4 -4 -7 -7 -20 -16 -11 -9 2 1 -11 -14 -20 -24 -15
6675 -15 -12 -7 10 -10 -6 -17 -10 -6 -8 1 17 9 4 -12 -10 -7 6 6 12 10 4 2 -16 -6 -6 1 22 19 15 8 -13 -3 -10 5 10 10 9 -1 -8 -13 -2 13 -4 12
6719 12 16 3 -11 -4 -4 -8 -4 6 12 -14 -25 -19 -8 -22 -14 6 -7 -11 -4 -6 -15 -11 -2 -5 2 4 -2 -6 -24 -12 -7 17 11 -9 -1 -22 -8 -6 -19 -3 14 14
6761 14 4 4 0 0 -2 18 15 10 2 -1 -6 -1 -4 11 17 2 -1 1 -6 -16 -11 13 12 9 2 -13 -28 -22 -12 -6 0 -5 -3 -17 -18 -23 -19 -8 -1 3 0 0 -12 -14 -3 -11 -2
6808bJ3Qj5p%oJ2RoJ1jj2j7O%J5%PLj3j3MLJJ0JQj5lpKJLJJ1oj1j4J3oJ0J7j5
6851@jj5KK%KQJrknkQJQJ0kqnj4J6lJ3JQj5LppJ8lJ0Lj2Kj4OLJ5J4k2Ok4Rj7K
6897a6ROJ0j4oNj4J1LJ8j2J7kk0Lj1JK0j4Pkj3LqNRJ4omnj5KJ7j0QJ2Jrok0K5
6938ajJ0jKpnkJNJJ2mo%j3N%KQkMj3noJ3MjQj2mkj4P%J7J2Kk1Kj3MNMJjjklnQ
6988hNJ0qOj3qrJ3J3Pjlj1kqJ1J1J3lOj4Kj1qJ4nJ9j0Jj7LJ4kkJ1qlj5%oJ0JL
7031bLqlPj9J1QNKnJp%%JJ9jLj3j6QlLJ2qJRj6JMLMkMrJ1kj7J2kJ3Lj4jLoJnJ1
7080DJ5rpj0NnLNJ4j0kj0mL%MLnPorqJ6LQ%%j3%mJQJ5oJ5j0j4oPkPJ6mlk0mJ1
7127aJ4qJ3pMj5J%QkOm%k%j3J8mMnlJ0k3OknJ4pNKmj3%j0K1oKJ4k0j2J3J%J1%
$$ plain form
6808 -2 11 19 4 -3 -3 -9 3 12 6 17 16 4 -13 -7 -7 8 8 15 18 5 -8 -4 -1 0 10 11 19 4 1 -6 -4 -3 0 1 12 6 -5 -19 -6 -12 -2 15 0
6851 0 -1 -16 -14 -12 -12 -10 -2 -1 -10 -12 -17 -19 -11 -10 -2 8 6 -2 -7 -21 -5 -8 5 6 14 -1 2 -5 -12 6 3 13 16 4 6 -8 -2 1 16 30 8 14 -10 -1 -18 -16
6897 -16 -7 -1 9 -5 -11 -6 -20 -9 -6 12 0 17 15 -5 -2 -13 -12 8 -6 1 -1 -14 -11 -19 -14 -5 9 3 -1 -6 -21 -19 -2 -12 -4 8 9 0 -6 -26 -1
6938 -1 -2 8 7 9 2 -3 -5 -4 1 2 14 10 4 4 -9 -4 -4 -2 6 4 8 -5 -10 -16 -3 1 0 8 -4 -8 -10 -24 -17 -17 0 12 14 -7 -5 -18 -14 -9 -5 -4 -5 -6 -8 -11 -16 -8
6988 -8 -3 7 -1 5 -8 -16 -25 -12 1 8 7 4 -7 -9 -17 -6 5 18 15 21 7 9 -2 -10 4 -1 18 8 9 -8 -5 9 7 5 16 8 5 -10 -10 -16 -6 -5 -2
7031 -2 1 -7 -10 -3 -22 -11 -3 2 4 -1 0 -7 -7 -7 -6 13 12 15 2 -14 -6 -9 -6 6 -2 -1 8 -8 -7 -3 0 4 2 6 -3 8 6 -11 1 -1 12 15 1 0 3 -3 -2 -7 4
7080 4 19 10 3 -7 -2 -7 -4 1 15 5 3 -7 -11 -8 -8 -4 -1 -6 1 -5 -14 -22 -6 -3 5 5 5 -8 -8 -12 -11 -3 12 6 21 11 -3 -9 -2 -4 3 19 15 12 -8 -12 -1
7127 -1 13 5 18 11 15 0 1 1 9 7 13 9 9 7 7 -6 12 8 12 7 4 14 -9 -3 -5 -10 4 -3 2 4 0 -13 -13 -23 -2 -8 -6 8 -12 -24 -11 -10 -10 1 1
7172AJj8kJ0nJ3N%pMlj0J5OJKkpJnrJ6MJ3j6MpnJrJ8J1oonj6LLLQQj4lrnPJ2N
7220FqMNj0j2kQQORmk5Mj0K0n%MN%oL%%J1J5qj4ojlJ5rJ2KRk0kqJ2PKrKoqOjN
7269CKjJj0lqNMJ9j3%k1jQLLQQpOj7mQj0K3kj%lj0oJ8KOOj0%p%KOJJ0kLj6mJ2
7317A1kK0oj7Qj4MMjROk7PPj9LMKOJ6k5jj2MJJ4Oj2J4pj1mJqK4Qk0KqljQJ1qO
7362@qlKM%J5MKoj8J1jMJ1jJ0oj0Kj2OJJ2mj0Mj8MmJ9JkRj8ljqJ4MJplj1Mo%J3
7409cK0pMj5mNj2J0PnjjLlLmRJNj1%jKKJ6LoMl2KJ5Lj4K6j1Lkj3RkJ0Lj1Jj3l
7455hqJ3KLJ4j7qOLj0LOOKj4j4J3kLKJ1KrLkj1NJ2lNQj2j0j0J3KjJ3Qj8kmLoJ7
7500IJ0o%j8JjJ3J%MnomKJORKj6pjmkKJ5J2j8mj2rLQJ5NJj4JqJ2KpJ0LlpNj9K0
$$ plain form
7172 1 2 -16 -18 -8 -13 0 5 5 -2 2 -1 -11 4 10 11 13 11 4 5 0 -9 7 11 24 8 12 5 0 1 -8 10 21 15 9 4 -12 -9 -6 -3 5 13 -1 -4 -13 -18 -11 1 6
7220 6 -2 2 7 -3 -15 -17 -9 -1 5 14 10 -15 -11 -21 -1 -6 -6 -2 3 3 -3 0 0 0 11 26 18 4 -2 -3 -6 9 0 12 14 23 3 1 -7 5 12 14 5 7 1 -7 -1 -2 3
7269 3 5 4 5 -5 -8 -16 -11 -7 12 -1 -1 -22 -23 -15 -12 -9 -1 7 0 6 -11 -15 -7 -17 6 4 3 3 0 -10 -16 2 4 10 16 6 6 -1 -1 1 7 8 18 16 19 3 -1 11
7317 11 9 29 23 6 14 0 4 8 7 16 22 -5 2 9 -10 -7 -3 -1 5 21 -4 -5 -17 -13 -12 2 8 -4 10 3 -8 -12 -11 -19 5 13 -7 -5 -13 -16 -17 -9 2 -6 0
7362 0 -8 -11 -9 -5 -5 10 14 16 10 -8 3 2 6 17 16 26 20 10 12 0 6 7 19 15 5 9 -9 -5 -9 10 11 9 18 0 -3 -4 -12 2 6 7 0 -3 -14 -10 -16 -16 -3
7409 -3 17 10 14 -1 -5 0 -12 -2 5 0 -1 -2 1 -2 1 -3 6 7 12 1 1 0 2 4 20 23 17 21 -11 -9 6 9 -5 21 10 13 11 -2 7 5 15 18 7 8 -5 -8
7455 -8 -16 -3 -1 2 16 -1 -9 -3 0 -10 -7 -1 5 7 -7 -21 -8 -10 -7 -5 6 8 -1 2 0 -11 -6 6 3 8 16 4 -6 -16 -3 -1 -2 11 19 1 -1 -5 -2 -8 9
7500 9 19 13 13 -5 -4 -5 8 9 9 13 8 2 -2 0 1 7 16 18 2 -5 -6 -10 -12 -10 5 17 -1 -5 -17 -26 -23 -15 0 5 6 -8 -7 -15 -3 -1 -8 2 5 2 -5 0 -19 1
7548AK3j6%Pk2krPK3mRj8Lj2J0Mj%OkKqkJ%QPqnJqjMMLMj4qJ2pMMKJMk1Lj6RN
7598a3K5nj0Nj7lJ2J5j2J9j0kNj2OkJ3LKkooj9J2QJ0jmj5Qj3LOJ3pLj1j1QPpN
7640@NRj6Pj4NJ0qQMmmj7nJ6mJ8j2KmqnNQMkKPoj1OkJ5J0j3QoqLlOQkJ1j8mMk
7688CpJ3Onkj7mlJ7kQjJ0j5j0J6j5NJ1koj2NqPPM%rMj0JnJ3J0oQj2NrkJ0J3pJ0
7733A7j4j1JLRJJ5orJ6k3P%J0rJ0Jk4J0ojQKLRj7kpKlJ1J2qJj6k%NRmQj1nqLM
7779iJ4JKojj0%J0j8K3lMqj1JPjJ1Qkj0j4QJ0kNQMnj0pP%QONj9jjj0QoK1lp%j2
7826ePlj1J3J0oj8Pj0%J1J5kjj2mj1J2OKPkLj0j0RlJ2j0MJ0rj7MK1mJ0mjjj1q
7868a0NJ1J2j3J7nj0j0MKLJ5%k1Pj4%MNJ0Nj6nj2Q%oJ5LJ1k7JMqQRMkqo%jpK7
$$ plain form
7548 1 24 8 8 15 -7 -9 -18 -11 12 8 17 -1 2 -10 0 4 3 3 9 7 9 1 -1 0 0 8 15 7 2 3 -5 -6 -2 2 5 9 -5 -13 -1 -8 -4 0 2 3 7 -14 -11 -27 -18 -13
7598 -13 12 7 -3 2 -15 -18 -6 9 -3 16 6 4 9 -3 3 1 14 17 19 17 11 5 -14 -2 6 16 15 11 -4 4 -9 -6 0 13 6 9 -2 -13 -5 2 -5 0
7640 0 5 14 -2 5 -9 -4 6 -2 6 10 6 2 -15 -20 -4 -8 10 -2 0 -4 -12 -17 -12 -4 0 -2 0 7 1 -10 -4 -6 9 19 6 14 8 0 3 0 6 14 12 23 5 1 5 3
7688 3 -4 9 15 10 8 -9 -13 -16 1 -1 7 6 16 1 -9 7 -8 -3 8 6 0 -12 -7 -15 -8 -1 3 3 -6 -2 -12 -11 -16 -3 7 1 9 -3 2 -7 -9 1 14 7 17
7733 17 3 -8 -7 -4 5 6 21 15 6 22 -1 6 6 16 7 17 18 -6 4 -2 -3 5 7 10 19 2 0 -7 -5 -8 3 15 7 8 -8 -10 -10 -5 4 0 8 -3 -8 -16 -13 -9
7779 -9 5 6 8 2 1 -9 -9 1 -17 6 3 7 -1 -12 -11 -4 -5 6 14 12 2 -12 -4 6 4 9 17 21 16 6 -1 6 6 14 20 25 6 5 4 -6 2 -4 17 14 7 7 -5
7826 -5 2 -1 -12 1 11 5 -13 -6 -16 -16 -5 10 8 7 -5 -9 -20 -8 -2 0 7 5 8 -2 -12 -3 -6 6 -4 0 10 1 -16 -12 9 5 15 11 10 9 -2 -10
7868 -10 -5 6 18 5 22 17 7 -3 1 3 6 21 21 0 7 -7 -7 -3 2 12 17 1 -4 -16 -8 -8 -14 1 4 15 -12 -11 -7 -15 -7 2 6 4 -4 -10 -10 -11 -18 9
7912InMkj5lJOJ7KnOj2j2oJ5KJ1joj2jkKQJ8jpj0j5J6JJ0okNrqkqJ5nKRj5%pl
7959b1J5kJ3oLj0mMj2K5MJoLk2J4%NJO%Kj5J4j4J3j4J1OlqLj3MQkJ6j8Jj4J6m
8001@JNNmlkj4MJ3RpMj2j2pOJ1OKr%j0lQmJ1J4rqkNj4J0KRKj0J0j8LRjJ1J0pj4
8047@nLnQJ0PmOk2lnKJ9NQpj5j1J0lJ1rPKploKlK4kj4Kj2qRNpJ1JqNnmJRpjJ3
8096Dkj2j0J3%K1Orrl%J2jKQlj3JroJ2KJ4j6Pjk4J5JPJOpk0PLnPJ1j7QOj6kJ4
8141CjjNMj1%k1oK6j7K4Nqj4Lj3J3MQl%KrJ1oJ0%Nj0J1j5kK1pmK3j2nj3jNkJ8
8184B0j2N%qj8RK
$$ plain form
7912 9 4 8 6 -9 -12 -11 -5 12 14 9 15 3 -9 -15 0 2 13 12 6 -6 -7 -9 -7 1 19 18 11 1 -14 2 3 13 7 5 10 1 -7 -9 -17 -2 -7 -5 4 -11 -11 -18 -21
7959 -21 -6 -8 5 -1 2 -8 -12 -8 -20 5 9 10 4 7 -15 -1 -1 4 5 11 11 13 -2 12 -2 11 -3 8 14 11 3 6 -7 -3 5 3 19 1 2 -12 4 0
8001 0 1 6 11 7 4 2 -12 -8 5 14 7 11 -1 -13 -20 -14 -3 3 5 -4 -4 -14 -17 -9 -13 -2 12 3 -5 -7 -2 -16 -6 -4 5 7 -3 7 -11 -8 1 0 11 21 14 0
8047 0 -5 -2 -7 1 11 18 14 20 -2 -5 -10 -8 11 16 24 17 2 -9 1 -2 9 0 7 9 2 -1 -7 -5 -8 16 14 0 2 -10 -18 -9 -4 -11 0 1 -7 -2 -7 -11 -10 -1 -8 -9 4
8096 4 2 -10 -20 -7 -7 14 20 11 2 -1 -1 11 10 12 20 17 4 5 -4 -10 2 4 18 2 9 8 -16 -1 0 7 8 14 7 -13 -6 -3 -8 -1 10 -7 1 7 -9 -11 3
8141 3 2 1 6 10 -1 -1 -22 -28 -2 -19 5 10 2 -12 -9 -22 -9 -5 3 0 0 2 -7 4 -2 8 8 13 3 14 -1 -3 18 11 7 30 18 13 0 -1 4 2 20
8184 20 8 13 13 5 -13 -4 -2
8191b
$$ Imaginary data points
##PAGE= N=2
##DATA TABLE= (X++(I..I)), XYDATA
0@%%%%%%%%%%%%%%%%%%%%%%%%%%jNj0J4j6J6j6J6j6J7j8K1k7L1l3L4l7M3m8N3
46B8n9O6p2Q2r2J00j15J36j60J92k36L03m24O97k515M17M606l33j706r29N03j299
68h10j757K24K790J797l22j039k99j043j882o22K314K942O97j556j586r04o74
85a730k13J247J941Q38o32p90o37j242j414N11K770K340m66k172j391j88k28j37
103a593J191K096Q85j191j857r50j89P8P85J747J424l46j896j746n08N41J133
120c96J299Q80q9r91j303j042l86P58J825J647L7j529j640o05J35L94Q56J411
138A261R34n75j792j485k32O80J097J218Q97k14j530j729n81P62J252R78N10j0
156A441o72j244j200l13R59J717J319k2j267j607q65J94Q71J057Q79L52m72j174
$$ plain form
0 0 0 0 0 0 0 0 0 0 0 0 0 0 0 0 0 0 0 0 0 0 0 0 0 0 0 0 -1 4 -6 8 -8 8 -8 8 -8 9 -9 12 -15 16 -17 17 -20 23 -25 28
46 28 -31 35 -37 45 -47 53 -62 74 -86 106 -130 173 -251 446 -2069 -1652 2954 2621 915 -14 489 -810
68 -810 -2567 -2343 447 2244 1922 883 584 -459 -2341 -2963 -649 2293 2990 1434 -152 -1056 -1730
85 -1730 -1943 -696 1245 2083 1451 661 24 -1218 -2632 -2121 649 2989 2523 351 -1040 -1228 -1456 -1593
103 -1593 -402 1694 2579 1388 -469 -1419 -1608 -1530 -745 1002 2426 2080 184 -1562 -2070 -1529 -396
120 -396 903 1783 1694 703 -600 -1642 -2028 -1270 555 2202 2239 710 -930 -1535 -1400 -1006 -150 1261
138 1261 2195 1620 -172 -1657 -1889 -1209 -112 1106 2003 1789 259 -1470 -2051 -1289 -37 941 1451 1441
156 1441 769 -475 -1675 -1988 -1029 688 2007 1985 718 -889 -1754 -1560 -689 368 1247 1599 1127 -47
174d7j215n38M43J221J375P14m44j413j467n86O17J344J202L96m12r08r24o80
192a322j64O15J325J283K24j118j664r74K02J004J118Q50J98o55j222j024k19
209a543N84J017R97N66k45j181j427o71N79J358J191L68m45r66j021o15J30Q22
227e02J145Q48L8q69j293r41j3R25J257Q52K1p42j128q88j83N84J068R85L77m51
247A090j096j138m77M73J137J132M41m17j026j030n21K13Q85J066O93m7q32j207
265f61q25N4Q78J188P79k8p60j065q17j36O08J026R12K94m90j056j034l94M84
284a043J085J038M02m40j004r81m49K87Q57R92O30j45q20j081p17N6Q16J134P52
303A369m3p83j071p30k5O31R73Q03K24m94j010r41l19N06J014R50L69m23r76r79
$$ plain form
174 -47 -1262 -1800 -1357 -136 1239 1953 1509 96 -1371 -1957 -1340 4 1206 1602 1190 282 -642 -1322
192 -1322 -1486 -871 454 1737 1961 843 -821 -1795 -1593 -589 529 1379 1577 922 -300 -1324 -1543
209 -1543 -959 58 1055 1621 1376 195 -1232 -1903 -1324 34 1225 1593 1148 182 -839 -1454 -1324 -502
227 -502 643 1491 1529 660 -633 -1574 -1587 -662 595 1447 1468 726 -402 -1290 -1473 -889 179 1164 1541 1090
247 1090 -6 -1144 -1621 -1148 -11 1121 1562 1145 119 -911 -1432 -1219 -334 732 1425 1378 546 -661
265 -661 -1486 -1432 -554 634 1413 1385 625 -440 -1257 -1393 -785 241 1153 1447 957 -99 -1133 -1527 -1043
284 -1043 42 1080 1482 1042 38 -943 -1392 -1105 -248 744 1374 1229 409 -672 -1389 -1333 -517 617 1369
303 1369 1326 543 -528 -1258 -1283 -652 321 1124 1348 854 -156 -1097 -1416 -910 104 1054 1423 1000 24 -955
323i55m10L55Q81R30N06j88p89r98o45R0P96J047O93o9p57j014p10j3O65R59P54
344A128J40n61r51q19k49M84R49R01L23m34r48r22l52L68Q58R04M56k36q08r53
364g22n35J52P71R58N99p7o98r68o65rO66R47P19Q3n68r35p73j78N09R33P81K63
386A253m23q82q61l38L75Q30Q70L98k60p85r12m93J85P85R20N25j18p03r12n95
406a141L3O28R12O58N0n70q90p19j36N05R01P59K07m55q70p86k78M07Q10P86L58
427A169k77p74q38m43K00P51Q89M80j44p20q51n54P0O37Q84N98mn86q53o41j07
448a114N15Q60O98J86m73q56p26k26L95P95P58L30l09p82q18l77K93P19P75M31
468A074j42o58q32n34J09O42Q29N37on50q44o26p0N41Q22O75J07m48q33o83j71
$$ plain form
323 -955 -1365 -1010 -129 801 1307 1119 330 -668 -1313 -1223 -427 620 1313 1244 487 -527 -1237 -1250 -585 374 1128
344 1128 1268 707 -244 -1063 -1312 -828 121 1022 1345 911 -37 -959 -1311 -943 -85 819 1275 1039 231 -722
364 -722 -1257 -1105 -334 624 1223 1146 448 -520 -1185 -1194 -528 419 1138 1221 653 -282 -1055 -1233 -724 209 990 1253
386 1253 830 -52 -913 -1251 -876 -46 824 1222 962 177 -735 -1228 -1043 -258 662 1187 1069 366 -546 -1141
406 -1141 -1108 -480 432 1090 1140 570 -320 -1039 -1175 -670 231 990 1197 742 -128 -914 -1192 -785 25 811 1169
427 1169 892 118 -720 -1163 -963 -212 677 1157 1013 293 -558 -1112 -1042 -405 479 1077 1073 487 -366 -1007 -1114
448 -1114 -599 261 959 1145 672 -184 -910 -1136 -741 54 812 1142 833 51 -767 -1144 -851 -132 643 1074
468 1074 932 274 -558 -1092 -983 -341 488 1025 1019 469 -375 -1001 -1071 -530 292 967 1074 626 -207 -890 -1061
489a061M19P36O70L06k61p54q22l88L36P73P39L32j85o05p91n17J14O89Q33M55
509A018j12n39p22n64j03N07Q32O61P4n15q00o20j50M35P48O59K01l14p02p30
529g36l48K97P59P24L00k34n95p03m98O4O91Q89M61k15o33o60m24l7M34P52O39
550I27J04n27p80o01q8M02P09O40K28l29p48p11k52L19P53O58K46k46n84o50m11
571i41N6O09Q39M80j49o62p40m10Q9M75O95N42P5m78p86n67n8M59O71N53J78k94
593F36o81p05l08L43Q06O90J63l59n61n49l51N5N74Q09M63j97o61o74l55M6M73
614c43O87N46L5n19p65m97j5M29O66N52J45l62o71o18k14K83P16O85K21l36o56
635c1n72k43J43N07O89M70j15o61p42l60J51N19O16M57L5m71p22n30%M53O45N19
$$ plain form
489 -1061 -642 94 764 1070 809 55 -767 -1155 -819 -46 693 1025 840 235 -556 -1073 -959 -270 563 1018
509 1018 906 367 -355 -919 -1022 -515 317 978 1052 537 -263 -883 -1033 -598 150 809 1010 696 -6 -736
529 -736 -1084 -787 -28 696 996 762 167 -536 -1034 -970 -279 610 1071 856 223 -437 -861 -898 -464 288 927
550 927 1031 504 -276 -877 -965 -563 146 786 1014 685 -63 -774 -1026 -707 46 704 950 704 120 -530 -941
571 -941 -885 -276 563 1043 894 232 -508 -918 -829 -354 341 883 958 480 -306 -873 -931 -472 199 752 930 636
593 636 -45 -750 -1058 -715 91 781 944 585 24 -525 -876 -821 -247 562 1025 828 167 -507 -862 -816 -343
614 -343 344 890 925 406 -359 -856 -871 -442 224 776 921 559 -112 -730 -944 -661 55 740 961 625 -31
635 -31 -603 -846 -703 -196 493 963 848 187 -555 -915 -764 -245 371 828 863 392 -330 -860 -860 -407 238 757
657G57J11l53o50o06k02L41P05O43J71l60o24n43k12J78N11O39M08j22o20p13
677e41l50J36N45O43M33n0n25o79m10K8M32N93M98R3l59o65n63j46L44O69O11
698G37J86l58o82n40j60K54N15N44L43j24n75o52l49J27N13O62M36p7n68o92l50
719h10R1M37N37M50J16l78o87n09n6L62N69N40K43l02p17o24j18L87N28M42K56
740G57p8n20o81l52K06N57N40L60Mm81p38m67J65N77N21K84M3k57n93n85j47M72
762d13O62M19P5k36n32o17k96L66P19M95R2k34m15n11l85R0N84O50L07j52m63
783B05n91m22N2N34O44L30r2l68m75m68j55L49O83N03M3l63n22m98k05K48O63
804I5N83J11l15n03m21k74R7M77O51L38j53n56n71l17P8M78O08L75j05m52n07
$$ plain form
657 757 868 515 -135 -741 -943 -602 103 746 917 557 -67 -610 -822 -644 -133 506 914 792 172 -541
677 -541 -891 -755 -210 433 866 816 291 -388 -798 -770 -338 255 753 846 487 -178 -741 -887 -543 126 737
698 737 923 565 -117 -657 -817 -563 -48 496 839 715 140 -512 -861 -734 -221 441 877 800 232 -460 -810
719 -810 -719 -282 255 705 821 443 -244 -753 -809 -447 122 662 905 603 -114 -738 -856 -469 59 501 757
740 757 679 159 -522 -874 -668 -111 429 789 793 312 -426 -893 -728 -151 370 654 697 440 -153 -738 -885 -413
762 -413 249 668 743 507 -25 -642 -938 -572 147 642 734 500 85 -426 -811 -721 -137 513 820 668 205
783 205 -386 -808 -756 -222 422 752 660 292 -183 -651 -806 -457 226 729 772 409 -113 -611 -816 -568 95
804 95 678 789 474 -29 -450 -724 -627 -150 501 839 686 130 -441 -758 -680 -202 406 781 676 224 -283
825b83l48p9L08N90N32P8m10n87m40j19K80N58N45J75l36n65m51j43J66M39N28
846D38L39j10n44o16k87J51M87N54L23o2m64n55l46L3L73N19M20Q0l38n79m87
867f71q2L41N76M68J18l00n26m88j53K44M80M68K46j39m77n49l04J39M90N54L02
888G37r7m71n22l25L5M05N16L64K8l20n52m42r9L40N88M42Q1l12n05m24j82K31
910d84N12M90K09k12m71m81k61R9M64N54L39j50m67n18k95P5L98M92L55J4l64
931B98n18m01o0L17N43M54Q4l41n13m18j07K24M68M72K37k25n21m72j92J57M01
952a13M95L26q8m73n66k92J43M10M55L00Pl23n14m07m3L76N08M01N7l09n02m08
974e60j10K51M93M50J66k19m88m80j77J99M31M63K49q7m48n24l04J17M53M74K77
$$ plain form
825 -283 -631 -710 -402 188 720 798 388 -199 -639 -758 -478 80 625 800 464 -101 -552 -695 -529 -90 438
846 438 777 667 123 -493 -780 -629 -142 412 735 673 209 -346 -692 -659 -286 233 653 733 395 -184 -671
867 -671 -753 -412 164 632 750 450 -76 -564 -717 -473 7 475 721 582 105 -444 -748 -609 -119 435 737
888 737 640 169 -353 -678 -643 -238 278 642 670 350 -202 -644 -743 -403 185 627 708 396 -109 -533 -715 -484
910 -484 28 518 727 515 44 -437 -698 -599 -135 419 758 608 141 -377 -672 -597 -199 293 648 662 298
931 298 -220 -621 -681 -364 179 633 717 376 -137 -555 -662 -438 30 502 739 514 -7 -479 -671 -514 -113
952 -113 382 708 620 147 -419 -711 -568 -158 297 597 604 281 -233 -640 -683 -307 201 602 659 350 -152 -560
974 -560 -670 -419 74 524 690 471 -17 -497 -674 -475 -44 419 668 581 133 -391 -695 -578 -125 349 626
995F26o8l39m63l59n1L60N28L99K5l70m79l40q6K44M52M57J48k59m91m38j60K16
1017d48M24M39K50j44m62m70k58J25M42M59K54o6l66m65l23rL54M98L86K2l55
1038B87m99l52m1K73M46M09J39k43m85m42j23K14M46M21K00j62m32m58k46J48
1058e00M21M62K47r9l71m66k90K7L50M82L29J1l46m80l55j3K93M52L70R5k34m82
1080i7m15j27K55M48L93J58j69m23m38k32J74M30M22K18r5l65m34l07M9L80M72
1101B97L04l9l57m38l27j9L13M62L48L7k74m06l75j35K21M57M17J39k28m11m13
1122d27j68J63L99M35K20j66l88m07k31O0L59M39K96l4l53m68k82oL26M35L27
1143E29L8l03m37l26o7K36M19L77J43k16m41l99j47J90M12L92K06j48m08m27j90
$$ plain form
995 626 558 219 -244 -603 -654 -294 234 633 658 288 -191 -531 -617 -373 79 536 684 425 -66 -504 -664 -448
1017 -448 -24 415 665 521 59 -411 -669 -544 -102 357 611 545 179 -286 -609 -618 -264 234 620 642 287
1038 287 -212 -564 -605 -332 114 523 662 419 -66 -508 -631 -417 29 450 650 488 56 -402 -648 -500
1058 -500 -79 383 630 531 160 -306 -596 -569 -219 263 592 603 257 -223 -578 -591 -298 154 524 619 385 -97
1080 -97 -512 -639 -384 64 457 615 446 23 -415 -647 -473 -43 379 597 502 137 -297 -604 -555 -175 297
1101 297 601 562 205 -233 -560 -579 -266 196 544 581 307 -99 -474 -609 -388 69 486 625 397 -14 -427
1122 -427 -595 -432 -33 402 622 456 68 -339 -570 -510 -151 288 584 550 197 -271 -553 -559 -233 202 529
1143 529 567 264 -173 -499 -566 -330 89 466 609 393 -48 -447 -594 -404 8 400 606 458 50 -377 -567
1164e67J15L46M10K52l1l46m60k82N6L25M03L02L5k85m59l24k4K57L97L46J16
1185E82j94m57l92j24K37M06L39J47j15l78m22k30J58L94L72J96m6l11m35l04
1205e77M6M00M17K33m4k56l77l37n3K87M33L12M5k15l87l68j33K11M45L67J06
1226E55j83l67l74j93J51L85L90J60r9l09l78k78K2L77M53K57r3l28l42k59o4
1247e17K68M45L34j0k82l61k79j14J72M01L94J15k14m04l38j44J55L79L82J64
1267E46j65l28l49j95L1K97M37K89q4l58l88k08J4K32L88L45N9l22m46k56OK07
1289b48L16L20J63j87m13l79j25K27L83L16J34j25l38l54k24J10L41L82K38r4
1309D43l33l64k25M7K57L75K88J4k92m12k74pK68L38K93Q2j90l83l50j13K01M01
$$ plain form
1164 -567 -452 -106 304 556 525 179 -281 -563 -507 -182 221 523 558 273 -186 -510 -534 -277 120 466 582
1185 582 388 -69 -461 -585 -348 58 397 544 429 51 -371 -601 -443 -49 323 519 473 162 -273 -577
1205 -577 -531 -131 286 519 475 219 -158 -495 -548 -261 172 484 529 314 -73 -441 -574 -363 82 449 555
1226 555 372 5 -369 -562 -411 -26 364 524 425 116 -262 -540 -518 -141 312 569 476 148 -194 -453 -517
1247 -517 -249 196 530 520 238 -123 -402 -516 -344 57 451 566 352 -52 -390 -534 -379 0 382 546
1267 546 381 53 -296 -491 -460 -163 274 563 479 121 -267 -475 -461 -229 159 504 563 241 -205 -461 -455 -248
1289 -248 68 388 551 364 -49 -428 -553 -326 57 373 507 382 44 -310 -534 -424 -83 299 537 443
1309 443 110 -254 -479 -432 -175 200 488 502 210 -202 -476 -483 -215 123 416 498 308 -75 -425 -538 -337 64
1331F4L49R5j86l29l24j54Q3L18L98K22j23l47l75j62P8K56L40K89Rl00m28k60
1353d87L8K69L40K50N8k04l42l38j09K23L88L37Q7k01l47k92j35J21K99L55K08
1374E18j15l43l66j55R4K64L14K55Rk95m11k65N1K84L43K30L5j97l53l13q9K20
1396b85L76L03P9j81l48l13j21J75L04L28J58j01l15l69j73J11L07L21J88j3k72
1417A59l65k62L0K95L54K25l4k13l01k68r8K17L54L14O5k02l46k96q5J55L24L29
1439C51J22j44l31l04j54J17K80L36J81o3k69l68k13M9K81L46K13j8k59l07k55
1460d09rJ97L28K76P0j82l66k85p2J86L26K90J14j58k96l17j30J10K96L21J65
1481D55r3k63l34k02M7K78L58J92m4k39l29k30%K12L38K52K5j92l25k71o9J79
$$ plain form
1331 64 413 508 322 -7 -331 -485 -402 -84 314 536 413 66 -309 -471 -393 -137 203 492 501 201 -227 -487
1353 -487 -449 -180 160 410 468 264 -78 -416 -525 -302 86 423 510 309 -38 -330 -465 -344 -45 310 518
1374 518 403 60 -306 -461 -367 -103 211 466 475 180 -231 -496 -445 -161 182 412 447 250 -103 -416 -505 -285
1396 -285 91 394 473 292 -56 -369 -490 -315 -11 317 475 374 59 -310 -483 -372 -65 256 444 431 159
1417 159 -206 -468 -438 -143 211 436 402 189 -112 -380 -478 -261 93 407 472 270 -76 -372 -457 -302 22 351
1439 351 473 329 -2 -306 -460 -343 -63 273 454 391 122 -246 -459 -410 -129 217 430 412 153 -154 -409
1460 -409 -418 -221 107 383 453 271 -95 -380 -452 -266 60 350 464 306 10 -307 -437 -327 -31 290 455
1481 455 362 99 -235 -437 -390 -112 246 438 394 155 -174 -404 -404 -192 146 398 423 231 -94 -365 -434 -255
1503b55L31K78R5j77l05k89j11J13K89L19J43q2k90l26j85R1K61L16K07m7k57
1524A19l19k20K9K42L02K29K0j86l17k78n9K04L29K62N5j54k99k91q8J36K99K84
1546B99J42j13k72l10j77R1K82L01J78n7k53l15k08K9K49L01K08Qj99k92k50o6
1568d24K01L18K69L4j73k81k73j08J56L07K77R6j17k61k86j42P0K76L40J42q5
1589C36k58k95j86L2K31L31K06k7k34k88j95l0J63L22K54N3j95l06k23p5J47K78
1611D1K64J17j44l01k58j07J12K29L05J64q5k83k98j37O1K25K82J86k4k26l08
1632a85j86J0J97K86K21K9j82l07k40k5J62K80K45Q6j47k68k58j05J11K64K71
1653B59J41q8k65k91j39R1K36K75J54k9k12k99k01J3K32K71K02J8j86k67k58l3
$$ plain form
1503 -255 76 354 449 272 -33 -322 -433 -320 -31 288 431 349 59 -267 -452 -361 -100 216 423 376 119
1524 119 -200 -420 -391 -149 153 382 402 216 -101 -379 -438 -234 95 357 412 258 -41 -332 -420 -284 15 299
1546 299 441 328 56 -254 -431 -340 -58 243 421 364 111 -204 -412 -383 -134 167 375 383 184 -108 -358 -424
1568 -424 -223 95 364 398 225 -56 -329 -437 -281 26 303 399 282 21 -265 -407 -337 -61 279 421 336
1589 336 78 -217 -403 -371 -140 191 397 370 136 -152 -347 -377 -214 108 362 415 220 -86 -309 -384 -237 41
1611 41 305 422 278 -23 -281 -388 -276 -47 258 422 337 54 -244 -381 -320 -95 187 373 349 123 -185
1632 -185 -371 -361 -164 122 343 372 190 -117 -357 -382 -220 60 305 391 244 -24 -282 -387 -276 -12 259
1653 259 400 312 47 -244 -383 -292 -56 219 373 344 132 -167 -368 -355 -123 148 350 368 182 -85 -343 -376
1675c76J92K86K24N7j56k61k38j08J25K54K72J13r3k58k80j29P2K42K82J51p1
1696C00k00k81j92K6K07L00J88qk06k60k03l2J79K64K44M4j62k74k21o2J29K36
1718A6K53J20j13k72k64j06J03K43K37J35m8k26k69j51L1K23K59J72j4j86k91
1739a48j91%J77K77K05K3j67k46k18o1J34K70K15R4j08k65k60j09J33K37K41J18
1761C51r1k03k56j52M5K21K69J53l6j89k45j91j9J98K93J94j1j76k57j76m4J26
1783a96K69K13P0j25k49k43q2J09K35K41J15j08k16k58j06N8K19K49J41n1k04
1804H1k37j75JJ90K83J85Mj97k59j60k2J30K40J93Q8j33k62k29n2J16K25K22J03
1827C35q8k27k59j05Q5K12K45J23n7j99k31j52RJ92K68J87j8k00k53j72K1J54
$$ plain form
1675 -376 -184 102 326 383 227 -34 -272 -380 -255 -1 271 384 291 33 -247 -376 -304 -62 220 371 300
1696 300 100 -181 -373 -347 -140 160 348 340 134 -126 -329 -361 -182 82 326 370 208 -66 -287 -349 -220 16
1718 16 269 389 276 4 -260 -366 -263 -20 217 352 304 78 -191 -342 -311 -88 171 343 329 143 -148
1739 -148 -339 -339 -162 115 320 343 176 -70 -288 -349 -215 55 270 364 256 -9 -269 -378 -245 -8 233 351
1761 351 260 57 -199 -351 -306 -85 184 337 301 112 -133 -324 -343 -145 148 342 331 155 -102 -278 -322 -196
1783 -196 73 286 356 231 -18 -261 -343 -234 1 242 357 249 33 -225 -331 -273 -54 195 336 285 81
1804 81 -156 -331 -330 -140 143 328 332 135 -124 -284 -306 -176 64 257 345 212 -50 -279 -331 -215 10 232 335
1827 335 247 20 -239 -344 -259 -47 198 321 264 65 -166 -318 -309 -117 151 338 320 120 -133 -305 -284 -130
1849a30K16K10N6j46k58k34l3J30K35K12P9r7k31k34j03R4K26K21J15o9k13k19
1871a73j36L8J75K49J73j5k04k60j62L8J57K07J74N0j37k50k21k5J54K23J94M9
1893B98r0k15k39j03J19K38K23R0q7j99k17j09L6J75K44J70m9j89k51j61M7J91
1915g8K06J49J5j38k30k07l5J58K50J60M3r6k26k16r7J12K53K15P7j04k09j99
1937a97j11N7J99K30J23m5j81k35j51J9J97K41J37k4j50k05j78k3J40K50J92P
1959B92j48j98j83o9Q8K47K28O4j25k21j79q0P6J75K28J31o7k15k06j16L4J58
1981h6K39J59k2j93k27j43MJ38K14J83K7j51k30j52m4J07K18J92P1j16k15k07
2003b34o5R9J94J93R8m1k21k23r4N8J75K23J17k9j58k35j39J0J76K05J58Rj42
$$ plain form
1849 -130 86 296 352 206 -52 -286 -319 -189 46 258 337 240 9 -225 -328 -234 -8 213 328 259 46 -173
1871 -173 -309 -271 -96 153 326 311 107 -153 -315 -277 -120 87 261 311 174 -76 -297 -322 -168 55 249 298
1893 298 208 -7 -246 -349 -230 8 231 321 234 35 -182 -291 -255 -80 164 334 285 96 -155 -316 -269 -78
1915 -78 128 277 292 154 -76 -283 -318 -160 90 250 293 197 -29 -245 -342 -230 23 238 315 211 2 -197
1937 -197 -308 -251 -52 178 301 256 75 -160 -311 -292 -95 146 283 259 109 -96 -274 -297 -157 93 285 292
1959 292 144 -54 -237 -306 -218 29 257 321 196 -25 -204 -284 -208 -33 195 326 259 44 -162 -278 -244 -86
1981 -86 153 312 290 97 -130 -273 -269 -131 83 266 293 142 -88 -240 -284 -177 41 233 304 188 -27 -234
2003 -234 -299 -200 -6 187 285 244 23 -200 -294 -236 -61 162 279 250 92 -143 -282 -272 -96 109 267 276 134
2026A34k12j74m4J52K08J84N0j18k11j99p4J30J83J99P3o2j73k13j18O7J74K15
2048A71J11m4j56k17j41J9J77K10J48k5j40k10j60j8J15K24J84M0j32k11j81n2
2070b88J05J93K07O9r8j97j77r1N9J72K31J06o1j82k08j09L9J59K06J36k0j49
2092A02k21j29JJ29J91J61M5j24k13j81l0J17K03J66O9r9k06j72q4Q5J83J86P7
2115B56l3j75k07j19L4J89K07J06k0j51k12j44J7J26K15J61kj22j94j70l2J08
2137a62K11J74M1j02j87j72p5P7K05J89P0o4j75j87j08M3J64K14J15k9j74k03
2159a35j06J7J23K05J39K2j41k08j61j2J12K05J67L0r9j93j80m6Q3J83J96Q2q8
2182A95j90j79o7L6J58J89J24l2j90k00j12M4J57J76J22J4j18k20j58LJ43J76
$$ plain form
2026 134 -78 -252 -296 -144 64 248 298 180 -31 -230 -304 -174 9 208 281 219 46 -167 -285 -218 -44 171
2048 171 282 238 82 -135 -276 -257 -80 130 278 253 113 -97 -257 -275 -160 64 248 288 156 -55 -236 -288
2070 -288 -183 10 217 286 188 -9 -186 -277 -218 -46 185 291 230 48 -160 -269 -230 -71 135 271 251 102
2092 102 -119 -248 -247 -118 73 234 279 155 -58 -239 -269 -152 51 217 286 187 -19 -191 -275 -190 -7 179 256
2115 256 223 48 -159 -278 -244 -55 152 258 238 87 -125 -269 -252 -126 89 250 248 126 -68 -238 -270 -162
2137 -162 49 223 264 162 -25 -197 -272 -195 10 199 269 205 30 -157 -265 -222 -58 156 271 242 68 -135
2159 -135 -241 -224 -101 104 243 265 124 -84 -245 -257 -145 60 227 257 158 -35 -215 -261 -178 5 201 283 195
2182 195 5 -174 -241 -205 -47 142 266 234 44 -156 -268 -224 -67 109 231 245 127 -93 -251 -248 -105 71
2204G1J49L4j02j99j83k8J06J85J58P4q0j75j78q8P4J68J84R5n5j55k21j00O4
2227b02J64J71R1rj07j96j53lJ40K01J20J3j09j73j59m8J01J93J70N0j00j61j81
2250a87n8O2J75J70P8l6j64j86j22N3J73J80Q8k2j26j62j40j6J39K11J35j9j21
2273A05j53j41n7J10K00J66K9j20j70j44m9O0J72J87P8q9j57j83q7M2J63J92R2
2296B46n3j35j58j09j9J24J99J52j7j57j66j04j9O9J83J77M8j29j89j35l6Q2J46
2319@J66J02q5j89j76n1N0J64J68R1l7j50j67j18K0J30J76J41Mj46j76j25mJ25
2343h7J45J49L6r5j91j56k4J01J60J26P8o1j75j82p9P9J73J54P5l3j51j70r1K8
2367a91J36J66J13k1j22j81j17J1J22J62J20K8j18j55j62oR4J59J38L9n6j51j80
$$ plain form
2204 71 220 254 152 -47 -230 -258 -152 33 191 265 185 10 -168 -256 -182 -14 170 265 210 55 -166 -266 -202
2227 -202 -38 133 224 215 108 -88 -241 -244 -104 97 217 230 121 -52 -211 -259 -158 35 205 255 155 -6 -187
2250 -187 -245 -183 -8 162 240 204 40 -146 -268 -215 -42 138 226 204 78 -84 -224 -240 -101 110 245 226 105
2273 105 -48 -189 -246 -136 64 230 259 139 -31 -175 -224 -164 8 195 273 184 27 -156 -243 -201 -38 154 246
2296 246 193 58 -100 -209 -228 -104 95 247 230 73 -93 -197 -216 -147 36 213 261 132 -57 -192 -228 -146 0
2319 0 166 268 183 -6 -182 -233 -183 -19 149 240 203 53 -114 -232 -212 -82 94 235 239 93 -83 -208 -212 -87
2343 -87 58 207 243 148 -43 -199 -223 -122 38 164 242 181 6 -176 -255 -176 -3 151 226 193 42 -128 -219 -191
2367 -191 -55 111 224 203 81 -100 -217 -206 -84 78 198 226 108 -47 -209 -215 -121 38 176 215 159 8 -172
2390a72q1P9J84J63N5o2j38j67q2L0J59J64R0m0j16j72j03RJ31J65J13Qj24j71
2414g8j14k3J10J75J16K9r1j55j49m4O2J66J67M8q3j50j39o9M8J36J71Q8n2j36
2438C3j55r0J3J20J72J27j2j28j64j05j8R5J62J41K8r7j59j49k0O8J64J46N1o5
2462A58j67j44o8P1J41J46O9l8j18j74q8M1J24J60Q9mj19j64j23J1J10J73J07
2485A93Rj00j44j43l3R6J57J43M0q6j49j57m6O8J42J55N3m6j19j52r3M1J17J67
2509A13R4k6j20j49r8kJ04J70J04K0j21j43j10l5J00J35J40L5q4j43j33n2O2J34
2533eJ66L8l5j55j44m6J2J24J63R6l7j19j65q9J7J13J45J15J1j26j64r4j0R0J41
2558D2J23L4p2j64j25l2O7J41J32N7o5j36j41o5M7J30J53Q1l2j33j45q6K7J20
$$ plain form
2390 -172 -253 -174 10 173 228 166 28 -139 -221 -191 -32 132 222 182 66 -106 -209 -200 -69 96 209 217 93 -78
2414 -78 -192 -215 -105 70 186 215 124 -31 -180 -224 -162 4 171 219 136 -14 -153 -222 -174 -38 133 221 169 33
2438 33 -122 -212 -199 -79 93 220 208 80 -84 -189 -207 -112 50 191 219 122 -37 -186 -206 -138 26 172 223 158
2462 158 -9 -153 -221 -150 -9 137 206 168 50 -124 -212 -171 -47 113 202 198 79 -85 -208 -197 -87 86 193
2485 193 202 102 -42 -185 -218 -122 35 178 218 132 -17 -174 -220 -152 -10 145 198 152 33 -119 -212 -171 -54 113
2509 113 207 181 61 -88 -186 -188 -84 86 190 210 89 -54 -164 -199 -99 36 176 211 127 -16 -149 -201 -139 -5
2533 -5 161 199 164 9 -135 -181 -169 -45 118 214 177 58 -107 -196 -179 -66 79 194 205 79 -85 -179 -189 -99 42
2558 42 165 199 127 -37 -162 -194 -127 14 146 203 138 2 -139 -204 -157 -27 126 207 175 42 -103 -189 -162 -42
2582d2J45R4rj07j44j13OR6J36J17J7q8j35j38l4Q6J46J21L8o0j37j24n4K4J39
2607b0J43P5l9j30j40q7M4J13J34Q8%j25j38r3oJ06J42R6J8r3j41j24k1O8J62
2632C2J38J7q4j36j04n5O7J21J49N4m2j29j36p1K8J31J31P2j5j01j36r8RJ09J35
2657H6R2nq8j19j19l0R1J40J12L2q8j32j23l7P2J17J23N1l5j42j25o1M4J14J31
2682A01Q0k3j21j38q4K1J03J44J01j3j02j36r7j4P4J48J16L2r6j29j01k9N5J25
2706A7J14N9p3j14j23n8N7J09J36N3j8j15j41o9J2J17J35O7nr2j34r8NQ8J28R6
2732A53Rp6j31j19nO7J21J14L0o7j02j25n8P7J14J28L9l2j26j24o7L5J12J31P6
2757A74k2r4j39q6LR9J31R8Jq4j13j04k0P6J43R4K3o8j12j19m2N3J22J18M1m5
$$ plain form
2582 -42 103 197 188 81 -63 -176 -170 -74 62 179 196 108 -27 -165 -199 -113 33 154 192 132 -5 -129 -183 -159 -20
2607 -20 123 198 159 29 -111 -198 -154 -41 93 181 181 56 -82 -175 -181 -75 67 163 181 88 -53 -177 -198 -130 32
2632 32 170 187 103 -33 -137 -192 -125 -4 145 199 157 28 -108 -179 -151 -20 111 183 168 67 -69 -167 -158 -49 86
2657 86 178 173 85 -34 -153 -183 -92 48 160 192 104 -28 -151 -188 -116 1 124 175 140 -2 -127 -188 -144 -30 101
2682 101 181 158 37 -101 -185 -164 -61 83 184 171 69 -67 -164 -178 -104 44 160 192 96 -33 -134 -163 -108 17
2706 17 131 190 117 3 -120 -178 -121 -12 124 177 159 44 -97 -166 -154 -37 98 165 160 68 -66 -164 -159 -71 57 153
2732 153 162 86 -45 -164 -169 -102 19 133 163 96 -6 -131 -189 -112 2 130 169 137 11 -113 -180 -145 -33 98 174
2757 174 152 58 -81 -167 -164 -65 66 164 165 81 -32 -136 -156 -80 63 157 180 112 0 -119 -161 -108 14 132 173 128
2783A28j21j03n5K7J00J25O4j2j18j16p6J2J01J07R9or4j21r5mP2J18J21Oo9j09
2809a9j11m1O7J05J20N1n2j20j14m1K8J10J14O5k9r6j42n9K1J06J16P8lj00j20
2834f6q8QP7J32Q0J4o4j29q9k5N5J19J01M2n5j21j00n8O1J09Q9P1l8r7j25o5K7
2861a35J01J17O7k1q3j22p4kQ5J22Q2J5q2j12r9j7P0J23R3K8n8j08j00m1M5J17
2887A1J05L3l3j04r8n4J1J10J05P5k7r1j08p1PQ5J05Q6kq5j14r0oO7J28Q1K8o9
2915H5j11r1m4M7J12J14M3o3r6j00n4M5R0J08O2m0q0j05p3J1R7J08Q4j8p2j06
2941d7q6j0P6J13R3J3o6j03j00k0N3J08J08K5n2j05r7m3M0Q5J11O1m2r1j06n8
2967a40K6P8J15O9j7p9j18p3J2O6J14P9J2o6j16q3k1N7J03J04K1o5r9j01k4L7
$$ plain form
2783 128 7 -96 -151 -124 -24 101 165 153 35 -81 -157 -145 -44 63 162 156 62 -59 -154 -158 -86 32 153 159 90 -19
2809 -19 -130 -171 -104 1 121 172 120 0 -114 -155 -127 -17 97 162 133 37 -105 -164 -143 -37 79 157 154 54 -66
2834 -66 -154 -146 -69 63 143 157 93 -36 -125 -150 -95 24 125 167 112 -9 -109 -167 -106 3 92 163 125 28 -97 -162 -135
2861 -135 -34 83 150 129 46 -76 -150 -152 -67 55 137 152 70 -42 -141 -158 -88 35 128 156 98 -10 -110 -151 -106 11
2887 11 116 149 116 12 -86 -140 -129 -19 86 161 134 43 -65 -136 -129 -44 61 147 145 60 -54 -144 -150 -83 45 126 154 85
2915 85 -26 -117 -161 -114 -2 112 155 92 -4 -104 -158 -113 -23 85 147 107 27 -78 -151 -140 -43 65 149 131 59 -47
2941 -47 -133 -143 -67 46 139 152 86 -17 -117 -137 -84 24 132 157 105 0 -97 -140 -100 -15 96 157 115 24 -82 -140
2967 -140 -114 -36 79 148 131 52 -66 -139 -127 -61 53 132 144 78 -38 -121 -142 -85 18 122 143 78 -21 -122 -146 -109
2993a09R9J01M5k6r3j12n0K8Q5J01O6qp7j08p5QP1J17P6no4j07r1pN7J07Q9L7
3021A55o1j15r4j9M2J00R4L2k4p9j31m7L8Q2J05N3rq8j06p1OP8J08P3Lp2r3r3
3049a33pQ1J01P0K8n6j04r8j5M1R3R3L5l7q1r6n5L1J08Q4M1j2p7r4p2J5Q1J13
3077G8N8j4p1r7o7nN8R4Q0K8p4q9r2l0O1R7R0M0m8r5j05m0N0Q4J00M2k8r4p9m7
3107a15JQ4J02O0j2r1p3p0nO6R1Q1J0p4j08n7qM8Q2Q1M2m4r2r8k4M2R8Q8K3k7
3137A01q0j07k8J9P4R3O2pq3j04n3J1N3J04O4Po4j01r1OO8Q9N8K5m0q8q4m1N3
3166h4R4Q4L7l0r6q7m2K1Q4R7M8k2r6p7p0K4P9Q6P0j2n5j03p9LO6J07N9J0l7r0
3196a1q5j9M0R6Q2K2m7p9p8l0K1Q1Q9M5k4q6q0n8K3O9Q5O4j9o8p4p7MN9R4N3O
$$ plain form
2993 -109 -10 91 136 110 17 -95 -145 -117 -32 69 135 127 50 -58 -133 -125 -54 63 139 134 70 -37 -128 -135 -78 29 118 155
3021 155 94 -21 -115 -134 -92 8 102 134 110 31 -100 -147 -109 -27 78 131 122 34 -72 -143 -137 -59 49 122 125 53 -40 -133
3049 -133 -140 -59 42 112 140 84 -20 -118 -133 -92 1 94 129 92 11 -85 -140 -109 -1 83 124 112 35 -59 -131 -116 -35 78
3077 78 136 122 51 -46 -113 -118 -60 34 114 142 68 -21 -113 -143 -82 15 105 145 97 2 -103 -143 -93 -9 91 133 105 11 -68 -115
3107 -115 -114 -30 72 132 120 29 -44 -114 -119 -53 38 119 129 55 -53 -110 -118 -70 12 93 135 91 -1 -99 -123 -81 17 105 128 101
3137 101 21 -86 -114 -95 -21 72 134 127 44 -60 -113 -102 -49 55 119 126 62 -39 -130 -124 -56 33 91 116 76 -12 -96 -137 -84
3166 -84 10 94 131 101 5 -82 -124 -103 -19 78 126 104 8 -69 -139 -115 -36 50 120 108 53 -50 -129 -126 -60 47 106 116 79 -11
3196 -11 -96 -115 -75 21 103 125 78 -1 -79 -109 -88 -7 82 127 103 17 -63 -121 -98 -29 56 120 101 33 -41 -118 -114 -55 39 92 98
3227I8m4r2p4j0N0Q2R2Rm5p8q0k1L3P6P9M3m0o1q4o5M0P0Q8M7mo9r3o2J5O0R8
3258E8N1ln1p5p2j7O0P9Q1K1m9j01p6j0L0Q9O2M1j2j01r0k8K2P8R0L0oo8q9n8
3288a14MQ0P4M9J4p1p5o4j0M8Q4P1J5l8r3o6j9L7Q7P0L7m5p8p8l5K9Q4Q1L1k5
3318H4o6q2m8J9O9Q4M9j0n5q3n9qN7Q6O5J1n3p8p8lL3P4P8K4l1p6p9k2J0Q3P7
3349G2L0j8p2p4n2J2P5P0O0qp2p8o0J9N2Q3O1J7n8r6o4nO3N6P1K2l4p0p4l3N1
3380e4O6O9M3m1o7q2m3L2O3Q3N3j7o2r3n2J2N7Q1N6Kn8q1o5j2N8Q2O8Rm5q1p0
3411h9j1K5Q2P0K8l4o6q1l9K2P0Q7L9k5m7q1n2OO3Q0N6j0n5p7o4PN1Q2O4J3m1
3442G3p2p5j9L9P7O8J5l4o2p2l1K6N9Q7K0k0o4o6m9QP0P3M3nm5q1m8rN3P9M6R
$$ plain form
3227 98 54 -38 -112 -122 -72 10 102 111 66 -12 -92 -113 -80 -4 75 118 78 17 -67 -132 -92 -22 66 113 109 40 -53 -115 -100 -40 58
3258 58 109 106 55 -20 -92 -109 -49 30 111 132 83 -18 -94 -104 -74 15 77 118 106 5 -85 -113 -91 -13 77 107 101 33 -56 -114
3288 -114 -110 -30 44 93 107 36 -39 -103 -113 -65 19 90 105 67 -26 -92 -111 -74 13 83 120 75 -3 -81 -116 -87 -3 78 109 84
3318 84 18 -64 -112 -93 -24 60 109 99 44 -39 -98 -106 -49 37 102 113 60 -18 -96 -99 -66 8 86 110 79 3 -76 -98 -88 -5 72
3349 72 102 84 12 -62 -114 -102 -27 43 103 95 23 -55 -115 -96 -44 39 100 117 59 -37 -101 -106 -43 13 84 106 72 2 -72 -105 -54
3380 -54 12 81 124 83 16 -66 -109 -77 -14 69 122 105 43 -50 -102 -90 -33 48 104 106 48 -33 -98 -110 -52 30 98 107 62 -19 -89
3411 -89 -100 -75 7 77 105 71 5 -76 -115 -93 -23 64 103 78 31 -50 -102 -96 -33 47 103 93 38 -39 -103 -96 -45 37 101 114 73
3442 73 1 -74 -93 -54 23 91 106 72 10 -62 -93 -67 -8 79 99 79 15 -51 -100 -92 -22 51 94 89 44 -37 -85 -94 -41 38 84 93
3474I3m5q1o1qM3P3P0K2m7n7p8k5L2P0O4L1j9p0o3m7J5O9P3N3k3o2p0l9mN2Q3
3505D4N4Jm8q4n3J2J8Q3O3J6m8o8o7k6M9O4O1K9k4p6p1k9J5O4Q0K1%p2o4n0K6
3536h0M2P2N9j6m4p4n2KM7O2O7Ol9q0n4j8M4P1N5L3m0p1o1k9K4O9O4L6k6m8o7
3567d6m8J1N1P0N3Ko0n8n0rN4O0M4J3k9o7p3LL4O0O3K6l3o8p4k0K6M9P2K5l6n1
3599fn6m5K9M8O3M2rm4o9n2J3M9P4L6J9n3n4o0nJ8P0O6Jj8o6m8l2K9O3M8L6j0
3631G7o3o1k6RO2O6L4k9m8o9k7oN4P2M2nm7o0m8mK4P8O0Pm0p2o0lJ6O6M8L5j5
3664F7p8m7k7J1P9N5K2j1n6n9m0J7L3O3O1j7l5p2m1RK5O5M6J9l1p5m7j2K9N5N7
3695F5J4l5m1n9l9K8O7O2J5pm8o5m8J8N7N8L3pl7p9k6mN2O4L2Jk8o8n9%L5N9M1
$$ plain form
3474 93 48 -33 -94 -102 -59 14 84 106 59 2 -76 -101 -69 1 65 96 77 7 -56 -103 -88 -19 54 107 84 22 -48 -87 -91 -39 44
3505 44 98 99 51 -33 -86 -74 -56 27 90 106 58 -10 -77 -103 -54 10 71 100 76 0 -71 -100 -85 -21 59 80 80 8 -56 -106 -80
3536 -80 -38 34 93 77 33 -41 -93 -91 -44 18 85 91 52 -28 -82 -100 -56 15 70 103 63 -8 -69 -98 -74 -5 59 95 69 21 -46
3567 -46 -94 -83 -32 38 91 93 33 -25 -75 -84 -30 30 74 87 58 -9 -82 -79 -45 15 78 104 71 3 -71 -91 -65 -16 56 81 45 -6
3599 -6 -62 -107 -78 -30 33 75 66 22 -47 -99 -86 -37 37 73 92 39 -15 -75 -80 -62 8 74 75 57 -9 -57 -89 -60 3 51 87 77
3631 77 14 -47 -73 -64 -2 64 98 69 21 -48 -75 -81 -27 45 87 82 35 -25 -73 -77 -53 25 85 92 52 -20 -80 -83 -67 -1 47 82 67
3664 67 -11 -58 -85 -74 5 60 82 71 15 -44 -84 -67 -34 29 90 73 38 -34 -75 -66 -41 24 70 89 58 -17 -64 -76 -47 8 65
3695 65 79 44 3 -56 -95 -67 0 62 77 70 22 -43 -91 -73 -16 42 75 68 31 -48 -74 -78 -26 38 70 71 43 -25 -84 -84 -49 10 51
3728E1K2l3n2o3k4K9O4N9K8k3n8l3m7J4N2O1M3j3n4n4l5OL9O1M5j2k9o4n3nL9
3759c9O5M1J4k5n9n3j7K8O0N4Oj7n6n0k1PN5N0L6po4n6k2%N4M8M4j2l7n7l5j6
3791h1L9M8N3J7l6o2m9%J8N6M6L0k1n1n1l9L5M1N0M1k0n4n8k3lN3O0L8jn2n0m1
3823f7RL4M9M1Ql9o8l0qL9M2M5K9l3n4p0j0L2N1M8K4k0m7n9k5J8M5O1K2j1l6n0
3855c0l8JM4N9L1j5k0n1m8JL0N3M4J5l4l7o1mK5L4O0K4k4n3m5k5J4N8M0K7j2l7
3887B6o7l5J2L6O4K9Ll1p3m0LM4M8L8J0l4n7l9j8L7N1L4K8l0m1l9l4J9N5L6K9
3918F4jn0n2k8kN1O0J7Ml2n1m3PL0O1K3Lk2m0n1pK1N2M1L1l3o0k7j9KN2M0L2o
3952F7o0m2k8NM7M3K4kl6n5k7%L2N3M6j2l2m9l2kK2M5M4J6k3o1l2oJ5L7M7K0j1
$$ plain form
3728 51 73 40 -12 -75 -99 -70 -6 53 81 58 0 -33 -80 -66 -14 47 90 77 23 -31 -66 -60 -21 40 85 73 44 -20 -73 -78 -39
3759 -39 26 67 81 56 -3 -56 -73 -45 15 69 75 58 2 -48 -69 -62 -7 43 79 72 8 -48 -70 -70 -16 32 76 64 27 -30 -65 -81
3791 -81 -42 6 59 76 40 -22 -71 -71 -53 3 49 79 58 7 -44 -83 -48 -7 43 84 64 10 -48 -71 -74 -21 39 77 76 24 -26 -67
3823 -67 -58 -24 25 66 74 35 -33 -63 -71 -32 10 55 84 51 -3 -73 -83 -51 0 48 72 52 5 -54 -79 -61 -16 45 67 56 20 -30
3855 -30 -68 -67 -23 36 67 52 32 -19 -67 -66 -36 17 61 76 42 5 -56 -60 -35 -1 59 83 59 6 -39 -64 -50 8 48 75 63 26
3887 26 -41 -76 -64 -28 36 65 68 37 -36 -76 -73 -29 19 57 67 33 -24 -63 -81 -44 7 41 69 39 -2 -41 -75 -56 -1 35 64
3918 64 63 13 -39 -67 -69 -18 42 59 63 31 -20 -63 -56 -26 35 58 61 39 -1 -52 -59 -38 14 55 86 53 -7 -34 -53 -51 1 41 73 67
3952 67 7 -35 -63 -58 -11 32 56 54 18 -37 -64 -64 -32 21 67 55 23 -26 -58 -60 -38 7 51 67 44 -17 -49 -55 -40 -3 44 64 53
3985E3m6m8j4kN0M4K7jm0m1l7PL0N0L0jl1m6l9kL0N5L5Rl3m8n1mL1L2N4Qj2m3
4019Fl9l2J3L6M0K7mm4l8k8ML4M9K7Pl7m3l8JL1L9M6kk5m2l1LJ2L6M4K3l2l8m3
4053c8j6J6L5M8K8j3m4n2k3J3L7M6K3ml4l8l6kL5L5M4Kj3n9n1kL8L9M7mk8k5n0
4086d6j7J6M0N2Nnm5l4k8J1M3L9J0Jk0n2j7rM1M7QPk7k5l9rK7M2L9%k9l2k8j4
4120d8J2M3K4K7j9l9j9l8OM0M3J8j2k3l7k9LM1M6J5mk1l6m5J2J7L6M7j3rn1m2
4152e5lL1K9L6J8k5l1m0k0J7L8L5K9nm0n1Jj3M8M0J7jk4m6k7nM1L1L0Rk2m5l3
4185c6j0L9J2L8J2j7m1l9j3J6L9M3J3nm5m7kKL3L0K9j4k8l2l0ML1L2L5qk3m1j8
4218d1j6L0L7J5K3k2l9k5j3RM6L9Rj2m2k5j6J2L3K1M1rm7l7jj2L7L9J5Rk4n1k3
$$ plain form
3985 53 7 -41 -55 -57 -7 37 64 63 23 -18 -55 -48 -18 32 62 61 30 -16 -55 -57 -27 28 63 72 39 -9 -60 -64 -33 -1 53 61 49 6
4019 6 -33 -65 -52 -16 24 51 47 3 -35 -63 -59 -25 24 51 58 21 -22 -60 -59 -28 11 57 55 30 -12 -43 -40 -28 8 52 75 43 5 -38
4053 -38 -54 -38 -3 45 73 60 16 -36 -59 -46 -9 37 60 56 22 -16 -52 -54 -19 16 60 62 49 -10 -61 -63 -25 14 61 57 29 4 -46
4086 -46 -63 -47 -7 45 50 45 0 -34 -62 -51 -8 31 41 42 22 -30 -47 -56 -15 32 40 47 20 -5 -44 -53 -26 16 55 55 26 -6 -34 -48
4120 -48 -36 7 31 58 39 0 -19 -57 -51 -11 32 50 38 15 -22 -51 -48 -7 39 54 50 29 -7 -52 -40 -23 13 60 47 38 -13 -55
4152 -55 -58 -27 2 38 56 31 0 -40 -60 -43 -5 30 59 54 14 -37 -36 -49 -1 39 56 55 31 -15 -42 -47 -6 25 55 64 42 -3 -36
4185 -36 -46 -7 5 43 55 38 -3 -42 -55 -39 0 43 56 51 6 -41 -43 -41 -8 22 51 37 9 -23 -53 -49 -18 14 49 41 18 -23 -41
4218 -41 -57 -27 10 25 48 26 -13 -38 -51 -42 4 43 52 40 -2 -27 -43 -31 2 23 64 55 8 -29 -30 -42 -5 34 49 58 34 -17 -40
4251d0rL9K7L7Mk2l5l0pJ1K9L4K9l8j5n2mRL1L9MJl0l9k2PK4N0K1j6k3k8k2j5
4285e1M4K0M3j5k2k1m0j3L1L5L5Lrm3l4mJ6L6K4K5j9k9l4k7JN6K3J7pj5m5k3J
4318d1K0L5J5J8k1n1k8PJ9L3K6Nj6k6l7k%L3M8Rj6l2l4j3MM0M1Llk4l3l4K4J9
4352a2K1L2%k2l6k6J2J9L4K4J2k5l1k2j7J5L7L3Pj5m1j3k0QK5L9J6qm1k9k5RK5
4385a5L9L3j2k0l4l0mL0K5L0Nk9l2k9mJ4M9J9Ok0rl5k0PM7K6Qkl2l4k8J5K5K8
4419A7K6J1m0l5pPPM3J3jk7k3j4j9K1L2L4J4l3k3k9rJ1K8K7K0rk6l0k0kL5K8K5
4453E2j9k4k8j7%J9K9L0kj8k8l2j0K6L9K9opl5k6j7L0K9K6K5k4l5k3j9RM2J8K5
4486E8k0l4k1j2QJ4L4J8Ll0l3j7j0L1K4L4%l1l1k0J1jL3K0J0j8k3k3k5K5J6L4
$$ plain form
4251 -40 -49 -10 17 54 58 36 1 -29 -36 -25 4 38 67 29 14 -38 -42 -33 -2 37 41 42 12 -27 -49 -42 -18 32 53 37 14 -14 -36 -51
4285 -51 -7 13 56 41 19 -2 -42 -55 -24 11 46 49 40 -3 -37 -41 -25 11 35 60 41 12 -22 -49 -48 8 31 48 41 26 -19 -42 -41
4318 -41 -21 14 29 47 26 -25 -53 -46 -27 6 32 37 21 -5 -42 -44 -44 -11 37 46 30 -2 -36 -49 -45 -5 36 39 36 12 -21 -55 -31 -12
4352 -12 9 41 41 19 -17 -43 -31 -12 22 46 58 33 2 -20 -37 -22 15 48 55 40 -1 -14 -34 -26 -1 38 54 46 5 -24 -49 -40 -15
4385 -15 24 57 45 25 -9 -39 -43 -13 12 42 47 18 -14 -43 -47 -33 16 35 41 21 12 -23 -43 -36 11 37 45 43 11 -23 -51 -36 -11 17
4419 17 43 54 14 -21 -28 -21 -14 29 42 41 14 -9 -23 -42 -21 11 45 59 26 3 -26 -35 -24 4 31 51 42 16 -14 -34 -36 -1 27 52
4453 52 33 9 -19 -36 -36 -17 12 42 40 22 -6 -38 -48 -22 17 46 40 33 -2 -28 -45 -15 14 40 65 41 6 -17 -36 -27 15 33 58
4486 58 38 4 -17 -29 -21 -7 27 45 48 18 -15 -32 -42 -11 13 47 47 16 -15 -35 -24 -25 8 28 38 20 -3 -26 -51 -26 -10 24
4518B4J7k9k2k2j9K5J1L0K0rj1m1k1lK9M5J3ok2j5k3PJ0K3K9Mrk9k5j0K2J4L1
4551C8NLm0l0j1KK9L1J1jj8l1j4j3K3K9J9Pk6k0k4lJ4L7J4Nk0k6j2l1L6J8K0R
4585C0pk1l2rJ4J9K5PJk3j0l0%L4K4J9qj5k6k5J1OL0K6kj5k8qj3J0L1K8Nnm3k5
4621b5j5J0K1L3J4j2k3k2j9J3J0L5J7Kj8m4j4jK4K1K7Ok1k9k0KJ5J6L0Pql7k1
4654b6KkL6QK2j1k3k5l0K5L5K1J7j9ok2k2nK6J9K3mj3k2l3J0ML2J5jkm2k1R%J0
4690a5M2Opk6j8j2RK4J4K7rk3k8k2QK7J4K5rj8k1l0QJ7K6L0Lk3j2l7mK4J2K0J7
4725C9j6k8j5pKJ5L4J7mj7k7oqK2K4J7%k7j4k5pL5PK7Rk1l5j7KK1PK4J1j7k6k3
4761b7LKJ6M6pj8j3j1k2J1J8J6K9j6j5k4j2j1K4K6J2Qpm3prJ4K8K3Lk2j4k6mR
$$ plain form
4518 24 41 12 -10 -32 -51 -26 -15 15 35 26 15 -26 -47 -50 -21 24 37 31 9 -6 -29 -22 -12 11 40 44 35 6 -19 -29 -7 7 38
4551 38 43 46 6 -24 -35 -33 -4 27 38 37 19 -12 -26 -39 -16 13 32 39 13 -7 -31 -34 -20 17 31 36 16 -10 -22 -53 -17 1 21 30
4585 30 23 2 -30 -39 -25 -6 19 26 27 4 -6 -36 -36 -2 22 41 33 18 -8 -33 -22 -16 14 40 38 23 -5 -13 -26 -16 15 43 48 43 0 -25
4621 -25 -40 -30 -9 24 38 26 3 -19 -38 -25 -15 20 37 39 21 -23 -37 -38 -14 7 34 40 19 -10 -30 -28 -13 3 33 40 32 -5 -26
4654 -26 -24 -26 10 18 40 29 6 -19 -49 -24 11 32 49 30 24 2 -20 -25 1 20 43 39 26 4 -29 -19 -15 17 32 31 29 -13 -34 -25 -25 -15
4690 -15 27 33 26 0 -18 -30 -21 3 17 44 35 12 -16 -38 -30 -3 11 36 27 9 -12 -42 -34 -17 9 39 42 19 7 -30 -34 -10 2 22 39
4725 39 23 -5 -20 -27 -25 -10 24 41 37 20 -7 -13 -21 1 25 42 42 15 1 -24 -31 4 11 38 47 26 -9 -26 -24 -3 4 28 39 22 -4 -27
4761 -27 -24 -22 -6 40 33 15 2 -9 -31 -20 -2 14 43 27 12 -12 -24 -35 -11 15 27 35 28 -15 -22 -31 -17 11 34 37 15 1 -25 -29 -20
4796b0L4K2nj3j2k5oOJ9J9J7%j9l1j8OL4J5NJ1k5l3okJ4J7J7Pk1j2k2olL3J7J1
4832B5pj2l0j2J8J5K5l%j4qk4RJ4L0OMj5k4j7j0J7K5J9J6l1k2lk3K4J6J5J0mk7
4867Bj0j9K1J9K3lpk6j8pNK1RK8pk2j7j8oK5J6J3%pl2j4rK3K1J8J5k4k2j0j3J4
4903a8K6ROOj9k9qRJ0L0J9k4j1k0rjK4J6J2Ok3k6j6OJ1L0LkRl2pj1J2K0J4Nj3
4940A4nk3j7PK0J5J8ok4j5k0J4J8OJ4J4k3k9pMJ6K5ROj6k4j7mJ8K9QKll0Oj6J4
4977bJ2J2J5qj0k8%%RJ3K7j3j1j9k7JK1J6J6Kql2kmJ9J1OJ4rk7nmqL3KJ4j1j4
5015Aj9j7LK6J7J5jql6j4K2J3JK7Jk8oj5KJ4J7K0Jk2rj4j4J9J4K1JLk8j9jKK0
5052IJ3j1J4nk9j2MRK7p%Kk9mqK0K2J0lj2j7oj8J7J8L1pj8j0k0rJ1K2J3Loj3j5
$$ plain form
4796 -20 14 36 31 18 6 -19 -25 -19 0 19 36 36 17 -14 -32 -26 8 23 28 39 14 -19 -25 -27 -13 4 21 28 7 -5 -27 -33 -36 -3 14 25
4832 25 18 6 -24 -36 -18 -3 22 19 19 5 -3 -27 -18 -4 26 32 36 21 -3 -20 -30 -13 12 31 47 16 -6 -9 -32 -8 8 23 33 29 2
4867 2 -8 -27 -6 13 36 33 26 0 -18 -25 -20 1 10 38 31 9 -8 -26 -32 -7 9 22 22 15 -17 -31 -40 -17 4 22 37 13 -9 -19 -32 -18
4903 -18 8 17 23 29 10 -19 -27 -18 -8 22 41 17 6 -14 -23 -24 0 16 28 34 11 -15 -31 -25 -14 16 19 17 26 -6 -13 -24 -12 8 22 27 14
4940 14 9 -14 -31 -24 -4 11 29 23 -1 -16 -36 -22 -4 2 16 30 7 -22 -29 -25 -9 16 25 31 15 -9 -26 -30 -12 17 25 27 24 -6 0 -16 -2
4977 -2 10 22 37 29 19 -9 -9 -9 0 13 40 27 16 -3 -30 -29 -8 8 24 26 18 -14 -16 -20 -1 10 16 30 21 -6 -11 -15 -23 10 12 26 15 1
5015 1 -18 -35 -32 -6 11 26 25 17 -19 -33 -11 2 3 30 31 3 -3 -18 -16 -2 15 35 36 14 5 -9 -23 -4 10 31 32 35 7 -12 -13 -11 9
5052 9 22 11 25 20 -9 -21 -17 -8 19 12 12 14 -15 -19 -27 -7 15 25 22 10 -7 -13 -31 -14 4 35 28 10 0 -20 -29 -18 4 17 20 14 1 -14
5090a4rJ5J1K0K0lk4j9j4mK5J2J3Qj6k4oMJ2NJ7Qk3j0k4j0K2LK6J0jk4l3MJ1J5
5126CJ4KJk0j4lj1K9PJ1Rj9k3npJ2J7K2prmj0kNJ4J6mkk3k0J0lJ5K1J4j1j6j8
5164ioJ6OJ1J0mj6j1qrK2K0Mjj7j6Nj5QK0OJ2k0k6Kk1J2J6K0OMk8nk1LK6LK1L
5203B3k1j2KnJ0K4nJ7k6j2oj0J8J4LKlmj7pjJ6J1J1j2j1rmJ0JJ5K1qj8k7MMJ0
5241bL0qQj4k7lnJ0K1NRk5Mk9oL0qK1%Nj4j0mrL0QOmj1j1j2J1PJ5Qnj2j1mj9K3
5282bMK0j0Mj5j2jRMJ0J2lj5j8P%J0J1J5nj8k2kOJ7NR%j3k1j%jK7Kkj9lrLPjK6
5325A5Kpk3rj1J5K5MOj4qqoQJ7J3J8j6j6j3qkJ7RJ4%jk7j1RQK2jMj3j0k0J5j0
5364a3J6J8onj3j5LLNJ4J8kj7j7j7K9oJ5J1jk3lj0OJ1NJ6jj5j7QoLJ3K5mqj5j4
$$ plain form
5090 -14 -23 -8 3 23 43 40 16 -3 -17 -21 4 16 29 37 21 -3 -9 -5 7 12 29 37 14 4 -20 -30 -8 -5 21 31 30 6 -27 -23 -12 3
5126 3 17 19 20 0 -14 -17 -28 1 8 19 28 9 -14 -19 -26 -14 3 25 18 9 5 -5 -7 -2 12 28 24 22 -1 -21 -11 -14 1 22 36 25 9 -9
5164 -9 -15 1 7 18 28 24 8 -3 -11 -20 2 22 26 25 8 -8 -3 -18 -10 10 16 28 8 -18 -16 -37 -25 -9 11 17 21 -7 -12 -33 -30 -4 -1 20 23
5203 23 2 -10 -8 -13 -3 21 16 33 7 -5 -11 -21 -3 11 14 16 13 9 -8 -15 -16 0 11 22 10 -1 -10 -14 -4 -3 12 33 25 7 -20 -16 -12 -2
5241 -2 28 20 28 14 -13 -16 -21 -11 10 15 24 -1 3 -26 -32 -2 -10 11 11 16 2 -8 -12 -21 9 17 23 19 8 -3 -15 -4 3 18 26 21 9 -2 -6 -25 -2
5282 -2 2 22 12 16 1 -11 -12 -3 1 11 23 20 5 -13 -6 -6 4 15 30 25 7 -15 -17 -11 6 11 20 20 7 -14 -15 -15 -16 11 13 11 -8 -11 -20 -17 -10 -11 15
5325 15 17 10 -13 -22 -33 -18 7 11 17 3 -5 -13 -19 -11 6 19 37 21 5 -8 -16 -18 -1 8 22 22 21 -6 -17 -8 0 22 21 25 12 2 -18 -3 -13
5364 -13 3 21 15 10 -3 -18 -15 -12 -7 7 25 23 6 -11 -28 1 -5 10 21 20 -3 -6 -16 -10 1 6 22 21 6 -11 -3 -9 -6 7 32 28 20 5 -9
5403ij1K2QOJ3j0qj7lqJ7L6j3Rl3j0kKJ8PkNj3j7MLLJ4P%oj4j1j0J0QJ2J9qj8
5443@j4%nK2J9Noj8j3rNNJ4J2kj6qrJ0OJ4QJ2k0Kj1j3%K8jJ1rj3j6PmJ9JK0j9
5483A4rj7QrJ7JJ4J7l8j4r%%J7L1Jk6Rk2Qj2K3J5j0%nj2q%J7NnJ1jk8MjOJ5Oj
5524A2mj6mKMJ2K1klk1qlPJ8LmkmrpNJ6J0mqoj2qJ0J5LMlk5Oj2KK4LOKj4j7%J1
5569@nJ0mJ9j1rmk4J7K4PRj1j3j2j3J7ONJ1%k1plJ0MOJ1Qj2j5j1NJ7MLJ0k3mj7
5609a6PMPJ3J1pj7j2j2PQJ7Pj1oj3j6J8jK1Lmk0QnoJ7J9Jk%k5nJJ1NJ6Lj3j2r
5650hmLJ6J4Oqj8plNJ5OKqoj1nj4K3OK3j2mj5rkKK4QmQj8j6kJJ5J7j7Nnk6jJ1
5693a3J1J2J0kj8j0JkJ5OJ1pRk3j2J2KJ5jjnj7Pk0K3KNK4j7j3j7l%J8J5Mj2rp
$$ plain form
5403 -9 -20 2 10 16 29 19 11 -6 -9 -17 0 36 23 32 -1 -11 -13 -11 7 14 12 17 4 -13 -9 -6 -3 11 18 18 12 -2 -13 -23 -13 -5 7 26 18 0
5443 0 -14 -14 -19 3 22 27 21 3 -10 -19 -14 -9 5 17 15 -1 -9 -18 -8 -2 12 20 32 12 14 3 -10 -10 18 17 28 19 6 -10 -3 -7 12 13 33 14
5483 14 5 -12 -4 -13 4 5 19 36 -2 -16 -25 -25 -25 -8 23 24 -2 7 -15 -7 -19 4 19 9 9 4 -8 -16 -16 1 6 1 12 11 -17 -13 -14 -8 7 13 12
5524 12 8 -8 -12 -10 -6 6 27 25 22 1 -7 -10 -3 15 18 14 12 8 -1 -8 -3 13 23 19 11 5 -7 -15 -5 10 13 17 14 -11 -5 -17 -15 9 12 18 20 6 -11 -11 0
5569 0 -5 5 1 20 9 0 -4 -28 -11 13 20 29 18 5 -7 -20 -3 3 8 19 19 -2 -9 -12 -2 2 8 19 27 15 0 -11 -6 11 15 18 28 5 1 -16
5609 -16 -9 -5 2 15 26 19 2 -10 -22 -15 -7 10 17 6 0 -13 -29 -11 -12 9 12 8 -12 -4 -9 -15 2 21 22 20 20 -5 -10 -9 2 7 23 26 13 1 -8
5650 -8 -12 -9 7 21 27 19 1 -6 -9 -4 11 17 19 11 5 -6 -11 -25 -2 4 27 15 11 -4 -13 -15 -13 11 19 15 23 5 -11 -13 -12 3 20 3 8 3 -23 -24 -13
5693 -13 -2 10 20 18 0 -10 -9 -11 4 10 21 14 23 0 -12 0 2 17 16 15 10 -7 0 -20 3 5 10 34 17 4 -13 -16 -16 2 17 21 9 0 -7
5732gjQmJ5J7pj0l7J7lJ0J2J0j2kk0nJ0NQPJj4Rj4qKJ9QJ3j8rOk6J7MJ8J0mj4
5772A1lj4j0J2J9J0Oj8k7%jK2jQJ2k2olj0QJ0K3%pj6orQnJ9Nkj6j4MKOK6j8J0
5812A3k4j2NKJK0Plplpj0PJ7PnLj5Jj3J5QK0j6Pj1jj6jJ2K2pJ0k6j4kJ4RrK2j2
5853Hj2oLqQJ4Nknnj5%LJ7RNqnj3k1J8J7kK4jj7k5kQMJ4KRk3kj7J3KJ3jNOj1k2
5897a6J4qJ9LMJ2j7k1RjJ3PnJj9n%oJ4%RJ7qj9k0J4JPJ5j1njj6KRJ2PMKj4mj6
5939a7J0J0jJ6j3J2l1J0nNNJ2Jpj0pJ1jJ3J2j1j1m%j0J8O%J3k6Pj3MnJ5J2pmk
5978Gj5oLJ6NJ0mmj9j2J5LJ0Mj1Nj2oJnK3J5k2Qj5jqKK5jJ1j4jqpjJ0J3Jj%j9
6020enONK3oMj2j1j1jQJ5jJ2j6Jj4JKMJ8%rJrqkJ2J3j4Qj8oRjLnK4moj2j0QLJ8
$$ plain form
5732 -7 -8 0 -4 11 28 21 11 -26 -9 -12 -2 10 20 8 6 -14 -19 -9 -4 4 11 12 -2 7 -7 -15 -13 6 14 27 9 0 6 -20 -3 1 19 29 25 11
5772 11 8 -6 -16 -4 15 25 31 13 -14 -14 -15 7 6 14 26 4 -2 -5 -15 -7 3 26 26 19 3 -3 -12 -4 -9 10 15 13 -3 -17 -13 -11 -5 21 3 13
5812 13 -11 -23 -18 -16 -15 5 12 9 2 -1 -8 -18 -11 6 13 8 11 -4 -3 -16 -1 7 27 11 18 7 6 -10 -11 1 23 16 26 0 -14 -16 -2 7 -2 20 8
5853 8 -4 -10 -7 -15 -7 7 12 10 5 0 -15 -15 -12 5 14 19 11 6 -7 -28 -10 7 5 29 28 11 -14 -16 -8 -4 10 12 21 -2 -4 -21 -8 -6 7 6 11 17 6 -16
5897 -16 -2 -10 9 12 16 28 11 -10 -1 -2 11 18 13 14 -5 -10 -10 -16 -2 -2 7 24 16 -3 -23 -9 -8 -1 14 3 -2 -3 -19 -17 -8 4 11 15 17 3 -1 -17
5939 -17 -7 3 2 18 5 17 -14 -4 -9 -4 1 13 14 7 -3 -10 1 0 13 25 14 3 -1 -1 -11 7 13 13 26 0 7 -6 -2 -7 8 20 13 9 7
5978 7 -8 -14 -11 5 10 20 16 12 -7 -19 -4 -1 9 13 2 7 -5 -11 -10 -15 8 23 1 9 -6 -7 -15 -13 12 11 22 8 7 -1 -8 -9 1 14 15 14 14 -5
6020 -5 -10 -4 1 24 18 22 10 -1 -12 -13 -5 10 9 21 5 6 -8 -7 -5 -1 17 17 8 9 0 -8 -10 2 15 1 9 -9 -15 -6 -7 -4 -9 15 11 5 -7 -17 -9 -6 12
6065A2J5j5jpj4PnQJ6J1j9o%MpJ0J1rMlJj6jLJ1J8kk9J0jpjJ1J4rk2J1k6J8PJ3
6106A5rJ0Kk2nlmJ5RNqlk1LJ1MJ0jnqoQPOk%J0j1rKqRJ0KQrj0Lj2J4LlJ4j7kk
6152@j6RJ3LJ6mk4jJ0j3PJ6jJ1j8k3jRLJJ2%j0Jj1nQRJ6kLk4qQmMK7lqj0jKqJ9
6196A2QpnkkrKMJ4kO%k5joJ4M%J9j1j2j5nJ1RJ5pQj9moKJ2RlKj0lj2J0JJ5J8j7
6240A2j1j5PpJ8%J2%j4lj1m%J2J3J0qnj6J4PkNJ0jmpj8MLK4pj4KmnqRK0kLnj4
6283@mrJ3P%LlPk1mkJ0QN%jj7lmJ5MJ2nMk1j4J3LJ5Olj0rklJ1pJ1KNjj8oOJ4J0
6329A7Mjj2rkMKLJ3j4%krNJ4Rkrj0j4lLJ1J0%j%rnJJ0PoOp%mj0J2MKLj3J2qk0
6375a8J4K0oMnNj4onQJ9JKomr%JNJ1Jj4lNj2LQQLLj4Jkk5K8LnMjj2oPRJMKqrj1
$$ plain form
6065 12 27 12 11 4 -10 -3 -8 0 16 27 8 2 2 6 -1 9 20 11 15 12 13 -3 -4 -1 10 28 26 -3 7 6 -1 -2 9 23 14 -8 3 -23 -5 2 15
6106 15 6 16 18 -4 -9 -12 -16 -1 8 13 5 2 -19 -16 -5 -1 9 8 3 -5 -11 -3 4 10 8 8 18 7 -2 0 -8 1 11 13 21 12 2 5 -7 7 10 7 21 4 2 0
6152 0 -16 -7 6 9 25 21 -3 -4 6 -7 0 16 15 26 8 -15 -16 -7 -4 -3 9 9 -1 0 -11 -16 -8 1 17 15 18 -6 -14 -6 -10 -6 21 18 10 0 -1 1 -7 12
6196 12 20 13 8 6 4 -5 -3 1 15 13 19 19 -6 -7 -13 1 5 5 24 13 1 -14 -19 -8 1 16 9 17 -2 -6 -12 -10 2 11 8 10 0 -3 -15 -5 -4 11 29 12
6240 12 1 -14 -7 -14 4 4 16 16 2 -1 -12 -16 -16 -4 9 19 11 6 -10 4 11 9 14 24 23 19 12 -6 -2 1 25 18 4 6 2 -3 -11 -2 18 16 19 14 0
6283 0 -4 -13 0 7 7 10 7 14 -7 -11 -13 -3 5 10 10 9 -8 -11 -15 0 4 16 11 15 -6 -20 -7 -4 11 17 14 4 -5 -7 -10 1 -6 5 7 12 11 -7 -13 -7 7 17
6329 17 21 20 8 -1 -3 1 3 6 19 5 5 3 -6 -1 13 22 20 11 1 -13 -16 -13 -2 8 8 7 7 -2 -7 -6 4 11 5 11 4 4 0 -10 2 6 8 11 -2 10 2 -18
6375 -18 -4 16 10 14 9 14 0 -6 -11 -3 16 17 19 13 9 0 0 1 6 17 18 4 1 6 -6 -3 5 13 16 19 5 6 4 -21 7 10 5 9 8 -4 -10 -3 6 7 11 13 5 -4 -15
6424a5%mRJ6J0j0mj1kRNJ2jPj3k0Qj2K2kONlj2NqPJ3jpMj5lQjJ0J1Oj3j8jJpP
6468bJ6nJpj3pJ3J2mJLlj1oJ1pJ4Qnj1%j4%LJ4J5Klj0j3mJ4OJNMrj9KQMJ9j3Q
6512A8qjk5J4PMPKrk1PoJ9%%MJk3J%MQlMJ1j1j6oRJ4QrMj4JpOlJ0KJ2j6j2Nk0
6557b8J9K0kJ2j1rljj2K4mJ0j1lmj5K0K5rpLj0rLoJ6LlPj1j2kjJ1kLJ6j3j4j1
6597b1K0NkJ2Rj5j3Jj7RJ0J1%qMk3j5K8RrJ3kJpj5RjoJ9jqjj3POJ1J0Jnj3pJ3
6639FoJ0J0qPk4jrJ7nJ0NMk1klQoOJ7k0KJnKlRLjKj0jnMQJ1Qj1j9JlMJ1J0Knj6
6686fNMKj0J6Rj1mjj2OORk%%kj3qJ3MPPmk0Oj1PPMkNjNk1N%J0j8J6j6jrJ2jQJ1
6733A1JmroQmJ1J2qLj7LrpK3RjJ1k3rpMJ6Q%rlmj0MJ3J7nMpk0kJ0OnNPnj1j3N
$$ plain form
6424 -15 -15 -19 -10 6 16 6 2 -9 -11 -2 3 15 14 21 8 -12 -4 -16 6 4 10 15 12 0 5 -3 4 17 16 9 13 -2 -5 3 2 12 23 29 16 -2 -3 -2 -9 -2
6468 -2 14 9 10 3 -10 -17 -4 8 4 5 8 5 -6 -12 -1 -8 6 14 9 -2 -2 -16 -16 -13 1 16 18 15 5 -8 -12 2 8 9 14 18 9 -10 -8 0 4 23 10 18
6512 18 10 9 -16 -2 5 9 16 18 9 -12 -5 -11 8 8 8 12 13 -10 -9 -9 -5 3 0 4 15 4 -12 -18 -9 5 13 4 8 -6 -5 -12 -6 -9 1 3 15 -1 -13 -8 -28
6557 -28 -9 11 9 21 10 1 -2 -3 -15 9 5 15 4 1 -3 -18 2 27 18 11 14 4 -5 -2 -8 8 11 8 15 4 -8 -10 -11 0 -2 1 17 4 -10 -21
6597 -21 -1 4 2 14 23 8 -5 -4 -21 -12 -2 9 9 1 5 -18 -33 -5 4 -5 8 6 7 0 -15 -6 -7 -13 6 5 -3 -4 -17 -10 -4 7 17 18 13 0 -7 6
6639 6 0 10 20 12 19 -5 -6 -15 2 -3 7 12 16 -5 -7 -10 -2 -8 -2 15 -5 -3 -2 -7 -5 -8 1 4 3 5 -5 -6 -11 -7 1 12 20 9 -10 -9 -12 -8 3 13 15 10 -6
6686 -6 -1 3 5 -5 11 20 9 5 4 -8 -2 4 13 11 11 11 9 -4 -12 1 5 12 19 15 -5 1 -10 -3 4 8 6 11 10 15 -6 -1 -1 9 -9 7 -9 -10 -19 -7 -8 0 11
6733 11 12 8 -1 -7 1 -3 8 20 12 15 -2 1 -8 -15 8 17 16 27 4 -5 -12 -8 8 16 16 7 4 0 -10 -6 7 24 19 23 16 -4 -6 4 10 5 10 17 12 1 -12 -7
6779g%K1Jj4JJj7nJ2J0kQonlj3P%K2knNrj2J3kOLnjkqJpK5Qqkj1jKqK0kKrl%j3
6828a4NJ4OKJ4k8Oj8KK0Pmjrj4jRKPj0K5j0nqj0PJJ8qLqnj7J2J0OMLoolLLJ6j2
$$ plain form
6779 -7 -7 14 15 1 2 3 -14 -19 -7 3 1 9 3 -2 -5 -18 -11 -11 11 9 4 9 0 -12 1 -1 5 8 3 2 0 -8 -7 -14 11 19 11 9 -2 -3 -1 -9 11 9 11 2 -1 -1 -14
6828 -14 -9 5 11 13 27 -1 5 -13 -11 9 16 12 11 2 -12 -13 -4 -2 5 -5 20 10 5 -3 -13 -6 -5 13 5 8 0 -5 -22 -10 0 6 10 13 7 1 -2 1 4 20 8
$$ [...]
8191A0
##END NTUPLES=NMR FID
##END=
