##TITLE=1H_LR-579-H1-CR2
 D2O, 8 sc, 
 25.6.2019
##JCAMPDX= 6.0         $$ Bruker NMR JCAMP-DX V2.0
##DATA TYPE= NMR FID
##DATA CLASS= NTUPLES
##ORIGIN= UXNMR, Bruker Analytische Messtechnik GmbH
##OWNER= root
$$ XWIN-NMR		Version 3.5
$$ Tue Jun 25 13:49:13 2019 Russian Standard Time (UT+4h)  she@DPX200
##.OBSERVE FREQUENCY= 200.13155
##.OBSERVE NUCLEUS= ^1H
##.DELAY= (6, 6)
##.ACQUISITION MODE= SIMULTANEOUS
##.ACQUISITION SCHEME= undefined
##.AVERAGES= 8
##.DIGITISER RES= 18
##SPECTROMETER/DATA SYSTEM= spect
##.PULSE SEQUENCE= zg30
##.SOLVENT NAME= D2O
##.SHIFT REFERENCE= (INTERNAL, D2O, 0, 15.7039)
##AUDIT TRAIL= $$ (NUMBER, WHEN, WHO, WHERE, WHAT)
$$ ##TITLE= Audit trail, XWIN-NMR		Version 3.5
$$ ##JCAMPDX= 5.01
$$ ##ORIGIN= Bruker BioSpin GmbH
$$ ##OWNER= she
$$ F:/spectra/data/she/nmr/H-F/1/audita.txt
$$ ##AUDIT TRAIL=  $$ (NUMBER, WHEN, WHO, WHERE, WHAT)
(   1,<2019-06-25 13:48:10.59 +0400>,<she>,<DPX200>,
      <created by zg, POWCHK disabled, PULCHK disabled
       configuration hash MD5:
       00 E9 B6 7A A2 85 ED C7 34 08 36 98 17 FE 4E 26
       data hash MD5: 16K
       C9 41 D6 D1 33 CE 79 79 C8 71 6E 49 7D 77 54 B8>)
$$ ##END=
$$ 
$$ hash MD5
$$ 94 02 BD 9F BA B0 4A 61 99 6D 17 6B E6 7A A1 EF
##$RELAX= 
##$RELAX= 
##$RELAX= 
##$RELAX= 
##$RELAX= 
##$RELAX= 
$$ Bruker specific parameters
$$ --------------------------
##$DU= <F:/spectra>
##$EXPNO= 1
##$NAME= <H-F>
##$PROCNO= 1
##$TYPE= <nmr>
##$USER= <she>
##$AMP= (0..31)
100 100 100 100 100 100 100 100 100 100 100 100 100 100 100 100 100 100 
100 100 100 100 100 100 100 100 100 100 100 100 100 100 
##$AQSEQ= 0
##$AQ_mod= 1
##$AUNM= <au_zg>
##$AUTOPOS= <>
##$BF1= 200.13
##$BF2= 200.13
##$BF3= 200.13
##$BF4= 200.13
##$BF5= 200.13
##$BF6= 200.13
##$BF7= 200.13
##$BF8= 200.13
##$BYTORDA= 1
##$CFDGTYP= 0
##$CFRGTYP= 5
##$CHEMSTR= <none>
##$CNST= (0..31)
1 1 145 1 1 1 1 1 1 1 1 1 1 1 1 1 1 1 1 1 1 1 1 1 1 1 1 1 1 1 1 1 
##$CPDPRG= <>
##$CPDPRG1= <>
##$CPDPRG2= <>
##$CPDPRG3= <>
##$CPDPRG4= <mlev>
##$CPDPRG5= <mlev>
##$CPDPRG6= <mlev>
##$CPDPRG7= <mlev>
##$CPDPRG8= <mlev>
##$CPDPRGB= <>
##$CPDPRGT= <>
##$D= (0..31)
0 1.2 0 0 0 0 0 0 0 0 0 0.03 0 0 0 0 0 0 0 0 0 0 0 0 0 0 0 0 0 0 0 0 
##$DATE= 1561456089
##$DBL= (0..7)
120 120 120 120 120 120 120 120 
##$DBP= (0..7)
150 150 150 150 150 150 150 150 
##$DBP07= 0
##$DBPNAM0= <>
##$DBPNAM1= <>
##$DBPNAM2= <>
##$DBPNAM3= <>
##$DBPNAM4= <>
##$DBPNAM5= <>
##$DBPNAM6= <>
##$DBPNAM7= <>
##$DBPOAL= (0..7)
0.5 0.5 0.5 0.5 0.5 0.5 0.5 0.5 
##$DBPOFFS= (0..7)
0 0 0 0 0 0 0 0 
##$DE= 6
##$DECBNUC= <off>
##$DECIM= 24
##$DECNUC= <off>
##$DECSTAT= 4
##$DIGMOD= 1
##$DIGTYP= 9
##$DL= (0..7)
0 120 120 120 120 120 120 120 
##$DP= (0..7)
150 150 150 150 150 150 150 150 
##$DP07= 0
##$DPNAME0= <>
##$DPNAME1= <>
##$DPNAME2= <>
##$DPNAME3= <>
##$DPNAME4= <>
##$DPNAME5= <>
##$DPNAME6= <>
##$DPNAME7= <>
##$DPOAL= (0..7)
0.5 0.5 0.5 0.5 0.5 0.5 0.5 0.5 
##$DPOFFS= (0..7)
0 0 0 0 0 0 0 0 
##$DQDMODE= 0
##$DR= 18
##$DS= 0
##$DSLIST= <SSSSSSSSSSSSSSS>
##$DSPFIRM= 0
$$ [...]
##$SUBNAM2= <"">
##$SUBNAM3= <"">
##$SUBNAM4= <"">
##$SUBNAM5= <"">
##$SUBNAM6= <"">
##$SUBNAM7= <"">
##$SUBNAM8= <"">
##$SUBNAM9= <"">
##$SW= 24.9336996594482
##$SWIBOX= (0..15)
0 0 2 0 0 0 0 0 0 0 0 0 0 0 0 0 
##$SW_h= 4990.01996007984
##$TD= 16384
##$TD0= 1
##$TE= 0
##$TE2= 300
##$TE3= 300
##$TEG= 300
##$TL= (0..7)
0 120 120 120 120 120 120 120 
##$TP= (0..7)
150 150 150 150 150 150 150 150 
##$TP07= 0
##$TPNAME0= <>
##$TPNAME1= <>
##$TPNAME2= <>
##$TPNAME3= <>
##$TPNAME4= <>
##$TPNAME5= <>
##$TPNAME6= <>
##$TPNAME7= <>
##$TPOAL= (0..7)
0.5 0.5 0.5 0.5 0.5 0.5 0.5 0.5 
##$TPOFFS= (0..7)
0 0 0 0 0 0 0 0 
##$TUNHIN= 0
##$TUNHOUT= 0
##$TUNXOUT= 0
##$USERA1= <user>
##$USERA2= <user>
##$USERA3= <user>
##$USERA4= <user>
##$USERA5= <user>
##$V9= 5
##$VALIST= <valist>
##$VCLIST= <CCCCCCCCCCCCCCC>
##$VD= 0
##$VDLIST= <DDDDDDDDDDDDDDD>
##$VPLIST= <PPPPPPPPPPPPPPP>
##$VTLIST= <TTTTTTTTTTTTTTT>
##$WBST= 1024
##$WBSW= 4
##$XGAIN= (0..3)
0 0 0 0 
##$XL= 0
##$YL= 0
##$YMAX_a= 223607
##$YMIN_a= -346635
##$ZGOPTNS= <>
##$ZL1= 120
##$ZL2= 120
##$ZL3= 120
##$ZL4= 120
##$ABSF1= 10
##$ABSF2= 0
##$ABSG= 5
##$ABSL= 3
##$ALPHA= 0
##$AQORDER= 0
##$ASSFAC= 0
##$ASSFACI= 0
##$ASSFACX= 0
##$ASSWID= 0
##$AUNMP= <proc_1d>
##$AZFE= 0.1
##$AZFW= 0.1
##$BCFW= 1
##$BC_mod= 2
##$BYTORDP= 1
##$COROFFS= 0
##$CY= 11.3945322036743
##$DATMOD= 1
##$DC= 2
##$DFILT= <>
##$DTYPP= 0
##$F1P= 18.9103706918063
##$F2P= -1.10871071338519
##$FCOR= 0.5
##$FTSIZE= 0
##$FT_mod= 4
##$GAMMA= 1
##$GB= 0.15
##$INTBC= 1
##$INTSCL= 1
##$ISEN= 128
##$LB= 0.24
##$LEV0= 0
##$LPBIN= 0
##$MAXI= 10000
##$MC2= 0
##$MEAN= 0
##$ME_mod= 0
##$MI= 1.114404
##$NCOEF= 0
##$NC_proc= 0
##$NLEV= 6
##$NOISF1= 3.799351
##$NOISF2= 2.8
##$NSP= 1
##$NTH_PI= 0
##$NZP= 0
##$OFFSET= 15.70392
##$PC= 1
##$PHC0= -8496.691
##$PHC1= 8.800971
##$PH_mod= 1
##$PKNL= yes
##$PPARMOD= 0
##$PSCAL= 0
##$PSIGN= 0
##$REVERSE= no
##$SF= 200.130013532006
##$SI= 16384
##$SIGF1= 3
##$SIGF2= 2
##$SINO= 400
##$SIOLD= 16384
##$SREGLST= <1H.CDCl3>
##$SSB= 0
##$STSI= 0
##$STSR= 0
##$SW_p= 3612.71676300578
##$SYMM= 0
##$S_DEV= 0
##$TDeff= 0
##$TDoff= 0
##$TI= <>
##$TILT= no
##$TM1= 0
##$TM2= 0
##$TOPLEV= 0
##$USERP1= <user>
##$USERP2= <user>
##$USERP3= <user>
##$USERP4= <user>
##$USERP5= <user>
##$WDW= 1
##$XDIM= 8192
##$YMAX_p= 0
##$YMIN_p= 0
$$ End of Bruker specific parameters
$$ ---------------------------------
##NTUPLES= NMR FID
##VAR_NAME=  TIME,          FID/REAL,        FID/IMAG
##SYMBOL=    X,             R,               I
##VAR_TYPE=  INDEPENDENT,   DEPENDENT,       DEPENDENT
##VAR_FORM=  AFFN,          ASDF,            ASDF
##VAR_DIM=   8192,          8192,            8192
##UNITS=     SECONDS,       ARBITRARY UNITS, ARBITRARY UNITS
##FACTOR=    0.0002004,     1,               1
##FIRST=     0,             0,               0
##LAST=      1.6414764,     0,               0
##MIN=       0,             -346635,         0
##MAX=       1.6414764,     223607,          0
$$ Real data points
##PAGE= N=1
##DATA TABLE= (X++(R..R)), XYDATA
$$ [...]
1967b08k75J54Q94J98q16n76J6M36M85p82N56j3M59l63p12K62J51M98J73j63j22
$$ -208 -483 -329 565 763 -53 -629 -613 -177 308 -474 82 69 528 165 -547 -285 -134 364 537 374 252
1988B52m37K29j10m03K47O81K07m51k67n40J83P78j25l94M77j3J41p96n94P54
$$ 252 -185 44 -66 -469 -222 459 666 215 -52 -592 -409 369 244 -150 327 314 455 -341 -935 -181
2008a81L49O23o78m68O05Q6l86l65J15O28J03o4m77j61j51J95j97J14O0N93K30
$$ -181 168 791 113 -355 250 336 -50 -415 -300 328 431 367 -110 -271 -422 -227 -424 -310 -250 343 573
2029E73p22n9L8P0J40l6M5L77k28l99k56k73O41N12j77rl39M45j04m89l39P88
$$ 573 -149 -208 -170 -100 40 4 49 426 198 -201 -457 -730 -89 423 246 237 -102 343 239 -250 -589 199
2051A99L1N08n17l92RO3K29m95N44O3L56n47l91k09N22K03j67j73L47N5j36m47
$$ 199 230 738 221 -171 -162 -99 130 -365 179 242 598 51 -340 -549 -27 176 9 -164 183 238 102 -345
2073c45l28M68K11R2j7l76L19K7k15l78L27M65m6O6k25l64M5L64l53j02N49L56
$$ -345 -673 -205 6 98 81 -295 24 51 -164 -542 -215 250 204 270 45 -319 -274 90 -263 -365 184 540
2095E40l0m74k59K72n5K66o40K09L35j93J49o45M40P9M83k04j18j75K25L1j76
$$ 540 510 36 -223 49 -6 260 -380 -171 164 -29 120 -525 -85 -6 477 273 155 -20 205 236 60
2116F0l20M56K54r5n10l07Q6N16J8l84N71M8j41n61q0P0N40j06l6j06K47j13o6
$$ 60 -260 196 450 355 -155 -462 -376 140 158 -226 345 393 252 -309 -389 -319 221 115 79 -27 220 107 41
2139D1n06L65O9P53n09l16P8m22O40l12k04K10L12J36p1k88l61M43O4k68J86J57
$$ 41 -465 -100 -31 722 213 -103 -25 -447 193 -119 -323 -113 199 335 264 -24 -385 58 122 -146 40 197
2161A97j09j00o7l54K04%L68O8l57L12q8j33m08O15p5K67j10j58j83M33m50Lo3
$$ 197 88 -12 -79 -433 -229 -229 139 207 -150 162 74 -59 -467 148 73 340 230 72 -111 322 -128 -125 -188
2184a88L87M0q3q8l67L16R1j9j1J4j72P7P0l54k12L83K49J69m50J66%k0j25L4
$$ -188 199 239 156 68 -299 17 108 89 78 92 -80 -3 67 -287 -499 -116 133 302 -148 18 18 -2 -127 -93
2208i3P0M24k01o4l16L7l4K29K06k88Q2K14j10m68J32k84O36L16m80N3K8k31L78
$$ -93 -23 401 200 136 -180 -143 -177 52 258 -30 52 266 156 -312 -180 -464 172 488 8 61 89 -142 236
2231B36n2k35K52R5l94M6L8j99q4P0J87J95j08j29Q3k48J97K45N0k98J08O9j07
$$ 236 184 -51 201 296 -98 -52 -14 -213 -297 -227 -40 155 47 -82 1 -247 -50 195 245 -53 55 124 17
2254A7n2k45q6N44l22J28r6J45K5k56K15l00N04J32j21l16m8R9K34j58k46K01
$$ 17 -35 -280 -366 178 -144 -16 -112 33 58 -198 17 -283 221 353 232 -84 -132 -33 201 43 -203 -2
2276bM83k65k31j65j06L05J41q0P5K18j69kl13J73O5J44r8j77j59pM66m30j6K4
$$ -2 481 216 -15 -180 -286 19 160 80 155 373 204 202 -111 62 127 271 173 -4 -163 -170 296 -134 -150 -126
2300a26L97R3n41q5J50M29j47n3Kn3r5L9k14N0l0L18j12l83M27R7j80l91QO01
$$ -126 271 364 -177 -262 -112 317 170 117 119 66 -29 10 -204 -154 -184 134 22 -361 66 163 -17 -408 -400 201
2324B01K61k80j15j63L34k0k89qL03Q9o2k87j48k78M03J91m96M27p4K8R8k48n2
$$ 201 462 182 67 -96 238 218 -71 -79 224 313 251 -36 -184 -462 -59 132 -364 63 -11 17 115 -133 -185
2347a85K71j73L84n57k8K26K37l15r8J10J40p8P6k15N3M7M0k28n1j3M24Q3o05
$$ -185 86 -87 297 -260 -288 -62 175 -140 -238 -128 12 -66 10 -205 -152 -105 -65 -293 -344 -357 67 150 -455
2370d55N97m5j53J07M7k13K91k89J06l33K82j5R3R8k9l0L65J9m84L5K53J06k06
$$ -455 142 97 -56 51 98 -115 176 -113 -7 -340 -58 -73 20 118 89 59 424 443 -41 -6 247 353 147
2393A47k51Q6LJ00q2q2J12L9M17o05n8j90M07J90k97JM5Or9j02J13K12J56l5k04
$$ 147 -104 -18 -15 85 3 -79 33 72 489 -116 -174 -364 43 233 -64 -63 -18 -12 -111 -213 -100 112 268 233 29
2418B9j33K61k45J9j43oK28m1n8K7Q8j52L33j58j65K79o4k65k61p3N59k54K56
$$ 29 -104 157 -88 -69 -212 -218 10 -31 -89 -62 26 -126 207 49 -116 163 99 -166 -427 -500 59 -195 61
2441F1k60K67L15j21k91k74L19J37L02k04l91K43j66Q0q5m6L75j01j30l27QJ49
$$ 61 -199 68 383 262 -29 -303 16 153 455 251 -140 103 -63 17 -68 -114 261 160 30 -297 -289 -140
2463a40L28l81K62k28K70k36K24n55M23K59K4L1l69N17n16m2M0J06m9N6Om34L87
$$ -140 188 -193 69 -159 111 -125 99 -456 -33 226 250 281 -88 429 -87 -129 -89 17 -32 24 30 -404 -17
2486a7l2j07K3o8L67k0m16M30j82j87J06O5PK45j30O8j88k35L46M1j12J75k18
$$ -17 -49 -156 -133 -201 166 146 -270 160 -22 -209 -103 -38 -31 214 84 152 -36 -271 75 116 4 179 -39
2509c9r1L30k93p0P7J14R4n5r3j19K42r3r9n5J50K36m4k96j40j58K50J46qk89
$$ -39 -130 200 -93 -163 -86 28 122 67 -26 -145 97 4 -95 -150 0 236 192 -104 -244 -402 -152 -6 -14 -303
2533c03J45M47k57q8j09N6K09m98M70j81K04J38l39j55K96LR6j44j75L60K26n13
$$ -303 -158 289 32 -56 -165 -109 100 -398 72 -109 95 233 -106 -261 35 38 134 -10 -185 175 401 -112
2555a12J18O0K40k57l4k74M39kj02J78l04j42l2N18j92k23Jk08M97o3j87J02l69
$$ -112 6 66 306 49 15 -259 180 178 76 254 -50 -192 -224 294 102 -121 -120 -328 169 106 -81 21 -348
2578c48lK73p0J34R3j80K26j79R7J8j31J23jJ40qj74p1M5P1q8P3K36j72J11k65
$$ -348 -351 -78 -148 -14 79 -101 125 -54 43 61 -70 53 52 192 184 10 -61 -16 55 -33 40 276 104 215 -50
2603e0r2p7K36J79K1j02l36L03Q1J10n53M5K61K01k95j52L76J93m23j17L50j64
$$ -50 -142 -219 17 196 217 115 -221 82 163 273 -280 -235 26 227 -68 -220 156 349 -74 -191 159 -5
2625eJ0K6l85J55L41l91o4j72N36P7j70k78N47L28n62L89l42r1K0p8L2K7R1J18
$$ -5 5 31 -354 -199 142 -249 -313 -485 51 128 -42 -320 227 555 -7 382 40 -51 -31 -109 -77 -50 41 159
2649A59k33J58J52l01K15k85J27J80k88J0J99k19k31N32j90K29m7j38J25j04j31
$$ 159 -74 84 236 -65 150 -135 -8 172 -116 -106 93 -126 -357 175 -15 214 167 29 154 50 -81
2670h1q4K28k2J04l33L2K77j27j8j99J13J70L1L4l88K25K01j04K4O3J82k77l5
$$ -81 -165 63 41 145 -188 -156 121 -6 -24 -223 -110 60 91 125 -263 -38 163 59 83 146 328 51 16
2693A6M9k92L29k86M43l31j50J24K36J45n66K80j8j87K42K69k61j87K03m17K38
$$ 16 65 -227 102 -184 259 -72 -222 -98 138 283 -283 -3 -21 -208 34 303 42 -145 58 -359 -121
2714a21p9K50R7k91o5p1N40l15J31k94J39M7j7J23j5O8j12J19n96K43J50L25j97
$$ -121 -200 50 147 -144 -209 -280 260 -55 76 -218 -79 -32 -49 74 59 127 15 134 -462 -219 -69 256 59
2737E9L16k60j55J61p4l6q1K73J12m34J50O7K6k58J59j83l4J1K47n4l92O21l66
$$ 59 375 115 -40 121 47 11 -70 203 315 -119 31 98 124 -134 25 -158 -192 -181 66 12 -380 241 -125
2760a25N5O9Oj03K76k29k01k4M67q1P7j57J61o6k66J6L0Jj6J13j6Q3KJ05j56K1
$$ -125 -70 -1 5 -98 178 -51 -252 -276 191 110 187 30 191 125 -141 -125 -95 -94 -110 3 -13 70 72 177 21 42
2786D2P1j68K52j45J5j35J65K8k70K19k32j8K31j10m31M71m9K9p7K86q3L3k63
$$ 42 113 -55 197 52 67 -68 97 125 -145 74 -158 -176 55 -55 -486 -15 -64 -35 -112 174 91 124 -139
2809a39j4pL51Q2j94j71Qj52L0J42O1K13j99J04J6l07K88K9j97K68l08R4k07K7
$$ -139 -153 -160 191 273 79 -92 -84 -236 -206 -64 -3 210 11 115 131 -176 112 141 -56 212 -96 -2 -209 -182
2833a82M35j21j25J13j50J05k56K15J85l57N5K79J34l51P7m38N04l2j22M9L15
$$ -182 253 132 7 120 -30 75 -181 34 219 -138 -83 196 330 -21 56 -382 122 90 -32 17 332
2854C32n21l2L92k70J6K47l18L2R9J01J45L9j94k38Q9J28l5k81N56k80K64m17
$$ 332 -189 -221 171 -99 -83 164 -154 -122 -23 78 223 262 68 -170 -81 47 12 -269 287 7 271 -146
2876a46j71M16k14J01J1j85P2J32k11K68NK6k30N82l82Jj82j4K60j71o9%m6L35
$$ -146 -317 99 -115 -14 -3 -188 -116 16 -195 73 78 104 -126 456 74 75 -107 -121 139 -32 -101 -101 -147 188
2900A88l57J3K78J16k4k5p4R0k68K32k65N7O6k58j1L37L1k87l1J22J7L55m24L34
$$ 188 -169 -156 122 238 214 189 115 205 -63 169 -96 -39 27 -231 -242 95 126 -161 -192 -70 -53 302 -122 212
2924B12k44J69k07k3nJ44k55K07q1K45K8l63J78p4J05q5j22K37k40J03j1J05K05
$$ 212 -32 137 -70 -93 -98 46 -209 -2 -83 162 190 -173 5 -69 36 -49 -171 66 -174 -71 -82 23 228
2947B28k85Q0o3J33J81P9j46j80k2M64m97K01N5k37o5K7O6J09n7l1j81J78J75
$$ 228 -57 23 -40 93 274 353 207 27 5 469 -28 173 228 -9 -74 -47 19 128 71 40 -141 37 212
2970B12n23M23k07J59j58K71j50j64j26J64J29q1J58o3k36L58l14q7K95J63j69
$$ 212 -311 112 -95 64 -94 177 27 -137 -263 -99 30 -51 107 44 -192 166 -148 -235 60 223 54
2991E4k87k05M32K3n9J48k38l5K07j6j40R8J55j76J79k50J80R0Ml02K14j36L1
$$ 54 -233 -438 -6 17 -42 106 -132 -167 40 24 -116 -18 137 -39 140 -110 70 160 164 -138 76 -60 -29
3014b9L55m23K9K67J74k67l0K48l84N2J67l07J06r1L37k10r1O3j11L14J55l61
$$ -29 326 -97 -68 199 373 106 76 324 -60 -8 159 -148 -42 -133 204 -6 -97 -34 -145 169 324 -37
3036c7r9K04j05k46K99j67J85j99K63L9m65L04k9N9R5k02J8J12j36p4J02N6L9
$$ -37 -136 68 -37 -283 16 -151 34 -165 98 137 -328 -24 -53 6 101 -101 -83 29 -107 -181 -79 -23 16
3059A6Kk3p9M1j4p9K97m44J84J98O9n35O37k94l0K02N7%j99K59l99K8K67m58J5
$$ 16 18 -5 -84 -43 -57 -136 161 -283 -99 99 168 -367 270 -24 -54 148 205 205 6 265 -134 -106 161 -297 -282
3084b82J07K14p0N9l26J50J43J13j23L1L2k22p3oL44K19n15J97r1J76m33K61J97
$$ -282 -175 39 -31 28 -298 -148 -5 108 -15 16 48 -174 -247 -253 91 310 -205 -8 -99 77 -356 -95 102
3107A02L03n13J30k38L44p7j65j3Q5j27q0K18p4J25o7L83k16k4J96l75J07J74
$$ 102 405 -108 22 -216 128 51 -114 -127 -42 -169 -249 -31 -105 20 -47 336 120 96 292 -83 24 198
3129A98k23M53m70J14m7Q8j22l2L82j34N5k92J41J53m34J66j07q1O01k71l00J81
$$ 198 -25 428 -42 72 25 113 -9 -41 341 207 262 -30 111 264 -170 -4 -111 -192 409 138 -162 19
3151A9J0M7n05K08J80K17k04k0M75n66n7P1K1J5j8J28R1l25N6J88j3k15R3L67
$$ 19 29 76 -429 -221 -41 176 -28 -48 427 -139 -196 -125 -104 -89 -107 21 112 -213 -157 31 18 -197 -104 263
3175B63j93m1J77j42N5q6J9l36K03K79q5l8k68J67J26n5k40L38q8l0j09P2n9J10
$$ 263 70 29 206 64 119 33 52 -284 -81 198 113 75 -193 -26 100 45 -195 143 55 25 -84 -12 -71 39
3199C9j23P7PK70m9l35p7K60j41J58J50Ml45M39k90k0P0j51m4q0L52k38k0j13
$$ 39 -84 -7 0 270 221 -114 -191 69 -72 86 236 240 -105 334 44 24 94 -57 -101 -181 171 -67 -87 -200
3223b00K40k1k96J83j79O64m12m04N18k16j67N06p8l09M09j76k19K97j53n2K33
$$ -200 40 19 -277 -94 -273 391 -21 -425 93 -123 -290 216 138 -171 238 62 -157 140 -13 -65 168
3244A68l18k9K89l00RJ23L41m21L52k35n3P6j35o8L16j14j12N6K37m17M50m49
$$ 168 -150 -179 110 -190 -181 -58 283 -138 214 -21 -74 2 -133 -201 115 1 -111 -55 182 -235 215 -234
3266b34M38j17k41M56m35lL44o5R0l79K26k04P3K99l46J32K7j03p7M3o4J25J07
$$ -234 204 87 -154 302 -133 -136 208 143 233 -146 80 -124 -51 248 -98 34 61 -42 -119 -76 -140 -15 92
3289I2k7r0K83l60l9j96J80J45K21m03L55j5k05L19j89J48j95N9K8K99n12J97
$$ 92 65 -25 258 -102 -141 -337 -157 -12 209 -194 161 146 -59 260 71 219 24 83 111 410 -102 95
3311I5J01l84K57k11M04l48j76L66Q2l22k4K09r5l38J48q7J15J94q8J93o4m1J33
$$ 95 196 -188 69 -142 262 -86 -262 104 186 -136 -160 49 -46 -384 -236 -323 -208 -14 -102 91 27 -14 119
3334A19r5q7L18m56J01J47j88j45M59O1l33L49j58k67p5J72M4nK63j17k20K10
$$ 119 24 -63 255 -201 -100 47 -141 -286 173 234 -99 250 92 -175 -250 -78 -34 -39 224 107 -113 97
3356I7k22l1J0n5m2M14k17o2k4N0j03K24n4R4Q3k61M15l14L48r7o8l20K53l6J86
$$ 97 -125 -156 -146 -201 -243 171 -46 -108 -132 -82 -185 39 -15 79 162 -99 316 2 350 253 185 -135 118 82 268
3381B68l21N17o49J84k18M32j36j58K07l44J35J43J89j30l95M65J0k7j44m9n8
$$ 268 -53 464 -185 -1 -219 213 77 -81 126 -218 -83 60 249 119 -276 189 199 172 28 -21 -79
3402g9j70M07j60Q2j03Q2J2o4O4J42k22m1N7J73o7rp9Q1J13n27M27j48j3Q1J34
$$ -79 -249 158 -2 80 -23 59 71 7 71 213 -9 -50 7 180 113 104 25 106 219 -308 119 -29 -42 39 173
3427A73k73K46J63k74J32l10n8mK03K36J7n8k15P9J85M0P2l08p0J24q1K3k37L34
$$ 173 -100 146 309 35 167 -143 -201 -205 -2 234 251 193 -22 57 242 282 354 46 -24 100 19 42 -195 139
3451A39l5j76L31NO1j81J14p0O1m10L6%M08l29J67J28l14M0q4O8R7R7J7k14J72
$$ 139 104 -72 259 264 325 144 258 188 249 -161 -125 -125 283 -46 121 249 -65 -25 -109 -41 56 153 170 -44 128
3476A28k61Q1J31m32P70m07k02O6k2jL84K62l79m01K87M5j32Q0J0J1r8P7n1M39
$$ 128 -133 -52 79 -353 417 10 -192 -126 -148 -149 235 497 118 -283 4 49 -83 -3 7 18 -80 -3 -54 385
3500C85l38j09j88J94m1O0K34j47k75K13J08l60N5L53r2P4L4m56K71r7J72l07
$$ 385 47 -62 -250 -56 -97 -37 197 50 -225 -12 96 -264 -209 144 52 126 160 -296 -25 -122 50 -257
3522b57M68R5m07l0J30o9o0J53J57j27N1m30L71J4o5k2N2J25m50K94l42K74j83
$$ -257 211 306 -101 -131 -1 -70 -130 23 180 53 104 -326 45 59 -6 -28 24 149 -301 -7 -349 -75 -258
3545b58R9m2J30j00p2J2J13L9J77j06J0L80k30r2o4L85j68o7l67M0J39p9M09j46
$$ -258 -159 -201 -71 -171 -243 -231 -118 -79 98 -8 2 382 152 60 -4 381 213 146 -221 -181 -42 -121 288 142
3569A42oK4k21L73k14n4R1J05j69O1k02L93m26L22m94K22K5k7m8J76j79Q2j03
$$ 142 136 160 -61 312 98 44 135 240 71 132 -70 323 -103 219 -275 -53 -28 -55 -103 73 -106 -24 -127
3592a27p8J04k14M61n89J15K88K00j86M4j13Q8K83k07j96J98n4J61m04M43k24
$$ -127 -205 -101 -315 146 -443 -328 -40 160 -26 18 -95 -7 276 69 -127 71 17 178 -226 217 -7
3613gJ23q9K61o33K95J33l48M50m74J44K9J15J43m60M29m16M35j03o0Q6J45l34
$$ -7 116 27 288 -345 -50 83 -265 185 -289 -145 -116 -1 142 -318 111 -305 130 27 -33 53 198 -136
3635a36K9J71l12J35J9K39J75q2m82J30L18k78K56l15K17j59K43k77J50O0J02
$$ -136 -107 64 -248 -113 -94 145 320 238 -244 -114 204 -74 182 -133 84 -75 168 -109 41 101 203
3656B03j32l19M73j55L03k70j09J18j06L29m21J01k21L68K34m42rK85j40J80k0
$$ 203 71 -248 225 70 373 103 -6 112 6 335 -86 15 -206 162 396 -46 -55 230 90 270 250
3677B50k75k88K62N1j24L41j55j64K13k46RM23k04M0j88l16L65J62j53j86M07
$$ 250 -25 -313 -51 0 -124 217 62 -102 111 -135 -126 297 93 133 -55 -371 -6 156 3 -183 224
3698B24j20o2k90n8L02K11l61n5N24l43j50K07k8J7k30Q8K38J44K1k76J25J03
$$ 224 104 42 -248 -306 -4 207 -154 -209 315 -28 -178 29 1 18 -212 -124 114 258 279 3 128 231
3720B31rl8j50j34Q0J40J16k89Lj04O7J3q9L16k4Nj78K06k68j9L71m42J23o1K17
$$ 231 222 184 34 -100 -20 120 236 -53 -50 -154 -87 -74 -163 153 129 134 -44 162 -106 -125 246 -196 -73 -134 83
3745H3l32J65J18j65K42j90J3M50l88K27j95k19K21j43K02L18k07l03K10o6j4
$$ 83 -249 -84 34 -131 111 -79 -66 384 -4 223 28 -191 30 -113 89 407 200 -103 107 41 27
3766B7m42j27L67K24q0j94M27o41N47J61J1k33k62J80m9J28j38P9r0J6N0j84J62
$$ 27 -415 -542 -175 49 -31 -225 202 -439 108 269 280 47 -215 -35 -84 44 -94 -15 -105 -89 -39 -223 -61
3789f1o1j6L0K8J75J8n17L45k16L09q7P7k64L24j12k4l2l4m6J44r6L66k06r1J97
$$ -61 -122 -138 -108 -80 95 113 -404 -59 -275 34 -53 24 -240 84 -28 -52 -84 -118 -164 -20 -116 250 44 -47 150
3814A50l09J69K78j7j43q5r2J48j19O8J06j81m5n2L43l0r8l18L49k09P6R3j61
$$ 150 -159 10 288 271 128 43 -49 99 -20 48 154 -27 -72 -124 219 189 91 -227 122 -87 -11 82 -79
3837g9P6k39M36j52j7J93n8k25K88k44R5k13K7K40K3Q2k72M3k27K57j36J4J22
$$ -79 -3 -242 194 42 25 218 160 -65 223 -21 74 -139 -112 128 151 233 -39 4 -223 34 -102 -88 34
3860C4m88L83K66j71l84K98l49M20K0mm9k69K27RL50q0k55L05l08j0J87j73K9
$$ 34 -454 -71 195 24 -360 -62 -411 9 29 25 -24 -293 -66 -57 293 213 -42 263 -45 -55 132 -41 -12
3883a2r1K31j19K4oj68L94k30K15k82J9j5K75p8k06L41k94m8J85P0k19R6k2l24
$$ -12 -103 128 9 33 27 -141 253 23 238 -44 -25 -40 235 157 -49 292 -2 -50 135 205 -14 82 60 -264
3907b64L62j25n8J39r7l53K08J77j7J51J00k55N6j34J8K91j2j04j47J33J68k89
$$ -264 98 -27 -85 54 -43 -396 -188 -11 -28 123 223 -32 24 -110 -92 199 187 83 -64 69 237 -52
3929e2J3j02M31o43K71R8J86l4m05K79J13l5P5l02J02K65m94K24k10L67n4k8J19
$$ -52 -39 -141 290 -353 -82 16 202 168 -237 42 155 120 195 -107 -5 260 -234 -10 -220 147 93 65 184
3952A84k08Q6n5J46l14M26l18J78k77J4L94k42R5K48k41m8k43J91j96N08N2m34
$$ 184 -24 62 7 153 -161 265 -53 125 -152 -138 256 14 109 357 116 68 -175 16 -180 328 380 -54
3974e4k17J95j40J93K0j30K16j63K67p0L70n91j88K93k71L61k11k9J61L75k63
$$ -54 -271 -76 -216 -23 -3 -133 83 -80 187 117 487 -104 -292 1 -270 91 -120 -149 12 387 124
3995A24l44M58n06M74k88N3OM4L5R9j29m0l4k07M92j79J30j00J7m0j93K06o6O8
$$ 124 -220 238 -268 206 -82 -29 -23 21 56 155 26 -14 -48 -255 237 58 188 88 105 65 -128 78 12 80
4019H0rl2J51m94M32l3k01J57j72m0J68J50j04J47m88K89j26O1O89p75P4J83r7
$$ 80 71 39 190 -304 128 95 -106 51 -121 -161 7 157 53 200 -288 1 -125 -64 625 -150 -76 107 10
4042A0O0k67M80m90L37l35QL98l88K20j69J27p2o2J51l2K36l03L00l0J1k51Q6
$$ 10 70 -197 283 -207 130 -205 -197 201 -187 33 -136 -9 -81 -143 8 -24 212 -91 209 179 190 -61 25
4065B5l11M33l7k58k7L12k98K22n5P5J3l01J4J05Q1p5J54M7k81P8J06J27o5r5
$$ 25 -286 147 110 -148 -175 137 -161 61 6 81 94 -207 -193 -88 -7 -82 72 119 -162 -84 22 149 84 -11
4089a1M8J57k06m7J51o0p5j31O9L75l40j51J32j29K57K3j31J69J00j94k4o6m6
$$ -11 37 194 -12 -59 92 32 -43 -174 -105 270 -70 -221 -89 -218 39 62 -69 100 200 6 -18 -84 -130
4112a30J55l46J78k7K79k69J70N5q4j34Q7J9M3r1rj08L42q1J83n58K78J41k39
$$ -130 25 -321 -143 -170 109 -160 10 65 -19 -153 -66 -47 -4 -95 -104 -212 130 49 232 -326 -48 93 -146
4135a46J06J79k62Q2J65L88n14p4r9L95j93l5o3j59K75O7P7k18P9L3j77O5J78
$$ -146 -40 139 -123 -41 124 512 -2 -76 -175 220 27 -8 -71 -230 45 112 189 -29 50 83 -94 -29 149
4158A49k26K7k17J70K72p0j25k18K32R6l91L28k07K97j26J40k47K49l78M06k57
$$ 149 -77 -50 -267 -97 175 105 -20 -238 -6 90 -301 27 -180 117 -9 131 -116 133 -245 161 -96
4179i6K43L1J76m34K43k89J30q8k33N33m43M23m0n95N27J22n24K39L17J5l49K50
$$ -96 147 178 354 -80 163 -126 4 -84 -317 216 -227 196 156 -439 88 210 -314 -75 242 257 -92 158
4201A58m58K57r7K55J15j36j61O7K60l84K9J45k34J48l5L11o30K21L30m26L18
$$ 158 -300 -43 -140 115 230 94 -67 0 260 -124 -95 50 -184 -36 -71 240 -390 -169 161 -265 53
4222E3J75nk99J48j08J3J49j57J99j72p6J34J69j78K8L39m81j74L45R4m05K15
$$ 53 228 223 -76 72 -36 -23 126 -31 168 -4 -80 54 223 45 73 412 -69 -243 102 196 -209 6
4244Fk2n9J56j80J22Nk20L90j77P8l40M02l25J19j49K25m2k2j90M05l20M8j07
$$ 6 -16 -75 81 -99 23 28 -192 198 21 99 -241 161 -164 -45 -194 31 -11 -33 -223 182 -138 -90 -197
4267a97R1L35m35K05K44k67M0j46k21M30k67Q3Q2j10J43j45j08L14M4J8l2j60
$$ -197 -106 229 -206 -1 243 -24 16 -130 -351 79 -188 -105 -23 -133 10 -135 -243 71 115 133 101 -59
4289e9K6k00R1L27j71j45R1J59j08P7k53L28m6j23p8k5R8Nj09K91j07j61k67L25
$$ -59 -33 -233 -142 185 14 -131 -40 119 11 88 -165 163 117 -6 -84 -109 -11 -6 -115 176 69 -92 -359 -34
4313c4K43k21K27j13j33J41l10N6K48n2j02j30J62r7j8J6p2J67J68l0m85P38m00
$$ -34 209 -12 215 102 -31 110 -200 -144 104 52 -50 -180 -18 -115 -133 -117 -189 -22 146 116 -369 369 -31
4336c1q8J17J12k1M5j59L3J4J7Qk82N1M01l20L98m23K13k10N2J19K3J4J10m23
$$ -31 -119 -2 110 89 134 -25 8 22 39 47 -235 -184 217 -103 295 -128 85 -125 -73 46 69 83 193 -230
4360b30K95l11L17M2k26L76l46K72l24J45J39l42L07K0j19J96j48j59K48M9m18
$$ -230 65 -246 71 113 -113 263 -83 189 -135 10 149 -193 114 134 15 211 63 -96 152 201 -217
4381b17J16n4o5J93p8M4M30m00J09K17l94K18lk82K91n3m8O1k32j26J70j0K20
$$ -217 -101 -155 -220 -27 -105 -61 369 -31 78 295 -99 119 116 -166 125 72 24 85 -147 -273 -103 -113 107
4404A07l30L67J02j6k24K0J36o8l6j15K99n67L22k5j17K19J61n2r9j86L15n53
$$ 107 -223 144 246 230 6 26 162 94 58 -57 242 -325 -3 -28 -145 74 235 183 84 -102 213 -340
4426c40J81L64m76L31R0or9Q8n1j36J68l70J83J05K30J22m96L0J71l3l46N17P0
$$ -340 -159 205 -271 60 150 144 45 133 82 -54 114 -256 -73 32 262 384 -112 -82 89 56 -290 227 297
4449B97m20j00L19l05M48l03L4R8M6J36m68J12J84k75M46j38J9J4k95M35l43J30
$$ 297 -123 -223 96 -209 239 -64 -30 68 114 250 -218 -106 78 -197 249 111 130 144 -151 284 -59 71
4471G1rk74J92J30l8l04J32j46L74Q2l25K12k02K11n9Nk07M31j31j81K22j92K35
$$ 71 62 -212 -20 110 72 -232 -100 -246 128 210 -115 97 -105 106 47 52 -155 276 145 -36 186 -6 229
4494B29m03K48j46k69L42J46j33J45j43J2K05l9r4K01l74L23m16q6O57j28j21
$$ 229 -174 74 -72 -341 1 147 14 159 16 28 233 194 100 301 -73 250 -166 -252 405 277 156
4515A56j8l78M59o03M57N9l45l31L66k18L92N3pK40p3n04K37l0J73M0j77K59j27
$$ 156 138 -240 219 -384 73 132 -213 -544 -178 -396 -4 49 42 282 209 -295 -58 -88 85 125 -52 207 80
4538H0j78K29m25J37M07l67K50k90J19J29j82J58l02K43O4K36l67k60J20J23L14
$$ 80 -98 131 -294 -157 250 -117 133 -157 -38 91 -91 67 -235 8 72 308 -59 -319 -199 -76 238
4559B38m42J80j16L9j42J98Q6q6K65m10L95m23M37l27K85k27N3L48o39N18rj91
$$ 238 -204 -24 -140 -101 -243 -45 41 -45 220 -190 205 -218 219 -108 177 -50 3 351 -288 230 221 30
4581C0l96M64l8k77K33j06J59j53R2P0o1N01o71J21L78k96K41m09M40l52O1J84
$$ 30 -366 98 60 -217 16 -90 69 -84 8 78 17 518 -153 -32 346 50 291 -118 322 -30 31 215
4603B15k38j71M46l36K29M9J19k90LJ36k15O8l8n3r1J27k11L11j61L1J90j28J0
$$ 215 -23 -194 252 -84 145 194 313 23 26 162 -53 15 -23 -76 -167 -40 -251 60 -101 -70 120 -8 2
4626Bp4j80j1K76j2J63j17p2k40L02J10m38J98J10j20k18M18k33J55J5R0j95M00
$$ 2 -72 -252 -263 13 1 164 47 -25 -265 37 147 -291 -93 17 -103 -321 97 -136 19 34 124 -71 329
4649C29l23K78l35K36N9l37Q1M7k58K78l5j99K01J89m48J12J81j84L1K92k50K97
$$ 329 6 284 -51 185 244 -93 -12 35 -223 55 20 -179 22 211 -237 -125 56 -128 -97 195 -55 242
4671B42m8l79L35l95J60m9K24K5K1Q2j24K29m89J6q6M77k14k71J65R4j54M29l08
$$ 242 194 -185 150 -245 -85 -134 90 115 136 218 94 323 -166 -150 -236 241 27 -244 -79 15 -139 290 -18
4694a8j6l42J17K45N7J08r6k48oM5M0J99m5K7k78J64J81O0k01O1J34j72r1J0J13
$$ -18 -34 -376 -259 -14 43 151 55 -193 -199 -154 -114 85 40 67 -211 -47 134 194 -7 54 188 16 -75 -65 48
4719D8L5J66l61L4KK38j40k8r3O8l4L69k30m28O52m83K33k51M8K37j35j72K24
$$ 48 83 249 -112 -78 -76 162 22 -6 -99 -31 -65 304 74 -354 298 -185 48 -203 -155 82 -53 -225 -1
4742aJ06N1k08J38j32k37P2L93k73j71J59R7K44m38O2J35o1R4j42R2J86L3l02
$$ -1 105 156 -52 86 -46 -283 -211 182 -91 -262 -103 -6 238 -200 -138 -3 -64 30 -112 -20 166 199 -103
4765a03J91k14L0J36k73M08l15M5J52k5j89j04L38o2M8N4q3j58QJ94J74k7o7Q8
$$ -103 88 -126 -96 40 -233 175 -140 -95 57 32 -157 -261 77 15 63 117 34 -124 -116 78 252 225 158 246
4789B46k15j67J91k47K41m5o3L84k59k68L17J0o7K0k03k1L5J16n3j65N1K91j36
$$ 246 31 -136 55 -192 49 4 -59 325 66 -202 115 125 58 78 -125 -146 -111 5 -48 -213 -162 129 -7
4812gj4j04K86j91N41n91q2O0L7o1M7L7J33j78N3j61K61r8j9L5P4K0j15K89J22
$$ -7 -21 -125 161 -30 511 -80 -162 -102 -65 -126 -79 -42 91 -87 -34 -195 66 -32 -51 -16 58 78 -37 252 374
4837C74l16k04L48k26L3j34k2N9m1K81r0K66m40j80M49M8j16m29N34n43N92k77
$$ 374 58 -146 202 -24 9 -125 -147 -88 -129 152 62 328 -112 -292 157 205 89 -340 194 -349 243 -34
4859c4j44K47P4l89J39m3m7qK02l1k25N13l33K75q2j86j9P8j25m9K76j92J60j36
$$ -34 -178 69 143 -246 -107 -150 -197 -205 -3 -34 -259 254 -79 196 114 -72 -91 -13 -138 -187 89 -103 57 -79
4883g9J20Kj17l68N4K23J7J47k86M85o9k07L03j0n6j99J80K5j45Om3K58o36N50
$$ -79 41 43 -74 -442 -388 -165 -148 -1 -287 198 129 -78 225 215 159 -40 140 165 20 26 -17 241 -395 155
4907A55j70J71k78N8M9P4J53m23q4oL80j20k76K99l02N17j23k30k1O1K55k52P7
$$ 155 -15 156 -122 -64 -15 59 212 -211 -295 -301 79 -41 -317 -18 -320 197 74 -156 -177 -116 139 -113 -36
4930c6p8J11J53j46j73K88J33j80K36m37R6J64k72j71M13l01k0K28K0P9j62J23
$$ -36 -114 -3 150 4 -169 119 252 72 308 -129 -33 131 -141 -312 101 -200 -220 8 28 107 -55 68
4952F8j89J50J1J13k64L25m4j20k68M01k19l2q2L02l80n8L73o9K17j32k17p8K08
$$ 68 -121 29 40 153 -111 214 170 50 -218 183 -36 -68 -150 152 -228 -286 87 18 235 103 -114 -192 16
4975A6m5k75N5K99nj51M4j87K41J45k59J78j06K96l08j3n5o0O3N8N8M0K40l5k24
$$ 16 -29 -304 -249 50 45 -106 -62 -249 -8 137 -122 56 -50 246 -62 -75 -130 -190 -127 -69 -11 29 269 234 10
5000A0N2m3n6J63k69O8L38l06N39m56j39KK22j50j15L46k13O8N1q3J33k32j21
$$ 10 62 19 -37 126 -143 -75 263 -43 496 40 -99 -97 125 -25 -140 206 -7 61 112 29 162 -70 -191
5023a91R9J77J15k03p9L30j67k57k07L98O3J19m11nL38k73K7K2J74j88N5J97J27
$$ -191 -92 85 200 -3 -82 248 81 -176 -383 15 78 197 -214 -219 119 -154 -127 -105 69 -119 -64 133 260
5046B60m61L77m1K88l67K4j55n4koJ35lN0K44l63L47l96M73l03k60Q3L8K08J97
$$ 260 -201 176 135 423 56 80 -75 -129 -131 -137 -2 -5 45 289 -74 273 -123 350 47 -213 -130 -92 116 313
5070C13m86l9N10j51kk09K98j39k59L61n04M05L3l66J61l0l31M09j4L32j25l02
$$ 313 -173 -212 298 147 145 -64 234 95 -164 197 -307 98 131 -235 -74 -104 -435 -26 -40 292 167 -135
5092a35K10k81K81l14K04L12m62L06j59j68L43n3J49n43M63l40j05J63L58j39
$$ -135 75 -206 75 -239 -35 277 -185 121 -38 -206 137 84 233 -310 153 -187 -292 -129 229 90
5112I0j2M15q48K80K96j10O5p8k95J1J57l62K34M17k33J35k64j56L50k36N2P8
$$ 90 78 493 -355 -75 221 111 176 98 -197 -186 -29 -391 -157 260 27 162 -102 -258 92 -144 -92 -14
5134a4m4J85j68l6J84q2k4J59j71r2J77j34k11j11L05J07k62K19N9j63j05J96
$$ -14 -58 127 -41 -77 107 25 1 160 -11 -103 74 -60 -271 -382 -77 30 -232 -13 46 -117 -222 -26
5156b6k31j69L67K44q7p3L4q7l3P1J2R6k47M49r8N5j09j6l8p2k22O4J79K15q9
$$ -26 -257 -426 -59 185 98 25 59 -28 -61 10 22 118 -129 320 222 277 168 152 114 42 -180 -116 63 278 189
5181A89n19J71L77j71K1M3j57J45l85L81p5n7P5Nk8J37k40J64J00mk06J8J32l
$$ 189 -330 -159 218 47 68 111 -46 99 -286 95 20 -37 38 43 15 152 -88 76 176 172 -34 -16 116 113
5205A13q3j51L44K6j54k4o6j24N0Q2j86j79K81rR3K18j96r3J6K17k44N07j78k70
$$ 113 30 -121 223 249 95 71 5 -119 -69 13 -173 -352 -71 -80 13 231 35 -58 -42 175 -69 438 260 -10
5229a0J88j69k16K55L1j79rJ15J6Q2M6j24o2L6l35M46M4J9j19P2qj71O9M3j5j68
$$ -10 178 9 -207 48 79 -100 -109 6 22 104 150 26 -36 0 -335 111 155 174 55 127 119 -52 17 60 45 -123
5255a23k48L18J53l15M03q6q4P8j31j87M14j09R8j38L6o2k27K96n7P2Q2k25j66
$$ -123 -371 -53 100 -215 188 102 18 96 -35 -222 192 83 181 43 79 17 -210 86 29 101 183 -42 -208
5278b08M5K83l30M19k21N6J0j90J83Q8n7j20J93k88L04J18Pm68P8K63J05k21k50
$$ -208 -163 120 -210 209 -12 44 54 -136 47 135 78 -42 151 -137 167 285 292 -176 -98 165 270 49 -201
5301b01L46K5j41k04K20j60Q3N8L1k70P5M60m52K73j71n6K21lk71p1J35L57l50
$$ -201 145 170 29 -175 45 -115 -32 26 57 -213 -138 322 -130 143 -28 -84 137 134 -137 -208 -73 284 -66
5324f6R6k26k3R0K11l6k03N2j64L58j22P2r9kj4M72n33K11j88Q7J34k86j63M09
$$ -66 30 -196 -219 -129 82 46 -157 -105 -269 89 -33 39 -60 -62 -76 396 -137 74 -114 -27 107 -179 -342 67
5348F7K6j38K94k71k59K52J98J7k61J51j23j67Q0K5o6o7K43j70J94j15O7p3J75
$$ 67 93 -45 249 -22 -281 -29 169 186 -75 76 -47 -214 -134 -109 -175 -242 1 -169 25 -90 -23 -96 79
5371G9l4L15l08o7P7rl7K1k25k10K90K91j39l45N9L18J2O3k56L53l66J51k80M64
$$ 79 45 360 52 -15 62 53 16 37 -188 -398 -108 183 44 -301 -242 76 88 151 -105 248 -118 33 -247 217
5395B17k66j45k2P1L02m33Q2K05j17l5K63r4K68m45J78m45R8K06j0N6j11J70K40
$$ 217 -49 -194 -216 -145 157 -276 -194 11 -106 -141 122 28 296 -149 29 -416 -318 -112 -122 -66 -177 -7 233
5418B33j44J35O2k03k4k6k01J43K46l09j84K53m2L47j81r7J48q6J7k13Q1J03J00
$$ 233 89 224 286 83 59 33 -168 -25 221 -88 -272 -19 -61 286 105 8 156 70 87 -126 -45 58 158
5441A58r6K46m50p8J88N6p1Q3k83L05k66L38j07M8k03J63k41L85k17Q8J6k4k03
$$ 158 62 308 -142 -220 -32 24 -47 36 -247 58 -208 130 23 71 -132 31 -210 175 -42 46 62 38 -165
5464a65R1r9R7O4M5k76J54L3K06l3J03l75L08k45O7o5j65K80M2K6J55j32k24n4
$$ -165 -74 -173 -76 -12 33 -243 -89 -56 150 117 220 -155 153 -92 -25 -90 -255 25 67 93 248 116 -108 -162
5488a62p3kJ48J18n9n6L2Q3p4L97o37J13K41r0j7j30J24k74K40K53j89o0k54N26
$$ -162 -235 -237 -89 29 -30 -86 -54 29 -45 352 -285 -172 69 -21 -38 -168 -44 -318 -78 175 -14 -74 -328 198
5512A98l32J50P6k55L70j50M7m2k12j8L61j95j12N83m72K06M7k21N0k85L19l42
$$ 198 -134 16 92 -163 207 57 104 62 -150 -168 193 -2 -114 469 -3 203 250 29 79 -206 113 -229
5534b29K28j21P9k05L86k01L18k93q4L42m16k31L31J41k45L94n70K45k26M97Q
$$ -229 -1 -122 -43 -248 138 -63 255 -38 -122 220 -196 -427 -96 45 -200 194 -376 -131 -357 140 148
5555A48k75K14n3k20NJ63k4L2j63J11L3J99k34KL3j26L08k61K87qj09M4lJ94l98
$$ 148 -127 87 34 -186 -181 -18 -42 -10 -173 -62 -29 170 -64 -62 -29 -155 153 -108 179 171 62 106 103 297 -101
5580a01K86l62K11j98J81j30J30P5j85J32Q2J4l88L98n9J0J5Rj89K90q8Jk1j4
$$ -101 185 -177 34 -164 17 -113 17 92 -93 39 121 135 -253 145 86 96 111 120 -69 221 133 134 113 99
5604I9L6j61j9J01j15P3Q3r5j06J77k53M38k06o5j28R5r0k9K86k90j7L91l01N8
$$ 99 135 -26 -45 56 -59 14 97 2 -104 73 -180 258 52 -13 -141 -46 -136 -165 121 -169 -186 205 -96 -38
5628c8N6j04l0J00l0J44J21l24Q8j65J90J25l16P3j39K89K97o71K37M4M3JJ95
$$ -38 18 -86 -116 -16 -46 98 219 -105 -17 -182 8 133 -183 -110 -249 40 337 -334 -97 -53 -10 -9 186
5651A86P2j40q3k7O4J88l83J93j85n1J6J15p1m7J13J89k13k8N5N34n59J04Ok96
$$ 186 258 118 35 8 72 260 -123 70 -115 -166 -150 -35 -106 -153 -40 149 -64 -92 -37 497 -62 42 48 -248
5675b48N65k08l07K50r3J36j54l4K98r8j69J15j95k10m6N98m27l1L41m02M11j03
$$ -248 317 109 -198 52 -41 95 -59 -93 205 107 -62 53 -142 -352 -398 200 -227 -258 83 -319 92 -11
5697a1K56k06K02j72j92L91l22J98j77L6J7O6j18j93K02J40j11J52j48j75K19
$$ -11 245 39 241 69 -123 268 -54 144 -33 3 20 86 -32 -225 -23 117 6 158 10 -165 54
5718E4J08l90J56J96m22L03k93K86Rj54o6J20K58j41J37o3k52K72n1J00l03L45
$$ 54 162 -228 -72 124 -298 5 -288 -2 7 -147 -213 -93 165 24 161 98 -154 118 67 167 -136 209
5740B09k15J25Q0n9p8k45J56nj46J97j19R3O4L9K5j18q3P8J71n2M2l57J11q5L05
$$ 209 -6 119 199 140 62 -183 -27 -32 -178 19 -100 -7 57 96 121 3 -80 -2 169 117 159 -198 -87 -172 133
5765A33o1L74n91r2q4N49M3l07M5P0j2j2J69l31J93j25J79P7k71O8N4r2j34N8
$$ 133 72 446 -145 -237 -321 228 271 -36 9 79 67 55 224 -107 86 -39 140 217 -54 14 68 -24 -158 -100
5789a00J77L6k04J52k52L75q7j43M4l4M4l03N33j93k23K26j3J24l72K01K62k94
$$ -100 77 113 -91 61 -191 184 97 -46 -2 -36 8 -295 238 45 -178 48 35 159 -213 -12 250 -44
5811d4L0J85j51k91O4L11j87m2J14j74J80j62o5L59k41q4p6J75L02j07l60J53
$$ -44 -14 171 20 -271 -207 104 -83 -125 -11 -185 -5 -167 -232 127 -114 -198 -274 -99 203 96 -264 -111
5833a11O04j10k80p4k25M53k89Q8N7r5k10K04J44l08N4J17M1J73M0k57k54P7R9
$$ -111 493 383 103 29 -196 257 -32 56 113 18 -192 12 156 -152 -98 19 60 233 273 16 -238 -161 -62
5856f2M4L3j51p1j82M10L8j57R0K02k95N9K16k83K76r8o8o9J28K9J5k6Q5O5n27
$$ -62 -18 15 -136 -207 -389 21 59 -98 -8 194 -101 -42 174 -109 167 69 1 -68 60 89 104 78 163 228 -299
5881b99J79K35k18L14j77%l26J76j09K53R7l33J85l04N12j34j17k88M00Q2j20
$$ -299 -120 115 -103 211 34 34 -292 -116 -225 28 125 -208 -23 -327 185 51 -66 -354 46 128 8
5902Ho9J74j9On5l70L47l6k0p3N2J08j28j74L15p8k99L08Q4j23O1j47m1K81k59
$$ 8 -61 113 94 100 45 -325 22 -14 -34 -107 -55 53 -75 -249 66 -12 -311 -3 81 -42 19 -128 -169 112 -147
5927a47K78m34L66m2m4RK01J29n98K28j62J87n0q3R7J38k05rK14l2K7l25K41K04
$$ -147 131 -303 63 21 -23 -14 187 316 -282 -54 -216 -29 -79 -162 -65 73 -132 -141 73 41 68 -257 -16 188
5951A88k07J93j54r0M4PO4q3j11K13l5R4j41N4J74l39L67k77jK57k03J8P7k78
$$ 188 -19 174 20 -70 -26 -19 45 -38 -149 64 29 123 -18 36 210 -129 238 -39 -40 217 14 32 109 -169
5975a69L46J7j79M2Oj52N7o7lj35O6M9N0Jm8J78N2j69J09l07L37k72K59j5Q7J8
$$ -169 177 194 15 57 63 -89 -32 -99 -102 -237 -171 -122 -72 -71 -119 59 111 -58 51 -256 81 -191 68 53 140 158
6001A58k35Q4k6M4N4k84L43n0LJ28j13k09K38j36o8J0P4l12J57M25j38j71rj08
$$ 158 -77 7 -19 25 79 -205 138 88 91 219 106 -103 135 -1 -69 -59 15 -297 -140 285 147 -24 -33 -141
6025a41J18n5J2k25N3K08r9L72k15j09K51j53M8P8j38k75J62J39k07L39k97K96
$$ -141 -23 -78 -66 -291 -238 -30 -129 243 28 -81 170 17 65 143 5 -270 -108 31 -176 163 -134 162
6047A62k40r2K05KJ71r3j51J31j18J66m9Q7k11K27J8j54j07qK42k21j62K92j42
$$ 162 -78 -170 35 37 208 115 -36 95 -23 143 94 181 -30 197 215 61 -46 -54 188 -33 -195 97 -45
6070d5L55l70J55l77q1L86n7J86k18L24m64r4L49j44J86n7J18k52J97k13J18j3
$$ -45 310 -60 95 -282 -363 23 -34 152 -66 258 -206 -300 49 -95 91 34 152 -100 97 -116 2 -11
6092a1j49L29l40n6q3L15M8J20q3jk04L2J41J56k52O7j18K33k29P1K09m50p9N68
$$ -11 -160 169 -171 -227 -310 5 53 173 90 89 -115 -83 58 214 -38 29 -89 144 -85 -14 195 -255 -334 234
6116B34n03L85j32J60o7j52n0R2l4j04J68j39L10r4j53M6o6M46m80J80k32J39
$$ 234 -269 116 -16 144 77 -75 -125 -33 -67 -171 -3 -142 168 74 -79 -33 -99 347 -133 47 -185 -46
6138d6P4P4j86Q5Q1K79m38J38j63R4jq1J16Q4q7q7n3j37K70O6j83K1L15l77q5
$$ -46 28 102 -84 1 82 361 -77 61 -102 -8 -9 -90 26 110 23 -64 -117 -254 16 82 -101 -80 235 -142 -227
6163b27J60K1L5L72n91K16qK18n8j21j79M50j97J95l34P8Lj6j25O8k23J47J94
$$ -227 -67 -46 -11 361 -230 -14 -22 196 138 17 -162 288 91 286 -48 30 33 17 -108 -40 -263 -116 78
6186G8k25J94j39J87o49M38j59J50M5J53j52M54n18K2QJ7P3K19j22j99L05o8N6
$$ 78 -147 47 -92 95 -554 -116 -275 -125 -80 73 -79 375 -143 -121 -113 -96 -23 196 74 -125 180 112 168
6209A68l28M79l57J33J23k07l88M45k77J13J63j82J28Q9j83j18L19j40p8j15J79
$$ 168 -160 319 -38 95 218 11 -377 68 -209 -96 67 -115 13 102 -81 -199 120 -20 -98 -213 -34
6230c4M5J0j47M37K5l80oJ73j96Mr8K50q7j42K51j81k30O22k80J49l49M38o31
$$ -34 11 21 -126 311 336 -44 -50 123 -73 -69 -167 83 -4 -146 105 -76 -306 316 36 185 -164 274 -357
6253c57M43k52M5J82j67L85l87K81k61M87l97K8j55K73j80k19J62K52Q4l37K12
$$ -357 86 -166 -121 61 -106 279 -108 173 -88 399 2 30 -125 148 -32 -251 -89 163 247 -90 122
6274A22k63J44K19l78J45j9K84k70n7j16K39m7L3Jo6k95J03K00k46N35l53P3J48
$$ 122 -141 3 222 -156 -11 -30 254 -16 -73 -189 50 3 36 37 -29 -324 -221 -21 -267 268 -85 -12 136
6297A36k82K07K5l85K06j2q7K5L24k42k79L41nJ72j71j54K25j72pL24J07o58K85
$$ 136 -146 61 86 -299 -93 -105 -192 -167 157 -85 -364 -23 -28 144 -27 -181 44 -128 -135 189 296 -362 -77
6320g7K01n02L28k0k81L52N2OQ3j88j97L45j67k0L68k59j87K60K49m61NJ29mJ5
$$ -77 124 -378 -50 -70 -351 1 53 59 142 -46 -243 102 -65 -85 283 24 -163 97 346 -115 -110 19 15 30
6344C0O4p3K39j38N7l64L63l7o01Q09j52k56j03Q4N6n4j32N4K13k26n0J73Q9M0
$$ 30 94 21 260 122 179 -185 178 141 -460 349 197 -59 -162 -78 -22 -76 -208 -154 59 -167 -217 -44 45 85
6368H5M6o5J00m04J93K22L2l07L83l25L5L5k12J86L1j29k95L01K95j75k8L81J0
$$ 85 131 66 166 -238 -45 177 209 -98 285 -40 -5 30 -182 4 35 -94 -389 -88 207 32 4 385 395
6391C95l18j85K03j46J95o1k20o4M18k16K9j68L62j40j9j05J53k81j6P1J51M9
$$ 395 77 -108 95 -51 144 83 -137 -201 217 1 30 -138 224 84 65 -40 113 -168 -184 -113 38 87
6413H7k84K73M5j10r9L22k75K21k15J47O2k36J04R7j65J15n8K2rM9Nk81J88j82
$$ 87 -197 76 121 11 -88 234 -41 180 -35 112 174 -62 42 139 -26 89 31 53 44 93 98 -183 5 -177
6437a77J89J22k08m61J73L40J50k19K74k06r5K13K15m34J16K35k80l9J98J3k81
$$ -177 12 134 -74 -535 -362 -22 128 -91 183 -23 -118 95 310 -124 -8 227 -53 -92 106 119 -162
6458a62K98O3k42L6J4K97n8l13J66m7K09o7n78K71J29K6j35J95m3n6qJ18n5j31
$$ -162 136 199 -43 -7 7 304 246 -67 99 52 261 194 -384 -113 16 42 -93 102 59 3 -5 113 58 -73
6482g3j10J87M3M4k27K41k19k39O7Q1J20J93k16K2p3P9k5K77j09l93N70j44j39
$$ -73 -183 4 47 91 -136 105 -114 -353 -286 -205 -85 108 -108 -86 -159 -80 -105 172 63 -330 240 96 -43
6505d3L5K8p1j97K17M6j95j7K53k68J81K50p0k09O0L76j31k08J6j51l0K96l9k80
$$ -43 -8 20 -51 -248 -31 15 -180 -197 56 -212 -31 219 149 -60 0 376 245 37 53 -98 -128 168 129 -151
6529a51PN47l60R5k38J36R5k02J45k07J29o4j42L40j05j55j4J7R9j91M54l12N2
$$ -151 -144 403 43 138 -100 36 131 -71 74 -133 -4 -68 -210 130 25 -130 -144 -127 -28 -219 235 -77 -25
6552b5l05N47j36M0J04n10j85N56q3J90m35J93L6k2J27k36O3O3k7l8L18l38J34
$$ -25 -330 217 81 121 225 -285 -470 86 3 193 -242 -49 -13 -35 92 -144 -81 -18 -45 -83 235 -103 31
6575C1l85K89j80K48r5j27J50j21L30k04J05j96M29n48J15L21l75M84j32j92j88
$$ 31 -354 -65 -245 3 -92 -219 -69 -190 140 -64 41 -155 274 -274 -159 162 -213 271 139 -53 -241
6596b41J72K19q7k01L30j49k21K28K46m65R7P9K97k52K35n12J86l9PJ81j81J92
$$ -241 -69 150 63 -138 192 43 -178 50 296 -169 -72 7 304 52 287 -225 -39 -78 -71 110 -71 121
6618A21m0j3Nq3M0J06l78l3J73J15L1N9k6j11k02L12Ll43J67k92L56J1J22Q4j07
$$ 121 81 68 73 -10 30 136 -242 -275 -102 13 44 103 77 -34 -236 76 79 -264 -97 -389 -33 -22 100 184 77
6643G7M3k7Qm7j83R8K0Q3mK52l35l3Q4l2j64J99o5J71k96J81R7l76R2K37j67P4
$$ 77 120 93 101 54 -129 -31 -11 72 68 320 -15 -48 36 4 -160 39 -26 145 -151 30 127 -249 -157 80 -87 -13
6669a3j60K23j9K76l86L47n35Q6L27j12m8l3P3L23l59J95J07j88k5L2k44nJ66
$$ -13 -173 50 31 307 -79 268 -267 -181 146 34 -14 -47 26 349 -10 185 292 104 79 111 -133 -138 28
6692B8O2l20J49r2K08J9j31O5l01M05J06k84P6J47L96n29K1K76j56J80k03L9o14
$$ 28 90 -230 -81 -173 35 54 -77 -12 -313 92 198 -86 -10 137 533 4 25 301 145 325 122 161 -453
6715d53K19K97j4q8K27l80K65q2r7J90j48J54j33J29l78J00J60k1p4j36J92j18
$$ -453 -234 63 49 -39 188 -192 73 -9 -106 84 -64 90 -43 86 -292 -192 -32 -53 -127 -263 -71 -189
6737a89Q5M40k04k70R9j39J85j52n9Nj05J28K17k9j19M3j93J93K06j11K8l8k17
$$ -189 -104 336 132 -138 -39 -178 7 -145 -204 -199 -304 -176 41 12 -107 -64 -257 -64 142 31 59 21 -196
6760a96K9J84j69O3p1K20k93L44j20l80N19k26J99j80L05q8l29J28k6j83K08Q7
$$ -196 -167 17 -152 -89 -160 60 -233 111 -9 -389 130 -96 103 -77 228 140 -189 -61 -87 -270 -62 25
6782B5O5k90L62l66K60m9J12k33K1J10q0K23k75J69n5o4J94p1J60l54P8N6K51
$$ 25 90 -200 162 -204 56 7 119 -114 -93 17 -63 160 -115 54 -1 -65 129 58 218 -136 -58 -2 249
6805B49k21J01k61j7J70j73J46K60l72m0M2L29j17J93n3j70j86j07K16K03p6j42
$$ 249 28 129 -132 -149 21 -152 -6 254 -118 -158 -116 213 96 289 236 66 -120 -227 -11 192 116 -26
6827b6l5j07K21j34J63m7J42j73k5J9R4k82p6K9K86j83J13K24k01j80J25J19L5
$$ -26 -61 -168 53 -81 82 35 177 4 -21 -2 92 -190 -266 -237 49 -134 -21 203 2 -178 -53 66 101
6850A01L7N2m40M03m95O09p5l66J51k64K49oj0K6k31P1J93rN7K7j90J57j18kJ5
$$ 101 138 190 -250 153 -342 267 192 -174 -23 -287 -38 -44 -54 -28 -259 -188 5 -4 53 80 -110 47 -71 -73 -58
6875e8k2O3p0K10j79j28j74J77K61m5M0q8K3k41M60j69N8ol21J61L79n25M68n69
$$ -58 -80 -17 -87 123 -56 -184 -358 -181 80 35 75 -13 10 -231 229 60 118 112 -209 -48 331 -194 274 -295
6899b95K17R0J3J61l72K8L0j82M25j00j29N6m13P10M29k48m23K16j32J5k66K6
$$ -295 -78 12 25 186 -186 -158 -128 -310 115 15 -114 -58 -471 239 668 420 -3 213 81 96 -170 -144
6921a44K01k96KM3J78J06j08p2k6Q9j60p0J01K89P8k64O0J03n77O14k9k43K23
$$ -144 57 -239 -237 -194 -16 90 -18 -90 -116 -27 -187 -257 -156 133 211 -53 7 110 -467 147 118 -125 98
6944I8m16j5L06K52k63n4J67L02k29m16L73l36J63K43j38J62j06k21j5N07j74
$$ 98 -318 -333 -27 225 -38 -92 75 377 148 -268 105 -231 -68 175 37 199 93 -128 -143 364 190
6965A90N4k94j63L07r1k80J2J49Q9rJ37o7j86J37J43j08K49m53K50m9k0o5J43
$$ 190 244 -50 -213 94 3 -277 -265 -116 -27 -36 101 34 -152 -15 128 20 269 -184 66 17 -3 -68 75
6988G5o2J66k04n5j27K42k3k51L29R3r6l92J50M01k88J55r8P4j5N3j91k27QK67
$$ 75 13 179 -25 -80 -207 35 12 -239 90 183 87 -305 -155 246 -42 113 15 89 74 127 -64 -291 -283 -16
7012a6j00K31k81J1N02l78j33J72j64J93n3m4r4L02l4P9j55L49n02M6K70l61K30
$$ -16 -116 115 -166 -155 347 -31 -164 8 -156 37 -16 -60 -154 148 114 193 38 387 -115 -69 201 -160 70
7035G0k80L29k31M08l57K00k31JK69j88J30j20k38L53k71K1K09J38m68K65kN1
$$ 70 -210 119 -112 296 -61 139 -92 -91 178 -10 120 0 -238 115 -156 -135 74 212 -256 9 7 58
7057E8r1r1K05r2J27j02O05p28J51m3J66k98J2k0L7j43J56q3O09j86q4k00K77
$$ 58 -33 -124 81 -11 116 14 619 -109 42 -1 165 -133 -121 -141 -104 -247 -91 -174 435 249 165 -35 242
7080B42l41J11r7O6m6J10N7p5q6N5j94k13N73j51L75m62O0J11l47K57Q9k70K91
$$ 242 -99 12 -85 -19 -65 45 102 27 -59 -4 -198 -411 162 11 386 -76 -16 95 -252 5 94 -176 115
7103A15R2m39j99K83o9M08Pj52R7J61m7k01J23k50M02n89L46Jr0O3k75K92j70
$$ 115 207 -232 -431 -148 -217 191 198 46 143 304 257 56 179 -71 331 -258 88 89 -1 62 -213 79 -91
7126i1oK18q0K2nj52L70m27J92o8J57l47M6L54o6J2pm9J66m88J27L06N8o8m35
$$ -91 -97 121 41 63 58 -94 276 -151 41 -27 130 -217 -171 183 117 129 122 73 239 -249 -122 184 242 174 -261
7151b61N79j02l5l87J03jK84l91J12L6m4R3j72L65n61K47K66Q2n5k44N9j1Q3p6
$$ -261 318 216 181 -206 -103 -104 180 -211 -99 -63 -107 -14 -186 179 -382 -135 131 213 158 -86 -27 -38 45 -31
7175c1q6K0j98L17L07k31n45L05N1n0M7J75l81m8R5L4L14j74J50K00Nl1m98K31
$$ -31 -117 -97 -295 22 329 98 -447 -142 -91 -141 -94 81 -300 -348 -253 -219 95 -79 71 271 276 245 -253 -22
7199b2J01J14k96J05n3kq0J70J34j4r3n6k47J48p5L9Q3q4j68L91J21j96O9O0o1
$$ -22 79 193 -103 2 -51 -53 -133 37 171 157 64 8 -239 -91 -166 -127 -44 -128 -296 95 216 20 89 149 88
7224H8KO9K5k16O9j98J18J43q4M4p4j50J12K58n60L14J97j26j75N7J20J07J87
$$ 88 90 159 184 -32 37 -161 -43 100 16 60 -14 -164 -52 206 -354 -40 157 31 -144 -87 33 140 327
7247C27j25k33O4q4Q5J11j69m1K80k57p7j93K65K73m30L24k79J77m5J08k1K9j
$$ 327 202 -31 33 -51 34 145 -24 -65 215 -42 -119 -312 -47 226 -204 120 -159 18 -27 81 60 89 88
7270H8k41RK62k46K40r8q0K52o51L78K40k20j74J77K06l7Lj81l88M53pn9k01L03
$$ 88 -153 -144 118 -128 112 14 -66 186 -465 -87 153 -67 -241 -64 142 105 108 -73 -461 -8 -15 -74 -275 28
7294B8J72l42J87j81K41N3k98k18N24j65J62k30j87L01J9K44%m12L86n21K93l0
$$ 28 200 -142 45 -136 105 158 -140 -358 166 1 163 -67 -254 47 66 310 310 -102 284 -237 56 26
7316B6l62P7J14k5K03K77j43j82N4J2j7J48l45J90k35M78j63l07J01J38J65j55
$$ 26 -336 -259 -145 -170 33 310 167 -15 39 51 34 182 -163 27 -208 270 107 -200 -99 39 204 49
7338D9J11n44J97L19n4j51k3K51l7j82L00k90J04K08l44L2J33P2n62K33O4K07
$$ 49 160 -384 -187 132 78 -73 -96 155 118 -64 236 -54 50 258 -86 -54 79 151 -411 -178 -114 93
7360I3m5j29J21q9J56l52J30J31l84N78j94k3r7O5L13k66J30j63K4r9QP2L3q7
$$ 93 48 -81 40 -49 107 -245 -115 16 -368 210 16 -7 -104 -39 274 8 138 -25 -1 -100 -92 -20 13 -74
7384g4J26J81m01P8J67j87k55K54K4m20P83m04J55J61k28J7l6l1K13L4L5j00J6
$$ -74 52 233 -168 -90 77 -110 -365 -111 -87 -507 276 -128 27 188 -40 -23 -59 -90 123 157 192 92 108
7407A08k18j8K58p3l10m4L35k03lL54l86K87q9j24L22j4n17L12j61q2K12o9K95
$$ 108 -110 -128 130 57 -253 -297 38 -165 -168 186 -200 87 -2 -126 196 182 -335 -23 -184 -266 -54 -123 172
7430A72r1l12P3K38M5j07l5j45R9P8j19L62k74P0l9j69J22K30k65K60j34k0k15
$$ 172 81 -231 -158 80 125 18 -17 -162 -63 15 -104 258 -16 54 15 -154 -32 198 -67 193 59 39 -176
7453a76J24k03L31j75K34k18L34j58P2j36K53l59j74L51P5p0kqN7r1o0n8q9L48
$$ -176 -52 -255 76 -99 135 -83 251 93 165 29 282 -77 -251 100 175 105 103 95 152 61 1 -57 -146 202
7477B02J0k18K53j43K04m63K12k67L01k93L66j1l53J11j42mK08n9J06p8l32M96
$$ 202 212 -6 247 104 308 -155 57 -210 91 -202 164 153 -200 -89 -231 -235 -27 -86 20 -58 -390 106
7499A06m9P6l49L00l79J39L14l94M05j16k10R1J2j04k9J76P3l06J6L49J5j86n4
$$ 106 57 133 -216 84 -295 -156 158 -236 169 53 -157 -66 -54 -158 -187 -11 62 -244 -228 121 136 -50 -104
7522a04J09rJ66r3k51J96J07K8l75K90l64J80R5j91j01M18P9l60M3J24j02j43
$$ -104 5 -4 162 69 -182 14 121 149 -226 64 -300 -120 -25 -216 -317 101 180 -180 -137 -13 -115 -258
7544b58M49j7j15r4l6r7K25L27m80K01m2j68J79j34L57l01m00O86j53m6l6k63
$$ -258 191 174 59 -35 -71 -168 57 384 -96 105 63 -105 74 -60 297 -4 -404 282 129 83 47 -216
7566b16J1l8M18k86Q4l8Nn5J2j4K46J9l35j76M04K79m02K40m02J8L84l41J18M
$$ -216 -205 -243 175 -111 -27 -65 -60 -115 -103 -117 129 148 -187 -363 41 320 -82 158 -244 -226 158 -183 -65 -61
7590f1J67q2L7j02j06n4K63j60K47j35k83J88j39O4N6J3PJ21k22J15j09Q6j7K92
$$ -61 106 24 61 -41 -147 -201 62 -98 149 14 -269 -81 -220 -156 -100 -87 -80 41 -181 -66 -175 -89 -106 186
7614A86k67J36j35p8J37K25m35K27N6P4k06k03K13l4J4j27J25l3L99k08%J5K13
$$ 186 -81 55 -80 -158 -21 204 -231 -4 52 126 -80 -283 -70 -104 -90 -217 -92 -125 274 66 66 81 294
7637B94o81K66L35J52n15J97J06K8m70RK90k7q0K87n16K14o4j4J32K23k48L0K47
$$ 294 -387 -121 214 366 -149 48 154 182 -288 -279 11 -16 -96 191 -325 -111 -175 -189 -57 166 -82 -52 195
7660A95k39P1j58J09jJ78k06j0J25l55K98l14K80Kj66J44J32j92j89M14k25K02
$$ 195 -44 27 -131 -22 -23 155 -51 -61 64 -291 7 -307 -27 -25 -191 -47 85 -107 -296 118 -107 95
7682I5p7n4k34P5P5P3J16K81k30q9Q1K19m22l4K00k48M47k82J68j46Q8J58k79
$$ 95 18 -36 -270 -195 -120 -47 69 350 120 31 112 331 -91 -125 75 -173 274 -8 160 14 102 260 -19
7705a9p2R6J98r1k95L33Q8l62j8M86n86J60J6K60m13L13J16k18M8K47O9k13j72
$$ -19 -91 5 203 112 -183 150 238 -124 -142 344 -242 -82 -66 194 -219 94 210 -8 40 287 356 143 -29
7728b9n9K26k37m9L58k31K27j05o2j05j84K60J53m5l04L41k16R0j65j08M21n7
$$ -29 -88 138 -99 -148 210 -21 206 101 39 -66 -250 10 163 118 -186 155 -61 29 -136 -244 177 120
7750A20k51Q7J06j23o3K51k54P8l7j81L96k58J82l32M42l20K68j85L31m40L13
$$ 120 -131 -44 62 -61 -124 127 -127 -49 -86 -267 129 -129 53 -279 163 -157 111 -74 257 -183 130
7771A30j34J21j06o9j53K97r3rL5r9l3k19M36O6l71N45l40k63J20Q5K59m01Q7
$$ 130 -4 117 11 -58 -211 86 -7 -16 19 -80 -113 -332 104 170 -201 344 4 -259 -139 -54 205 -196 -109
7794a09m8q3K31j55L49j55K36k9m22J88J67k81K23p8j84j63N18k2j39J29j22m3
$$ -109 -157 -240 -9 -164 185 30 266 237 -185 3 170 -111 112 34 -150 -313 205 183 44 173 51 8
7816HOk29J13M0j33L83j83m9n9O7L7k6jj44J72k7L30j06Pp5j44m7K28l1j09m4
$$ 8 14 -215 -102 -62 -195 188 5 -44 -103 -36 1 -25 -26 -170 2 -25 305 199 206 131 -13 -60 168 137 28 -16
7842a6lj34L4P8O0J77k55J47r1p2k24K26J32m6r6Q3J01o8K2K55k50m6j36j82J14
$$ -16 -19 -153 -119 -41 19 196 -59 88 -3 -75 -299 -73 59 13 -83 0 101 33 55 310 60 14 -122 -304 -190
7867a90L18j81L3O0l20N81l53J49l66K59N5k2J73r3k12K5j47L45l95K83j20m5
$$ -190 128 -53 -20 40 -280 301 -52 97 -269 -10 45 23 196 103 -109 -84 -231 114 -281 2 -118 -163
7889a63K45R6P4n91L54j15J24J43j48R5l41M28j74j56QL6J54K1j79J8K73j50O1
$$ -163 82 178 252 -339 15 -100 24 167 19 114 -227 201 27 -129 -121 -85 69 90 -89 -71 202 52 113
7912A13m57N25j6j05k00L41j80Q2j70K31k75k15K96j71K25J88k15L98m41L95r8
$$ 113 -344 181 165 60 -140 201 21 103 -67 164 -111 -326 -30 -201 24 212 -3 395 -46 349 251
7933B51n11J51J50r6r0j23L20K25m43J67k52K33R3J5k72L26k83J20K6l8l2K69
$$ 251 -260 -109 41 -55 -145 -268 52 277 -166 1 -251 -18 75 90 -182 144 -139 -19 7 -31 -63 206
7955B06k26KP1J13m4k88J34L9M4j17M0J91n6n97K97K35n06N62k4K2%J54k89r2
$$ 206 -20 -18 53 166 122 -166 -32 7 51 -66 -26 165 109 -488 -191 44 -462 100 76 98 98 252 -37 -129
7979a29k1J36k8N1M8Nr9j94K92J65j79o4j09j47L52k04L6m6J9o3J5J62q9K90k35
$$ -129 -150 -14 -42 9 57 62 -37 -231 61 226 47 -17 -126 -273 79 -125 -89 -135 -116 -179 -164 -2 -91 199 -36
8004c6Kk4q7L60k74k5R4m6J62J0n08L30qj0k37J89Q2k53O00k20j59j09r6K41L36
$$ -36 -34 -58 -145 215 -59 -84 10 -36 126 136 -372 -42 -50 -60 -297 -108 -26 -279 321 101 -58 -167 -263 -22 314
8029C14n70J49J90J76l30n9K14j21J54l59K28K35N1k66P4j56Q2M3J35K1R1m01
$$ 314 -256 -107 83 259 -71 -130 84 -37 117 -242 -14 221 272 6 80 -76 6 49 184 205 296 -105
8051a05J34J10N0k23K13l58J29j39J0J57k00J15k6K42j01lL67m12J16N0P8r3k8
$$ -105 29 139 189 -34 179 -179 -50 -189 -179 -22 -222 -107 -133 109 8 5 372 -40 76 126 204 111 83
8074H3K7k97J42j90M32l75J49j44L18p9P9J38l63J35M2m40K59J37J06M4k04j06
$$ 83 110 -187 -45 -235 197 -178 -29 -173 145 66 145 283 -80 55 97 -343 -84 53 159 203 -1 -107
8096a07J03O9k4P1K4m64MK90Lq5j29K86l02L36LP8j64Kl7L7%m6mJ80M5j67k9J84
$$ -107 -4 65 41 112 136 -328 -324 -34 -31 -116 -245 41 -261 75 78 156 -8 -6 -43 -6 -6 -52 -56 124 169 2 -27 157
8124A57j66J15L9o6l01L75l02j17M23j97n2K7j61N17m53J28L55k14J53m79J57
$$ 157 -9 106 145 79 -222 153 -149 -266 157 -40 -92 -65 -226 291 -162 -34 321 107 260 -219 -62
8145f2J70j05lK9k9RQ8J3n9m8j0l53O11l10J34M2o9k19K81k18J4q7J29O7J47p4
$$ -62 108 3 0 29 0 9 97 110 51 3 -7 -360 251 -59 75 117 48 -171 110 -108 -94 -181 -52 15 162 88
8171H8m40K50K08p8R7j04K16l4k11K24p08N28K24j11l17J45N1o3r0L22
$$ 88 -352 -102 106 28 125 21 237 203 -8 216 -492 36 260 149 -168 -23 28 -35 -125 197
8191A97
$$ Imaginary data points
##PAGE= N=2
##DATA TABLE= (X++(I..I)), XYDATA
0@%%%%%%%Kj0J6j6J6k4L2m0M8n3O1p2Q8j04J20j36J54j78K08k37K69l04L41l86
$$ 0 0 0 0 0 0 0 0 2 -8 8 -8 8 -16 16 -24 24 -29 32 -40 48 -56 64 -72 82 -96 112 -125 144 -160 181 -205
31b05M34m87N43o04O76p52Q35r28J026j137J261j394J545j713J900k112K351k627
$$ -205 229 -258 285 -319 357 -395 440 -488 538 -599 662 -732 813 -900 1000 -1112 1239 -1388
49a388K948l324L779m338N037n953P206r027J1944j7365L0805j23845k43114J78140
$$ -1388 1560 -1764 2015 -2323 2714 -3239 3967 -5060 6884 -10481 20324 -103521 -346635 -168495
63a68495K18337N3629n7783M7470M6729j18351k23665n5779J58495J84122M8019
$$ -168495 49842 103471 45688 93158 139887 21536 -202129 -257908 -99413 84709 132728
74A32728k4218k6846n9651j29908r3456M6165J53448J31029M2953m2337j07178
$$ 132728 108510 81664 22013 -107895 -201351 -155186 -1738 129291 172244 129907 22729
85B2729j35277o8933N7751J25733Q4979L2033J7785k6268j31087j62205j7870
$$ 22729 -112548 -181481 -123730 2003 86982 119015 136800 110532 -20555 -182760 -200630
96b00630J62480J68508K5368o1838l3109l1168j06166j08763M5039J88395J40125
$$ -200630 -38150 130358 155726 93888 60779 29611 -76555 -185318 -140279 48116 188241
107A88241k7325j11107p4552m2503n3338j5258R4400J51794P0941o4759j26061
$$ 188241 160916 49809 -24743 -67246 -120584 -135842 -41442 110352 181293 116534 -9527
118i527r4909l4017K2342P3400R9374O8015m007p1200j05519r1280j5279Q9811
$$ -9527 -104436 -138453 -116111 -42711 56663 124678 120671 49471 -56048 -147328 -162607 -72796
130g2796J36256P4549k9436p6899o4769n4651m5298J7076J14416J34900L1552
$$ -72796 63460 138009 108573 31674 -33095 -87746 -133044 -115968 -1552 133348 164900
141A64900r0462j13478n5867p363J5887N7619J05042Q2943k3685j18028j11698
$$ 164900 74438 -39040 -94907 -102270 -86383 -28764 76278 159221 135536 17508 -94190
152i4190k9908M1319O7585P1236N9867J3133o2101j08689q2073k95P7358J00472
$$ -94190 -124098 -82779 -15194 56042 115909 129042 66941 -41748 -123821 -124116 -46758 53714
164E3714O5574j054o1141q4882o6890k1670L3993Q2843R2066M1209m6937j03540
$$ 53714 119288 118234 57093 -27789 -94679 -116349 -82356 487 92553 133762 86825 -16715
176a6715q6117k0261L7750O7157P5352N3565q021q0592j01915m9592K8755P4193
$$ -16715 -102832 -123093 -85343 -18186 57166 110731 102710 22118 -79797 -129389 -100634 -26441
188b6441P3685M5279M212m6683q3892p3513j1416O2610R5267O6258L175n2454
$$ -26441 47244 92523 96735 50052 -33840 -107353 -118769 -56159 39108 105366 108541 56087
200E6087p4677o1546k1653L2938P5684P8669L2667l4459p8509p4089l0973K3770
$$ 56087 -18590 -80136 -101789 -68851 6833 85502 118169 83710 5201 -68888 -99861 -76091
212g6091O4478P3789M3938j2625o4651p9694m6630R795N7662P2797M9783L57n0277
$$ -76091 -11613 62176 106114 93489 28838 -50856 -97486 -87691 -30029 42768 92551 92908 42631
225D2631p4641n7630q121M4809P3277O0907J3514m1305p1528o1052j8700L1253
$$ 42631 -32010 -89640 -97761 -52952 20325 81232 94746 53441 -18087 -79139 -97839 -66586
237f6586O3372O3816L0737k1874o5013o9407l3106K1226O1064O6162L6506j2053
$$ -66586 -3214 60602 91339 69465 4452 -64955 -98061 -76835 -15771 50391 86897 74844
249G4844n3654o6394m1277O565M9111O5548M7705L223m4296o6855n0353o509L9817
$$ 74844 21190 -45204 -86481 -79916 -30805 34743 82448 85671 41375 -25480 -75833 -82342 -42525
262d2525O3396N3339J6320l2784o3590n7169j7623K8980N6581N3469K5688j6386
$$ -42525 20871 74210 90530 57746 -5844 -63013 -80636 -51656 4925 58394 84082 67696
274F7696n2852o1796l4461J4185N4020N9604L3029r885m6837n8745l9571J896
$$ 67696 14844 -46952 -81413 -67228 -13208 46396 79425 69540 22703 -36042 -75613 -73717
286g3717M0933N8263M3191L842l7182n8370m6807r327L2498N4709M7319J6202
$$ -73717 -32784 25479 68670 72512 35330 -23040 -69847 -79174 -46676 8033 55352 71554
298G1554k4155n3269n3147k0434K4063N1563M8834K2874j3210m2372n2610l2102
$$ 71554 47399 -5870 -59017 -79451 -55388 -3825 45009 67883 54673 12301 -40309 -72411
310g2411R238M5553N4925L2693o070l8703n0270l5502k689L4146N2704M1332N940
$$ -72411 -63173 -17620 37305 69998 63928 25225 -25045 -60547 -63236 -29090 23614 64946 70886
323G0886l1818n0377m0666j0985K4133M7308M4792J6101k0944m6387m5432k0521
$$ 70886 39068 -11309 -51975 -62960 -38827 8481 53273 69374 48430 2043 -43389 -63910
335f3910J5534M2574M5666K3023j1076l7936m6481k9841L690L7033M8505L0675
$$ -63910 -48376 -5802 39864 62887 51811 13875 -32606 -62447 -58757 -21724 26781 57456
347E7456l037l2687m4079l3864n996K7128M5852L8505Q448k4842m3319l8228j2518
$$ 57456 54419 21732 -22347 -56211 -62207 -35079 10773 49278 57726 32884 -10435 -48663 -61181
360f1181K0055M0891M0125J8060j4310l9922m2317k0135J3314L7517M0400K3020
$$ -61181 -41126 -235 39890 57950 43640 3718 -38599 -58734 -45420 -7903 32497 55517
372E5517n831l2200m2404k8160K730L1181M2598L0034R25k8031m0139l0714o013
$$ 55517 49686 17486 -24918 -53078 -50348 -19167 23431 53465 54390 26359 -13780 -44494 -50507
385e0507K1833L8828L6136J0282k1396l9616l4077j2023J4753L4798L6275J7914
$$ -50507 -28674 10154 46290 56572 35176 -4440 -38517 -50540 -35787 -989 35286 53200
397E3200j2166l5232l8156k0035R122L2195L7130K1723m524k8397l7438k6331
$$ 53200 41034 5802 -32354 -52389 -43267 -11072 26058 47781 43257 14860 -22578 -48909
409d8909m22K6554L8025K8165K345k3073l5981k9301o784J9213L4530L1587J1520
$$ -48909 -49331 -22777 15248 43413 45758 22685 -13296 -42597 -49381 -30168 4362 35949 47469
422D7469j6039l4315l2634j2140J3897L0764L1707J7755p837k9322l4694j9554
$$ 47469 31430 -2885 -35519 -47659 -33762 -2998 28709 46464 38627 9305 -25389 -44943
434d4943O281K7687L4454K1828j972k4745l3723k3925k126K1822L2921K6546M736
$$ -44943 -38662 -10975 23479 45307 43335 18590 -15133 -39058 -41184 -19362 13559 40105 44841
447D4841j9333l1660k7238q320J4340L0195K8637J1901j1934k8908l1070j5603
$$ 44841 25508 -6152 -33390 -41710 -27370 2825 31462 43363 31429 2521 -28549 -44152
459d4152R244K8959L1080J4807p050k4234k9498k0255J363K3062L1969K1544M11
$$ -44152 -34908 -5949 25131 39938 32888 8654 -20844 -41099 -39736 -16674 15295 36839 37250
472C7250k1242l0111k2233l585J6960K8886K5296Q284j4545k9368k6497q671J3372
$$ 37250 16008 -14103 -36336 -39921 -22961 5925 31221 39505 24960 -4408 -30905 -39576 -26204
485b6204K6442K5767J2299o859k4464k8461j6379N394K4817K9160J7127m306k1071
$$ -26204 238 26005 38304 31445 6981 -21480 -37859 -32465 -7648 21512 38639 34333 13262
498A3262k6734j8762j857J7084K7925K3921M308j8910k8777k1335m322J2650K3710
$$ 13262 -13472 -32234 -34091 -17007 10918 34839 39147 20237 -8540 -29875 -34197 -21547 2163
511B163K3833J1192r880k6743k6803j1827J0838K4360K3170J2237m586j9065k5970
$$ 2163 25996 37188 27308 565 -26238 -38065 -27227 -2867 20303 32540 27954 8889 -17081
524a7081j8483R64K1494K7615J7001j652j7085k2985j8920m534J2609K5179K3683
$$ -17081 -35564 -34600 -13106 14509 31510 29858 12773 -10212 -29132 -33666 -21057 4122 27805
537B7805O796j4523k5621k1122n093J0837J9793K1257J2332n021k2205k5704j2626
$$ 27805 34601 20078 -5543 -26665 -31758 -20921 -1128 20129 32461 27440 5235 -20469 -33095
550c3095P985K1164K1134J1991j460j4742k2946j8513j582J7979K5197J6490q19
$$ -33095 -25110 -3946 17188 29179 27719 12977 -9969 -28482 -30064 -12085 13112 29602 28783
563B8783j4273j9943j6758o119Q927K2045K1186P207j1225k1846j9586p097P317
$$ 28783 14510 -5433 -22191 -28310 -19383 2662 23848 31055 19830 -2016 -21602 -28699 -21382
576b1382J7745K0122J1771m369j8730k2733j2981M824J8658K0439J0712j623j2532
$$ -21382 -3637 16485 28256 23887 5157 -17576 -30557 -25733 -7075 13364 24076 22453 9921
589I921j8767j6756m155J4229K4341J7073l33j3974j7047j3860o773O503K0142
$$ 9921 -8846 -25602 -29757 -15528 8813 25886 25553 11579 -5468 -19328 -26101 -19598 544
602E44K2249P449j1777k0381j4814n933L436J4139K0287J4379l767j9896k1032
$$ 544 22793 30242 18465 -1916 -16730 -22663 -19227 -5088 15199 29578 25811 5915 -15117
615a5117r167M097J2758J7151J4422K153j3864k1402j3894r76J1022J7281J6318
$$ -15117 -24284 -20187 -7429 9722 24144 26297 12433 -8969 -22863 -23839 -12817 4464 20782
628B0782N451j1018j9630j5842m091P017J4766J8245J0861o866k0177j8407m233
$$ 20782 26233 15215 -4415 -20257 -24348 -17331 -2565 15680 26541 19675 -502 -18909 -23142
641b3142O006R691J3914J4955M118j6403k4149j1981P129J4869J1050R453O721
$$ -23142 -17136 -7445 6469 21424 25542 9139 -15010 -26991 -19862 -4993 6057 15510 22231
654B2231n368k0316k0207j971J5497J7212Q770L015k289j2051j8832j1208P949
$$ 22231 16863 -3453 -23660 -25631 -10134 7078 15848 18863 16574 4523 -14309 -25517 -17568
667a7568J8971J5138M556l911j1234j6254j0895L021J4161J4038Q240J579q070
$$ -17568 1403 16541 21097 17186 5952 -10302 -21197 -18176 -4015 10023 18263 19842 11772
680A1772j7783j6290P00J5583J5300N250K60k279j0683j8185r976J0675K1288
$$ 11772 -6011 -22301 -21601 -6018 9282 14532 14792 12513 1830 -16355 -26331 -15656 5632
693E632J2607k319p282o773j0306j2785j151J7725K1171N444j0266j1991q079
$$ 5632 18239 15920 8638 1865 -8441 -21226 -22377 -4652 16519 21963 11697 -294 -8373
706h373o671l625Q241J7572J2420j386j1194j3035j0501k391Q838J6124J1453
$$ -8373 -15044 -18669 -10428 7144 19564 18178 6984 -6051 -16552 -18943 -10105 6019 17472
719A7472o8p876r972j1075p429L817J6604J6744K569j0216j0778p316o295k685
$$ 17472 17404 9528 -444 -11519 -18948 -15131 1473 18217 20786 10570 -208 -7524 -13819 -16504
733a6504R189J8556J2703o059j7502j1571j839J352L063J0602J4607M281j1310
$$ -16504 -7315 11241 23944 17885 383 -11188 -13027 -11675 -8612 1990 16597 20878 9568
746I568j7593r446J588P080J0615J0243M826n731j2873j1983m362M005J1755J3662
$$ 9568 -8025 -17471 -15883 -8803 1812 12055 16881 11150 -1723 -13706 -18068 -14063 -2308 11354
760A1354O137n283j2034j0213n202N36P555J3666J1238o88j2905j3563n796L081
$$ 11354 17491 12208 174 -10039 -15241 -14705 -7150 6516 17754 17066 4161 -9402 -15198 -12117
774a2117O262Q583R768N262n655j5430j2112n05Q486J0714Q826M030l908j0744
$$ -12117 -5855 2728 12496 17758 12103 -3327 -15439 -15944 -7458 3256 12082 16112 12204 1460
788A460j1502n173L820J0264J1012O515k669j0633j1288n590J361P213J0298R643
$$ 1460 -10042 -15215 -11395 -1131 9881 16396 13727 3094 -8194 -13784 -12423 -5210 5088 14731
802A4731R24r898j3103p502J722O768Q548P784M343m782j2091j1104k721O728
$$ 14731 15655 5757 -7346 -14848 -13126 -6358 2190 9974 14317 9535 -2556 -13660 -16381 -9653
816i653J0872Q438L417l396r251r897n383L749R255R048N378q99p740j0785o883
$$ -9653 1219 9657 13074 9678 427 -9470 -14853 -11104 -1849 7199 12577 11678 3938 -6847 -13730
831a3730J547Q499R719O118P88n904j0547q792l08P697R309O702J657l864r085
$$ -13730 -12183 -3684 6035 12153 12941 7037 -3510 -12302 -12610 -4913 4396 11098 12755 8891 -194
846a94r327l628M509J0412Q836K715m269q214r183l970K538P957Q854M512j662
$$ -194 -9521 -13149 -8640 1772 10608 13323 9054 840 -8343 -12313 -9775 -1818 7036 11548 9886
861I886o627r222o682J18P949R545N794k43n769q805p001j563N640Q869P683J727
$$ 9886 3259 -5963 -12645 -12527 -4578 4967 10761 10518 4749 -4056 -11057 -12620 -6980 1889 9572 11299
877A1299m672q351p343l160L326Q276Q378M522k745q513q537m315K808P541P939
$$ 11299 6627 -1724 -9067 -12227 -8901 -625 7753 12275 9530 1017 -7520 -11835 -9027 -1486 6453
892F453M510p45n389q080p142p84P126R417N956m21n449p175o588j587L320Q190
$$ 6453 10963 10218 4829 -3251 -10393 -11177 -4051 5366 11322 10901 5452 -1723 -8311 -9898 -6578 1612
908A612P555K234l762q024p329k861K682O552P457M282j411o770q417n207J751
$$ 1612 9167 11401 7639 -385 -7714 -10575 -7893 -1341 6116 10398 8987 2217 -6200 -11407 -9656
923i656O971P451L582k68m346o789o403k121N184R040O419j36m824o638m795k080
$$ -9656 -2685 4766 8348 8080 3734 -3055 -9458 -11579 -6395 2645 9064 8928 4104 -2534 -7329 -9409
939i409K513O250P122L477k242p412o845k726K479N995N925L916m25n158p148
$$ -9409 -6896 -646 6476 9953 7711 299 -6546 -9272 -6793 -798 5127 9043 8618 3460 -3688
954c688n123K53O258P071L912n41l837n007n388k821L121P885O613Q04m834o081
$$ -3688 -8811 -8558 -2300 4771 8683 8142 4305 -702 -6090 -8911 -5790 2095 8708 9512 4678 -1403
970a403m474j749J702M833N931L893j560o433o754k925J633N392N390L639l57
$$ -1403 -5877 -7626 -5924 -1091 4840 8733 7173 740 -6014 -8939 -7306 -1914 3476 7115 6758
985F758m347o427m661k04N169O528M247j74l540n389m301j683K324O158O306K336
$$ 6758 2411 -4016 -8677 -8881 -3712 2816 7063 6889 3349 -2040 -6341 -8024 -5700 458 6764 9100
1001I100l790o019m778j318J765M261N582L499p24n268o123l083R22M668N330
$$ 9100 5310 -709 -5487 -6805 -5040 -779 4803 8302 7578 2310 -3813 -6896 -5974 -1306 4024
1016D024L252j84l297n546m486q92L586N947M296J97l472m316m518j959K052N270
$$ 4024 7276 7092 3795 -1751 -6237 -7129 -3543 2404 6700 6897 3425 -891 -5409 -7368 -5316 -46
1032d6N087K023k177n063n330j469J013M320M579L112N1m454n709l165P11M095
$$ -46 5041 7064 4887 -176 -5506 -6975 -5962 -1642 2937 6049 6100 1646 -4063 -7228 -6517 -2422
1048b422M831L368L72l706m586l974m14K482N145M775P17k477m727l718j730J736
$$ -2422 2409 5777 6149 2443 -2143 -6117 -6531 -4049 1096 5871 6588 4111 -616 -4334 -6064 -4328
1064d328M366M989K409k042m285m682k296J325L912M255K730k01l577m731l901
$$ -4328 38 5027 7436 5394 1109 -3573 -5869 -4544 -632 3623 6353 6152 2575 -2156 -6057
1079f057J39L266N384L044k38k534m663l524q03K050M732L891J203j850m618m215
$$ -6057 -5918 -2652 2732 5776 5538 3004 -1659 -5183 -5986 -3936 796 4687 5890 4040 -578 -4793
1095d793j552J532L857M348K170q60m455m543k378J439L567M231K165K78k694
$$ -4793 -6345 -4813 -956 3392 5562 4702 247 -4296 -6674 -5235 -1668 2563 4728 5006 2312
1110B312m543l410p7L120N055K989r3k428l893k995j250J509M379M172J390k390
$$ 2312 -2231 -5641 -5718 -2598 2457 5446 5353 2925 -968 -3963 -5213 -3704 675 4847 6237 3847
1126C847l941l642p56J072L157L789J881l23l779l816k657Q64L462L302J999K47
$$ 3847 -94 -3736 -4492 -3420 -263 3526 5407 5084 1305 -2511 -5168 -4304 -842 2460 4459 4706
1142D706k483l684l357p62K878M512K452L62k787l356k406r83J372L348L476J633
$$ 4706 2223 -1461 -4818 -5580 -2702 1810 4262 4624 1837 -1519 -3925 -4908 -3536 -188 3288 4921
1158D921j632l958l400r52J855K861K765J728j04l424l551k356R86L436L308J506
$$ 4921 3289 -669 -4069 -5021 -3166 -305 2460 4188 4084 660 -2891 -5247 -4261 -825 2483 3989
1174C989L88k519l029k378j042K555L880K599K14k124l321k759j88J130L185L103
$$ 3989 4377 1858 -1171 -3549 -4591 -2036 1844 4443 4657 2533 -788 -3547 -3735 -2605 580 3683
1190C683J327j356l398l584j426J404L598K832Q25n43k216l219k416Q0L122L583
$$ 3683 5010 3654 256 -3328 -4754 -3350 248 3080 3905 3362 1146 -2073 -4489 -4409 -1287 2296
1206B296J852p65k236k790k041r51J649L606L038J040k939l456k147k99J383K774
$$ 2296 4148 3383 1147 -1643 -3684 -4635 -2986 620 3658 4698 1759 -1697 -3844 -4143 -2760 14
1222A4K802J475j041k571l910j135Q55K983L463J203o61k413k278k018l00J655
$$ 14 2816 4291 3250 679 -3231 -4366 -3511 -528 2935 4138 3477 1064 -1214 -3232 -3532 -1877
1238a877L794K493j85k690k959j277k47J168J893K871J397j058l859k960n3J941
$$ -1877 1917 4410 4225 1535 -1424 -2701 -2948 -1780 113 2984 4381 3323 -536 -3496 -3549 -1608
1254a608J847J728J122J32k117l607j881P77K771K969J177m82k273k337j457k9
$$ -1608 239 1967 3089 3221 1104 -2503 -4384 -3607 -836 2133 3310 2828 555 -1782 -3239 -3268
1270c268J151K878K246J54j753l221j356J12J586K023J497J221m58k579l190j238
$$ -3268 -2117 761 3007 3161 1408 -1813 -3169 -3057 -1471 552 2049 3270 2812 233 -2957 -4195
1286d195K455L145J349k28p43n95j785k689k49L066L536O30j353j749j398j232
$$ -4195 -1740 1405 2754 2526 1783 1188 -597 -3286 -3535 -469 3067 3697 2344 595 -803 -2035
1302b035n07R18K829K434l3j772l198j532J90J281K490J076O61n93k019k621j334
$$ -2035 -2542 -1624 1205 3639 3606 1834 -1364 -2896 -2706 -1425 1065 2141 2802 2209 190 -2431 -3765
1319c765Q80K858K871n08j282j040j218j506p27J576L302K535j240k859j958k71
$$ -3765 -2885 -27 2844 2336 1054 14 -1204 -2710 -3437 -1861 1441 3976 2736 -123 -2081 -2352
1335b352N6L41K201K279J165j784l452j781Q72J716J431P32J192K65k025k710
$$ -2352 -2296 -1955 246 2525 3690 1906 -1546 -3327 -2455 -739 692 1424 2616 2881 856 -1854
1351a854j337J027K139K363O51q10j332j623j053l26Q16K169K258P06k849k913
$$ -1854 -3191 -2164 -25 2338 2989 2179 847 -776 -1829 -2155 -1339 830 3088 3794 945 -1968
1367a968l81N09P83J016J495J425m25k673k496p62J897J993J185k53O29q54k309
$$ -1968 -2349 -1840 -1057 -41 1454 2879 2454 -219 -2715 -3477 -1580 413 1598 1345 1974 1120 -1189
1384a189k117J85K543J996R54j033j198q47o65q14L33K025K033M37j382k074j491
$$ -1189 -3306 -3121 -578 1418 2372 1339 141 -706 -1371 -2185 -1852 173 2206 2643 1261 -813 -2304
1401b304O63J292P03J048R60L4j757k359p11J273J784J243n2j60p11j368j457
$$ -2304 -1641 -349 354 1402 2362 2396 639 -1720 -2431 -1158 626 1869 1817 1657 946 -422 -1879
1418a879k69J690J929R11o08j445j285k69j41K80J182J539O93r57k169j637K77
$$ -1879 -2148 -458 1471 2382 1774 329 -956 -1225 -1366 -1086 96 1635 2328 1371 -798 -2435 -2158
1435b158J191J195Q23M00j96j043j834j331Q52J912J813j85l64p40r49j466n77
$$ -2158 -967 228 1051 1451 1255 212 -1622 -2953 -2101 -189 1624 1439 1075 335 -614 -2080 -2657
1452b657J739K139J367q07j141j422o51L1P42J082J353P60n03k137j702k37J155
$$ -2657 -918 1221 2588 1781 640 -782 -1433 -1402 -660 422 1775 2535 2032 -105 -1807 -2044 -889
1469h89J286J132L41J01j176j872r95K58J715J601M60m21j054p29r81q86M82K025
$$ -889 397 1529 1870 1971 795 -1077 -2072 -1814 -99 1502 1962 1541 487 -242 -1223 -2109 -1627 398
1487C98J373N1j388j154r97Q6JQ89J761Q45o10j537j360q07R71J262N44R97K4
$$ 398 1771 1822 434 -720 -1717 -1631 -1630 -741 1020 1865 1255 -282 -1642 -2449 -1478 -216 328 1325 1349
1506A349n62j380j301K67R09J526N58K56j083o17p24p18%J681J700J42p06j522
$$ 1349 787 -593 -1894 -1627 -718 808 1366 1622 539 -78 -802 -1520 -1520 161 1861 2003 1297 -225
1524b25q59L30J0M92J142P48K36j651j168m41M22R08J073K26On40r53j061k49
$$ -225 -1084 -754 -744 -252 890 1638 1874 223 -945 -1386 -964 -56 1017 1243 1249 709 -244 -1305 -1554
1543a554J039J410M76l89n38o80r74o17M81J011J600J21j013j267l29m9M2O50
$$ -1554 -515 895 1371 982 444 -236 -1210 -1827 -1346 -335 1265 1386 373 -894 -1223 -1272 -1230 -580
1561e80J134Q52l0j249j286n68Q39R23N31O62K1l67j147j350K40J022J137N92
$$ -580 554 1406 1376 127 -1159 -1727 -888 35 566 1228 1249 882 -265 -1615 -1375 -353 784 1376
1579A376k13l21n87q86n64L27Q67J511L95n30j370j126j27M80O70M93J054K97
$$ 1376 1163 842 255 -631 -1195 -868 -1 1510 1905 1375 5 -1121 -1248 -768 -98 395 1449 1746
1597A746q52j958n41M38J087N97J41J69l2q35j493l58Q74J449N00L5r45k78n06
$$ 1746 894 -1064 -1605 -1167 -80 517 658 827 795 -40 -1533 -1891 -1017 432 932 967 22 -256 -762
1616g62n41LO52J681J41m85j176n90M7K09M81P74L10N81o64r13p19o6O32R50Q67
$$ -762 -1303 -1300 -648 1033 1174 689 -487 -1077 -1030 -821 -340 434 744 1325 661 -252 -971 -1037 -405 545 1412
1637A412j11p49o58m12k50J69J009P80L30o51o52o95J10n5J6Q41O89L60j283j002
$$ 1412 1301 552 -106 -518 -768 -599 410 1190 1520 869 217 -478 -368 -423 -407 434 1123 1483 200 -802
1657h02l99N32O35J63N50L38l31j227p99q4Q45Q70L39j28k01o18o31l54N49M75
$$ -802 -1201 -669 -34 129 679 1017 686 -541 -1340 -1424 -579 291 630 502 301 -317 -948 -1302 -753 -278
1677b78R73P57o42r23q57n4K19Q57N70K67M8l81q11q92M81L88R21N2O0M3k83j359
$$ -278 695 1452 810 -113 -970 -1024 -805 52 622 889 937 556 -255 -1147 -666 -278 643 695 755 798 515 -844
1699h44k90O54J291K27j85k18o11o42k23L95N04M37K64j47p37m83m33M43M49L57
$$ -844 -1134 -480 811 1038 853 635 24 -618 -841 -446 58 495 759 612 -125 -608 -1041 -598 -149 208
1719B08N72l09n58m13l99O4L81P57K76k36k36k75n60m03L47O90Q66J07r14m28
$$ 208 780 471 -87 -500 -899 -835 -454 303 579 343 107 -168 -728 -1131 -784 -94 772 879 -35 -463
1739d63j1RO2J69Q14O41l53o29p04j81K97L71M29K26j4j16n70n84O9M72N80M50
$$ -463 -474 -465 -403 -234 580 1221 868 239 -465 -646 -349 22 451 677 663 547 -23 -607 -538 -66 514 964
1761I64q6k07q22n49mJ11R93L44j26k32o81n28J85L39M88j16N11R6o78o11j68
$$ 964 878 671 -151 -700 -704 -593 400 744 618 386 -295 -823 -638 -299 189 73 584 680 2 -609 -777
1782g77m9Q41M89l73P9M4o92m02k30M16J006L48n1m34j15m66l06M57L13N96J59
$$ -777 -826 15 504 131 210 254 -438 -840 -1070 -654 352 700 649 215 100 -366 -672 -215 98 694 853
1803H53m09k66o91j84M78Q0N33J95K45n80m93m67K24L62P36L81n64L0n49k88p3
$$ 853 444 178 -513 -697 -219 -139 394 589 834 254 -239 -706 -482 -120 616 997 433 463 -86 -374 -447
1824d47n4O71K51M8n9m95k80m4k6R1M03P06l51o06o80J48M83O2J96M19k62L10
$$ -447 -501 170 421 469 410 -85 -365 -409 -435 -344 59 765 414 -192 -872 -724 -241 -179 17 436 174 484
1846D84p41l76q9O34L78K31l25k46Qj14l53K53K90M54K6k23n51n1J85J41o6J57
$$ 484 -257 -633 -722 -88 290 521 196 -50 -42 -156 -509 -256 34 488 514 291 -260 -311 -126 15 -51 106
1868A06Q80k06p31o32k4P76O38o79K32J70k94k27n93j2O75N88n21j58rl85k89
$$ 106 986 780 49 -583 -607 169 807 128 360 530 236 9 -584 -596 79 667 146 -12 -21 -406 -695
1889f95L67j63N51L59R0r9r67o3M68j10L27K06K28k46l8p17m34P44M28O28p30
$$ -695 -328 -491 60 419 509 410 -557 -620 -152 -262 65 271 499 253 215 -502 -936 -192 236 864 134
1910A34J9j82K01l11o10L77J038L22o52q25J52M10l90m1O18L17O28p68q79O3J49
$$ 134 153 -29 172 -139 -749 -372 666 988 336 -489 -337 73 -317 -358 260 577 1205 437 -442 -379 -230
1931b30M51l7K54K87J00n59m40k31K63K46J97k20q2K27l95j15k59p0M54N78K8
$$ -230 221 184 438 725 825 266 -174 -405 -142 104 301 81 -1 226 -169 -284 -543 -613 -159 419 447
1952D47m69n20K05N82m41n07M78P27K03r80l53M22J98K01n58N02N2M40q45p84
$$ 447 -22 -542 -337 245 -196 -703 -225 502 705 -275 -628 -206 -8 193 -365 137 189 629 -216 -1000
1972a000P63N06J92k81J73p5o7l08k55J51L67L23K53o67k98j52N69j97N0o5M32
$$ -1000 -237 269 461 180 353 278 211 -97 -352 -201 166 489 742 75 -223 -375 194 -3 47 -18 414
1993D14J89n51n50N4O52P2Om80j6L77j7p77Q1L79M48j25l5m95M30k3l48l03Q77
$$ 414 603 52 -498 -444 208 280 286 -194 -210 167 150 -627 -546 -167 281 156 121 -374 56 33 -315 -618 259
2016B59J50j18j51n27O1K75J5j88M01J10n5k36j48l79M75N28J30k97j10R2j58
$$ 259 409 291 140 -387 -326 -51 -36 -224 177 287 232 -4 -152 -531 -56 472 602 305 195 287 129
2037A29j31n87L57N36M32m32n81j96O52r5p17L47O57O34m94p40j04J41L75o5P
$$ 129 -2 -589 -232 304 736 304 -277 -473 179 84 -633 -286 371 1005 511 -229 -333 -192 183 118 125
2058A25J38q0k7l68l80M16K39J18k52j90M67J96p45J83k76L62M38j28k54j98L18
$$ 125 263 183 156 -212 -592 -176 63 181 -71 -261 206 402 -343 -160 -436 -74 364 236 -18 -216 102
2079A02K66n56l96N38O70Mm00q27M95M43j81k63J7K13J62k35l18k71N83K90p2
$$ 102 368 -188 -584 -46 624 628 228 -599 -104 339 158 -105 -88 125 287 52 -266 -537 46 336 264
2100B64l93K55M2j52q1o75N32M96q2j21j4o21N63j46j59R3M18o1Pm26o18P19J98
$$ 264 -129 126 168 16 -65 -740 -208 288 206 85 71 -550 13 -133 -292 -199 219 158 165 -261 -879 -160 38
2123C8l5j01L19j23j1k56m67O56O1K72l61M9N1j52n6k96N44J26K75k33l22k10
$$ 38 3 -98 221 98 87 -169 -636 20 81 353 -8 41 92 -60 -116 -412 132 258 533 300 -22 -232
2145b32J16J51J87j10n0M57l29j28n12N45j83J32J50j45pM0k49N3P4K65rk01R8
$$ -232 -116 35 222 112 62 519 190 62 -450 95 -88 44 194 49 42 82 -167 -114 -40 225 216 15 113
2168A13J99o69M79j65l0K69O6J22l39l77j19L94N43k50k41K78J39l49k22O8J39
$$ 113 312 -357 122 -43 -73 196 262 384 45 -332 -451 -57 486 236 -5 273 412 63 -159 -91 48
2189D8L86k99j38m9J67jL8k71J88N9Q4k71k39K47R4j51J2L56Qj48k17q8j30R6
$$ 48 434 135 -3 -52 115 114 152 -119 69 128 212 -59 -298 -51 43 -108 -96 260 268 120 -97 -185 -315 -219
2213b19J15%mn3OM28l53q8R6K19K33k20j97PN0J13n59Q4L49M94j09m25k20j06
$$ -219 -104 -104 -108 -161 -155 273 -80 -168 -72 147 380 160 -37 -30 20 133 -426 -342 7 501 392 -33 -253 -359
2237c59M41j31j22J1J61l3n6k03L54l98N00j33O4j32q5M00n80J47J95L90k87r5
$$ -359 82 -49 -171 -160 1 -32 -88 -291 63 -335 165 32 96 -36 -121 279 -301 -154 41 431 144 49
2259D9j71l4J49j0j17m7M44M48n26n34K15M66j06k19P7K81m4l3n78n4M30L67m67
$$ 49 -122 -156 -7 -17 -134 -181 263 711 185 -349 -134 332 226 7 84 365 321 288 -290 -344 86 453 -14
2282a4j55L1M32k1m21j22K21J76J78m67r0J75M6M3l0j97K24L36m3p25J13K53L70
$$ -14 -169 -138 294 273 -148 -270 -49 127 305 -162 -252 -77 -31 12 -18 -215 9 345 302 -423 -310 -57 313
2305C13j2j16k70L11k65J81n34K26M21q4n4m37K81J24Ln10M58J13K06k97K3l70
$$ 313 301 185 -85 226 -39 142 -392 -166 255 171 117 -320 -39 85 88 -422 36 149 355 58 81 -289
2327b89J65L70k68q5N5J10Q1n26M2J01J56K34j09r4Q2j47j5R4J06J02l70M03n14
$$ -289 -124 246 -22 -107 -52 58 139 -387 -345 -244 -88 146 37 -57 25 -122 -137 -43 63 165 -205 198 -316
2350c16K2RM1N1R3j22M82r8l6l32J24K98q2l79K71K69j1k25p07M74M16q2Qj77
$$ -316 -294 -285 -244 -193 -100 -222 260 162 126 -206 -82 216 134 -245 26 295 284 59 -648 -174 242 160 168 -9
2374ik43P11k46m56K11J00Q6r4J59m79J66J79q8k0R9J48L10l59k69o2J33L22l45
$$ -9 -252 459 213 -243 -32 68 154 60 219 -260 -94 85 -3 -23 76 224 534 175 -94 -156 -23 299 -46
2397d6J02Q4O9j49k56J75J37q0M20o57J28p1L31j12m58K32l8L48l78K90m25J89
$$ -46 56 140 209 60 -196 -21 116 36 456 -201 -73 -144 187 75 -383 -151 -189 159 -219 71 -354 -165
2419a65L13n4l48j4O03k22j82m19M04J39N6k07J75ln7k73J24K97J15j31j06j85
$$ -165 148 94 -254 -268 335 113 -69 -488 -84 55 111 -96 79 76 19 -254 -130 167 282 151 45 -140
2441a40J81j44N8K9j21L87k29L86k11m47j5L75j7l26mN12l8j63j53K9J14K81j45
$$ -140 41 -103 -45 -16 -137 250 21 407 196 -251 -266 109 92 -234 -238 274 236 73 -80 -51 63 344 199
2464A99q8r2q0n0k24J41K42K96q9p90M29J45k01M16l50M97k39j35j5j18K68j56
$$ 199 111 19 -61 -111 -335 -194 48 344 255 -535 -106 39 -162 254 -96 401 162 27 12 -106 162 6
2486FO5k22L22P6k58q3k27J76K84J68j93m56P27k94j39L4n7L6K43M11n22k85j2
$$ 6 71 -151 171 247 -11 -94 -321 -145 139 307 114 -342 385 91 -48 -14 -71 -35 208 619 97 -188 -200
2509b00K18j21m0PJ00K50k77Q5O5P1J6j2m45L61j33j42O8J61m52M21mm29K44K42
$$ -200 18 -103 -143 -136 -36 214 -63 22 87 158 174 162 -283 78 -55 -197 -129 32 -420 1 -3 -432 -188 54
2533E4K3j68J46j38k12O97k05l86M36k84L04k23k38o1M34P6l83j07M35k38o3K9
$$ 54 77 -91 55 -83 -295 402 197 -189 247 -37 267 44 -194 -255 179 255 -128 -235 200 -38 -101 -72
2555g2R4J84n7j42n6p9J15L46k28m27N97R4m12P0qL7k16L97l58k9nM47J73q01
$$ -72 22 206 149 7 -49 -128 -13 333 105 -322 275 369 -43 27 19 56 -160 237 -121 -150 -155 292 465 -336
2579c36J9K71N60o40Q9l86O03J79m59J48j29J80k18l5N6K63r1j45o1J89Qn3m0
$$ -336 -317 -46 514 -126 -37 -423 180 359 -100 48 -81 99 -119 -154 -98 165 74 -71 -132 57 65 12 -28
2602b8J01m0j29J32J82l79M7OK64Oj81J82p8q7j25L03j50M1J54n53J67K24m1m81
$$ -28 73 33 -96 36 218 -161 -114 -108 156 162 -19 163 85 -2 -127 176 26 67 221 -332 -165 59 18 -463
2626d63J71J70M10l39K18m48L64R6k57J03j94L16j78J51J12j32j39k27M62n6k19
$$ -463 -292 -122 288 -51 167 -281 83 179 -78 25 -169 147 -31 120 232 100 -39 -266 196 140 -79
2647g9J21l29L8M5K12QQ1j44k87O55p6l19onL73j50m5n5K0p4j38O6K7k9M0J50
$$ -79 42 -287 -249 -204 8 16 97 -47 -334 321 245 -74 -80 -85 288 138 93 38 58 -16 -154 -88 -61 -90 -50 100
2673A00j21J21o9J74l95k17M72k38K11jj3J2j10k70J04L63j04Q1k52J96j93L6
$$ 100 -21 100 31 205 -190 -407 65 -173 38 37 24 36 -74 -344 -240 123 19 100 -152 44 -149 -113
2695a13J22K55m25o6N19l10k30L65o6k5j00j5JL1K16k69J1L51k72J38j7j69k59
$$ -113 9 264 -161 -227 292 -18 -248 117 51 26 -74 -89 -88 -57 159 -110 -99 252 -20 118 101 -68 -327
2718c27O69k23j00j82L16k11jJ16J23l62J14K30k57j18J55K6J55r3J21k66k94
$$ -327 342 119 19 -163 153 -58 -59 57 180 -182 -68 162 -95 -213 -58 -32 123 30 151 -115 -409
2739d09N72o5J11k20J20J06p17P17k65K06j5k63k2Q8J14l26L88O7j26j18J29n38
$$ -409 163 98 209 -11 109 215 -502 215 -50 156 141 -122 -144 -56 58 -268 120 187 61 -57 72 -466
2761d66O05K7n6J92j96k02L5J18k26K04K6j52L97l38J13J76k06J1q6k5K61k97
$$ -466 139 166 110 302 106 -96 -61 57 -169 35 61 -91 306 -32 81 257 51 62 -24 -49 212 -85
2783h5J0j0k18M84k52J57j38M0J27J21k37q3N2kL0k65K09J2O5r2k12J41J0L88
$$ -85 -75 -85 -303 181 -71 86 -52 -12 115 236 -1 -84 -32 -34 -4 -269 -60 -48 17 -75 -287 -146 -136 252
2807B52l37K76j67o3L20k90N3j46K09j3k92K01L70m73Q7l8K3L5K02k06J76k51
$$ 252 -85 191 24 -39 281 -9 44 -102 107 94 -198 3 373 -100 -13 -51 -28 7 209 3 179 -72
2829g2L58l06K58j38l2k32R7j76j42M70o9K00k30k46j9N7M04ml95K76Q1j21N5
$$ -72 286 -20 238 100 68 -164 -67 -243 -385 85 16 216 -14 -260 -279 -222 182 178 -217 59 140 19 74
2852G4J32k22Qj98m8L85o8k50K29J11l36L80l52J48Ro7k10K80j2J8k20QK2M15
$$ 74 206 -16 -8 -206 -254 131 63 -187 42 153 -183 197 -155 -7 2 -65 -275 5 -7 11 -209 -201 -179 236
2876B36m45NL59k91L33k12K04j88j43q0K75Q1j32J57k94J87K64l36j89K90L9O3
$$ 236 -209 -204 155 -136 197 -15 189 1 -142 -222 53 134 2 159 -135 52 316 -20 -209 81 120 183
2898A83j88P2k44K16l7J01j54n8K6n9M03m71N4K84n3Q3n1j26j9j08J63j28K28
$$ 183 -5 67 -177 39 2 103 -51 -109 -83 -142 261 -210 -156 128 75 158 107 -19 -38 -146 17 -111 117
2921A17J02n1n26M62j05j82j72J72J27p4L41k24k22j32M32p0L09j25l53K41k21
$$ 117 219 168 -358 104 -1 -183 -355 -183 -56 -130 211 -13 -235 -367 65 -5 304 179 -174 67 -154
2942a54J81J4j67K36%r1Q9l99N12p4K90n95R5O9k00J83K45l75L4K89k67K29k18
$$ -154 27 41 -126 110 110 19 108 -291 221 147 437 -158 -63 6 -194 -11 234 -141 -107 182 -85 144 -74
2965g4O7k46M58%k93j1J98K20k15r0j08n5NJ34J19pk69L62j40l7n2J75j71k3O2
$$ -74 -7 -253 205 205 -88 -99 99 319 104 14 -94 -149 -144 -10 109 102 -167 195 55 18 -34 141 -30 -53 9
2990IJ53n2j6J15m01L75l52K62j75J49J51n5j84J91k33L15k20o2P2l54N00o6L5
$$ 9 162 110 94 209 -192 183 -169 93 -82 67 218 163 -21 170 -63 252 32 -30 42 -312 188 122 157
3013A57P6l28K18j45J51J52m36K25j27J41l83M82l15J36K1j89j00K7J34J28k22
$$ 157 233 -95 123 -22 129 281 -155 70 -57 84 -299 183 -132 4 25 -164 -264 -237 -103 25 -197
3034a97J78K41k18l75M05J20j88j29k4L94j0r3k34qK98j22O9J35l59L84L3k30
$$ -197 -19 222 4 -371 34 154 -34 -163 -187 207 197 104 -130 -138 160 38 107 242 -117 267 300 70
3056G0m8j68J70l8k36k9QM72o6p2k6l1j21J27O9k13K28l08M07j54l08L76M6R3
$$ 70 22 -146 24 -14 -250 -279 -271 201 135 63 37 6 -115 12 81 -132 96 -212 195 41 -267 109 155 248
3080B48k93J96p9p5j12L4M1j9J5r6j25J87M08l91J48j23J0p1pj1N27m56m2J0j29
$$ 248 -45 151 72 -3 -115 -81 -40 -59 -44 -140 -265 -78 330 -61 87 -36 -26 -97 -104 -115 412 -44 -86 -76 -205
3105b05J35R7l64J73J19J33k72n8L36j58K70j62K16k43J9L00k82M3j66L6K68p1
$$ -205 -70 27 -337 -164 -45 88 -184 -242 94 -64 206 44 260 17 36 336 54 97 -69 -33 235 164
3127A64N6m28R1K14j7P5k31J8k9R7j52J26j91L30j24l88O87k36j18j83L51j4k78
$$ 164 220 -208 -117 97 80 155 -76 -58 -87 10 -142 -16 -207 123 -1 -389 298 62 -56 -239 112 98 -180
3150a80L83m41L19K4j05l14L96j19k29J22J67q7j24l0M06l55k3k20N66k02l7P2
$$ -180 203 -238 81 105 0 -314 82 -37 -266 -144 23 -64 -188 -218 188 -167 -190 -410 156 -46 -83 -11
3172a1ok16K46J13l40o0K31L52o04J82L52O0m50k5K80O0j31K02l71JL04l07J75
$$ -11 -17 -233 13 126 -214 -274 -43 309 -295 -113 239 299 -151 -176 104 164 33 235 -136 -135 169 -138 37
3195C7j6k24L14M0k9l22L29j33P4K38l12k00J42j7j54K78j96L11j80m6M7j51M61
$$ 37 21 -203 111 151 122 -200 129 -4 70 308 -4 -204 -62 -79 -233 45 -151 160 -20 -66 -19 -170 291
3218B91j08N6k17Nj08J29j10K11Kk19J50l07N49l47n9j62J58L99l74L2N4l36M08
$$ 291 183 239 22 27 -81 48 -62 149 151 -68 82 -225 324 -23 -82 -244 -86 313 -61 -29 25 -311 97
3241I7j47n1L86k36M8k31L25l98J39L72J3n09J21j37K14J97k96J9m1J55P0j7K4
$$ 97 -50 -101 285 49 97 -134 191 -207 -68 304 317 -192 -71 -208 6 203 -93 -74 -115 40 110 93 117
3264A17r1j72K32j22j95M39j25k12K4K61j32j08K3J20J30j82k39KK24p2j52L77
$$ 117 26 -146 86 -36 -231 208 83 -129 -105 156 24 -84 -61 59 189 7 -232 -230 -6 -78 -230 147
3286A47l9j3J05j41N6K7k17L72l54M23j02m7j61J9k97J45P2K01J14j33k30J0K1
$$ 147 108 95 200 59 115 142 -75 297 -57 366 264 217 56 75 -222 -77 -5 196 310 177 -53 -43 -22
3309b2KJ58k07o5%J75m26N10j30J8K61m44Q7L32j50k15J26Q9M0m77O78o01l9L12
$$ -22 -20 138 -69 -134 -134 41 -385 125 -5 13 274 -170 -83 249 99 -116 10 99 139 -338 340 -261 -300 12
3333A2J7J6J28O0l03R6p4K65m34k8J58J60j70K43j11N0oj31K00j77j0k24K83J14
$$ 12 29 45 173 233 -70 26 -48 217 -217 -245 -87 73 -97 146 35 85 79 -52 148 -29 -39 -263 20 134
3357A34L9n9l00J62R6Ll10L53k38j27O7P4J81J83j59j59O9K60j40L5p9Jj55J92
$$ 134 173 114 -186 -24 72 75 -235 118 -120 -247 -180 -106 75 258 99 -60 9 269 129 164 85 86 -69 123
3381A23k94K08j2j04k6K38r3l3Jr1K16j11J14k84J5j93K86n4m8K08R5l11L85K4
$$ 123 -171 37 25 -79 -105 133 40 7 8 -83 133 22 136 -148 -133 -326 -40 -94 -142 66 161 -150 235 259
3405B59j38m10K52R1l69L42K17j1k1l18j51J02L47k64m0L10j12j00L9lo5k66P3
$$ 259 121 -289 -37 54 -315 27 244 233 212 -106 -257 -155 192 -72 -112 198 86 -14 25 22 -43 -309 -236
3428b36M8L4pJ13J66k27J27j74J82J02k0k0k0N5J15j08k36J79J23j68L5M3j74
$$ -236 -188 -154 -161 -48 118 -109 18 -156 26 128 108 88 68 123 238 130 -106 73 196 28 63 106 -68
3451f8K42N9l42J36J4j46L5L04k38p6j49J28J20K00k79L96k87j94L20l23K05k72
$$ -68 174 233 -109 27 41 -105 -70 234 -4 -80 -229 -101 19 219 -60 336 49 -145 175 -148 57 -215
3473b15j12K61k14M01l12J62Q8k13N11l04jlK13k55J11m9j05J57K23m08M7J37
$$ -215 -327 -66 -280 121 -191 -29 59 -154 357 53 52 49 262 7 118 69 -36 121 344 -64 -17 120
3495A20O8l32J59L17m74K44l92Q27o74p3j68L77L0J48N7l12j00P1L7J3N7k60K53
$$ 120 188 -144 15 332 -142 102 -290 537 -137 -210 -378 -1 29 177 234 -78 -178 -107 -70 -57 0 -260 -7
3518gJ17m65L23m6j93K37P7P8j50J58N8n20L55R2j79L48k36lj27l6K69k7k26J04
$$ -7 110 -355 -32 -78 -271 -34 43 121 -29 129 187 -333 22 114 -65 283 47 44 -83 -119 150 123 -103 1
3542Aj1J60k34j57L28r0N8j92L91j56O2l03j71K52L0N4O6n2q2N5L22k99q4J80
$$ 1 -10 150 -84 -241 87 -3 55 -137 254 98 160 -143 -314 -62 -32 22 88 36 -46 9 331 32 -52 128
3566A28J27l54R9j21K09J3k27J88L1j62K58j15j76K81J2j84k54j15L23QN3j70
$$ 128 255 -99 0 -121 88 101 -126 62 93 -69 189 74 -102 179 191 7 -247 -362 -39 -31 22 -148
3588a48K21n11P90k91J53k67J03j38P0P1j50K33j77j6J1j4l82M29n3M8J04k54
$$ -148 73 -438 352 61 214 -53 50 -88 -18 53 -97 136 -41 -57 -46 -60 -442 -13 -66 -18 86 -168
3610a68M2J07L14k59o7m3K69n3N4k17nk33J27mJ6j08J17j5J20kO0j55J61K24j20
$$ -168 -126 -19 295 36 -31 -74 195 142 196 -21 -26 -259 -132 -136 -120 -228 -111 -126 -6 -8 52 -103 58 282 162
3635A62p4k94J91J86J0N0j96l99L15k25K84m8Kj52J71J65q2j43P1r5Rj5K35k53
$$ 162 88 -206 -15 171 181 231 35 -364 -49 -274 10 -38 -36 -188 -17 148 66 -77 -6 -101 -92 -107 128 -125
3659a25Q1j95J12K50k1N2l3l10L60R9j51p6j2p4K3j53K39oj23P7K83k96J05j38
$$ -125 -44 -239 -127 123 102 154 121 -189 171 270 119 43 31 -43 -20 -173 66 60 -63 14 297 1 106 -32
3683c2r2K17jK06o00K63K22k14k5k3nJ81K4J55l32J78p3l33J78L9j12N9j42M68
$$ -32 -124 93 92 298 -302 -39 183 -31 -56 -79 -84 97 121 276 -56 122 49 -284 -106 -67 -179 -120 -262 206
3707B06l57K62n2Nl1j07K59l52J80R0O5k52m0K03n56L90J25m0J99m15J40K3K41
$$ 206 -151 111 59 64 33 -74 185 -167 13 103 168 -84 -124 79 -477 -87 38 -2 197 -218 -78 -55 186
3730A86j97J02L2j83K40k60K72k91R9K13j38j69K64j63r1J6K47j53J33l76M25
$$ 186 -11 91 123 -60 180 -80 192 -99 0 213 75 -94 170 7 -84 -68 179 26 159 -217 208
3751B08j14k01PJ96J97m99K03j45K53jO1l63L72j57P8K7m22N59m51J92K6r8n7
$$ 208 94 -107 -100 96 293 -206 -3 -148 105 104 165 -198 174 17 95 122 -300 259 -192 0 26 -72 -129
3774a29R6j0k36Q9J88K79n13K92m24K14k02L14p0M34k01l97N56l32J90m5j29j14
$$ -129 -33 -43 -279 -190 -2 277 -236 56 -368 -154 -356 -42 -112 322 121 -276 280 -52 138 93 -36 -150
3796a50m7K56l40QJ48J7K11j12r3j89K64l74J99M3m3M02l40N1n6K16m0n3J03j4
$$ -150 -197 59 -281 -273 -125 -108 103 -9 -102 -291 -27 -401 -202 -159 -202 200 -140 -89 -145 71 31 -22 81 67
3820F7j1k39P2K65q1r7j24K2J37j0Q6n9j49K72k48J63j3k2K9m73M21k99M61l18
$$ 67 56 -183 -111 154 73 -24 -148 -126 11 1 87 28 -121 151 -97 66 53 31 60 -413 8 -291 170 -148
3844a48L70k70j10K66n7J6P2r0p8n8m28N66j24j14J92M31k68l17m3L09R7o0k04
$$ -148 222 -48 -158 108 51 67 139 49 -29 -87 -515 51 -73 -187 5 436 168 -149 -192 117 214 154 -50
3867e0K52j45J6j61K81j72m00J91K81j72Q3j15J3m5K28p8j79L8Q5o0J26O5j90
$$ -50 202 57 73 -88 193 21 -379 -188 93 -79 4 -111 -98 -143 85 7 -172 -134 -49 -109 17 82 -108
3890a08K47j83j37L22q2L2k04M91l87Pp2N6J5k10J27O4l0R5m5j19J47j14J36l76
$$ -108 139 -44 -181 141 59 91 -113 378 -9 -2 -74 -18 -3 -213 -86 -22 -52 43 -2 -121 26 -88 48 -328
3914c28Q1L03M7p2j16R1O0P3j02J84k67K21j45l10K71L13l55q0K39j21r4j92K49
$$ -328 -247 56 103 31 -85 6 66 139 37 221 -46 175 30 -280 -9 304 -51 -131 108 -13 -107 -299 -50
3937e0j35J47P9k21K70k39O5K99l30J29o1L1L32l60j42J06%M3M6j52K44m50M86
$$ -50 -185 -38 41 -180 90 -149 -84 215 -115 14 -47 -16 316 -44 -186 -80 -80 -37 9 -143 101 -349 137
3960A37k49R0r5M02l14r5QJ08J01k48L2n8K04K5l41J98k1J20K55k01k57J14R3
$$ 137 -112 -22 -117 285 -29 -124 -116 -8 93 -155 -123 -181 23 48 -293 -95 -116 4 259 58 -199 -85 8
3983HR7j02M01n26K96k2j48K9J16J14k68K6o2J13J09l95K51K20Oj64l46L24j17
$$ 8 105 3 404 -122 174 152 4 33 149 263 -5 21 -41 72 181 -214 37 257 263 99 -247 77 -40
4006d0J25r7j2m69J48K81j23K02k53L03L9n7l4R1k92J20KL2J74o5O5N3MP6o8j53
$$ -40 85 -12 -24 -493 -345 -64 -187 15 -238 65 104 47 13 104 -188 -68 -66 -34 140 75 140 193 197 273 205 52
4032E2k4K5M6N9k85K51o9P3q4r3mO6l1J5n9k39K79J44P0l90j3J09J63K9q7J20
$$ 52 28 53 99 158 -127 124 55 128 44 -49 -53 13 -18 -3 -62 -301 -22 122 192 -198 -211 -102 61 90 3 123
4058A23l34O15m85o3M6K16j49J75q6J62j79k30L08l08J00J80j91q0M2O6J7k7M5
$$ 123 -211 404 -81 -144 -98 118 -31 144 58 220 41 -189 119 -189 -89 91 -100 -180 -138 -72 -55 -82 -37
4081c7J39l8k72L04o5m5M6k3K23K4j80r6K34R5k32o2Q6k07J66j84j5P8L77m15
$$ -37 102 64 -208 96 31 -14 32 9 232 256 76 -20 214 309 77 15 101 -106 60 -124 -139 -61 316 -99
4105i9O6o6J77m7j94J52K77k97J55Q2j75j21J0J7N1K51l42N68l83J53l42j4Q1
$$ -99 -33 -99 78 31 -163 -11 266 -31 124 206 31 -90 -80 -63 -12 239 -103 465 82 235 -107 -121 -40
4128d0J35J23j02j10j37R0J14L01k98q0k91M36j94o3J92j63Q8r6k4N8J31M9l23
$$ -40 95 218 116 6 -131 -41 73 374 76 -4 -295 141 -53 -116 76 -87 1 -95 -119 -61 70 119 -204
4151b04NK39R6q5j13Q7k02R7P0J39j89L45l67J71j05k15k5L44k08J22lj53J62
$$ -204 -199 40 136 51 -62 25 -177 -80 -10 129 -60 285 -82 89 -16 -231 -256 88 -120 2 -1 -154 8
4174Hk38m2K02K24m02K09M48k61j05lM9n5J28m86J80k3J65N9p7m6L6l35L26O4
$$ 8 -230 -272 -70 154 -248 -39 409 148 43 40 89 34 162 -324 -144 -167 -2 57 -20 -66 -30 -365 -39 25
4198B5k40N24l88m2J79k06J05j19J09J13p6r3K22K47k41j03k02j08J39j01K81
$$ 25 -215 309 -79 -121 58 -148 -43 -162 -53 60 -16 -109 113 360 119 16 -186 -294 -155 -256 25
4219B5j7K1k58N4N8O31p75K86j5k20K19p1NPj26L15L7p7L9o6j77J88L5m9L12l70
$$ 25 8 29 -229 -175 -117 514 -261 25 10 -210 9 -62 -57 -50 -176 139 176 99 138 72 -105 83 118 69 381 11
4245A1k8L33k93j6J62j59j15K38o9P4p0K75m48K17k65P1j10L26P7l18L46l99J46
$$ 11 -17 316 23 7 169 10 -105 133 64 138 68 343 -105 112 -153 -82 -192 134 211 -107 239 -160 -14
4268a4N2k84J91O0L27l24L06jl29M0p5NkQ1r8J86j68J34Q8k8m7j49R3J1j12J29
$$ -14 38 -246 -55 5 332 8 314 313 -16 24 -51 -46 -48 33 -65 121 -47 87 175 147 100 -49 44 55 -57 72
4294G2L28n96q2L76j58K26M8k93J86J35J83m30j45J2J02j43R6L19k14K28j21j28
$$ 72 400 -196 -278 98 -60 166 214 -79 107 242 425 -5 -150 -138 -36 -179 -83 236 22 250 129 1
4316AJ51m07K03K1j67K02q8q6L56k30k32J65K45k44J62J6L2J33j23n3K2j04k5
$$ 1 152 -255 -52 -31 -198 4 -84 -170 186 -44 -276 -111 134 -110 52 68 100 233 110 57 79 -25 -50
4339e0K15j67K7J35j8J86r4j24k13K70k19J54J40k07m3l2M7j13L90k71L64l97
$$ -50 165 -2 25 160 142 328 234 110 -103 167 -52 102 242 35 -8 -40 7 -106 284 13 377 -20
4361b0K96r5j47O1j41J83j99RM0J78l16j8p9L4J23J80k30J42R5O2j65o9J21l0
$$ -20 276 181 34 95 -46 137 -62 -53 -13 165 -151 -169 -248 -214 -91 89 -141 1 96 158 -7 -76 45 15
4385A5J08J17J15k11k44j03M07o0r4L8k38L12p1k82R9J22L0k77J24j13J15k39
$$ 15 123 240 355 144 -100 -203 204 144 50 88 -150 162 91 -191 -92 30 60 -217 -93 -206 -91 -330
4407c30L96L8j1j77n4K44Q2l50R8r6O00k90l94K73j31J51j05p3J5J50J13j04k15
$$ -330 66 104 93 -84 -138 106 188 -162 -64 -160 440 150 -244 29 -102 49 -56 -129 -114 36 149 45 -170
4430a70K83L4N4j03m41J26J52L48m55L11n8%k23J35P1J17J20k04k04j30J80N52
$$ -170 113 147 201 98 -343 -217 -65 283 -172 139 81 81 -142 -7 64 181 301 97 -107 -237 -57 495
4452D95m29O3m8q7J82k02j78J18jln9K8L53k75M6P1K5o8k35J60J10j95O0K11k66
$$ 495 66 129 81 -6 176 -26 -204 -86 -87 -90 -149 -121 232 -43 3 74 99 31 -204 -44 66 -129 -69 142 -124
4477a24J88l5M8P7j48j5L3N7j25k56P3N43j52j02l3L9j90j24L7j17M38k62L8J18
$$ -124 64 29 77 154 6 -9 24 81 -44 -300 -227 316 164 62 29 68 -122 -246 -209 -326 112 -150 -112 6
4501Fo1r5j25J57K56J4J9j89K34j57j8N2l61R3J21R8r3J28np5k08J1L44o7j12
$$ 6 -55 -150 -275 -118 138 152 171 -18 216 59 41 93 -268 -175 -54 44 -49 79 74 -1 -209 -198 146 79 -33
4526c3N9p8r0p3J19J6J15K41l07p5J34O6j78L64k88J92j89M8J17j01j84N6M1J61
$$ -33 26 -52 -142 -215 -96 -80 35 276 -31 -106 28 94 -84 280 -8 184 -5 43 160 59 -125 -69 -28 133
4550A33j84J64J37m78m6L33m9J10k12k42J96J92k20K20l53L28p0j49J94L01j58
$$ 133 -51 113 250 -228 -274 59 10 120 -92 -334 -138 54 -166 54 -299 29 -41 -190 4 305 147
4571A47O5j12j91Q5p1M4l6J62J7j34p1J45n0M6J57l89K07l74M34j26N1j24J74
$$ 147 212 100 -91 -6 -77 -33 -69 93 110 -24 -95 50 0 46 203 -186 21 -353 81 -45 6 -118 56
4594E6j46J01J7k57J87J03N1l53J03j24R8J8K86k73O9k02K13L54j83j44K20n26
$$ 56 -90 11 28 -229 -42 61 112 -241 -138 -262 -164 -146 140 -133 -64 -266 -53 301 118 -26 194 -332
4616c32L76k41J38N43k25l36m02P87j36j67o7P6p8L25l20J36J29j87k34J10N4
$$ -332 44 -197 -59 484 259 -77 -479 308 172 5 -62 14 -64 261 -59 77 206 19 -215 -105 -51
4637e1K86l08Lk05L68k53J78j96N29k56J44k42M5j12J42k6j55K18K9j02m05N86
$$ -51 235 -73 -70 -275 93 -160 18 -178 351 95 239 -3 42 -70 72 46 -109 109 138 36 -369 217
4659B17n05P15n02J26p7Q4J27k24J89k08J10l67K83k81K05O08m97J19j58n1J24
$$ 217 -288 427 -75 51 -26 58 185 -39 150 -58 52 -315 -32 -313 -108 500 3 122 -36 -87 37
4680C7J28q4j34J77j77K72l23LJ2M04l97m2N3J88j28n7J4K73m1k9p9l24M06k11
$$ 37 165 81 -53 124 -53 219 -104 -101 -89 315 -82 -124 -71 117 -11 -68 -54 219 178 149 70 -254 152 -59
4704e9Q1J86k80J51k81L11k6Q0k99L57m1j66j94K75n1o9K63j93J66r6k50J02k13
$$ -59 22 208 -72 79 -202 109 83 163 -136 221 180 14 -180 95 44 -25 238 45 211 115 -135 -33 -246
4727b46P77k54k44R5k11J85l1J15m77O31n08K89j25k04K92j20J6k47L38L46o56
$$ -246 531 277 33 128 -83 102 71 186 -291 340 -168 121 -4 -208 84 -36 -20 -267 71 417 -239
4748b39K17K29j91kK39l01M7J77k52J45L01m02l4Q1K31j97k15L09j22j98J95k43
$$ -239 -22 207 16 14 253 -48 -1 176 -76 69 370 -32 -66 15 246 49 -166 143 21 -177 18 -225
4770b25L01j45q4M2j10O6K89l27J25l5P7K76j91O9k84J74j24k00K26n3L84k79
$$ -225 76 -69 -153 -111 -221 -155 134 -193 -68 -103 -26 250 59 128 -156 18 -106 -306 -80 -133 251 -28
4792b8k82R3K67K61n47N58l80o1M24m60j11K12j81M64j33j90Q2J78k30M7J4j9
$$ -28 -310 -217 50 311 -236 322 -58 -119 305 -155 -266 -54 -235 229 96 -94 -12 166 -64 -17 -3 -22
4814b2R7K8m56J94J36J90j51k23K75j9j2n44M00J72k59K78oo44O13kM5k14J16
$$ -22 75 103 -353 -159 -23 167 16 -207 68 49 37 -507 -107 65 -194 84 78 -566 47 45 90 -124 -8
4837hO6p2k6J15k13K74j47M8m2P2p3r1j39K55L14m09J73j04j78L07J14j65J79
$$ -8 58 -14 -40 75 -138 136 -11 37 -5 67 -6 -97 -236 19 333 -76 97 -7 -185 122 236 71 250
4860B50j91j6J31j71K61j52k37J31o1K36j36q7L47m71K63O9Rk37J98q0q2j8j17
$$ 250 59 43 174 3 264 112 -125 6 -55 181 45 -42 305 -166 97 166 175 -62 136 56 -26 -44 -161
4883a61M97k71j14J23j04J38L86n63N5j98L60l59L68n8j04m2o4m0J01R7k47L86
$$ -161 336 65 -49 74 -30 108 494 -69 -14 -212 148 -211 157 99 -5 -47 -111 -151 -50 47 -200 186
4905A86k31J19k33j32M47K7k60p7J37o7J48pl00K24q8J41L5q5q8o8O1K96M9l81
$$ 186 -45 74 -159 -291 156 183 -77 -154 -17 -84 64 57 -243 -19 -107 34 69 -16 -104 -172 -111 185 234 -147
4929a47L18o3q1K5nj7j49K98k50J68k9pO8R0l29J58J56j94k19L07l6k3j02R1K76
$$ -147 171 108 27 52 47 30 -119 179 -71 97 68 61 129 219 -110 48 204 10 -209 98 62 39 -63 28 304
4954C04r7k31j%r6J68k10j18L88j54L1K18k73ql3j39P6P3K63j10j95J5J39J96
$$ 304 207 -24 -25 -25 -121 47 -163 -281 107 -47 -16 202 -71 -79 -112 -251 -175 -102 161 51 -144 -129 10 206
4978B06l53j77J32K46r5j16l1J18J16J77m32L02l08O01l09J77Q1o16q8L12J09
$$ 206 -147 -324 -192 54 -41 -157 -188 -70 46 223 -209 93 -215 386 77 254 335 -281 -369 -57 52
4999E2k89l7M87k23n9P8R0j36j00kK34j62k2J15lo9j39L9P2R2n6J58l56K04j52
$$ 52 -237 -274 213 -10 -69 9 99 -37 -137 -139 95 -67 -89 26 23 -46 -185 -146 -74 18 -38 120 -236 -32 -184
5024a84L28l03J15j08rk9P4J93k0p9J75p0j7L15l91O1j09r3R8k01K51K17l23j42
$$ -184 144 -159 -44 -152 -161 -190 -116 77 57 -22 153 83 66 381 -10 51 -58 -151 -53 -254 -3 214 -109 -251
5048b51K05K70l46j21M59m0j44J48j25j00O1k83K04J65j68l7p8j3J41k01L34J54
$$ -251 -46 224 -122 -243 216 176 32 180 55 -45 16 -267 -63 102 -66 -103 -181 -194 -53 -254 80 234
5070B34m7k08k05j97L73j6J92l89M67L4Nl32L4M8J1j26K8j8J16r8j65J89N9k9
$$ 234 187 -21 -226 -423 -50 -66 126 -263 204 238 243 -89 -55 -7 4 -122 -94 -112 4 -94 -259 -70 -11 -40
5094d0J28j61JL6pK49j99R4O8l85M2M72n47K40j41K27NKL74n38K10q4P6m35K50
$$ -40 88 -73 -72 -36 -43 206 7 101 169 -216 -174 298 -249 -9 -150 77 82 84 458 -80 130 46 122 -313 -63
5119f3LL43m61J24Ll4l0K1j91K27p7K9N0P4Lj38L9M0J66l3j37M1O8j19j10L34
$$ -63 -60 283 -178 -54 -51 -85 -115 -94 -285 -58 -135 -106 -56 18 21 -117 -78 -38 128 95 -42 -1 67 -52 -162 172
5145A72N9m28L67LM0l50P1l7K81k28q1p3J58MO2k01L90r8L4m52J96l3L62m98M6
$$ 172 231 -197 170 173 213 -137 -66 -103 178 -50 -131 -204 -46 -42 20 -181 209 111 145 -307 -111 -144 218 -280 -234
5170b34K46j37J77j30J55J87m6j74J19k48J83j13K25l03J51j14l5k1K34j81p3
$$ -234 12 -125 52 -78 77 264 218 44 163 -85 98 -15 210 -93 58 -56 -91 -112 122 -59 -132
5191a32L69K32j21o25L03l4L24l74q3J45NL09l18j13L90o0j90q1j86K70n5k01
$$ -132 237 469 348 -277 26 -8 316 -58 -141 4 9 318 0 -113 277 217 27 -54 -240 30 -25 -226
5213b26K73J09k8j78k21M37k55l7J84R1j59R6J52k86R4K49n1o15L49j73L66J82
$$ -226 47 156 128 -50 -271 166 -89 -126 58 149 -10 86 238 -48 46 295 244 -371 -22 -195 171 353
5235C53J75l58l13K78j67J38J09m63p6M88r1j60Kp7O3K04p3j84K49q4j59o2J74
$$ 353 528 170 -143 135 -32 106 215 -248 -324 164 73 -87 -85 -162 -99 105 32 -152 97 13 -146 -208 -34
5258c4K6K61k44j84L87j28j15J98j10q3P9j42J1j56K89j16L3J72j47J32J38m32
$$ -34 -8 253 9 -175 212 84 -31 167 57 -26 53 -89 -78 -234 55 -61 -28 144 -3 129 267 -165
5280a65J56QJ27P3m37M88L3j9k82k22L28j76K56l71J54J63p1k28K60K2j45j24
$$ -165 -9 -1 126 199 -238 250 283 264 -18 -240 88 -88 168 -203 -49 114 43 -185 75 97 -48 -172
5302a72J20K14J17j52k56J63on1K15l91K69J0Q6k85K1k7L13l08P5J25L8J36l45
$$ -172 -52 162 279 127 -129 34 28 -23 192 -199 70 80 166 -119 -98 -125 188 -120 -45 80 118 254 -91
5325i1K02l60K04k2K54l39J26K02k91M9L00l10J67j29K63j20j25K13k09K60m05
$$ -91 111 -249 -45 -67 187 -152 -26 176 -115 -66 234 -76 91 -38 225 105 -20 193 -16 244 -161
5346a61J96j92J85j89J88K1j40k6N2P4L9q7J11l24K46K5Q8L9q1m5q0j95m4M05
$$ -161 35 -157 28 -161 27 48 -92 -118 -66 8 47 -40 71 -253 -7 18 106 145 64 19 -61 -256 -300 105
5370A05J19q5O1m14K75KK0l95K79K90l49NJ64J29l48K65k89J46j19K8P2J10J36
$$ 105 224 139 200 -214 61 63 83 -312 -33 257 -92 -87 77 206 -142 123 -166 -20 -139 -111 -39 71 207
5393B07l05J06j51K6j66J33K87k20m1J60o8o8n6K99m8k74K68l88K68Q5k80K33
$$ 207 -98 8 -143 -117 -283 -150 137 -83 -124 36 -32 -100 -156 143 95 -179 89 -299 -31 54 -226 7
5415GQ3j59k1k13N87j67j54O2J47l31K80J08m44K25j53L66j45j14qj15J22J38
$$ 7 90 -69 -90 -303 284 117 -37 25 172 -159 121 229 -215 10 -143 223 78 -36 -44 -159 -37 101
5437A01k76J33J9J20j75R6L7J20k39L75l52j61J44J0m6K9j93J80k1K1K5R3k08
$$ 101 -175 -42 -23 97 -78 18 55 175 -64 311 -41 -202 -58 -48 -94 -65 -258 -78 -99 -78 -53 40 -168
5460a68L89l00j2M2j44k33L21J00k51L56k55K16J73j74K1j55K86m9L76o50K4K01
$$ -168 221 -79 -91 -49 -193 -426 -105 -5 -256 100 -155 61 234 60 81 -74 212 163 539 -111 -87 114
5482A14j40L41m93o8J94p3M0oK0K45r1p4j18N6qR4j05k43K2K42r7j33j3K47QL6
$$ 114 -26 315 -178 -246 -52 -125 -85 -91 -71 174 83 9 -109 -53 -61 33 -72 -315 -293 -51 -148 -281 -294 -47 -39 -3
5508cj56K19N3j46j47L86k66R4R3k04N2N5l45K05J68O1r3m06M53J8p6j47J75j4
$$ -3 -159 60 113 -33 -180 206 -60 34 127 -77 -25 30 -315 -110 58 119 26 -380 73 91 15 -132 43 29
5532B9J06l71Q9M65k76k71J57k11M84l10J44nk56J79J52l26K34RL8k4o3K09OJ00
$$ 29 135 -236 -147 318 42 -229 -72 -283 201 -109 35 30 -226 -47 105 -221 13 22 60 36 -27 182 188 288
5556B88k83n2k20K66J36j46j88N4j02M51j94n9K40j72P0o2j81J68K3j08R5n8J86
$$ 288 5 -47 -267 -1 135 -11 -199 -145 -247 204 10 -49 191 19 89 27 -154 14 37 -71 24 -34 152
5579A52J31k04L15k99OJ23k17K0l4J30J22l47K01n3kj75J40rp8L4J80o8J29j92
$$ 152 283 79 394 95 101 224 7 27 -7 123 245 -102 99 46 44 -131 9 0 -78 -44 136 68 197 5
5603Ej53k56M57K01m43L08l05M55k73j04J76l14J99K92j48k20L44j25k21L25j96
$$ 5 -148 -404 53 254 -189 119 -186 269 -4 -108 68 -246 -47 245 97 -123 221 96 -125 200 4
5624DJ27j64L7N2k24K37J61Q7l32J01j45jK15k93K18j65O3O1j74J74k67J88K54
$$ 4 131 -33 4 56 -168 69 230 317 -15 86 -59 -60 155 -138 80 -85 -22 39 -135 39 -228 -40 214
$$ [...]
8191b23
##END NTUPLES=NMR FID
##END=
