##TITLE=1H_LR-576-OC1A
 CDCl3, 8 sc, 
 24.6.2019
##JCAMPDX= 6.0         $$ Bruker NMR JCAMP-DX V2.0
##DATA TYPE= NMR FID
##DATA CLASS= NTUPLES
##ORIGIN= UXNMR, Bruker Analytische Messtechnik GmbH
##OWNER= root
$$ XWIN-NMR		Version 3.5
$$ Mon Jun 24 15:52:38 2019 Russian Standard Time (UT+4h)  she@DPX200
##.OBSERVE FREQUENCY= 200.13155
##.OBSERVE NUCLEUS= ^1H
##.DELAY= (6, 6)
##.ACQUISITION MODE= SIMULTANEOUS
##.ACQUISITION SCHEME= undefined
##.AVERAGES= 8
##.DIGITISER RES= 18
##SPECTROMETER/DATA SYSTEM= spect
##.PULSE SEQUENCE= zg30
##.SOLVENT NAME= CDCl3
##.SHIFT REFERENCE= (INTERNAL, CDCl3, 0, 15.7039)
##AUDIT TRAIL= $$ (NUMBER, WHEN, WHO, WHERE, WHAT)
$$ ##TITLE= Audit trail, XWIN-NMR		Version 3.5
$$ ##JCAMPDX= 5.01
$$ ##ORIGIN= Bruker BioSpin GmbH
$$ ##OWNER= she
$$ F:/spectra/data/she/nmr/H-F/1/audita.txt
$$ ##AUDIT TRAIL=  $$ (NUMBER, WHEN, WHO, WHERE, WHAT)
(   1,<2019-06-24 15:51:34.03 +0400>,<she>,<DPX200>,
      <created by zg, POWCHK disabled, PULCHK disabled
       configuration hash MD5:
       00 E9 B6 7A A2 85 ED C7 34 08 36 98 17 FE 4E 26
       data hash MD5: 16K
       80 20 7B EF EE 38 A9 87 E0 D4 A6 D5 6F 68 F5 E0>)
$$ ##END=
$$ 
$$ hash MD5
$$ E3 ED 14 5B 15 C9 A2 20 5F 58 00 1C A0 0F 50 E3
##$RELAX= 
##$RELAX= 
##$RELAX= 
##$RELAX= 
##$RELAX= 
##$RELAX= 
$$ Bruker specific parameters
$$ --------------------------
##$DU= <F:/spectra>
##$EXPNO= 1
##$NAME= <H-F>
##$PROCNO= 1
##$TYPE= <nmr>
##$USER= <she>
##$AMP= (0..31)
100 100 100 100 100 100 100 100 100 100 100 100 100 100 100 100 100 100 
100 100 100 100 100 100 100 100 100 100 100 100 100 100 
##$AQSEQ= 0
##$AQ_mod= 1
##$AUNM= <au_zg>
##$AUTOPOS= <>
##$BF1= 200.13
##$BF2= 200.13
##$BF3= 200.13
##$BF4= 200.13
##$BF5= 200.13
##$BF6= 200.13
##$BF7= 200.13
##$BF8= 200.13
##$BYTORDA= 1
##$CFDGTYP= 0
##$CFRGTYP= 5
##$CHEMSTR= <none>
##$CNST= (0..31)
1 1 145 1 1 1 1 1 1 1 1 1 1 1 1 1 1 1 1 1 1 1 1 1 1 1 1 1 1 1 1 1 
##$CPDPRG= <>
##$CPDPRG1= <>
##$CPDPRG2= <>
##$CPDPRG3= <>
##$CPDPRG4= <mlev>
##$CPDPRG5= <mlev>
##$CPDPRG6= <mlev>
##$CPDPRG7= <mlev>
##$CPDPRG8= <mlev>
##$CPDPRGB= <>
##$CPDPRGT= <>
##$D= (0..31)
0 1.2 0 0 0 0 0 0 0 0 0 0.03 0 0 0 0 0 0 0 0 0 0 0 0 0 0 0 0 0 0 0 0 
##$DATE= 1561377093
##$DBL= (0..7)
120 120 120 120 120 120 120 120 
##$DBP= (0..7)
150 150 150 150 150 150 150 150 
##$DBP07= 0
##$DBPNAM0= <>
##$DBPNAM1= <>
##$DBPNAM2= <>
##$DBPNAM3= <>
##$DBPNAM4= <>
##$DBPNAM5= <>
##$DBPNAM6= <>
##$DBPNAM7= <>
##$DBPOAL= (0..7)
0.5 0.5 0.5 0.5 0.5 0.5 0.5 0.5 
##$DBPOFFS= (0..7)
0 0 0 0 0 0 0 0 
##$DE= 6
##$DECBNUC= <off>
##$DECIM= 24
##$DECNUC= <off>
##$DECSTAT= 4
##$DIGMOD= 1
##$DIGTYP= 9
##$DL= (0..7)
0 120 120 120 120 120 120 120 
##$DP= (0..7)
150 150 150 150 150 150 150 150 
##$DP07= 0
##$DPNAME0= <>
##$DPNAME1= <>
##$DPNAME2= <>
##$DPNAME3= <>
##$DPNAME4= <>
##$DPNAME5= <>
##$DPNAME6= <>
##$DPNAME7= <>
##$DPOAL= (0..7)
0.5 0.5 0.5 0.5 0.5 0.5 0.5 0.5 
##$DPOFFS= (0..7)
0 0 0 0 0 0 0 0 
##$DQDMODE= 0
##$DR= 18
##$DS= 0
##$DSLIST= <SSSSSSSSSSSSSSS>
##$DSPFIRM= 0
$$ [...]
##$SUBNAM2= <"">
##$SUBNAM3= <"">
##$SUBNAM4= <"">
##$SUBNAM5= <"">
##$SUBNAM6= <"">
##$SUBNAM7= <"">
##$SUBNAM8= <"">
##$SUBNAM9= <"">
##$SW= 24.9336996594482
##$SWIBOX= (0..15)
0 0 2 0 0 0 0 0 0 0 0 0 0 0 0 0 
##$SW_h= 4990.01996007984
##$TD= 16384
##$TD0= 1
##$TE= 0
##$TE2= 300
##$TE3= 300
##$TEG= 300
##$TL= (0..7)
0 120 120 120 120 120 120 120 
##$TP= (0..7)
150 150 150 150 150 150 150 150 
##$TP07= 0
##$TPNAME0= <>
##$TPNAME1= <>
##$TPNAME2= <>
##$TPNAME3= <>
##$TPNAME4= <>
##$TPNAME5= <>
##$TPNAME6= <>
##$TPNAME7= <>
##$TPOAL= (0..7)
0.5 0.5 0.5 0.5 0.5 0.5 0.5 0.5 
##$TPOFFS= (0..7)
0 0 0 0 0 0 0 0 
##$TUNHIN= 0
##$TUNHOUT= 0
##$TUNXOUT= 0
##$USERA1= <user>
##$USERA2= <user>
##$USERA3= <user>
##$USERA4= <user>
##$USERA5= <user>
##$V9= 5
##$VALIST= <valist>
##$VCLIST= <CCCCCCCCCCCCCCC>
##$VD= 0
##$VDLIST= <DDDDDDDDDDDDDDD>
##$VPLIST= <PPPPPPPPPPPPPPP>
##$VTLIST= <TTTTTTTTTTTTTTT>
##$WBST= 1024
##$WBSW= 4
##$XGAIN= (0..3)
0 0 0 0 
##$XL= 0
##$YL= 0
##$YMAX_a= 238509
##$YMIN_a= -412314
##$ZGOPTNS= <>
##$ZL1= 120
##$ZL2= 120
##$ZL3= 120
##$ZL4= 120
##$ABSF1= 10
##$ABSF2= 0
##$ABSG= 5
##$ABSL= 3
##$ALPHA= 0
##$AQORDER= 0
##$ASSFAC= 0
##$ASSFACI= 0
##$ASSFACX= 0
##$ASSWID= 0
##$AUNMP= <proc_1d>
##$AZFE= 0.1
##$AZFW= 0.1
##$BCFW= 1
##$BC_mod= 2
##$BYTORDP= 1
##$COROFFS= 0
##$CY= 11.3945322036743
##$DATMOD= 1
##$DC= 2
##$DFILT= <>
##$DTYPP= 0
##$F1P= 18.9103706918063
##$F2P= -1.10871071338519
##$FCOR= 0.5
##$FTSIZE= 0
##$FT_mod= 4
##$GAMMA= 1
##$GB= 0.15
##$INTBC= 1
##$INTSCL= 1
##$ISEN= 128
##$LB= 0.24
##$LEV0= 0
##$LPBIN= 0
##$MAXI= 10000
##$MC2= 0
##$MEAN= 0
##$ME_mod= 0
##$MI= 1.114404
##$NCOEF= 0
##$NC_proc= 0
##$NLEV= 6
##$NOISF1= 3.799351
##$NOISF2= 2.8
##$NSP= 1
##$NTH_PI= 0
##$NZP= 0
##$OFFSET= 15.70392
##$PC= 1
##$PHC0= -8493.034
##$PHC1= 5.200971
##$PH_mod= 1
##$PKNL= yes
##$PPARMOD= 0
##$PSCAL= 0
##$PSIGN= 0
##$REVERSE= no
##$SF= 200.130013532006
##$SI= 16384
##$SIGF1= 3
##$SIGF2= 2
##$SINO= 400
##$SIOLD= 16384
##$SREGLST= <1H.CDCl3>
##$SSB= 0
##$STSI= 0
##$STSR= 0
##$SW_p= 3612.71676300578
##$SYMM= 0
##$S_DEV= 0
##$TDeff= 0
##$TDoff= 0
##$TI= <>
##$TILT= no
##$TM1= 0
##$TM2= 0
##$TOPLEV= 0
##$USERP1= <user>
##$USERP2= <user>
##$USERP3= <user>
##$USERP4= <user>
##$USERP5= <user>
##$WDW= 1
##$XDIM= 8192
##$YMAX_p= 0
##$YMIN_p= 0
$$ End of Bruker specific parameters
$$ ---------------------------------
##NTUPLES= NMR FID
##VAR_NAME=  TIME,          FID/REAL,        FID/IMAG
##SYMBOL=    X,             R,               I
##VAR_TYPE=  INDEPENDENT,   DEPENDENT,       DEPENDENT
##VAR_FORM=  AFFN,          ASDF,            ASDF
##VAR_DIM=   8192,          8192,            8192
##UNITS=     SECONDS,       ARBITRARY UNITS, ARBITRARY UNITS
##FACTOR=    0.0002004,     1,               1
##FIRST=     0,             0,               0
##LAST=      1.6414764,     0,               0
##MIN=       0,             -412314,         0
##MAX=       1.6414764,     238509,          0
$$ Real data points
##PAGE= N=1
##DATA TABLE= (X++(R..R)), XYDATA
$$ plain form
0 0 0 0 0 0 8 -8 8 -8 16 -16 24 -24 32 -40 48 -64 72 -88 104 -121 142 -166 193 -222 254 -293 333 -380
28 -380 430 -488 547 -616 690 -772 862 -961 1068 -1188 1316 -1461 1617 -1791 1981 -2196
44 -2196 2433 -2700 2997 -3338 3729 -4184 4719 -5360 6147 -7136 8428 -10186 12747 -16833
58 -16833 24422 -43361 193325 229139 -86335 69273 238509 232476 48748 41569 151284
69 151284 198906 57047 -40041 -18 58257 -41520 -154680 -134481 -21011 -1165 -82023
80 -82023 -162159 -154335 -131550 -163018 -219251 -201539 -145563 -123148 -125088 -99210 -90264 -138450 -194865
93 -194865 -173976 -86690 -18089 -29219 -66679 -45997 20620 45715 13048 -18039 -9721 23012
105 23012 55032 75730 97605 125782 131620 86971 33653 32197 77229 109874 100930 83713 98144
$$ packed form
0@%%%%Qj6J6j6K4l2M0m8N6p2Q8j12J36j60J92k25K63l08L59m15M76n47O26p13
28c80Q10r18J035j163J306j462J634j823K029k256K504k777L078l408L772m177
44b196M629n133N697o335P067p913Q903j0079J1507j3283J5564j8614K2933k9580
58a6833M1255o7783K36686L5814l15474J55608J69236o033j83728p179J09715
69A51284M7622j41859r7088M0023N8275r9777j13160K0199J13470J9846q0858
80h2023q0136P824K2785l1468n6233J7712N5976K2415j940K5878Q946m8186n6415
93a94865K0889Q7286O8601j1130l7460K0682O6617K5095l2667l1087Q318L2733
105B3012L2020K0698K1875K8177N838m4649n3318j456M5032L2645q944j7217J4431
$$ plain form
118 98144 123806 106171 48395 11870 24787 54362 64968 55717 45230 49163 55825 43012 15044
131 15044 -6194 -16056 -16211 1396 30871 48223 36970 6526 -19730 -30939 -36612 -38567 -19224
144 -19224 9048 6327 -20395 -27930 -16451 -26609 -59890 -79048 -65703 -41434 -36783 -48554 -47072
157 -47072 -33639 -43419 -78224 -96950 -87886 -72584 -57284 -36457 -21998 -22881 -39322 -59088 -58904
170 -58904 -35889 -19451 -18306 -4746 23770 37427 32254 28612 31840 34745 33658 33420 50309 83610
184 83610 103094 94189 82755 79402 67964 54103 56023 67898 78719 88888 87095 68011 46028
197 46028 34141 28600 24192 17770 7983 6711 15463 13607 -3213 -18085 -29690 -45014 -58192
210 -58192 -58211 -48669 -34439 -27751 -39889 -56918 -62459 -63778 -70138 -71243 -58312 -42346 -33688 -33832
$$ packed form
118I8144K5662j7635n7776l6525J2917K9575J0606r251j0487L933O662j2813k7968
131A5044k1238r862j55J7607K9475J7352j1253l0444k6256j1209n673j955J9343
144a9224K8272k721k6722p535J1479j0158l3281j9158J3345K4269M651j1771J482
157d7072J3433r780l4805j8726R064J5302J5300K0827J4459q83j6441j9766J84
170e8904K3015J6438J145J3560K8516J3657n173l642L228K905j087k38J6889L3301
184H3610J9484q905j1434l353j1438j3861J920J1875J0821J0169j793j9084k1983
197D6028j1887n541m408o422r787j272Q752j856j6820j4872j1605j5324j3178
210e8192j9R542J4230O688j2138j7029n541j319o360j105J2931J5966Q658j44
$$ plain form
224 -33832 -36366 -34839 -32070 -37774 -41403 -32487 -18783 -9104 1114 11787 14504 8405 -1537 -9169
238 -9169 -5007 9992 24464 33699 36787 32792 26384 22442 18508 15464 20726 29469 33239 35987 40403
253 40403 39396 32991 25688 17375 13549 19622 27480 29933 33269 36464 31762 20889 9096 1261
267 1261 3675 12697 15889 13679 16042 15352 3534 -6978 -9613 -12478 -15538 -15749 -15202 -11536 -5836
282 -5836 -8649 -21918 -32030 -36664 -40772 -38528 -30373 -25961 -22546 -20198 -26576 -37655 -39436 -36710
296 -36710 -36776 -32338 -22182 -14138 -9089 -7631 -13281 -17336 -13065 -9558 -9125 -1521 9812 17157 22443
311 22443 23924 18283 14869 17549 17929 18901 30192 41081 41148 37520 34821 30576 27175 25446 22132
326 22132 23483 31165 33353 28943 27137 22860 13433 5900 2414 -253 2579 8585 7027 1633 233
$$ packed form
224c3832k534J527K769n704l629Q916J3704R679J0218J0673K717o099r942p632
238i169M162J4999J4472R235L088l995o408l942l934l044N262Q743L770K748M416
253D0403j007o405p303q313l826O073P858K453L336L195m702j0873j1793p835
267A261K414R022L192k210K363o90j1818j0512k635k865l060k11N47L666N700
282e836k813j3269j0112m634m108K244Q155M412L415K348o378j1079j781K726
296c6710o6M438J0156Q044N049J458n650m055M271L507M33P604J1333P345N286
311B2443J481n641l414K680L80R72J1291J0889O7l628k699m245l401j729l314
326B2132J351P682K188m410j806m277r427p533l486k667K832O006j558n394j400
$$ plain form
341 233 -4062 -15192 -22318 -23479 -22059 -16113 -12285 -14741 -16487 -16631 -22864 -32147 -32516 -28945 -25998 -20351
357 -20351 -15826 -15875 -14817 -14403 -21337 -27177 -23339 -16867 -12743 -7809 -3378 -757 1320 -2175 -9168 -9108
373 -9108 -1315 2633 4743 11718 16961 16322 15112 11355 7585 9694 14334 14682 17566 24540 27733 25144
389 25144 21215 15612 12585 14883 16088 14778 18543 24096 22404 16284 12811 8075 3077 2118 2278
404 2278 2814 8076 10115 3854 -3466 -7398 -11348 -14318 -14378 -14735 -12866 -7571 -8468 -15317 -18992 -19672 -23923
421 -23923 -27181 -24297 -20080 -16130 -12227 -13821 -18021 -17641 -17369 -20334 -19583 -13511 -8568 -3862 -789 -2225
437 -2225 -3254 -720 -1454 -4575 -224 7269 10303 12044 14547 15005 14996 14373 10494 9075 13992 18450 19466
454 19466 21211 23070 20272 16323 13499 9179 9008 14227 14947 12443 13359 13784 9507 4034 -185 -2908
$$ packed form
341B33m295j1130p126j161J420N946L828k456j746j44o233r283l69L571K947N647
357b0351M525m9J058M14o934n840L838O472M124M934M431K621K077l495o993O0
373i108P793L948K110O975N243o39j210l757l770K109M640L48K884O974L193k589
389B5144l929n603l027K298J205j310L765N553j692o120l473m736m998r59J60
404B278N36N262K039o261p320l932l950k970o0l57J869N295q97o849l675o80m251
421b3923l258K884M217L950L903j594m200L80K72k965P51O072M943M706L073j436
437b225j029K534p34l121M351P493L034J741K503M58ro23l879j419M917M458J016
454A9466J745J859k798l949k824m320j71N219P20k504R16M25m277n473m219k723
$$ plain form
470 -2908 -2389 105 -681 -1227 440 -1814 -8384 -12032 -13842 -15260 -13587 -10977 -11641 -11296 -8757 -11950
486 -11950 -17621 -18405 -16673 -16299 -14450 -12636 -11158 -8520 -7376 -10172 -11748 -9989 -9469 -9454 -6316 -2408
502 -2408 -44 2162 2701 254 61 2349 1422 1899 6031 9707 11677 12249 10937 8638 9030 9332 8258
519 8258 9341 12797 13927 13422 14013 12322 8966 7928 6904 4652 6771 10105 9672 7902 5260 2141
535 2141 395 527 -1633 -3678 -1150 429 -1347 -2948 -4556 -7121 -7854 -8596 -10636 -10614 -6525 -6235 -9549
552 -9549 -9886 -9132 -10016 -11399 -12074 -12943 -9490 -5805 -7129 -8821 -6413 -5665 -8165 -7634 -6084 -5035 -3038
569 -3038 -1569 -2085 -538 3347 1934 -1208 40 2793 3648 5494 6391 6269 8033 9432 5990 4066
585 4066 7151 8437 7671 8726 10564 9823 9679 8275 5082 5288 8085 7040 4853 6070 6959 5160
$$ packed form
470b908N19K494p86n46J667k254o570l648j810j418J673K610o64L45K539l193
486a1950n671p84J732L74J849J814J478K638J144k796j576J759N20J5L138L908
502b408K364K206N39k447j93K288r27M77M132L676J970N72j312k299L92L02j074
519H258J083L456J130n05N91j691l356j038j024k252K119L334m33j770k642l119
535B141j746J32k160k045K528J579j776j601j608k565p33p42k040K2M089K90l314
552i549l37P54q84j383o75q69L453L685j324j692K408P48k500N31J550J049J997
569c038J469n16J547L885j413l142J248K753Q55J846Q97j22J764J399l442j924
585D066L085J286p66J055J838p41j44j404l193K06K797j045k187J217Q89j799
$$ plain form
601 5160 4390 2308 -307 339 1590 -1013 -2123 -273 -843 -3917 -4712 -5367 -6706 -5392 -6300 -8797 -8394
618 -8394 -5798 -7236 -9448 -8238 -7890 -9043 -8989 -9346 -9334 -6965 -5181 -6809 -7287 -5091 -4880 -6003 -5060
635 -5060 -4547 -3159 -62 513 -1105 -216 1702 1119 815 2685 3680 5172 6039 5672 4979 6832 7146 5470
653 5470 5388 7445 8251 8117 8405 6995 6240 7575 6735 4798 6493 7384 5226 4114 4463 3629 3140 3273
671 3273 1234 -188 1125 561 -2371 -2608 -1215 -2531 -3474 -3717 -5894 -5405 -4547 -6665 -8727 -6635 -5354
688 -5354 -6976 -8411 -8208 -8669 -7458 -6756 -8691 -8885 -5485 -5248 -7331 -6708 -5104 -4952 -3962 -3047 -3739 -2413
706 -2413 574 -359 -1534 957 2551 2264 3298 4095 4098 5381 6561 5391 5039 8096 8899 7406 8556
723 8556 8709 7336 7818 8600 7218 7780 8805 6690 5256 6214 6107 3802 3364 3057 1643 2414 2528 -629
$$ packed form
601E160p70k082k615O46J251k603j110J850n70l074p95o55j339J314r08k497M03
618h394K596j438k212J210L48j153N4l57J2K369J784j628m78K196K11j123R43
635e060N13J388L097N75j618Q89J918n83l04J870R95J492Q67l67o93J853L14j676
653E470q2K057Q06j34K88j410p55J335q40j937J695Q91k158j112L49q34m89J33
671C273k039j422J313n64k932k37J393j316r43k43k177M89Q58k118k062K092J281
688e354j622j435K03m61J211P02j935j94L400K37k083O23J604J52R90R15o92J326
706b413K987r33j175K491J594k87J034P97LJ283J180j170l52L057Q03j493J150
723H556J53j373M82P82j382N62J025k115j434R58j07k305m38l07j414P71J14l157
$$ plain form
741 -629 -2481 -1194 -2317 -4108 -3695 -4861 -5407 -5029 -6492 -8532 -7679 -6137 -8105 -9687 -8218 -7389 -7951
758 -7951 -7618 -8647 -8825 -6610 -5546 -7213 -7026 -4261 -4319 -4606 -3045 -2545 -1442 144 -83 -1347 1036
775 1036 3288 2513 2841 4874 5379 5207 6125 5619 5566 6763 7352 7189 7879 8728 7288 6657 6884 6108 5936
794 5936 6891 6171 4886 6012 6040 3026 2174 2487 1501 882 1357 357 -468 -407 -1895 -3907 -3614 -3223 -4473
813 -4473 -4922 -4920 -5576 -5708 -5044 -6573 -8179 -7025 -6258 -7407 -7048 -6308 -6756 -5092 -4270 -5653 -5793 -4564
831 -4564 -4549 -4458 -2594 -1941 -1811 -444 751 -747 55 1548 932 823 2945 4856 4949 5488 4948 3708
849 3708 4953 5539 4309 5767 7746 6511 5900 6268 6053 4562 4712 4098 3545 4834 5830 4150 2577
866 2577 2811 1586 424 539 -164 -922 77 -195 -2448 -2240 -1533 -3491 -5021 -4689 -4582 -4956 -3456 -4264
$$ packed form
741f29j852J287j123j791M13j166n46L78j463k040Q53J542j968j582J469Q29n62
758g951L33j029j78K215J064j667J87K765n8k87J561N00J103J586k27j264K383
775A036K252p75L28K033N05j72R18n06n3J197N89j63O90Q49j440o31K27p76j72
794E936R55p20j285J126K8l014q52L13r86o19M75j000q25O1j488k012K93L91j250
813d473m49Ko56j32O64j529j606J154P67j149L59P40m48J664Q22j383j40J229
831d564J5R1J864O53J30J367J195j498Q02J493o16j09K122J911R3N39n40j240
849C708J245N86j230J458J979j235o11L68k15j491J50o14n53J289R96j680j573
866B577K34j225j162J15p03p58R99k72k253K08P07j958j530L32J07l74J500q08
$$ plain form
884 -4264 -5805 -4663 -3660 -5266 -6472 -5755 -5163 -4318 -2963 -3915 -4003 -1914 -2459 -4696 -4009 -1442 -1692
901 -1692 -1145 357 488 1021 1907 221 -975 1168 2702 2705 3011 4097 3825 4203 4045 2346 2018 4074
919 4074 4233 3259 4550 5650 4290 3129 3024 2296 2326 3311 2651 2095 3059 3460 1546 1090 559 -837
937 -837 -90 160 -725 -697 806 -88 -2144 -2018 -2149 -3091 -3153 -2948 -3271 -2100 -493 -2547 -4051 -3453 -3848
956 -3848 -5032 -4012 -3457 -2938 -1661 -1141 -2790 -2892 -1870 -3238 -3769 -2032 -558 -428 440 482 -1124
973 -1124 -191 236 -950 -833 1744 2467 2145 3054 2496 1402 2013 2727 1278 1961 4118 3521 3416 4214
991 4214 3691 2666 3063 2376 1185 2900 4241 2588 2330 3390 2079 862 1001 209 -460 783 1428
1008 1428 70 470 1301 -779 -2388 -2533 -2756 -2617 -1542 -2012 -2722 -1337 -1474 -4046 -4885 -4141 -4424 -3899
$$ packed form
884d264j541J142J003j606j206P17N92Q45J355r52q8K089n45k237O87K567k50
901a692N47J502J31N33Q86j686j196K143J534LL06J086k72L78j58j699l28K056
919D074J59r74J291J100j360j161j05p28L0R85o60n56R64M01j914m56n31j396
937h37P47K50q85K8J503q94k056J26j31r42o2K05l23J171J607k054j504N98l95
956c848j184J020N55N19J277N20j649j02J022j368n31J737J474J30Q68M2j606
973a124R33M27j186J17K577P23l22R09n58j094O11P14j449O83K157n97j05P98
991D214n23j025L97o87j191J715J341j653k58J060j311j217J39p92o69J243O45
1008A428j358M00Q31k080j609j45k23J39J075m70p10J385j37k572q39P44k83N25
$$ plain form
1026 -3899 -2424 -2573 -2929 -1435 -2461 -4694 -4195 -2674 -3106 -2492 -640 -862 -8 285 -1145 -2427 -173
1043 -173 59 -229 941 2643 2585 2649 2565 1703 1369 3542 3381 2125 3734 4971 4316 4193 3962 2863 3050
1062 3050 3408 2044 1921 4156 4251 2994 2723 1938 924 637 744 -710 0 1156 464 -530 -762 -1215
1080 -1215 -2940 -3379 -3470 -3791 -2210 -1121 -2875 -3591 -3061 -4362 -5441 -4596 -3990 -3633 -2194 -2156 -3374 -2970
1098 -2970 -2734 -3755 -3821 -2631 -1502 -1370 74 348 -509 549 810 -372 -10 1707 1623 2038 3136 3604
1116 3604 3336 3729 3372 1987 2611 4113 3723 3885 4626 4350 3549 3998 2905 1358 2398 3002 2064 2292
1134 2292 3728 2848 1388 962 -520 -1477 -612 -432 -1286 -224 167 -1811 -2788 -2730 -4169 -4071 -3419 -3153
1152 -3153 -3597 -2125 -1892 -4334 -4392 -3802 -4869 -4077 -3060 -3194 -2233 -1091 -1893 -2622 -1592 -1669 -2195 -1278
$$ packed form
1026c899J475j49l56J494j026k233M99J521m32O14J852k22Q54K93j430j282K254
1043a73K32k88J170J702n8O4q4q62l34K173j61j256J609J237o55j23k31j099J87
1062C050L58j364j23K235R5j257k71p85j014k87J07j454P10J156o92r94k32m53
1080a215j725m39r1l21J581J089j754p16N30j301j079Q45O06L57J439L8j218M04
1098b970K36j021o6J190J129J32J444K74q57J058K61j182L62J717q4M15J098M68
1116C604k68L93l57j385O24J502l90J62P41k76q01M49j093j547J040O04r38K28
1134B292J436q80j460m26j482r57Q65J80q54J062L91j978r77N8j439R8O52K66
1152c153m44J472K33k442n8N90j067P92J017j34R61J142q02p29J030p7n26R17
$$ plain form
1170 -1278 -21 157 1253 2322 1286 799 2018 2142 1086 2114 3075 3373 4160 4173 3223 3079 3802 2553
1188 2553 2018 2938 3914 3782 4285 3905 2108 2139 1670 -182 -159 1535 1743 756 1054 609 -816 -1198 -1880
1207 -1880 -3523 -1814 -985 -1479 -1559 -1338 -2075 -3373 -3440 -3620 -4278 -2681 -1863 -2461 -2625 -1577 -2861 -3127
1225 -3127 -2783 -2527 -2680 -1088 -592 -1270 -225 789 -532 -1001 -93 -267 -301 1140 1481 1634 2893 2936
1243 2936 1083 884 1783 1455 1729 2551 3157 2843 3705 2676 803 1453 2094 958 1289 2527 2621 2017
1261 2017 1994 795 -179 143 259 -608 103 1200 482 237 -83 -1463 -2108 -822 -1462 -2289 -466 -106
1279 -106 -1441 -1666 -1402 -2372 -2564 -1977 -2465 -2438 -1164 -987 -1378 -1418 -1255 -2013 -2072 -1395 -2284 -1147 772 -132
1299 -132 -508 455 -34 -1109 -861 -60 39 571 1675 1079 998 1729 579 -448 559 1123 1092 2319 2981
$$ packed form
1170a278J257J78J096J069j036m87J219J24j056J028R61K98P87J3r50j44P23j249
1188B553n35R20R76j32N03l80j797L1m69j852K3J694K08r87K98m45j425l82o82
1207a880j643J709Q29m94q0K21p37j298o7j80o58J597Q18n98j64J048j284k66
1225c127L44K56j53J592M96o78J045J014j321m69R08j74l4J441L41J53J259M3
1243B936j853j99Q99l28K74Q22O06l14Q62j029j873O50O41j136L31J238R4o04
1261B017k3j199r74L22J16q67P11J097p18k45l20j380o45J286o40q27J823L60
1279a06j335k25K64r70j92N87m88K7J274J77l91m0J63p58n9O77q89J137J919r04
1299a32l76R63m89j075K48Q01R9N32J104n96q1P31j150j027J007N64l1J227O62
$$ plain form
1318 2981 1688 1462 2057 424 90 956 1567 1683 2247 1976 1097 1234 1384 -549 -1 945 599 602 1228
1337 1228 727 267 387 -336 -1812 -854 -88 -640 -643 -71 -199 -939 -645 -2236 -2261 -914 -1112 -2001 -1298 73
1357 73 -864 -1447 -1417 -1923 -2591 -1545 -1172 -1555 -422 100 -973 -1461 -1057 -1628 -1697 -617 -460 10 1132
1376 1132 1060 -783 -183 238 -475 213 1530 1237 1619 2658 1980 1010 1516 1597 700 1325 2229 2453 2641
1395 2641 2754 1516 984 2196 1737 576 1342 1939 1493 1587 1311 405 -14 644 -559 -1038 -63 435 -978
1414 -978 -642 -526 -1273 -1478 -1528 -2839 -3040 -1640 -1772 -2249 -1620 -1685 -2528 -2744 -2551 -3466 -2320 -1412 -1684 -1679
1434 -1679 -829 -1439 -2052 -1285 -1427 -1096 -20 500 -95 756 1397 545 197 864 1413 1192 2369 2728 1825
1453 1825 2228 3154 2149 1656 2442 2478 2055 2960 2786 2573 2918 2597 1327 1290 1949 1062 710 1194 1166 348
$$ packed form
1318B981j293k26N95j633l34Q66O11J16N64k71q79J37J50j933N48R46l46LO26
1337A228n01m60J20p23j476R58P66n52lN72j28p40K94j591k5J347j98q89P03J371
1357G3r37n83L0n06o68J046L73l83J133N22j073m88M04n71o9J080J57M70J122
1376A132p2j843O00M21p13O88J317k93L82J039o78r70N06Q1q97O25R04K24J88
1395B641J13j238n32J212m59j161P66N97m46R4k76r06m19O58j203m79R75M98j413
1414i78L36J16p47k05n0j311k01J400j32m77O29o5q43k16J93r15J146R08k72N
1434a679Q50o10o13P67j42L31J076N20n95Q51O41q52l48O67N49k21J177L59r03
1453A825M03R26j005m93P86L6m23R05j74k13L45l21j270l7O59q87l52M84k8q18
$$ plain form
1473 348 907 80 -939 -858 -731 -1783 -1238 -778 -1353 -1277 -1578 -2809 -3307 -2699 -2705 -2930 -2302 -1860 -2206 -2370
1493 -2370 -2616 -3174 -3064 -2233 -2298 -2185 -704 -554 -1283 -1163 -641 -1076 -763 213 -44 257 1626 1699 1022 1416
1513 1416 1951 1143 1537 1999 2252 2247 3020 2657 2295 3053 2698 1611 2537 2286 1903 2082 2972 1753 1446 2077
1533 2077 1098 -151 640 664 196 667 412 -557 -371 -684 -1793 -2293 -1523 -1687 -2166 -1180 -1393 -2380 -2141
1552 -2141 -1933 -3142 -2951 -1795 -2029 -2385 -1303 -1488 -2062 -1979 -1833 -2297 -1099 -308 -1135 -958 299 -235
1570 -235 -489 334 109 -17 1092 1230 877 1191 2084 1903 1193 1911 1380 1361 1883 1793 1552 2646 2742 1414
1590 1414 1651 1889 1055 857 1702 1060 1234 1283 1422 440 269 348 -417 -418 9 -225 -279 597 -593 -1051 -925
1611 -925 -906 -1657 -1611 -614 -1201 -1166 -657 -1619 -2199 -1380 -1592 -1815 -1290 -871 -1060 -945 -693 -1339 -987 -251 -1123
$$ packed form
1473C48N59q27j019Q1J27j052N45M60n75P6l01j231m98O08ok25O28M42l46j64
1493b370k46n58J10Q31o5J13J481J50p29J20N22m35L13R76k57L01J369P3o77L94
1513A416N35q08L94M62K53nP73l63l62P58l55j087R26k51l83J79Q90j219l07O31
1533B077r79j249P91K4m68M71k55r69J86l13j109n00P70j64m79R86k13r87K39
1552b141K08j209J91J156k34l56J082j85n74Q3J46m64J198P91q27J77J257n34
1570b35k54Q23k25j26J109J38l53L14Q93j81p10P18n31j9N22r0k41J094R6j328
1590A414K37K38q34j98Q45o42J74M9J39r82j71P9p65jM27k34n4Q76j190m58J26
1611i25J9p51M6R97n87L5N09r62n80Q19k12k23N25M19j89J15K52o46L52P36q72
$$ plain form
1632 -1123 -956 -142 6 -300 -119 557 -383 3 369 16 77 1027 885 489 1284 1112 293 683 768 -141
1652 -141 872 1357 850 921 2070 1139 290 603 425 295 1175 1594 717 920 1086 480 60 413 -207 -268
1672 -268 568 537 -13 262 427 -440 -859 -200 -479 -877 -309 -30 -666 -404 -694 -1318 -764 -515 -1197 -1128 -589
1693 -589 -600 -842 -500 -792 -1653 -1014 -581 -1356 -1140 -337 -606 -686 -276 -496 -1019 -194 -596 -776 -101 543 -193
1714 -193 -150 461 124 25 753 238 104 1232 1508 810 830 1570 990 917 1581 1211 1185 1797 1401 1121 1334
1735 1334 1425 742 873 1524 783 981 1577 1055 -82 839 381 -477 193 69 -448 -517 -41 -524 -1087 -234
1755 -234 -1254 -1546 -1043 -1242 -1544 -1490 -1154 -1734 -1541 -1189 -1841 -2079 -1265 -1364 -1599 -1167 -1112 -1275 -794 -628 -1058
1776 -1058 -734 -72 -572 -395 798 727 436 732 535 382 932 1388 886 964 2031 1132 1141 1939 1794 1176
$$ packed form
1632a123J67Q14J48l06J81O76r40L86L66l53O1R50j42l96P95j72q19L90Q5r09
1652a41J013M85n07P1J149r31q49L13j78j30Q80M19q77K03J66o06m20L53o20o1
1672b68Q36l1n50K75J65q67m19O59k79l98N68K79o36K62k90o24N54K49o82O9N39
1693e89j1k42L42k92q61O39M33p75K16Q03k69q0M10k20n23Q25m02j80O75O44p36
1714a93M3O11l37r9P28n15j34J128K76o98K0P40n80p3O64l70k6O12l96k80K13
1735A334R1o83J31O51p41J98N96n22j137R21m58q58O70j24n17o9M76m83n63Q53
1755b34j020k92N03j99l02N4L36n80J93L52o52k38Q14r9k35M32N5j63M81J66m30
1776a058L24O62n00J77J193p1k91K96j97j53N50M56n02P8J067q99RP98j45o18
$$ plain form
1796 1176 2166 1820 1270 1705 2065 1515 1008 1876 1256 769 1601 1248 567 627 456 -203 -178 178 -591 -819
1816 -819 -263 -764 -1213 -507 -1171 -1577 -1404 -1179 -2118 -2023 -1406 -2030 -2059 -1199 -1801 -1935 -1618 -1418 -2093 -1258 -800
1837 -800 -1336 -700 -284 -549 -784 -235 -345 -307 476 1171 143 708 1121 566 1111 1316 903 1507 2037 1614
1857 1614 1464 1657 1979 1375 1563 2131 1450 1615 2020 752 544 1046 1176 478 718 845 77 39 279 -466
1877 -466 -704 -323 -396 -1190 -670 -752 -1435 -1235 -986 -1492 -1572 -1020 -1514 -1959 -1081 -1465 -1867 -1127 -1230 -1553 -1389
1898 -1389 -632 -1349 -1330 -654 -601 -693 121 -109 -148 49 388 -31 345 1149 553 606 1449 1262 826 1495 1215
1919 1215 753 1380 1716 955 944 1304 695 784 1399 676 645 1177 466 353 552 547 -202 -12 435 -148 -266
1940 -266 76 -159 -795 -220 -197 -1120 -622 -518 -1200 -942 -699 -714 -790 -642 -800 -1293 -505 -184 -918 -390 -125
$$ packed form
1796A176R90l46n50M35L60n50n07Q68o20m87Q32l53o81O0j71o59K5L56p69k28
1816h19N56n01m49P06o64m06J73K25r39R5O17o24k9Q60o02j34L17K00o75Q35M58
1837h00n36O36M16k65k35N49j10L8P83O95j028N65M13n55N45K05m13O04N30m23
1857A614j50J93L22o04J88N68o81J65M05j268k08N02J30o98K40J27p68l8K40p45
1877d66k38L81p3p94N20q2o83K00K49n06q0N52m94m45Q78l84m02P40j03l23J64
1898a389P57p17J9O76N3r2Q14k30l9J97L39m19L76Q04n96N3Q43j87m36O69k80
1919A215m62O27L36p61j1L60o09Q9O15p23l1N32p11j13J99np49J90M47n83j18
1940b66L42k35o36N75K3r23M98J04o82K58K43j5p6J48j58m93P88L21p34N28K65
$$ plain form
1961 -125 -638 -126 98 -256 -464 110 -499 -504 350 178 -85 273 581 127 -74 718 -236 208 710 696 231
1982 231 550 988 201 589 846 486 76 644 284 1 463 651 -22 152 647 74 235 326 -175 -267 341
2003 341 542 -13 -35 66 -208 -162 145 -210 -147 399 10 -480 30 23 -327 12 149 -115 100 433 -388 -319
2025 -319 -21 -106 -139 -128 138 -241 -115 135 -841 -449 418 -35 -333 214 -203 -541 -325 -158 -435 -120 17
2046 17 -620 -480 137 -268 -257 -32 339 -349 261 82 -329 -209 475 142 134 344 169 281 852 429 -263
2067 -263 631 552 273 399 1048 837 349 390 492 344 1065 623 41 590 572 63 390 437 -147 -94 177 -157
2089 -157 -525 120 -150 -564 -388 -41 -420 -703 -333 -684 -1032 -331 -643 -1062 -154 -558 -918 -542 -463 -931
2109 -931 -734 -83 -526 -401 -392 -116 -425 -82 -474 -259 87 319 227 214 709 116 257 708 885 347 864
$$ packed form
1961a25n13N12K24l54k08N74o09nQ54j72k63L58L08m54k01P92r54M44N02j4m65
1982B31L19M38p87L88K57l60m10N68l60k83M62J88o73J74M95n73J61R1n01r2O08
2003C41K01n55k2J01k74M6L07l55O3N46l89m90N10pl50L39J37k64K15L33q21O9
2025c19K98q5l3J1K66l79J26K50r76L92Q67m53k98N47m17l38K16J67k77L15J37
2046A7o37J40O17m05J1K25L71o88O10j79m11J20O84l33qK10j75J12N71m23o92
2067b63Q94p9k79J26O49k11m88M1J02j48P21m42n82N49j8n09L27M7n84N3K71l34
2089a57l68O45k70m14J76L47l79k83L70l51l48P01l12m19R08m04l60L76P9m68
2109i31J97O51m43J25RK76l09L43l92K15L46K32r2j3M95n93J41M51J77n38N17
$$ plain form
2130 864 840 424 681 1251 1100 576 1054 871 904 1351 734 340 906 441 111 289 281 1 131 703 1
2151 1 -476 175 -246 -842 -360 -771 -983 -769 -145 -484 -991 -1045 -915 -1125 -529 -851 -1240 -730 -365 -491 -747
2172 -747 -216 -827 -686 -70 -87 -265 291 126 -219 121 689 -122 437 659 649 625 944 1024 305 835 1039
2193 1039 562 393 1219 501 840 1415 1017 306 998 530 177 238 274 -103 90 326 134 -246 458 -293
2213 -293 -772 -452 -86 -742 -346 -118 -947 -372 -751 -1181 -984 -669 -558 -756 -678 -703 -1007 -648 -582 -910 -668
2234 -668 109 -256 -397 91 -61 -74 256 309 34 506 497 425 313 901 591 382 1253 411 455 843 894 570
2256 570 560 934 578 727 957 296 175 325 241 140 301 608 -222 -247 172 -437 -706 -300 -155 -627 -388
2277 -388 -167 -992 -755 -860 -636 -791 -454 -432 -453 191 -532 -1064 -259 -503 -446 -287 -16 -556 -261 -55 -173
$$ packed form
2130H64k4m16K57N70j51n24M78j83L3M47o17l94N66m65l30J78qk80J30N72p02
2151Am77O51m21n96M82m11k12K14O24l39n07n4J30k10N96l22l89N10L65j26k56
2172g47N31o11J41O16j7j78N56j65l45L40N68q11N59K22j0k4L19Q0p19N30K04
2193A039m77j69Q26p18L39N75l98p11O92m68l53O1L6l77J93K36j92l80P04p51
2213b93m79L20L66o56L96K28q29N75l79m30J97L15J11j98P8k5l04L59O6l28K42
2234f68P77l65j41M88j52j3L30N3k75M72rp2j12N88l10k09Q71q42M4L88N1l24
2256E70j0L74l56J49K30o61j21J50q4j01J61L07q30k5M19o09k69M06J45m72K39
2277c88K21q25K37j05K24j55L37K2k1O44p23n32Q05k44N7J59K71n40K95K06j18
$$ plain form
2298 -173 -352 10 -58 -267 172 462 293 315 501 215 362 397 570 199 594 271 -10 638 911 399 336
2319 336 594 -5 94 300 -83 -223 173 209 30 -52 -204 -546 -233 129 -163 -450 121 -255 -638 -412 -283
2340 -283 -484 -510 -316 -458 -222 -31 -411 -516 -166 -463 -286 -173 203 -77 330 446 -180 -332 287 178
2360 178 -88 230 354 109 447 452 10 189 377 188 85 342 201 224 371 465 35 273 304 -16 -181 384
2382 384 -257 -138 -38 281 66 -100 6 -733 -24 341 -411 -260 256 -205 -512 -256 -172 -163 -10 100 -105
2403 -105 37 36 -444 73 14 -33 -239 519 70 -183 318 67 149 259 465 -70 269 529 10 27 338 220
2425 220 -41 96 349 21 -182 198 -148 -144 441 -178 -330 67 8 -585 -234 -269 -143 -211 13 -367 -447 259
2447 259 -325 -551 85 -193 -202 86 129 -437 -33 390 127 -64 254 418 -289 289 325 33 494 385 283
$$ packed form
2298a73j79L62o8k09M39K90j69K2J86k86J47L5J73l71L95l23k81O48K73n12o3
2319C36K58n99R9K06l83j40L96L6j79q2j52l42L13L62k92k87N71l76l83K26J29
2340b83k01k6J94j42K36J91l80j05L50k97J77J13L76k80M07J16o26j52O19j09
2360A78k66L18J24k45L38Nm42J79J88j89j03K57j41K3J47R4m30K38L1l20j65N65
2382C84o41J19J00L19k15j66J06p39P09L65p52J51N16m61l07K56Q4RJ53J10k05
2403a05J42jm80N17n9m7k06P58m49k53N01k51Q2J10K06n35L39K60n19J7L11j18
2425B20k61J37K53l28k03L80l46MN85o19j52L97n9n93L51l5J26o8K24l80q0P06
2447B59n84k26O36k78rK88M3n66M04M23k63j91L18J64p07N78L6k92M61j09j02
$$ plain form
2468 283 340 431 149 98 639 421 222 64 382 -16 246 646 161 -60 407 -25 -420 171 25 -329 36
2489 36 -31 -546 -258 -297 -376 -215 -99 -493 -397 -401 -112 -649 -652 25 -580 -521 195 -361 -320 -55 -238 -367 186 -35
2513 -35 -252 -60 261 -8 198 719 -108 192 522 494 82 815 705 411 421 652 396 211 837 437 333
2534 333 713 631 230 198 372 101 286 322 -144 -69 330 -70 -386 -113 -467 -545 -546 -354 -863 -696 -580 -616 -573
2557 -573 -626 -785 -734 -645 -206 -675 -877 -39 -571 -207 58 -356 -433 12 -133 -183 286 27 -255 622 634 306
2579 306 192 769 567 292 472 930 615 579 675 456 563 700 179 282 556 533 364 463 500 -142 480 414
2601 414 24 197 362 -567 -422 -522 -548 -601 -258 -386 -743 -288 -474 -490 -744 -441 -661 -849 -116 -391 -970
2622 -970 -247 -61 -784 -174 70 -498 -249 217 -461 -86 257 190 27 237 144 54 416 613 391 388 602 419
$$ packed form
2468B83N7R1k82n1N41k18j99j58L18l98K62M00m85k21M67m32l95N91j46l54L65
2489C6o7n15K88l9p9J61J16l94R6mK89n37lO77o05N9P16n56M1K65j83j29N53k21
2513c5k17J92L21k69K06N21q27L00L30k8m12P33j10k94J0K31k56j85O26m00j04
2534C33L80q2m01l2J74k71J85L6m66P5L99m00l16K73l54p8jJ92n09J67J16l6M3
2557e73n3j59N1Q9M39m69k02Q38n32L64K65m14p7M45j45n0M69k59k82Q77J2l28
2579C06j14N77k02k75J80M58l15l6R6k19J07J37n21J03K74k3j69R9L7o42O22o6
2601D14l90J73J65r29J45j00k6n3L43j28l57M55j86j6k54L03k20j88P33k75n79
2622i70P23J86p23O10K44n68K49M66o78L75L43o7j63K10r3r0L62J97k22lK14j83
$$ plain form
2644 419 225 519 558 636 979 775 637 389 810 246 197 483 553 -179 602 224 -73 326 402 -94 -165 -16
2666 -16 -251 -393 -308 -480 -525 -245 -366 -398 -437 -596 -746 -608 -178 -390 -402 -77 -79 -442 -350 -276 -742 -397 -380 -391
2690 -391 68 509 -256 -105 368 -16 220 320 146 374 524 696 198 404 464 358 451 548 773 395 520
2711 520 766 223 126 569 404 -156 444 338 -139 487 -133 -452 -298 216 -380 -39 -81 -270 -446 -179 -374
2732 -374 -340 -267 -182 -685 -289 -171 -426 -400 -178 -382 -359 -58 -290 -400 -57 -36 -511 -292 190 -85 -221 495
2754 495 215 -34 410 292 -212 428 212 0 191 592 257 287 540 170 249 425 248 330 195 -61 125
2775 125 -18 607 39 -480 371 18 -321 -2 -106 -304 84 126 -370 -114 -52 -329 -152 -152 269 -490 -151
2796 -151 -14 -127 106 213 -304 -83 153 -260 59 174 261 44 302 126 -318 33 344 101 -305 164
$$ packed form
2644D19j94K94L9P8L43k04j38k48M21n64m9K86P0p32P81l78k97L99P6m96p1J49
2666a6k35j42Q5j72m5K80j21l2l9j59j50J38M30k12j2L25kl63R2P4m66L45J7j1
2690c91M59M41p65J51M73l84K36J00j74K28J50J72m98K06O0j06R3R7K25l78J25
2711E20K46n43r7M43j65n60O00j06m77O26o20l19J54N14n96L41m2j89j76K67j95
2732c74L4P3Q5n03L96J18k55K6K22k04K3L01k32j10L43K1m75K19M82k75j36P16
2754D95k80k49M44j18n04O40k16k12J91M01l35L0K53l70P9J76j77Q2j35k56J86
2775A25j43O25n68n19Q51l53l39L19j04j98L88M2m96K56O2k77J77%M21p59L39
2796a51J37j13K33J07n17K21K36m13L19J15Q7k17K58j76m44L51L11k43m06M69
$$ plain form
2816 164 266 92 -318 259 -170 231 327 -103 239 -83 -268 -332 442 -255 -392 55 -128 -299 -318 -165 -223
2837 -223 -104 115 -370 -91 164 -194 -342 -213 151 -548 -69 173 -433 -163 319 128 57 363 -56 94
2857 94 404 262 -12 102 132 171 363 568 232 159 634 195 -37 268 622 63 -62 291 162 -302 100
2878 100 -239 -103 117 267 -301 -247 20 -352 -477 -72 -359 -423 -80 -560 -570 -154 -88 -400 -202 -57 -198
2899 -198 -378 -76 -449 -309 259 -70 -540 -1 221 -233 -3 326 234 104 276 99 199 431 489 98 448
2920 448 554 454 844 543 370 273 657 218 227 592 781 -79 59 236 26 -10 445 -342 -124 359 -494
2941 -494 -238 -325 -298 -600 -404 -103 -406 -743 -651 -466 -329 -225 -139 -447 -520 -290 -545 -319 -226 -459 -623 83
2963 83 -371 -164 232 11 -50 53 114 -8 295 444 186 65 416 254 335 547 313 406 591 473 136 222
$$ packed form
2816A64J02j74m10N77m29M01R6m30L42l22j85o4P74o97j37M47j83j71j9J53n8
2837b23J19K19m85K79K55l58j48J29L64o99M79K42o06K70M82j91p1L06m19J50
2857I4L10j42k74J14L0L9J92K05l36p3M75m39k32L05L54n59j25L53j29m64M02
2878A00l39J36K20J50n68N4K67l72j25M05k87o4L43m80j0M16O6l12J98J45j41
2899a98j80L02l73J40N68l29m70N39K22m54K30L29r2j30J72j77J00K32N8l91L50
2920D48J06j00L90l01j73r7L84m39RL65J89q60J38J77k10l6M55p87K18M83q53
2941d94K56q7K7l02J96L01l03l37R2J85J37J04Q6l08p3K30k55K26R3k33j64P06
2963H3m54K07L96k21o1J03O1j22L03J49k58j21L51j62Q1K12k34R3J85j18l37Q6
$$ plain form
2985 222 242 -169 511 564 408 22 374 365 -82 -27 445 -322 391 197 -240 -539 -276 -239 -243 -164 -327 -541 -194
3008 -194 -504 -297 -502 -400 -743 -725 -392 -248 -371 -314 -225 -449 -151 -108 -52 -399 -52 -156 -362 149 581 28
3030 28 424 416 -228 232 413 422 318 411 754 -243 632 408 239 467 447 234 405 556 -115 -193 546 280 151
3053 151 417 183 -161 112 -30 -415 -138 -25 -414 -316 -237 -486 -787 -118 -347 -410 -112 -315 -379 -350 118 -254
3075 -254 -462 -139 -58 -514 -38 -59 -238 61 361 84 43 67 8 92 35 143 -275 293 425 20 245 311 0
3098 0 -142 625 -7 -165 237 17 -150 423 189 -145 -41 364 13 101 -7 341 -413 -36 -46 -427 -7
3119 -7 117 -182 26 213 -413 -373 344 1 -423 228 -102 -371 -185 -124 -296 76 189 -311 -158 -19 -40 -415
3141 -415 304 68 23 221 344 302 60 335 -48 -162 307 192 -17 587 276 159 326 521 -139 -164 88
$$ packed form
2985B22K0m11O80N3j56l86L52rm47N5M72p67P13j94m37k99K63L7mP9j63k14L47
3008a94l10K07k05J02l43J8L33J44j23N7Q9k24K98M3N6l47L47j04k06N11M32n53
3030B8L96qo44M60J81Rj04R3L43r97Q75k24j69K28k0k13J71J51o71p8P39k66j29
3053A51K66k34l44K73j42l85K77J13l89R8P9k49l01O69k29o3K98k03o4K9M68l72
3075b54k08L23Q1m56M76k1j79K99L00k77m1K4n9Q4n7J08m18N68J32m05K25O6l11
3098@j42P67o32j58M02k20j67N73k34l34J04M05l51Q8j08L48p54L77j0l81M20
3119gJ24k99K08J87o26M0P17l43m24O51l30k69J86O1j72L72J13n00J53J39k1l75
3141d15P19k36m5J98J23m2k42K75l83j14M69j15k09O04l11j17J67J95o60k5K52
$$ plain form
3162 88 220 -81 208 64 -365 187 83 -147 -448 -198 15 -261 155 -392 -524 -2 -97 -136 -290 -45 -314
3183 -314 -181 -188 -274 -127 97 -142 -240 108 466 -267 -15 91 72 85 163 -32 -113 276 -3 406 217 307 1
3206 1 420 436 212 229 636 365 -23 256 278 -205 111 263 -180 243 253 -109 109 -113 -311 -276 21 -333
3228 -333 -577 -292 -499 -552 -187 -175 -140 -371 56 -180 -605 -15 45 -266 -399 126 24 137 106 -181 -398 233
3250 233 106 -76 514 564 223 267 417 -162 346 436 79 26 672 407 -28 409 55 -107 -6 507 342
3271 342 380 487 221 -225 309 450 -333 -97 78 -439 4 235 -468 -364 111 -328 -547 -299 -216 -589 -270
3292 -270 117 -483 -631 -91 -3 -521 88 -20 -198 123 108 -347 -142 -126 -43 39 226 322 -15 312 197 78
3314 78 119 167 221 198 595 264 176 538 249 221 357 80 -29 367 459 78 79 166 -97 -165 93 -82 -291 -92
$$ packed form
3162H8J32l01K89j44m29N52j04k30l01K50K13k76M16n47j32N22r5l9j54K45k69
3183c14J33pq6J47K24k39r8L48L58p33K52J06j9J3P8j95q1L89k79M09j89R0l06
3206AM19J6k24J7M07k71l88K79K2m83L16J52m43M23J0l62K18k22j98L5K97l54
3228c33k44K85k07n3L65J2L5k31M27k36m25N90O0l11j33N25j02J13l1k87k17O31
3250B33j27j82N90N0l41M4J50n79N08R0l57n3O46k65m35M37l54j62J01N13j65
3271C42L8J07k66m46N34J41p83K36J75n17M43K31p03J04M75m39k19K48Q3l73L19
3292b70L87o00j48N40Q8n18O09j08j78L21j5m55K05J6Q3Q2J87R6l37L27j15j19
3314G8M1M8N4k3L97l31q8L62k89k8J36k77j09L96R2l81JQ7k63o8K58j75k09J99
$$ plain form
3338 -92 -17 -425 -152 -24 -333 5 -91 -339 -240 -186 -468 -361 -339 -177 -295 -252 -292 -547 -291 -226 -318 -170 169
3361 169 303 47 342 427 61 7 380 -216 59 363 -43 57 274 476 -22 336 154 -38 252 550 -114
3382 -114 -118 138 353 23 263 -122 55 33 175 100 165 82 -79 -172 459 -307 -159 -2 -359 -302 -218 -24 -400
3405 -400 -327 -222 -274 -428 47 -189 20 -108 -83 -431 -245 125 -334 -231 -248 -60 -56 -6 145 -33 32 415 86
3428 86 31 456 -138 -28 395 228 324 59 335 -38 220 -68 -200 281 328 53 -374 261 70 -95 -59 -162
3450 -162 -352 63 56 -50 -265 -213 -234 -357 -40 -424 -298 -247 -452 -411 -233 -280 -304 -63 345 -176 -226 154 83
3473 83 -376 189 371 137 144 -5 45 229 291 164 -32 421 219 -64 217 373 25 229 178 -60 128 135 92
3496 92 -260 55 155 -245 108 55 25 -50 -112 -114 -269 -13 63 -196 4 243 -213 -232 -125 -179 -420 207 -297
$$ packed form
3338i2P5m08K73J28l09L38r6k48R9N4k82J07K2J62j18M3m0k55K56O5r2J48L39
3361A69J34k56K95Q5l66n4L73n96K75L04m06J00K17K02m98L58j82j92K90K98o64
3382a14mK56K15l30K40l85J77k2J42p5O5q3j61r3O31p66J48J57l57N7Q4J94l76
3405d00P3J05n2j54M75k36K09j28K5l48J86L70m59J03j7J88MN0J51j78O5L83l29
3428H6n5M25n94J10M23j67R6k65K76l73K58k88j32M81M7k75m27O35j91j65L6j03
3450a62j90M15pj06k15N2k1j23L17l84J26N1k05M1J78m7k4K41M08n21n0L80p1
3473H3m59N65J82k34Pj49N0J84O2j27j96M53k02k83K81J56l48K04n1k38J88Pm3
3496I2l52L15J00m00L53n3l0p5o2kj55K56P6k59K00K39m56j9J07n4k41O27n04
$$ plain form
3519 -297 -378 -79 -366 -261 -166 -15 -194 -116 131 -326 -213 18 -58 -221 572 386 -279 135 204 297 67 234
3541 234 -95 234 357 357 214 252 347 66 362 97 -53 333 435 -44 185 69 -22 -22 -129 18 5 -179 -194
3564 -194 -359 -18 96 -266 -109 -58 -484 -447 -99 -285 -317 -102 -248 -265 9 66 -274 -509 82 -105 52 440
3586 440 -126 -209 -44 454 -98 -104 -86 215 384 243 114 138 79 -8 218 335 240 227 202 299 237 -305 265 -30
3610 -30 44 148 -165 -279 206 105 -100 120 17 9 -70 -82 -272 -477 -307 49 -81 -83 -107 -268 -368 -122 -284
3633 -284 -367 -257 -121 -25 -306 -112 -284 -328 -38 -342 -181 33 259 163 117 381 295 6 158 283 314 292 105
3656 105 143 426 215 173 297 278 -136 231 63 88 -11 446 233 -80 177 156 -30 -290 180 -234 -17 162
3678 162 -8 -166 -90 -130 -325 -280 45 -256 -389 -59 -68 -346 62 -322 -277 -106 -266 -120 -78 -346 -164 -59
$$ packed form
3519b97q1K99k87J05R5J51j79P8K47m57J13K31p6j63P93j86o65M14O9R3k30J67
3541B34l29L29J23%j43L8R5k81K96k65j50L86J02m79K29j16r1%j07J47j3j84j5
3564a94j65L41J14l62J57N1m26L7L48j86l2K15j46j7K74N7l40k35N91j87J57L88
3586D40n66q3J65M98n52oJ8L01J69j41j29K4n9q7K26J17r5j3k5R7o2n42N70k95
3610c0P4J04l13j14M85j01k05K20j03qp9j2j90k05J70L56j30kk4j61j00K46j62
3633b84q3J10J36R6k81J94j72m4K90l04J61K14K26r6m6K64q6k89J52J25L1k2j87
3656A05L8K83k11m2J24j9m14L67j68K5r9M57k13l13K57k1j86k60M70m14K17J79
3678A62j70j58P6m0j95M5L25l01j33L30rk78M08l84M5J71j60J46M2k68J82J05
$$ plain form
3700 -59 88 20 -369 362 297 183 204 317 -59 306 282 201 66 187 -6 222 -53 -59 -11 242 425 99 87
3723 87 73 33 346 66 92 -130 48 -60 -249 59 201 -275 142 -145 -118 -74 -47 -13 -525 -45 -495 -127 -101
3746 -101 -15 -446 -189 79 -241 -306 -176 -148 -42 -114 169 22 -92 117 149 118 331 -90 -26 153 260 264 98
3769 98 296 -59 302 515 82 119 253 -124 -102 331 209 -219 135 284 -2 -135 -103 -191 19 238 -128 -136
3791 -136 -212 -637 0 -90 -41 -100 -328 -5 48 -249 142 -566 -373 -48 -123 -316 -97 -74 -371 -164 -33 239
3813 239 -146 139 -117 102 51 283 2 50 45 40 152 295 149 243 665 192 446 361 211 187 109 232 -18
3836 -18 189 -223 -132 -52 151 -80 -221 -171 156 -205 -225 118 -222 -275 -32 -397 -518 -296 -110 -444 -45 107
3858 107 -152 -8 -169 118 44 317 -331 -189 -2 -376 -220 -176 111 -115 44 306 178 279 147 -60 106
$$ packed form
3700e9J47o8l89P31o5j14K1J13l76L65k4q1j35J21j93K28k75oM8K53J83l26j2
3723H7j4m0L13k80K6k22J78j08j89L08J42m76M17k87K7M4K7L4n12M80m50L68K6
3746a01Q6m31K57K68l20o5J30K8J06p2K83j47j14K09L2l1K13m21O4J79J07Mj66
3769I8J98l55L61K13m33L7J34l77K2M33j22m28L54J49k86j33L2q8K10K19l66q
3791a36p6m25O37r0M9n9k28L23N3k97L91p08J93L25p5j93K19K3k97K07J31K72
3813B39l85K85k56K19n1K32k81M8nnJ12J43j46R4M22m73K54q5j50k4p8J23k50
3836a8K07m12R1Q0K03k31j41N0L27l61k0L43l40n3K43l65j21K22J86l34L99J52
3858A07k59J44j61K87p4K73o48J42J87l74J56M4K87k26J59K62j28J01j32k07J66
$$ plain form
3879 106 187 365 266 202 252 -41 175 84 -70 331 152 7 180 336 15 56 -5 -15 277 -248 -12 -353 -58
3902 -58 158 123 16 -84 -269 -359 329 -20 -247 -443 -228 -367 -464 -96 -200 -320 119 -109 -63 -325 26 -67
3924 -67 -349 49 250 34 122 -79 -191 159 278 39 311 236 35 -294 508 214 262 421 56 12 439 464
3946 464 -209 237 217 24 95 -79 159 111 132 -135 253 233 -98 -391 -531 -197 -149 -459 137 -85 -272 -93
3968 -93 -276 -95 -36 -348 -438 -299 -45 72 -89 127 286 -126 301 -104 -170 451 -103 -44 317 342 -47 -140
3990 -140 42 106 1 43 297 -109 257 494 130 504 201 137 295 97 186 -63 103 235 146 -74 165 -169
4012 -169 -134 -89 54 -136 -165 82 -226 -71 -171 96 -274 -15 -174 -267 -82 -282 217 66 36 -183 -117 -50
4034 -50 -297 182 347 -86 18 85 140 264 382 256 -346 306 311 248 269 412 85 539 408 561 209 104
$$ packed form
3879A06Q1J78r9o4N0k93K16r1j54M01j79j45J73J56l21M1o1j0K92n25K36l41K95
3902e8K16l5j07j00j85r0O88l49k27j96K15j39r7L68j04j20M39k28M6k62L51r3
3924f7k82L98K01k16Q8k01j12L50J19k39K72p5k01l29Q02k94M8J59l65m4M27K5
3946D64o73M46k0j93P1j74K38m8K1k67L88k0l31k93j40L34M8l10N96k22j87J79
3968i3j83J81N9l12r0J39K54J17j61K16J59m12M27m05o6O21n54N9L61K5l89r3
3990a40J82O4j05M2K54m06L66K37l64L74l03o4J58j98Q9k49J66J32q9k20K39l34
4012a69L5M5J43j90k9K47l08J55j00K67l70K59j59r3J85k00M99j51l0k19O6O7
4034e0k47M79J65m33J04O7N5J24J18j26o02O52No3K1J43l27M54j31J53l52j05
$$ plain form
4056 104 451 -41 305 392 -37 314 -111 190 -16 -162 -45 -313 158 -101 -301 -247 -6 -537 -371 -179 -270
4077 -270 -451 -186 -168 -334 132 -8 -10 65 -139 -333 10 216 13 -537 -113 294 -104 75 56 -117 112 224
4099 224 -62 79 178 269 189 177 454 -185 83 1 137 -106 -352 408 96 274 374 -187 201 372 130 -169
4121 -169 324 301 60 86 -117 -328 46 -193 -49 -30 -133 202 -394 -252 -78 -503 -84 -205 -336 47 -140
4142 -140 -128 144 59 -342 -120 -32 -273 -235 4 230 18 45 -55 -13 225 198 25 263 37 12 -45 101 289
4165 289 194 67 170 298 419 451 -11 -156 107 393 -71 174 -23 -222 -59 -304 -124 -42 -354 -131 -425
4186 -425 -116 -122 -85 62 61 -447 -177 -153 -79 -85 -11 29 -459 12 -134 -230 34 49 -196 -67 239 -111 189 207 25
4211 25 -154 121 140 150 27 264 8 237 364 -78 270 238 -37 60 261 434 205 219 4 100 -101 60
$$ packed form
4056A04L47m92L46Q7m29L51m25L01k06j46J17k68M71k59k00N4K41n31J66J92r1
4077b70j81K65J8j66M66j40kP5k04j94L43K06k03n50M24M07l98J79j9j73K29J12
4099B24k86J41R9R1q0j2K77o39K68q2J36k43k46P60l12J78J00n61L88J71k42k99
4121a69M93k3k41K6k03k11L74k39J44J9j03L35n96J42J74m25M19j21j31L83j87
4142a40J2K72q5m01K22Q8k41L8K39K26k12K7j00M2K38k7j73K38k26k5n7J46J88
4165B89r5j27J03J28J21L2m62j45K63K86m64K45j97j99J63k45J80Q2l12K23k94
4186d25L09oL7J47jn08K70K4P4oP4M0m88M71j46r6K64J5k45J29L06l50L00J8j82
4211B5j79K75J9J0j23K37k56K29J27m42L48l2k75R7K01J73k29J4k15R6k01J61
$$ plain form
4233 60 92 -166 -87 -20 -136 96 3 -95 -284 -70 -221 -192 -239 -404 31 -29 -15 -192 -193 96 -236 -364 219 -219
4257 -219 237 -168 -201 -327 -35 170 142 -188 242 311 6 155 -25 462 -127 205 -249 168 50 358 31
4278 31 265 191 -87 178 108 157 117 208 21 402 23 22 -35 202 5 8 267 -284 -205 -98 -64 -47 -130 57 -322
4303 -322 -30 2 -199 -243 85 -307 -46 58 10 -253 275 21 -273 75 -195 3 -108 -256 -14 97 85
4324 85 123 -358 -54 163 105 85 181 243 118 308 151 -114 144 60 149 99 48 -189 14 240 -259 -152 79
4347 79 94 -174 -342 -1 -56 53 -90 -361 -21 98 -121 -343 -260 -120 -145 50 231 -313 87 174 -280 -87
4369 -87 -174 79 131 124 -239 -69 242 128 100 -135 219 -47 17 44 212 -9 161 294 254 33 226 86 258
4392 258 315 -169 269 72 44 102 430 -44 -155 355 -3 -140 -33 62 -392 74 -17 20 -237 -98 -279 -270 -75
$$ packed form
4233F0L2k58P9O7j16K32r3r8j89K14j51K9m7j65M35o0J4j77jK89l32j28N83m38
4257b19M56m05l3j26K92K05k8l30M30O9l05J49j80M87n89L32m54M17j18L08l27
4278C1K34p4k78K65p0M9m0R1j87L81l79jn7K37j97LK59n51P9J07L4J7q3J87l79
4303c22K92L2k01m4L28l92K61J04m8k63N28k54k94L48k70J98j11j48K42J11j2
4324H5L8m81L04K17n8k0R6O2j25J90j57k65K58q4Q9n0n1k37K03K26m99J07K31
4347G9J5k68j68L41n5J09j43k71L40J19k19k22Q3J40k5J95J81n44M00Q7m54J93
4369h7q7K53N2pl63J70L11j14k8k35L54k66O4K7J68k21J70J33m0k21J93j40J72
4392B58N7m84M38j97k8N8L28m74j11N10l58j37J07R5m54M66r1L7k57J39j81RJ95
$$ plain form
4415 -75 38 -227 -208 214 -367 -255 16 -53 -287 -70 -134 -253 170 -63 115 118 -36 305 -64 189 -85 113
4437 113 5 69 36 158 218 -2 126 322 344 390 -12 208 119 -108 142 -179 -71 409 -116 -210 2 -129
4459 -129 -154 -38 25 -221 47 323 -232 -455 -151 109 -427 -108 -60 -173 -228 -204 1 57 -166 -126 -342 -123
4481 -123 -227 220 205 250 -493 130 222 -119 -128 -195 42 21 -96 -164 -146 235 -105 16 196 60 172 -166 190
4504 190 68 208 83 210 180 -32 9 -15 317 60 143 -207 336 220 137 145 -156 -84 -26 -177 -322 -187 -218
4527 -218 -192 -210 -53 -261 -207 -87 -113 -95 -342 52 -274 -164 18 -276 196 -100 99 66 135 -99 -378 207
4549 207 122 211 58 14 -37 255 337 48 -138 216 104 424 73 228 255 103 292 413 -76 -133 159 130 -172
4572 -172 75 -52 -34 205 -312 -46 -145 -55 -270 136 -156 -188 1 -84 -215 -223 66 -54 -42 173 -91 -115 31
$$ packed form
4415g5J13k65J9M22n81J12K71o9k34K17o4j19M23k33J78Lj54L41l69K53k74J98
4437A13j08O4l3J22O0k20J28J96K2M6m02K20q9k27K50l21J08M80n25r4K12j31
4459a29k5J16O3k46K68K76n55k23L04K60n36L19M8j13n5K4K05N6k23M0k16K19
4481a23j04M47j5M5p43O23R2l41ro7K37k1j17o8J8L81l40J21J80j36J12l38L56
4504A90j22J40j25J27l0k12M1k4L32k57Q3l50N43j16q3Ql01P2N8j51j45J35l1
4527b18K6j8J57k08N4J20k6J8k47L94l26J10J82k94M72k96J99l3O9k34k79N85
4549B07q5Q9j53m4n1K92Q2k89j86L54j12L20l51J55K7j52J89J21m89n7K92k9l02
4572a72K47j27J8K39n17K66r9R0k15M06k92l2J89q5j31qK89j20J2K15k64k4J46
$$ plain form
4595 31 147 60 57 18 -144 86 -120 59 70 501 189 -125 87 -17 96 37 202 177 431 260 56 117 305
4618 305 111 231 -180 156 -355 2 228 9 125 2 -159 -87 219 231 -432 -73 -69 -273 -174 252 48 -97
4640 -97 -8 -410 -340 147 -188 -476 -180 -120 -164 -183 25 -285 44 201 180 160 -212 -138 36 39 -27 40 -171 379
4664 379 62 305 398 112 129 113 135 -152 -177 75 102 216 159 -252 53 217 122 -158 223 -22 -23 186 -139
4687 -139 101 22 -311 -117 -27 -24 -75 -98 102 -154 -44 -32 -288 -220 -53 -254 -258 -189 110 83 -65 -177 48 229
4711 229 5 -2 46 207 231 63 -155 185 204 -1 352 -89 148 -42 395 -105 -54 294 196 -89 134 -115
4733 -115 -157 -115 -216 127 244 16 -49 -65 46 246 -59 -47 -70 -350 100 -92 -293 10 82 -179 -287 -40
4755 -40 -318 -116 -103 -23 -475 -232 -60 -41 -6 -281 -378 -50 205 430 -18 284 -75 54 -200 97 -185 111
$$ packed form
4595C1J16q7ll9j62K30k06J79J1M31l12l14K12j04J13n9J65k5K54j71k04O1J88
4618C05j94J20m11L36n11L57K26k19J16j23j61P2L06J2o63L59Mk04R9M26k04j45
4640i7Q9m02P0M87l35k88K96O0m4j9K08l10L29J57k1k0l72P4J74Lo6O7k11N50
4664C79l17K43R3k86J7j6K2k87k5K52K7J14n7m11L05J64r5k80L81k45jK09l25
4687a39K40p9l33J94R0Ln1k3K00k56J10J2k56O8J67k01mO9K99k7j48j12K25J81
4711B29k24pM8J61K4j68k18L40J9k05L53m41K37j90M37n00N1L48r8k85K23k49
4733a15m2M2j01L43J17k28o5j6J11K00l05J2k3k80M50j92k01L03P2k61j08K47
4755d0k78K02J3Q0m52K43J72J9L5k75r7L28K55K25m48L02l59J29k54K97k82K96
$$ plain form
4777 111 275 305 42 -15 156 -96 -79 79 67 308 274 113 5 -57 36 -62 96 -2 -190 133 -134 -326 -1
4800 -1 -252 -112 -115 -113 1 -171 -385 15 -172 -37 43 -323 -42 -88 -102 -194 -37 60 -279 88 -200 77 42 -53
4824 -53 -280 139 360 321 -75 255 -95 -98 110 -165 -86 357 128 290 19 -125 194 111 240 -118 237 133
4846 133 41 1 30 117 116 -176 -60 376 87 -88 47 -230 192 -218 -237 -25 -117 -97 -96 -38 207 -240 -80 99
4870 99 -402 -104 125 51 -135 127 -351 170 -148 88 -194 505 280 -325 206 231 222 135 209 170 206 80 201
4893 201 177 467 143 -146 310 292 218 -161 102 -29 -45 104 250 29 163 189 -124 -99 -97 -76 67 6 -155
4916 -155 51 61 168 -73 88 9 -21 130 -174 -124 -194 -183 -48 -364 302 -125 -293 -105 246 114 103 283
4938 283 162 38 116 239 -177 221 -66 102 0 7 -44 299 374 31 63 152 258 331 284 232 -130 -247 -147
$$ packed form
4777A11J64L0k63n7J71k52J7J58j2K41l4j61j08o2R3r8J58r8j88L23k67j92L25
4800ak51J40lKJ14j72k14M00j87J35Q0l66K81m6j4r2J57R7l39L67k88K77l5r5
4824e3k27M19K21l9l96L30l50lK08k75P9M43k29J62k71j44L19q3J29l58L55j04
4846A33r2m0K9Q7jk92J16M36k89j75J35k77M22m10j9K12r2K0JN8K45m47J60J79
4870I9n01K98K29p4j86K62m78N21l18K36k82O99k25o05N31K5rq7P4l9L6j26J21
4893B01k4K90l24k89M56j8p4l79K63j31j6J49J46k21J34K6l13K5KK1J43o1j61
4916a55K06J0J07k41J61p9l0J51l04N0p0J1J35l16O66m27j68J88L51j32j1J80
4938B83j21j24P8J23m16L98k87J68j02Pn1L43P5l43L2Q9J06P3m7n2l62j17J00
$$ plain form
4961 -147 92 40 65 269 -134 171 -190 -247 187 123 -180 -26 44 -212 118 -46 250 -125 -143 -308 -243 -12
4983 -12 27 -365 262 -144 -38 -48 82 17 -119 201 177 358 304 28 11 97 -132 274 248 114 243 51 343
5006 343 -158 77 122 168 -147 72 98 73 -155 137 -52 268 361 257 -9 42 94 -291 -62 243 70 -168
5028 -168 5 0 -214 -69 -278 -330 -190 91 -39 -209 133 61 -417 -275 154 -208 -173 -118 -214 -122 219 -201 119
5051 119 -110 -175 -119 360 131 343 -110 143 -94 173 123 -93 -22 26 -44 -65 136 97 9 493 193 68 61 46
5075 46 -146 -195 125 6 -106 89 132 -146 7 2 -494 -140 -54 -116 -269 -109 -103 141 -2 -118 70 3 86 -85
5099 -85 233 43 -135 -138 -126 131 -270 -56 425 199 11 68 16 217 102 75 -341 119 253 -41 -34 236 -99
5122 -99 150 353 33 -41 540 169 191 196 165 -350 231 247 -3 129 -45 -154 -179 -90 -50 18 -293 50 -419 -245
$$ packed form
4961a47K39n2K5K04m03L05l61n7M34o4l03J54P0k56L30j64K96l75j8j65O5K31
4983a2L9l92O27m06J06j0J30o5j36L20k4J81n4k76j7Q6k29M06k6j34J29j92K92
5006C43n01K35M5M6l15K19K6k5k28K92j89L20R3j04k66N1N2l85K29L05j73k38
5028a68J73nk14J45k09n2J40K81j30j70L42p2m78J42M29l62L5N5r6R2L41m20L20
5051A19k29o5N6M79k29K12m53K53k37K67n0k16P1M8p0k1K01l9q8M84l00j25pj5
5075D6j92m9L20j19j12J95M3k78J53nm96L54Q6o2j53J60OK44j43j16J88o7Q3j71
5099h5L18j90j78lJ2K57m01K14M81k26j88N7n2K01j15k7m16M60J34k94PK70l35
5122i9K49K03l20p4N81l71K2Nl1n15N81J6k50J32j74j09k5Q9M0O8l11L43m69J74
$$ plain form
5146 -245 68 -58 -143 -320 110 -452 -71 -145 -98 122 -291 -50 -114 55 -257 -161 -12 -61 295 269 169 -26
5168 -26 -46 306 -45 221 -127 239 -456 -4 147 -145 355 393 611 224 129 87 5 197 236 -46 216 96
5190 96 289 17 -115 -92 201 8 -185 -46 235 -68 -299 -154 -336 -147 244 -45 -221 48 30 -100 -114
5211 -114 -3 -145 -138 -29 -134 -201 -257 -251 -147 -25 138 -31 -413 154 144 -37 156 -10 -189 188 310 -49
5233 -49 200 242 91 62 -59 102 -52 -205 415 -58 -159 -94 1 153 -187 170 -98 -72 -79 -150 -443 -372 206
5256 206 110 -268 113 151 1 -145 -171 -428 279 -5 -348 -71 -80 -391 -66 -4 294 -146 205 -178 -109 -120 -130
5279 -130 -38 14 322 59 271 107 254 210 114 147 -41 230 267 338 224 -63 -73 150 228 -80 -66 -116 84 50
5303 50 129 -88 -291 -142 -62 24 -127 -62 135 122 67 -65 -138 -276 -352 -143 -123 -36 -54 -219 -346 -15 74 -92
$$ packed form
5146b45L13j26q5j77M30n62L81p4M7K20m13K41o4J69l12R6J49m9L56k6j00j95
5168b6k0L52l51K66l48L66o95M52J51k92N00L8K18l87r5m2q2J92L9k82K62j20
5190I6J93k72j32K3K93j93j93J39K81l03k31J45j82J89L91k89j76K69j8j30j4
5211a14J11j42PJ09j05o7n6OJ04J22J63j69l82N67j0j81J93j66j79L77J22l59
5233d9K49M2j51k9j21J61j54j53O20m73j01O5R5J52l40L57k68K6pp1k93P1N78
5256B06r6l78L81L8j50j46k6k57P07k84l43K77rl11L25O2K98m40L51l83O9j1j0
5279a30R2N2L08k63K12j64J47m4r6L3j88K71L7P1j14k87j0K23P8l08J4n0K00l4
5303E0P9k17k03J49Q0Q6j51O5J97j3n5j32p3j38p6K09K0Q7j8j65j27L31Q9j66
$$ plain form
5327 -92 64 11 -41 118 132 -175 179 -213 -74 140 158 -199 248 222 85 123 -33 -67 435 24 -164 -52 212
5350 212 -67 297 -143 -307 -160 -79 -210 -130 -146 -28 24 -109 350 -271 -55 -175 -46 -230 -139 -180 -409 65
5372 65 84 32 -72 -243 -171 272 -144 12 -155 -74 14 -129 -124 -179 27 114 -110 -80 420 -37 84 -118 406 410
5396 410 -150 -79 140 213 100 -92 -8 259 239 211 -45 -70 -54 302 116 172 285 75 206 -118 319 45 257
5419 257 -346 -143 -54 29 446 -332 -148 -207 -434 -263 252 163 91 -87 -118 -219 -329 -104 -206 -231 217 66
5441 66 -26 -30 56 -140 120 142 335 75 116 172 54 146 -159 -150 119 208 130 -69 372 102 109 -166 -121 -210 154 -38
5467 -38 -6 -54 -137 -1 -112 63 -43 -8 1 -115 20 -246 253 79 130 -72 -90 -210 -111 68 146 -60 -126 20
5491 20 -146 -131 149 -118 161 -263 -212 29 166 -177 213 102 98 69 -111 -2 30 51 -72 4 198 -13 39
$$ packed form
5327i2J56n3n2J59J4l07L54l92J39K14J8l57M47k6j37L8j56l4N02m11j88J12K64
5350B12k79L64m40j64J47Q1j31Q0j6J18N2j33M59o21K16j20J29j84R1m1k29M74
5372F5J9n2j04j71P2M43m16J56j67Q1Q8j43Nn5K06Q7k24L0N00m57J21k02N24M
5396D10n60P1K19P3j13j92Q4K67k0k8k56k5J6L56j86N6J13k10J31l24M37k74K12
5419B57o03K03Q9Q3M17p78J84n9k27J71N15q9p2j78l1j01j10K25j02k5M48j51
5441F6r2mQ6j96K60K2J93k60M1N6j18R2l05RK69Q9p8j99M41k70Pk75M5q9L64j92
5467c8L2m8q3J36j11J75j06L5Rj16J35k66M99j74N1k02j8j20R9J79P8k06o6J46
5491B0j66J5K80k67K79m24N1K41J37l43L90j11mk9j80J09L2K1j23P6J94k11N2
$$ plain form
5514 39 159 244 -16 330 229 -73 130 -75 159 -275 120 -80 -237 -38 -166 384 -218 223 34 -98 206
5535 206 224 115 92 -67 -5 -280 -31 43 -235 112 -245 -333 11 -31 -130 -175 -192 -15 159 -152 -253 -261 -79 253
5559 253 5 -114 -156 194 118 143 14 -230 85 -19 -51 115 130 95 225 -184 -86 -82 221 -46 184 62 -7
5582 -7 69 -9 -223 18 -209 70 -129 24 40 114 -46 67 -184 161 -12 -329 187 -81 149 -177 67 -152
5604 -152 302 -60 -260 -7 -99 93 81 11 -89 104 -356 178 232 50 240 83 79 148 264 146 -5 -121
5626 -121 328 353 -63 214 -231 172 -205 67 296 -41 199 238 86 -204 -311 88 -192 -296 -141 50 -114
5647 -114 -276 -66 -160 -294 -10 131 -141 -259 -10 -51 -173 -130 -58 230 -107 24 185 25 143 -139 -124 353
5669 353 129 -198 142 112 -105 -279 260 -18 40 16 26 19 -115 117 -41 -184 -28 106 210 217 -54 -154 136
$$ packed form
5514C9J20Q5k60L46j01l02K03k05K34m34L95k00j57J99j28N50o02M41j89j32L04
5535B06J8j09k3j59O2k75K49P4k78L47l57q8L44m2r9m5j7J77J74l11j01qJ82L32
5559B53k48j19m2L50p6K5j29k44L15j04l2J66J5l5J30m09R8ML03k67K30j22o9
5582gP6p8k14K41k27K79j99J53J6P4j60J13k51L45j73l17N16k68K30l26K44k19
5604a52M54l62k00K53r2J92j2p0j00J93m60N34N4j82J90j57mO9J16j18j51j16
5626a21M49K5m16K77m45M03l77K72K29l37K40L9j52k90j07L99k80j04J55J91j64
5647a14j62K10r4j34K84J41k72j18K49m1j22M3P2K88l37J31J61j60J18k82J5M77
5669C53k24l27L40l0k17j74N39k78N8k4J0pj34K32j58j43J56J34J04Pk71j00K90
$$ plain form
5692 136 -209 52 75 -154 86 -289 98 -388 40 -150 -91 -8 -31 -90 -79 -122 28 -217 -268 185 -237 -150 46
5715 46 -113 -390 110 -108 81 -270 -176 -7 130 -51 -21 231 270 -280 -290 44 -93 180 74 -185 -21 115
5737 115 117 49 -14 22 154 33 -31 228 -92 132 28 -231 16 282 300 9 -89 95 43 -240 -315 -336 -128 18
5761 18 -414 -8 -175 -264 -132 -227 -139 -105 -68 -84 -196 -142 -164 146 -226 137 -256 -70 84 -175 17 91 191
5784 191 -194 -71 113 158 102 54 104 2 236 70 -36 187 171 63 -13 148 526 116 -13 -196 -109 39
5806 39 103 256 -247 19 -131 65 141 7 -121 -44 -31 -92 -68 -152 38 429 -306 -509 -155 -38 -298 -154 91
5829 91 94 -74 394 -81 -108 51 -306 -120 -85 24 -310 -106 -8 183 120 176 71 -60 269 114 -113 214 201
5852 201 -13 -63 233 -97 66 329 23 -9 110 207 64 -386 188 146 -240 74 -82 -41 -97 -23 -3 147 19
$$ packed form
5692A36l45K61K3k29K40l75L87m86M28j90N9Q3k3n9J1m3J50k45n1M53m22Q7J96
5715D6j59k77N00k18J89l51R4J69J37j81L0K52L9n50j0L34j37K73j06k59J64J36
5737A15Ko8o3L6J32j21o4K59l20K24j04k59K47K66J8k91r8J84n2k83p5k1K08J46
5761A8m32M06j67q9J32r5Q8L4L7j6j12N4k2L10l72L63l93J86J54k59J92P4J00
5784A91l85J23J84M5n6m8N0j02K34j66j06K23j6j08p6J61L78m10j29j83Q7J48
5806C9O4J53n03K66j50J96P6j34j28P7J3o1K4q4J90L91p35k03L54J17k60J44K45
5829I1Lj68M68m75k7J59l57J86L5J09l34K04R8J91o3N6j05j31L29j55k27L27j3
5852B01k14n0K96l30J63K63l06l2J19R7j43m50N74m2l86L14j56M1n6P4K0J50j28
$$ plain form
5875 19 -87 58 -160 -269 -64 189 -459 136 48 69 -214 77 36 -17 8 -118 -38 27 140 -217 88 -23 322
5898 322 -15 -119 211 271 -36 267 -165 66 225 335 -47 -90 214 283 315 194 308 114 185 146 -2 -118
5920 -118 262 98 -158 -136 -303 -323 227 0 88 -253 111 16 168 19 279 -91 33 -73 -165 -5 -74 -4
5942 -4 73 289 -351 85 -148 -115 -209 77 263 63 44 6 109 265 -60 175 216 33 -40 -50 8 -179 -130 43
5966 43 72 -9 44 -258 24 -115 -124 102 -151 -82 -64 390 -140 20 80 -185 -39 -88 -13 228 -251 -148 -403 -266
5990 -266 -94 -219 -240 -342 236 -121 -132 122 -212 -93 -97 -317 -205 200 -103 -64 -132 128 136 99 -180 60 313
6013 313 31 229 -26 31 181 -144 -191 21 241 238 329 20 -141 155 -91 40 12 -86 -74 -59 -189 267 -28
6036 -28 -182 61 175 -168 -292 -88 271 -381 -278 -27 -279 -95 -256 16 56 33 -173 -271 -105 -255 202
$$ packed form
5875A9j06J45k18j09K05K53o48N95q8K1k83K91m1n3K5j26Q0O5J13l57L05j11L45
5898C22l37j04L30O0l07L03m32K31J59J10l82m3L04O9L2j21J14j94P1l9j48j16
5920a18L80j64k56K2j67k0N50k27Q8l41L64r5J52j49K60l70J24j06r2J60o9P0
5942dP7K16o40M36k33L3r4K86J86k00j9l8J03J56l25K35M1j83p3j0N8j87M9J73
5966D3K9q1N3l02K82j39rK26k53O9J8M54n30J60O0k65J46m9P5K41m79J03k55J37
5990b66J72j25k1j02N78l57j1K54l34J19mk20J12M05l03L9o8K60Ql7k79K40K53
6013C13k82J98k55N7J50l25m7K12K20lR1l09j61K96k46J31k8r8J2J5j30M56k95
6036b8j54K43J14l43j24K04L59o52J03K51k52J84j61K72M0k3k06r8J66j50M57
$$ plain form
6057 202 -70 -78 212 83 -356 113 175 51 -163 -316 191 137 -119 84 329 154 142 67 279 217 37 -29 45
6080 45 166 516 16 72 19 8 165 -95 47 35 -147 -113 79 126 148 -159 -140 -103 -238 -16 -92 85 189 24
6104 24 -193 -20 362 -235 -228 -257 124 -156 -59 -97 -150 -58 11 -74 -196 -91 167 -195 26 -131 -20 109 -129
6127 -129 143 121 120 56 -145 221 109 -91 -63 289 318 60 -173 212 185 192 52 -55 234 -168 -25 82 -91
6150 -91 -177 196 -243 -6 210 210 -51 -143 -126 18 -236 92 -135 -270 44 -62 -74 -196 153 11 -240 -38
6172 -38 -108 -202 -192 -50 -13 287 27 227 138 80 -68 -92 324 288 96 -148 103 -160 -54 39 69 -128 294 15
6196 15 -88 207 461 -79 -58 -257 -208 -139 -125 -258 -211 2 220 63 -234 -144 95 -433 -154 -391 -325 -40 -397
6219 -397 214 -331 -188 270 98 -30 -520 8 -192 -50 96 -203 -327 214 103 -121 -73 -89 100 -73 305
$$ packed form
6057B02k72qK90j29m39M69O2j24k14j53N07n4k56K03K45j75j2p5K12o2j80o6P4
6080D5J21L50n00N6n3j1J57k60J42j2j82L4J92M7K2l07J9L7j35K22p6J77J04j65
6104B4k17J73L82n97Pk9L81k80R7l8n3R2O9q5j22J05K58l62K21j57J11J29k38
6127a29K72k2jo4k01L66j12k00K8L52K9k58k33L85k7Pj40j07K89m02J43J07j73
6150i1q6L73m39K37K16%k61r2J7J44k54L28k27j35L14j06j2j22L49j42k51K02
6172c8p0r4J0J42L7L00k60K00q9n8j48k4M16l6j92k44K51k63J06R3L0j97M22k79
6196A5j03K95K54n40K1j99M9O9J4j33M7K13K18j57k97R0K39n28K79k37O6K85l57
6219c97O11n45J43M58j72j28m90N28k00J42J46k99j24N41j11k24M8j6J89j73L78
$$ plain form
6240 305 240 -57 -44 -141 -234 241 318 164 40 352 54 44 64 -42 118 142 -180 425 -273 39 135 48 41 -184
6264 -184 124 -105 29 -370 -67 -314 -55 -45 146 194 -254 -55 33 38 122 -177 -112 112 21 -120 -147 -52 -116 -1
6288 -1 279 179 157 198 -22 176 105 50 2 299 22 216 44 99 129 -83 282 56 194 -242 75 -50 -45 191
6312 191 -85 -36 41 -154 125 -74 -215 -219 115 17 -201 -106 59 117 -107 -115 -4 -130 -66 -14 -87 -118 -467 -310
6336 -310 -47 71 169 -98 -30 116 -173 160 -45 167 -151 219 205 -133 135 -191 -273 -143 218 12 -71 194
6358 194 -127 -201 -50 -124 262 -83 -167 -317 -53 57 138 -47 -249 -243 -338 -228 -247 -183 158 115 7 12 178 -390
6382 -390 69 89 -137 -98 -89 -118 -46 -171 72 -174 -186 78 59 -164 74 222 -71 -118 -17 -16 120 328 128 237
6406 237 -108 30 399 189 67 72 95 -217 -24 -124 -94 63 -107 178 22 -220 -155 -113 -296 43 -112 -63
$$ packed form
6240C05o5k97J3r7r3M75P7j54j24L12k98j0K0j06J60K4l22O05o98L12R6q7pk25
6264a84L08k29J34l99L03k47K59J0J91M8m48J99Q8NQ4k99O5K24r1j41k7R5o4J15
6288aK80j00k2M1k20J98p1n5m8K97k77J94j72N5L0k12L65k26J38m36L17j25NK36
6312A91k76M9P7j95K79j99j41mL34r8k18R5J65N8k24qJ11j26O4N2p3l1l49J57
6336c10K63J18R8k67O8J46k89L33k05K12l18L70j4l38K68l26q2J30L61k06q3K65
6358A94l21p4J51p4L86l45q4j50K64J10Q1j85k02Or5J10j9O4L41m3j08NJ66n68
6382c90M59K0k26L9Rk9P2j25K43k46j2K64j9k23K38J48k93m7J01JJ36K08k00J09
6406B37l45J38L69k10j22NK3l12J93j00L0J57j70K85j56k42O5M2j83L39j55M9
$$ plain form
6428 -63 -74 -150 -259 59 0 -26 204 -40 255 -93 -131 -186 -147 239 -278 -154 -51 -497 -248 -101 167 -132 99
6451 99 50 -58 0 -115 -269 -118 345 -42 -27 63 -206 21 111 71 82 -75 96 -58 153 -410 66 -22 -62
6474 -62 295 160 -4 100 167 -262 -175 -42 82 -23 198 53 -63 -122 -30 198 181 115 53 -17 3 -183 208
6497 208 -15 -14 164 147 -156 -74 -166 38 125 -40 215 -266 -170 26 -77 96 83 163 129 160 -71 -46 -140 -147 58
6522 58 232 394 213 -211 -82 65 116 128 -166 -172 -261 -55 133 -19 117 -92 -21 78 178 41 -621 25 -81
6545 -81 213 -439 44 -92 108 69 169 25 -43 120 -198 -239 -103 34 -74 144 -459 89 317 -143 -333
6566 -333 124 -24 98 67 -20 -58 -54 28 162 -51 187 59 -75 15 27 95 219 66 144 68 162 -89 40 -41
6590 -41 -159 16 193 167 108 -33 -109 56 -49 -12 113 -91 0 -85 -384 -61 -153 -87 79 199 -161 173 -191
$$ packed form
6428f3j1p6j09L18n9k6K30k44K95l48l8n5L9L86n17J24J03m46K49J47K68k99K31
6451I9m9j08N8j15j54J51M63l87J5R0k69K27R0m0J1j57J71j54K11n63M76q8m0
6474f2L57j35j64J04O7m29Q7J33J24j05K21j45j16n9R2K28j7o6o2p0K0j86L91
6497B08k23JJ78j7l03Q2r2K04Q7j65K55m81R6J96j03J73j3Q0l4L1k31K5r4pK05
6522E8J74J62j81m24J29J47N1J2k94oq9K06J88j52J36k09P1R9J00j37o62O46j06
6545h1K94o52M83j36K00l9J00j44o8J63l18m1J36J37j08K18o03N48K28m60j90
6566c33M57j48J22l1q7l8MQ2J34k13K38j28j34R0J2O8J24j53P8p6R4k51J29q1
6590d1j18J75J77k6n9j41p6J65j05L7J25k04R1q5k99L23r2O6J66J20l60L34l64
$$ plain form
6613 -191 2 153 71 -192 48 92 -54 2 -146 229 85 24 67 152 118 491 -194 180 182 325 -242 -73 104
6636 104 -13 -67 210 5 207 179 158 64 184 -2 -106 185 152 -16 19 -42 -356 -151 -33 99 81 -241 466
6659 466 84 -12 168 -12 -74 -6 56 -94 -217 -31 -100 8 -97 -289 -337 60 118 122 186 33 -202 -135 140 122
6683 122 -77 -22 171 345 -3 74 -123 81 -87 45 22 5 155 185 292 40 71 12 61 -168 -322 -101 -208
6706 -208 -310 -56 107 -184 177 -78 -98 -6 -98 -251 238 170 -400 -40 59 -206 83 1 -114 -135 259 -36
6728 -36 231 -40 -112 -59 -177 -49 -13 -115 -291 32 -113 29 -115 256 112 8 66 124 198 -140 172 92 91
6751 91 96 -71 220 181 208 -119 106 189 -178 -281 367 -100 -102 -171 -147 268 -103 -103 -124 -196 52 135 -67 -112 105
6776 105 -90 153 24 -250 2 -77 213 -117 269 -133 110 -104 -61 171 -28 -100 180 86 -151 -109 85 349
$$ packed form
6613a91J93J51q2k63K40M4j46N6j48L75j44o1M3Q5l4L73o85L74KJ43n67J69J77
6636A04j17n4K77k05K02k8k1r4J20j86j04K91l3j68L5o1l14K05J18J32j8l22P07
6659D66l82r6J80j80o2O8O2j50j23J86o9J08j05j92m8L97N8MO4j53k35O7K75j8
6683A22j99N5J93J74l48P7j97K04j68J32k3j7J50L0J07k52L1n9M9k29j54K21j07
6706b08j02K54J63k91L61k55k0R2r2j53M89o8n70L60R9k65K89q2j15k1L94k95
6728c6K67k71p2N3j18J28L6j02j76L23j45J42j44L71j44j04N8N8P4l38L12q0j
6751I1Nj67K91l9K7l27K25Q3l67j03O48m67ko9K4M15l71%k1p2K48Q3k02m5K17
6776A05j95K43j29k74K52p9K90l30L86m02K43k14M3K32j99p2K80r4k37M2J94K64
$$ plain form
6798 349 -193 -134 146 351 162 -86 -143 -80 12 106 225 36 -6 -78 187 144 6 175 -4 89 82 111 200 70
6822 70 -84 190 -21 -26 -272 -304 -22 -16 109 -217 -421 -21 -111 246 37 -5 231 90 15 -26 22 183 -207 84
6846 84 1 -100 5 115 140 -128 165 208 -224 194 1 -73 -84 156 -141 -270 -72 -190 49 -81 -188 -166
6868 -166 -106 42 59 22 -26 47 -26 44 100 137 50 94 68 127 -84 -17 -253 -198 -254 -102 -131 -376 -12 -143 -21 -118
6894 -118 -157 -86 261 160 -201 -15 -61 -225 -45 -148 -56 -19 47 -427 -226 242 33 -26 -33 -5 183 61 -329
6917 -329 122 111 -31 -18 53 72 -14 -172 318 146 90 214 132 38 279 -89 -2 -96 198 37 -181 42 -134
6940 -134 -22 157 -280 266 -202 -93 -103 -74 -203 -183 19 124 -99 27 218 -105 128 -154 126 -156 250
6961 250 111 136 -250 -63 343 -104 109 278 296 -59 -188 102 118 316 -119 93 197 -83 -144 -41 -154
$$ packed form
6798C49n42N9K80K05j89k48n7O3R2R4J19j89m2p2K65m3j38J69j79R3pK9Q9j30
6822G0j54K74k11nk46l2K82OJ25l26k04M00r0L57k09m2K36j41p5m1M8J61l90K91
6846H4q3j01J05J10K5k68K93M3m32M18j93p4j1K40k97j29J98j18K39j30j07K2
6868a66O0J48J7l7m8P3p3P0N6L7q7M4k6N9k11O7k36N5n6J52k9k45L64j31J22r7
6894a18l9P1L47j01l61J86m6j64J80j03R2L7O6m74K01M68k09n9pK8J88j22l90
6917c29M51j1j42J3P1J9q6j58M90j72n6J24q2r4K41l68Q7r4K94j61k18K23j76
6940a34J12J79m37N46m68J09j0K9j29K0K02J05k23J26J91l23K33k82K80k82M06
6961B50j39K5l86J87M06m47K13J69J8l55j29K90J6J98m35K12J04k80o1J03j13
$$ plain form
6982 -154 69 58 -207 321 -11 -111 32 -33 -107 -187 -136 67 -17 115 -41 160 74 42 -97 9 -148 64 -309
7005 -309 -368 -241 -317 -201 94 -101 85 -212 187 131 -107 10 19 -149 -139 250 -18 -23 118 66 93 96 -17 -117
7029 -117 12 71 265 -37 110 -103 -158 291 30 160 -208 -6 110 50 -344 142 -207 -215 -229 -8 -34 -22 202
7052 202 -251 89 -66 -233 -73 17 -137 140 -208 -319 7 69 -14 -226 -117 53 104 -234 -249 59 240 272
7074 272 38 1 170 -197 -125 0 -22 91 97 25 48 159 106 190 -138 97 -2 -37 190 357 140 26 -321 51
7098 51 98 -394 -326 128 -75 -56 -128 12 20 57 -47 17 -181 -20 -139 -128 156 -145 -357 -57 119 -61 -449
7121 -449 15 272 90 21 60 23 105 -90 -51 138 21 0 85 379 192 106 105 -95 29 153 238 -77 -305 107
7145 107 -46 -179 180 30 26 79 -182 -212 329 158 -12 179 -172 44 -74 -244 -139 0 71 62 -151 77
$$ packed form
6982a54K23j1k65N28l32j00J43o5p4q0N1K03q4J32j56K01q6l2j39J06j57K12l73
7005c09n9J27p6J16K95j95J86k97L99n6k38J17Rj68J0L89k68nJ41n2K7Lj13j00
7029a17J29N9J94l02J47k13n5M49k61J30l68K02J16o0l94M86l49qj4K21k6J2K24
7052B02m53L40j55j67J60R0j54K77l48j11L26O2q3k12J09J70N1l38j5L08J81L2
7074B72k34l7J69l67P2J25k2J13Op2K3J11n3Q4l28K35r9l5K27J67k17j14l47L72
7098E1M7m92O8M54k03J9p2J40QL7j04O4j98J61j19J1K84l01k12L00J76j80l88
7121d49M64K57j82o9L9l7Q2j95L9J89j17k1Q5K94j87q6jk00J24J24Q5l15k28M12
7145A07j53j33L59j50mN3k61l0N41j71j70J91l51K16j18j70J05J39P1rk13K28
$$ plain form
7167 77 -16 62 22 63 -175 107 -35 -280 -306 -102 -179 81 199 55 121 122 112 -39 158 -1 -296 -90 44 -3
7191 -3 107 81 452 -54 -51 -55 -71 -47 -18 -173 470 -125 -323 43 -171 110 54 -67 -81 66 63 104 -76 132 65
7216 65 55 -255 -228 -76 116 -245 86 67 -22 41 125 299 -225 47 -79 -76 380 -296 -24 181 139 114 35 -82
7240 -82 64 332 -280 51 17 41 -88 68 37 3 13 232 272 141 226 6 3 -80 -147 -92 -153 147 -298 143 -52
7265 -52 -128 130 -85 -86 -39 -53 117 8 -203 -90 -288 -48 152 -40 226 -232 97 195 -119 -54 -163 -320 88
7288 88 -4 -131 -181 -4 261 56 -74 17 214 -34 104 113 -18 161 248 149 -83 271 163 135 107 -59 123
7311 123 -234 198 2 293 17 -174 343 63 204 60 -87 -146 -97 41 22 291 434 97 164 96 -53 45
7333 45 -142 389 285 -156 -130 -88 -41 -121 -215 -293 165 112 7 -96 106 75 -55 99 86 -32 -88 22 196 13
$$ packed form
7167G7r3P8m0M1k38K82j42k45k6K04p7K60J18j44O6Jj0j51J97j59k95K06J34m7
7191cJ10k6L71n06Lmj6K4K9j55O43n95j98L66k14K81n6j21j4J47lM1j80K08o7
7216F5j0l10K7J52J92l61L31j9q9O3Q4J74n24K72j26LM56o76K72K05m2k5p9j17
7240h2J46K68o12L31l4K4j29J56l1l4J0K19M0j31Q5k20lq3o7N5o1L00m45M41j95
7265e2p6K58k15jM7j4J70j09k11J13j98K40K00j92K66m58L29R8l14O5j09j57M08
7288H8r2j27n0J77K65k05j30R1J97k48J38Rj31J79Q7r9k32L54j08k8k8j66J82
7311A23l57M32j96K91k76j91N17k80J41j44j47n9M9J38j9K69J43l37O7o8j49R8
7333D5j87N31j04m41K6M2M7q0r4p8M58n3j05j03K02l1j30J54j3j18n6J10J74j83
$$ plain form
7357 13 -136 294 -289 -277 181 -114 -34 281 -46 -443 51 92 258 -1 -91 -125 -124 8 -225 86 -195 -310 126
7380 126 -268 61 273 -212 -79 -103 -101 65 56 63 42 -168 -11 -26 58 -231 149 -131 287 -59 58 -246 240
7403 240 39 21 -12 -76 -171 -106 207 281 47 -236 117 -201 78 -70 105 172 -10 254 322 -210 -95 48 -192
7426 -192 -326 227 17 13 100 -19 48 -78 162 121 -13 -124 -90 257 124 238 -174 -190 108 -173 -77 -93 -150
7449 -150 108 377 14 -295 161 -158 25 -51 -6 350 -31 45 257 -16 -115 -157 -133 165 46 -65 17 183
7471 183 197 196 165 63 101 119 -45 135 -32 40 33 194 101 362 -89 38 -22 75 -50 168 304 340 136 -28
7495 -28 -119 116 -58 -173 -243 181 30 -94 86 -28 -13 29 -47 -209 -197 131 -30 -32 -105 -281 -151 -82 70 -28
7519 -28 117 219 -170 235 -20 36 -51 278 -54 1 15 -93 136 -93 119 130 82 285 -147 -14 -185 119
$$ packed form
7357A3j49M30n83J2M58k95Q0L15l27l97M94M1J66k59r0l4JJ32k33L11k81j15M36
7380A26l94L29K12m85J33k4KJ66rPk1k10J57j5Q4k89L80k80M18l46J17l04M86
7403B40k01j8l3o4r5O5L13P4k34k83L53l18K79j48J75O7j82K64O8n32J15J43k40
7426a92j34N53k10mQ7j19O7j26K40m1j34j11L4L47j33J14m12j6K98k81R6j6n7
7449a50K58K69l63l09M56l19J83p6M5L56l81P6K12k73r9m2K4K98j19j11Q2J66
7471A83J4jl1j02L8J8j64J80j67P2pJ61r3K61m51J27o0R7j25K18J36L6k04j64
7495b8r1K35j74j15p0M24j51j24J80j14J5M2p6j62J2L28j61kp3j76J30O9J52r8
7519b8J45J02l89M05k55N6q7L29l32N5J4j08K29k29K12J1m8K03m32J33j71L04
$$ plain form
7541 119 214 -173 -101 -328 -78 60 -175 -144 -96 128 -10 172 19 205 -85 -393 -110 141 -104 39 -254
7562 -254 -63 -207 -44 -145 -183 -71 -209 43 404 57 29 46 -81 111 152 167 3 125 -134 -99 -14 -224
7584 -224 -378 188 172 -83 -64 -247 -127 -151 295 -257 219 193 323 69 57 56 230 -43 -327 -133 -31 193
7606 193 -82 -138 -26 98 -61 -34 -167 162 168 12 -268 -11 -146 -11 -95 -151 -197 -22 38 42 -140 189 173 204
7630 204 98 43 55 -194 -59 85 217 4 72 426 20 106 -262 157 -209 -82 -214 -65 -266 -82 107
7651 107 -176 73 -109 -139 2 32 178 71 106 164 -286 142 -76 -431 -114 88 -111 201 -257 -121 161
7672 161 -82 -162 -169 7 -73 -119 120 -15 160 -170 -58 -136 112 94 68 -121 -189 -81 -57 -48 -101 243 -37 -284
7696 -284 213 -122 -6 211 -349 249 227 86 118 -129 20 -348 86 143 -130 82 98 145 -13 354 -175 136
$$ packed form
7541A19R5l87P2k27K50J38k35L1M8K24j38J82j53J86k90l08K83K51k45J43k93
7562b54J91j44J63j01l8J12j38K52L61l47k8J7j27J92M1J5j64J22k59L5Q5k10
7584b24j54N66j6k55J9j83J20k4M46n52M76k6J30k54j2jJ74k73k84J94J02K24
7606A93k75n6J12J24j59K7j33L29Oj56k80K57j35J35q4n6m6J75O0Mj82L29j6L1
7630B04j06n5J2k49J35J44J32k13O8L54m06Q6l68M19l66J27j32J49k01J84J89
7651A07k83K49j82l0J41L0J46j07L5N8m50M28k18l55L17K02j99L12m58J36K82
7672A61k43q0pJ76q0m6K39j35J75l30J12p8K48j8k6j89o8J08K4Rn3L44k80k47
7696b84M97l35J16K17n60N98k2j41L2k47J49l68M34N7k73K12J6M7j58L67n29L11
$$ plain form
7718 136 10 -105 -188 183 290 44 6 57 -50 311 -167 15 -61 -49 184 -137 64 223 91 -46 231 -276
7740 -276 -31 27 20 95 226 127 197 -99 45 -102 182 -3 -221 19 91 119 202 -98 -129 -105 408 209 29 -3
7764 -3 296 263 261 -69 -124 -201 99 51 -448 -125 135 62 -114 -25 -112 -90 -8 -242 194 -81 119 33 -206 163 55
7789 55 167 169 176 -24 140 -277 -14 4 -27 -160 67 74 -90 -6 -244 247 -25 -529 -46 283 -214 -127 -42 89
7813 89 44 -194 110 -318 224 193 55 20 26 351 152 2 311 43 -21 237 -123 -17 -132 -150 -59 -35 144
7836 144 41 -44 -293 -21 75 -138 -89 40 -139 -90 -58 -19 -149 353 -147 81 -33 -148 100 -251 -72 -110
7858 -110 110 -169 -32 -212 -248 -79 -62 155 363 299 123 67 -90 146 389 236 -5 351 -56 291 66
7879 66 213 108 -268 167 -29 -105 -23 239 244 -162 -36 188 19 -107 343 -322 -119 299 199 45 -117 -146
$$ packed form
7718A36j26j15q3L71J07k46l8N1j07L61m78J82p6J2K33l21K01J59j32j37K77n07
7740b76K45N8pP5J31r9P0k96J44j47K84j85k18K40P2K8Q3l00l1K4N13j99j80l2
7764cK99l3kl30n5p7L00m8m99L23K60p3j76Q9q7K2Q2k34M36k75K00q6k39L69j08
7789E5J12KPk00J64m17K63J8l1j33K27Pj64Q4k38M91k72n04M83L29m97Q7Q5J31
7813H9m5k38L04m28N42l1j38l5OL25j99j50L09k68o4K58l60J06j15j8R1K4J79
7836A44j03q5k49K72R6k13M9J29j79M9L2L9j30N02n00K28j14j15K48l51J79l8
7858a10K20k79J37j80l6J69J7K17K08o4j76n6j57K36K43j53k41L56m07L47k25
7879F6J47j05l76M35j96p6Q2K62Nm06J26K24j69j26M50o65K03M18j00j54j62k9
$$ plain form
7901 -146 24 93 -78 -187 -125 -89 -70 56 -118 -414 62 123 2 203 -31 -135 -62 -150 -145 -199 151 129 312 -231
7925 -231 271 120 124 241 -273 144 -327 332 314 76 -349 -290 -97 -183 269 104 -23 220 150 166 -418 24
7947 24 76 -120 144 -63 -201 -272 182 -93 69 -310 -157 -272 -447 -24 136 -294 -29 154 -98 190 -275
7968 -275 -197 258 78 12 202 -66 -43 -114 -102 181 192 -16 -154 -79 -147 207 -180 -53 25 115 -165 -5 72 7
7992 7 48 -81 244 74 -202 -253 -155 -220 -194 -9 -144 -330 -3 20 -151 -32 -152 -1 12 23 192 178 -246 -216
8016 -216 -168 120 21 20 -105 83 12 6 -76 295 44 243 -410 22 111 -197 167 -72 26 313 6 -77 144 153
8040 153 -97 -158 -29 100 -134 -188 -96 -188 -134 -81 -155 -44 121 -98 -268 49 -93 -26 58 38 176 44 -5 -167
8064 -167 199 -99 93 -15 -131 -224 264 -15 135 146 130 52 -22 95 199 104 156 -70 199 68 188 77
$$ packed form
7901a46J70O9j71j09O2L6J9J26j74k96M76O1j21K01k34j04P3q8Nn4L50k2J83n43
7925b31N02j51MJ17n14M17m71O59j8k38m25N9J93q6M52j65j27K43p0J6n84M42
7947B4N2j96K64k07j38p1M54k75J62l79J53j15j75M23J60m30K65J83k52K88m65
7968b75P8M55j80o6J90k68K3p1J2K83J1k08j38P5o8L54l87J27P8R0k80J60P7o5
7992GM1j29L25j70k76n1R8o5K6J85j35j86L27K3j71J19j20J51J3J1J69j4m24L0
8016b16M8K88r9jj25J88p1oq2L71k51J99o53M32Q9l08L64k39R8K87l07q3K21R
8040A53k50o1J29J29k34n4R2r2N4N3p4J11J65k19j70L17j42O7Q4k0J38j32m9j62
8064a67L66k98J92j08j16r3M88k79J50J1j6p8p4J17J04r5N2k26K69j31J20j11
$$ plain form
8086 77 238 9 15 -156 -166 127 114 30 -351 -54 71 139 36 -45 71 8 -133 219 33 -166 -133 212 -22
8109 -22 -319 -299 -60 321 -137 -79 -246 187 109 -87 -56 59 -242 -247 -126 -295 -194 -121 -11 85 -15 262 58
8132 58 121 201 -65 237 306 -404 186 -259 236 77 -181 -89 -122 20 115 298 -32 29 -54 75 67 304 233 237 -73
8157 -73 30 52 -48 104 -5 -3 131 -211 -94 85 69 77 -263 -35 88 -57 26 70 -289 -109 53 93 67 42
8181 42 65 215 -3 23 6 -25 220 102 71 -40
$$ packed form
8086G7J61k29Oj71j0K93j3q4l81K97J25O8j03q1J16o3j41L52j86j99L3L45k34
8109b2k97K0K39L81m58N8j67M33p8j96L1J15l01nJ21j69J01P3J10R6j00K77k04
8132E8O3Q0k66L02O9p10N90m45M95j59k58R2l3J42R5J83l30O1q3J29qK37p1Ml10
8157g3J03K2j00J52j09KJ34l42J17J79j6Ql40K28J23j45Q3M4l59J80J62M0k6k5
8181D2K3J50k18K6j7l1K45j18l1j11
8191d0
$$ Imaginary data points
##PAGE= N=2
##DATA TABLE= (X++(I..I)), XYDATA
$$ plain form
0 0 0 0 0 0 0 0 -8 8 -8 8 -14 16 -16 24 -26 32 -40 47 -56 64 -74 87 -101 117 -133 152 -173 196 -223 252
30 252 -282 318 -356 397 -443 493 -549 607 -675 747 -829 917 -1014 1125 -1245 1384 -1538
47 -1538 1714 -1918 2157 -2438 2780 -3204 3742 -4454 5448 -6930 9384 -14183 27152 -135649
61 -135649 -412314 -163527 63800 28943 -152457 -135715 3320 40777 -93728 -162923 -78103
72 -78103 8056 -59884 -133071 -64570 60297 57360 -46782 -112270 -75708 -28910 -44546 -80138
84 -80138 -47651 14510 22206 -10369 -16714 -23194 -65739 -94740 -45321 43908 81956 39531 -10992
97 -10992 7974 66048 72801 27099 5508 37862 86257 115943 123873 124245 125740 110721 67642
110 67642 36814 64365 122737 145910 118773 87358 87871 94307 61758 4552 -15612 14109 43127
$$ packed form
0@%%%%%%qJ6j6J6k2L0l2M0n0N8p2Q7j03J20j38J61j88K18k50K85l25L69m19M75
30B52n34O00o74P53q40R36j042J156j282J422j576J746j931K139k370K629k922
47a538L252l632M075m595N218n984O946q196R902j2378J6314k3567M1335j62801
61a35649k76665K48787K27327l4857j81400J6742J39035L7457j34505o9195Q4820
72g8103Q6159o7940p3187O8501J24867k937j04142o5488L6562M6798j5636l5592
84h0138L2487O2161P696l2575o345o480m2545k9001M9419Q9229L8048m2425n0523
97a0992J8966N8074O753m5702k1591L2354M8395K9686P930L72J495j5019m3079
110F7642l0828K7551N8372K3173k7137l1415N13O436l2549n7206k0164K9721K9018
$$ plain form
123 43127 34934 4100 -21376 -32136 -40710 -65876 -97408 -112283 -108288 -97872 -82324 -68807 -75432
136 -75432 -105682 -139032 -151986 -140081 -120557 -102931 -77421 -52523 -57132 -80504 -78228 -52605
148 -52605 -45875 -57646 -48037 -8842 27855 37082 27726 30918 46553 42884 21696 23087 54601
161 54601 81608 93282 99483 96099 77694 54536 40541 47241 70150 79814 68800 65111 73065
174 73065 65559 39592 21845 18541 16682 13287 12008 21385 37273 34097 4655 -20077 -24862 -28974
188 -28974 -34467 -24460 -7931 -2127 -4480 -15602 -36652 -51975 -51027 -42696 -36555 -34284 -35337 -31994
202 -31994 -22891 -25535 -42415 -53262 -52506 -53054 -50792 -38462 -22421 -12702 -15257 -31610 -46635 -44775
216 -44775 -34678 -30814 -24809 -8664 4898 5597 -1069 -6359 -4530 403 715 3339 17213 33339
$$ packed form
123D3127q193l0834k5476j0760q574k5166l1532j4875L995J0416J5548J3517o625
136g5432l0250l3350j2954J1905J9524J7626K5510K4898m609k3372K276K5623
148e2605O730j1771R609L9195L6697R227r356L192J5635l669k1188J391L1514
161E4601K7007J1674O201l384j8405k3158j3995O700K2909R664j1014l689P954
174G3065p506k5967j7747l304j859l395j279R377J5888l176k9442k4732m785m112
188b8974n493J0007J6529N804k353j1122k1050j5323R48Q331O141K271j053L343
202c1994R103k644j6880j0847P56n48K262J2330J6041R719k555j6353j5025J860
216d4775J0097L864O005J6145J3562O99o666n290J829M933L12K624J3874J6126
$$ plain form
230 33339 39258 41750 43705 39442 30735 24403 27085 38712 55720 64982 62642 54452 43653 34024
244 34024 30495 30012 29507 33713 38980 35858 28545 22445 13964 1080 -8505 -13660 -14370 -8909 -4314
259 -4314 -8760 -15293 -20505 -30980 -43570 -50207 -49432 -41414 -30626 -28779 -34673 -36438 -37585 -45891 -50824
274 -50824 -44450 -37546 -33412 -27372 -21096 -16176 -12325 -14513 -23455 -25808 -17934 -9808 -543 10866 15750
289 15750 15168 14267 8485 1848 5811 15765 20211 24807 32738 35349 31576 26670 19035 15096 20066
304 20066 24789 24700 28155 33944 33206 27780 21319 12322 7192 10972 13432 14070 19442 23705 15425 4919
320 4919 -88 -3988 -5814 -5196 -5081 -3500 2087 1081 -7733 -13498 -16361 -23490 -26869 -23874 -20733 -16623
336 -16623 -12407 -15407 -23353 -25858 -27794 -33184 -34296 -27418 -20400 -14599 -11805 -15858 -19367 -18821 -21196
$$ packed form
230C3339N919K492J955m263q707o332K682J1627J7008R262k340q190j0799r629
244C4024l529m83n05M206N267l122p313o100q481j2884r585n155p10N461M595
259d314m446o533n212j0475j2590o637P75Q018J0788J847n894j765j147q306m933
274e0824O374O904M134O040O276M920L851k188q942k353P874Q126R265J1409M884
289A5750n82r01n782o637L963R954M446M596P931K611l773m906p635l939M970
304B0066M723q9L455N789p38n426o461q997n130L780K460O38N372M263q280j0506
320D919n007l900j826O18J15J581N587j006q814n765k863p129l379K995L141M110
336a6623M216l000p946k505j936n390j112O878P018N801K794m053l509N46k375
$$ plain form
351 -21196 -23960 -18154 -7553 -2297 2123 5490 3836 2364 3124 621 -320 8602 18629 22386 24333
366 24333 25508 23909 21694 18827 14297 17340 26419 30230 28619 30153 29822 23769 17520 13668 10943
381 10943 12780 16888 16014 13532 15438 11965 3223 -4336 -8036 -9981 -7098 -4872 -7801 -7478 -5612
396 -5612 -11113 -20206 -23275 -24429 -25475 -23094 -18830 -17163 -14168 -13408 -20045 -26462 -25660 -23086 -20730 -15817
412 -15817 -11683 -9115 -4838 -5180 -11544 -13201 -8920 -7216 -5990 621 6919 9673 10749 7330 2890
427 2890 4708 7820 7755 9901 16605 20686 20452 18931 15117 12248 13941 13993 11525 15118 21416 20978 17083
444 17083 15217 13276 10357 8032 5403 4303 9105 12067 8837 6463 4675 -254 -5586 -7672 -8152
459 -8152 -6505 -1872 -2229 -7167 -8325 -8620 -13815 -18276 -18279 -17051 -13953 -10560 -11118 -12599 -12216 -13952 -19161
$$ packed form
351b1196k764N806J0601N256M420L367j654j472P60k503r41Q922J0027L757J947
366B4333J175j599k215k867m530L043R079L811j611J534l31o053o249l852k725
381A0943J837M108q74k482J906l473q742p559l700j945K883K226k929L23J866
396e612n501r093l069j154j046K381M264J667K995P60o637o417Q02K574K356M913
412a5817M134K568M277l42o364j657M281J704J226O611O298K754J076l419m440
427B890J818L112o5K146O704M081k34j521l814k869J693N2k468L593O298m38l895
444A7083j866j941k919k325k629j100M802K962l230k374j788m929n332k086m80
459h152J647M633l57m938j158k95n195m461lJ228L098L393n58j481L83j736n209
$$ plain form
476 -19161 -19660 -16429 -13620 -10260 -6427 -6439 -6864 -4899 -7005 -10157 -7577 -1870 488 2863 5572 6577
492 6577 7549 8362 5857 4893 8693 10892 11418 14602 17374 16692 15808 14516 11248 10666 12721 13020 12404
509 12404 14431 16050 13397 10426 7310 4398 3987 4451 3143 3269 4811 3590 329 -1326 -4037 -7626
525 -7626 -7719 -7270 -7913 -6298 -3923 -5580 -9228 -11860 -13180 -12867 -10918 -11324 -11422 -8257 -6011 -7813 -9972
542 -9972 -9953 -10397 -9340 -7586 -6811 -5164 -1098 -642 -3730 -3597 -1181 -857 -953 -77 837 4121 7594 5867
560 5867 3100 5185 6799 4756 4809 7198 8549 9083 10040 8545 8767 10741 8350 4898 6375 9756
576 9756 9472 9170 8942 7240 7374 7054 3403 980 4367 5741 3528 2519 3319 1434 -475 -2021 -4551
593 -4551 -3955 -1084 -2330 -5556 -4701 -4017 -6037 -8044 -8625 -9795 -8584 -6363 -8212 -9211 -6969 -6872 -9665
$$ packed form
476a9161m99L231K809L360L833j2m25J965k106l152K580N707K358K375K709J005
492F577R72Q13k505r64L800K199N26L184K772o82q84j292l268n82K055K99o16
509A2404K027J619k653k971l116k912m11M64j308J26J542j221l261j655k711l589
525g626r3M49o43J615K375j657l648k632j320L13J949m06r8L165K246j802k159
542i972J9m44J057J754P75J647M066M56l088J33K416L24r6Q76R14L284L473j727
560E867k767K085J614k043N3K389J351N34R57j495K22J974k391l452J477L381
576I756k84l02k28j702J34l20l651k423L387J374k213j009Q00j885j909j546k530
593d551N96K871j246l226Q55O84k020k007n81j170J211K221j849r99K242R7k793
$$ plain form
610 -9665 -9057 -8262 -7262 -6324 -5380 -6471 -5376 -2191 -2500 -4214 -2642 -702 -1416 70 1275 1411 4219
627 4219 5694 4179 3656 6073 6150 5377 6576 8353 8759 10041 9766 7054 7229 8880 8164 6527 8314
644 8314 8454 7628 7553 6199 4302 4813 5328 2480 1926 3727 3115 1424 642 -1072 -2627 -1395 -2275 -4424
662 -4424 -3443 -2363 -4999 -6236 -5424 -5683 -6395 -6044 -7055 -8247 -6104 -5999 -8290 -8066 -5597 -5971 -6904
679 -6904 -6359 -6362 -6054 -4187 -4350 -5609 -2652 -483 -2370 -3075 -1317 -310 388 2146 1446 1152 4265 5351
697 5351 2979 3457 5816 6370 6616 7733 6821 7259 9245 7872 6354 7842 9601 8143 7707 7836 6868
714 6868 6847 7339 5216 3918 5928 5569 2878 2275 2279 314 -18 9 -1321 -2650 -1567 -3789 -5813 -4681
732 -4681 -4937 -7119 -7261 -7030 -7502 -7108 -7030 -9203 -10155 -7472 -7363 -8609 -7965 -6541 -6526 -6128 -5733 -6450 -4680
$$ packed form
610i665O08P95J000R38R44j091J095L185l09j714J572J940p14J486J205J36K808
627D219J475j515n23K417P7p73J199J777M06J282k75k712J75J651p16j637J787
644H314J40q26p5j354j897N11N15k848n54J801o12j691p82j714j555J232q80k149
662d424R81J080k636j237Q12k59p12L51j011j192K143J05k291K24K469l74r33
679f904N45lL08J867j63j259K957K169j887p05J758J007O98J758p00k94L113J086
697E351k372M78K359N54K46J117r12M38J986j373j518J488J759j458m36J29r68
714F868k1M92k123j298K010l59k691o03Mj965l32K7j330j329J083k222k024J132
732d681k56k182j42K31m72L94P8k173r52K683J09j246O44J424J5L98L95p17J770
$$ plain form
751 -4680 -2271 -2820 -3543 -974 768 407 1111 1235 1763 3850 5634 4384 4354 6585 6819 6513 7951 8176
769 8176 7548 8820 8237 6733 7854 9598 8435 7143 8178 7318 5775 5634 4867 3942 4149 4289 2908
786 2908 2430 2133 189 -1669 -1235 -1862 -2492 -2142 -2639 -4272 -4294 -4270 -7009 -7603 -6145 -6056 -6537 -5995 -6411
805 -6411 -6928 -6374 -7264 -7761 -6655 -5294 -5610 -5652 -4116 -4045 -3954 -2878 -2814 -3752 -1366 226 -273 58 1367
824 1367 2073 2680 3801 2911 2891 4475 5111 5054 6352 7152 6536 7041 7326 5456 5353 6830 6407 5495 6905
843 6905 7551 6000 5048 3990 2559 3082 3606 2702 2417 3323 1715 -554 -657 -880 -2798 -2867 -2691 -3403
861 -3403 -2570 -1836 -4101 -6152 -5439 -5190 -6382 -5603 -5415 -5378 -4505 -4723 -6258 -5498 -4032 -5034 -6019 -4209
879 -4209 -2947 -2628 -1461 -1641 -2576 -1260 281 -1312 -1333 667 1500 2269 3471 2766 1903 3610 3914 1512
$$ packed form
751d680K409n49p23K569J742l61P04J24N28K087J784j250l0K231K34l06J438K25
769H176o28J272n83j504J121J744j163j292J035q60j543j41p67r25K07J40j381
786B908m78k97j944j858M34o27o30L50m97j633k2K4k739n94J458Q9m81N42m16
805f411n17N54q90m97J106J361l16m2J536P1R1J076O4r38K386J592m99L31J309
824A367P06O07J121q90k0J584O36n7J298Q00o16N05K85j870j03J477m23r12J410
843F905O46j551r52j058j431N23N24r04k85R06j608k269j03k23j918o9J76p12
861c403Q33P34k265k051P13K49j192P79J88L7Q73k18j535P60J466j002r85J810
879d209J262L19J167j80r35J316J541j593k1K000Q33P69J202p05q63J707L04k402
$$ plain form
897 1512 2743 5335 5507 4589 5329 5133 4264 4513 3126 2181 3814 5811 4429 3631 4151 3063 2048
914 2048 1765 593 71 2143 2253 602 783 1428 -679 -2468 -1958 -2359 -1907 -1158 -1483 -2780 -2246 -1989
932 -1989 -3706 -4144 -3917 -4098 -3451 -2183 -3347 -3676 -2023 -2604 -4949 -4114 -2844 -3123 -2736 -1769 -1654 -731
950 -731 416 -1490 -2989 -1533 -358 -932 -291 1416 1819 2088 2086 542 332 2119 1685 1287 3529 4614
968 4614 3808 3591 2973 1576 2115 2898 2401 2626 4398 4566 3271 3187 2429 1100 1236 1907 1045 1571 3217
987 3217 1831 424 672 188 -1335 -1091 -706 -1583 -456 442 -1371 -2457 -1747 -2781 -3948 -3160 -3433
1004 -3433 -3345 -2116 -1737 -2992 -2790 -2380 -3518 -4810 -3894 -3137 -2736 -1380 -1559 -2084 -1541 -1158 -3103 -3312
1022 -3312 -1159 -668 -269 1408 1433 688 1195 845 -577 531 2534 2645 2758 4035 3662 3194 3273 1857
$$ packed form
897A512J231K592J72r18P40j96q69K49j387r45J633J997j382p98N20j088j015
914B048k83j172n22K072J10j651J81O45k107j789N10m01M52P49l25j297N34K57
932a989j717m38K27j81O47J268j164l29J653n81k345Q35J270k79L87R67J15R23
950g31J147j906j499J456J175n74O41J707M03K69kj544k10J787m34l98K242J085
968D614q06k17o18j397N39P83m97K25J772J68j295q4p58j329J36O71q62N26J646
987C217j386j407K48m84j523K44L85q77J127Q98j813j086P10j034j167P88k73
1004c433Q8J229L79j255K02M10j138j292R16P57M01J356j79n25N43L83j945k09
1022c312K153M91L99J677K5p45N07l50j422J108K003J11J13J277l73m68P9j416
$$ plain form
1040 1857 1454 3280 4348 3271 3760 4588 3588 2885 2655 1661 1097 2598 2960 1110 1521 2704 945
1057 945 216 -181 -1540 -1484 -945 -1518 -1948 -511 -813 -2829 -3598 -3511 -4624 -4242 -3567 -3635 -3655 -1843 -2773 -4411
1077 -4411 -4410 -4224 -4592 -4167 -2987 -2548 -1184 -333 -2372 -2962 -1789 -1667 -1869 -545 940 1091 2053 2084 1195
1096 1195 902 1990 1410 1402 3001 4158 3884 4794 4443 2563 3296 3612 2769 2614 4070 4395 3032 4074
1114 4074 3631 2308 1994 1909 167 746 1901 1383 571 933 236 -1237 -1545 -2260 -3226 -2253 -1268 -2503
1132 -2503 -2414 -1657 -3095 -4136 -4520 -4723 -4391 -3327 -2625 -3507 -2923 -2261 -3766 -4716 -3836 -3561 -3338 -1394
1150 -1394 -1125 -1004 82 53 -1954 -1631 -204 359 867 2113 2382 2385 3249 2486 1706 2269 3113 2998 3346
1169 3346 4395 4106 3974 4395 3153 1825 3004 3201 1848 2460 3401 3165 2394 2211 424 -225 253 -477
$$ packed form
1040A857m03J826J068j077M89Q28j000p03k30r94n64J501L62j850M11J183j759
1057I45p29l97j359N6N39n73m30J437l02k016p69Q7j113L82O75o8k0J812r30j638
1077d411JJ86l68M25J180M39J364Q51k039n90J173J22k02J324J485J51R62L1q89
1096A195k93J088n80qJ599J157k74R10l51j880P33L16q43j55J456L25j363J042
1114D074m43j323l14q5j742N79J155n18q12L62o97j473l08p15r66R73R85j235
1132b503Q9P57j438j041l84k03L32J064P02q82N84O62j505r50Q80K75K23J944
1150a394K69J21J086k9k007L23J427N63N08J246K69LQ64p63p80N63Q44j15L48
1169C346J049k89j32M21j242j328J179J97j353O12R41k36p71j83j787o49M78p30
$$ plain form
1187 -477 -1411 10 743 -138 -1067 -1502 -2927 -3312 -3124 -3621 -3716 -1605 -1854 -3121 -2815 -3284 -4029 -4457 -3599
1206 -3599 -3921 -2521 -969 -1816 -2723 -1736 -1878 -2750 -1745 -920 -1062 116 1086 662 542 1091 479 -212
1224 -212 789 1585 1900 3296 3106 1971 2419 3296 2017 1173 2356 2722 2420 3576 3142 2150 2885 2469
1242 2469 510 -42 1496 1616 1218 1685 1379 331 490 -328 -2636 -1470 -58 -750 -997 134 -276
1259 -276 -1572 -1809 -2790 -3413 -2183 -1300 -2019 -1557 -748 -1877 -2646 -2063 -2755 -3342 -1815 -1011 -2001 -627
1277 -627 -121 -1376 -1824 -1327 -1653 -1245 36 -152 -406 1101 1254 45 -2 622 -34 -61 1109 872 1383
1296 1383 2786 2211 597 1501 1193 402 774 2047 2250 2266 2396 1385 797 1250 536 -72 541 1551
1314 1551 1193 1551 1692 260 -655 -41 -984 -1158 -3 799 -378 -4 -133 -1277 -1325 -1420 -2355 -1660 -348
$$ packed form
1187d77r34J421P33q81r29m35j425l85J88m97r5K111k49j267L06m69p45m28Q58
1206c599l22J400J552q47r07R87j42q72J005Q25j42J178R70m24j20N49o12o91
1224b12J001P96L15J396j90j135M48Q77j279q44J183L66l02J156m34r92P35m16
1242B469j959n52J538J20l98M67l06j048J59q18k308J166J412o92k47J131m10
1259b76j296k37r81o23J230Q83p19M62Q09j129p69N83o92n87J527Q04r90J374
1277f27N06j255m48M97l26M08J281j88k54J507J53j209m7O24o56k7J170k37N11
1296A383J403n75j614R04l08p91L72J273K03J6J30j011n88M53p14o08O13J010
1314A551l58L58J41j432r15O14r43j74J155Q02j177L74j29j144m8r5r35O95J312
$$ plain form
1333 -348 -267 -1571 -592 -857 -2222 -1773 -1802 -2558 -1766 -508 -1150 -1369 -540 -946 -1854 -1689 -1514 -1667 -639
1352 -639 13 -738 -182 806 -282 -1133 -505 -493 -217 482 1193 829 1530 1342 354 217 961 858 842 1899
1372 1899 2101 1948 2446 2169 529 821 1646 1080 1335 2132 1851 1677 1965 1162 -406 266 1003 510 644
1391 644 879 731 391 -22 -1112 -1460 -583 -967 -1918 -997 -298 -1156 -1545 -1420 -2249 -2859 -2092 -2402 -2729 -1667
1411 -1667 -1012 -2091 -2150 -1756 -2386 -2491 -1817 -2203 -1883 -227 -136 -633 -551 -26 -1138 -515 -54 -59 925 2117
1431 2117 1677 1059 1850 1351 976 1480 2285 2220 3057 3876 2677 1966 3072 2306 1495 2306 2414 2346 2352 2284 1058
1452 1058 1255 1503 386 -324 898 421 200 129 190 -968 -711 -1462 -2463 -2365 -1198 -1834 -2641 -1750 -1959
1471 -1959 -2798 -2703 -3024 -3409 -2870 -2232 -2837 -2530 -1252 -1779 -2296 -2149 -2510 -2616 -1012 -345 -1090 -220 695
$$ packed form
1333c48Q1j304R79k65j365M49k9p56P92J258o42k19Q29m06r08J65J75j53J028
1352f39O52p51N56R88j088q51O28J2K76O99P11l64P01j88r88j37P44j03j6J057
1372A899K02j53M98k77j640K92Q25n66K55P97k81j74K88q03j568O72P37m93J34
1391F44K35j48l40m13j090l48Q77l84r51R21O99q58l89J25q29o10P67l10l27J062
1411a667O55j079n9L94o30j05O74l86L20J656R1m97Q2N25j112O23M61nR84J192
1431B117m40o18P91m99l75N04Q05o5Q37Q19j199p11J106p66q11Q11J08o8Oo8j226
1452A058J97K48j117p10J222m77k21p1O1j158K57p51j001R8J167o36q07Q91k09
1471a959q39R5l21l85N39O38o05L07J278n27n17J47l61j06J604O67p45Q70R15
$$ plain form
1490 695 119 -136 221 418 -120 1528 1971 1401 2645 2982 1584 1578 2096 2152 2273 2959 2770 2633 3355 2971
1510 2971 1671 1958 2570 1582 1545 1868 1631 1117 1674 718 -65 562 291 -839 -507 -109 -1073 -1325 -599
1529 -599 -1824 -2429 -1369 -2159 -3516 -2293 -1528 -2040 -2045 -1769 -2800 -2857 -2391 -3013 -2718 -1552 -1579 -1685 -983
1548 -983 -1011 -1797 -1426 -572 -1047 -963 713 768 164 938 1230 387 921 1065 802 1928 2668 2179 1934 2732
1568 2732 2237 1379 1804 2095 1912 2707 2529 1674 1768 1983 1305 892 1126 592 511 913 862 -176 657 671 -792
1589 -792 -1294 -582 -1144 -1140 -355 -669 -1387 -783 -792 -2304 -2341 -1505 -1949 -2044 -1104 -1167 -1053 -1021 -1432 -2515 -1837 -1253
1611 -1253 -1609 -917 -509 -509 -865 -90 -720 -831 -77 376 -405 250 1086 683 582 630 449 502 1348 1163 681
1632 681 1339 1996 602 1066 1766 966 785 1419 1148 434 1730 1332 522 749 1079 404 210 654 -70
$$ packed form
1490F95n76k55L57J97n38J648M43n70J244L37j398oN18N6J21O86j89j37P22l84
1510B971j300K87O12r88l7L23k37n14N57r56p83O27k71j130L32L98r64k52P26
1529e99j225o05J060p90j357J223P65n12nK76j031n7M66o22K95J166k7j06P02
1548i83k8p86L71Q54m75Q4J676N5o04P74K92q43N34J44k63J126P40m89k45P98
1568B732m95q58M25K91j83P95j78q55R4K15o78m13K34n34q1M02n1j038Q33J4j463
1589g92n02P12n62MP85l14p18O04rj512l7Q36m44r5R40o3J14L2m11j083O78N84
1611a253l56O92M08%l56P75o30j11P54M53p81O55Q36m03j01M8j81N3Q46j85m82
1632F81O58O57j394M64P00q00j81O34k71p14J296l98q10K27L30o75j94M44p24
$$ plain form
1651 -70 391 779 623 -212 230 -125 -955 -678 111 -530 -141 313 -758 -434 -364 -952 -1648 -782 -724 -1017 -518
1672 -518 -218 -1317 -965 -540 -1421 -1655 -546 -582 -1224 -608 -434 -888 -1084 -393 -968 -557 -314 -342 -989 244
1692 244 65 -459 -5 265 -656 97 675 -67 214 902 952 345 782 899 199 1076 1142 800 1083 1933 1001
1713 1001 790 1456 822 725 1225 1088 1001 1618 1537 737 700 1051 325 287 593 271 101 865 67 -798 -473
1734 -473 -228 -1214 -771 -258 -889 -1053 -484 -1354 -1669 -910 -1163 -1735 -1624 -1142 -1487 -1295 -909 -1479 -1478 -691 -1214
1755 -1214 -1604 -841 -319 -1261 -777 -155 -397 -484 226 -163 18 676 1024 379 875 1431 1091 969 1406 1002
1775 1002 1058 2054 1664 1267 2278 2212 1433 1370 1782 1072 1633 1942 1238 850 1289 1013 308 654 683 -72 231
1796 231 273 -326 -367 -77 -886 -1401 -528 -993 -1402 -1083 -1143 -1986 -1667 -1084 -1945 -1952 -1433 -1811 -2334 -1313 -1658
$$ packed form
1651g0M61L88j56q35M42l55q30K77P89o41L89M54j071L24P0n88o96Q66N8k93M99
1672e18L00j099L52M25q81k34J109l6o42O16J74m54j96O91n75M11K43k8o47J233
1692B44j79n24M54K70r21P53N78p42K81O88N0o07M37J17p00Q77O6l42K83Q50r32
1713A001k11O66o34r7N00j37q7O17q1q00l7L51p26l8L06l22j70P64p98q65L25
1734d73K45r86M43N13o31j64N69q70l15P59k53n72J11M82l45J92L86n70JP87n23
1755a214l90P63N22r42M84O22k42q7P10l89J81O58L48o45M96N56l40j22M37m04
1775A002N6R96l90l97J011o6p79o3M12p10N61L09p04l88M39k76p05L46K9p55L03
1796B31M2n99m1K90q09n15Q73m65m09L19o0q43L19N83q61pN19l78n23J021l45
$$ plain form
1817 -1658 -1624 -1194 -1067 -1608 -1290 -632 -772 -981 -119 -77 -338 667 719 339 546 929 381 1213 1744 1435
1837 1435 1107 1621 1614 1340 1779 2154 1572 1960 2201 1042 1246 2030 1287 1190 1474 1197 865 1269 840 150
1857 150 525 448 -230 -305 48 -639 -781 -846 -1073 -1506 -1188 -844 -1391 -1712 -991 -2049 -1684 -1295 -1626 -1873 -1205
1878 -1205 -1203 -1781 -1511 -1035 -1482 -1225 -602 -937 -516 90 -434 -1116 84 421 -141 519 806 389 739 1132
1898 1132 580 732 1758 1451 1147 1379 1501 1195 1409 1373 1124 1146 1399 1062 597 807 866 516 368 732
1918 732 106 340 416 -184 -177 399 -618 -340 -192 -406 -638 -483 -395 -1325 -969 -221 -846 -1470 -575 -1052 -1426
1939 -1426 -972 -496 -1379 -731 -546 -1021 -777 -170 -760 -742 -60 -344 -360 98 144 -269 90 445 206 -190 689
1960 689 499 -5 685 656 312 1003 598 374 714 1005 399 610 708 382 648 1009 571 41 819 714 107
$$ packed form
1817a658L4M30J27n41L18O58j40k09Q62M2k61J005N2l80K07L83n48Q32N31l09
1837A435l28N14pk74M39L75n82L88K41j159K04P84p43r7K84k77l32M04m29o90
1857A50L75p7o78p5L53o87j42o5k27m33L18L44n47l21P21j058L65L89l31k47O68
1878a205Kn78K70M76m47K57O23l35M21O06n24o82J200L37n62O60K87m17L50L93
1898A132n52J52J026l07l04K32J22l06K14l6k49K2K53l37m65K10N9l50j48L64
1918G32o26K34P6o00PN76j017K78J48k14k32J55Q8r30L56P48o25o24Q95m77l74
1939a426M54M76q83O48J85m75K44O07n90J8O82k84j6M58M6m13L59L55k39l96Q79
1960F89j90n04O90k9l44O91m05k24L40K91o06K11R8l26K66L61m38n30P78j05o07
$$ plain form
1981 107 -40 286 -9 -209 229 21 -169 294 -23 -752 -146 353 -346 -394 372 -224 -561 -160 -255 -635 2
2002 2 97 -381 -466 -148 -580 -86 481 -282 -112 106 144 -96 -145 -170 -435 -264 314 -329 -28 -50 -78 -485 188
2025 188 211 -261 481 156 -313 52 -13 -246 -129 186 -98 48 675 -43 -375 93 327 -173 -56 383 -113
2046 -113 -487 501 251 49 722 567 284 527 698 43 176 405 281 108 646 289 -58 543 204 -342
2066 -342 258 491 -18 54 154 -108 -213 29 -267 -411 -62 67 -475 -564 -441 -626 -306 -409 -447 -803 -561
2087 -561 -510 -1027 -297 -263 -506 -641 -273 -621 -652 -90 -292 -626 319 -56 -313 188 163 -352 -136 607 156
2108 156 845 916 560 22 672 994 419 638 762 319 829 1025 728 680 842 517 405 1089 933 586 564
2129 564 681 14 208 460 -199 -595 245 -162 -850 27 -206 -612 -675 -359 -1047 -853 -874 -731 -1258 -539 -792
$$ packed form
1981A07j47L26k95k00M38k08j90M63l17p29O06M99o99m8P66n96l37M01r5l80O37
2002BR5m78q5L18m32M94N67p63J70K18L8k40m9k5k65J71N78o43L01k2k8m07O73
2025A88K3m72P42l25m69L65o5k33J17L15k84J46O27p18l32M68K34n00J17M39m96
2046a13l74R88k50k02O73j55k83K43J71o55J33K29j24j73N38l57l47O01l39n46
2066c42O00K33n09P2J00k62j05K42k96j44L49J29n42q9J23j85L20j03l8l56K42
2087e61N1n17P30L4k43j35L68l48l1N62k02l34R45l75k57N01k5n15K16P43m51
2108A56O89P1l56n38O50L22n75K19J24m43N10J96k97m8J62l25j12O84j56l47k2
2129E64J17o67J94K52o59l96Q40m07o88Q77k33m06o3L16o88J94k1J43n27P19k53
$$ plain form
2150 -792 -1486 -749 -785 -1013 -1042 -220 -734 -606 208 -366 -713 -382 -10 -271 301 379 -46 495 706 683 287
2171 287 842 470 185 1074 802 369 1396 1111 530 780 752 670 533 906 673 522 1035 391 281 389
2191 389 724 -79 -116 106 -176 -466 180 -231 -752 -443 -273 -837 -823 -415 -1011 -964 -460 -769 -957 -643 -833
2212 -833 -1342 -661 -343 -835 -338 -85 -713 -712 -420 -65 -308 219 57 -180 264 644 -18 174 637 242 474
2233 474 788 727 736 496 1069 547 617 1206 724 825 1028 415 297 921 572 301 336 525 40 141 374 129
2255 129 -49 118 -52 -615 -32 -250 -967 -540 -492 -704 -370 -363 -851 -790 -503 -682 -617 -200 -231 -788 -505 -270
2277 -270 -870 -722 -139 -193 -353 49 130 -60 351 208 -532 279 266 435 539 957 456 268 831 739 400
2298 400 672 594 77 367 824 769 766 477 23 -71 462 161 -18 210 455 -241 137 251 -299 -387 55 -380
$$ packed form
2150g92o94P37l6k28k9Q22n14J28Q14n74l47L31L72k61N72P8m25N41K11k3l96
2171B87N55l72k85Q89k72m33J027k85n81K50k8q2j37L73k33j51N13o44j10J08
2191C89L35q03l7K22k82k90O46m11n21L09J70n64J4M08n96M7N04l09j88L14j90
2212h33n09O81L18m92M97K53o28JK92L55k43N27j62k37M44L80o62J92M63l95K32
2233D74L14o1Rk40N73n22P0N89m82J01K03o13j18O24l49k71L5J89m85J01K33k45
2255A29j78J67j70n63N83k18p17M27M8k12L34Pm88O1K87j79O5M17l1n57K83K35
2277b70o00J48N83n4j60M02Q1j90M11j43p40Q11j3J69J04M18n01j88N63r2l39
2298D00K72p8n17K90M57n5lk89m54r4N33l01j79K28K45o96L78J14n50q8M42m35
$$ plain form
2320 -380 -494 -70 -331 -677 -207 -19 -884 -729 -370 -335 -710 -248 -156 -344 -187 -333 -590 -219 379 -313 205
2341 205 449 339 -213 -46 -47 -225 133 272 325 274 519 217 218 293 -161 35 413 484 242 316 406 42 125 14
2365 14 -239 131 271 -108 430 164 312 -360 -168 127 -657 -314 30 -227 -161 -25 -311 -229 -323 -47 -334
2386 -334 -33 69 -308 294 274 -81 22 84 191 -353 111 191 -61 418 469 -32 -216 272 1 -19 464 371
2408 371 -59 572 231 -200 154 66 -56 187 284 -136 34 91 79 -342 3 0 -749 -109 15 -357 -159 -8
2430 -8 -345 -478 358 105 -510 -215 315 -462 -308 301 -25 -49 437 -336 -104 309 157 11 329 419 -49
2451 -49 152 572 4 77 510 239 88 567 610 23 53 475 147 234 626 297 -155 212 96 -393 -135 193
2473 193 -389 19 75 -306 -751 -21 -443 -652 -150 -282 -618 -338 -187 -444 -283 -308 -409 -531 196 -210 -324
$$ packed form
2320c80j14M24k61l46M70J88q65J55L59L5l75M62R2j88J57j46k57L71N98o92N18
2341B05K44j10n52J67jj78L58J39N3n1K45l02JP5m54J96L78P1k42P4R0l64Q3j11
2365A4k53L70J40l79N38k66J48o72J92K95p84L43L44k57O6J36k86Q2r4K76k87
2386c34L01J02l77O02k0l55J03O2J07n44M64Q0k52M79N1n01j84M88k71k0M83r3
2408C71m30O31l41m31L54q8j22K43R7m20J70N7j2m21L45lp49O40J24l72J98J51
2430hl37j33Q36k53o15K95N30p77J54O09l26k4M86p73K32M13j52j46L18R0m68
2451d9K01M20n68P3M33k71j51M79M3n87L0M22l28Q7L92l29m52L67j16m89K58L28
2473A93n82M08N6l81m45P30m22k09N02j32l36K80J51k57J61k5j01j22P27m06j14
$$ plain form
2494 -324 -139 -101 -201 -17 259 -16 -143 386 230 100 549 385 474 474 406 -209 793 601 388 170 822
2515 822 239 521 860 57 172 576 461 -67 233 431 28 -101 104 -215 -407 231 -2 -420 130 -15
2535 -15 -568 -215 -49 -516 -616 -153 -618 -651 -423 -485 -844 -503 -534 -600 -814 -30 -337 -253 140 -164 -296 26
2557 26 -104 -225 129 250 -37 274 371 441 436 851 548 82 818 397 615 430 1149 379 359 558 419 493
2579 493 450 464 286 702 341 6 -139 298 -153 -188 280 -49 -185 -251 -353 -397 -569 -494 -861 -539 76 -798
2601 -798 -897 -340 -521 -1001 -158 -437 -755 -576 -497 -404 -271 83 -349 -414 -76 363 95 149 99 -47 391 526
2623 526 144 302 741 421 215 783 937 564 874 616 303 532 831 550 391 550 242 277 501 528 -286
2644 -286 -38 68 -127 532 547 -11 -275 184 -648 -463 -209 -270 -619 -607 -568 -854 -809 -76 -723 -656 -298 -431
$$ packed form
2494c24J85L8j00J84K76k75j27N29j56j30M49j64Q9%o8o15J002j92k13k18O52
2515H22n83K82L39q03J15M04j15n28L00J98m03j29K05l19j92O38k33m18N50j45
2535a5n53L53J66m67j00M63m65l3K28o2l59L41l1o6k14P84l07Q4L93l04j32L22
2557B6j30j21L54J21k87L11R7P0nM15l03m66P36m21K18j85P19p70k0J99j39P4
2579D93m3J4j78M16l61l35j45M37m51l5M68l29j36o6j02m4j72P5l67L22O15q74
2601g98r9N57j81m80Q43k79l18J79P9R3J33L54m32o5L38M39k68N4n0j46M38J35
2623E26l82J58M39l20k06N68J54l73L10k58l13K29K99k81j59J59l08L5K24K7q14
2644b86K48J06j95O59J5n58k64M59q32J85K54o1l49J2L9k86M5P33o47O7L58j33
$$ plain form
2666 -431 -692 -385 -17 -590 -314 -365 -361 -580 44 -274 -218 48 -24 -112 184 165 -11 255 438 -102 573 656 534
2689 534 426 772 392 201 275 575 498 655 603 199 382 447 88 14 169 237 -72 260 -110 -302 -162 -58
2711 -58 -120 -422 -86 -309 -604 -125 -198 -429 -542 -274 -758 -791 -79 -552 -526 42 -13 -621 -11 -19 -505 -171 -178
2734 -178 -214 -41 323 309 123 214 145 74 251 69 46 293 425 228 382 342 -262 147 283 475 -28 747
2756 747 310 -113 272 270 -285 15 437 97 1 209 90 -429 -3 41 -218 -299 -50 -46 -540 70 -194 -579
2778 -579 252 150 -160 -34 -52 -129 -97 124 20 20 264 252 -121 114 391 -24 114 240 485 32 245 -312
2800 -312 -141 172 100 50 792 429 -211 381 202 -220 -64 323 -53 -70 192 305 -248 -269 -62 -223 -255 -166
2822 -166 -355 -82 402 -282 -617 137 18 -206 -176 -118 -194 -90 243 -530 -144 270 -140 -98 496 -122 112
$$ packed form
2666d31k61L07L68n73K76n1Mk19O24l18N6K66p2q8K96j9j76K66J83n40O75Q3j22
2689E34j08L46l80j91P4L00p7J57n2m04J83O5l59p4J55O8l09L32l70j92J40J04
2711e8o2l02L36k23k95M79p3k31j13K68m84l3P12m73K6N68n5o08O10qm86L34p
2734a78l6J73L64j4j86R1o9p1J77j82k3K47J32j97J54m0o04M09J36J92n03P75
2756G47m37m23L85kn55L00M22l40r6K08j19n19M26M4k59q1K49Mm94O10k64l85
2778e79Q31j02l10J26j8p7L2K21j04%K44j2l73K35K77m15J38J26K45m53K13n57
2800c12J71L13p2n0P42l63o40N92j79m22J56L87l76j7K62J13n53k1K07j61l2Q9
2822a66j89K73M84o84l35P54j19k24L0N8p6J04L33p73L86M14m10M2N94o18K34
$$ plain form
2843 112 84 259 25 72 306 41 -18 575 570 9 439 308 125 231 295 -258 66 406 283 -381 358 156
2865 156 -245 -45 -177 -170 -346 72 -144 -192 -21 -500 -318 -148 -378 -501 -52 -25 -689 -48 -128 -424 -508 66
2887 66 140 -190 14 -4 -390 -215 269 -155 -176 258 -116 52 230 22 459 381 409 177 585 417 -72 294
2909 294 574 383 302 857 210 165 250 518 84 18 482 484 81 134 -265 -523 -131 -558 -578 -163 -313 -554 -242
2932 -242 -171 -424 -634 -269 -594 -571 -192 -445 -642 -254 -626 -425 -424 -210 -428 5 -76 -30 -401 -142 140 -105
2954 -105 392 361 239 -76 451 519 81 414 349 62 1070 229 278 648 653 305 404 761 262 277 228 122 -76
2977 -76 565 378 -208 -70 284 -82 26 369 -158 -366 -167 -314 -401 -200 -278 -644 -282 -256 -562 -462 -609
2998 -609 -279 -763 -316 -273 -841 -212 -94 -612 -398 65 51 -239 62 -48 85 539 310 198 84 344 387
$$ packed form
2843A12k8J75k34M7K34k65n9N93nn61M30j31j83J06O4n53L24L40j23o64P39k02
2865A56m01K00j32Pj76M18k16m8J71m79J82J70k30j23M49K7o64O41q0k96q4N74
2887F6P4l30K04j8l86J75M84m24k1M34l74J68J78k08M37p8K8k32M08j68m89L66
2909B94K80j91q1N55o47m5Q5K68m34o6M64Km03N3l99k58L92m27k0M15j50k41L12
2932b42P1k53k10L65l25K3L79k53j97L88l72K01JK14k18M33q1M6l71K59K82k45
2954a05M97l1j22l15N27O8m38L33o5k87J008q41M9L70Nl48R9L57m99J5m9j06j98
2977g6O41j87n86J38L54l66J08L43n27k08J99j47q7K01p8l66L62K6l06J00j47
2998f09L30m84M47M3n68O29J18n18K14M63j4k90L01j10J33M54k29j12j14K60M3
$$ [...]
8191B7
##END NTUPLES=NMR FID
##END=
