##TITLE=1H_LR-562-C3-C
 CDCl3
 8 sc, 
 20.12.2023
##JCAMPDX= 6.0         $$ Bruker NMR JCAMP-DX V2.0
##DATA TYPE= NMR FID
##DATA CLASS= NTUPLES
##ORIGIN= UXNMR, Bruker Analytische Messtechnik GmbH
##OWNER= root
$$ XWIN-NMR		Version 3.5
$$ Wed Dec 20 16:35:58 2023 Russian Standard Time (UT+4h)  she@DPX200
##.OBSERVE FREQUENCY= 200.1313
##.OBSERVE NUCLEUS= ^1H
##.DELAY= (6, 6)
##.ACQUISITION MODE= SIMULTANEOUS
##.ACQUISITION SCHEME= undefined
##.AVERAGES= 8
##.DIGITISER RES= 18
##SPECTROMETER/DATA SYSTEM= spect
##.PULSE SEQUENCE= zg30
##.SOLVENT NAME= CDCl3
##.SHIFT REFERENCE= (INTERNAL, CDCl3, 0, 15.7039)
##AUDIT TRAIL= $$ (NUMBER, WHEN, WHO, WHERE, WHAT)
$$ ##TITLE= Audit trail, XWIN-NMR		Version 3.5
$$ ##JCAMPDX= 5.01
$$ ##ORIGIN= Bruker BioSpin GmbH
$$ ##OWNER= she
$$ F:/spectra/data/she/nmr/H-F/1/audita.txt
$$ ##AUDIT TRAIL=  $$ (NUMBER, WHEN, WHO, WHERE, WHAT)
(   1,<2023-12-20 16:34:44.96 +0400>,<she>,<DPX200>,
      <created by zg, POWCHK disabled, PULCHK disabled
       configuration hash MD5:
       00 E9 B6 7A A2 85 ED C7 34 08 36 98 17 FE 4E 26
       data hash MD5: 16K
       68 AC D2 78 C0 BC 09 05 0F AE B5 41 08 23 F7 D1>)
$$ ##END=
$$ 
$$ hash MD5
$$ E5 2E 21 F4 7E 58 87 26 9A 10 5B F2 A5 FC 66 99
##$RELAX= 
##$RELAX= 
##$RELAX= 
##$RELAX= 
##$RELAX= 
##$RELAX= 
$$ Bruker specific parameters
$$ --------------------------
##$DU= <F:/spectra>
##$EXPNO= 1
##$NAME= <H-F>
##$PROCNO= 1
##$TYPE= <nmr>
##$USER= <she>
##$AMP= (0..31)
100 100 100 100 100 100 100 100 100 100 100 100 100 100 100 100 100 100 
100 100 100 100 100 100 100 100 100 100 100 100 100 100 
##$AQSEQ= 0
##$AQ_mod= 1
##$AUNM= <au_zg>
##$AUTOPOS= <>
##$BF1= 200.13
##$BF2= 200.13
##$BF3= 200.13
##$BF4= 200.13
##$BF5= 200.13
##$BF6= 200.13
##$BF7= 200.13
##$BF8= 200.13
##$BYTORDA= 1
##$CFDGTYP= 0
##$CFRGTYP= 5
##$CHEMSTR= <none>
##$CNST= (0..31)
1 1 145 1 1 1 1 1 1 1 1 1 1 1 1 1 1 1 1 1 1 1 1 1 1 1 1 1 1 1 1 1 
##$CPDPRG= <>
##$CPDPRG1= <>
##$CPDPRG2= <>
##$CPDPRG3= <>
##$CPDPRG4= <mlev>
##$CPDPRG5= <mlev>
##$CPDPRG6= <mlev>
##$CPDPRG7= <mlev>
##$CPDPRG8= <mlev>
##$CPDPRGB= <>
##$CPDPRGT= <>
##$D= (0..31)
0 1.2 0 0 0 0 0 0 0 0.06 0 0.03 0 0 0 0 0.0002 0 0 0 0 0 0 0 0 0 0 0 0 
0 0 0 
##$DATE= 1703075684
##$DBL= (0..7)
120 120 120 120 120 120 120 120 
##$DBP= (0..7)
150 150 150 150 150 150 150 150 
##$DBP07= 0
##$DBPNAM0= <>
##$DBPNAM1= <>
##$DBPNAM2= <>
##$DBPNAM3= <>
##$DBPNAM4= <>
##$DBPNAM5= <>
##$DBPNAM6= <>
##$DBPNAM7= <>
##$DBPOAL= (0..7)
0.5 0.5 0.5 0.5 0.5 0.5 0.5 0.5 
##$DBPOFFS= (0..7)
0 0 0 0 0 0 0 0 
##$DE= 6
##$DECBNUC= <off>
##$DECIM= 32
##$DECNUC= <off>
##$DECSTAT= 4
##$DIGMOD= 1
##$DIGTYP= 9
##$DL= (0..7)
0 120 120 120 120 120 120 120 
##$DP= (0..7)
150 150 150 150 150 150 150 150 
##$DP07= 0
##$DPNAME0= <>
##$DPNAME1= <>
##$DPNAME2= <>
##$DPNAME3= <>
##$DPNAME4= <>
##$DPNAME5= <>
##$DPNAME6= <>
##$DPNAME7= <>
##$DPOAL= (0..7)
0.5 0.5 0.5 0.5 0.5 0.5 0.5 0.5 
##$DPOFFS= (0..7)
0 0 0 0 0 0 0 0 
##$DQDMODE= 0
##$DR= 18
##$DS= 0
##$DSLIST= <SSSSSSSSSSSSSSS>
$$ [...]
##$SUBNAM2= <"">
##$SUBNAM3= <"">
##$SUBNAM4= <"">
##$SUBNAM5= <"">
##$SUBNAM6= <"">
##$SUBNAM7= <"">
##$SUBNAM8= <"">
##$SUBNAM9= <"">
##$SW= 18.0517328524113
##$SWIBOX= (0..15)
0 0 2 0 0 0 0 0 0 0 0 0 0 0 0 0 
##$SW_h= 3612.71676300578
##$TD= 16384
##$TD0= 1
##$TE= 0
##$TE2= 300
##$TE3= 300
##$TEG= 300
##$TL= (0..7)
0 120 120 120 120 120 120 120 
##$TP= (0..7)
150 150 150 150 150 150 150 150 
##$TP07= 0
##$TPNAME0= <>
##$TPNAME1= <>
##$TPNAME2= <>
##$TPNAME3= <>
##$TPNAME4= <>
##$TPNAME5= <>
##$TPNAME6= <>
##$TPNAME7= <>
##$TPOAL= (0..7)
0.5 0.5 0.5 0.5 0.5 0.5 0.5 0.5 
##$TPOFFS= (0..7)
0 0 0 0 0 0 0 0 
##$TUNHIN= 0
##$TUNHOUT= 0
##$TUNXOUT= 0
##$USERA1= <user>
##$USERA2= <user>
##$USERA3= <user>
##$USERA4= <user>
##$USERA5= <user>
##$V9= 5
##$VALIST= <valist>
##$VCLIST= <CCCCCCCCCCCCCCC>
##$VD= 0
##$VDLIST= <DDDDDDDDDDDDDDD>
##$VPLIST= <PPPPPPPPPPPPPPP>
##$VTLIST= <TTTTTTTTTTTTTTT>
##$WBST= 1024
##$WBSW= 4
##$XGAIN= (0..3)
0 0 0 0 
##$XL= 0
##$YL= 0
##$YMAX_a= 46384
##$YMIN_a= -58722
##$ZGOPTNS= <>
##$ZL1= 120
##$ZL2= 120
##$ZL3= 120
##$ZL4= 120
##$ABSF1= 10
##$ABSF2= 0
##$ABSG= 5
##$ABSL= 3
##$ALPHA= 0
##$AQORDER= 0
##$ASSFAC= 0
##$ASSFACI= 0
##$ASSFACX= 0
##$ASSWID= 0
##$AUNMP= <proc_1d>
##$AZFE= 0.1
##$AZFW= 0.1
##$BCFW= 1
##$BC_mod= 2
##$BYTORDP= 1
##$COROFFS= 0
##$CY= 11.3945322036743
##$DATMOD= 1
##$DC= 2
##$DFILT= <>
##$DTYPP= 0
##$F1P= 15.7292609196834
##$F2P= 12.9074282941183
##$FCOR= 0.5
##$FTSIZE= 0
##$FT_mod= 4
##$GAMMA= 1
##$GB= 0.15
##$INTBC= 1
##$INTSCL= 1
##$ISEN= 128
##$LB= 0.24
##$LEV0= 0
##$LPBIN= 0
##$MAXI= 10000
##$MC2= 0
##$MEAN= 0
##$ME_mod= 0
##$MI= 1.114404
##$NCOEF= 0
##$NC_proc= 0
##$NLEV= 6
##$NOISF1= 3.799351
##$NOISF2= 2.8
##$NSP= 1
##$NTH_PI= 0
##$NZP= 0
##$OFFSET= 15.70392
##$PC= 1
##$PHC0= -24611.73
##$PHC1= 40.05273
##$PH_mod= 1
##$PKNL= yes
##$PPARMOD= 0
##$PSCAL= 0
##$PSIGN= 0
##$REVERSE= no
##$SF= 200.130013532006
##$SI= 16384
##$SIGF1= 3
##$SIGF2= 2
##$SINO= 400
##$SIOLD= 16384
##$SREGLST= <1H.CDCl3>
##$SSB= 0
##$STSI= 0
##$STSR= 0
##$SW_p= 3612.71676300578
##$SYMM= 0
##$S_DEV= 0
##$TDeff= 0
##$TDoff= 0
##$TI= <>
##$TILT= no
##$TM1= 0
##$TM2= 0
##$TOPLEV= 0
##$USERP1= <user>
##$USERP2= <user>
##$USERP3= <user>
##$USERP4= <user>
##$USERP5= <user>
##$WDW= 1
##$XDIM= 8192
##$YMAX_p= 0
##$YMIN_p= 0
$$ End of Bruker specific parameters
$$ ---------------------------------
##NTUPLES= NMR FID
##VAR_NAME=  TIME,          FID/REAL,        FID/IMAG
##SYMBOL=    X,             R,               I
##VAR_TYPE=  INDEPENDENT,   DEPENDENT,       DEPENDENT
##VAR_FORM=  AFFN,          ASDF,            ASDF
##VAR_DIM=   8192,          8192,            8192
##UNITS=     SECONDS,       ARBITRARY UNITS, ARBITRARY UNITS
##FACTOR=    0.0002768,     1,               1
##FIRST=     0,             0,               0
##LAST=      2.2672688,     0,               0
##MIN=       0,             -58722,          0
##MAX=       2.2672688,     46384,           0
$$ Real data points
##PAGE= N=1
##DATA TABLE= (X++(R..R)), XYDATA
0 0 0 0 0 0 0 0 0 0 0 0 0 0 0 0 0 0 0 0 0 0 0 0 4 -8 8 -8 8 -8 8 -9 14 -16 16 -17 22 -24 25 -30 33 -36 41 -44 49 -56
44 -56 61 -66 74 -82 90 -98 109 -119 132 -145 160 -179 199 -223 249 -282 322 -371 434 -520 638
65 638 -819 1121 -1727 3361 -16169 -45449 7570 21889 882 22672 46384 28006 31613 40491
79 40491 12339 1056 16221 -9697 -40304 -24114 -18292 -40266 -31585 -13041 -17595 -9695 8689
92 8689 3877 6377 26076 21329 7609 18695 20491 5010 5996 9351 -1210 -1846 1568 -12032
106 -12032 -18285 -10258 -18713 -27732 -16429 -11605 -15911 -2312 10009 7022 15722 27204 17822 13634
120 13634 22536 13929 -739 2286 108 -14473 -12923 -6904 -15054 -15149 -5296 -9264 -12904 -2100 728
135 728 -4348 3495 10542 6410 8674 15305 12366 9298 12176 7886 370 -365 -3959 -11341 -11650 -10780
151 -10780 -13833 -12306 -7079 -6364 -3691 2470 4432 5143 8894 9185 6837 8361 8262 4313 3990 3768 -227
168 -227 -2751 -2051 -4568 -7829 -6489 -6955 -8904 -6796 -3531 -3491 -1279 3472 4073 4634 7622 8411 6070
185 6070 5902 5906 2553 25 -238 -2024 -4473 -4653 -4819 -5850 -5364 -3780 -3764 -2999 -850 711 1279 2633
203 2633 4042 4510 4291 4750 4680 3251 2380 1629 -319 -1602 -2824 -3457 -4063 -4202 -4113 -3488 -2913 -1751 -452
222 -452 478 1333 2672 3152 3278 3667 3642 3032 2164 1942 1097 -238 -1227 -1410 -2726 -3251 -2874 -2838 -2986 -1961
242 -1961 -975 -536 119 1449 1425 1484 2609 2903 1998 2236 2353 1181 369 -17 -200 -1645 -1867 -2010 -2392
261 -2392 -2673 -1865 -1571 -1064 -381 515 981 1362 2055 1872 1496 1741 1522 1002 100 407 -241 -836 -1196 -977
281 -977 -1437 -1597 -1152 -1198 -1102 -1056 -127 -120 74 1031 1223 1000 1387 1725 1219 670 719 51 -774 -801 -674 -1043 -1049
304 -1049 -861 -785 -709 -434 14 27 215 382 442 147 314 650 293 18 726 373 -393 217 95 -409 -774
325 -774 -420 -421 -932 -526 -132 -14 -70 492 428 84 644 379 -24 -164 259 -279 -463 -134 176 -282 445 642
347 642 257 133 140 356 -67 -338 62 -214 -240 -38 -70 -513 -282 222 28 -166 170 139 87 -1 586 397 160
370 160 425 507 -317 318 312 -98 -451 -237 -271 -983 -509 -484 -358 -446 -87 385 235 572 888 483 507 706 509
393 509 171 308 310 -357 -254 -190 -611 -1134 -652 -206 -1092 -558 -252 -126 -112 553 845 508 917 1138 882 546
415 546 694 483 -452 -298 -48 -645 -1098 -634 -855 -877 -690 -337 -601 -227 612 656 408 703 1033 1001 830
436 830 901 429 -135 415 76 -465 -950 -631 -925 -1128 -596 -521 -506 -222 246 435 269 542 1144 547 901
457 901 1005 445 49 594 140 -627 -504 -611 -924 -1127 -752 -812 -770 -321 287 -25 172 869 472 663 993
478 993 814 591 627 615 93 -321 -151 -406 -835 -824 -895 -852 -899 -467 42 -281 -61 388 392 455 782 502 584 549
502 549 651 251 51 147 18 -282 -712 -497 -691 -807 -330 -480 -465 -186 -27 -103 162 830 577 530 734 808
524 808 252 41 444 141 -380 -334 -405 -773 -278 -503 -655 -630 -250 -271 -127 -38 146 217 370 588 991 457
546 457 363 627 487 -90 352 -120 -443 -652 -340 -525 -871 -477 -289 -603 -78 528 38 381 769 451 237
567 237 611 497 181 73 373 -164 -197 -264 -343 -768 -460 -636 -793 -305 -204 -92 -6 89 494 478 839 834 823
590 823 533 396 355 245 -215 -310 -407 -557 -595 -516 -498 -967 -369 -356 -313 -15 87 164 270 754 605 409 636
613 636 732 380 15 210 -237 -461 32 -507 -1113 -648 -536 -768 -420 56 39 211 258 533 436 577 469 424
635 424 363 495 -43 -151 -52 -153 -389 -197 -358 -590 -544 -602 -330 -124 -159 99 382 419 593 563 667 667 217
658 217 388 75 -42 181 -170 -506 -425 -90 -548 -161 -256 -291 -239 71 30 232 609 275 434 234 132 207
680 207 336 236 -194 128 -34 -289 -498 -437 -402 -204 -185 -248 -458 -139 -109 -249 315 141 122 135 367 89 -43
703 -43 384 116 98 -164 -148 -92 -381 -7 -204 -215 -371 -278 -163 -92 -125 1 183 265 431 434 325 388 115 236
727 236 238 348 -4 -181 -172 -182 -281 -33 -130 -295 -362 132 -46 -292 150 353 232 80 498 245 236 267 198 148 -68
752 -68 -97 -257 -193 -363 -364 -471 -285 -253 -316 -274 3 -168 300 144 286 218 386 565 267 499 224 70 33 -164
776 -164 -160 -127 -394 -557 -559 -334 -347 -222 5 -139 179 335 210 545 761 396 222 310 275 -132 -48 135 -189
799 -189 -413 -448 -292 -463 -603 -174 -346 -125 125 198 118 454 405 651 244 325 84 338 161 -64 -170 -246
821 -246 -374 -294 -352 -208 -615 -220 -173 -123 -103 95 394 221 438 159 489 150 311 170 76 -189 -169 -125 -145
844 -145 -514 -570 -338 -272 -209 -250 -203 -38 64 495 274 362 467 487 216 349 57 41 -55 125 -120 -76 -58 -256
868 -256 -458 -286 -45 -176 -74 -54 161 -24 115 311 355 154 314 339 192 581 162 192 -287 -250 -139 -543
890 -543 -452 -364 -286 -215 -5 124 -28 202 484 159 123 522 210 235 444 248 109 235 21 -5 -435 -330 -256
913 -256 -356 -373 -361 -245 -325 -170 185 258 387 316 256 41 262 451 446 272 445 -93 -27 -92 -369 -244 -332 -400
937 -400 -345 -220 -199 -65 185 72 97 198 339 172 166 132 377 261 -58 31 -151 -159 -390 -298 -261 -262 -57 -221 -273
962 -273 174 66 217 237 76 473 292 450 273 167 382 62 -61 -291 79 -394 -483 -289 -338 -363 -370 -518
984 -518 43 46 150 92 400 342 245 469 169 153 252 185 -15 -265 -120 -184 -33 -248 -122 -144 -421 -39 -37 -92 108
1009 108 -7 90 107 165 320 247 291 160 71 87 -93 -127 -135 -221 -305 -485 -264 -171 -143 -153 76 448 -58 170 162 277
1035 277 348 423 356 334 292 120 -123 -11 -87 -406 -177 -193 -478 -347 -217 76 -258 137 79 241 276 -47 330
1058 330 230 32 175 177 128 8 -175 61 -387 -74 -237 -6 -133 -342 -241 -277 -223 -51 64 286 303 112
1080 112 141 196 24 3 9 11 -31 91 -96 -398 -295 -178 -110 -189 63 -224 -248 -13 30 91 234 303 200 268 337
1105 337 320 43 -111 -5 134 -52 -247 -175 -359 -476 -338 -283 -40 -41 -193 33 333 200 380 319 161 253
1127 253 119 142 185 28 184 -125 -407 29 -333 -423 -4 -133 -135 68 -338 -218 -50 80 394 139 87 204
1149 204 169 128 354 191 105 -240 -191 -231 -296 -535 -336 -267 -103 -159 -106 94 117 371 -6 74 101 295 386 370 51
1174 51 -6 98 -141 -268 -21 -218 -246 -441 -385 -31 -259 51 -8 362 287 39 318 233 287 247 47 -24 -5 -266
1198 -266 -214 -24 -246 -325 -310 -148 -93 -254 -330 -162 47 9 158 40 243 -75 307 167 47 297 142 -143
1220 -143 171 215 -211 -378 -137 -110 -79 -166 -234 -38 -19 18 72 272 165 200 227 162 1 412 92 -100 -149 -35
1244 -35 -25 -253 -199 64 -251 -121 -147 -64 -275 -56 -251 73 218 319 358 318 252 94 -195 -43 -397 20 3
1267 3 -229 -27 -263 -29 -155 -135 101 -114 -73 45 -147 -150 95 108 -22 179 35 26 93 -58 127 -174 -145 -302
1291 -302 0 -46 -27 -282 -41 -48 99 -50 -235 126 -94 303 16 20 234 7 135 148 43 -164 -111 -208 -119
1314 -119 -219 -201 -245 -110 -219 -47 148 239 337 263 194 288 107 -73 283 11 84 -39 -119 39 -164 -135 -200 -141
1338 -141 25 -68 -370 -19 91 247 45 -62 236 215 100 279 155 61 -121 1 106 -133 129 -362 -167
1359 -167 -2 -413 -249 -113 -180 -27 20 28 353 310 231 322 47 -115 77 -152 102 63 -4 -215 -22 -361 -160
1382 -160 -40 -320 -14 90 -19 -4 155 -92 4 242 330 83 -19 87 -111 -89 204 -205 -67 -7 -47 -46 -178
1405 -178 -441 152 16 39 59 28 86 155 309 262 138 108 60 86 -27 43 117 -11 19 -76 90 -160 -95 -181 -189 -164
1431 -164 -151 155 33 89 -93 255 225 342 116 228 302 105 8 18 46 -186 7 -72 -241 -235 55 -135 69
1454 69 -110 -41 280 185 47 24 -28 101 6 149 14 -84 -39 118 -221 71 -213 40 23 35 -38 -193 -151 80
1478 80 76 175 92 239 -20 115 -35 202 265 -26 59 -89 -185 -135 -278 -211 -225 -389 54 72 51 -2 113 52 7
1503 7 124 73 118 131 254 500 263 33 -91 -111 -194 -90 -103 -219 -297 -114 -28 -56 124 6 77 120 202 344 111
1528 111 215 -22 4 81 -26 -74 24 -205 60 30 -256 -172 -92 -6 -44 7 126 -4 107 294 -35 -148 84
1551 84 132 18 -139 -248 26 246 69 -135 11 -163 78 -1 -11 -39 144 -85 -76 -104 132 94 122 277 -125
1574 -125 -46 -92 -33 -255 -120 34 -89 -214 -365 -89 -239 -91 -45 210 -113 -82 -4 -126 272 -208 200 -6
1596 -6 145 -17 49 93 -180 122 -127 -105 -289 -63 55 58 -14 42 -106 329 -226 -13 259 331 221 90 57 163
1620 163 92 86 -25 -117 -132 -46 -78 -103 -134 -76 5 -371 -61 -107 -78 -53 120 -221 317 117 29 215 -118 38 113
1645 113 80 -103 -22 -145 -244 8 -26 -180 -230 -26 -113 29 -183 200 157 37 238 182 -115 39 79 147 108 15
1669 15 41 70 -343 89 -196 -327 42 -351 72 77 174 10 34 212 201 139 319 -121 70 244 64 -57 32
1692 32 40 -162 -135 -280 -162 -150 72 42 -139 90 207 -55 144 211 257 337 -6 -234 70 -1 109 43 -230 -232
1716 -232 27 -103 -320 -17 -140 -18 -24 36 -131 69 105 -6 194 -19 74 121 160 -264 -287 20 205 -89 160
1739 160 -136 133 11 -265 -114 14 136 -102 222 97 -137 166 -174 -80 23 -87 133 32 -49 181 -194
1760 -194 19 110 17 -103 44 -80 -137 -17 300 225 218 74 107 165 15 -89 62 201 7 98 -159 -185 26
1783 26 -177 -333 -128 -33 -103 -21 14 179 -29 173 57 -234 52 132 -117 183 210 -121 174 -60 155 -81
1805 -81 -40 -368 -411 -10 -65 -129 -259 -283 71 214 -4 28 144 121 36 259 86 99 -52 -7 -18 -27 61 -65 20
1830 20 -82 142 -110 -207 -100 244 12 60 107 125 -39 189 26 -165 51 -206 -100 -67 1 251 -73 2 34
1853 34 58 -175 109 -28 -102 25 0 164 156 -82 -79 -161 110 56 13 -66 94 -179 184 -155 -21 -130 -114 -152 -221
1878 -221 -185 82 -112 16 30 100 -44 -64 6 207 151 32 -45 -150 -194 -202 47 -232 17 -90 -87 292 -16 109
1902 109 -2 109 146 21 185 -166 58 -108 488 51 29 -206 -13 89 209 -109 -185 -84 -156 165 35
1923 35 222 12 -52 -83 138 -166 -12 232 35 99 -101 -26 -277 -199 -193 -301 -164 -117 -51 18 -398 266 66 -51
1947 -51 105 -34 -149 96 48 53 -134 -149 -51 -33 -61 -99 15 -23 -86 18 -91 -161 82 146 103 -293 151 21 273
1972 273 -112 103 120 196 75 -75 -114 -259 -16 -162 -83 106 -17 -185 -214 183 -221 25 -2 336 64 6
1994 6 200 185 86 222 218 -318 73 -79 195 -70 98 -174 11 40 -78 -212 113 177 13 53 13 48 75 -63
2018 -63 -97 -60 49 -17 -30 164 59 -99 -66 62 -239 -269 -160 4 -94 25 -6 -92 -53 99 199 -68 -57 95
2042 95 -48 -3 -187 -39 -26 100 -42 -354 27 -210 -227 -286 -34 -67 -227 151 -82 21 234 -93 271 291
2064 291 -54 -28 -4 -151 229 24 85 39 -151 159 -193 221 -118 -246 -229 -60 19 -84 266 267 263 -86 43
2087 43 -260 -18 234 -266 120 72 -189 50 67 57 122 -89 -33 -135 164 131 -38 -58 271 -76 55 83 165
2110 165 65 134 21 -28 -114 -69 6 -149 -208 -192 7 -44 217 -53 168 -65 -96 -66 48 122 92 101 359 -22 -156
2135 -156 10 -131 -222 137 119 -380 -16 -31 -34 216 15 -135 79 46 334 473 98 6 264 89 -46 -204
2157 -204 -11 -247 -257 -17 14 -124 -9 63 -68 -220 -36 73 289 -47 -18 61 253 131 -45 85 -73 -41
2179 -41 -7 14 -160 -36 118 28 -111 -239 189 89 88 60 -135 -324 72 320 -34 201 76 -113 -72 70 -20
2202 -20 3 172 -10 -86 -288 -58 -140 -50 -161 -154 152 -17 120 80 235 36 122 260 179 -73 30 -89 -71 78
2226 78 -89 -166 -85 -1 108 -192 253 35 56 -13 -50 83 -57 9 -167 105 -111 -42 270 -44 50 -130 162
2249 162 169 -200 30 -40 121 -32 49 -228 2 -199 -86 -95 348 103 155 -14 -395 24 119 143 372 45 -8
2272 -8 162 -160 -49 -86 222 -137 -90 -96 116 -15 9 362 223 323 39 -21 113 -42 -89 254 4 27 -40 -74
2296 -74 328 136 -8 -37 15 -168 45 18 30 66 70 -55 -61 -332 216 -181 -23 -251 107 -123 -139 -58 -425 -58
2320 -58 -265 -268 -186 117 -29 157 -23 -219 -128 -156 146 -36 -200 -22 -109 42 -147 -104 -41 1 -134 -120 -137 -148
2344 -148 77 -54 63 29 251 -194 -106 -157 93 11 248 181 -239 103 -126 -51 -113 -49 3 -236 54 65 -5 -105
2368 -105 232 194 44 -80 41 46 84 85 236 9 -60 71 162 184 186 87 58 37 2 -48 -116 270 5 -64 118 -22
2394 -22 -137 -30 2 44 -37 -17 -86 29 -18 -10 17 20 -42 -92 -152 -135 -138 -269 -105 244 -123 -213 128 -200 39 26 165
2421 165 6 -2 166 114 45 84 -30 -332 -9 -49 105 -83 129 77 -36 -166 88 51 60 -239 227 218 305 39
2445 39 -5 60 -148 43 -60 -14 -224 111 -13 26 -119 -94 97 -20 -54 126 5 -178 358 -53 -71 -99 87
2468 87 -215 0 17 -59 -75 -87 -22 -29 -64 -206 -13 44 -193 80 38 245 -135 -98 66 16 250 128 68 73 -45
2493 -45 -198 -133 -98 41 -201 -31 -74 -59 -4 111 83 -41 -89 181 -74 25 -37 108 417 -147 -115 218 96 -37
2517 -37 85 -72 47 -171 168 -195 -4 -110 -167 -157 -250 95 254 141 -51 15 -90 8 43 184 -135 58
2539 58 198 61 243 -6 -146 -147 67 21 -169 15 332 -195 171 27 -177 277 61 241 259 -207 -68 195
2561 195 132 15 -131 -4 -161 181 -20 87 370 133 218 -92 142 70 -169 -47 -141 97 239 9 309
2582 309 -115 -4 77 26 -48 83 -158 -17 -154 217 144 156 -2 -231 67 21 85 -49 84 -322 -16 -204
2604 -204 140 -135 21 83 257 -169 130 -67 170 68 -128 1 -214 78 85 74 38 171 155 -53 85 133
2626 133 65 110 144 -18 132 -41 -27 -38 -50 -106 268 7 3 32 119 218 -28 211 104 -101 38 45 8 127 58
2651 58 154 74 -90 151 26 351 -23 -37 12 -65 -198 -188 345 -238 -90 47 53 -170 33 168 12 -49 1 -9
2675 -9 -63 -11 -57 -203 -30 -35 -12 193 -77 207 -124 114 -27 -109 -273 196 9 8 231 -67 162 -112 6 190
2699 190 -39 -112 284 -109 13 43 -27 85 -124 191 159 126 175 -58 68 68 -19 -46 -127 -45 105 133 -72 17 -84
2724 -84 -325 -174 212 -194 214 133 -19 -245 54 -104 -45 118 322 -77 -115 36 -44 -66 -114 -200 -103 -40 61
2747 61 55 156 131 -15 280 136 57 98 -51 -49 125 -32 -98 219 -89 103 1 41 169 -51 131 112 106 33 -22
2772 -22 -180 -51 13 214 -31 122 -108 36 186 62 -50 71 203 -5 -120 -45 -202 87 159 -171 156
2793 156 -147 216 -239 -88 28 21 -9 158 65 -9 48 206 126 -257 24 23 178 -97 -115 -217 -81 -89 115 -302
2817 -302 -50 15 125 -16 -45 -99 -108 -137 134 33 199 123 12 -152 6 -103 -288 -53 -78 146 -14 -68 192
2840 192 84 -154 127 87 40 118 14 13 3 125 6 -42 -186 -75 67 114 -118 136 177 -137 271 168 -39
2863 -39 60 67 -40 -187 -128 77 -212 100 -166 82 14 59 -155 3 -167 -201 -62 151 -327 12 48 116 -17
2886 -17 57 -174 147 -88 -54 -44 -57 32 -1 10 5 -163 161 118 -251 -37 -199 200 -146 128 -25 12 229 -43
2910 -43 -113 60 -162 42 -109 15 -28 -129 130 -97 -99 -9 -244 141 -182 142 146 -120 -133 -126 36 -92 201 12
2934 12 -48 17 208 -147 162 -138 124 -86 -236 -233 37 -49 -43 12 -125 -54 -293 16 61 -83 -171 192 -14 191
2958 191 -41 -261 122 -148 103 -171 -214 225 -417 -115 -46 40 -213 -116 34 -20 197 -142 -89 -69 -82 -120 42
2981 42 -49 -226 -221 -115 -247 -116 -230 83 240 -155 33 -69 -76 111 -40 -22 -125 -146 126 194 197 -50 105 66
3005 66 248 -135 -14 77 314 47 -96 -61 1 74 -306 -30 201 73 15 168 96 109 211 172 -191 -159 138
3028 138 -110 -167 7 -37 -47 -137 -260 -89 77 -33 -213 -142 -197 -51 318 170 281 -217 -80 -25 -1 -89 -87 26
3052 26 -36 -38 166 -48 221 128 33 -115 -51 -49 -180 227 252 -75 -24 12 132 -223 86 88 260 8 -129 19 -7
3077 -7 -449 -113 52 -152 -43 -226 103 -101 16 -218 94 -7 -36 -99 55 109 -122 115 66 -7 -43 54 -194
3100 -194 -101 -251 98 116 -146 61 35 253 157 139 221 201 41 115 -105 29 -76 142 4 127 231 -115 163
3123 163 -247 -188 34 58 18 -20 -366 52 -87 -71 239 195 -74 -159 94 54 -224 222 37 55 -54 -212 -154
3146 -154 -140 -142 -33 -138 51 13 -16 -99 -393 174 210 -9 -30 183 -32 114 -230 -306 131 88 -176 -276 -241 -361
3170 -361 27 0 -130 -17 4 -26 -120 -21 265 101 87 -107 278 -44 -177 -18 79 -198 -24 -58 86 54 -200
3193 -200 -455 90 166 155 309 -107 75 -210 -78 -39 177 191 -168 195 120 149 -97 -39 -161 -67 -276 33 56
3216 56 -53 -212 58 -48 -309 163 -153 -33 -190 -126 229 160 150 19 97 125 -158 91 -114 -202 -59 -223
3238 -223 -35 85 -110 13 -115 152 -191 180 -220 104 157 208 -188 -129 -196 188 167 -129 25 -100 71 1
3260 1 57 115 1 72 112 -417 -26 117 25 135 114 10 -51 43 101 -241 172 -55 104 -196 -31 -105 10 160
3284 160 18 38 -56 -142 109 53 181 116 120 115 -33 37 126 43 -83 -17 45 12 15 -84 -353 85 184 47 56 40 24 -76
3312 -76 -79 -78 55 -88 158 -142 -8 38 82 -66 -140 93 135 92 -237 104 -164 -165 -91 79 41 -167 -85 92 -146
3337 -146 -87 -231 -228 135 58 -12 -57 47 45 106 -49 -74 160 -23 -178 150 44 -264 148 -271 240 -333 -55
3360 -55 -123 -111 72 67 271 -49 -147 -58 -51 -53 24 111 -88 -129 128 30 -35 16 74 -75 -108 191 -37 -157 -63 -111 -17
3387 -17 9 -267 -102 -39 64 87 198 29 -139 43 44 4 70 -121 -36 -36 35 66 209 175 -66 5 -191 3 -157
3412 -157 209 46 13 272 -43 -61 85 -118 -62 -181 -8 -75 -205 0 -165 55 257 -100 72 11 75 -27
3434 -27 7 -138 -312 -66 5 -13 93 -289 107 -272 -116 79 -321 -15 157 222 87 254 38 47 132 -140 -98
3457 -98 147 148 34 65 376 58 -81 14 226 -92 -140 18 -26 105 12 -8 -16 27 -30 -100 112 -93 146 164 -189
3482 -189 -6 152 -105 0 -115 70 -91 -187 1 47 126 -41 -48 -279 55 75 -244 -113 -61 26 -95 89 22
3505 22 -55 192 -312 -99 -124 72 164 45 170 102 45 147 53 -62 65 -68 89 116 -175 12 8 -76 -1 101
3529 101 -147 90 -41 -84 292 -100 -158 -126 45 -184 112 11 -172 133 143 253 -88 -178 9 -5 -198 16
3551 16 -1 75 -153 48 58 -88 -242 46 208 43 -29 88 -27 -200 258 -80 -86 11 -34 -292 21 -238 -74
3574 -74 -41 -38 219 -71 -128 71 64 -17 175 -50 22 -194 212 36 -87 -40 -58 77 -112 -97 -22 -69 -101 -4 -50 -247
3600 -247 112 153 -121 148 86 -91 80 -309 -35 16 63 62 37 46 -111 -166 -72 161 -176 116 212 56 59 10 -50
3625 -50 -21 20 -190 -20 73 -40 79 -54 207 90 79 -35 140 -308 46 -115 -68 9 -46 -23 -19 9 -140 67
3649 67 199 184 179 -25 -72 -122 -9 192 237 -134 -222 84 -79 108 -15 -169 -213 55 19 123 -67 -103 -51 10
3673 10 69 -294 -55 73 -7 -12 295 46 60 -88 -1 -188 -140 -365 -43 -79 -86 -51 -139 191 -4 -84 123 -108 29
3698 29 -44 152 -147 72 -142 -1 33 130 -137 154 -11 -181 24 -39 219 87 -78 -33 39 226 3 -191
3720 -191 126 103 -44 -109 123 151 -30 345 -137 -99 -47 -174 18 16 71 -29 227 317 -48 129 -191 99 170
3743 170 -58 -97 88 -35 -158 -113 -218 115 108 -56 -159 69 2 -203 85 21 -296 -98 -144 46 102 -114 117
3766 117 66 -88 -240 -13 23 1 31 17 337 206 -40 93 13 -77 34 143 -50 170 -49 214 89 133 -114
3789 -114 111 59 129 -77 -5 50 -93 33 -113 -105 115 124 63 -29 -18 -16 36 39 92 184 205 123 -141 196 129 -65 83
3816 83 -83 75 269 277 133 475 2 138 95 -176 178 113 -288 56 42 -92 -2 -107 8 71 -126 201 78
3839 78 147 155 83 -97 83 -158 17 -129 -181 27 -179 -9 -11 -134 88 94 156 -158 -475 -46 -187 -139 -120 -1
3863 -1 -149 -226 133 37 96 -14 -23 -9 38 -222 -159 -23 133 160 80 -66 -18 -126 -13 226 -19 -5 133 -156 184
3888 184 69 138 120 45 -183 -259 90 -53 76 188 212 -108 -109 -22 46 -99 113 -150 50 -136 -264 38 -70
3911 -70 136 77 131 62 -49 -44 -213 14 127 -62 -96 -2 -60 148 -391 40 36 -65 34 -235 -51 -159 -170 -140 -85
3936 -85 -47 -268 128 6 -200 -193 216 -270 144 -63 -16 1 -103 -76 147 -179 25 68 -190 -100 -50 -303 -17
3959 -17 -180 40 65 1 27 117 75 -174 148 41 -39 -252 -38 81 258 -13 94 -83 -38 213 317 -64 -148
3982 -148 -58 194 321 164 -84 -182 -111 23 -121 93 28 215 -138 196 75 157 3 -218 -58 76 -24 -58
4004 -58 179 99 -27 -17 7 23 2 103 -144 -33 -36 -61 23 297 179 26 3 7 37 -158 53 -102 -19 -154 6
4029 6 -48 -38 1 -129 73 -22 -63 44 -49 -63 -25 -14 168 -205 -86 86 -62 110 -36 -159 -19 127 -15 -1
4053 -1 -52 -39 116 67 -83 37 80 -51 -122 27 -77 -223 60 29 -71 -185 -44 145 6 -312 -94 9 178
4076 178 -302 -127 149 -3 150 164 165 9 -241 83 85 122 -86 -226 -61 -23 -1 -94 -58 114 -137 -23 -99 144
4100 144 -247 236 -3 -89 -103 -72 -105 140 -116 -9 3 -74 5 -24 491 -149 40 37 160 1 151 189 -176 -269
4124 -269 -70 136 108 199 -41 -142 44 -48 -68 -128 -38 59 -91 -53 99 -64 165 -56 97 -184 36 175 -175
4147 -175 52 43 220 29 151 116 125 -57 312 -90 -71 187 -109 6 -71 5 175 -56 321 37 92 -154 16
4170 16 -98 -69 -78 80 56 -126 -142 -262 -96 -94 61 -86 -37 -34 172 -28 -44 -121 14 241 164 62 -68 -141 11
4195 11 41 149 190 55 126 -73 88 -88 -41 -288 7 -15 -66 191 -146 141 14 -130 -137 109 -158 -69 -180
4218 -180 118 -87 145 107 -75 75 140 179 -103 -65 -84 144 36 -60 141 144 -65 -96 -74 6 -310 224 -8 41
4242 41 -180 -150 -59 93 141 144 38 123 -124 -128 -113 -236 183 34 -2 -126 206 -128 -281 -247 234 -117 -129 80
4266 80 -18 -16 -131 -75 58 -91 -227 -43 9 295 72 29 -100 -51 221 -28 -66 105 210 71 57 36 -89 46
4290 46 185 28 104 -203 8 204 -62 79 157 108 -9 116 10 19 181 8 -202 -27 4 255 -3 -306
4312 -306 100 -106 3 -75 14 -127 63 254 57 -78 45 46 -160 -236 11 -198 -119 -163 -180 154 25 -127 -24
4335 -24 -137 48 -25 -154 114 -58 -49 -48 -145 -45 8 -114 -21 190 -124 -83 -14 -75 121 196 142 115 31 -214 -90
4360 -90 -174 31 179 -222 -36 -120 28 237 111 9 -22 164 77 -86 101 72 324 171 10 73 176 -26
4382 -26 -32 -324 -147 148 73 -241 -75 54 -52 60 -24 -10 -135 -54 122 59 77 222 -297 23 -118 164 -309
4405 -309 147 104 -165 -228 74 107 139 -60 -29 -43 -118 29 -86 -216 -60 -217 63 66 97 77 157 20 -78 22
4429 22 -79 -16 -165 3 -131 102 -15 106 -392 -154 -271 -157 -1 49 -290 -145 102 -154 58 290 98
4450 98 -234 -182 -154 -41 -172 -3 -237 55 -47 34 58 213 75 -68 -8 -17 -57 -26 -104 66 -221 189 24 -224
4474 -224 -164 -190 -25 -182 -26 -195 -113 90 -12 -83 67 63 -256 -181 -326 -65 -128 -61 11 -48 -119 -161 -68 44 168
4499 168 25 180 -107 182 8 -101 -128 -47 -28 -179 -212 36 91 -53 -12 110 -80 -85 204 54 116 150 -59
4522 -59 -148 -123 -18 -86 -177 -77 -67 352 141 -238 -67 -37 48 24 28 114 2 44 -165 111 -107 92 52 -136 15
4547 15 -110 -137 -184 -37 163 81 121 -13 68 -21 -24 -234 -32 -46 -91 288 -263 -185 -163 -99 93 13 -50 86 153 143
4573 143 -105 271 170 -46 -53 115 158 -46 106 236 -58 -143 157 55 -105 8 -144 -138 -146 -100 14 -6 158
4596 158 185 126 -286 -151 -154 -65 230 107 42 79 330 -155 2 53 174 42 -96 -108 -71 -378 -119 67 -42
4619 -42 -59 120 312 204 196 -163 46 -33 62 -342 31 -63 73 140 86 -226 276 -40 13 267 -34 12 -105 -30
4643 -30 52 179 71 162 -44 34 -119 134 133 -87 74 244 -46 -114 -37 525 92 -75 89 143 46 -79 -166 -192
4667 -192 -52 -105 81 184 159 -33 -19 -29 148 -75 17 6 121 -186 -372 58 53 157 -14 -201 133 -28 134
4690 134 43 136 -5 122 107 -15 123 14 229 80 -117 107 36 -186 175 185 119 -191 -38 25 187 -35
4712 -35 -111 23 -299 18 1 46 105 194 -65 117 -36 -43 -97 -162 31 -93 -265 -188 -84 57 -231 257 -70 163
4736 163 211 -126 50 87 -76 39 112 143 11 -67 -176 58 34 -10 87 42 92 242 286 8 -248 218 130 288
4760 288 -104 -68 -168 9 -35 -177 -198 -52 16 -24 -137 23 -174 9 -171 28 -30 24 -154 -199 -30 -168 -159
4783 -159 -122 -16 97 -70 -186 38 128 -222 87 215 154 258 3 -122 144 -154 -92 -196 -124 -290 -123 209
4805 209 185 -8 1 67 -137 57 123 -176 -131 204 -172 44 -15 163 -163 40 287 175 -134 -142 131 13 21 -15
4829 -15 -116 126 85 90 -60 157 -190 45 166 -93 26 -103 11 8 -161 97 -194 -105 102 36 -65 99 95
4852 95 65 -227 -130 37 180 49 -278 172 -74 -16 104 -106 -276 67 -111 -187 141 -49 -49 -105 141 -124 -153
4875 -153 -136 180 -219 -44 -112 -190 248 -36 -126 5 229 -62 -164 124 -433 -146 58 75 83 -141 -8 10 -149
4898 -149 7 26 -118 27 -226 -181 -96 16 -147 -43 229 -29 216 -71 31 224 79 -37 -101 -119 -153 125
4920 125 -142 -95 253 -26 -219 -99 -85 -114 -194 -89 -149 96 16 -231 -42 -142 29 -9 84 -217 15 -87 -45
4943 -45 9 71 106 -122 4 53 -34 17 -220 -159 166 -200 -3 -167 -12 190 -297 -99 251 205 133 166 -10 -193
4967 -193 -228 120 167 -204 229 86 2 -213 169 -161 23 -151 91 -112 -48 -108 250 129 14 -56 -23 91
4989 91 -35 32 3 -207 -54 -30 38 -23 -153 -190 60 212 -163 68 95 48 49 186 274 58 116 43 -51 18 -180
5014 -180 114 -93 247 109 33 60 -55 32 -97 -214 -47 -23 32 -7 -131 -312 -57 -221 19 -130 58 16
5036 16 -52 -14 144 76 121 -49 132 -223 -174 -7 140 58 -130 152 -191 234 19 22 -89 41 -176 -37 48
5059 48 87 81 -63 15 -211 -103 -98 168 76 -123 61 -184 -120 -108 2 -138 -157 197 -55 -114 -12 108 -125 147
5083 147 -146 181 -11 37 -104 -131 48 -298 33 -20 0 -206 -368 -39 -283 -54 81 21 -64 28 -114 186
5105 186 -65 -24 -45 -96 122 39 -164 106 62 60 65 24 136 -24 -47 72 79 -27 240 47 -60 -179 47 35 160
5130 160 -151 -109 14 -24 -66 8 149 -20 -45 -139 -241 -9 -120 196 82 86 -111 173 -216 208 -87 97 -81
5153 -81 97 -209 -42 113 -191 125 158 -59 -95 3 -59 174 89 97 75 27 -35 259 73 147 -103 48 144 -138
5177 -138 -63 36 92 88 -14 -10 -190 -165 46 -14 -46 81 -126 182 -65 89 -290 143 -151 199 23 89 61 -19
5201 -19 113 18 10 4 104 276 161 109 222 -1 -129 55 48 -194 -17 97 15 142 -67 -51 -3 -49 -188 -53
5225 -53 -1 -116 -27 -47 -94 -172 -25 94 141 287 21 46 -108 55 11 116 107 -264 7 127 -48 56 -206 140
5249 140 -307 0 26 -5 24 111 15 -172 -109 -63 -28 -18 -64 109 -13 -25 157 -200 53 120 174 -80 -56 -20 38
5274 38 -23 -27 -74 -134 -80 -19 189 -46 213 42 -9 -10 -181 34 -96 19 -24 -72 226 -172 -48 -75 -12 36 86 33
5300 33 -275 96 14 -20 51 -159 130 83 -23 4 239 44 -215 -33 57 66 70 -60 222 -68 -9 114 120 -23 23
5325 23 224 -85 -52 163 -95 -326 -23 69 122 -45 -104 -208 -225 -260 25 -130 -102 -64 -27 -133 124 120 -111 105
5349 105 -135 -193 125 -21 -50 228 68 115 -144 93 -220 -36 70 -113 6 -73 -36 30 23 106 139 -14 -31 55
5373 55 -67 -94 -77 201 172 -36 -149 204 83 -212 146 15 81 242 -7 83 -235 -116 133 -100 133 18
5395 18 117 -84 -56 175 62 245 15 -81 225 -160 -7 257 -173 -286 34 -135 197 -132 39 -6 -188 270
5417 270 -142 81 -105 288 -52 -221 22 -41 -41 -127 176 182 -180 180 209 -238 109 -10 -28 101 32 -85 -90 -236
5441 -236 163 180 -27 -161 60 -147 19 -86 -118 -181 -62 -129 -26 117 270 -228 12 -132 34 -199 130
5462 130 -215 -69 147 28 224 -199 -140 -85 164 -97 -4 1 -78 34 178 29 7 -239 -18 -83 94 203 179
5485 179 75 124 369 49 -154 -3 40 -93 -6 -55 37 -12 178 87 -51 -113 185 -17 -55 21 -217 -299 -76 -237
5509 -237 -123 -12 102 165 220 -80 -237 -119 5 220 148 14 53 86 224 -41 -114 102 -212 -52 -106 15
5531 15 202 161 -133 -154 -178 86 117 -21 162 -113 218 -12 49 -154 42 119 87 -104 -46 -151 -146 -37 -63 -99
5555 -99 39 33 -92 174 151 6 59 195 -142 48 111 -118 54 -95 -35 -38 -28 80 -251 208 -58 0 90 -281
5579 -281 -72 164 -38 35 238 182 -86 250 134 28 -128 -14 73 33 2 19 71 149 -159 -204 187 -122 -75
5602 -75 -101 66 125 -166 65 177 -4 8 -70 182 63 -232 287 55 -108 127 125 63 92 2 70 13 68 -34
5626 -34 -44 -129 -56 -26 -9 -69 -108 115 -27 -91 52 29 109 -173 133 -28 -177 -188 -205 -102 29 -88 -45 27 -139
5651 -139 -146 -206 262 -42 -190 124 -145 -29 73 -7 -21 -18 -100 52 120 -189 -188 -291 -1 45 -83 16 -24 -84 -27
5676 -27 17 -18 53 -283 154 85 -200 -120 26 -99 85 49 -11 -60 62 -12 -23 117 67 -61 -50 -72 -172 195 17
5701 17 145 173 202 -28 6 -42 -103 82 -259 246 245 -250 227 212 -8 7 137 32 -223 -5 -56 43 19 178
5725 178 11 122 -175 21 -22 -26 -31 24 143 167 329 -13 56 2 -56 -6 -97 -51 67 109 -81 -71 -8 -240 101
5750 101 -28 -163 -28 158 -125 -24 0 -51 -39 70 -62 -102 -75 -79 -178 84 -45 34 -137 -30 28 -135 126
5773 126 -154 179 54 139 -8 -217 215 175 -42 -60 40 -26 72 -175 -215 164 72 -45 93 -104 141 56 71
5796 71 -113 238 -203 222 -136 -13 28 -144 1 -14 -19 -131 -53 79 -100 95 -106 -168 125 261 73 145 -69
5819 -69 -377 169 -84 139 101 -87 84 -35 -128 -205 -42 324 143 100 -21 -80 21 -323 225 -55 -80 -71 100
5842 100 21 151 35 15 179 -217 -103 -1 -64 -84 25 -149 85 -71 -26 92 -70 7 140 146 -144 -59 191
5865 191 128 -83 22 163 -53 -124 -29 -45 -38 143 113 -50 -253 -108 -131 -211 -228 203 -88 -56 151 91 -335 51
5889 51 -84 -104 21 -66 69 -166 -173 73 -179 -79 214 -13 19 -64 0 34 174 112 -109 107 -46 -67 -168 153
5913 153 187 -10 -192 -78 20 -30 -41 -44 4 -44 64 106 170 251 222 -45 -29 -140 -263 249 31 -220 -194 -210 -36
5938 -36 -157 122 -84 84 -1 -63 -115 74 338 -135 -97 32 -63 131 -208 290 -86 -37 -188 -75 231 -49
5960 -49 121 -88 -28 -203 -119 -129 -104 118 293 -42 -38 117 93 -59 -229 -195 61 38 -134 88 -23 -57 -90 113
5984 113 -166 203 39 62 -19 -105 -50 -115 0 -225 50 20 20 -290 -349 -183 207 -21 -241 -55 -197 -107 -3
6007 -3 -9 -140 -111 72 -76 15 34 -19 -60 58 -174 -3 -97 -103 191 -22 -188 -77 -38 125 -5 157 185 -8 75
6032 75 37 -35 -154 157 14 139 156 -7 -90 119 103 25 -35 14 -13 55 -145 -127 -9 -71 -97 117 86 -214 0
6057 0 -98 57 34 14 283 -100 17 -127 -82 63 274 -65 354 -269 -75 -140 -94 -87 156 113 -38 134 161 -46
6081 -46 14 219 -146 -89 111 2 129 67 67 -255 -179 -63 19 -102 74 -41 -91 77 206 149 26 257 378
6104 378 0 71 -42 179 -267 -98 0 31 225 -43 -145 -154 -95 156 121 163 -16 -67 -126 -45 -5 22 -158 78
6128 78 -10 -90 77 -42 222 110 7 145 -41 193 -66 152 157 11 130 -17 -309 -25 93 -61 347 131
6150 131 82 96 -97 -121 323 -67 -128 151 -368 64 -172 237 1 124 -139 -154 -33 -191 266 -24 -88 -29
6172 -29 21 -8 94 269 130 -187 -291 -140 -24 24 -72 -118 -34 259 65 163 33 -7 -142 -14 -37 61 68 52 100
6197 100 164 130 230 120 226 -121 -127 -186 -43 -48 -4 -158 -36 -163 -6 -60 263 263 -7 -6 -2 100 -57 -35 -15 -148
6223 -148 186 -127 -77 -29 -267 -122 -155 368 96 10 14 -99 38 19 191 88 154 104 57 97 43 33 -34 -19 14
6248 14 -55 153 85 -123 -57 228 -104 65 -176 -90 59 160 131 -126 -88 -29 -84 10 -133 -47 -111 -8 -34 -68 -157
6273 -157 34 162 53 184 -204 70 -48 157 -142 213 258 -91 30 -130 -177 14 -73 33 -189 124 66
6294 66 -11 -93 11 -2 17 -35 -39 266 -87 -168 48 96 -76 -131 148 102 -4 63 259 -78 264 -36 -145 -41
6318 -41 8 -8 150 -82 -25 -23 345 91 63 4 -26 -272 106 67 172 109 -1 -31 99 -3 -105 257 141 213
6342 213 -89 -49 99 28 -152 -8 36 130 -186 -129 -174 -108 -134 23 124 -130 -323 -77 162 -206 -29 -37 298
6365 298 148 -47 -2 -187 -46 -67 -83 256 20 -3 6 -77 102 133 -115 -48 -53 -126 -12 167 34 120 -18 -131
6389 -131 -177 28 46 -52 144 108 -80 -81 -141 -4 207 -7 -59 144 16 90 -89 252 -79 -25 131 58 78 -161
6413 -161 171 -13 202 -6 77 -84 267 112 -269 245 131 2 264 -117 -68 -2 67 104 8 -311 -83 -144
6435 -144 -16 -156 -117 100 -123 -19 5 15 9 57 -131 -225 157 -98 -26 78 30 168 -48 -90 -40 1 38 179
6459 179 -158 -17 -148 -59 -21 -160 42 -26 -24 -151 0 355 -64 11 185 -63 40 226 -4 265 -128 119
6481 119 -27 37 -252 -23 -143 -15 96 152 107 49 183 74 -20 103 -350 -153 -49 134 18 21 245 367
6503 367 -124 318 -99 106 -114 -12 164 -109 -2 -64 -2 -196 -35 -344 11 66 -212 97 99 20 -154 19
6525 19 -96 -75 119 143 112 155 177 215 216 229 -30 52 -33 -40 25 -38 -125 105 69 222 128 -235 -32 130 184 3 -95
6552 -95 -32 -111 -67 146 -3 242 -72 111 5 -128 -11 14 43 17 40 22 -92 4 -66 -77 -160 13 192 -26
6576 -26 -34 -109 -10 88 -79 -128 27 4 27 -78 107 56 -4 50 -174 -138 -71 8 196 -297 -30 -69 -291 176 141 165
6602 165 7 -32 -139 -73 -85 45 -36 -149 -213 -20 304 70 -51 298 -115 16 135 13 10 148 -69 210
6624 210 72 83 94 -197 -144 79 -110 -95 51 -33 173 -59 -91 -8 19 165 -254 -59 -68 -99 -67 -12 -117 -37 106
6649 106 73 86 -289 74 -28 -64 -132 10 -49 -41 -213 -56 85 -111 363 69 -175 3 16 274 73 54 -157
6672 -157 183 -11 -248 -56 83 -39 -228 106 -23 30 -75 261 -130 230 64 -65 -46 173 191 -167 87
6693 87 -131 -68 -16 -91 30 145 120 -192 -67 -54 -77 17 116 -59 64 63 250 123 122 -103 -143 -144 72 154 -50 16
6719 16 -213 36 44 -51 -85 301 -113 147 45 23 -115 167 338 -130 16 -236 -67 46 -271 154 -13 -193
6741 -193 -77 -117 -21 -120 -51 -180 48 -20 -17 -40 -27 -13 -156 211 -12 130 -74 57 -87 -270 50 24 62 8
6765 8 36 -50 143 -134 82 -169 -222 4 -121 -18 248 80 -81 118 42 36 141 80 253 85 235 -28 -13
6788 -13 -26 200 -308 -214 -157 -54 108 19 166 -226 -289 -143 28 89 -45 76 -6 -168 -35 9 146 -135 174
6811 174 -73 -18 10 44 157 -31 -204 -41 -20 -114 130 -15 8 71 -79 -7 30 74 -23 108 7 -30 36 -271
6835 -271 -69 -96 297 -161 -206 -174 25 155 -219 114 26 -160 164 126 32 -110 -37 24 55 -205 18 255 -21
6858 -21 -72 5 140 -128 73 -169 65 -5 -34 272 -118 -151 -114 -170 116 -190 51 15 149 34 -130 -93 -112 -85
6882 -85 -125 164 -83 45 68 -59 88 -227 -165 -6 65 209 34 -187 -12 68 26 144 -13 125 36 -115 -171
6905 -171 184 77 229 58 140 69 232 -240 -207 100 62 105 62 157 -77 -146 -27 130 153 65 66 -8 162 -212
6929 -212 -91 -49 18 303 88 -60 -44 -60 123 -4 -174 78 272 113 -97 27 -98 -114 -186 -76 249 -248
6951 -248 -116 104 102 39 30 -182 -151 -99 55 -206 3 15 -205 -82 -11 19 17 141 -48 2 90 101 50 43 -299 250
6977 250 -160 -52 -499 -35 176 136 135 42 -16 -228 -62 -47 52 -2 58 35 152 -197 -210 29 94 69 -12 -330 120
7002 120 31 46 -252 -77 -73 166 -148 -109 -14 -101 -77 67 -15 -20 144 -1 13 118 105 87 -17 30 -134 -121 31
7027 31 78 95 24 -55 85 101 67 393 167 63 42 -2 75 99 -187 -13 85 -106 -68 -19 -10 113 -11 109 -165
7052 -165 38 -147 189 123 11 -97 176 -112 27 -181 181 154 115 -29 222 -51 -138 51 -14 32 -32 -199
7074 -199 144 -101 -52 -228 -160 69 121 -32 157 137 -89 42 37 172 0 95 15 311 -21 -234 181 79 -10
7097 -10 247 -193 96 -135 194 27 181 -100 20 -113 92 146 -147 3 -411 288 -263 -67 -68 19 -93 -191
7119 -191 -163 22 53 -43 58 -13 201 114 -236 226 -10 113 -19 -104 206 -17 -7 67 -61 -129 -239 136 -45
7142 -45 -75 10 -237 -293 -182 110 -151 182 -14 -27 35 242 -5 -84 -142 -122 91 85 120 -13 24 0 -103 -64 76
7167 76 -120 -121 -110 29 -109 -175 -1 -95 -101 -103 -81 23 -17 31 -233 -59 -116 29 -62 -112 5 67 83 -107 -150 -94 -49
7194 -49 -21 -8 107 70 82 -117 -246 207 54 61 95 -138 28 -22 -80 65 -25 234 -28 57 94 -71 -46 -220 -60
7219 -60 86 -147 -161 -8 -61 136 -120 128 201 -230 1 -13 235 -176 36 -77 14 112 -51 340 -29 89
7241 89 7 48 48 -96 -84 -5 226 -223 119 -56 -295 -1 -117 -54 102 183 41 -193 -255 -183 -145 75 152 -114
7265 -114 -105 -56 -104 -120 134 18 -66 135 165 -12 117 71 63 -116 72 67 21 59 15 15 118 -4 207 -117 -3 42
7291 42 3 -5 -74 -296 -92 102 5 129 20 16 -19 22 -145 -221 9 75 -173 -152 -139 -136 24 -123 111 -205 -46
7316 -46 -45 -58 59 114 115 36 -29 150 -288 86 206 217 4 149 -128 270 49 143 -60 110 -54 18 67 -165
7340 -165 65 247 332 -77 208 -149 -39 -172 263 18 38 96 -3 -349 -93 -219 -35 144 13 -112 217
7361 217 -110 -59 -26 -45 -94 60 -197 -58 272 -131 152 -145 20 259 -165 -213 52 -104 86 25 28 52 -98
7384 -98 58 -4 -110 -63 -29 -88 -169 50 -73 139 68 -111 230 -33 221 9 45 -37 103 15 -117 -10 -124
7407 -124 -58 -142 -88 268 -29 -42 57 -26 25 -191 270 -5 160 50 89 188 152 27 -234 292 74 -35 -31 200
7431 200 -99 121 138 -124 -99 82 -130 -104 -177 -134 -135 106 279 -94 -241 -94 114 16 -48 52 4 -30 406 32
7455 32 -213 -45 42 111 -8 109 -198 -65 -144 31 166 110 311 5 10 -112 350 -109 -12 -276 -33 -109 -12
7478 -12 70 147 69 -183 139 -370 -261 198 159 -196 -53 233 -401 -109 295 -45 -304 -24 58 134 54 -13 -198
7501 -198 -164 94 -99 67 -6 -40 -40 29 45 -39 15 -194 -155 52 83 78 73 -322 -108 -149 -23 116 -40 -56 1 57
7527 57 25 79 -9 2 10 327 12 -22 50 26 -105 173 -111 104 123 -16 -285 161 -81 -259 -88 153 291 -188
7551 -188 38 -201 -27 43 95 15 -47 7 -83 290 87 -95 114 -50 -97 321 -53 146 -233 11 -187 -27
7573 -27 -27 -187 179 -140 192 -72 174 -10 23 149 -25 -1 -141 -162 -343 -13 165 140 -55 -95 -191 -87 131
7596 131 -252 -83 8 -46 23 -1 -154 24 -212 320 -209 -149 -55 -96 105 -139 -51 5 -30 110 168 -27 75 -33
7620 -33 239 -131 -146 214 -19 -90 -92 -284 105 -51 271 198 2 -226 46 -58 63 79 -110 107 -100 3
7642 3 74 -116 -44 -146 33 5 314 -88 -64 53 -116 191 -241 -175 340 -25 154 276 110 252 -24 182
7664 182 141 -181 98 -69 110 201 -37 77 -55 152 36 -71 0 118 62 -33 -112 -138 -194 21 127 -56 93
7687 93 74 -12 -165 -44 -149 -61 410 -73 -34 303 34 -10 -63 -14 40 -92 18 -193 138 -85 -100 -235 119
7710 119 170 191 24 -146 56 55 119 297 -236 -27 -101 12 56 -113 -59 37 -14 -52 227 -68 96 -163 132 -167
7734 -167 86 31 -183 204 -180 -267 27 -21 46 -39 -42 -75 -64 -134 90 -135 4 -24 -48 64 158 313 -2 98
7758 98 186 5 138 94 111 -118 -129 -125 101 -135 -239 -234 -104 -100 30 -71 -163 284 104 -73 -37 122 -267 96
7782 96 -202 30 13 5 -122 -201 -88 70 141 251 -136 149 257 -32 -156 -6 -181 -18 -20 -28 -53 -251 179 -278
7806 -278 61 -257 101 -105 -55 -33 133 116 30 -103 -111 -21 142 -23 53 25 60 65 -27 -27 -11 163 81 114 48 18 95
7833 95 51 -187 83 13 -103 278 52 351 -34 -9 -44 -171 149 -36 -38 5 -61 -170 -366 13 -86 68 -18 70
7857 70 0 -178 -138 140 -194 -94 -31 7 -32 -14 341 -37 -105 -29 -35 29 -205 -240 271 -65 99 83 -55 -104 112
7882 112 199 182 170 20 -59 -50 -275 -57 -27 219 188 39 190 106 -163 -90 87 -161 -115 -255 84 51 124 -134
7906 -134 98 78 -63 -234 102 -2 46 19 166 57 83 -50 269 -37 147 64 -64 -190 288 -31 50 -122
7928 -122 17 22 17 182 -9 -122 -25 -124 2 -66 -14 15 -174 1 -91 15 -61 -47 35 66 109 -27 145 -114 156
7953 156 -112 -51 52 -45 89 24 -164 33 97 81 118 -34 -18 120 -95 37 44 -28 -175 -12 -98 86 -62 30
7977 30 -226 -240 48 85 17 -150 -21 116 -250 -134 -182 41 -34 -181 -22 -51 50 26 -77 56 -67 167 -3
8000 -3 -30 221 -24 133 78 49 187 143 114 261 11 -268 -170 -24 -44 28 128 -164 -156 -270 105 20 199 214 -29
8025 -29 -113 -51 379 -240 -60 -171 41 102 -171 49 362 22 173 -10 -124 -265 23 -173 237 -97 -49 12
8047 12 -187 80 -62 131 27 25 -184 -46 -50 219 101 -76 377 -183 -38 -16 67 161 75 51 -87 -46 -176 181
8071 181 -163 -53 -158 49 259 -50 -29 -177 -30 -256 47 -52 -169 132 -73 -167 48 102 -18 -182 131
8092 131 232 -38 158 24 21 47 263 -22 101 -160 157 180 90 -75 -57 171 164 148 1 -80 -34 136 42 36 -99
8117 -99 -113 -31 -142 154 196 74 -25 144 -83 6 36 55 -79 -142 -1 150 -17 34 58 -124 84 99 -118 251
8141 251 -59 -410 -49 -115 -1 -107 -231 -206 63 -241 -5 41 101 0 -6 55 -167 52 -17 -110 58 -178 33
8164 33 104 28 -85 -272 -44 142 -33 10 104 -309 146 -125 208 114 101 -24 14 40 113 -35 -188 -91 18 -56
8188 -56 111 76 211
8191B11
$$ Imaginary data points
##PAGE= N=2
##DATA TABLE= (X++(I..I)), XYDATA
0 0 0 0 0 0 0 0 0 0 0 0 0 0 0 0 0 -3 8 -8 8 -8 8 -16 16 -16 24 -24 32 -32 40 -44 49 -56 64 -73 83 -96 105
37 105 -120 132 -147 164 -185 203 -225 249 -275 304 -335 370 -406 449 -493 546 -601 664 -735
56 -735 816 -910 1017 -1145 1296 -1483 1719 -2028 2446 -3057 4034 -5846 10413 -51551 -58722
71 -58722 -11296 -47157 -22171 8838 3655 792 27188 14237 9366 32054 25555 -2854 16440
84 16440 28145 2523 -4628 9458 -7191 -18896 -12723 -22174 -32611 -17090 -17370 -27408 -10902
97 -10902 6878 1839 10862 27184 25147 23921 30214 18840 6558 10126 1170 -15452 -11363 -8964
111 -8964 -20548 -17011 -7499 -14630 -13482 -1925 -6479 -9353 5437 8446 1061 11230 20239 11520
125 11520 13018 21077 11905 3844 6804 -1259 -13851 -10874 -10952 -20518 -17176 -8736 -11520 -9092 1542
140 1542 3935 3052 10334 11921 8008 10212 11518 6509 5337 6864 1982 -1392 -847 -4644 -8160 -7632
156 -7632 -9057 -11240 -9178 -7385 -7505 -3309 1292 2390 5753 10024 9006 8316 10515 8227 3809 3012
172 3012 1217 -3539 -4694 -3999 -6794 -7684 -5257 -5297 -6373 -3226 -1024 -1986 -45 3464 3546 3563 6200
189 6200 6611 5210 5245 4822 2407 423 -351 -2901 -4464 -4884 -5183 -6113 -5518 -3518 -2757 -1926 -82 1716
207 1716 2565 3179 4257 4357 4084 3991 3286 2304 1125 216 -979 -1916 -2810 -3615 -4005 -4105 -3434 -3028 -2539
226 -2539 -1432 -151 611 1561 2502 3302 2796 3142 3399 2450 1517 1030 498 -735 -1559 -1506 -2748 -3033 -2404
245 -2404 -2807 -2504 -1377 -397 -475 130 1794 1999 2079 2424 2673 1951 1556 1341 324 -409 -459 -778 -1588 -1794
265 -1794 -1675 -1765 -1914 -1430 -980 -820 -317 486 849 1136 1571 1942 1847 1381 1827 946 63 -140 -647 -1252 -1569
286 -1569 -1418 -1361 -1562 -621 -661 -357 116 450 357 452 1062 1215 351 1074 1152 777 386 541 535 -182 -447 -371 -944
309 -944 -1127 -1209 -852 -981 -556 156 -177 259 921 1004 293 571 611 135 -232 226 74 -564 -212 26 -165
330 -165 -300 236 2 -505 -31 -32 -289 -263 -32 257 -165 -100 423 67 5 136 -63 -356 3 18 -267 -402
352 -402 309 107 163 77 289 287 2 311 -219 -552 -554 -403 -751 -494 -153 -249 -225 245 406 118 522 750 486
375 486 364 519 461 -71 -132 255 -175 -487 -287 -739 -820 -689 -348 -598 -661 -66 503 211 456 979 726 682
397 682 885 600 -35 233 94 -547 -687 -384 -558 -1009 -346 -556 -879 -491 164 246 -172 555 909 690 697
418 697 1143 781 436 612 380 -391 -442 -551 -815 -1070 -882 -953 -927 -907 -386 -233 0 668 783 547 1028 1074
440 1074 799 754 807 253 -63 -266 -274 -611 -996 -487 -865 -1051 -510 -447 -663 -119 531 299 296 874 1032 602
462 602 670 988 190 -28 208 70 -724 -821 -499 -1121 -1013 -519 -440 -893 -154 225 116 435 725 617 572 892
484 892 902 574 245 450 192 -276 -254 -298 -669 -708 -495 -540 -944 -451 82 -474 -200 556 738 332 626 950
506 950 343 360 575 178 -166 -88 -295 -938 -667 -263 -664 -1041 -695 -369 -457 207 167 -7 333 437 530 480
528 480 1035 630 339 587 390 -81 -297 -603 -327 -701 -443 -835 -566 -611 -240 -38 -140 -189 406 383 419 700
550 700 603 296 215 391 342 -220 -142 15 -501 -444 -403 -793 -868 -448 -496 -512 39 548 202 498 840 772 667 858
574 858 701 300 512 127 -254 -75 -444 -481 -694 -645 -191 -600 -508 -167 -197 115 198 33 609 695 457 771
596 771 631 138 304 286 -380 -469 -200 -662 -693 -467 -416 -782 -411 -196 -221 234 448 260 464 702 601 551
618 551 558 478 -75 207 66 -318 -406 -240 -729 -583 -293 -506 -398 -340 -364 8 373 90 554 747 544 443
640 443 408 416 16 160 -211 -216 -505 -357 -685 -713 -403 -149 -627 -207 -71 206 236 337 233 332 732 603 291
663 291 156 450 -42 -164 -80 124 -410 -528 -390 -292 -216 -490 39 -149 205 213 415 93 623 413 582 287
685 287 33 320 153 64 185 -244 -297 -26 -302 -226 2 -271 -345 -209 46 -13 87 479 97 508 73 318
707 318 328 298 62 249 -79 -161 -26 -255 -17 -259 -80 -234 -363 -281 -65 -130 -26 365 155 24 298 173
729 173 292 283 372 15 -47 248 -91 -327 47 -305 -466 -386 -207 -377 -88 -29 -146 48 23 116 456 353 273
752 273 97 320 372 36 133 129 -100 -144 -82 -256 -334 -308 -495 -656 -362 -231 190 135 438 230 539 549 6 198
776 198 176 296 188 40 -200 -506 -42 -313 -654 -110 -418 -400 -356 -230 -141 -175 193 387 277 446 534 689
798 689 232 429 320 51 -47 -178 -616 -419 -499 -512 -451 -353 -114 -81 121 176 112 255 183 273 254 68 394 425
822 425 159 66 201 -168 -108 -450 -512 -431 -612 -228 -166 -547 -38 38 154 290 402 524 312 401 454 203 82
845 82 296 -326 -225 -99 -235 -60 -98 -508 -431 -236 -106 100 -36 12 239 182 211 314 444 530 182 128 -6
868 -6 33 -34 -185 -270 -333 -213 -407 -262 -222 -197 -146 65 224 99 -91 387 471 51 288 393 145 37 -69 -262
892 -262 -200 -7 -291 -553 -415 -215 -522 -24 49 24 -94 217 271 463 229 518 316 165 326 126 67 -292
914 -292 -166 -246 -251 -190 -197 -420 -353 -344 -175 10 -159 301 -119 121 282 403 157 420 172 356 196 149 64 -537
938 -537 -319 -373 -304 -194 -228 -266 -246 -385 -219 19 -18 332 276 266 283 279 336 112 166 291 -53 -156 -329 -240 -405
963 -405 -271 -407 -95 -194 -241 4 17 88 59 146 234 307 52 151 112 90 155 -157 -299 -189 -146 -293 -393 -475 18
988 18 41 -506 -146 135 38 366 327 342 572 452 268 460 321 140 -159 -300 -222 -449 -466 -693 -460 -439 -322
1011 -322 -18 -60 120 -13 -256 422 297 462 197 53 111 157 308 -36 -248 -237 -47 -458 -421 -268 -303 -290
1033 -290 -346 -193 193 -58 165 290 261 163 206 510 211 165 62 45 -5 -23 26 -182 -317 -348 -262 -384 -229 -256
1057 -256 138 -11 46 246 215 324 157 238 325 3 -43 -79 73 74 30 -326 -241 -205 -342 -198 -43 -255 236 135
1081 135 -125 365 -28 -5 392 171 263 169 67 349 166 -21 -74 -27 -300 -207 -435 -139 -209 -318 77 65 -150
1104 -150 -8 195 147 174 240 110 329 148 211 231 -47 -154 -224 -144 -254 -206 -187 -385 104 -90 -54 -256 375
1127 375 4 221 163 85 140 254 166 288 38 59 -25 -274 -123 -401 -187 -260 -234 -125 -121 -194 166 -64 257 253
1151 253 11 162 307 26 331 43 21 288 -57 -156 -144 -81 64 -166 -4 -189 -114 -39 55 95 490 291 219
1174 219 219 231 169 68 57 107 -151 -98 -103 -242 -342 -449 -289 -133 107 -166 -31 36 316 -10 121 192 326 70
1198 70 367 283 216 204 -53 136 -176 -149 -194 -305 -15 -66 -105 57 -22 -154 275 90 154 66 -81 121 429 134
1222 134 108 109 9 -18 -165 -10 -162 -252 -112 -184 -94 -333 -220 -84 128 58 51 211 154 259 268 259 135 202 -118
1247 -118 -7 -129 61 10 -42 84 -302 -363 -366 -109 -317 124 191 -87 -69 56 92 218 108 143 148 29 206 148
1271 148 -236 -62 -171 -213 -61 -411 -265 -162 -8 -205 -165 86 -59 119 316 -65 -168 143 338 160 105
1292 105 -153 58 -283 -302 -165 -162 -233 -297 -279 -107 -169 40 -112 -37 174 163 361 79 216 184 134 19 227 -128
1316 -128 7 52 45 106 -306 -164 -134 -133 -56 -124 -112 74 -20 151 385 332 -125 -197 61 211 -158 115 -48 -233
1340 -233 -302 -177 -87 -256 -442 -169 -362 91 -267 -51 10 -81 52 54 193 158 1 70 187 160 -114 -85 -321
1363 -321 -98 -76 -345 -207 -404 -145 -144 -110 -38 79 -215 193 104 192 144 157 91 3 -136 -182 -261 -198 -270 -173 -232 -49
1389 -49 -69 -103 42 96 69 -66 112 101 302 164 195 263 402 81 148 -77 -310 173 -87 -304 -162 -308 -62
1412 -62 -333 -9 54 234 158 77 99 164 128 13 371 -26 -90 -105 194 137 138 212 -149 -288 -7 -175 -330 -124
1436 -124 -82 -149 -153 308 221 278 202 48 287 -21 111 -1 41 -31 -127 -4 -10 -117 -15 -218 -189 -26 -290 0
1460 0 -62 -83 -103 294 75 116 117 189 60 -55 -40 -144 -17 -110 -355 -115 185 109 204 -318 -265 -69 -34 333 -65
1485 -65 -84 301 215 7 -30 194 389 -104 35 44 -258 118 -64 -59 -208 -369 145 62 -46 -136 336 -8 132
1508 132 210 141 49 5 168 167 -87 140 -134 1 -46 -102 -48 2 -192 -6 86 -190 81 -78 -107 93 209 -58
1532 -58 437 40 -43 25 -56 -70 -132 -141 -33 -227 -209 -159 -20 -58 65 -61 66 -57 -217 171 -10 -23 464 -14
1556 -14 105 33 57 -18 -123 -107 -253 6 -206 -222 -172 -131 -102 -67 -104 -251 33 185 133 19 118 138 -55 118 74
1581 74 321 -88 -117 -6 37 -186 -106 -56 -104 -36 -24 -228 -135 -82 370 237 -38 44 312 250 -25 124 -85 -18
1605 -18 -42 -83 -27 -174 15 -222 48 -13 -144 8 -72 8 80 47 326 137 29 31 -93 -83 304 216 -166 -184 -138
1630 -138 -176 -381 -279 -31 -243 -131 5 -57 -103 -15 -130 -33 164 -201 288 6 200 -430 -6 125 -73 51
1652 51 -64 -45 -136 251 -27 32 -206 -250 126 104 183 -20 114 186 256 209 86 226 49 -23 150 17 -174 60
1676 60 -318 -110 64 -60 -153 23 -256 -61 -22 -139 -156 190 -83 59 204 138 -114 122 196 130 -185 -39
1698 -39 -46 -267 -16 -114 -160 -34 -120 416 214 236 -119 222 77 155 -7 99 -249 20 26 -48 65 -76 -276 79
1722 79 -5 -345 26 162 -195 72 -34 92 174 210 153 316 274 177 -74 81 -140 -148 -179 -146 -32 -135 -62 -175
1746 -175 -133 97 -42 228 128 214 210 24 259 -52 -35 172 -38 126 99 -81 201 -117 290 -218 -88 -313
1768 -313 -121 -189 3 -5 260 -236 170 174 -49 -25 -13 210 225 -39 -30 128 -128 -225 37 -100 -114 41 -338 21
1792 21 -15 -75 -213 118 161 74 -204 36 34 164 162 236 -115 1 186 -189 -102 117 130 -48 55 73 49 -93 -35
1817 -35 50 90 282 131 247 102 95 235 143 82 69 -78 -128 -196 -148 -376 -71 78 129 -244 67 76 228 226 -64
1842 -64 34 228 113 -25 71 -52 121 26 70 -370 -5 117 -226 37 -74 -193 -184 48 -233 -50 185 130 -77
1865 -77 217 19 -34 195 173 12 -144 -170 58 -155 158 -157 -112 138 -305 172 -287 -107 5 189 82 130
1887 130 -19 -97 44 -125 34 -45 -107 84 -23 6 -13 20 -70 24 -237 -168 -146 134 -59 -175 -16 34 24 153
1911 153 76 194 233 -116 -173 -130 19 -19 151 -60 -339 -230 -160 -117 -155 -394 132 165 -149 1 6 -129 -247 41
1935 41 20 -88 225 68 27 213 11 -19 29 3 -110 -122 -58 6 -76 126 -43 97 -138 198 56 257 148
1958 148 266 97 -14 237 8 -48 -32 45 24 -110 -104 -308 36 54 -10 -6 -202 -118 63 -21 228 -228 44 23
1982 23 125 -239 -106 71 97 -389 55 -81 -89 63 -158 20 -7 165 50 27 -103 218 123 -105 166 234 -95
2005 -95 -14 78 -76 -129 258 35 -56 -184 -50 -21 -152 -214 -114 259 125 56 313 186 -1 179 299 162 -16
2028 -16 47 115 80 -117 -35 -17 -169 23 20 -23 -143 -186 -121 18 -162 47 -32 40 163 45 81 -120 -177 83 21
2053 21 224 -28 -99 -18 49 -1 -140 -125 23 -81 -193 54 40 -178 279 114 52 290 42 -75 17 -46 76
2076 76 -158 -2 -179 4 139 -92 -12 167 -55 7 301 143 -95 87 136 112 -198 -7 136 43 -114 -19
2098 -19 -60 -201 -47 -272 -186 -169 -27 125 87 -80 354 12 -164 360 278 48 -46 230 175 -60 112 301 44
2121 44 -49 -122 80 -7 59 -6 -162 -223 150 -33 -36 -154 -80 64 -217 -86 212 168 43 83 -15 -96 18 -92 -204
2146 -204 107 6 9 -278 21 -103 171 -116 146 -52 240 -27 17 73 -140 140 -180 17 1 -95 -59 -117 -153
2169 -153 -90 -4 -93 -12 -54 225 -78 -49 -71 -131 447 -35 88 -103 253 25 -25 -273 54 -68 -71 -52 -271 -70
2193 -70 40 -36 128 25 150 164 84 -78 -17 155 273 -117 150 177 -149 -63 35 112 -351 -176 -130 186 13
2216 13 -36 -99 36 2 73 -33 -37 72 119 -90 157 -24 148 134 -120 -97 122 -117 220 -103 27 -53 -376 -218
2240 -218 -152 47 -178 153 98 -140 -29 275 89 -220 259 23 137 -223 4 -114 126 -83 -232 -72 -55
2261 -55 -33 -6 134 52 127 -111 -68 -51 -4 151 225 -88 26 -108 201 -272 -41 102 -47 24 -181 -203 40 -197
2285 -197 100 92 -31 62 19 60 163 250 291 -229 -94 88 75 206 -6 -117 38 129 -223 -58 68 211 -225
2308 -225 143 -13 -49 62 89 -260 -134 252 102 -77 -114 -10 -114 -261 -34 125 -64 -12 -73 77 -30 -92
2330 -92 2 114 59 271 -110 -183 87 -163 -26 11 -392 160 3 145 136 -42 -51 36 137 93 -56 -34 -27 -137 -159
2355 -159 -55 -82 40 -56 94 -130 114 296 72 17 -22 0 -101 -98 -143 -55 32 -181 252 49 -126 281 118
2378 118 -294 64 -127 -126 133 203 -10 -57 -83 -197 182 -331 -120 -56 -60 114 -202 -117 -52 -221 58 -116 -47 -100
2402 -100 172 -195 22 -73 168 183 -11 62 -134 20 -84 -99 76 -36 -72 -78 -30 -43 -95 -125 -69 26 -108 6
2426 6 -96 80 -17 136 -6 216 184 -139 -7 -74 78 -88 148 -130 6 -94 54 46 -7 131 57 226 108
2449 108 12 -46 59 -204 47 157 -220 177 61 115 -43 78 -102 -197 -13 121 -111 -9 -73 121 -189 -1
2471 -1 -234 -81 330 -192 171 -97 -39 -193 -61 13 85 -41 -150 207 -141 100 80 231 114 -179 -59 -194
2493 -194 93 159 66 46 127 -76 -152 -140 -40 25 -311 65 -77 235 119 7 32 166 228 -192 -108 -41 23 -75
2517 -75 219 160 91 66 2 -108 65 1 -179 -4 -17 60 -64 27 -223 111 -86 -90 -5 -109 274 226 0 47 121
2542 121 -12 131 29 123 114 135 298 56 -100 -168 19 150 -83 -119 -108 291 119 234 -18 119 211 204 11
2565 11 103 65 49 127 112 -37 -11 70 133 122 58 188 -227 30 -94 109 -32 -69 40 119 50 -181 -48 -67 137
2590 137 5 83 188 -9 -51 8 -26 -19 106 -161 -19 100 -24 108 183 -327 -43 -6 62 424 93 -53 -88
2613 -88 -15 -122 -51 -19 -25 -190 16 106 129 11 143 -30 4 -70 -79 -242 183 -210 251 50 -54 203 48 -230
2637 -230 -57 -196 -102 -187 -155 -50 151 -74 44 -147 129 96 -117 -159 40 231 89 -164 17 113 -93 -82
2659 -82 0 203 112 -137 -81 90 147 -139 -171 -69 -49 157 128 29 139 -271 91 -82 191 -138 -128 -222 -294 -66
2683 -66 271 7 -232 -202 15 -48 32 144 168 -354 -65 -72 19 285 80 -38 58 -138 -290 66 -254 72 -39
2706 -39 -31 -239 -292 -177 46 49 72 96 -137 -48 67 23 78 90 -110 59 -94 -103 -14 -12 -21 -229 -63 -275 25 -6 -269
2733 -269 -11 57 205 114 203 110 92 228 103 62 70 -52 -82 7 -82 25 177 -126 17 -38 -166 88 68 -232
2757 -232 26 150 -57 24 -57 -97 177 173 127 131 -24 161 -387 -106 -34 -103 -214 66 -97 -92 13 -62 312 -61
2781 -61 16 199 217 115 -146 96 -40 56 205 -161 -60 238 -82 45 214 67 38 145 72 -223 49 -105
2803 -105 -118 220 -101 99 -30 29 -48 38 31 -160 -67 122 -140 -158 -112 -3 71 -93 33 -60 186 -23 349 -168
2827 -168 100 57 86 -17 -27 0 97 24 221 10 2 -18 65 150 205 181 122 106 -26 -49 -25 68 8 120 175 231 92
2854 92 2 -78 -23 -135 -62 -36 -99 -210 5 -42 -76 -59 -74 -174 31 -124 -34 109 -122 -3 27 -316 -111 -41 112
2879 112 116 118 -31 -139 172 14 -68 24 -76 -61 33 -173 168 245 227 -81 4 8 114 179 -121 27 -109 -36 -54
2904 -54 -16 77 23 90 -275 7 -140 3 -60 64 182 -9 34 26 -222 170 11 -212 -112 -54 76 -181 261
2927 261 -165 -52 -155 -29 -11 159 68 1 -151 -128 77 -243 107 73 -200 -273 43 5 -179 40 17 -69 64
2950 64 -37 166 182 66 67 -5 178 -52 -76 -49 131 62 19 -24 -78 -265 79 -29 30 99 -6 -66 50 111 -33
2975 -33 -19 -201 -21 -124 -130 149 -1 -55 122 131 25 82 -22 257 102 2 -60 -28 11 -99 12 164 -31 -79
2999 -79 14 -159 -215 -5 61 104 189 92 -102 -7 18 -37 98 -21 56 -340 39 -109 -121 -181 -212 1 111 17 79
3024 79 38 -275 85 22 26 40 129 -146 -266 3 135 -3 -148 -147 -213 -184 -117 94 1 -134 194 102 -92 17 102
3049 102 266 -49 -65 250 101 -31 91 -7 -13 -18 165 -93 50 158 227 83 250 -239 192 -161 86 -164
3071 -164 -33 -38 150 53 -62 125 5 -163 103 35 -159 23 56 128 -84 -4 -47 80 -50 -183 -78 -33 169
3094 169 -214 111 266 74 154 32 50 18 -70 62 60 5 160 -208 -81 34 83 4 120 -167 27 112 11
3117 11 11 152 42 210 -117 -148 249 31 -33 -34 25 -55 -75 9 -137 -26 91 -303 2 -126 108 -27 92 292
3141 292 -102 153 -177 29 242 -35 -50 19 -112 229 0 26 -6 -143 103 -179 77 123 -212 -306 -99 -24
3163 -24 -170 58 -164 -61 -60 98 -333 -23 -62 -94 141 -31 3 -124 237 -33 54 99 60 206 -378 204 130
3186 130 185 -225 -91 189 -46 -61 -76 299 -135 -159 287 47 126 70 -16 -55 -220 -29 -120 41 -126 -40 187
3209 187 7 47 27 205 64 -105 -75 28 8 -116 -300 123 -1 -106 80 55 70 3 -48 -280 140 191 -265
3232 -265 30 -67 -45 -238 -33 93 -105 197 -91 -63 -12 -119 203 -91 -50 129 -73 -9 -175 -39 -198 58
3254 58 112 29 13 -195 81 90 -96 53 234 -53 -19 -63 -160 -32 88 -7 97 217 -208 81 252 96 246
3277 246 242 236 -189 174 -71 -64 112 113 -305 -11 -138 -29 205 -110 87 -130 150 114 -114 227 11 -28 -119 45
3301 45 104 -199 113 149 -56 -271 85 27 103 79 -57 -150 97 2 131 27 326 -114 -219 80 -128 40 -11
3324 -11 -57 -132 -190 -48 -75 123 -87 -104 -40 -184 -200 155 50 -103 -75 -193 111 8 61 -10 170 -83 -74 -52 -48
3349 -48 109 -86 72 -99 189 -47 -251 -72 -347 -31 67 -163 -227 -72 -66 58 72 40 -5 73 39 182 44
3372 44 -58 213 -26 -251 28 -107 37 128 -83 -182 -229 77 71 41 -32 149 11 -78 99 107 -24 58 -134 224
3396 224 18 -110 15 -67 239 -90 -24 -29 31 54 -28 64 -221 88 50 -426 -50 28 277 -169 -84 181 -65 -80
3420 -80 -65 -150 -112 109 -250 60 125 83 -68 4 -170 14 -118 88 -39 -101 -100 91 -29 -238 -138 11 259
3443 259 -212 59 27 -216 -161 51 294 -43 276 -60 84 149 34 42 92 -9 -175 239 -166 -33 108 -243
3465 -243 -184 -172 -96 -182 -86 -191 -85 150 -47 -135 64 -240 143 135 -53 -61 21 -75 -180 -31 -181 119 -201 0
3489 0 276 -110 35 356 -75 270 39 113 20 -48 33 -70 129 102 -55 -57 -80 163 6 -369 -2 7 99 293
3513 293 75 142 -4 -133 -29 -61 -15 45 90 71 215 -372 -353 83 -57 -164 75 -140 -131 80 -76 274 -30
3536 -30 61 -137 13 113 -68 93 -107 -80 79 51 -79 105 84 38 -141 129 -103 -241 -256 -46 111 16 -2
3559 -2 -28 43 -30 157 -17 -208 195 -147 -129 -30 -31 29 119 -5 -145 -273 -97 138 -145 106 23 163 32 127
3583 127 -73 -174 -69 -92 -42 11 -58 202 82 -13 -205 154 185 48 -76 -56 -71 -104 7 18 148 127 175 46
3607 46 -223 256 159 43 121 179 48 290 111 -37 112 17 29 -301 81 82 -79 58 7 10 25 -117 -171 -235 -160
3632 -160 -257 152 58 62 235 154 84 -190 -146 340 230 8 -140 24 -52 -35 39 -156 61 -123 -98 43 -119 -94
3656 -94 23 213 -260 -218 221 -88 -77 -252 -213 57 59 -223 -47 22 99 -130 -35 189 -117 -110 -182 -40 226 -16
3680 -16 -243 58 32 188 35 46 -68 -11 -91 175 -130 -124 33 -11 -20 228 296 -37 -49 -3 71 119 65 -194 -199 -20
3706 -20 -43 237 8 271 -158 -122 140 31 131 80 132 195 86 -10 29 -40 -100 -83 -98 223 -90 229 -152 147
3730 147 -191 -18 13 -5 -318 -248 -180 -156 -167 -167 -85 47 54 11 42 -5 48 144 69 -41 32 213 -141 97 10 -200
3756 -200 -19 54 10 39 29 44 -229 15 87 113 194 87 339 195 155 -116 115 7 -155 58 72 242 76
3779 76 -51 -100 -19 -63 29 -176 180 17 144 181 1 -48 248 67 -201 86 36 240 58 148 -110 -77 125
3802 125 -64 166 -162 138 125 58 -54 -70 -30 19 109 137 26 -151 23 -150 -94 39 126 197 8 18 -67 186
3826 186 -64 82 155 -32 23 -164 15 252 -279 151 -5 -32 -5 23 18 -79 170 -122 47 -155 130 -89 255
3849 255 -32 -151 -399 -129 -122 -230 34 75 -124 71 -198 -5 35 96 14 -74 -105 -154 -12 304 94 -112 226
3872 226 195 -108 -101 21 -160 -289 188 38 152 19 -98 -89 -31 -109 19 -85 75 20 -90 -32 -46 -227 -64
3895 -64 33 -30 85 222 -166 223 145 -84 49 -118 -112 30 -76 106 -60 48 -340 147 -194 -81 -54 -202
3917 -202 36 -177 -26 -222 -213 -12 293 -92 124 3 -119 -294 -83 211 -187 -183 -280 -86 -70 -60 105 37 -311
3940 -311 -157 37 63 -46 30 -124 -66 196 -74 187 -222 99 -289 58 54 -164 -72 56 40 59 -38 -21 -24 45
3964 45 -61 -123 30 -187 -43 61 175 -155 -42 -33 47 -395 -190 -1 86 41 -22 -1 109 -285 86 -20 12
3987 12 -369 -122 -282 -94 -166 148 66 272 -33 -219 327 -84 53 5 -104 -121 -14 135 258 258 -171 -105 -86
4010 -86 243 -81 -42 359 13 -81 26 -48 91 136 245 24 -89 115 -8 184 -298 135 -85 -45 -25 89
4032 89 141 -119 32 -92 -160 43 55 -66 -7 -48 -125 -99 66 70 -19 122 78 114 0 151 -100 39 -231 -4
4056 -4 -54 -181 53 30 86 -76 76 117 -67 -247 -28 45 204 37 63 -95 85 -11 -2 59 174 288 -29 50
4080 50 -222 129 -49 115 65 48 121 -196 -73 56 -73 -112 -5 176 -70 -1 88 16 -19 125 -152 21 101
4103 101 67 56 43 -197 143 204 317 185 104 -152 60 87 234 142 42 -57 -99 -19 -226 -19 -20 -81 -56 -20 93
4128 93 -81 131 114 243 -269 -93 189 9 -112 -86 -67 125 200 -260 167 327 95 6 -175 235 54 -175
4150 -175 -116 105 65 208 -304 -25 72 78 113 -54 -219 -112 53 101 159 -107 -124 166 106 -132 1 -239 -74
4173 -74 -332 139 -205 8 218 -13 6 125 32 51 81 -175 185 -28 -45 36 202 110 13 49 203 -274 151
4196 151 49 -147 10 84 54 82 83 -171 151 21 -19 -18 87 27 -269 229 -229 67 63 87 -89 -60 68 -56
4220 -56 -43 -105 -41 -128 -29 189 11 -194 -191 -151 201 -184 92 -100 -28 -250 -35 231 4 179 -97 -155 -48 55
4244 55 -37 311 88 68 -50 97 17 -20 -212 -9 33 -2 59 95 79 -179 -4 -112 61 10 -122 99 118 -16
4268 -16 -334 -63 -124 55 -280 -128 -4 -101 -81 -275 -54 29 184 -59 204 124 243 -167 -164 183 105 -27 39
4291 39 -7 49 131 -103 38 -73 88 -259 -377 37 -100 46 98 -84 51 -27 171 -164 -24 -9 88 -102 116
4314 116 -243 -169 -149 -238 -10 103 -104 -15 -254 51 153 246 -255 47 -74 -19 -42 -169 45 26 -11 -104 24
4337 24 24 64 -104 194 50 -229 -7 9 -134 -46 108 97 26 -61 58 -4 -1 -160 -215 178 325 -51 -8 -48 112
4362 112 -59 -136 -356 86 -1 258 179 138 92 -61 49 -177 -156 206 -62 68 127 85 -163 17 -151 39 236
4385 236 41 -25 127 -172 129 -46 -279 19 176 -135 -156 354 -57 -123 52 301 76 264 -200 69 141
4406 141 -73 -2 -75 -62 1 -292 122 -260 -1 250 16 -35 46 37 69 74 116 169 50 105 124 -48 -218 -216 -22 -132
4432 -132 200 -75 -190 -143 190 -159 -4 -21 78 56 -122 -82 57 -189 11 138 -155 -119 -94 -16 -100 63 -282
4455 -282 121 126 86 145 57 -271 -11 76 8 126 -162 -46 43 205 -226 1 -23 -80 -72 -98 -91 -15 80 14 -58 -77 -165
4482 -165 -84 -16 36 -233 -49 -130 57 -57 -248 102 224 -40 4 -101 -336 -25 -181 -3 277 -104 258 252
4504 252 140 -75 127 -76 -43 56 -8 115 94 207 11 156 14 -35 -58 55 72 -82 -34 264 203 -9 -238
4527 -238 152 50 -77 -95 64 82 51 -13 -102 -93 176 -219 19 -64 -11 97 -50 94 59 131 148 69 278 28
4551 28 5 -24 10 67 129 28 162 239 190 -63 -22 -92 -44 -193 -233 -82 22 -9 -123 -98 48 32 -143 122 144
4576 144 -125 135 61 -63 191 29 -116 142 -69 -135 96 -1 -69 -83 23 465 215 -25 -38 149 19 -103
4598 -103 -11 -12 -83 116 212 -26 -192 56 89 -249 -105 113 -75 -317 -71 36 109 123 -371 125 47 -29 139
4621 139 73 101 103 -59 -164 -39 33 112 43 -17 65 197 68 -59 -63 72 53 23 147 -160 53 201 249 71 -462
4646 -462 21 -107 102 17 -197 -125 14 -41 86 74 121 -205 -168 -47 120 -58 -191 -50 89 219 81 -106
4668 -106 283 -31 -104 114 -187 -264 -68 108 95 -43 38 -6 -96 57 -6 118 5 153 50 -66 135 58 54
4691 54 91 112 28 357 -267 33 -83 -104 -99 59 2 152 327 -67 248 89 -235 -109 219 -55 -99 -78 179
4714 179 50 -58 -33 79 -13 54 -1 -1 13 131 178 59 41 -45 24 -118 -228 155 -274 -108 168 15 -155 -99
4738 -99 -339 -76 185 38 44 -206 73 94 298 -10 105 108 -278 106 -168 103 88 -127 -4 -73 150 35 171
4761 171 93 239 15 228 -141 -111 -53 -50 104 -201 -15 -13 15 -56 61 159 258 -69 123 -50 -146 -89 51 -15 -62
4786 -62 13 -142 -92 35 62 115 101 146 118 69 -274 301 -55 -13 -14 -91 197 -116 -72 -145 94 -135 -37 -137 -21
4811 -21 53 64 -19 145 150 174 64 -47 -127 -89 -302 83 -226 4 116 153 8 -99 16 -97 92 -10 203
4834 203 38 -170 256 -220 -138 146 100 80 295 125 -35 110 -62 -150 -30 68 95 -151 -38 -190 323 121
4856 121 52 -134 19 83 -225 42 112 123 -182 7 -163 -50 -210 21 -187 -27 91 -6 27 -153 -140 -187 -131
4879 -131 -9 82 -43 154 -16 113 102 -208 -120 57 6 227 -1 -116 56 -33 -232 42 37 115 155 188 45
4902 45 -38 2 166 97 -414 328 102 46 99 -127 59 -37 -82 -46 -248 117 1 99 -22 120 -26 135 -33
4925 -33 127 -6 188 -129 67 -82 135 35 84 103 -254 56 36 82 8 -197 -51 233 -90 -30 74 13 -49
4948 -49 8 -107 283 -17 9 57 191 -166 -28 13 47 -288 -160 -1 16 -62 42 143 -273 -136 -41 -218 257
4971 257 -45 27 206 259 -91 17 193 9 69 76 0 34 -3 -51 -27 44 80 -57 -226 -57 186 -7 -285 -3
4995 -3 289 -9 -10 14 -165 89 214 52 -14 -99 -63 -60 -71 -25 -160 50 13 11 -103 -41 -225 105 27 18 230 117
5021 117 -42 74 197 -33 63 129 -47 132 28 26 131 139 -124 -163 232 50 35 -5 -100 -30 72 135 -117 -259
5045 -259 -63 18 -62 151 102 154 50 -84 -4 18 92 235 -197 -50 -43 -252 180 -94 232 86 -104 -116 -17 37
5069 37 108 -242 -118 -146 48 -218 77 107 -150 175 -71 -65 131 -284 25 138 -19 9 9 -42 -237 83 30 334
5093 334 -116 -110 -81 153 184 -85 -71 180 1 -332 -146 -259 22 96 -219 187 -32 96 -60 165 -36 101
5115 101 -82 -37 -76 -72 -9 -213 47 -31 40 -26 -151 -75 24 277 -109 -347 -30 -91 107 -16 101 -109 8 204
5139 204 -165 91 -70 122 29 12 -54 178 -40 -165 -156 162 29 -75 75 102 -129 -84 71 9 223 -33 62
5162 62 -131 -104 -306 -16 -151 293 90 166 -63 -150 -11 -42 -21 174 111 5 245 -242 -26 37 -89 -87 48
5185 48 11 178 60 53 162 69 -97 -26 -24 40 41 -21 -31 -213 45 194 -19 4 -50 149 242 83 -190 -10 -72 4
5211 4 28 -144 128 -19 125 134 -95 -57 -1 -78 -133 -134 -3 232 21 -21 132 153 162 73 100 -172 -127 -64 131 235
5237 235 25 -203 -153 28 98 154 -291 -137 11 -33 -74 159 -153 69 -28 -24 -65 -83 67 -62 3 142 3 1
5261 1 -66 94 38 172 74 -29 2 82 -16 -25 -23 -4 -102 -44 59 -222 151 -37 -188 -83 1 117 223 -37 118
5286 118 81 -112 -46 -2 21 -3 -104 130 -122 38 9 115 64 -155 -35 118 -7 -207 137 35 -123 -169 -443
5309 -443 43 47 34 -194 -136 -64 110 112 154 -144 -140 -60 119 41 -3 86 59 -75 56 -230 -59 -131 -106 -240 -207 144
5335 144 -110 -146 -102 -154 59 40 160 -12 123 127 118 -18 -352 -79 -328 -27 -189 -44 -141 -100 -179 56 -140 7
5359 7 -187 -51 -154 117 187 365 -123 148 -22 -172 26 159 187 244 336 -32 24 -115 -93 112 164 291 -30
5382 -30 16 26 26 -42 -85 -74 -33 23 -246 109 -143 270 28 -18 152 56 129 -127 -147 -12 -8 -144 112 -50 106
5407 106 59 -18 -71 -107 -32 44 -107 -251 28 46 -166 -65 -164 148 59 163 155 -13 -47 34 -81 -109 -50 87 -46
5432 -46 116 -93 107 10 77 18 -52 11 -110 91 -62 1 -115 -62 92 -57 4 45 160 132 -2 269 -91 -90
5456 -90 100 -12 -89 18 82 299 -5 -18 101 68 63 -191 188 -148 72 -48 -14 6 -75 -213 10 -34 -87 -240
5480 -240 0 -22 -48 -126 -138 84 92 -21 -91 -53 153 -22 -95 -69 192 -211 -72 111 -136 81 190 -75 -177
5503 -177 275 -204 -99 -68 145 24 243 18 -209 -10 74 -235 127 -87 -6 -23 133 21 39 179 169 -44
5525 -44 -105 -126 -202 128 -83 -27 -129 -17 -123 -50 70 187 -57 -28 123 -119 113 246 42 -96 -123 49 76
5548 76 -321 3 -107 -17 -212 42 -71 -176 158 103 -179 -57 -61 -17 -8 7 -150 50 140 128 -75 15 -101 29
5572 29 165 -38 -1 -183 115 20 155 324 148 0 179 -42 47 -34 -316 -66 53 -226 -134 39 -136 -128 -86
5595 -86 -126 -122 95 136 24 -194 -221 22 -110 -4 -201 194 -86 -101 81 39 -16 1 14 79 -303 -160 250 40
5619 40 -109 -38 -76 -159 94 -40 82 -45 -6 51 -16 -238 -183 -345 90 -148 127 -174 124 127 44 98 126 52 179
5644 179 -82 178 176 68 274 -138 -133 76 68 -83 -202 -32 78 -168 146 -100 -194 -67 -86 36 8 -241 -5
5667 -5 61 162 122 -122 5 96 -46 -101 -306 -75 -208 -102 -200 -111 3 -56 46 35 -141 -41 160 194 -38 28
5691 28 58 -45 51 51 -126 -93 -38 -68 -60 -74 347 48 0 -7 172 216 -28 188 71 -13 93 27 -119 -28 52 -152
5717 -152 -4 -147 -20 -87 -22 68 79 -124 -180 112 -59 61 15 100 -28 92 -51 167 -105 -10 105 -15 -202
5740 -202 -173 -157 12 316 45 15 96 -67 -185 -150 -143 88 60 48 120 288 -122 32 79 -127 200 -285 61 -10
5764 -10 219 40 36 -86 13 175 25 -175 119 65 104 242 114 -4 -155 -59 -80 201 -51 122 -49 161 144
5787 144 -114 26 158 2 134 -37 -87 -45 -55 -12 77 -31 -41 -76 -397 86 80 -13 -146 -113 132 74 165 -37
5811 -37 -75 344 -173 10 119 -50 123 -232 56 18 81 -108 -110 -169 -39 77 -119 0 -103 -21 -7 35 -56 -235
5835 -235 -119 -50 145 -39 -95 -117 -427 -305 -71 -135 174 -175 -246 159 -127 174 -28 322 105 -86 158 -68
5857 -68 56 -30 166 217 133 88 -138 -89 -26 43 -90 -26 -125 -13 45 80 119 45 -73 43 -92 0 -99 -134 102 -149
5883 -149 230 190 -160 -231 122 257 -282 -20 424 16 -180 134 -57 -6 22 182 -138 -3 -134 76 -83
5904 -83 38 131 13 88 10 -36 14 -1 23 55 -295 53 233 -191 -185 -157 110 0 -240 124 56 -56 32 -180 -17
5929 -17 -127 74 36 106 98 -34 111 202 51 55 25 2 214 39 43 -44 -73 -83 2 142 11 -152 6 63 -57 -81
5955 -81 -11 185 -2 126 -46 -156 -111 108 125 -78 73 -103 192 237 -2 -28 118 161 67 79 -70 166 -95
5978 -95 93 80 -244 -214 56 -177 -79 -1 -260 28 26 68 0 -107 86 140 -57 -225 -136 257 115 -211 -89 -189
6002 -189 -22 -127 169 -18 -120 -45 -22 202 -21 -109 216 49 83 20 -166 107 113 -80 -43 -146 -231 -2 97
6025 97 -151 66 -123 -41 -285 261 50 74 75 -75 -1 -27 224 -222 -148 -253 239 -25 32 108 -102 -84 -13 -68
6049 -68 232 2 262 210 170 -97 -231 81 114 -127 31 -57 -283 -17 152 121 -223 -89 2 48 -62 -21 -66
6072 -66 44 -132 -219 -52 -317 -181 7 24 13 13 4 236 -61 -229 98 -23 136 26 46 6 75 42 -75 -100
6096 -100 62 -126 162 8 259 81 -299 199 47 72 92 -97 -1 34 47 0 230 255 46 95 383 -48 74
6119 74 81 244 -25 -186 24 18 242 41 -121 102 -126 22 -133 -113 54 -23 147 25 21 -95 186 -38 -13
6142 -13 94 -61 -71 39 123 -67 77 -15 179 147 -116 24 17 52 56 -87 148 -43 -48 132 -121 222 -279 4
6166 4 105 92 44 -265 54 0 329 -3 -285 -66 -105 111 116 -174 -41 -178 100 -80 125 -185 -4 -8 17 44
6190 44 364 207 -55 -74 -187 -101 -47 12 -105 32 262 -95 -83 -190 -305 -81 -96 -354 -8 -225 149 24
6212 24 -8 69 -25 66 -79 -26 37 36 -125 -27 -98 -1 141 -339 33 47 -113 4 -77 9 178 -2 -68 -8 29 -26
6238 -26 -51 -173 -20 189 182 -27 55 174 92 15 -110 18 73 -116 -12 -35 156 25 -142 -216 90 63 19 80
6262 80 -9 65 64 -196 -71 -238 34 215 161 275 113 19 126 -84 84 -2 -5 -108 179 -117 -229 73 289
6285 289 -62 7 -53 18 -85 -3 211 24 -50 66 -55 77 84 108 14 135 -15 -120 74 -80 -132 -27 255
6308 255 34 -123 -115 20 111 233 -86 45 -159 65 106 81 34 248 52 91 309 -86 -64 23 148 61 -271
6331 -271 193 -20 142 76 27 288 -3 -147 115 -25 -116 -27 72 162 -26 185 -76 -34 -160 -193 26 -189 -197
6354 -197 88 181 -55 -167 133 201 -61 156 -26 -140 -165 9 158 167 -65 351 60 -340 -2 -117 146 -25
6376 -25 -93 195 220 64 139 62 14 -200 148 77 200 28 311 -46 -263 -41 -77 84 -82 70 177 51 239
6399 239 56 -268 -55 18 -159 132 -172 -172 -33 267 -103 -200 91 -84 -145 207 -43 -158 -173 -14 -45 396
6421 396 -139 -33 82 175 87 -35 28 -75 163 -301 33 91 -94 -43 -106 36 -72 -147 73 162 219 33 -8
6444 -8 30 147 55 36 -231 304 62 -79 81 -18 -156 -115 -56 -111 -13 -108 20 47 191 79 73 -118 228 165 -155
6469 -155 40 173 31 -105 -27 -206 135 278 23 4 -110 -94 27 233 330 -246 -111 -180 75 -8 -27 -12 3
6492 3 248 -147 102 6 45 -88 -103 -136 78 142 157 329 71 -11 -50 28 121 247 78 38 -59 -50 244 -139 49
6517 49 83 17 64 38 216 -102 74 -59 -129 -4 30 141 -169 46 -43 -97 -200 61 111 -292 265 41 26 -170
6541 -170 -40 83 288 137 -16 -141 110 -4 79 -31 42 2 -87 -32 -30 159 91 -94 -36 281 47 305 31
6564 31 -192 54 102 -116 128 79 -152 167 -90 4 191 45 131 -146 8 5 80 -105 100 38 -34 -36 169 -12
6588 -12 203 -17 -30 39 -92 207 -52 -269 106 9 135 -189 -120 144 -68 90 -98 71 107 -261 249 -61
6610 -61 -114 -149 -123 -160 -18 -36 -65 153 -52 174 78 15 -154 -231 81 104 -117 67 -59 62 14 -69 59 35 67
6635 67 120 -73 30 -264 -50 -103 -89 203 -39 123 -124 -57 -152 326 -77 -40 24 40 -7 -195 -4 -205 -116 57
6659 57 -120 -44 29 56 310 19 71 -185 69 34 -70 -82 44 4 130 197 107 -197 -63 -151 69 263 91 -153
6683 -153 221 -19 23 -60 219 -151 -47 56 -92 -58 1 -99 105 191 -51 -139 12 -42 -79 -128 -38 -118 -99 11
6707 11 -225 -183 43 -79 -66 -232 -143 12 -227 208 233 -81 77 -86 -148 85 25 -88 -219 -104 163 60
6729 60 184 43 131 -45 -105 55 -81 -39 -34 90 -41 -97 -45 126 -113 -15 99 -40 77 -4 -97 229 -105 77
6753 77 -152 119 204 -184 -75 152 -136 -84 -49 73 10 55 -70 41 60 -151 49 -80 -300 48 -12 105 55
6776 55 173 -184 -255 87 244 29 -90 -33 88 221 124 -109 -20 -95 -200 -71 -75 26 -141 2 -128 306 58
6799 58 -101 -359 66 -34 180 22 52 53 386 -75 -160 -99 27 -4 125 123 105 -12 -57 38 18 -82 24 -25 266
6824 266 -219 19 69 127 -162 -51 -244 -175 -176 7 16 -257 27 82 -9 -73 173 -151 11 -24 -24 -75 -47 181 14
6849 14 25 -104 -206 58 -71 -72 187 -62 -172 -64 -201 111 -125 63 -25 -91 68 125 -44 -277 -17 184
6871 184 112 -33 47 -21 11 98 -10 -147 -309 130 -82 -54 98 -16 90 -121 236 -132 58 -53 3 2 -20
6894 -20 49 -16 -111 -253 -248 -88 -131 -153 -68 -417 64 -12 113 113 -7 -63 -78 109 -328 227 111 14 -96 -109 -274
6919 -274 -300 -40 137 55 -9 -143 -130 38 68 -141 -127 -35 192 -13 -54 -66 29 8 34 -90 -377 -89 195 -106
6943 -106 140 89 -30 -67 324 188 -77 -43 18 -70 -96 78 1 -72 9 53 14 -130 26 122 -93 318 60 15
6967 15 -84 -66 84 -39 184 198 -144 290 -89 154 167 147 -24 210 -96 139 82 105 -101 241 32 54 -99
6990 -99 -58 53 12 -148 -40 31 -107 -7 -158 -203 98 50 -126 59 104 -72 35 28 37 -102 -51 -117 33 123 383
7015 383 -21 -67 137 -93 -119 82 -97 81 109 -157 13 68 159 -156 24 -155 -34 59 15 -206 -27 -66 340
7038 340 238 42 40 120 72 240 97 75 120 7 33 -80 -94 -243 54 -32 110 99 98 -26 117 112 90 -64 15
7063 15 135 160 -10 234 70 296 16 2 115 31 -200 -249 -109 -31 -76 -64 101 -40 -196 -29 112 96 207
7086 207 43 158 -76 -304 18 174 12 -113 160 -111 5 -57 149 -3 -102 29 -110 -248 -100 -34 -50
7107 -50 130 -56 101 -20 126 29 33 -149 -262 71 -22 1 97 49 -50 -151 -68 -10 -152 -132 -14 370 -45 216
7131 216 149 188 274 87 86 40 -146 -28 -116 -11 257 -140 -90 75 40 -183 -72 -28 -113 -77 74 -118 -31 55 -268
7156 -268 -206 -94 56 223 -34 140 -57 345 -198 26 -30 -232 20 -13 146 -22 -169 58 48 161 149 -185
7178 -185 77 -99 269 -189 98 -117 -251 56 181 -339 -123 192 -254 -33 -112 104 -36 189 42 110 -205
7199 -205 -73 194 -24 85 -135 -35 -89 40 -219 -127 -78 -97 241 140 -43 -64 -142 -117 -76 185 -26 -103 47
7222 47 90 137 130 -85 31 30 -169 86 -147 -161 69 170 99 79 -127 82 -33 -195 -273 -39 68 -97 -145 60
7246 60 -80 -7 -111 -39 -1 -37 -245 23 154 2 -15 32 69 5 -31 205 -22 -119 226 -124 -161 119 -27 -149
7270 -149 -173 248 223 66 154 -57 -72 128 -76 -184 52 170 -157 -20 83 -232 -172 -32 -130 9 -65 187
7292 187 41 107 212 -119 -51 -171 -114 -129 155 -122 179 -72 -160 439 -106 -149 -10 -59 244 2 -199 85
7314 85 -91 78 -13 45 60 65 160 -309 -78 -89 -64 -107 53 32 130 96 92 34 115 -20 -77 -11 253 -43 5 239 -88
7341 -88 -101 185 151 52 -146 44 126 296 104 122 73 1 128 71 13 5 97 -65 -180 -27 -14 -163 13 196 37
7366 37 70 12 168 100 287 102 161 186 -336 -113 117 9 38 -81 34 -155 -280 143 1 36 37 -9 -224 138
7390 138 122 73 -213 -77 29 85 -23 142 1 -44 181 72 -76 197 32 11 112 -186 -56 18 174 125
7412 125 -225 -81 88 15 -73 -195 75 44 -19 39 59 141 71 -36 178 176 -122 -210 71 -91 -45 -97 68 98 -81
7437 -81 33 -144 -133 -89 -96 -2 -173 36 134 -55 52 -109 151 -120 237 62 153 -29 33 -151 -36 190 -20
7460 -20 -126 -252 -132 -337 -133 32 165 237 111 -65 12 167 -197 -44 54 -177 5 -57 -128 -12 -165 -100
7482 -100 -139 65 116 58 19 180 216 74 315 -21 16 -35 -64 -58 -94 140 328 -27 214 -142 171 -57 -71 6
7506 6 12 -129 -40 63 200 -13 -129 -60 -43 44 14 -44 253 24 88 -210 -81 -106 -18 104 204 20 -147 -70 -37
7531 -37 -76 -86 113 -6 -246 -96 127 215 -4 214 -26 2 233 213 130 -198 11 -50 40 -83 -21 -140 197
7554 197 32 -103 1 1 300 137 -14 188 203 23 -164 -40 7 -38 -330 49 -147 133 66 -6 -55 51 58
7577 58 2 -16 -6 6 200 -78 89 -84 -4 1 58 29 102 -39 43 0 197 -223 81 102 -17 37 -193 90 113
7602 113 29 116 84 40 -13 56 64 43 53 174 26 107 30 141 -39 -168 4 -163 94 97 -248 -161 200 68 -223
7627 -223 -414 60 89 -53 -10 -45 -57 17 253 -173 -311 -38 77 142 141 35 76 -92 -202 -57 -144 -196 319 -97
7651 -97 -90 -78 2 6 68 120 18 100 41 96 -26 -125 31 -86 -167 49 179 -102 -103 -86 48 90 71 -6 9 -31 64 250
7679 250 -33 49 132 18 182 254 12 -33 105 121 -51 -50 12 37 -124 111 172 191 183 -92 -138 35 -31 -63 -37 -68
7705 -68 46 -371 -106 -201 -16 155 114 136 -101 -210 37 241 -18 88 -145 140 -41 -8 -149 24 152 -7
7727 -7 48 -199 -29 -58 -109 129 71 -244 -243 25 54 147 124 -177 20 90 93 92 89 -166 137 -271 -120 -93 53 -11 59
7754 59 49 -196 193 -101 -26 10 20 -120 68 154 -13 161 120 -145 -98 -12 60 -65 -107 88 -2 79 8 123 133
7779 133 184 -14 230 224 -83 -143 -126 230 -106 -36 12 -200 -37 -3 191 112 118 -45 -58 -4 -194 -160 -32 211 -158
7804 -158 -6 11 -178 -10 -82 62 -163 -28 -123 21 71 -65 34 217 -42 121 27 -1 132 -132 29 72 -35
7827 -35 44 -183 135 193 -135 -106 -152 276 -100 175 -2 58 43 -122 -58 92 -172 -284 -67 -33 23 21 39 100 -73
7852 -73 -53 208 118 144 38 231 -76 277 -75 -38 78 244 -105 -95 -85 74 172 42 -15 -15 217 137 -46 -83
7876 -83 -125 -33 96 -98 -97 118 -140 74 225 101 -235 -12 -32 128 97 167 60 -80 -130 -50 271 -20 219
7899 219 -88 -18 -324 -64 24 -30 168 -18 -224 -196 83 -99 -88 53 131 -94 295 98 250 -372 27 135
7921 135 -170 -8 63 9 -27 233 220 157 -5 -111 71 303 -169 117 80 -224 -57 -105 -13 -213 -158 -9 28
7944 28 12 -43 197 5 160 160 64 -121 -94 64 -42 33 -30 147 -320 -124 -119 53 308 157 117 28 -17 -105 100
7969 100 21 144 -64 143 -19 -66 -10 -24 -161 167 246 234 -163 -38 -9 48 60 41 0 104 17 96 40 104 191
7994 191 -112 28 40 133 46 -159 -171 187 42 9 -82 72 -81 96 -64 22 -62 308 -44 88 44 63 93 -278
8018 -278 178 -338 51 -169 56 38 85 142 -123 -198 -42 -139 -57 -177 -106 68 280 -36 0 -61 -56 197 -179 -40
8042 -40 318 7 -92 -46 -204 113 218 43 -21 85 131 49 1 -102 -127 -55 67 67 36 -78 -173 241 -144 -58 88
8067 88 170 32 24 188 228 36 -10 171 91 -45 -190 370 18 -34 239 233 11 30 2 106 -16 -161 155 -278
8091 -278 -106 -35 47 -284 109 -86 125 -104 78 -94 -107 106 3 156 -167 -10 79 -102 -69 122 -96 306
8113 306 -141 97 57 12 20 -66 70 178 -227 -67 -90 112 -67 -54 -47 187 -81 -79 -22 -94 43 -37 -138 22 -88
8138 -88 -54 247 81 112 -133 -73 50 297 129 -16 -174 187 132 -103 -171 60 11 3 -183 105 -212 -46 -49 6
8162 6 255 56 -224 -248 56 93 -75 29 32 55 -1 -116 36 154 17 103 234 -30 74 73 18 -205 -222 -143 37
8187 37 261 -29 -82 6
8191F
##END NTUPLES=NMR FID
##END=
