##TITLE=1H_LR-350-C1
 CDCl3
 8 sc, 
 29.11.2023
##JCAMPDX= 6.0         $$ Bruker NMR JCAMP-DX V2.0
##DATA TYPE= NMR FID
##DATA CLASS= NTUPLES
##ORIGIN= UXNMR, Bruker Analytische Messtechnik GmbH
##OWNER= root
$$ XWIN-NMR		Version 3.5
$$ Wed Nov 29 14:14:54 2023 Russian Standard Time (UT+4h)  she@DPX200
##.OBSERVE FREQUENCY= 200.1313
##.OBSERVE NUCLEUS= ^1H
##.DELAY= (6, 6)
##.ACQUISITION MODE= SIMULTANEOUS
##.ACQUISITION SCHEME= undefined
##.AVERAGES= 8
##.DIGITISER RES= 18
##SPECTROMETER/DATA SYSTEM= spect
##.PULSE SEQUENCE= zg30
##.SOLVENT NAME= D2O
##.SHIFT REFERENCE= (INTERNAL, D2O, 0, 15.7039)
##AUDIT TRAIL= $$ (NUMBER, WHEN, WHO, WHERE, WHAT)
$$ ##TITLE= Audit trail, XWIN-NMR		Version 3.5
$$ ##JCAMPDX= 5.01
$$ ##ORIGIN= Bruker BioSpin GmbH
$$ ##OWNER= she
$$ F:/spectra/data/she/nmr/H-F/1/audita.txt
$$ ##AUDIT TRAIL=  $$ (NUMBER, WHEN, WHO, WHERE, WHAT)
(   1,<2023-11-29 14:13:48.00 +0400>,<she>,<DPX200>,
      <created by zg, POWCHK disabled, PULCHK disabled
       configuration hash MD5:
       00 E9 B6 7A A2 85 ED C7 34 08 36 98 17 FE 4E 26
       data hash MD5: 16K
       C6 F4 95 B2 F6 AE 48 8B F6 81 40 3F 76 28 88 3D>)
$$ ##END=
$$ 
$$ hash MD5
$$ F8 89 92 DA BC 31 6D 38 57 64 F9 4C 1C 19 27 E8
##$RELAX= 
##$RELAX= 
##$RELAX= 
##$RELAX= 
##$RELAX= 
##$RELAX= 
$$ Bruker specific parameters
$$ --------------------------
##$DU= <F:/spectra>
##$EXPNO= 1
##$NAME= <H-F>
##$PROCNO= 1
##$TYPE= <nmr>
##$USER= <she>
##$AMP= (0..31)
100 100 100 100 100 100 100 100 100 100 100 100 100 100 100 100 100 100 
100 100 100 100 100 100 100 100 100 100 100 100 100 100 
##$AQSEQ= 0
##$AQ_mod= 1
##$AUNM= <au_zg>
##$AUTOPOS= <>
##$BF1= 200.13
##$BF2= 200.13
##$BF3= 200.13
##$BF4= 200.13
##$BF5= 200.13
##$BF6= 200.13
##$BF7= 200.13
##$BF8= 200.13
##$BYTORDA= 1
##$CFDGTYP= 0
##$CFRGTYP= 5
##$CHEMSTR= <none>
##$CNST= (0..31)
1 1 145 1 1 1 1 1 1 1 1 1 1 1 1 1 1 1 1 1 1 1 1 1 1 1 1 1 1 1 1 1 
##$CPDPRG= <>
##$CPDPRG1= <>
##$CPDPRG2= <>
##$CPDPRG3= <>
##$CPDPRG4= <mlev>
##$CPDPRG5= <mlev>
##$CPDPRG6= <mlev>
##$CPDPRG7= <mlev>
##$CPDPRG8= <mlev>
##$CPDPRGB= <>
##$CPDPRGT= <>
##$D= (0..31)
0 1.2 0 0 0 0 0 0 0 0.06 0 0.03 0 0 0 0 0.0002 0 0 0 0 0 0 0 0 0 0 0 0 
0 0 0 
##$DATE= 1701252827
##$DBL= (0..7)
120 120 120 120 120 120 120 120 
##$DBP= (0..7)
150 150 150 150 150 150 150 150 
##$DBP07= 0
##$DBPNAM0= <>
##$DBPNAM1= <>
##$DBPNAM2= <>
##$DBPNAM3= <>
##$DBPNAM4= <>
##$DBPNAM5= <>
##$DBPNAM6= <>
##$DBPNAM7= <>
##$DBPOAL= (0..7)
0.5 0.5 0.5 0.5 0.5 0.5 0.5 0.5 
##$DBPOFFS= (0..7)
0 0 0 0 0 0 0 0 
##$DE= 6
##$DECBNUC= <off>
##$DECIM= 32
##$DECNUC= <off>
##$DECSTAT= 4
##$DIGMOD= 1
##$DIGTYP= 9
##$DL= (0..7)
0 120 120 120 120 120 120 120 
##$DP= (0..7)
150 150 150 150 150 150 150 150 
##$DP07= 0
##$DPNAME0= <>
##$DPNAME1= <>
##$DPNAME2= <>
##$DPNAME3= <>
##$DPNAME4= <>
##$DPNAME5= <>
##$DPNAME6= <>
##$DPNAME7= <>
##$DPOAL= (0..7)
0.5 0.5 0.5 0.5 0.5 0.5 0.5 0.5 
##$DPOFFS= (0..7)
0 0 0 0 0 0 0 0 
##$DQDMODE= 0
##$DR= 18
##$DS= 0
##$DSLIST= <SSSSSSSSSSSSSSS>
$$ [...]
##$SUBNAM2= <"">
##$SUBNAM3= <"">
##$SUBNAM4= <"">
##$SUBNAM5= <"">
##$SUBNAM6= <"">
##$SUBNAM7= <"">
##$SUBNAM8= <"">
##$SUBNAM9= <"">
##$SW= 18.0517328524113
##$SWIBOX= (0..15)
0 0 2 0 0 0 0 0 0 0 0 0 0 0 0 0 
##$SW_h= 3612.71676300578
##$TD= 16384
##$TD0= 1
##$TE= 0
##$TE2= 300
##$TE3= 300
##$TEG= 300
##$TL= (0..7)
0 120 120 120 120 120 120 120 
##$TP= (0..7)
150 150 150 150 150 150 150 150 
##$TP07= 0
##$TPNAME0= <>
##$TPNAME1= <>
##$TPNAME2= <>
##$TPNAME3= <>
##$TPNAME4= <>
##$TPNAME5= <>
##$TPNAME6= <>
##$TPNAME7= <>
##$TPOAL= (0..7)
0.5 0.5 0.5 0.5 0.5 0.5 0.5 0.5 
##$TPOFFS= (0..7)
0 0 0 0 0 0 0 0 
##$TUNHIN= 0
##$TUNHOUT= 0
##$TUNXOUT= 0
##$USERA1= <user>
##$USERA2= <user>
##$USERA3= <user>
##$USERA4= <user>
##$USERA5= <user>
##$V9= 5
##$VALIST= <valist>
##$VCLIST= <CCCCCCCCCCCCCCC>
##$VD= 0
##$VDLIST= <DDDDDDDDDDDDDDD>
##$VPLIST= <PPPPPPPPPPPPPPP>
##$VTLIST= <TTTTTTTTTTTTTTT>
##$WBST= 1024
##$WBSW= 4
##$XGAIN= (0..3)
0 0 0 0 
##$XL= 0
##$YL= 0
##$YMAX_a= 152563
##$YMIN_a= -211038
##$ZGOPTNS= <>
##$ZL1= 120
##$ZL2= 120
##$ZL3= 120
##$ZL4= 120
##$ABSF1= 10
##$ABSF2= 0
##$ABSG= 5
##$ABSL= 3
##$ALPHA= 0
##$AQORDER= 0
##$ASSFAC= 0
##$ASSFACI= 0
##$ASSFACX= 0
##$ASSWID= 0
##$AUNMP= <proc_1d>
##$AZFE= 0.1
##$AZFW= 0.1
##$BCFW= 1
##$BC_mod= 2
##$BYTORDP= 1
##$COROFFS= 0
##$CY= 11.3945322036743
##$DATMOD= 1
##$DC= 2
##$DFILT= <>
##$DTYPP= 0
##$F1P= 15.7292609196834
##$F2P= 12.9074282941183
##$FCOR= 0.5
##$FTSIZE= 0
##$FT_mod= 4
##$GAMMA= 1
##$GB= 0.15
##$INTBC= 1
##$INTSCL= 1
##$ISEN= 128
##$LB= 0.24
##$LEV0= 0
##$LPBIN= 0
##$MAXI= 10000
##$MC2= 0
##$MEAN= 0
##$ME_mod= 0
##$MI= 1.114404
##$NCOEF= 0
##$NC_proc= 0
##$NLEV= 6
##$NOISF1= 3.799351
##$NOISF2= 2.8
##$NSP= 1
##$NTH_PI= 0
##$NZP= 0
##$OFFSET= 15.70392
##$PC= 1
##$PHC0= -24587.83
##$PHC1= 9.4527
##$PH_mod= 1
##$PKNL= yes
##$PPARMOD= 0
##$PSCAL= 0
##$PSIGN= 0
##$REVERSE= no
##$SF= 200.130013532006
##$SI= 16384
##$SIGF1= 3
##$SIGF2= 2
##$SINO= 400
##$SIOLD= 16384
##$SREGLST= <1H.CDCl3>
##$SSB= 0
##$STSI= 0
##$STSR= 0
##$SW_p= 3612.71676300578
##$SYMM= 0
##$S_DEV= 0
##$TDeff= 0
##$TDoff= 0
##$TI= <>
##$TILT= no
##$TM1= 0
##$TM2= 0
##$TOPLEV= 0
##$USERP1= <user>
##$USERP2= <user>
##$USERP3= <user>
##$USERP4= <user>
##$USERP5= <user>
##$WDW= 1
##$XDIM= 8192
##$YMAX_p= 0
##$YMIN_p= 0
$$ End of Bruker specific parameters
$$ ---------------------------------
##NTUPLES= NMR FID
##VAR_NAME=  TIME,          FID/REAL,        FID/IMAG
##SYMBOL=    X,             R,               I
##VAR_TYPE=  INDEPENDENT,   DEPENDENT,       DEPENDENT
##VAR_FORM=  AFFN,          ASDF,            ASDF
##VAR_DIM=   8192,          8192,            8192
##UNITS=     SECONDS,       ARBITRARY UNITS, ARBITRARY UNITS
##FACTOR=    0.0002768,     1,               1
##FIRST=     0,             0,               0
##LAST=      2.2672688,     0,               0
##MIN=       0,             -211038,         0
##MAX=       2.2672688,     152563,          0
$$ Real data points
##PAGE= N=1
##DATA TABLE= (X++(R..R)), XYDATA
0@%%%%%%%%%%%%%%%%JnJ2j6J6j6J6j8K6l2L2l8M6n2O0o8P6q4R6j09J19j30J45
39G7j65J86k05K24k48K74l02L35l69M07m48M91n40N98o62P31q10R01j008J136
59F03j289J474j707K008k414K988l859N327q204J5743o8547j53161K41922J02642
73A33526j81979L6357J64659j31782j45618J10872K0955j26390Q7782J48634r7248
84A9768q0414J07901j6209j19646Q3939J09467j11565n8651J11626k2442j19655
95i5881O8824J00497p4955j9871J02475m8136j25261O7208Q9364q6737l2327J06065
107E1265r916j02090L4167O1618n7482q375Q6417j5753p8719K8530L4435n4882
119c0785L297P1756k0824n2847M1153J9216o6134p85O6730j2698m1912L1722J0325
$$ plain form
0 0 0 0 0 0 0 0 0 0 0 0 0 0 0 0 0 0 1 -4 8 -8 8 -8 8 -10 16 -16 16 -22 24 -28 32 -36 40 -44 52 -57 62 -68 77
39 77 -88 98 -107 117 -131 143 -159 176 -193 214 -234 257 -283 315 -347 384 -426 475 -533 603
59 603 -686 788 -919 1089 -1325 1663 -2196 3131 -5073 10670 -57877 -211038 30884 133526
73 133526 -48453 -12096 152563 20781 -124837 -13965 6990 -119400 -31618 117016 19768
84 19768 -60646 47255 31046 -88600 -4661 104806 -6759 -65410 46216 23774 -95881
95 -95881 -27057 73440 -1515 -21386 81089 32953 -92308 -25100 64264 -22473 -54800 51265
107 51265 41349 -60741 -26574 35044 -22438 -30813 55604 39851 -38868 -10338 24097 -30785
119 -30785 -27488 44268 23444 -29403 11750 30966 -35168 -35953 30777 18079 -23833 7889 18214
132A8214n2007O661N1174j8712k8329M0212J2744m8930j405L8135j4633j9221
144a6097L3032P574l8581P01K6679j6297j4990K8254O237k7424M238J7529k0149
157i294j0476K8052O427k2118N656J4252j6706q737J9890J974j4980Q698J0407
170A3045j7625p900J5642M11j1738J0096Q264j4352n091J2826j865j0236R311
183G88R342j0409n070R355j608q664O656P619p627l924N964j999o806M379N408
198C404m460j105N218k709n355L679M959l372j242M966q58n571J341L711k371
213B35j446L366l42l965K01J836j698n86L114J21k622M26K426j474j578L341J873
230C228k866p29K325m67k810J417J780j770j192J018l62j863R31J595r45p54J717
$$ plain form
132 18214 -33793 -27132 24042 5330 -22999 17213 29957 -18973 -20378 17757 3124 -16097
144 -16097 16935 24509 -14072 -13371 13308 -2989 -17979 10275 16512 -10912 -6674 10855 -9294
157 -9294 -19770 8282 14709 -7409 -1753 12499 -4207 -12944 6946 8920 -6060 2638 13045
170 13045 -4580 -12480 3162 3573 -8165 1931 10195 -4157 -9248 3578 1713 -8523 788
183 788 10130 -279 -5349 4006 2398 -6266 390 8009 382 -3542 2422 423 -6383 -2004 3404
198 3404 -1056 -2161 3057 348 -5007 -1328 3631 259 -983 3983 3125 -2446 -1105 2606 235
213 235 -1211 2155 1813 -2152 -1951 -115 -1813 -2399 715 836 -1786 -1360 1066 -408 -1986 1355 3228
230 3228 362 -367 1958 1491 -1319 98 1878 108 -1084 -66 -428 -2291 -1360 235 -710 -1464 253
247B53K23j870O07K648q86j317J706P07k385Q9J410k99j931J153N99j860m76J392
265b37k37j520J299J157j003J73R61m13k73J226N99j231k47J485p20j567M16J218
283A086j729q39J181J20j332J26J355k11q94J061P56m44P5P11k53l75M19J59n10
302D62k8J91o11n25J90N7q36o4O36j49k88L43L71N9K09O88m2q6K16j28R6Q5k09
325F37m85l03K37n6r65J1N33q9o23N27J20L57m77O86K78K73j78k5M22k46J13n52
347A95k71J08m1o65Q4M09m92j44J14N41n54mM58L52L1O15J72l23K44P9k76n91
369D1N41l32o34K29J57k92m98K42L7l91K36Q51m09j54O93K75n49J95P39k33o22
390A22N37k32n50K23r0m43n94P69q7n47K80N45m94r2R35J69j66J01N09m76J4O60
$$ plain form
247 253 476 -1394 -787 1861 975 -342 1364 2071 -314 -225 1185 886 -1045 108 707 -1153 -1629 -237
265 -237 -474 -1994 -695 462 -541 -368 593 180 -93 1133 1732 501 254 1739 1019 -548 -132 1086
283 1086 -643 -1482 -301 -181 -1513 -1387 -32 -243 -1137 -76 680 236 311 1022 769 394 813 972 462
302 462 434 625 14 -511 -321 -264 -1100 -1164 -528 -677 -965 -622 -251 -192 17 705 663 577 793 665 761 846 637
325 637 152 -151 86 30 -935 -924 -391 -480 -1103 -576 -456 -99 -576 110 388 661 483 458 880 634 747 195
347 195 -76 32 -9 -674 -590 -181 -673 -817 -703 -162 -716 -720 -262 90 121 736 908 585 829 908 632 41
369 41 582 250 -384 -155 2 -290 -788 -546 -509 -900 -664 187 -222 -376 317 592 43 238 977 744 122
390 122 659 427 -123 100 10 -433 -1027 -258 -345 -892 -612 -67 -561 -653 282 451 285 386 895 419 433 1093
412A093k52p37J45n4q68K82P50r10n02O27L20j063M20J003j87j65O85J73o21L74
432E13K78n18N4P78p37q57L92L58j093J75R93k49j355M84P59o68J75R81o6n87
452a90N39N59r71J92J263r64n54Q86p4j671j17J904j368p32J296K01j565N80J080
471B94m79m12J789J4j597O63J019j173n70J763j28k248R06Q76j703p25K152k3
489D18j711P25R58j309l29K049L31j747J440O71j762l44J762m86j615J459R20
506A430k673j12K094q48j439J674Q22j934j09J695p33j033K133Q50j930l2J625
523A480j417j069J873N62j930JJ472j648j505K307Q78k263L66J831j108j413K035
540D52J50r97Q02J357j491j337J775n3j522Q06J450k004q09J543j96j836J450
$$ plain form
412 1093 841 104 249 195 -673 -391 359 -551 -1053 -426 -106 -1169 -749 254 67 -98 587 760 139 513
432 513 791 273 327 1105 368 -489 -97 261 -832 -657 336 87 -1268 -784 -25 -693 -518 463 397 -190
452 -190 349 908 -63 129 1392 428 -126 760 686 -985 -1102 802 -566 -1298 -2 199 -1366 -786 294
471 294 -185 -597 1192 1206 -391 272 1291 118 -452 1311 1183 -1065 -159 717 -986 -1711 441 418
489 418 -1293 -568 390 -919 -1248 801 1132 -615 825 1496 -266 -610 1152 666 -949 510 1430
506 1430 -1243 -1355 739 -109 -1548 126 948 -986 -1095 600 -133 -1166 967 1817 -113 -145 1480
523 1480 63 -1006 867 1429 -501 -500 972 -676 -2181 126 1004 -1259 -893 938 -170 -1583 452
540 452 602 -395 407 1764 273 -1064 711 658 -864 -58 1392 -612 -1421 122 -74 -1910 -460
557d60J465j336o10J854q14j399J732J207j441m29J633p87j998J791Q84j807J82
574c33J134r87j703J186J035j401L54J754r32j215J274N75j404Q16J362q93j298
591f76J352j9j763O88J527j237j128J346L5j671O75J627q85p43J739k57j294M80
609b04J208j204j49J686m09k040Q76R69j218l53J574l13j757N85J168j320o4J739
627G74l30r53O02P40j188Q5J464l50j184Q22N94j865j20J535o45j047J194N02
645F30j514k84J381k77l70P35N88j255J27J286n98q11J272O8j240N0N04o15m22
664g45R01K62r32m2O64m14n41J205K57p98M62N80r39k36R43j27n00L73K86r13
684b54o31J028j19q79Q55J24q09j8P15j2l97N57N10p75L93M90m20p57Q11K62q01
$$ plain form
557 -460 1005 -331 -941 913 99 -1300 432 1639 198 -231 1402 615 -1383 408 1292 -515 -333
574 -333 801 -186 -1889 -703 332 -1069 -715 1039 107 -1108 166 741 -663 153 1515 622 -676
591 -676 676 657 -1106 -418 1109 -128 -1256 90 125 -1546 -871 756 -129 -872 867 610 -684 -204
609 -204 1004 -200 -349 1337 928 -1112 -236 733 -485 -838 736 423 -1334 -749 419 -901 -965 774
627 774 444 -509 93 833 -355 -270 1194 844 -340 482 1076 -789 -909 626 -19 -1066 128 630
645 630 -884 -1168 213 -64 -434 301 889 -366 -239 1047 449 -362 910 978 -262 -212 292 -323 -745
664 -745 156 418 -514 -556 108 -306 -847 358 615 -183 279 859 -80 -316 627 500 0 373 659 -254
684 -254 -885 143 24 -855 0 124 -685 -703 12 0 -397 160 670 -105 288 778 358 -399 412 674 -127
705a27k83N92m30l28K22L97m03j79P68m60l68P70J28n47M88L98o31O4L49o9n92
726b41K85L94m75m29M42K6k26j72M57k48l46M12J68j73K78J03k59o9M90J9l62
747G4J58k5n09J32K08k19k97k9K66O3m02M66j0K64l51K43j74N47qj70rJ93O5o29
771a53K36n1j39k22J68p2J43l78L87QJ8O0J8R4M8J82l36J1L47K08k83k21J30l14
795a11m9L38j48l28k08K22ll9K9O9L43O3k57P8L63r6r4N5K51n55J94O0p7q2j11
820i3q9N1m0K9m4LR9k26J90j07K33L44M4j29l0P4k52J22j83q4lr6Nr2K15j19j51
847c29J19PPK33j05K63j70L88n7k62N5J02p4k53J99j08j3m46L76l22Q2N8j4J41
871a23M0j65L87JJ05m0j5j42J18J04j25j88J11k77lO4Q7m5k58l6M24j26K6K15
$$ plain form
705 -127 -410 182 -248 -576 -354 43 -360 -539 229 -231 -599 171 299 -248 240 638 7 71 420 351 -241
726 -241 44 438 -37 -466 -24 2 -224 -396 61 -187 -533 -121 47 -126 152 255 -4 -73 417 436 74
747 74 232 207 -302 -170 38 -181 -478 -507 -241 -178 -580 -114 -124 140 -211 32 -142 405 397 227 218 411 476 -153
771 -153 83 32 -107 -329 -161 -233 -90 -468 -81 -73 -55 5 23 117 165 347 11 22 369 577 294 73 203 -111
795 -111 -160 178 30 -298 -506 -284 -287 -326 -297 -228 115 178 -79 -1 362 266 172 227 478 -77 117 177 100 18 -93
820 -93 -182 -131 -171 -142 -186 -183 -84 -310 -120 -227 6 350 394 265 235 309 57 179 -4 -88 -91 -187 -182 -274 -59 -178 -329
847 -329 -210 -203 -196 37 -68 195 25 413 356 94 149 251 177 -76 123 15 2 -444 -68 -390 -308 -250 -264 -123
871 -123 -83 -248 139 140 245 205 190 48 166 270 145 -43 68 -209 -212 -148 -61 -106 -364 -400 24 -102 -76 139
895A39l50j7M23k58K17k6Q9MJ2l6j23l00K02k23R5p3R1j52p9L49j73K55Pj4o5
920fl9J18L12n99L90M2k14r1K03l70J15qK00j26m50L90l8n0L10O3k57K64Lk0j73
945c1N74l72K0l8K90o40k75M42J11k94J61j70p8o4K18K53k98m7N28o5k16J28R0
968B27j50K65o7l42n6J69k25l00L90K08m15p3M26j07l02O81k58n3j40K45m1j19
990c7K33K80l88mj39o0p8J35rk27J28k4q1J44J7J2K9J23M3j73J1P7L44k58J13
1015B11Rj24MR6m08k02K00O5Q6j79M12k67j20L41k10P0J32K78l43J62k56L94k14
1038A37J5n3j39Q7j61r8O9m6J6J50m61M30l6o6J3L14j71L14O4j20j74K5N9M9l19
1063a02K90L3n46K10J83k45O0J78qJ20k39J01l13M18J29J68l19m1K86m23J8J61
$$ plain form
895 139 -211 -228 195 -63 154 128 217 221 233 197 74 -226 -24 -247 -152 -225 -134 -286 -365 -16 -189 66 73 59 -6
920 -6 -45 73 385 -214 176 218 4 -87 116 -254 -139 -147 53 -73 -523 -133 -171 -221 89 152 -105 159 162 142 -31
945 -31 543 171 191 153 443 -197 -472 -30 81 -213 -52 -222 -300 -364 -146 107 -191 -238 290 225 9 137 227
968 227 77 342 275 -67 -123 46 -179 -479 -89 119 -296 -369 57 -50 -352 329 71 18 -122 123 82 -37
990 -37 196 476 88 84 -55 -115 -193 -58 -67 -294 -166 -190 -271 -127 -110 -98 -69 54 97 -76 -65 12 356 98 211
1015 211 220 96 100 196 -212 -414 -214 -149 -63 -242 170 -97 -217 124 -86 -16 116 394 51 213 -43 351 137
1038 137 152 99 -40 47 -114 -212 -143 -189 -173 -23 -484 -54 -90 -156 -143 171 0 314 378 258 84 109 168 217 -102
1063 -102 188 221 -325 -115 68 -177 -117 61 53 173 -66 35 -278 140 269 437 118 77 363 -60 -42 119
1085A19Q3k31j23K49m50MJ36M30l92j19M04j93J92O3j18j00M63K4m21J55l21J37
1107ik39L94o7n4k30P3M4k01J95M4n2K64J98k42k01K13J04j44l9P5k17J19Ok90
1131b56K51j14l18M51l92J92O4j48K86Q2k4Ro5K2J07j55J06L7k40J89m09J74L6
1154a15M8M7m5j86QK23k32J70L3p1K00P7m07M04K19l79r3L64k7l82KJ17k61K91
1178EK0lj66q3J1K09J27oj37J51m4L28n04J83j72K06%j34P0J48N0l63J28l3j49
1203a58pQ2M7k5nL7M03j81k8n9l50M04%K4k1j94O9j91N0j06O0J25k09J68lm7J70
1230E5m8J02Q8R9J79m30l2J96l79K56n3J00k87J67k17M9k2j01Q5K74p6J91k86
1253i0P9J23j19L96l72j9K35j41L5o6j48L7k50L18j05n0K50k73K16N7k12J48j10
$$ plain form
1085 119 202 -29 -152 97 -353 -349 -213 217 -175 -294 110 -83 109 172 54 -46 417 441 20 175 -146 -9
1107 -9 -248 146 79 25 -205 -132 -88 -289 -94 -50 -102 162 360 118 -83 130 234 90 51 126 -91 28 34 -256
1131 -256 -5 -119 -437 14 -378 -186 -122 -270 16 98 74 83 18 40 147 -8 98 135 -105 84 -325 -151 -115
1154 -115 -67 -20 -65 -251 -243 -20 -252 -82 -49 -120 80 157 -250 154 373 -6 -99 265 238 -144 -142 -25 -286 5
1178 5 25 22 -144 -227 -216 -7 120 114 -23 128 84 412 -92 91 -81 125 125 -9 61 209 259 -104 24 -9 -158
1203 -158 -165 -83 -36 -61 -66 -29 374 193 165 106 -244 160 160 184 163 -31 38 -153 -103 -209 -149 -24 -233 -65 -68 -115 55
1230 55 7 109 197 296 475 45 13 209 -170 86 33 133 -154 13 -204 -155 -177 -278 -193 81 5 196 -90
1253 -90 -11 112 -7 389 17 -2 233 92 127 61 -87 -50 -300 18 -87 -137 113 -160 56 113 -99 49 -61
1276f1M3P0L93j37m05K85k83Q6O2j76r4K5K18j00M5J8j17Qn3r5K12K83K8j04P2
1301B23oK7j19K03n11Q6J00m5l8K13j26k96K28j69J49K26j66l0Q2m6J91k48M19
1324C47j80P%Qq5R1k14J67k95Lj36N0M7J70K3O6k38l6K69O9p4N8k5j39K49o3j90
1351e1J16J68m74J88J18j49j3j7J59k57L67k48J94M3%K14k97j24K3K59j00J04
1373B23j55j40R6J04l15N8j30K97j16M3O8J17k88p1N38j89m2J53M2j08k63N1J69
1396A42r0l24L08j55O8n5L09k76K17k18M7J27j03r6O9K72k39j15L33j87J9l3k35
1419b15K93j48J02j69k35K41k21k09N23p3q4N0K53R7k1r1m4J84k31oj20N8K43
1442A77m2P3l12O5Pm6J10k38K13Qm0J60k33r7L45Km7L41k56q1j23J66j55q1J66
$$ plain form
1276 -61 -18 52 445 308 -97 188 -95 -9 53 -123 -217 -192 26 -74 -29 -11 -128 -120 -173 -268 -56 227 255 151 223
1301 223 217 244 125 328 -183 -97 3 -42 -80 133 7 -289 -61 -230 -81 145 -21 -51 31 -15 176 -72 347
1324 347 167 174 174 182 97 188 -26 141 -154 -151 -287 -237 -190 -20 3 69 -169 -205 64 133 59 117 92 -47 202 139 -51
1351 -51 65 233 -241 -53 65 -84 -97 -114 45 -212 155 -93 101 144 144 358 61 -63 -40 219 119 223
1373 223 68 -72 24 128 -187 -129 -259 38 -78 -35 33 150 -138 -209 329 140 98 251 293 185 -78 -27 142
1396 142 52 -272 36 -119 -51 -106 203 -73 144 -74 -27 100 -3 -99 -30 242 3 -112 221 34 53 20 -215
1419 -215 78 -70 32 -137 -372 -131 -352 -561 -38 -111 -195 -145 108 205 184 93 49 233 2 -4 -124 -66 177
1442 177 135 208 -104 -39 -32 -78 32 -206 7 15 -25 135 -98 -195 150 152 105 446 190 109 -14 152 -3 -84 82
1467H2J20k57j91J89K0p4j02R2L01Q3k11J05J6O1K24l09J1Q2nk77j35K90q6J13
1491A42o2l35MK55o9P2J01kJ96l30k8L12k01J63Rk83k6K48k08J12p8M0j81J28
1515b1p3j15K91k20M0j22M41nl08J60l3km1J49J12j59k02J6Q8q3j6N4j69O8K28
1540G8j51J47k08L49r8p9J58p6j53j02K5J55K67m02r6p9J32K28k99J69J30m5j45
1563i5K70j1k37R1J16K57l43j55l9K69j68Q6j04J72j42k32l6J44K30k7J51q9j84
1586g6LJ93o7J56K38k71J00k58m1O4J7l2q8J60J25k07l92L06q8K26j10k53K83
1609a2K00M8l22K25j15J89k49j18J84j4J39l80J09JJ75j17n7M0J66r3K8J50k15
1632c8Pp6p4K29J17Q4Q8r6k03J0K9j48K8l55K11L75m32J62m7J9k0J12M7r9J22
$$ plain form
1467 82 202 -55 -246 -57 -37 -111 -213 -121 180 263 52 157 173 234 458 149 160 242 237 -40 -175 115 29 142
1491 142 80 -255 -251 4 -65 7 108 106 302 -28 -56 256 55 218 227 -56 -82 166 -42 70 -8 32 -149 -21
1515 -21 -94 -209 82 -138 -98 -220 221 216 -92 68 35 33 -8 141 253 94 -108 -92 -4 -87 -103 -49 -218 -150 78
1540 78 -73 74 -134 215 117 38 196 120 -33 -135 -110 45 312 -90 -186 -265 -133 95 -204 -35 95 50 -95
1563 -95 175 164 -73 18 134 391 48 -107 -146 123 -45 41 -63 109 -33 -265 -301 -157 73 46 197 108 -76
1586 -76 -73 120 53 209 447 176 276 18 -23 41 58 26 -62 98 223 16 -376 -70 -158 68 -42 -295 -12
1609 -12 188 236 -86 139 24 213 -36 -154 30 16 155 -225 -116 -115 60 -57 -114 -74 92 -1 27 177 -38
1632 -38 -31 -107 -181 48 165 249 337 241 38 48 77 -71 -43 -398 -187 188 -244 -82 -129 -110 -130 -18 29 -70 52
1657E2q4O2o3K08j89K89k43J73k89J68R4R6m48R2L36n10o4L90j14j95J35J91j54
1680f7j06L15n5Q4J15k14po1k3n9K3j72M9J93K15l8l99O4P1J82N4l13K93P4M3
1705B61j44N9j81j9K70k16r5K5K43l38K32k36P4O7J60j57J14m7q8J20q2j55L23
1728A90j34R9J61k42k79K45j65L9qJ19J9k58K10L8j39K7J89m0j52J64p4l18K50
1751e9K54K4j52k56K73l72M09j66N6k91K02J59m33L77O1j39O8j05K46j94p8J98
1773H2j93L23r4m4o7K07l52J08j74J62L1J82k27j53q8K46K45n8k30o3K43Q5o5
1796A06j14J45m09J65mk62l3J77K44j85J84J4k08K12j21J02rj1Q3Qk06L59n21
1819b84K04J81r5J43J76l98J90q6M3j01k86K20K25k04K04l93O08j47j09R5l01
$$ plain form
1657 52 -32 30 -33 175 -14 275 32 205 -84 84 178 274 -174 -82 254 -256 -320 70 -44 -239 -104 87 -67
1680 -67 -173 142 87 171 286 72 65 4 -19 -78 -55 -227 -178 15 230 192 -207 -143 -72 110 164 -149 144 218 261
1705 261 117 176 -5 -24 246 30 -65 -40 203 -135 97 -139 -65 2 162 5 119 72 -16 104 22 -133 190
1728 190 56 155 316 74 -205 40 -125 -86 -94 25 44 -214 -4 34 -105 -78 111 71 -81 83 9 -309 -59
1751 -59 195 219 67 -189 84 -288 121 -45 11 -280 -78 81 -352 25 86 -53 15 -90 156 -38 -116 82
1773 82 -111 212 118 74 7 214 -138 -30 -204 -42 -11 171 -56 -209 -297 -51 194 136 -94 -157 86 171 106
1796 106 -8 137 -272 -107 -111 -373 -406 -229 15 -170 14 28 -180 32 -89 13 4 -7 76 84 -122 237 -284
1819 -284 -80 101 6 149 325 -73 117 31 74 -27 -313 -93 132 -72 132 -261 347 200 91 186 -115
1840a15j57L63l88L44j71J48n6k63K42L0p7mJ10o8O5J4j10QO9j1K79j06k2j33
1864ij6j32J01q4r8M76j96j29o1K84k43K15k46J01N2j38J60N3nj34J07j16J80
1887A22k97N60l37J3p6m4P1j62M8J98k15J99o0J30k76L33Q5l11j3MJ42j93J66
1910H7j35R1l0J03k44J39J08l10J72l33j4J99M44l28j72N53j35k55J84l43L51
1931A32o2Q6l62O4L81j81p2k15k4l6J73r4L71p7r5K05R4j63l6K9j21M1l4k66K12
1956e0N2q1l0qJ43K1p4j03K05R2l97K33K9j20J89k18J61k7K47l70L47m96M07l50
1980a98M77m27K92k41M8K21j22j07j15J50n2j7J41k1L39l77P7q6J19J56j69j84
2002i6j85L06J17k72Q1j39J17L3k37L74l8Q0l78L27l8p6K33j73N2J9M7j28l00
$$ plain form
1840 -115 -272 91 -297 47 -124 24 -32 -295 -53 -23 -100 -104 6 -62 3 17 -93 -85 -16 -27 252 146 124 -9
1864 -9 -25 -157 -56 -140 -238 238 42 -87 -148 136 -107 108 -138 -37 15 -123 37 90 85 -49 58 -58 122
1887 122 -175 385 48 61 -15 -59 12 -150 -102 96 -119 80 20 150 -126 207 292 -19 -32 -28 114 -79 87
1910 87 -48 43 13 116 -128 11 119 -191 -19 -352 -366 -167 277 -51 -223 330 195 -60 124 -219 132
1931 132 70 156 -206 -142 239 58 -14 -229 -253 -289 -116 -210 161 84 -11 194 288 125 89 118 -3 38 4 -262 -50
1956 -50 2 -79 -109 -117 26 47 -27 -130 75 167 -230 3 32 -88 101 -117 44 17 264 -106 241 -255 152 -198
1980 -198 279 -148 144 -97 -49 172 50 -57 -172 -22 -74 -91 50 29 368 -9 68 -18 101 257 88 -96
2002 -96 -281 25 142 -130 -49 -188 -71 -38 -275 99 61 141 -237 90 52 -24 209 36 88 107 154 26 -274
2025b74K62n9R1l5p3O6J88m31N8J05K88m2k32L12k43J97k3k98M6k88N51m75L16
2048Gk12K43j25N8n3J3R6L7J4j77Q5k7J7Q1J45q9j57J39j26L4j09K37k3j52P6
2073C2r4P0k3o2mP8N8j2J02lm0L57k67m04M62j62j5OK03q9k74L2j21j1P5J41j26
2100i1Q8j53K18o6p6M6j8R9J54k33J35j21J09l37rO3J61k7j39M50l37M1K35P0
2124B62l19J49p0J22r5j01K82j73j05l0j50K38J38l15L9J47j84J6K36J78n24K19
2146d0Q9j34J71Q6l5r8R1j89K52j72j2Q5j18O6k7k14J27N4m2K16j31J72l39R9
2170d3K58r5j54j31L57k19O5Q2k08o2J06J75l6q7k90M09n61M31r7J83J40r6L5
2193A62n8j09J62k37P1l4n7J71j61K06o7q4P5Q9k01N9j04K84k37K14j75R8R6r8
$$ plain form
2025 -274 -12 -71 20 -15 -88 -22 166 -265 -207 -102 186 144 -88 224 -19 178 155 -143 -97 -385 166 -309 7
2048 7 -205 38 -87 -29 -82 -69 27 64 78 -99 -14 -41 -24 57 202 113 -44 95 -31 3 -106 131 108 -44 32
2073 32 -62 8 -15 -77 -81 -3 55 43 145 142 102 459 192 -212 250 88 73 79 282 193 -81 -49 -170 -181 -106 35 -91
2100 -91 -3 -156 62 -4 -80 -34 -52 47 201 -32 103 -18 91 -246 -255 -192 -31 -58 -197 253 -84 -43 192 262
2124 262 -57 92 22 144 49 -52 230 57 -48 -78 -228 10 148 -167 -128 19 -165 -149 87 265 -259 -40
2146 -40 49 -85 86 172 137 39 130 -59 193 21 9 94 -24 42 15 -199 -72 -18 -60 156 25 197 -142 -43
2170 -43 215 120 -34 -165 192 -27 38 120 -88 -150 -44 131 95 8 -282 127 -434 -3 -100 83 223 127 162
2193 162 104 -5 157 -80 -9 -43 -100 71 -90 116 49 -35 40 129 -72 -13 -117 167 -70 144 -31 67 163 65
2217F5j4nM7j93o2K87j66j20J47q6k1r3K19KN8J06p5j1J41l58J60k19J62K31k9
2242A73k98L19j58J16L62n30n2R7o0p8J80j83J21k1J56R6l00R5j48j97K65j43
2264a88K98K10l27J08k95L6P9J97L1j83K66k13J38n0k82K11J36j47R3q2k14M37
2286B59o5n6Q8r4n0l32J88O0q2o3J96j44O0q2L08j94P4K25r4k61J75l8J6q7qK33
2312B32j18M2Q7m46J63K7k13Q5J16RJ93j72M2lj26R4N3O0j1M7r4m1n7Q2j03J28
2338G6m0k13M02m28K96k25J07o1nj3N4P0p9K64k07K29k29K45k06J0JQ5j70j17
2362a54J64j00J41P5p7q2J28r6kmJ13R8k01j99L28k14K31P4k29J15k9l51Q0M7
2386a44L03r2n9Jl8K47k02lj03n8n6R7K6l3j5K64k20J65j48p1J81J11j66k6K35
$$ plain form
2217 65 51 46 93 -100 -162 125 -41 -161 -14 -100 -121 -214 5 7 65 171 96 85 226 -132 28 -191 -29 202 173
2242 173 -125 194 36 152 514 -16 -68 29 -31 -109 71 -112 9 -12 144 240 -60 35 -113 -310 -45 -188
2264 -188 110 320 -7 101 -194 -158 -79 118 149 -34 232 19 157 107 -175 36 172 25 118 36 -178 259
2286 259 194 138 226 132 82 -250 -62 -2 -84 -147 49 -95 -35 -117 191 -3 71 296 202 -59 116 78 94 7 -1 232
2312 232 114 156 243 -203 -40 -13 -226 -141 -25 -16 177 5 47 44 -82 12 65 125 114 161 67 26 -31 51 -52 76
2338 76 36 -177 225 -203 93 -132 -25 -86 -91 -104 -50 20 -59 205 -2 227 -2 243 37 47 48 133 -37 -154
2362 -154 10 -90 51 126 49 -33 95 -1 -3 -7 106 204 3 -196 132 -82 149 223 -6 109 80 -271 -191 -144
2386 -144 159 67 8 9 -29 218 16 13 -90 -148 -204 -107 -81 -114 -129 135 -85 80 -68 -139 42 153 -13 -39 196
2411A96k63Q4j6J16k38pL32k42K45j33j96J79J60j98j74K59j55o7N8k7Q8J4k51
2434b36L01Kj52j1J87r0M0j32K6J98k35J46j28J44P4q6L7j45J49L2j49J67k39
2457a00J4J28Km3K68n07J86J05J17m46L5K83l6M2K1k02L28m7k97J11j22L11k23
2480g2j24K13j52J38l78O63l13L44n23J78K42j59j37O7K2NM9M5l33L43k03L3P1
2503A9P8K19m64J05K84l45Pp5M32k19J7j22k1j40L17r4K09k16j28J11j19K84j73
2526c4J51J30l73K4K15j52KJ53k2q2J71j80R8M5r8j54J2J78o4L1L5j16P3j07K09
2551A45k16k95M36J60l04J78q0j24j0m4J16l9N6Rp7J44Q0l94J34J18J23j05R2
2574A03l75K16J2J64n4k31K41N0k63J26l8J40N3j09o9l9l2J15k0p8K09k01R5R9
$$ plain form
2411 196 -67 17 1 117 -121 -128 204 -38 207 74 -122 57 217 19 -155 104 -51 -118 -60 -87 1 15 -236
2434 -236 65 67 -85 -96 91 1 41 -91 -65 133 -102 44 -84 60 134 48 85 -60 89 121 -28 139 -100
2457 -100 -86 42 44 1 269 -238 -52 53 170 -276 -241 42 6 48 69 -133 195 148 -149 -38 -160 151 -72
2480 -72 -196 17 -135 3 -375 288 -25 319 -204 -26 216 57 -80 -13 9 14 63 108 -225 118 -85 -52 19
2503 19 97 316 -148 -43 241 -104 -97 -172 260 41 58 -64 -85 -225 92 -2 207 -9 -137 -26 -145 139 -34
2526 -34 117 247 -126 -102 113 -39 -37 116 94 12 183 3 101 146 48 -106 -94 84 20 51 86 -30 43 -64 145
2551 145 -71 -366 70 230 -74 104 24 -100 -110 -154 -38 -77 -21 -12 -89 55 135 -259 -125 -7 116 11 103
2574 103 -272 -56 -44 120 66 -165 76 126 -137 -11 -49 91 144 35 -34 -73 -105 10 -10 -88 121 -80 15 114
2598A14k56K53k85K91l4J34k45j49P3K09k08K66J9j69J06j16J59l1j23K7k17K20
2620C8R2R2n5k27j17K14m8j02K36o2k30kM2n2J18R4q6k9mO1J76k19O4q7k90M81
2646I8p5K3j1k53J07J99r3J40K56j76k67n6J06j44K97k51RK24k17K85l32j6J00
2669d7n6p1N34p13K24P9J78j50LM2J22k27K62k17j77K83m6R9j24O1o2K8r9j7K39
2694A48J47n78M40j94l1j9J85l05M10k35J28j56J50J33o0p1j7j0k09L62l74j93
2716c49M60j37R9j94Q4k4J57j35J87k16K7K69l83L52L5l69L49j03k29L07k96J35
2738B6N6J17l97j9K02o2N7n3J51Ql39N54l97r1J79J52K50o37K45O9MP3q3N7p6
2763D6j30J9j11JK73k61J95L4j73jJ71m0k7j98K69J35j53n9mJ32r3N3K07m1l82
$$ plain form
2598 114 -142 111 -174 117 83 217 -28 -177 -104 105 -103 163 182 13 119 3 162 131 8 35 -182 38
2620 38 130 222 167 -60 -177 37 -11 -113 123 61 -169 -171 -129 -181 -63 31 -55 -84 -88 -27 149 -70 -6 -93 -383 98
2646 98 23 46 35 -218 -111 88 -5 135 391 215 -52 -108 -2 -146 151 -100 -91 133 -84 201 -131 -147 -47
2669 -47 -103 -174 360 -353 -129 -50 128 -22 -19 23 145 -82 180 -37 -214 69 23 122 -2 59 -3 25 -74 -91 148
2694 148 295 -283 157 -37 -68 -87 98 -207 203 -32 96 -60 90 223 163 92 75 65 -144 218 -156 -349
2716 -349 111 -26 73 -121 -37 -61 96 -39 148 -68 -41 228 -155 197 232 -137 212 109 -120 187 -109 26
2738 26 82 199 -198 -217 -15 -77 -20 -73 78 86 -253 301 -96 -187 -8 144 394 -243 2 71 75 148 65 122 46
2763 46 -84 -65 -176 -175 98 -163 32 66 -107 -108 63 23 -4 -202 67 202 49 -10 -14 118 25 78 285 244 -138
2788a38J31l8J82k37N1j6M9J59l15L47k10o9J91J56j32k4k0L4l90K15P6J66j77
2811ik68K64J08l16L45J70n69L82k53L30k21J69j32l0k30J48M2R6j25J66j97K05
2833G5q0k2K25r9j18j33Q7M3O0p7j41J64k86M57J00o2l23k14L14k67L16Q9J14
2856B22k12K9o3Q4j01J7M2J87n02K50J38j17J42q9r0J7j99K50rj31n3j8R7N9J20
2881G0Jk80K97J49k27K81o3q8j49J1k5j48K35Rk41L38l4k05r5L8m7K87k24k8p9
2906b17L30J34l41J34k03P8O3K8Q6k41L01k18K29j44K5r7O6n9J9r1K4r4J13M40
2930C65m32J52j6j48J67J51j87n5J01q9R2j79JK63m53Q1j25J10K38K76k25k90
2952b02K47k81K46j15K85J5j64J01k13K71j73P0j43p5Q1Q1O3o0J43k33p6k2L47
$$ plain form
2788 -138 -7 -45 137 -100 -49 -65 -16 143 -172 175 -35 -104 87 243 111 87 67 101 -289 -74 2 168 -9
2811 -9 -277 -13 95 -221 124 294 -275 107 -146 184 -37 132 0 -30 -260 -112 -70 26 -99 67 -130 75
2833 75 -5 -27 198 99 -19 -152 -65 -22 38 -39 -180 -16 -302 155 255 193 -130 -344 -30 -297 19 108 222
2856 222 10 39 -24 60 -41 -24 18 205 -297 -47 91 -26 116 27 -63 -46 -245 5 -4 -135 -188 -206 -109 -50 70
2881 70 71 -209 88 237 10 291 228 140 -9 2 -23 -171 64 73 -168 170 136 -69 -164 -126 -173 114 -110 -138 -217
2906 -217 113 247 -94 40 -163 -85 -22 6 92 -149 152 -66 163 19 44 -53 13 -46 -27 -118 -94 -188 -75 365
2930 365 -67 85 69 -79 88 239 52 -3 98 9 101 -78 -77 186 -267 -186 -311 -201 37 313 88 -202
2952 -202 45 -236 10 -105 180 195 31 132 -81 190 17 87 -56 -131 -50 31 94 34 177 -56 -132 -154 193
2975A93j76N6R3l3m7j96J00j14J90j19J11K72r6q9k33Q1oM3n3K44k74L41l73J34
2999D9l4j08K59n5k84J38J32k50L2L11j68m6O7J81Nk03k07K72M9m9L8L2j04P8
3023A35P4k17k17K89j5kk09o1K04J39l06J79j47K07j37J47R8k78J78J8j86J45
3045C8J47m75K99K85k96J10l95M57l26O0L4M7k05K06J11O7m57L16J22j55J46k36
3067a00K26K4L7j94j8O6k12Q5P5N4o4oJ05l0j08j49K56j5K1k16J5J21q4J10J27
3092A26j71L03l55k8M23j88j91J71j40L65j58k49L20l34j32K31r2J74J01k73K00
3113A03j54j69J71J85J58k96O8l04J47n1J88r4K5J73p7j51K56j0k15n9O4n8K50
3136A50M3mj27j51j4J49J40j60m5j95L70r9K52m32R1j5j02Q9J24K8k01J63l0j78
$$ plain form
2975 193 17 73 166 133 86 -110 -10 -124 66 -53 58 330 234 145 -88 -7 -13 30 -23 221 -53 288 -85 49
2999 49 15 -93 166 111 -173 -35 97 -153 -121 190 22 -24 43 224 229 26 -181 91 140 91 129 161 57 135
3023 135 209 -8 -225 64 49 47 -162 -223 -19 120 -186 -7 -154 53 -84 63 161 -117 61 79 -107 38
3045 38 185 -290 9 294 -2 108 -287 170 -156 -96 -62 -15 -220 -14 97 164 -293 23 145 -10 136 -100
3067 -100 126 150 187 -7 -25 41 -171 -86 -11 43 -21 -27 78 48 -60 -209 47 32 53 -163 -148 -27 -111 -1 126
3092 126 -45 258 -97 -125 298 110 -81 90 -50 315 157 -92 228 -106 -238 -7 -99 75 176 -97 103
3113 103 -51 -220 -49 136 294 -2 66 -238 -91 -142 46 -48 -23 150 73 -78 178 168 -47 -106 -42 -100 150
3136 150 193 189 62 -89 -103 46 186 26 -19 -214 156 57 309 -123 -32 -47 -149 -60 64 92 -109 54 24 -154
3160a54L29m6k59o4K22K53j85j75K02m37K20J10l06M25j49j90p1J89n5O6N1N2
3182B8L82m09R6o1J83j82o7q0L37k14J02l19K14J2j60K27J2j35O1M8k10J5Q2j29
3206a67J21J24K48j70j84j08j5N9K6m5M41j2m32j9K17L3j93kJ0l2K49j79k02M54
3230B22l49J46k9j27J70M9K01l55Oj04L07k89M5K4J28j27J91j40J08k0P8k02M1
3253b6j63J05RK37n1N1j48K69j07m22K96N4q2j6j07k3J14k38L59K1j78j10K97
3276A41r9j11K26l14J74q5J06j40j22K10q6K77m49L60J2J9l53K93j12J10p3r2
3298a08R2K1Kq4N6N3j71K34m01K37J00M8pk11M24k62lj25R5n5j10M66k20r3j49
3323a71L39J57l76p8O0j4J38k44L99k18P4n7j08r0K07q3J68j99j83P4K43J24k34
$$ plain form
3160 -154 175 129 -130 -194 28 281 96 -79 123 -314 -94 16 -290 135 -14 -204 -275 -86 -141 -75 -24 28
3182 28 410 1 97 36 219 37 -30 -110 227 13 115 -204 10 22 -138 89 101 -34 27 75 -135 -120 -38 -167
3206 -167 -46 78 326 156 -28 -136 -151 -92 -66 -111 330 318 -114 -133 84 117 -76 -78 -68 -100 149 -30 -232 222
3230 222 -127 19 -10 -137 33 82 283 -72 -66 -170 137 -152 -107 -83 45 -82 109 -31 77 57 135 -67 -26
3253 -26 -189 -84 -75 162 111 162 14 283 176 -246 50 104 22 6 -101 -124 -10 -248 111 132 -46 -156 141
3276 141 42 -69 157 -157 17 -68 38 -102 -224 -14 -100 177 -272 88 100 119 -234 59 -53 57 -16 -108
3298 -108 -16 5 7 -77 -21 32 -139 95 -306 -69 31 79 72 -139 285 23 20 -105 -10 -65 -175 291 71 -22 -171
3323 -171 168 325 -51 -129 -69 -83 55 -189 210 -8 66 9 -99 -189 18 -65 103 -96 -279 -205 38 162 -72
3346g2J7j8R3J20q1j69J54j5R7m52L46N2j17K78k46J18l3L7m21M61k10j27Q0k2
3370a30K21j84J39q7J57j82K20l55K39J23k45J2L60l68M87n68K27RR7j51L6k51
3392a94K41Nj16%K50q4j16J06Mr7K28%N1k08J77j64j18NO2kj8j93J74J0J81l00
3418a16J61j07J59J51j44n0k59K19j24J55j77K04K8j11j58J76R8q2r9j6K70j88
3440a0L8k85K46o4j82K03J77K07l97J08J8l80K81J30l88M06j54m7J04J47l48O6
3462a24K47j78J02j21K71q8j48J80l74M37p3P5l31N1P4K63k39m5J3k4r8N4m5J14
3486gk26K56k0K9J45o6k71J03l0J16l2r0M11n80N02k38J41k26K4J80j25j03o4
3509a71R6L21k80J74K4J11l44J00j42J94j21J4j00M6J76k33J57J19k88L53j95
$$ plain form
3346 -72 -55 -73 20 140 59 -110 44 29 126 -326 20 72 -45 233 -13 105 72 109 -312 149 -61 -188 -108 -130
3370 -130 91 -93 46 -41 116 -66 154 -201 38 161 -84 -72 288 -80 407 -161 66 75 172 21 57 -194
3392 -194 47 52 -64 -64 186 102 -14 92 96 -1 227 227 278 70 247 83 -35 -30 32 30 12 -181 -7 3 184 -116
3418 -116 45 -62 97 248 104 54 -205 14 -110 45 -132 72 100 -11 -169 7 105 23 -76 -92 178 -10
3440 -10 28 -257 -11 -75 -257 -54 123 330 -67 41 59 -321 -40 90 -298 108 -46 -93 11 158 -190 -124
3462 -124 123 -55 47 -74 197 109 -39 141 -233 204 131 206 -125 -74 0 263 24 -21 -8 -32 -130 -76 -121 -7
3486 -7 -233 23 3 32 177 111 -160 -57 -87 29 -3 -93 318 -262 240 2 143 -83 -59 121 -4 -107 -171
3509 -171 -75 246 -34 140 164 275 -69 31 -111 83 -38 -24 -124 -78 98 -135 22 141 -147 206 11
3530A1qJ08j9k42J00K92k16J2o5N8l24L90K9k7l01K39K3p2J03p3O7L3j56j10K21
3555G3J31j89K9n2k66K91M5j75k0K86P1k70r4K67p3o4q1K03Pj04j60J68j50J09
3579a8J69l04L06j40K39j33m81K59q8K11RL2n1J2j77L2J00M6j83N9J50j29L46
3602B66k19j40K5J32m36P05m38R9N1Q0j07k4N4m32K63p3J01j2J02p6o3M70k09
3625A19J68k97o4P3l10L91j66j6K55l99J31J20l43L87J3Q1n2j28J17k1p6J86k12
3648d3J69n1j78J26j23J53k17K95n2j16O8k25R9J39J22j22q5QM9J13j23L77m51
3671f8p1m6J93J47k37n3J66q0K30O3k11n7J41J1k97J60l2r1M21l38j50K04J42
3694A47j6J49m87M34k65M3l5KNK47k08k92K99j06O3J48k00K15j49j20R8j57K0
$$ plain form
3530 11 3 111 92 -150 -50 242 26 38 -27 31 -293 97 126 99 -202 37 60 -12 91 18 85 118 -38 -148 73
3555 73 204 15 44 -8 -274 17 62 -113 -133 153 224 -46 -140 127 54 -10 -91 112 119 15 -145 23 -127 -18
3579 -18 151 -153 153 13 252 119 -362 -103 -191 20 29 61 10 22 -155 -123 -23 23 -160 -101 49 -80 266
3602 266 47 -93 -68 64 -372 333 -105 -6 45 125 18 -6 48 -384 -121 -194 -93 -105 -3 -79 -142 328 119
3625 119 287 -10 -74 -1 -311 80 -86 -102 153 -246 -115 5 -338 49 62 143 91 -37 80 59 -17 169 -43
3648 -43 126 75 -103 23 -100 53 -164 131 79 -37 31 -194 -95 44 166 44 -41 -33 16 129 6 383 -68
3671 -68 -139 -185 8 155 -82 -135 31 -49 181 244 33 -24 117 128 -169 -9 -41 -132 289 -49 -199 5 147
3694 147 131 280 -207 227 -38 5 -30 -28 -23 224 16 -276 23 -83 -20 128 -72 143 -6 -126 -28 -185 -165
3717a65J84J28j79o1M3l1K00j19p4K45j53M6j61K11j06j08J4J66rr3J74O1k75
3740f2K59j7m03K09J11j35L5M3o8J02o9k9J94j67p8m3L8K50q0j02J89j28J85k67
3764c3J45j56j97O6K30J33m51M31k13N5K26j93k39L09K0l8j99J15O0P6j21j0R9
3787A15m17M14J81l58R6j69K28J84k09m01L58J88m36J02j11N43j04j86j06n3L11
3808A70O2m32K02J46k51J00k34J31L52m29M17k33l5Q4k27PK80rp0j96L90l16r9
3831a90q9L36P0J10m46K21k42K90J81l85J55q5N22o27J83K9Q4j75J09o4kL3p5
3854e7J06P6j67K20l65J95LoJ31N9j81j38J28k64L42q1r5kj44J42L1M12l32P6
3878H9j1q2P3M5k48K78r6l83J97J2p0L88j52j17J89j41N2j80M50j90K6j42J32
$$ plain form
3717 -165 19 147 -32 -93 -50 -81 119 0 -74 171 18 64 -97 114 8 -100 -86 80 71 -22 152 213 -62
3740 -62 197 180 -223 -14 97 -38 -3 40 -28 74 5 -24 170 3 -75 -118 -80 170 90 -12 177 49 234 -33
3764 -33 112 -44 -241 -175 55 188 -263 168 -45 10 236 43 -196 113 133 95 -104 11 71 147 26 16 115
3787 115 -302 112 293 -65 31 -138 90 274 65 -336 22 210 -226 -124 -235 308 204 18 -88 -141 170
3808 170 232 -200 2 148 -103 -3 -237 -106 246 -183 234 1 -34 50 -177 -170 110 101 31 -165 225 -91 -190
3831 -190 -279 57 127 237 -209 12 -230 60 241 -144 11 -74 448 -179 4 33 117 -58 51 -13 -15 18 -57
3854 -57 49 125 -42 178 -187 8 11 5 136 195 14 -124 4 -260 82 1 -94 -96 -240 -98 -67 345 13 89
3878 89 78 -4 69 114 -134 144 48 -335 -138 -126 -196 192 40 -77 112 -29 23 -157 293 103 129 -13 119
3901A19k61M8m4J33j81K71r0k60L61k45K84J20l91K16j38K29j87J32k67K16r6
3922c1k02N66k46K53j98n9q2j88L34j61J4j27J35K8k2N4l0l27K09K74k22J82m14
3945b60L97k39j98J38J77k52J65O6L6j31m9M4O2o1K07J01j09J06p6j96J50r5O4
3968D7J98l77R9L2m3R8J74r6KO7j23l10R6J60p9K4j03K17j32r5J67j71L85j38
3992I9k26k1K97r8N8r7J10l0j48j49K20k49L4L9j17L11j41Q8j75L26p8N5k17K95
4016A86m1jk12k3M2J83r7J53j07j4L0l53L43j37K93k3j28pN3P4l37J26J2j87K18
4041D6k84L59k70L90l84J53J6O3q8j50J59j24K26l6j07L04k90j88M51k31M2k78
4063b21Q1M11j54j36p5J02J6L21n98L81q5O5n0p5k2l9K36r9j03J35j12R8J2j84
$$ plain form
3901 119 -142 -94 -138 -5 -186 85 -5 -265 96 -149 135 255 -136 80 -58 171 -16 116 -151 65 -31
3922 -31 -233 333 87 340 142 83 1 -187 147 -14 0 -127 8 36 14 68 38 -289 -80 194 -28 154 -260
3945 -260 137 -102 -300 -162 15 -237 -72 -6 30 -101 -150 -106 -44 -105 102 203 94 200 124 -72 78 -17 47
3968 47 245 -132 -33 -1 -44 54 228 132 134 201 78 -232 -136 24 -55 -31 -134 83 -49 -144 23 -148 237 99
3992 99 -127 -148 149 51 109 12 122 92 -56 -205 15 -234 -200 -161 -278 33 -108 -20 -195 131 53 108 -109 186
4016 186 145 144 -68 -91 -49 134 37 190 83 69 99 -254 89 -48 245 222 94 87 140 214 -123 3 15 -172 46
4041 46 -238 121 -149 241 -143 10 26 89 1 -149 10 -114 112 76 -31 273 -17 -205 246 15 57 -221
4063 -221 -140 271 117 -19 -94 8 24 345 -253 128 43 108 58 -17 -39 -78 158 59 -44 91 -21 77 89 -95
4087i5r6L5K44j38K11O3k36l7P0k33K48j27N7P6J10j36j60O4m8J90J00k05k8Q7
4111A6Q5j09k88J76J56k20K34P6r8L86n23j47J63M6l3J38K15j43m13K01Q3J4m5
4134c0J89n54M98k85k1K58Pj22K04r1R4l3q8J70k14Q5PP7k16J00KN3j15L17l31
4159c9q5J34m1r3P0k8R3k33K80J05k80J83pk0j78L10l60n8K04J02j00p0K63l40
4183a88k3J60l8J7J43j38R0L83j73k03R1l5k26J44j0j66J51QM8J0O4j23k3j9J71
4208A15k47N2l14J78K33J68j99k05lJ40J05o7j29J50N6j32K22N3k04j0R4j06J27
4231G7l21J49j04J50lJ18j3K34l09J09j57MK06J6j08j33J6J64pk08J76j11K2J55
4255A22m2j43J52j03J66n3n9k1k6P0P4l44N06j98j14j06J69J73k62p2K52k69K15
$$ plain form
4087 -95 -191 -156 88 -50 161 224 -12 -49 21 -212 36 -91 -34 42 152 16 -144 -80 -128 62 162 -43 -71 16
4111 16 101 -8 -296 -120 36 -184 50 126 28 414 -109 -256 -93 -47 -80 58 273 130 -283 -82 1 15 -30
4134 -30 159 -395 103 -182 -203 55 62 -60 144 53 147 114 26 196 -18 67 74 151 -65 35 37 90 -25 292 -39
4159 -39 -124 10 -31 -124 -54 -82 11 -222 58 163 -117 66 59 39 -139 171 -189 -247 -43 59 -41 -111 152 -188
4183 -188 -211 -51 -89 -72 71 -67 23 406 233 30 121 86 -140 4 -6 -172 -21 -13 35 45 109 -14 -37 -56 115
4208 115 -132 -80 -394 -216 17 185 -14 -219 -222 -82 23 -44 -173 -23 33 -99 123 176 -28 -38 56 -50 77
4231 77 -244 -95 -199 -49 -52 66 53 287 -22 87 -70 -66 140 156 48 -85 -69 95 88 -120 56 -55 -33 122
4255 122 80 -63 89 -14 152 99 40 19 -7 63 137 -207 299 101 -13 -119 50 223 -39 -111 141 -128 87
4278H7Q6k14j24L13j54K18k11J4l8k0K67p9k83m1K34j17J05nk1j41JJ41O9J39
4302B26k47O8j58J11o0j34Q3J03oK03m50K47j10Q3k7K1K61Q2j92N8k86Q4N2j6
4326dJ15j4L5k62J25n3J04k39L37l31K0pJ68r4K90k66J34J47k15k87K05J83j85
4349i4R9q6L06l68M66j40l41R1K97k12K42k83P0l13L19n9k8K28p8N0k13J31o9
4372A5L69m27m4K49k56K65l52J79j51K45k80K58J48k57K22l07K49l03J3K01Q7
4393A23j93J13k36K76o6p6m8R7j39L54k17J42R0k24K78m47J59k48M35j61k5PK36
4416B30O1j76R1O2m95M57j44j92QK77o2J22l40m4P4m0K28n1J6Kr9R1j81J68j40
4441g7J5L1L9K87k35m3j74K43j14K13k25k09M55l88O3j56K45J22J33k29L9K1J58
$$ plain form
4278 87 173 -41 -165 148 -6 212 1 15 -23 -43 224 145 -138 -179 55 -62 43 38 17 -124 -123 18 87 226
4302 226 -21 47 -111 0 -60 -194 -111 -8 -14 189 -261 -14 -124 -41 -68 -47 214 296 104 162 -124 -40 12 -4
4326 -4 111 97 132 -130 -5 -58 46 -193 144 -187 -167 -174 -6 -100 190 -76 58 205 -10 -297 -92 91 -94
4349 -94 5 -81 225 -143 323 183 -158 -67 230 18 260 -23 47 -266 53 -6 -34 194 116 166 -47 84 15
4372 15 384 -43 -87 162 -94 171 -181 -2 -153 92 -188 70 218 -39 183 -124 125 -178 -165 36 123
4393 123 -70 43 -193 83 17 -59 -107 -10 -149 205 -12 130 220 -4 274 -173 -14 -262 173 12 -13 -6 230
4416 230 291 115 206 268 -227 230 86 -106 -98 179 117 239 -101 -145 -71 -111 117 66 82 84 -15 76 -105 63 -77
4441 -77 -62 -31 8 295 60 17 -157 86 -28 185 -40 -249 206 -182 -119 -275 -30 92 225 -4 35 56 214
4464B14p2K5k55M3K22l4j63j46K23L3J13l01J38j4o8O3J0P7l9k10K73k34J32j53
4488a23KK3K77m06N56j67l11N3j51K05Q4j21L0J46m4k9r7J88j09J86j96K45m47
4511b06K47M9j60J22J9l25Q2J39j10K9J27k35K60r4O2m3kn0L12j50k34Q6l8N7
4535e6j7P5j24J55n3k55J23K79J07j79p1J27n8m7J46k9j69J04j70J42j90K17J63
4558B20j19l08O0jj8J44m7l0N2m0J91K40J42k99M5k84j06K30j1jn1m5j96L41k6
4583H3rQ3k33j01K42J90l27K50K11k00j64J2m38J67M50q3m49J01K37n6q4J54J71
4606B07k41P0J74j41pp7k81L90k28L14k24K05J42m83J34j72O6J73K34k67m6rJ13
4629D6j40r4K88L9r8M5k9j5j05q0J90J2p4mn3k2p3J63Q7K6M7n3j40J4K17k09j9
$$ plain form
4464 214 142 167 -88 -45 177 143 -20 -166 57 90 203 -98 40 26 -42 21 31 108 69 -141 132 -102 30 -123
4488 -123 -121 -98 179 -227 329 162 -149 -96 -247 -42 42 -79 -49 97 53 24 -73 115 6 192 -4 241 -206
4511 -206 41 90 -70 52 71 -254 -172 -33 -143 -114 13 -222 38 -56 6 -37 -39 -89 223 73 -161 -75 -113 -56
4535 -56 -73 2 -122 33 -20 -275 -152 127 234 55 -16 111 53 6 152 123 -46 58 -112 30 -160 57 220
4558 220 101 -207 -147 -148 -166 -22 -69 -99 -47 -87 104 344 486 187 232 -52 -158 72 61 60 9 -36 -232 109 83
4583 83 74 157 -76 -177 65 255 -72 178 389 189 25 37 -401 -234 216 133 -316 -215 22 -34 -118 36 207
4606 207 -34 36 210 69 62 -15 -296 94 -134 180 -44 161 303 -180 -46 -218 -152 21 255 -12 -58 -67 46
4629 46 -94 -188 100 139 41 86 57 42 -63 -143 47 59 -15 -19 -72 -94 -167 -4 83 109 156 103 -37 -23 194 -15 -34
4656c4J07r1K38k26j83J4k7L63k29J74Q4k10J64k53J74m5L6r2P6k76L58O1n7k48
4680a22J49R3q3j1n6O1o4q3r8L72l01j16J22k5L73l26K6M12l53K11k80j01K21
4703B1k72J91M8N5J6j87K44N9j40L21m44j52K10P2l3Q9Lk62J65r4J23j0k61K45
4727Gj01O1j43R7J38M3j75M5j51K48n0J93m31J14J64Mj80J05K33k39j3j27K13
4750E5j46J66l79L70%m6M2o1J80J8n3m7l38K95p4j73K07L7k4j61J77n3p6j11R3
4775a02J17K37m93J85l1M35l74j9K8J15o0o6j17J78J0jQ6o5r7J35o1M9o1l7K5
4800A6j12P2M3Q2L5J16k39K1k3M6j83J88j3J27n1j98j20j5R7m8K30q1M8j59m8
4825a69J59m4J99k20J29j87k21L67p6j5j2J05J07p4j80J42p3J75n9k69K60j62
$$ plain form
4656 -34 73 -18 220 -6 -189 -175 -202 161 -68 106 190 -20 144 -109 65 20 56 -36 40 -236 122 183 126 -122
4680 -122 27 120 37 26 -30 31 -33 -116 -214 158 -143 -259 -137 -162 211 -115 -89 323 -30 181 -99 -200 21
4703 21 -251 -60 -12 43 59 -128 116 175 35 356 -88 -240 -30 42 9 98 101 -161 4 -90 33 23 -238 7
4727 7 -94 -33 -176 -79 59 102 -73 -28 -179 69 19 212 -219 -105 59 63 -117 -12 221 -18 -31 -158 55
4750 55 -91 75 -304 66 66 20 62 1 181 199 146 99 -239 56 -18 -191 16 53 29 -132 45 -8 -84 -195 -102
4775 -102 15 252 -241 -56 -87 348 -26 -45 -17 98 38 -28 -145 33 43 42 128 63 -34 101 40 89 28 -9 16
4800 16 -96 -24 19 101 136 252 13 34 11 57 -126 62 49 176 125 -73 -193 -208 -111 -159 71 -10 38 -121 -169
4825 -169 -10 -54 145 -75 54 -133 -354 13 -63 -78 -90 15 122 48 -132 10 -63 112 53 -216 44 -118
4847a18K21J1l17L16m0L6j09N8p3q5R8q4j75L38m6M4k5J6j09p8L20k55R9q5J22
4872H0j99K74k26j0K32k23K6K6K70n17L81j64K43m73J73n4n0K07rM0k40NK30j1
4896A1K6j61o5K49k3K2j19L08j05j21K73l39K9M7l6qn1J0N9J70n5r2q0Q5J4k12
4922a64J11L5j40J11J48k23K81o7k30O9K3J6m2L9J4K07n5j81O9O0q6R0L57m67
4946b5N7j99k3P5K23l8m0J08j65J40j88M1oK42l13JQ4k58L06n6M43n13M36m22
4970i0K93l80L7J56Q7L2l30J06M8k20J64l9K9L38m0j76K91k30J70l98J19m6O0
4993a9K69k50k0q2J55k34N62l81p8J5j30n3M06r3k60L90k73J97j5k85J16N5j50
5016a58J94l8M9J19j48O5n7m6K93j90Rk07k78L32J82q5J59j60j26K36k50J0J50
$$ plain form
4847 -118 103 114 -203 113 73 109 0 58 -15 -100 -2 -86 -261 77 31 75 50 66 -43 -121 199 -56 43 -42 80
4872 80 -119 155 -71 -81 151 -72 -46 -20 250 -267 114 -50 193 -280 -107 -161 -211 -4 -13 27 -213 -208 22 11
4896 11 37 -124 -189 60 37 59 -60 248 143 22 295 -44 -15 32 -4 -12 -63 -53 6 176 121 29 -51 34 48 -164
4922 -164 -53 -18 -158 -47 101 -122 159 92 -138 -69 -46 -30 -72 -33 -19 188 133 -48 21 81 -5 85 442 -25
4946 -25 32 -167 -190 -115 108 70 30 138 -27 113 -75 -34 -40 202 -111 -110 -26 -284 22 -34 409 -104 332 -90
4970 -90 203 -177 -140 16 103 135 -195 -89 -41 -261 -97 -136 -107 231 191 15 306 76 246 -152 -33 -79 -19
4993 -19 250 0 -20 -102 53 -181 381 0 -78 -63 -193 -246 160 67 -193 197 -76 121 106 -179 -63 -8 -158
5016 -158 36 -2 47 166 18 83 26 -20 273 83 92 -115 -393 -61 121 36 195 35 -91 145 -105 -95 55
5039E5k39K56j22L4J54n31L56jk24M61l64o0R1Q4J91j25N6k9j74R5j59K65o2p0
5063f2L46m46M77l42P8j86K06n9qj54R3P4l3J56N3m39J66N6P2k82L11j06q9L5
5087h3j11O4J40j24L9q5K09O0k11K14j69R2m4l1P8j51l0J18Q2J51l11J37l1n9
5111e6n5J25r3Po4K05j48N5k71K85J07k46R6M00l61j38L53K4j81J6J90k70K27
5134B07j47K0j87J22N4k10J05p2J95j91M1J18K0K19l53J11J3k1l58Q8L8J70L22
5157C04k63j53r0J62j6k2l4Q1J21J3j67k3J76J3k26J40o8J08n7l04M56q8k28j22
5181b87M29m03L94q7k21K80l84M58k95J31m2J15K24k03o8J67k04J03k22J28o7
5202e4L20m51n9J78JRj61L95M5k23Pj32L00K0j97l3J54k02J27J6k13j27N6L79
$$ plain form
5039 55 -184 72 -50 -16 138 -393 -37 -38 -262 199 -165 -225 -134 -50 141 16 72 43 -131 -36 -195 70 8 -62
5063 -62 284 -162 315 -27 51 -135 71 12 4 -150 -57 17 -16 140 193 -246 -80 -24 48 -234 77 -29 -118 -83
5087 -83 -194 -130 10 -114 -75 -160 49 109 -102 112 -57 35 -9 -40 38 -113 -143 -25 57 208 -103 34 3 -56
5111 -56 -111 14 -79 -72 -136 69 -79 -24 -295 -10 97 -149 -53 347 -14 -152 201 225 44 60 250 -20 207
5134 207 60 80 -107 15 69 -141 -36 -108 87 -104 -63 55 75 294 -59 52 65 44 -314 -226 -188 -18 304
5157 304 41 -112 -202 -40 -56 -78 -112 -31 90 103 -64 -87 89 102 -124 16 -52 56 -1 -305 151 63 -165 -287
5181 -287 142 -261 133 46 -175 105 -279 179 -116 15 -27 88 312 109 41 208 4 107 -115 13 -54
5202 -54 266 -185 -244 -66 -65 -56 -217 178 223 0 7 -125 175 195 -2 -35 119 -83 44 60 -153 -280 -224 155
5226A55k36l0Q4J18kj62p9K05j61K30j03J75m13K01oM4k22L13J88o02K74J32k58
5249a55R2R4M0J61j76k40R6J79J3k02M09k38k73J33J8K81m10M89k33k06O5m3r4
5272b00K08k92L19j60kN7P2j03J41L7lk40L65K0r0k1k60L37m37K43n4j1J67m8
5296D5j21K40j69L01l71J54j67j0K26j19J88M5l77K50p9K4j37J00J4j79J30J27
5318A15j90K62l57K72q3k7m3L62k93K14k41j5K04l18J47K5q7K0R5q0O9l08m2J87
5342a12O0Rl1n6L71j95r2Qj06L9K12k0K21j79l74K04M5j16o8K27j28M4m8m0k0
5367a45J79j09q2J70Q0j78K58k82L57k79N5M6o3r9K53J72m32J56o5j05J93R2k04
5390c2j4J22J91j73j97J78O3j99N8k52M2J73k35L43j34j68J65l6K22l30L18L7
$$ plain form
5226 155 -81 -111 -27 91 89 -73 -152 53 -108 122 19 194 -219 -18 -24 20 -202 111 299 -303 -29 103 -155
5249 -155 -63 31 71 232 56 -184 -88 91 104 -98 311 73 -200 -67 -49 232 -178 311 78 -128 -63 -106 -200
5272 -200 8 -284 35 -125 -127 -70 2 -101 40 77 74 -166 199 219 129 108 -152 185 -252 -9 -63 -74 93 45
5296 45 -76 164 -5 296 -75 79 -88 -98 128 9 197 242 -135 115 36 60 -77 23 37 -142 -12 115
5318 115 -75 187 -170 102 19 -8 -51 311 18 232 -9 -24 180 -138 9 34 -53 -33 62 -18 51 -257 -299 -112
5342 -112 -52 -43 -74 -130 241 46 -46 -38 -144 -105 107 87 308 129 -245 -41 4 -112 -180 47 -81 -37 -85 -125 -145
5367 -145 34 -75 -157 13 93 -85 173 -109 248 -31 24 70 7 -92 161 333 -99 57 -8 -113 80 172 -32
5390 -32 -46 76 267 94 -103 75 138 -61 -3 -255 -213 -40 -275 68 -66 -234 -69 -105 117 -213 105 142
5412A42k92J31q2J45j04J30j01m0k7K38qj32M7k35J06J95j52M5N3k33J04L48k04
5435G4O1k35K51k09o2j08M35m79M0K43l29J52K62k9n4NJ22j99J07%O7j1j61J9
5459c8p1J38P9j06j26J77j48J01m4K13P9n6k21j77J60k0Q7j75J10k04P6M00l40
5482a06jJ06j40J41K23l04o7K52m1m2K53j77L7j07M1k26M5K01k09kJ06K06l5j51
5506Cj84L9N1j14M56k83K21j45PJ4p3J97k68K44Q0l74L83p3n25M00j0M0M4n9Q7
5531A58p8OQ8q5p2K2n9J45j82P3j7q6j96M65k40L98k01k95J90O5k99L30l70M06
5555A66k34K26pl26J58K70j93j16K39k92J66l39K03j20K36j1K3l4j27J93r8N8
5577D1r0j60K44Q7N8j00j3k86j3J87j3P2j45k8n6N53k79J30k35o2O4n4K94R7k14
$$ plain form
5412 142 -150 -19 -101 44 -60 70 -31 -71 -98 140 132 0 47 -188 -82 113 -39 6 59 -174 -70 278 74
5435 74 135 -100 151 -58 -120 -228 207 -272 -232 11 -318 -166 96 67 13 18 140 -59 48 48 115 104 -57 -38
5459 -38 -109 29 108 2 -124 53 -95 6 -38 175 254 198 -23 -200 -40 -60 27 -148 -38 -242 -166 234 -106
5482 -106 -107 -1 -141 0 223 -81 -148 104 63 21 274 97 134 27 68 -158 -113 88 -121 -123 -17 189 154 3
5506 3 -181 -142 -91 -205 251 -32 189 44 51 65 -8 189 -79 165 245 -129 254 181 -344 56 46 86 130 71 158
5531 158 80 86 174 89 17 39 -20 125 -57 16 -1 -87 -283 182 -58 340 139 -156 34 99 -200 130 -240 166
5555 166 -68 158 151 -175 -17 253 60 -56 183 -109 57 -282 -79 -199 37 26 49 15 -112 81 -17 41
5577 41 -49 -209 35 122 180 80 67 -219 -232 -45 -58 14 -131 -159 -215 338 59 189 -46 -108 -44 -98 196 293 79
5602G9r9r7MJ51J99k12j99K85k24J5M4J18j24K25k1l29M3L54m53K22K18l00K07
5625A06k5j82L16j74J9RJ36k82mK4K12k17J40J56j08j09o7K66m27L62p2J31n6
5648A54m45L04P7j63q8K0j4K44k52Q4J38k94M05k86O5J74j50K50k83J43n1l5P
5671Dj86P9K93k86J15j9j44K51J7k14K82j2l71K39j57kJ04M1q1k7j1J28k92J10
5695a39J74q3n1K07j91m7m3K43Jk11M61j00k86qK15j04o4K10l5j36k55Q2K50j69
5719g9j15M00p9l37K13j5J8Q4k14P7j02M46k16j93K84m06O7M1N5n7K39N6j6l27
5743a76K04O8j73k8J68J25k76P6K11p3q8k10J14P7j30O7P1J54j64j36K58k14J65
5766I0n2L9k23N6p9J39j31K6K78p1J69k30m3o0J30j48L59l08J64n6M0j22o5n9
$$ plain form
5602 79 -20 -117 -113 38 237 25 -174 111 -113 -98 -54 64 -60 165 144 -185 -142 212 -241 -19 199 -101 106
5625 106 81 -101 215 41 60 69 205 -77 -81 -57 155 -62 78 234 126 17 -50 216 -211 151 79 210 154
5648 154 -291 13 90 -73 -161 -141 -155 89 -163 -79 59 -235 170 -116 -51 123 -27 223 -60 83 32 -3 4
5671 4 -182 -103 190 -96 19 0 -144 107 124 -90 192 180 -191 48 -109 -111 -7 34 -47 -74 -85 43 -249 -139
5695 -139 35 -48 -99 108 -83 -130 -173 70 71 -140 321 221 -65 -73 142 38 -26 184 149 13 -242 -160 90 -79
5719 -79 -194 206 127 -210 3 -12 6 90 -124 -47 -149 297 81 -112 172 -234 -167 -126 -71 -128 111 167 151 -176
5743 -176 28 96 -77 -105 63 188 -88 -12 199 126 38 -172 -58 19 -111 -44 27 181 17 -119 139 -75 90
5766 90 38 77 -146 -90 -169 -30 -161 -135 143 72 241 11 -32 -92 38 -110 249 -59 105 49 89 -33 -98 -157
5790a57L18j61j02J8r0J31l9J88k28l9K87j20k3m4N7P8r5j6J34l71K08M01j20
5813B15m76J16J22l2j57L73l85L26R1k62J25k33L42j96p1p8n6J54lJ3N2k09K77
5836D8J30l91N45j96l2k65L1K17j15L42l64K34p6N1j70Q4J30nk39p4L7J00k19
5859a97L35o7l1k96K19O2j03K7m4J61j51J19k6R8J3k92K48J08l76J88o6J51l4
5882D6k45J48J54j76j51K68jj45J68j41K41j10q7QK60K1j68k9j89K25k72K48j40
5905f7m5l71K55K2J54K02l19N5K21L1l53K10P5l13R3K65l68PK42R9j9K6j48m0
5929h6K06j18j79K01q7J15q9j04J66N8Q4j98j4n7M31n59L26N5k41K7n0K42j24
5952EJ05k66J10j05L13j64J25k11K6Q8n7J34p2Q6q0L1M5l53K97Oj49L85l05K42
$$ plain form
5790 -157 161 0 -102 -84 -174 -43 -82 106 -122 -161 126 6 -17 -61 -4 74 -21 -37 97 -274 -66 335 215
5813 215 -261 -145 -23 -55 -212 161 -224 102 193 -69 56 -177 165 -31 -102 -180 -236 -82 -85 -72 -20 -229 48
5836 48 178 -213 332 136 104 -161 -130 87 -28 314 -50 184 108 159 -11 73 203 198 -41 -115 -78 22 -197
5859 -197 138 71 40 -256 -37 25 -78 -51 -95 66 -85 34 8 106 119 -173 75 183 -193 -5 -71 80 46
5882 46 -199 -51 103 -73 -224 44 43 -102 66 -75 166 56 -31 -23 237 258 90 61 -128 97 -175 73 -67
5905 -67 -112 -483 -228 -206 -52 150 -169 -114 107 138 -215 -5 70 -243 -150 115 -253 -246 -4 95 76 102 -46 -86
5929 -86 120 2 -177 24 -63 52 -37 -141 25 83 167 -31 -45 -102 329 -230 96 151 -90 -63 -113 129 5
5952 5 110 -156 -46 -151 162 -2 123 -88 -62 26 -31 103 31 117 37 68 113 -240 57 63 -86 299 -6 236
5976B36k66J67j09j38n9K94k61k18K59P9J48l87J99M0k86J95J83l9q5K08k34J29
5998E5P2l72L31q0J30j69r1L10j89l7m1J76k48J15R1j54J75l27M26n5j40R9K33
6021C10k70O8j2j25N7j27J50R0j13q2K19j12J23k61K88k99J18j6k6l6k08J72N4
6044c8K6J41l8K72k21j4M8k29j30q2rK82N0j93J02O2J83j73qj98J97K26j82K0
6068I4r1j97K67l09L04q6J99n30N23k42m8K49j80p5j8J88n5L0q8K42m11J69J44
6091G9p3j18O6J38j19j64L13k62J54N1L9j63pP4m3q4N6J72J38l57L1J47j04R6
6115F0k16K79q9J48l1j32O9k77M7J33J62P4j23j31N2Q2k15P8J3J30j80l8O1J45
6139A01M7j89J1O7j77M5J00j0N9J03p6L0p6J12j32R9N7j73j26k0J94j63K27j37
$$ plain form
5976 236 -30 137 28 -110 -169 125 -136 -354 -95 -16 132 -255 -56 -16 -302 -107 76 37 -48 160 -74 55
5998 55 127 -245 86 6 136 -33 -124 186 -3 -40 -81 95 -153 -38 53 -101 74 -253 173 118 -22 77 310
6021 310 40 108 96 -29 28 -99 51 141 28 -54 165 53 176 -85 203 -96 22 6 -20 -56 -264 -92 -38
6044 -38 -12 129 91 363 142 128 176 -53 -183 -265 -274 8 58 -135 -33 29 212 39 31 -167 30 256 74 94
6068 94 3 -194 73 -236 68 -18 181 -349 174 -68 -116 133 -47 -122 -140 48 -7 23 -65 177 -234 -65 79
6091 79 6 -112 -46 92 -27 -191 122 -140 14 65 104 -59 -66 8 -35 -119 -63 109 247 -110 -79 68 -36 60
6115 60 -156 123 34 182 151 19 88 -189 -142 -9 153 227 104 -27 25 107 -108 -30 -17 113 -67 -105 -44 101
6139 101 148 -41 -30 37 -140 -95 5 -5 54 157 81 111 35 147 15 114 171 -2 -128 -148 46 -117 110 -27
6163b7j41K33j94K53j83l61M19k69j38L15J22k57J39J1J17k34o9K40n7L22j5n08
6185b82L42K04k30N9j82JJ87K01l23J5m0j96R4L42k21q7n8J61O5j35j1l98O05
6208A13j36q0J54r8lO9j21J31O7q4rK7j31j94K73M5j8m9J36l31L59j41O7j68J29
6233Gl57K66K29k56J95l5J94l78J84k00J25L21m94L08j93J47j43K47l73N8J36
6254a2L9J25k49J81l41M39j36q0L9L4k73J77n0n6K80P6k81L15k78J66n5l48J61
6277a27q6M13m2j11o2J14j05j55J47N9j76J29l2k7q2J19J8r2K86m7k13K80l41
6300a33K23p2L02j38k81J9J4k52L11P3J88k75J60j07j23J90k33J25K67k07K00
6321B51l87L31j78j05r4P5K58q9j97N5J24J19l57K46J38P3jl30P1n5J3J94l9k48
$$ plain form
6163 -27 -168 65 -129 124 -59 -420 -1 -270 -408 -93 29 -228 -89 -78 39 -195 -264 -24 -81 241 226 -282
6185 -282 60 264 34 93 -89 -88 99 300 -23 -8 -48 -244 -150 192 -29 -116 -174 -13 52 -83 -94 -492 113
6208 113 -23 -103 51 -47 -50 19 -102 29 96 12 3 30 -101 -295 -22 23 5 -44 92 -239 120 -21 46 -122 7
6233 7 -350 -84 145 -111 84 49 243 -135 49 -151 -26 295 -199 109 -84 63 -80 167 -206 -148 -12
6254 -12 27 152 -97 84 -257 182 46 -34 5 39 -234 -57 -107 -163 117 193 -88 227 -51 115 60 -288 -127
6277 -127 -213 200 158 47 -15 99 -6 -161 -14 45 -131 -2 -34 -61 -143 -24 -6 -98 188 141 -72 208 -133
6300 -133 90 18 320 182 -99 -80 -66 -318 -7 66 254 -21 139 32 -91 99 -134 -9 258 51 251
6321 251 -136 195 17 -88 -182 -107 151 62 -135 -80 44 163 -194 52 190 263 262 -68 3 -52 -39 155 116 -132
6345a32L39j55J09M6k80j41J42P2J1K0k9K07J8m12J64J19q7J19m6j18O6j98o7
6368b33J27J93r3Q0j83j27J77O6k9j29R1l0j50K16n5K32k3k80J86JJ50k69j44
6391b26K46l59L77J59l27K90K14m61m2J71j56J34Q9o2l31K18j71J34J8K01j79
6412f3J41k13K50j12pJ15k92J48j33j4q7K81k16K36M8M4o1m1L2J13n0l31N21m3
6436B66m62K64Q1l0j56k1J69j82j12J1J54J27j39p8J15j69K78j22K40n3j85J12
6458A08L5r9j98K12J63k48o5j25K17K33k30o1k64N39j82j17L24l88K83j45N9J6
6480F7j60K38l17j06K53q0K9R8J05k8p0J48k37L1J1j56J41J20m9k91L78j92Q6
6503A9J57j98K30l18L4K6K29p7%l4J62j74l1k2K21k65J80Q9j18%k50P1n2J75K59
$$ plain form
6345 -132 207 52 161 207 -73 -214 -72 0 11 31 2 209 227 -185 -21 98 11 130 84 -34 32 -166 -233
6368 -233 -106 87 -6 74 -109 -236 -59 7 -22 -151 -60 -90 -240 -24 -79 153 130 -150 36 37 187 -82 -226
6391 -226 20 -339 38 197 -130 160 374 -87 -129 42 -114 20 109 47 -284 -66 -237 -103 -85 116 -63
6412 -63 78 -135 115 3 -4 111 -181 -33 -166 -180 -267 14 -202 34 82 126 65 24 56 169 119 -212 309 266
6436 266 -196 68 149 119 -37 -58 111 -71 -183 -172 -18 109 -30 -108 7 -162 116 -6 234 181 -4 108
6458 108 143 44 -154 58 221 -27 -92 -217 0 233 3 -58 -322 217 35 -82 242 -146 137 -8 51 67
6480 67 -93 145 -172 -278 -25 -105 -76 22 127 99 29 177 -60 -29 -18 -174 -33 87 38 -253 125 -67 19
6503 19 176 -22 208 -110 -76 -50 179 102 102 68 230 56 25 3 224 -41 139 228 110 110 -140 -69 -121 54 313
6528C13p21J62R5L7K09RO7j12m8j46K48j85J75pql4O9k1J12m7l29J4J01p3J29
6553IQ3R3j58k74L70k7r9J7k52N31r3k18k14L9J52k8rj14L63j16N9P7k54q9L8
6578a14J87j18o9M9j25J68K67j44l45N78j12k89k63J61J26J28j26q8J31j19j58
6599b75K31K40k27k09L28J08m03K64j20J12J10j36n4j0N29k99l43R7J27j13J14
6620G1k45K48J8q1j63J87M0lr2j72J38j8n3R6K71l88J30l20M54j41K6j48K77j0
6644A22Kk13P0n9Q5l5K3K9j79J27K3J5j34j44K06K0J85k43K70l7n31M15l62M01
6668E6o3J14l00J92j22J42j54j94K68j53K18j06K9N3p7K19k02j10K50p9Q2o3r
6691ij87M17j36j63J45j1r9Q5l26M26k39l8L46j43j92l4n4K62J63l73K91L6j96
$$ plain form
6528 313 -408 -246 -151 -114 95 104 171 59 11 -135 113 -72 103 96 88 54 123 102 214 167 -162 -148 -47 -120 9
6553 9 92 185 27 -247 123 96 -3 14 -238 293 200 -18 -232 -193 -41 -69 -78 -192 171 55 114 191 -63 -152 -114
6578 -114 73 -45 -114 -65 -190 -22 245 101 -244 334 222 -67 -330 -169 -43 85 -41 -129 2 -117 -275
6599 -275 -44 196 -31 -240 88 196 -207 57 -63 49 159 23 -31 -41 488 189 -154 -57 70 -43 71
6620 71 -174 74 92 11 -152 35 75 72 -20 -192 -54 -72 -125 -29 242 -146 -16 -336 118 -23 3 -145 132 122
6644 122 124 -89 -19 -78 7 -28 -5 24 -155 -28 -5 10 -124 -268 -62 -42 143 -100 170 133 -398 17 -345 56
6668 56 -7 107 -193 -1 -123 19 -135 -329 -61 -214 4 -102 -73 -20 -97 122 -80 -190 60 -19 63 0 -9
6691 -9 -196 221 85 -78 67 56 -43 42 -284 142 -97 -135 211 68 -124 -158 -212 50 213 -160 131 167 -29
6714b9J6k47L86jk65K63l01L26j27J38j94l21K70K79l80K30Mr0J25k12P3j41K03
6737EQ3j58j02qJ45J77k30L4J67k26L49m05J92N2j30J59n8J05j21q2j80K89p9
6760b2kJ94m14L15j60J43j0q8K60l55K13j0j61j09J06J97j24k1K03m19K75j89
6782a78J93p4J9K86l17J10j24k47N41k16q8n3q7K79j37J8j27J60kK7J07k37K91
6805A44j30L3j92m0J17j08K00k89L08j13K31K3k25J40j95k37K38K12j47K86m5
6826B11k83J98j69K19k47J59M8k81J57mk39R5R5K0o6N6R3j96j36P1M72j29k62
6849a18k7M03q9l02K16j21o3p0L05J19q6j24j19R5j91J93O9k09J69o6j83L83j59
6872B5O7p6j01k58J17M9R5RK21l08J10j72J75K4J67j40Q7l60L27K8j90J2K77R6
$$ plain form
6714 -29 -13 -260 126 125 -140 123 -178 148 21 159 -35 -356 -86 193 -187 43 47 -43 82 -130 -57 -198 5
6737 5 88 -70 -172 -180 -35 142 -88 -54 113 -113 236 -169 23 75 -55 104 46 151 30 -52 -232 57 -22
6760 -22 -24 170 -244 71 -89 54 44 -44 216 -139 74 64 -97 -206 -100 97 -27 -48 155 -264 11 -178
6782 -178 15 -59 -40 246 -71 39 -85 -332 209 -7 -95 -148 -235 44 -93 -75 -202 -42 -44 -17 90 -147 144
6805 144 14 47 -145 -185 -68 -176 24 -265 43 -70 161 184 -41 99 -96 -333 -95 117 -30 256 211
6826 211 -72 126 -43 176 -71 88 136 -145 12 8 -231 -136 -41 -21 -87 -31 62 -134 -270 -199 273 144 -118
6849 -118 -145 258 169 -133 83 -38 -101 -171 134 253 167 43 -76 19 -172 21 90 -119 50 -16 -199 184 25
6872 25 92 16 -85 -343 -226 -177 -82 -73 148 -160 -50 -222 -47 -23 144 4 91 -269 58 86 -104 -92 185 281
6896B81j63j12j16K89j71j25K57j30L1j86K24j20m3O9J05j49J41j22J02j06K1
6917b3L2k37K89j95N8O0j2K95k94K25n50L38j1K41k46J30o1J3J6j67K11k23j1
6940a22K46k04j19L89l37L72k96jJ37P8j52J68k59P4Q2k73j0M2J12j03K21P5q
6963A12j23j89p0J81K37m59L9P0M22m98O28l07J54N9j41j20l03N04j1P9k05q8
6985b9l4J12k49K92k82L9J11J12p7j6j82K23k13K22R6p0L22l22l6L72m41J41j33
7008d2q4p7K60o4R8j06l8J94PlK9p0j12J15k62NO1J47j74K30j27L7k76J53k34
7033c33J70K97L6M2m24J93k8R2j03j2J74j39K8q3k24M61k02j0j61J81J65j10k38
7056b28M55l77J92NK37o1l38J26q6M64l17q2n8j7J44k8J32j27L42m83P8P1R8j28
$$ plain form
6896 281 118 6 -110 179 8 -117 140 10 41 -145 79 -41 -84 -15 90 -59 82 -40 62 -44 -23
6917 -23 9 -228 61 -134 -76 -16 -28 267 -27 198 -352 -14 -25 216 -30 100 39 52 68 -99 112 -111 -122
6940 -122 124 -80 -199 190 -147 225 -71 -72 65 143 -9 159 -100 -26 56 -217 -227 -185 -73 -176 45 120 112
6963 112 -11 -200 -270 -89 148 -311 -272 -202 220 -278 350 43 197 256 115 -5 -308 196 185 264 59 -29
6985 -29 -63 49 -200 92 -190 -151 -40 72 -5 -21 -203 20 -193 29 125 55 377 55 19 391 -50 91 -42
7008 -42 -126 -203 57 -7 91 -15 -53 141 148 145 174 104 -8 107 -155 -150 -89 58 -116 114 -13 24 -252 -99 -333
7033 -333 -163 134 170 212 -212 -19 -47 45 -58 -70 104 -35 -7 -90 -314 147 -55 -65 -226 -45 120 10 -228
7056 -228 227 -150 42 47 284 223 -115 11 -75 389 72 -10 -68 -85 59 31 163 36 378 -105 -27 44 142 14
7080A4L3j6Rj86O4K31j51j58J64J3K28j37L2n50L51p2N2K85j98k22O03l90J87
7103A86M3o01K06N0j34R5R2P5J85k92J02j10J00J13m07N69l81R8J43j16J30j24
7125B2K02k83J34j3m6l46M04j90O8K39p4q7J94k53l3J40l26J00K53j56J28k94
7147b17M31k73k30J26n6K18J58k56M3M0J29j34Q0o5J85p0l54K40Mk44J99j49L0
7170a65L00j93J87k39J41q9K61j36O3r7j64j49K45k2J35k56L57j99J05j19l0K99
7192B35j43n5J68j1l72J12L3J5n0L2J12k9j45q4J52O2K5j97M03k36k9O4J2J7j90
7217i9j4O0L8lM07k77k53J37J3j1j96K59j20k7K05j9Q2j13M4l08K17J64q0j56
7241e0m2o0QL00m4J5k9j00K30J5l23N1O8j78K84k37J75p3j0k4J47r2K62m69J48
$$ plain form
7080 14 47 31 40 -146 -82 149 -2 -160 4 17 245 108 140 -410 -59 -131 -79 206 8 -214 389 -1 186
7103 186 229 -372 -166 -116 -250 -155 -63 12 197 -95 7 -103 -3 110 -297 272 -109 -11 132 16 146 22
7125 22 224 -59 75 62 16 -330 74 -116 -48 191 117 30 224 -29 -62 78 -248 -148 105 -51 77 -217
7147 -217 214 -59 -289 -163 -219 -1 157 -99 -56 -16 113 -21 59 -6 179 109 -245 -5 -1 -245 -46 -195 -165
7170 -165 135 -58 129 -110 31 -58 203 67 130 33 -131 -280 -35 -57 78 -178 179 -20 85 -34 -64 235
7192 235 92 37 205 194 -178 -66 -33 -18 -68 -36 76 47 -98 -182 -30 32 57 -140 263 27 -2 62 74 91 -99
7217 -99 -113 -53 -15 -18 389 112 -141 -4 9 -2 -198 61 -59 -86 119 100 182 69 113 -195 22 186 106 -50
7241 -50 -92 -152 -144 156 112 127 98 -2 228 243 -80 -29 39 -139 145 -92 83 10 0 -24 123 31 293 -176 -28
7266b8o3K36l5m6l18J26K83q0k59J96l11K74K11j58r7K36l2j09l1k2J63k49p4
7289a87M20m95L68P4j17l7o9P6j79K29j12j29J78k6J16ok16J2K05j35j01j30J74
7312h7N3o5K73j86qj50L9K5P6M4O4MJo9o2J28j52J86n9j44K07j63J70k22K10L6
7338A49j02j68k6M23q4k22J78k10m0j10J10N4l2J51J3k18j7L12m88L80m19P22
7360C56l19K37k11l9K82k32j9L9q9o1L8r5J94j63L6K01J44l18K0j92J52K2n2L61
7384B92r9j67J47nR8o5j00P5r9k83J68K47k28j03l9J46n2R4j96K56k65j30M94
7407A86k11j91J59J28q3P1l1o9J51j64J07M5j79N4J16N2o0j98Pk37M22o8K4j31
7431a00P9k05J84J38K62k28No6K3j04j19J98k9j56P2m2J78P0j57j21K25Q7k65
$$ plain form
7266 -28 -91 145 110 64 -254 -128 155 75 -184 12 -299 -25 186 28 -69 167 135 26 -5 -27 136 -113 -187
7289 -187 233 -262 106 180 63 26 -43 33 -146 83 -29 -158 20 -6 110 104 -112 -100 105 -30 -131 -261 -87
7312 -87 -34 -99 174 -12 -20 -170 -131 -106 -30 14 78 82 83 14 -48 80 -72 114 55 -89 118 -45 125 -97 113 149
7338 149 47 -121 -147 276 192 -30 148 -62 -102 -212 -102 -48 -80 71 84 -134 -151 161 -327 53 -366 356
7360 356 37 274 63 24 306 74 55 94 5 -56 -18 -113 81 -82 -46 155 299 -19 1 -191 -39 -17 -69 292
7384 292 193 26 173 168 266 201 101 176 77 -206 -38 209 -19 -122 -161 -15 -67 27 -169 87 -178 -308 186
7407 186 -25 -216 -57 71 -12 59 28 -41 110 -54 53 98 -81 -27 89 141 81 -117 -110 -347 75 7 31 -100
7431 -100 -21 -226 -42 96 358 130 135 69 92 -12 -131 67 38 -118 -46 -88 90 160 3 -118 107 194 -71
7454g1J78l30J17J12K62k87Q7Qj87J3J66j46j3R1R8j25m3J86j28j16K66k98K68
7477A08q0j27J16m9KO3P1j21K19j50n1K45n9kn7K38n23L52j77J07N1j89K07j90
7501DJ19k98K44k97L19j96L10j23q8m24N34r3J03j18o8j94J66J41J36k64J63k05
7523a29j42J06K07o9J6J45k05J43k41J56J15j33J73k04l9M7J32q1k9k7J04J37
7545A82j66j14J06j00J01J14OKL6j29j4%J05k31o8J17p4j54M36j26O0J89j99k41
7569a62J92jN0j17K25k9J8k86L17J88l54k48L64r5K07k62N3N2k24K62k8l04J78
7592dj28N6L5j22P8J11J86j58k55N4O7N9j0l5J4L25l10p9K88rl4K7j53o6J03k65
7618b25L62K1k17L7k33K46j07J86l01K10M8l9j67J13j2L66k36k65J60j14L04j27
$$ plain form
7454 -71 107 -223 -106 6 268 -19 68 76 -111 -98 68 -78 -91 0 98 -27 -70 116 -12 -128 138 -160 108
7477 108 28 -99 17 -32 -30 33 104 -17 202 52 1 246 187 185 128 366 -157 195 18 125 176 -13 194 4
7501 4 123 -175 69 -228 91 -105 205 82 -6 -430 104 11 114 -4 -72 -266 -100 41 177 -87 76 -129
7523 -129 -271 -165 42 -27 -11 134 -71 72 -169 -13 102 -31 142 -62 -101 -54 78 -3 -32 -59 45 182
7545 182 16 -98 8 -92 9 123 129 131 167 38 24 24 129 -102 -170 -53 -127 -281 155 29 89 278 79 -162
7569 -162 30 29 79 -38 187 158 176 -110 207 395 41 -207 157 62 269 7 60 112 -112 150 122 -182 -4
7592 -4 -132 -76 -41 -163 -85 26 212 54 -201 -147 -80 -21 -31 -66 -52 273 -37 -116 172 163 129 156 3 -63 40 -225
7618 -225 137 158 -59 -22 -255 -9 -116 70 -231 -21 27 -12 -179 -66 -78 288 52 -213 -53 -167 137 10
7640A0k7J91n9p7jj49j39K90j5N7j44k5R4p4l5K01K69m84M82n18M6P8n4O1J12
7665I0j69m8o4J76L81l11p2Q9M5k54L7j23J07m3K21K0j75j0M7J41p2R6K4O6p4
7690A25j35L9k72L15k45L9M03l52k6Nk3J29Kj23L14m02J05M9J17j04p3L7K29j04
7714D9J1j29K9nP4J59l15J27k8k82MO12m16Np0J42L14l58K03m69N63l79R7L11
7738B49l58Q8K18l38L75r3j66J91k92J13J44k55J06R1j62J31k16M21k19q6J68
7759A10m13L81j35q3M09m96J72j57M62m4k00j40K45j66MJ9J3k68L14m6K25q1k58
7782a33J60l13M62l24O1J30K00m27K61j76R0n2P3o8L5J91n5j11j76O8N00j28k33
7805C5j81L94j88k80J95qoM0jJ5P5k31L4L8Q8J26k21K77p4k27J74m3k57K99Q9
$$ plain form
7640 10 -17 174 115 38 37 -112 -251 39 24 81 -63 -88 6 -68 -103 98 367 -117 365 -153 -107 -29 -83 -22 90
7665 90 -79 -127 -191 -15 366 55 -17 72 117 -137 -100 -223 -116 -159 62 82 -93 -103 -56 85 13 109 133 199 125
7690 125 -10 29 -243 72 -173 -134 269 -83 -109 -104 -127 2 4 -119 195 -207 -102 -53 64 -40 -113 -76 153 49
7714 49 60 -69 -40 -45 29 188 -127 0 -28 -310 -306 306 -110 -105 -175 -33 281 -77 126 -343 220 -159 -62 249
7738 249 -109 -21 197 -141 234 141 -25 166 -126 -13 131 -124 -18 73 -89 42 -174 247 28 -58 110
7759 110 -303 78 -57 -140 269 -227 -55 -212 250 206 6 -134 111 -55 -51 -32 -19 -287 27 -19 206 125 -133
7782 -133 27 -286 176 -148 -87 43 243 -184 77 -99 -9 -61 12 -56 -21 170 115 4 -172 -104 396 268 35
7805 35 -146 248 60 -220 -25 -33 -39 1 0 15 90 -141 -107 -69 19 145 -76 201 127 -100 74 31 -226 73 162
7830A62k48K28k91L48l62R2K94l64p1l9N5J05j29K50P0N7n5m11L08l35L69J53
7852A86j34k8j46J54j01J28m8J93k08j82j1J74kO1p5j68P4K36j10J98k31J92l1
7875A21L34m76P6j89K51ok78K63k10r5J08j21J06P2J81k93L02r7k28O7K0K05Q
7898A21J91k99j48R6K5O8j36K67l18nL63k51k1j8K02j57n3m2m9J92j20O3J16J2
7922I9k4q3KJ6l1m6RJ96rj04R4J4j97o7L21j66k37M7o2K73j92J44K28j69J19j98
7948b3o5P3R4j85J2R5MJ48l2J32j1j51q7lk56K10K24j43J94k24m0P3j99J37JJ6
7974fr6J00K5r8M2K77l67n3J88j03Q2P4K95l02NO3q0L40l54j20K71k29j65J36
7998g5K28p9j36r4J9K04J39j20j54j42O0J04J54k01R4J22n6k47k0J34Q5L5o4N7
$$ plain form
7830 162 -86 142 -149 199 -163 -71 223 -141 -212 -251 -196 -91 -220 30 100 157 102 -309 -1 -336 33 186
7852 186 52 24 -122 32 -69 59 11 204 -4 -186 -197 -23 -25 36 -39 -207 -133 103 -7 191 -40 152 121
7875 121 455 -21 55 -134 117 111 -167 96 -114 -209 -101 -222 -116 -44 137 -156 146 49 -179 -112 -92 113 121
7898 121 312 13 -135 -39 -14 54 -82 185 -133 -138 225 -26 -47 -65 137 -20 -73 -115 -164 28 -92 -29 87 99
7922 99 75 -8 -6 10 -21 -67 -58 138 129 25 119 133 -64 -131 190 24 -213 -166 -228 45 -147 -3 225 56 175 -23
7948 -23 -88 -15 79 -106 -94 1 5 153 121 253 242 91 4 1 -255 -45 179 36 230 6 -34 39 -160 -23 -22 -6
7974 -6 -102 -2 23 -75 -33 244 -123 -176 12 -91 -9 65 360 58 63 126 46 386 32 -88 183 -46 -211 -75
7998 -75 153 74 -62 -156 -137 67 206 86 -68 -210 -150 -46 108 -93 1 123 67 -180 -200 -66 19 54 -10 47
8022D7k46rJ04J89j15lJ65j73K4n4J19j19N0q1J35J25j84l2jj20p0L23l3k9m2
8047c0K03k13qJ0m2p0K00m0j93L12m5r9j1j40J21J76k54K48q0L12n22M2O2j40
8071b01L41k03J59N7M5J5l00j81Q1k6J67o2K37j26l05L55j01Q7J35k74J71o1j71
8094a61J67q6j52J05k2K14Q9P2l20N4k6J00J0m9j23K47j57J91j81j76M0L64k50
8117e0o9J16j29L75m58J24N6J25k12J82j39P9n1J39k40J52L4k74J62K29k05J04
8139E0j68J92l30L22Q1L7l75O0J52r6K62j90j42J07J48q4P6K7j1k18K26j22j66
8162a62K12J34k42L95m18J23MK85m33J67J17k00M67l34k96K42N9j54j68L40k56
8183a18J01L54q44K71J3K80l6M6
$$ plain form
8022 47 -199 -208 -104 85 -30 -33 132 -41 -17 -71 48 -71 -21 -102 33 158 -26 -58 -59 -179 -249 74 41 12 -30
8047 -30 173 -40 -48 -38 -80 -150 50 10 -183 129 84 -15 -26 -166 -45 131 -123 125 45 357 -165 -123 -61 -201
8071 -201 140 -63 96 153 198 213 -87 -268 -187 -213 -46 -108 129 3 -302 53 -48 39 174 -100 71 10 -161
8094 -161 6 -80 -232 -127 -149 65 154 226 -94 -40 -66 34 44 -5 -128 119 -38 153 -28 -204 -164 200 -50
8117 -50 -119 -3 -132 243 -215 -91 -35 90 -122 60 -79 0 -51 88 -152 0 34 -240 -78 151 -54 50
8139 50 -118 74 -256 66 147 184 -191 -131 21 -75 187 -3 -145 -38 110 26 102 129 118 -100 126 4 -162
8162 -162 50 184 -58 337 -81 42 46 331 -102 65 182 -18 449 115 -181 61 120 -34 -202 138 -118
8183 -118 -17 337 -507 -236 -223 57 21 67
8191F7
$$ Imaginary data points
##PAGE= N=2
##DATA TABLE= (X++(I..I)), XYDATA
0@%%%%%%%%%%%qJ6j6J6k4L2l7M5n6O4p2Q8j04J25j49J76k05K34k69L08l49L97
33B12m52N11n76O48p27Q13r07J011j125J248j383J532j694J870k063K274k505
50a313K760l042L350l692M079m513N002n562O210o968P871q964J0323j2068J4399
65G872j7693K2740l1523N1124j76371N4692K28130k12062K3135J77153o7841j73288
77a13932J28191O5592j23894J8573J37352j10729j17005J05300M8761j04504O9194
88B899J21789j00480r8216J03781N619j23436M5387J17624p1567n7093R1772j1950
100B6129j13671O5365J13855p6403o5474R3312K626j11678K1196Q6555m3289l0716
112c2193P6385n100q7791K1546N7540m1964j3973O5333j3862o6235L0551L6803
$$ plain form
0 0 0 0 0 0 0 0 0 0 0 0 0 -8 8 -8 8 -16 16 -21 24 -32 32 -40 48 -56 69 -80 96 -109 125 -144 164 -185 212
33 212 -240 271 -305 343 -384 429 -478 533 -592 656 -727 805 -889 981 -1082 1192 -1313
50 -1313 1447 -1595 1755 -1937 2142 -2371 2631 -2931 3279 -3689 4182 -4782 5541 -6527 7872
65 7872 -9821 12919 -18604 32520 -143851 -89159 138971 -73091 -49956 127197 59356 -113932
77 -113932 14259 79851 -44043 -25470 111882 1153 -115852 -10552 38209 -66295 2899
88 2899 124688 24208 -74008 29773 35392 -88044 -42657 74967 3400 -53693 38079 26129
100 26129 -87542 -22177 91678 15275 -50199 43113 45739 -65939 -44743 41812 -1477 -32193
112 -32193 44192 39092 -48699 -27153 30387 -11577 -25550 39783 25921 -40314 -9763 27040
124B7040n2805o393P1107n030n7039K0330K3406m4751j263N4125j2417m0566K9498
137E242J9787m6326o018M6353m998k8245K4578J2399l8639m017L3734q170k0161
150a4481K3852J0407l0419k218K2531j2970j3956K5460Q644k6404r54J8403j1092
163c197j1039K0704O478j7162L351J2447j4168r591J6890M737j3654M536Q936
176I268j3310p811J3976J904j1663O246R940j0389p684J0495K387q386N199Q807
190H979p185n921O504O13o116L467N756m854l980M077j141n751L021N741l722
205e12k898M332j39m806J606N200j167k470L017N22l765J15L130j133j698K034
221A368N32l700n95K740j093k135K703J693k724j181K879N80k123J320K345j020
$$ plain form
124 27040 -25765 -32158 38949 33919 -23120 -2790 20616 -24135 -25398 28727 16310 -24256 5242
137 5242 25029 -21297 -27315 19038 14040 -14205 10373 22772 -15867 -19884 13850 5680 -14481
150 -14481 9371 19778 -10641 -12859 9672 -3298 -17254 8206 16850 -9554 -10508 7895 -3197
163 -3197 -14236 6468 12946 -4216 -865 11582 -2586 -12177 4713 9450 -4204 332 9268
176 9268 -4042 -11853 2123 4027 -7636 -1390 8550 -1839 -9523 972 3359 -5027 172 8979
190 8979 1794 -4127 2377 2990 -3126 341 6097 1243 -2737 1340 199 -5552 -2531 3210 -512
205 -512 -3410 922 783 -4023 -2417 2783 1616 -854 2163 2685 -1080 -965 2165 1032 -666 1368
221 1368 1900 -1800 -2395 345 -748 -2883 -180 1513 -1211 -2392 487 1067 -1056 264 2609 1589
237A589j973J388P91j925J31J568j394j657J114L55k371M59K322p05j417J597
253a28J030j503r6K240l4j578R62J217j457j255J217L57j771M83O45j151q44R59
271g07l9p65J153O86q82l9J172M78j304P73J371j194j002J303L09j626k91O35
289C1j54j028M85M11p52l5P51k46j39N10P39m44L45N00j32l47J12N77n62o06K08
310B24k95n18k25M46l65l15O74L4q2j8L36L2K33M92k00m3N51P9p38J77L10m80
332C09q46o9L00k32l87j32N30j38Q4K78J63K30L16K09k58M45K60q08K77O4j32
353D63m88J68J2o98p5L46l18o8J43J53KJ4M79J19j93O10M59n87n5O14p78m89M11
376B44Q4o29k52M15m33l21R4M39m14M77L56J17l19N99O4k49P5O01n85k28N13N1
$$ plain form
237 1589 -384 1004 1795 -130 1 1569 175 -1482 -368 -13 -2384 -1925 397 -308 -1725 -128
253 -128 902 -601 -697 1543 1509 -69 893 2110 653 -602 615 972 -799 -316 329 -822 -1666 -707
271 -707 -746 -1511 -358 328 -554 -593 579 1057 -247 526 1897 703 -299 1004 1313 -313 -604 31
289 31 -123 -1151 -666 -255 -1007 -1042 -291 -537 -676 -166 573 129 474 974 842 495 607 1184 622 16 224
310 224 -71 -589 -814 -368 -733 -1048 -374 -340 -422 -440 -104 -72 161 653 453 410 961 1040 302 479 789 309
332 309 -537 -606 -306 -538 -925 -1057 -527 -665 -581 -303 -140 90 406 615 357 802 1062 254 531 595 463
353 463 -25 143 155 -543 -618 -272 -590 -658 -515 -362 -360 -346 133 252 59 669 1128 541 486 1100 322 -167 244
376 244 328 -301 -553 -138 -571 -892 -798 -359 -773 -296 60 177 -142 457 521 272 347 948 363 135 648 699
398F99j182J99M66n96k97J92N45q98O2P74k85j69P98J0l78R6P37o17K89N42j06
419H81j009L93K71j209j82R16k77q09M13L94p36K73Q46m91K96O28p6p22P73N09
439A082n38n99P65p1j112K81L23q00j25P74J48j109M33L55p40K95J465l68p29
458b70J162M10j666L83J318m33j376Q01K94j548q3J127m26q05J084J63j450O64
476f51J598j075m58J517N05j891M29J548j042j157J675L34k095J22J249j169j005
493a566J776M94j798M04J486j639m93K461k80j642J358J043j773r23K318r0j874
510g38O77J433k068q37J517L87j788J213J223j966k73J866l45j360J514J542k059
527f2l57J889j055j478J653P36j759n64J670j059j436J440Q07j392L72J683j236
$$ plain form
398 699 -483 -284 182 -414 -711 -519 26 -872 -810 -36 -321 -490 308 318 -60 36 773 156 445 987 881
419 881 -128 265 536 -673 -855 61 -216 -1025 -612 -218 -954 -681 165 -326 -30 598 522 -200 573 1082
439 1082 544 -55 710 639 -473 -192 131 -669 -794 -20 128 -981 -548 -193 -933 -638 827 459 -270
458 -270 892 1302 -364 19 1337 904 -472 329 623 -925 -1008 119 -307 -1112 -28 135 -1315 -651
476 -651 947 -128 -586 931 1436 -455 -26 1522 480 -677 998 1332 -763 -641 608 -561 -1566
493 -1566 210 704 -1094 -690 796 -843 -1336 1125 845 -797 561 1604 -169 -1092 1226 1136 -738
510 -738 -61 1372 -696 -1533 -16 371 -1417 -204 1019 -947 -1220 646 301 -1059 455 1997 -62
527 -62 -419 1470 415 -1063 590 1326 -433 -997 673 -386 -1822 -382 425 -967 -595 1088 -148
544a48j166J772P01j716P69J763j652j395J855M50k054M20J921j681j398J592
560C3j29j402J015J549j371n76J585m16j457J571J382j726k21J331p35j690J172
577h5J166j727K16J037o89j626J247J035j468K74J729j035j049J319O64j312J55
594a49J993q98j853J090N58j755M05J602q19j031R87l44j122N34J605o63q75J183
612D48M47j906P18J585p51q30J459j78j820M06R66q33o43J358k65j498P72Q73
630C08j015k30J473Q5j095P05P37j295j46J863o51r82L31P33j324n22J206m0p53
649f12M38N68j482J13J058k30m87R79M92q19p7J057n03r83J064M24j393k61J033
668C79n40p37Q47K85r09q4J000m47o02R37L83p01J73P22m76n08R63n4p84K71N76
$$ plain form
544 -148 -1314 458 1159 -557 212 1975 323 -1072 783 1233 -821 -401 1520 -161 -1559 33
560 33 -96 -1498 -483 1066 -305 -881 704 288 -1169 402 1784 58 -163 1168 433 -1257 -85
577 -85 1081 -646 -430 607 -82 -1708 -461 574 -894 -620 1109 74 -975 344 1008 -304 -149
594 -149 1844 946 -907 183 741 -1014 -609 993 174 -857 130 -214 -1336 -802 803 140 -735 448
612 448 895 -1011 -293 1292 541 -289 1170 992 -828 -422 544 -289 -932 426 161 -1337 -565 308
630 308 -707 -937 536 621 -474 231 968 -327 -473 1390 739 -243 88 821 -503 -1025 181 141 -612
649 -612 -174 394 -1088 -975 83 -147 -634 345 837 18 -59 998 495 -488 576 1000 -393 -654 379
668 379 -161 -898 -51 234 -675 -759 241 -206 -808 129 512 -189 -16 706 230 -278 685 631 -153 118 694
689F94r83n09P08j03p04N35R96q70m33J062l74l47L64Q44p77k59Q28m54n69N55
709B04L25o74k80N04j23o53N17Om03K18K82m88J60N45J43m58K50N31m48l34L95
730B19J19l76O1J77k72pj81J31p1o5L04m69mP40l76j12L81J7j35K16K9j71l16
753a61L02J32m09j9Lq8Q2o7P7j41n2K86l11J44J91J91q0j23N02q9l19k85M49L4
777B49j39O4j43P8k11j39R8j89J6o5M44j10J51j21J09L12k97M1L46k17l30K56
799B03q9ll53Qj3q5q4J96m1K88l02L5K4N67k36l54O22j69q5K02l86K43j09J55
823B34l92J81J23l95J85m03N52k89N7k0J96r6j03K13K50l29n4K44K79j10j78M8
845A93m13Q1J23k10pN8j32K48k44J51J01J56q6L54l76K07JQ1l21K85k35J75k37
$$ plain form
689 694 -289 -798 -90 -193 -897 -362 634 -236 -669 393 19 -328 36 880 103 -156 672 218 -351 204
709 204 529 -145 -425 79 -44 -697 -180 -174 -577 -359 -77 -565 -405 140 283 -175 75 606 158 -176 219
730 219 338 -38 23 200 -72 -79 -260 -129 -200 -265 39 -430 -434 306 -70 -182 199 216 81 297 326 155 -161
753 -161 141 273 -136 -155 -152 -240 -158 -225 -148 -289 -341 -55 -366 -222 -31 160 80 -43 459 370 51 -234 215 249
777 249 110 174 31 109 -102 -241 -143 -332 -316 -381 63 -47 104 -17 92 404 107 148 494 277 -53 203
799 203 114 111 -242 -234 -247 -332 -416 -220 -261 27 -275 -240 -216 351 115 -239 383 214 129 331 -55 188 79 234
823 234 -158 23 146 -249 -64 -467 85 -204 -147 -167 29 -67 -170 43 293 -36 -90 154 433 323 145 193
845 193 -220 -139 -16 -226 -233 -175 -307 -59 -303 -152 -51 105 19 373 -3 204 205 286 -35 250 15 190 -47
868d7rp2j15K7L4j59K54j21r1J33Q8L82k72Q6K59Qj66J52k60l9q3J17m91K09j27
893c03p2L6Q0P7j23N3J98Q8Q4l11K53R0J59k80K71k08N2M2o9j93r6Q0j0n0j95
918c47P7K45j05R8K7J57j51K50j76K0j2j51J50J3K7j67J86l70J95k79J05j72K82
941i8%j91JM61j61r9N3M22j20k67K99J5j40j70K66j33m13K93l51K15l57M22k25
964b78k37L93n6Q4m8K80j74J13K25J53k70J71Rl01j66J25k3k10O6O8O5l56K05
987a62J51r5K52o1Q7Pj01J35l49l2M46j24n1NO1k87J4m8oRm7K70k95k94L91p6
1013b00J56L98l91J20J83j2l98J53P1m9j93P5m3k80J81K65k70k12K94J18m64M36
1035f2M60k85k45K33L13m40L34j5k16q7N1J09j06r1j54J8l49N79q8j4q8J19j48
$$ plain form
868 -47 -56 -128 -243 -216 -182 -341 -87 -208 -299 -166 -78 304 32 118 377 385 219 371 111 72 -11 106 -385 -176 -303
893 -303 -375 -339 -259 -182 -305 -252 -54 34 118 -193 60 150 309 29 300 92 144 186 117 -76 -172 -92 -102 -152 -347
918 -347 -270 -25 -130 -32 -5 152 1 251 75 95 83 -68 82 95 122 -45 141 -229 -34 -313 -208 -380 -98
941 -98 -98 -289 -288 173 12 -87 -34 388 268 1 300 315 175 5 271 138 -275 18 -333 -118 -475 -53 -278
964 -278 -515 -122 -178 -94 -142 138 -36 77 302 455 185 356 365 64 -102 23 0 -210 -144 -76 -11 -367 -162
987 -162 -11 -106 146 85 172 179 78 213 -136 -168 278 154 103 108 169 -118 -104 -152 -158 -149 -196 74 -221 -515 -124 -200
1013 -200 -44 354 -37 83 266 254 -144 9 80 31 -162 -87 -130 -410 -229 36 -234 -446 -152 -34 -498 -62
1035 -62 398 113 -132 101 414 -26 308 293 77 -10 41 150 44 -47 -201 -183 -532 47 -41 -55 -143 -24 -172
1058a72J1L68m6k96J34L63m18l6Q6J10j28k39J45J14n52O25j42j38L77k98j11
1079b43J61O4n5p2O14j35l35K47J49j72k90J53j17k54J82k95j73L99J5J04J9j81
1101b15R5r3L49j08K12k34J16j64q8j28M7K11n9qO2N4j75k4p5K6K34Ll04r1M61
1126A04J08n29N33j26L82k78J6j43l67L31p4L4J07n3rn72M93n1k13K40L67k26
1148G4J63k56J02K68l36M8K39j71Lm3k55J96q2q7j53J73o5L2J9L37k03o4L70p2
1172B37j62k26K68k0K44l53L04l11r1%k99L79J4p0k98L20k34M85j13K38j38J9
1194A93q2j33P3J93j27J0J14m24L9K45k64l0O5n5K22j82n1J77p8O7p5M07l18K79
1218B65l04J97j08J58j00Rk41J70n8P2K8l26N6J02l21M55K6M3j3l3j18J86Q1J83
$$ plain form
1058 -172 -161 207 161 -135 -1 362 -56 -92 -6 104 -24 -263 -118 -4 -556 69 -73 -211 166 -132 -243
1079 -243 -82 -18 -73 -145 469 334 -1 246 395 223 -67 86 -31 -285 -103 -398 -571 -172 -157 -53 -34 -215
1101 -215 -120 -213 136 28 240 6 122 -42 -130 -258 -211 0 -59 -67 -5 49 -126 -150 -225 -199 35 38 -266 -357 104
1126 104 212 -317 216 90 472 194 210 67 -300 31 -43 -9 98 45 36 -536 -43 -94 -307 -67 300 74
1148 74 237 -19 83 351 15 63 302 131 134 91 -164 32 -50 -137 -290 -117 -182 -150 -131 206 3 -61 309 237
1172 237 75 -151 117 97 341 -12 292 -19 -110 -110 -409 -30 -16 -86 -384 -64 -298 187 74 312 174 193
1194 193 111 -22 51 244 117 127 241 -183 -144 101 -163 -193 -128 -183 39 -143 -194 -17 -95 -28 -103 304 -14 265
1218 265 -39 158 50 208 108 117 -124 46 -12 60 88 -238 -182 -80 -401 54 80 123 110 77 -41 145 226 409
1242D09m94l2K98j71Q5k1o4P9qr3j04K95k77J32Q5j92M4k19L28J4J52p5m2J70
1266B99l41J04k08p4K8M30k44j50J79k96J48r4P6R9K09l38M18k18j25K46k51J08
1288EL0p7K16j84L9k01O7j06K8r3J2J28J8J26J52k86LJ25o3K42m06L13J8j40R
1313b5J50k05P9k8n3J89j60k30K11j46J22mn9k7M17j15j46K29K26j4n19L03oj75
1337A4p5m8k4L4P0j56j42J11M2k66O17j47P7j42j66K91j51K78k0k17pR7n9j74
1361a63J19j71J57L9j16P7k17J88K29j4j13K16k7k15j02L34j38L0l4k6m67M39
1383B5q3k9l3k5J31l01K10O0Q5KQ1j62J48j63J15J31l4O2k22M31m77Jk78L09P7
1408F1j50N5r9J73j5N5J7k23PJ12K46m5l66Q9J78Q2k36k6k9J44R4m41K91K00n3
$$ plain form
1242 409 -85 -117 181 10 95 74 10 89 81 -12 -116 179 -98 34 119 -73 -29 -248 80 94 246 171 129 299
1266 299 -42 62 -146 -220 -192 238 -6 -156 23 -273 -125 -219 -143 -44 165 -173 245 27 -98 148 -103 5
1288 5 35 -42 174 -10 29 -172 -105 -211 -183 -276 -264 -136 -118 8 160 -126 -123 2 -61 181 -225 88 106 -34 -25
1313 -25 125 -80 -1 -29 -82 107 -53 -283 -72 -218 -96 -100 -159 -186 231 116 -30 199 425 411 -108 195 189 14
1337 14 -61 -109 -133 -99 -29 -185 -327 -216 -174 -440 177 30 107 -35 -201 90 -61 217 197 -20 -27 70 11 -163
1361 -163 -44 -215 -58 -19 -135 -58 -275 -87 142 128 15 231 204 -11 -113 221 83 113 79 53 -414 25
1383 25 -58 -87 -120 -145 -14 -315 -105 -45 40 42 123 -39 109 -54 61 192 158 220 -2 429 -48 -47 -325 -16 61
1408 61 -89 -34 -133 40 25 80 97 -126 -119 -7 239 194 -172 -83 95 177 -59 -85 -114 30 124 -317 -26 174 121
1433A21o43M35N7J28J22l86K03j55K59J8m3j8K74l82K0j51j43L15j23j09J10L00
1455B09j19o7j83K02K2j29Q8J62L9k11J52j80K57j84j35j13J3K22J11j25P5n7
1477D9l45J68R5K22j17J06j71o0J77L3l24K14J31j2l12M8K17k96J68k53K31n2
1499h3K3o5m9J60J81J78r4m08L00Q9k20k60N53j39k77J97Q2m55M87l5k69L2N7
1522a5l2j08L4J13p2n9L18l9k28K55j87K13J05j39k52j58O13l03j53N9K80m45
1544b00K18k3m0l7l4L82m0k80P6K8j07J38J15k66j6L11l11J68k43L20m11J50J22
1567B0j8l26M60j31n4K25p7j29r4L81j96p7o6L67k97J8l7j36j58K52Q2l0J84r9
1591F4P0o0J35k34J82nM6j9l06J92K10k46KN1J17j39j20M8j43L60k46R1Q1j20
$$ plain form
1433 121 -522 -87 -30 98 220 -166 37 -118 141 159 116 98 372 -10 10 -141 -284 31 -92 -201 -91 209
1455 209 90 23 -160 42 64 -65 23 185 224 13 165 -15 242 58 -77 -190 -177 45 156 31 106 49
1477 49 -296 -128 -33 189 72 178 7 -53 124 157 -167 47 178 166 -146 -98 119 -177 -9 -262 -31 -83
1499 -83 -60 -125 -174 -14 167 345 251 -157 143 232 12 -248 305 166 -111 86 168 -287 200 165 -104 -72 -15
1522 -15 -47 -155 -121 -8 -80 -139 179 140 -88 167 -20 193 298 159 -93 -251 362 59 -94 -35 245 -200
1544 -200 18 -5 -45 -82 -116 266 226 -54 22 50 -57 81 196 -70 -86 225 -86 82 -161 159 -252 -102 20
1567 20 2 -324 136 5 -49 176 99 -30 -124 257 61 -16 -82 285 -12 6 -31 -167 -325 -73 9 -21 163 64
1591 64 134 74 209 -25 157 152 198 179 -127 65 275 29 31 82 199 60 -60 -12 -155 205 -41 50 131 11
1615A1P2k53J10L24n0r7j03j91L41l18K83j96J50m5J80j36k53L12n19J48M32j28
1637G4L0j0r1J27j64M23k53l77K25p9K32m44L39j12K07j31r6M0J01l56K54l24
1659c85M34j64J71M8k76K31K57k49K66l52j0K03j95m35N30j75J98j83q7K36r8
1680c5K18l1k69L62j24k21J32M9J36r1L1j28N6j98P9n6j9L2j2k2p0K1J91j15j50
1705b34J50L08k79J79j14%L4j55K67l23J72Nr5O8k28J81L07j61J05m54L02j26
1727i1P5l4m2K89k17K43j99L1R5l17K02K1q8K3l4J6j93K55l25J43K65j31J64o1
1751I0j13j4K0J35k78K16M1j34J91l50L95j40k86K06j11J25k55K58j84J35R9j30
1773h4K3Q4J12r1L2J60l7k75L54k42k88M66k34l5Q3o6L2j8nR3k98N38l93J30J92
$$ plain form
1615 11 83 -170 -60 264 214 117 14 -177 164 -154 129 -67 83 38 218 82 -171 141 -378 -230 202 74
1637 74 104 94 3 130 -34 389 136 -241 -16 -95 137 -307 32 -80 127 -4 -100 -60 41 -315 -61 -385
1659 -385 49 -115 56 104 -172 59 316 67 333 -19 -29 174 -21 -456 74 -101 97 -86 -173 63 -35
1680 -35 183 152 -117 245 121 -100 32 81 217 126 157 29 85 -113 -34 -90 -109 -77 -89 -111 -181 -160 31 -84 -234
1705 -234 -84 224 -55 124 10 10 44 -111 156 -167 5 10 -85 -17 -245 -64 243 82 187 -267 35 -91
1727 -91 -16 -50 -92 197 -20 223 24 55 150 -167 35 56 -32 -9 -43 -27 -220 35 -290 -147 118 -13 151 90
1751 90 -23 -37 -17 118 -160 56 97 -37 154 -196 199 59 -227 -21 -132 -7 -262 -4 -188 -53 46 -84
1773 -84 -61 23 135 44 76 236 199 -76 278 36 -252 214 -20 -55 28 -38 -6 -24 -29 64 -234 304 -89 41 233
1798B33l19k37L09o9j53K37Q5Q0k61P1J96k96NK29j90qJ75j73J70j36P6L8N3r5
1822B0k03J13J51j26qN2r8qm5p3K7Q0l4K45j49J8k3m2j55K87J42j64J40N5j60
1847D2l9j01K82j63j85J68j34P8Q9k28J38Q5j1j73pRM67j53k7o4jL3J09l63J32
1872a7M3j26J15j65M1L05o27K35K48k3OK0K38j38J0k49O8J69l14K62k19J99J63
1895B44l12K12K0j57k45K29J7J44k44J02J53m9j70J79l1j18J3K5J18K1j50j56
1917a55O5J9K0Q4k2L07n51J58R3R0l28L34K28j76o4p1J97j48j91J20L7j90K10
1940F6j4J0l80L96j63J25M6J20j97MO3J2m2K2N4J8k29j9K35k11K2LK84j66k27
1965a68N3L34j64M5k78K89l31J90R6K05l34K42o5l54K53j87K74O1n8r7j02L43
$$ plain form
1798 233 -86 -323 -14 -83 -236 1 86 166 -95 -24 172 -124 -119 110 -80 -88 87 -86 84 -52 24 62 115 20
1822 20 -183 -70 81 -45 -53 -1 -99 -107 -152 -225 -198 -118 -152 93 -56 -38 -61 -103 -258 29 171 7 147 202 42
1847 42 3 -98 184 21 -164 4 -130 -52 37 -191 -53 32 21 -152 -159 -150 317 164 137 73 72 105 214 -149 -17
1872 -17 26 -100 15 -150 -109 196 -431 -196 52 29 35 55 293 155 165 -84 -16 153 -161 101 -118 81 244
1895 244 -68 144 164 7 -238 -9 8 152 -92 10 163 114 -56 123 92 -26 -13 12 130 151 1 -155
1917 -155 -90 -71 -51 33 11 318 -233 -75 18 108 -220 114 342 166 102 31 228 80 -111 9 46 -144 66
1940 66 52 62 -318 78 -85 40 86 206 9 13 76 88 46 68 122 140 -89 -108 127 -84 -62 -59 225 59 -168
1965 -168 -115 219 55 100 -178 111 -220 -30 66 271 -63 179 114 -240 13 -174 100 161 103 6 -96 247
1987B47l95Q1r8q4K03K9J85j66p5J81j02o4K06m6J01l15J77o4K34n12K55K34k76
2010f4m4q7K79j02p2O6q6J71k62RK60j3l9j53L60j93%m2j32N3R9j05m9j60K44
2035f2q5J04P7j63L45l71P9K9J85l7j75J50o6k14N73k25j65J19J01j43j30l0P
2058i7R7K8l1j23J96k32L76k28N5k52J98M3R5k40N0P6j9q4J28J0K9j87K75j59
2082Dp2m2L19k29j8L28l79J32o6J18j05J1P6k23N5N5j7o4k9m17M56L94m15J88
2106F0n5J47J75l25K81j84l5p6m0J49k23L75k71l8j57K03j33j04K42j1j04J75
2128E1p0M2o3J11o8lM3R4o6k16J54K9j3R2k03Q7J96m25K0K37j08J15r5M6Q7j25
2154e1K68j02n3j01K50j58K06m82l8J31J51n4RL1r3J78mk83Q8q4K55j16J17Q0
$$ plain form
1987 247 -148 -67 -165 -249 -46 -17 168 2 -73 108 6 -58 148 102 203 -112 65 1 235 -277 -22 212 -64
2010 -64 -108 -195 84 -18 -90 -24 -110 61 -201 -192 68 55 16 -137 223 30 30 -12 -144 -91 8 -97 -146 -306 -62
2035 -62 -147 -43 34 -129 216 -155 -76 -47 138 101 -74 76 10 -204 369 144 -21 98 199 56 -74 -104 -97
2058 -97 0 28 -3 -126 70 -162 214 -14 41 -211 -13 30 125 -115 -65 11 -8 -92 36 46 75 -112 163 4
2082 4 -68 -110 209 -20 -38 290 -89 43 -23 95 -10 1 77 -146 -91 -36 -53 -117 -146 -563 -107 287 -128 60
2106 60 5 152 327 2 283 99 64 -12 -52 97 -126 249 -22 -60 -217 -14 -147 -251 -9 -20 -124 51
2128 51 -19 23 -40 71 3 0 43 137 71 -145 9 38 25 117 -86 1 197 -228 -208 29 -79 36 -59 -13 74 -51
2154 -51 217 115 62 -39 211 53 259 -223 -261 -130 21 -33 -24 7 -86 92 88 -195 -107 -191 64 -52 65 145
2178A45m1j48J45p7O1j84K66j48K7L1j00j4P7q9K76j97L2j59J71J91k56Q9j45
2201d7M11k59k36K7P7M2J0%l40M05o1k42J73J08j52J43R3p3j9J04j77k0o6P3J58
2226A32j78jJ28l1k82R1J33mj57j56K00J50K58j60l46K88n9p2j21J51Q3k9J44
2249A62k34L12m76J95o8K16P9j80l5M6j18j43J30P6j15K85r9o9r9J99j98K20p7
2272IJ36k47J38r9J86m5k41p9M2j23L23J4Q6p9R3l16P0M64l67K3Q7k31N2P7R2
2297F5j44J61K2j5j78L10l44N3k1N1J93j9k15J93j12jL0j34N4N0j01p8J06k9N5
2322d8K12p4N8m86L58J6O9J61l16M0J20k7j03o3K24Jj46ML7J45l21J49J48k43
2346h5J52p2j81L22r7j01q9J11R2m4K1o6K58m26L73q8j68M09k20j21j02J39r8
$$ plain form
2178 145 104 -44 101 24 85 -99 167 19 46 77 -23 -37 40 -49 227 30 62 -97 74 265 9 98 -47
2201 -47 364 105 -131 -104 -27 15 25 25 -315 90 29 -213 -40 68 -84 59 152 79 60 164 -13 -33 -99 -26 132
2226 132 -46 -47 81 50 -232 -141 -8 -12 -169 -325 -125 25 283 123 -223 65 6 -66 -187 -36 47 18 162
2249 162 -72 240 -236 -41 -109 107 186 6 -29 17 -101 -244 -114 -38 -153 132 33 -36 -135 64 -134 86 9
2272 9 145 -102 36 -63 123 78 -163 -242 -200 -323 0 14 100 21 114 -202 -132 332 -35 -12 75 -156 -104 -27 65
2297 65 -79 82 104 89 -89 221 -123 -70 -91 -40 153 134 -81 112 0 -1 29 -105 -51 -1 -102 -180 -74 -103 -48
2322 -48 164 90 148 -338 20 36 105 266 -50 -10 110 83 -20 -83 141 142 -4 0 37 182 -139 10 158 -85
2346 -85 67 -5 -186 136 39 -62 -151 -40 52 8 29 -37 221 -205 168 80 -88 321 101 -20 -122 17 -81
2369h1J51J13l86J54j70L24k69K19j81j13K71j01K13j30J1j11N2K1J72Rm2n5j04
2392c3l6J10j20J79j65p2L44l80L11k74L29j34k35J53M9o5pJ35r3j05r2K80Qp5
2416A2l11M04j52m0n5J65R1jj64Q1J15r6lo0k26J38R3KN8j99K54k52L8J17k02
2441a93K04j31K27j70O2K5j68K24l06J05K03Q6q0J44k69o2N9j58O2j7J3J04j93
2464b29O3L53k31K79j46p6K18j7m0J55l74J21j40PJ77r2j07L63m90K17J5n6mj23
2488a57N6J32L1j27J04K97j20l85K66j49K51j35p7J28j81K75m04L35L0m05K04
2509c1M1j7L54p8l15J87j59p2J98j15J6j10j3J98J53L2l31K89j65m0j27m38O44
2532A01K3O6J21m28PL4K72j12k57J2K37p0j51J71k73L29k84K46q1J82j14k55K78
$$ plain form
2369 -81 70 183 -203 -49 -219 105 -164 55 -126 -239 32 -69 144 14 25 -86 -34 -13 159 168 126 71 -33
2392 -33 -69 41 -79 100 -65 -137 207 -173 138 -136 193 59 -176 -23 26 -39 -46 89 -4 -109 -201 79 87 12
2416 12 -299 105 -47 -87 -142 23 114 113 -51 30 145 49 46 -14 -240 -102 -9 -7 51 -148 106 -146 -108 9 -193
2441 -193 11 -120 107 -63 -1 24 -144 80 -226 -121 82 168 88 232 -37 -99 -40 -198 -136 -153 -140 -36 -229
2464 -229 -166 187 -44 235 89 13 231 214 174 329 -45 76 -64 -57 120 28 -79 284 -206 11 26 -30 -34 -157
2488 -157 -101 31 62 -65 39 336 216 -169 97 -52 199 64 -13 115 -66 209 -195 140 170 -235 -31
2509 -31 10 -7 347 269 -46 141 -18 -90 108 -7 9 -101 -114 84 237 269 -62 227 62 22 -105 -543 101
2532 101 124 190 311 -117 -110 -76 196 84 -173 -161 76 6 -145 26 -247 82 -202 44 -37 145 31 -224 54
2555E4M6J71j96O0q0P2l19J13K2K5j70K72o8m74N99j1l20m9K05j25P4L10k16P
2579BO2J6j00r5K00Q6k82K0K74l64K34j45j19K45R5q1K9J67k12K2N5j48M8k03
2603a94K30j31K16j93M5J04q4j54K63k23J38J2k24O8K77m37J51q8N24k45r3m3
2625h1q8l3L23q3n7J98k36J1J28j26pm6J2K88o2k70J70k14J56n9J21J6n7q9O5
2650b0K74k97J29k72K88j91j8r5L49M1k21J57j48j29K19l78N34j73l91J56K66
2671H0%O5j36Q2j06j65P5L9M1L5j28K72l58p9K07M9J09j60O7J55Oq2p7K74m28
2696a63O5L98k39m9O9k55K00j87K86L2l16J99j71L21k75j10L08k54J44J24j10
2717A7j77K42j32N7m9j71K58r5K50k28j00L64k10k69R6K07n3J98l6k22O7j1K49
$$ plain form
2555 54 100 271 75 135 55 127 -192 -79 -57 -32 -202 70 2 -472 127 116 -204 -253 -48 -173 -99 211 -5 2
2579 2 64 80 -20 -115 85 171 -111 -91 183 -181 53 -92 -211 34 129 48 77 244 32 54 109 -39 9 -194
2603 -194 36 -95 121 -72 -27 77 -7 -161 102 -121 17 29 -195 -127 150 -287 -136 -224 300 55 -38 -81
2625 -81 -169 -202 121 38 -19 179 -57 -46 82 -44 -51 -97 -85 203 141 -129 41 -173 -17 -76 45 61 4 -85 -20
2650 -20 254 -43 86 -186 102 -89 -107 -202 147 188 -33 124 -24 -153 66 -312 222 49 -342 -186 80
2671 80 80 145 9 91 -15 -180 -105 -66 -25 10 -118 154 -204 -283 -76 -27 82 -78 -11 144 150 68 -9 265 -163
2696 -163 -98 300 61 12 81 -174 26 -161 125 157 -159 40 -131 190 -85 -195 113 -141 3 127 17
2717 17 -160 82 -50 7 -42 -213 45 -50 200 -28 -128 236 26 -243 -147 60 7 205 169 -53 14 3 252
2740B52o2j67O2j34j32K77M8j12j72K16j92J7P7o5K19k23k0m3N6M2J64k05K40
2763A43k27J38K34k64m0p8j13J47Q9j81J25j58L56K53l06j81K95k69K87k53j72
2784a75L66J13j44k14j38J45N0L8q4j98L21l1j18q5K46j49LR9k48K77j92R5n5
2807g8o1K94j43j23k2J14jj38L2k2J5J49j07K60R0m53J91K18M0k72j13L42k85
2830g3k8j0o1j38K36k40m3J89J54L37l88P9jJ57l39K01P1j17O9l01N0K01Q8j55
2854f2J55J53j29N3m11M28k89l1J2J86k01J17K0j08J63L1l6J3j40J03q7m1rO0
2878e0O1j22K69k92O3J66k21J15k86J99J52nk2J62j00q6k53L59j62LJ92q7j76
2901a21J7J69j10K02j48j0Jl34J63K25j98L5Q8r1o2l3L15O1n6k34L78k74P2k17
$$ plain form
2740 252 190 23 85 -49 -181 96 144 32 -140 76 -116 -99 -22 -87 132 -91 -111 -154 -98 -56 108 -97 143
2763 143 -84 54 288 24 -16 -94 -207 -60 29 -152 -27 -185 171 424 118 -63 232 -37 250 -3 -175
2784 -175 191 304 160 -54 -192 -47 3 41 -43 -241 80 49 -69 -154 92 -57 -54 45 -203 74 -118 -23 -78
2807 -78 -139 155 12 -111 -133 -19 -20 -158 -126 -148 -133 16 -91 169 259 -194 -3 215 255 -17 -130 212 -73
2830 -73 -101 -111 -172 -310 -74 -314 -357 -168 -14 323 -65 14 13 170 -169 32 103 -14 55 -246 -196 5 93 -62
2854 -62 93 246 117 170 -241 187 -102 -133 -121 65 -136 -19 1 -107 56 87 51 64 -76 27 -60 -101 -110 -50
2878 -50 11 -111 158 -134 -71 95 -126 -11 -297 -98 54 49 27 189 89 3 -250 109 -53 -50 142 55 -121
2901 -121 -104 65 -45 157 9 -1 0 -334 -171 54 -144 -109 -21 -112 -174 -207 108 169 113 -121 257 -17 55 -162
2925a62lP4j41K62K23mk4k0j30k61J11M0j0L11l87K61k89J95r0J79l8l41J02J32
2949a0k5K18k79rJ05J59j68K23j48j89j6K16p8K80j18l6l99L5J04j0J33p3q0R2
2973g3J21l6q5j45M69j43n5O8l22M6J6L36l0k02Mo2J58K1J17r9q8J17k5p9k12
2998a83K33j91K93p3j00j68K20j18J20l6M3k68L34k34K68j57j16J69J22l05J41
3019fj20K01R5l21n5Q9J76L4K15o16M36k70K21R7k05r5j14L50m5j4K28m26L09
3042A64k17J37j27K62m51L21J42l89J41k55J84Q2o0j69M27k68k9J92l5j26K67
3063A93l50N58m61m2Ol7L26j23k1o3j68K47L5k91K15N1j37M1K55m76l9J43K02
3086F4j65n7K4J51RQ6j45o1J38m5M9j52J3L8K7j4J53j78l21M17N3j09k01J25L8
$$ plain form
2925 -162 -165 -91 -232 30 253 249 225 205 75 -186 -75 -35 -45 266 -121 140 -149 46 -44 135 97 -244 -142 -10
2949 -10 -35 183 -96 -105 0 159 -9 214 66 -123 -139 77 -1 279 161 125 -274 -239 -135 -145 -12 -85 -165 -73
2973 -73 48 12 -73 -218 251 108 53 121 -201 -155 -139 197 167 -35 -31 -93 65 86 203 104 16 133 108 29 -183
2998 -183 50 -141 152 79 -21 -189 31 -87 33 -3 40 -228 106 -128 140 -17 -133 36 158 -147 -6
3019 -6 -126 75 170 -151 -206 -117 59 93 308 -308 128 -142 79 176 -29 -124 -238 112 67 53 281 -145 164
3042 164 -53 84 -43 219 -232 89 231 -158 -17 -272 -88 -6 -66 -235 192 -76 -105 87 52 -74 193
3063 193 -157 401 -60 -102 -96 -133 193 70 49 -14 -182 65 100 -191 24 75 -62 -21 234 -242 -281 -138 64
3086 64 -101 -158 -134 17 26 112 -33 -94 44 -1 48 -104 -91 -53 -26 -40 113 -65 -386 31 84 -25 -226 -101 -63
3111f3J28k41J37j69k9L86j01P4k10Q3J14J00j14K17k88k78J07L77j54J9j78K40
3133A57j44r7O7J22p2j77p1M34j37k50J68J49j69J15J59k24j00K50k97R2J03k18
3155a40M26l99N5P3J07o7K16j57J8k5n7j81K54j41N3k6n8kK07r4j18K16k71J45
3179C4k87J61l3R3L1j0j63M58l93K1%J22l67K65kK89j50K62k16j21O4l18K02J98
3203A40j73J76j14R8l0j29JK64j33l5j86J72k33J07j63J73LL9J0R8R4j16q6j55
3227a78O7m3K86j77l3K12k05K47l21P3j7j55J01J61o7J40m3k40J32l15L05L87
3249C17l03j52o3J66j48J88o2P5n7K58j46j2l45L87j18N1j85R2K41j96L86n11
3271a37K22J0O9j77K29l59J13k09M0K77on1J23Q6p3k81o5M94m09K70l40M05j38
$$ plain form
3111 -63 65 -176 -39 -208 -237 149 48 122 -88 -5 109 209 95 312 24 -254 -147 230 76 95 -83 157
3133 157 13 -84 -17 105 33 -144 -215 219 82 -168 0 149 -20 95 254 30 -70 180 -117 -25 78 -140
3155 -140 286 -113 -58 15 122 55 271 114 132 107 50 -131 123 -18 35 9 -49 -51 156 62 -56 160 -111 34
3179 34 -253 -92 -125 -32 -1 -11 -174 284 -109 -88 -88 34 -333 -68 -70 219 69 331 115 -6 58 -260 -58 140
3203 140 -33 143 29 127 97 -32 -31 233 100 65 -121 51 -182 -75 -238 -65 -62 -23 -13 85 179 63 -23 -178
3227 -178 -111 -154 132 -45 -78 134 -71 176 -145 -72 -89 -244 -143 18 -49 91 48 -192 -60 -375 -70 317
3249 317 14 -138 -201 -35 -183 5 -57 18 -39 219 73 61 -284 103 -15 36 -149 -57 184 -12 374 -137
3271 -137 85 95 164 -13 216 -143 -30 -239 -199 78 72 21 144 230 157 -124 -189 305 -104 166 -174 231 93
3294I3k41M23k35j43J37Q1k02L36k46J32J1J39m73L91j29m3J93l23J27k3J18k63
3316a40p1L34p4K0j14j36o3L45j14m3n0K29k90L92j13j2l39J55M13m10L4P1k45
3339b21N4J33l3J02k3p7PJ03N9k33N8j13L42j43J49j90r3o6Q4P5N0j82L66j4k27
3364c3J68m9j25l9N0j04L40m45L96j78J14l9j43J77j95K72j35j47N0j36L11j49
3386c9j63L05k45J96L5j81o5Q0r4j2M65k48n0l7J16p3j12K71J4o9j51L6K4j67
3410a64J04J11j60K41j55J1R9j10J90k16q7L02m91J93J26Ok27K84o3K43m16J73
3432fR1k69L0j4J7R3l7j57J36R7M1M7j61K6M61l69j9N6q5m2J18k61R5J5L14J7
3458B34k50k58K01M9K20n6j38K67j83j64k58L35O7k38J23N8k1J03j70O9l00K53
$$ plain form
3294 93 -148 275 40 -103 34 115 -87 249 3 135 146 285 -188 203 74 31 224 -99 28 5 123 -140
3316 -140 -211 123 49 69 -45 -181 -244 101 -13 -56 -106 123 -167 225 112 100 -239 -84 329 -81 -47 24 -221
3339 -221 -167 -34 -67 35 12 -65 -58 45 104 -129 -71 -184 158 15 164 -26 -119 -185 -101 -26 24 -158 208 194 -33
3364 -33 135 86 -39 -78 -28 -132 208 -237 159 -19 95 56 -87 90 -105 167 32 -115 -65 -201 110 -39
3386 -39 -202 103 -142 54 89 -92 -157 -77 -171 -183 282 34 -16 -53 63 -10 -122 149 163 94 -57 -21 3 -164
3410 -164 -60 51 -109 132 -23 -12 87 -23 167 -49 -136 166 -325 -132 -6 0 -227 57 -6 237 -179 -6
3432 -6 85 -184 -154 -168 -151 -58 -95 -252 -116 -19 22 69 -92 -66 395 26 7 63 -22 -64 54 -207 -112 -97 217 234
3458 234 -16 -274 -73 -24 196 140 2 269 86 -78 -336 -1 66 -172 -49 9 -12 91 -79 -10 -310 -57
3480e7K3J04m7j5L5j9R9l53K36nj24Q5j04J28K20r5r7j01J06j82K60j3J4J15k32
3505a9Q6O7r1M0j83J03k81K19M9j17L33k55J1qk9j85K93j75q9L86k61J34J03p7
3529E4R0k15J64j41K28j63l2Q5j75J24J37n5k57p2K15LpR1Q0n1l51M10j04j46
3553h8N9K95m84L40rm63L80q4m0J02m6J29o9L9N7k51P8j8jj12J87j31O2J57j35
3578d6j23J33l9K3J48j25L49k67J00k86L5L9R4K26m36j74K31J25j06J12k94J76
3600a05L1J74j11J10j01J63j5l14L1L50l42K59k56j42K99j7J37j28jM5p2J73k72
3623a04m5K11r6K12k84K76l07M42k40j55K85l57M54k68k5m0p3K64k75K48l12K31
3645D2p4j64J68j01O3R5J28q4j70k7P3J68k52N2J19K1m6J85O0l26nK38k94J60
$$ plain form
3480 -57 -34 70 23 8 43 24 123 -230 6 1 -123 -38 -142 -14 206 111 14 -87 19 -163 97 84 98 213 -19
3505 -19 67 134 43 83 -100 3 -278 -59 -10 -127 206 -49 -38 -46 -75 -260 33 -142 -231 155 -106 28 131 54
3529 54 144 -71 93 -48 180 17 -15 70 -105 19 156 101 -156 -228 -13 -10 -17 74 154 103 -248 162 58 -88
3553 -88 -29 266 -218 122 113 -350 30 -54 -94 8 -38 91 22 61 118 -133 -55 -73 -74 -186 1 -130 -68 89 -46
3578 -46 -169 -36 -75 -52 96 -29 320 53 153 -133 -98 -59 35 261 -175 -349 -118 7 -99 13 -281 -105
3600 -105 -74 100 -11 99 -2 161 146 -168 -137 213 -129 130 -126 -268 31 14 151 23 22 67 -5 168 -104
3623 -104 -149 62 -34 178 -106 170 -137 305 65 -90 195 -162 292 24 -1 -41 -114 150 -125 123 -189 42
3645 42 -32 -196 -28 -129 -66 29 157 73 -97 -124 -51 117 -135 -83 36 57 11 196 256 -70 -75 163 -131 29
3669B9P8k7J32k47J20m4L8j36J21O1l0J03k63K68j93l6Q5k8K2P9j27L4j06n3O1
3694e9nL6M0k17L57M7l55n5M50j00j56J08j79M09m21L5P9k00J00J73kq0K53m06
3718a48J56j21J58J6r7J66k21j73L82n4j61K17p0J04n5k7r7j6RL7J07J87j73K2
3742A48k73K68j27n5N7j57K81j0k66K00pj31J52k69J42o8L21j89j8l7K57j36J3
3765I6o5J44j16r1J61l3j07L76k17k74NJ74q2J50k74K32M2K0j10K2K14k54J05
3788A18K4J9P2k60l0Q7j25q7L05M5kl04o2M22k17o6j2J36J31o2j03O0P7l37L61
3813A90K0k11K50j40j23j0K69l07K14j57o0J46rK51m82j4J63Q4m5K57m56J54k6
3836d2p0M17l3k65k31L31j12Q1m7j4j58JL90n9K2k83j0J71j27J43k56j35J78J41
$$ plain form
3669 29 107 80 212 -35 85 41 79 -57 64 125 95 198 -65 203 10 -26 59 31 53 132 5 39 -67 -120 -59
3694 -59 -64 -28 12 -205 152 199 -156 -211 239 139 -17 91 -88 321 -100 -65 14 -186 -86 87 85 5 258 -148
3718 -148 8 -113 45 61 -36 130 -91 -264 118 64 -97 120 50 154 99 72 -25 -41 -32 5 112 299 126 148
3742 148 -125 143 16 -39 18 -139 142 132 -134 66 59 -72 80 -189 -47 -115 206 17 -1 -38 219 83 96
3765 96 31 175 59 -32 129 96 -11 365 148 -126 -121 53 -29 121 -153 79 121 141 31 53 267 13 118
3788 118 142 161 233 -27 -57 30 -95 -182 123 168 166 -138 -200 222 5 -61 -73 63 194 132 29 89 166 -171 190
3813 190 210 -1 249 109 -14 -24 245 -62 152 -5 -65 81 72 323 -159 -173 -10 74 29 286 -170 -16 -42
3836 -42 -112 305 272 7 -224 107 -5 76 29 15 -143 -142 248 189 211 -72 -82 89 -38 105 -151 -286 -108 33
3860C3j93K07j55J16k11J25J15j39K06j1k09J19j04m1M62m77J07K52n1J38k17
3881G2k0Q0Kk46j1M01k74J1m4J72l97K41j15pK23j01J1j48J46N5M2M7l28K39m6
3906Ep1j52j8J07L89j0k43j1N9K2P1m6O5j73J80l79M25j88k26J96j07K4N4q5R6
3931a6J18J02j82Q5k50J75R6k78J0OK31n2m3K08k25r9K12N0q1j60K25m9j80nR4
3956hM3J13k35L33j73p5R0J32j88P2j35J47m2k15PoK00k32K71r5J7j52K16j3r8
3981b6L5j82N5L71j73k02P4K34k03O7J1j54k65L97k8P6m1J06K6k28K3K45m65J58
4005h9M39l60K4P9o3R3j08K8N4j47J15Nl79L88q2Q2k00N7J64K9j72O9L64n34J03
4030d1J02N7o7J5n8j3J8l5J57J81m10K09N9l61K33J8q1j08l8J24R6j5r0k40O5
$$ plain form
3860 33 -160 47 -108 8 -203 -78 37 -102 104 93 -116 3 -101 -142 320 -157 -50 202 151 289 72
3881 72 52 132 134 -112 -123 278 4 15 -29 143 -254 -13 -128 -135 88 -13 -2 -150 -4 51 93 140 -188 51 5
3906 5 -66 -218 -236 -129 260 250 7 -4 55 77 148 102 167 -6 174 -205 220 32 -194 2 -105 -81 -27 -112 -16
3931 -16 102 204 22 107 -143 32 128 -150 -140 -134 97 45 2 210 -15 -114 98 148 67 -93 132 83 -97 -102 -8
3956 -8 35 148 -87 246 73 -2 88 220 32 104 -31 116 74 -141 -134 -140 60 -172 99 4 21 -131 85 72 -26
3981 -26 9 -173 -118 253 80 -122 -48 186 -17 50 61 -93 -358 39 11 87 46 152 178 -50 -27 218 -247 -89
4005 -89 350 -10 14 93 30 123 15 43 97 -50 65 70 -309 79 -3 79 -121 -64 100 129 -43 26 390 -144 -41
4030 -41 61 118 51 66 8 -5 13 -22 135 316 -94 115 174 -187 46 64 -17 -125 -163 -39 57 42 -48 -288 -223
4055b23L17j99J80r7r2n6J68j15J65j46J67O6k78P1j30jN24m94K48M0l39K51Q2
4078A09j52L9J54N5k8k66K03j07RN1O8j57n3L1J16j42m6O4j64j6J43K72j63j34
4102a14J7N8qj9PQ5k96K01J06q0M02l58j03J33k65K5J24K43k23P9j50nJ71j78
4126a48N1nK14j20p3kJ3M5l23M80k17K82l9Pj22K11l84Q8pK94j45R9r1k66K41
4151H3k30K15J41m45M47j19k00j04LO8KP1j0K27k77M95l88K01r7n5j23K05j60
4174e0R2l2K60l18K18l37K4p0K51j77l8K31j29J01J4j14m9L72j57J9J46k18M1
4197H0Q3L4q5j10R3o5J11n27M96m16L13N7J8k16K1k26K90J18Q6k19R5n5O3J90
4221B29L1j80N2r0O1j86K53j06q1l2J43j81o4k2k7K09j7J92Mj85Q5j44k63M95
$$ plain form
4055 -223 94 -105 75 -22 -114 -170 -2 -117 48 -98 69 135 -143 -72 -202 -203 321 -173 75 115 -224 27 109
4078 109 -43 -4 150 205 177 -89 114 7 16 67 135 -22 -75 -44 72 -70 -116 -52 -216 -232 -89 183 20 -114
4102 -114 -97 -39 -47 -66 -59 26 -270 -69 37 -43 359 1 -102 31 -234 -209 -85 158 -65 14 -136 -141 30 -148
4126 -148 -97 -102 112 -8 -81 -83 -70 -25 -348 132 -85 197 158 165 43 254 -130 -42 -49 245 100 199 108 -158 83
4151 83 -147 68 209 -236 211 92 -108 -212 -209 -141 -139 -68 -78 149 -128 367 -21 180 83 28 -95 110 -50
4174 -50 42 10 270 -48 170 -167 -143 -213 38 -139 -177 54 -75 26 40 -74 -123 249 92 111 257 39 80
4197 80 163 197 112 2 95 30 141 -386 110 -306 7 64 82 -134 -113 -339 -49 69 155 -64 31 -24 39 229
4221 229 260 80 132 42 103 -83 170 64 -17 -49 94 -87 -151 -173 -200 9 -8 184 188 3 88 -56 -319 176
4245A76l73M35ok79Q7j5K26m35N00j81k25j44K95J17j75p0K96k99j67L17k87J15
4267i2P9K43p6j36j64K61m8Nm5o6k84L23J01p4k8O1K59m56J70J7j25m3Q8J7p0
4292h3J57j53J75p5J22k96K42n4K8Pn0k3J61J10j60j22P0R5n2j12M6J67j83j66
4316a49o6mJ26j9nM9L62l12j28M9J36J71k10K77m64J07p4K22L5k54J19r7Q9j72
4340b12K32Q1k51R5qK38k20L19m56j7J59J49j79l4J76j6j61o2J70L35j68m45K16
4363e9K34q2j23M4k90oK81J7o6K2Q2K5j72M2n6J55KKJ77j5n0r5j06K78l77K2K42
4390A28k47m3m4M22r5l75L71k31R5J42k16J05k02M89m20J79j57L15j08nr0Q4j7
4413H0l23J25k2L84l15J41j29j5L0J58m3k44J44pj44R1K02k16J20O7j24k45M78
$$ plain form
4245 176 -197 238 232 -47 40 25 251 -184 316 135 -90 -234 61 178 3 -67 229 -70 -237 80 -207 -92
4267 -92 -13 230 154 18 -146 115 67 72 27 -39 -323 0 101 27 -1 60 319 -137 33 50 -75 -118 -30 -13 -83
4292 -83 74 -79 96 21 143 -153 89 35 63 70 20 -3 158 268 108 -14 56 151 99 -13 33 200 17 -149
4316 -149 -215 -219 -93 -112 -117 -68 294 -18 -146 -97 39 210 0 277 -187 -80 -154 68 103 -151 -32 -129 -40 -212
4340 -212 20 101 -150 -55 -63 175 -45 274 -182 -199 -40 109 -70 -104 72 56 -105 -167 3 338 170 -275 -59
4363 -59 175 93 -30 14 -276 -282 -1 16 -50 -28 54 79 -93 -51 -107 48 50 52 229 214 164 69 -37 241 -136 -114 128
4390 128 -119 -162 -206 216 121 -254 117 -114 -19 123 -93 12 -190 299 -121 58 -99 216 108 103 13 97 80
4413 80 -243 -118 -140 244 -71 70 -59 -74 -44 114 71 -173 -29 -36 -180 -89 113 -103 17 84 -40 -285 193
$$ [...]
8191i4
##END NTUPLES=NMR FID
##END=
