##TITLE=1H_LR-0169-C2-CH2Cl2
 CDCl3
 8 sc, 
 28.8.2023
##JCAMPDX= 6.0         $$ Bruker NMR JCAMP-DX V2.0
##DATA TYPE= NMR FID
##DATA CLASS= NTUPLES
##ORIGIN= UXNMR, Bruker Analytische Messtechnik GmbH
##OWNER= root
$$ XWIN-NMR		Version 3.5
$$ Mon Aug 28 14:26:38 2023 Russian Standard Time (UT+4h)  she@DPX200
##.OBSERVE FREQUENCY= 200.13135
##.OBSERVE NUCLEUS= ^1H
##.DELAY= (6, 6)
##.ACQUISITION MODE= SIMULTANEOUS
##.ACQUISITION SCHEME= undefined
##.AVERAGES= 8
##.DIGITISER RES= 18
##SPECTROMETER/DATA SYSTEM= spect
##.PULSE SEQUENCE= zg30
##.SOLVENT NAME= CDCl3
##.SHIFT REFERENCE= (INTERNAL, CDCl3, 0, 15.7039)
##AUDIT TRAIL= $$ (NUMBER, WHEN, WHO, WHERE, WHAT)
$$ ##TITLE= Audit trail, XWIN-NMR		Version 3.5
$$ ##JCAMPDX= 5.01
$$ ##ORIGIN= Bruker BioSpin GmbH
$$ ##OWNER= she
$$ F:/spectra/data/she/nmr/H-F/1/audita.txt
$$ ##AUDIT TRAIL=  $$ (NUMBER, WHEN, WHO, WHERE, WHAT)
(   1,<2023-08-28 14:25:33.75 +0400>,<she>,<DPX200>,
      <created by zg, POWCHK disabled, PULCHK disabled
       configuration hash MD5:
       00 E9 B6 7A A2 85 ED C7 34 08 36 98 17 FE 4E 26
       data hash MD5: 16K
       3F 1E 40 EB 40 A8 7B 7F 14 43 FD D4 51 C2 34 08>)
$$ ##END=
$$ 
$$ hash MD5
$$ 72 95 6B 17 FE 4E 1A 6F 10 DB 29 A4 75 9A 5E 54
##$RELAX= 
##$RELAX= 
##$RELAX= 
##$RELAX= 
##$RELAX= 
##$RELAX= 
$$ Bruker specific parameters
$$ --------------------------
##$DU= <F:/spectra>
##$EXPNO= 1
##$NAME= <H-F>
##$PROCNO= 1
##$TYPE= <nmr>
##$USER= <she>
##$AMP= (0..31)
100 100 100 100 100 100 100 100 100 100 100 100 100 100 100 100 100 100 
100 100 100 100 100 100 100 100 100 100 100 100 100 100 
##$AQSEQ= 0
##$AQ_mod= 1
##$AUNM= <au_zg>
##$AUTOPOS= <>
##$BF1= 200.13
##$BF2= 200.13
##$BF3= 200.13
##$BF4= 200.13
##$BF5= 200.13
##$BF6= 200.13
##$BF7= 200.13
##$BF8= 200.13
##$BYTORDA= 1
##$CFDGTYP= 0
##$CFRGTYP= 5
##$CHEMSTR= <none>
##$CNST= (0..31)
1 1 145 1 1 1 1 1 1 1 1 1 1 1 1 1 1 1 1 1 1 1 1 1 1 1 1 1 1 1 1 1 
##$CPDPRG= <>
##$CPDPRG1= <>
##$CPDPRG2= <>
##$CPDPRG3= <>
##$CPDPRG4= <mlev>
##$CPDPRG5= <mlev>
##$CPDPRG6= <mlev>
##$CPDPRG7= <mlev>
##$CPDPRG8= <mlev>
##$CPDPRGB= <>
##$CPDPRGT= <>
##$D= (0..31)
0 1.2 0 0 0 0 0 0 0 0.06 0 0.03 0 0 0 0 0.0002 0 0 0 0 0 0 0 0 0 0 0 0 
0 0 0 
##$DATE= 1693218333
##$DBL= (0..7)
120 120 120 120 120 120 120 120 
##$DBP= (0..7)
150 150 150 150 150 150 150 150 
##$DBP07= 0
##$DBPNAM0= <>
##$DBPNAM1= <>
##$DBPNAM2= <>
##$DBPNAM3= <>
##$DBPNAM4= <>
##$DBPNAM5= <>
##$DBPNAM6= <>
##$DBPNAM7= <>
##$DBPOAL= (0..7)
0.5 0.5 0.5 0.5 0.5 0.5 0.5 0.5 
##$DBPOFFS= (0..7)
0 0 0 0 0 0 0 0 
##$DE= 6
##$DECBNUC= <off>
##$DECIM= 32
##$DECNUC= <off>
##$DECSTAT= 4
##$DIGMOD= 1
##$DIGTYP= 9
##$DL= (0..7)
0 120 120 120 120 120 120 120 
##$DP= (0..7)
150 150 150 150 150 150 150 150 
##$DP07= 0
##$DPNAME0= <>
##$DPNAME1= <>
##$DPNAME2= <>
##$DPNAME3= <>
##$DPNAME4= <>
##$DPNAME5= <>
##$DPNAME6= <>
##$DPNAME7= <>
##$DPOAL= (0..7)
0.5 0.5 0.5 0.5 0.5 0.5 0.5 0.5 
##$DPOFFS= (0..7)
0 0 0 0 0 0 0 0 
##$DQDMODE= 0
##$DR= 18
##$DS= 0
##$DSLIST= <SSSSSSSSSSSSSSS>
$$ [...]
##$SUBNAM2= <"">
##$SUBNAM3= <"">
##$SUBNAM4= <"">
##$SUBNAM5= <"">
##$SUBNAM6= <"">
##$SUBNAM7= <"">
##$SUBNAM8= <"">
##$SUBNAM9= <"">
##$SW= 18.05172834244
##$SWIBOX= (0..15)
0 0 2 0 0 0 0 0 0 0 0 0 0 0 0 0 
##$SW_h= 3612.71676300578
##$TD= 16384
##$TD0= 1
##$TE= 0
##$TE2= 300
##$TE3= 300
##$TEG= 300
##$TL= (0..7)
0 120 120 120 120 120 120 120 
##$TP= (0..7)
150 150 150 150 150 150 150 150 
##$TP07= 0
##$TPNAME0= <>
##$TPNAME1= <>
##$TPNAME2= <>
##$TPNAME3= <>
##$TPNAME4= <>
##$TPNAME5= <>
##$TPNAME6= <>
##$TPNAME7= <>
##$TPOAL= (0..7)
0.5 0.5 0.5 0.5 0.5 0.5 0.5 0.5 
##$TPOFFS= (0..7)
0 0 0 0 0 0 0 0 
##$TUNHIN= 0
##$TUNHOUT= 0
##$TUNXOUT= 0
##$USERA1= <user>
##$USERA2= <user>
##$USERA3= <user>
##$USERA4= <user>
##$USERA5= <user>
##$V9= 5
##$VALIST= <valist>
##$VCLIST= <CCCCCCCCCCCCCCC>
##$VD= 0
##$VDLIST= <DDDDDDDDDDDDDDD>
##$VPLIST= <PPPPPPPPPPPPPPP>
##$VTLIST= <TTTTTTTTTTTTTTT>
##$WBST= 1024
##$WBSW= 4
##$XGAIN= (0..3)
0 0 0 0 
##$XL= 0
##$YL= 0
##$YMAX_a= 77518
##$YMIN_a= -145861
##$ZGOPTNS= <>
##$ZL1= 120
##$ZL2= 120
##$ZL3= 120
##$ZL4= 120
##$ABSF1= 10
##$ABSF2= 0
##$ABSG= 5
##$ABSL= 3
##$ALPHA= 0
##$AQORDER= 0
##$ASSFAC= 0
##$ASSFACI= 0
##$ASSFACX= 0
##$ASSWID= 0
##$AUNMP= <proc_1d>
##$AZFE= 0.1
##$AZFW= 0.1
##$BCFW= 1
##$BC_mod= 2
##$BYTORDP= 1
##$COROFFS= 0
##$CY= 11.3945322036743
##$DATMOD= 1
##$DC= 2
##$DFILT= <>
##$DTYPP= 0
##$F1P= 15.7292609196834
##$F2P= 12.9074282941183
##$FCOR= 0.5
##$FTSIZE= 0
##$FT_mod= 4
##$GAMMA= 1
##$GB= 0.15
##$INTBC= 1
##$INTSCL= 1
##$ISEN= 128
##$LB= 0.24
##$LEV0= 0
##$LPBIN= 0
##$MAXI= 10000
##$MC2= 0
##$MEAN= 0
##$ME_mod= 0
##$MI= 1.114404
##$NCOEF= 0
##$NC_proc= 0
##$NLEV= 6
##$NOISF1= 3.799351
##$NOISF2= 2.8
##$NSP= 1
##$NTH_PI= 0
##$NZP= 0
##$OFFSET= 15.70392
##$PC= 1
##$PHC0= -21044.32
##$PHC1= 6.65272
##$PH_mod= 1
##$PKNL= yes
##$PPARMOD= 0
##$PSCAL= 0
##$PSIGN= 0
##$REVERSE= no
##$SF= 200.130013532006
##$SI= 16384
##$SIGF1= 3
##$SIGF2= 2
##$SINO= 400
##$SIOLD= 16384
##$SREGLST= <1H.CDCl3>
##$SSB= 0
##$STSI= 0
##$STSR= 0
##$SW_p= 3612.71676300578
##$SYMM= 0
##$S_DEV= 0
##$TDeff= 0
##$TDoff= 0
##$TI= <>
##$TILT= no
##$TM1= 0
##$TM2= 0
##$TOPLEV= 0
##$USERP1= <user>
##$USERP2= <user>
##$USERP3= <user>
##$USERP4= <user>
##$USERP5= <user>
##$WDW= 1
##$XDIM= 8192
##$YMAX_p= 0
##$YMIN_p= 0
$$ End of Bruker specific parameters
$$ ---------------------------------
##NTUPLES= NMR FID
##VAR_NAME=  TIME,          FID/REAL,        FID/IMAG
##SYMBOL=    X,             R,               I
##VAR_TYPE=  INDEPENDENT,   DEPENDENT,       DEPENDENT
##VAR_FORM=  AFFN,          ASDF,            ASDF
##VAR_DIM=   8192,          8192,            8192
##UNITS=     SECONDS,       ARBITRARY UNITS, ARBITRARY UNITS
##FACTOR=    0.0002768,     1,               1
##FIRST=     0,             0,               0
##LAST=      2.2672688,     0,               0
##MIN=       0,             -145861,         0
##MAX=       2.2672688,     77518,           0
$$ Real data points
##PAGE= N=1
##DATA TABLE= (X++(R..R)), XYDATA
0@%%%%%%%%%%%%%%Qj6J6j6J6k4L2l2M0m8N6o5P3q8J04j20J36j52J72j96K21k49
36a32K80l14L51l91M36m84N38o00O64p33Q10q91R80j082J193j314J448j598J765
55I26j952K165k409K691l023L419l898M497n272O319p812J0139j4305K4085r1666
70g6096o9765R4601K2415L5812K0026N832j956L0235m954k0529K51J8086L195
83E7153J6376L989k5120k6607k975j5655j9681r239j3885k4068l179M047n905
96f4749j46J4339P136J0376K3170J1294p309K268R018N414J8917K8454R096j928
110F5350J158q772j8473q818j1084k1619j1635L27n796n756J512n925r589j040
124d0160l026p139K997Q978P496J6210K2139J2907O495Q527L339l810q36l137
$$ plain form
0 0 0 0 0 0 0 0 0 0 0 0 0 0 0 0 8 -8 8 -8 8 -16 16 -16 24 -24 32 -33 40 -48 56 -64 72 -80 92 -104 117 -132
36 -132 148 -166 185 -206 230 -254 284 -316 348 -385 425 -466 514 -568 625 -689 759 -839 926
55 926 -1026 1139 -1270 1421 -1602 1817 -2081 2416 -2856 3463 -4349 5790 -8515 15570 -76096
70 -76096 -145861 -51260 -28845 6967 26993 32825 30869 61104 56150 35621 35872 53958 57153
83 57153 73529 77518 52398 25791 22816 7161 -12520 -21759 -35644 -59712 -62891 -58844 -64749
96 -64749 -64895 -50556 -43420 -33044 -9874 1420 -5889 -3621 5397 10811 29728 58182 67278 65350
110 65350 66508 57736 39263 30445 19361 -2258 -13893 -13566 -19362 -25118 -23606 -29531 -39120 -40160
124 -40160 -43186 -50325 -47328 -38350 -30854 -14644 7495 20402 26897 35424 38763 34953 34117 30980
138C0980q020l295M918L017l83l406j2571j8261j3485p246q408n485O38J542M933
153c4532J1001R339L605O232O121J730L085L758R99M588J1069Q104K007o97n102
168C1307r750o830p644j4211j0726l408j339J397N055J108m646j182k45j432J216
183b1330N057O007R274J1135P259L989N125L534j128l715n873r160o246l25Q67
198D470l66n43m001p433n512n770q224m716J567M468O733J0065Q758N340M305
213I141K744j660j366P44K098L835N583J853k550l122k638m249n953o720p674
228i934o613m646j989L10L589N009L989K618R23j455j748K631M887M923N148O875
244A4517P085M980K150m293q622p441m967l372r05o05j287k006J09k253n134n138
$$ plain form
138 30980 22960 19665 24583 27600 27217 23811 11240 -7021 -20506 -27752 -36160 -41645 -41007 -39465 -34532
153 -34532 -23531 -14192 -10587 -4355 1766 3496 6581 10339 11338 15926 26995 35099 37106 36409 31307
168 31307 21557 14727 7083 -7128 -17854 -21262 -22601 -21204 -16149 -15041 -19687 -20869 -21114 -22546 -21330
183 -21330 -16273 -10266 -992 10143 17402 21391 26516 30050 28922 25207 19334 10174 3928 3603 4470
198 4470 4104 3561 -440 -7873 -13385 -19155 -27379 -32095 -30528 -26060 -19327 -9262 -504 4836 9141
213 9141 11885 10225 8859 9603 11701 15536 21119 22972 20422 17300 14662 10413 4460 -2260 -9934
228 -9934 -16547 -21193 -23182 -22872 -19283 -14274 -10285 -7667 -6744 -8199 -9947 -7316 -2429 2494 7642 14517
244 14517 21602 26582 28732 24439 15817 8376 3409 37 -868 -1473 -2760 -4766 -4657 -6910 -12044 -17182
260a7182k759l82J538L295J765L891Q031Q262N830K946j228l610j717J804L33
275A0817l06J83n9K89K02k445o459o766n000n574l128J91J637K633M781M464J706
292b834O55Q33m57O71J512J159K414M887N413L266J223j031n193p279o254m884
308e899k309J797K504P24m16j854l021j503Q86m65j149J311L019M098M994M410
324G127J456J437K167M19j644k817m738m042k50J636J318P23O45n69l730n489
340f351p192n361N44N497O994O718L573o94j205P5L13p44O69J857K236K610J045
357A0584j994j507o42j924k796k573l297m029k428l61o95J663L427M075K993J136
373A632k695l972k046J714L768N775O648M112J143j624m614n625l325j358n72
$$ plain form
260 -17182 -19941 -20323 -18785 -15490 -13725 -9834 -1803 6459 12289 15235 14007 10397 8680 10484 10817
275 10817 10511 10694 10635 10924 11126 8681 2222 -4544 -9544 -15118 -18246 -18055 -16418 -13785 -9004 -4540 -2834
292 -2834 -2179 -1346 -1803 -1132 380 1539 3953 8840 14253 17519 18742 17711 12518 5239 -1015 -5899
308 -5899 -8208 -6411 -3907 -3183 -3599 -5453 -8474 -9977 -9091 -9556 -10705 -9394 -6375 -2277 2717 7127
324 7127 8583 10020 12187 12606 10962 8145 3407 -635 -885 751 2069 2792 3437 2868 -862 -6351
340 -6351 -13543 -18904 -18360 -12863 -5869 849 4422 3728 2523 2598 2911 2167 2836 4693 6929 9539 10584
357 10584 8590 7083 6441 4517 1721 -852 -4149 -8178 -10606 -10967 -11662 -9999 -6572 -2497 496 1632
373 1632 -1063 -5035 -7081 -5367 -1599 4176 10824 14936 16079 14455 9841 4216 891 -467 -1039
388a039M83N30j745j359M77q63l654k676q32p9J234K598J374J301L630L581L260
405F221L239Q16j934j523j099k205j346J672K688J912P00l089n816n224l390k767
421a1145m63J397N90J914L374K796J84n67J16m63O11K071J536K435M220K158K64
438A1028p30j654k641j439j811l512l436j246P0J671J936k95k714j651n18j595
454h537m96J195J907L139M355L993Q22J176P13r67q31j652k743j434J990K298
470D928M63l55j976l556k427k105k689j857M58P15K233L785K316N56R59O63j392
487G19j427M69J347K686K786J190o39l93n55j998k049j894l419k045o53P67K85
504d823J058J219N41K65o85j944j349J355J769J856K843K956J478K385Q30j821
$$ plain form
388 -1039 -556 -26 -1771 -3130 -2653 -3516 -7170 -9846 -10678 -10757 -9523 -6925 -5551 -4250 -620 2961 6221
405 6221 9460 10276 8342 6819 5720 3515 2169 3841 6529 8441 9141 6052 236 -4988 -8378 -11145
421 -11145 -11608 -10211 -9621 -7707 -4333 -1537 -1353 -1920 -1804 -2267 -1656 415 1951 4386 8606 10764 11028
438 11028 10298 8644 6003 4564 2753 -759 -4195 -5441 -5371 -3700 -1764 -2059 -4773 -6424 -6942 -8537
454 -8537 -9033 -7838 -5931 -2792 1563 5556 6378 7554 8267 7300 6469 4817 2074 640 2630 4928
470 4928 5391 5036 3060 -496 -2923 -5028 -7717 -9574 -9116 -8401 -6168 -2383 -67 489 1448 2111 719
487 719 -708 -239 1108 3794 6580 7770 7131 6738 6183 4185 2136 242 -3177 -5222 -5875 -5108 -4823
504 -4823 -3765 -2546 -2005 -1740 -2425 -4369 -5718 -4363 -2594 -738 2105 5061 6539 8924 9754 7933
520G933m094l346k621P27J909J033j51l00r05k056k407j657j677j2Q74J620J688
537c442J480K261K334K067O36j092j151m77L19N81k73K83O71J132j46j276k917
554I90l450k886k737j047O76J612K935K695J422j234j635q53J024J512J338Q07
570A169K081K694K418J397n69k346k826k206j386j131j325o81P23O66k92j756
586c370j240j415j84K21m56j33J209K392M051L358J863j90p67r9n59o14q59r60
604B248O21J387M91l84j061j988l454l120k946j756L92L023L287K186K51q66o81
621b370O95Q61J60R60J801J846J573J382K66p31n36m88j759j800k358k280r58
638c736O73o23m57R88J155K32o30k114k677o60K050L176M179L559J483k91m13
$$ plain form
520 7933 3839 493 -2128 -1401 508 1541 1390 1090 185 -1871 -4278 -5935 -7612 -7624 -6750 -5130 -3442
537 -3442 -1962 299 2633 4700 5336 4244 3093 2616 2935 3516 3243 3526 4197 5329 5183 3907 990
554 990 -2460 -5346 -8083 -9130 -8454 -6842 -3907 -1212 210 -1024 -2659 -3512 -2488 -976 362 1169
570 1169 3250 5944 8362 9759 9190 6844 4018 1812 426 -705 -2030 -2711 -1988 -1322 -1614 -3370
586 -3370 -4610 -6025 -6209 -5988 -6444 -6577 -5368 -2976 1075 4433 6296 6106 5339 5240 4681 4067 3208 2248
604 2248 2869 4256 4747 4363 3302 1314 -2140 -5260 -8206 -9962 -9570 -6547 -3260 -1074 -823 -1689 -2370
621 -2370 -1675 -814 -654 306 2107 3953 5526 6908 7174 6443 5907 5419 3660 1860 -498 -2778 -3736
638 -3736 -3063 -3686 -4143 -3155 -2000 -1768 -2398 -4512 -7189 -7849 -5799 -2623 1556 5115 6598 6307 5894
655E894j523k786q57M72P74J051Q26p43j417l61k015k459j245j048l20O15J242
672c900K11O21J146J976J083J121O61j100l31k51q11K71K469K098J117M86k395
689D472m223l002r52j082K03R87J59Q57K387L10j577j442o72l45J384K171J087
706G22J604K155R01Q8m74j620j526k65K42j270k061q99K39O78K058n93j972j634
724c627j241o28m1J388J284J384L228K268M64M0q09r21m55o26n00M07J799J447
742D861m09j135k198k827j875o63p78r57O08Q47J049J917N50J51O77K89n52m96
760i41P23J367J734K363J248o04o11o72j183j033k220k459j479N59J140N03K36
777a329n79o79r41q10o72l29Q85J887K165K375J588O75R43N78j157k012j436m29
$$ plain form
655 5894 4371 1585 728 1200 1974 3025 3851 3108 1691 1330 -685 -3144 -4389 -5437 -5757 -5142 -3900
672 -3900 -3689 -3068 -1922 54 1137 2258 2919 1819 1488 1237 426 697 3166 5264 6381 6867 4472
689 4472 249 -2753 -3705 -4787 -4584 -3597 -3438 -2581 -194 116 -1461 -2903 -3575 -3920 -2536 -365 722
706 722 2326 4481 5382 5470 4996 3376 1850 1585 1827 557 -1504 -2403 -2164 -1486 572 -21 -1993 -3627
724 -3627 -4868 -5496 -5537 -4149 -2865 -1481 1747 4015 4479 4519 3710 2789 2334 1708 1208 1615 3414 4861
742 4861 4452 3317 1119 -1708 -3583 -4246 -5024 -5981 -5373 -4526 -3477 -1560 -1010 -859 -182 107 -445 -941
760 -941 -218 1149 2883 5246 6494 5890 5279 4607 3424 2391 171 -2288 -3767 -3208 -2068 -1565 -1329
777 -1329 -1908 -2587 -3528 -4338 -5010 -5339 -4454 -2567 -402 1973 3561 4236 5179 5757 4600 2588 1152 723
795G23L60J582J062m44n02j640k099j631j184j536r01R12J091P26J301J286J163
812B69Q08k41n92n23P27Q30Q18J016R95J5R59J93q48k492k294k222j270P8L00
831c474J348J337R08n03j603j337j001l2J125J785J068J816J956Q51Q39q45j511
848B727j503q0j74l78j70L81K79p3o00p34j705o38J04r72o36m30M89K140L222
867A249K071m83o60o63m27p50k00K57K16J786J488O00r28j818k027j757r16r44
885c906p16O76J769J890O97q07j090l92N89P76M22M86l0M22J826J324N17k11j093
904C149n22j710j128j372p78m1R57P45M9L41q26q93j124o32j031L80K042K672
922B78K225J272J75n37r25r30r15J41M62O59K33J41m57m99m80r58j431j666j372
$$ plain form
795 723 1083 2665 3727 3283 2781 1141 -958 -2589 -3773 -5309 -6210 -5298 -4207 -3481 -2180 -894 269
812 269 1077 836 244 -279 448 1278 2096 3112 4107 4122 5081 5274 4426 1934 -360 -2582 -3852 -3774 -3474
831 -3474 -2126 -789 119 -384 -1987 -3324 -4325 -4357 -3232 -1447 -379 1437 3393 4244 5083 4238 2727
848 2727 1224 1144 970 592 422 803 1082 1009 409 -325 -2030 -2668 -2564 -3536 -4172 -4602 -4113 -1973 1249
867 1249 3320 2837 2177 1514 1087 337 137 394 610 2396 3884 4484 3556 1738 -289 -2046 -2962 -3906
885 -3906 -4622 -3946 -2177 -287 410 -397 -1487 -1879 -1290 -514 -92 394 364 786 2612 3936 4453 4242 3149
904 3149 2627 917 -211 -1583 -2361 -2402 -1445 -700 -651 -310 -1136 -2029 -3153 -3785 -4816 -4436 -2394 278
922 278 2503 3775 3950 3413 2488 1558 643 784 1246 1905 2138 2279 1822 1323 843 -115 -1546 -3212 -4584
941d584O4N41Q12R78M92O80J104P09J89p12m51l69L87J200J538Q29Q75O65j35
960D812j969k554j999q66N33N25J0M89K12o0R3n04j139j379O9P83J535J619Q46
979A056R92Q71J78m20n98o78l85j31J28o41R3N92M64r3l44j633j441j207o39j9
999c855M70P97J688J641P36L96p85l46q81o16n9N01J063J667J471L33r59k420
1017H42j600o80p3k39l44K84P93P07M50j4m92n95J41k96l12l6O35J015J838J005
1037C029o53k44n8p05j257q69j578l71J064J920J112M4n76j301j138l83n67o28
1055c159R16J494J976P08P54o33j8n6q17j148n28k57J55J629J194n55j038l16
1073C01o29r35p15j305m94P42J582M63J345J166j95q9k08o07r37j39J256O68J284
$$ plain form
941 -4584 -4520 -3979 -3167 -2189 -1697 -1017 87 796 985 273 -178 -547 -160 1040 2578 3407 4282 4947 4812
960 4812 2843 289 -1710 -2576 -2043 -1518 -1508 -1019 -807 -867 -774 -1278 -2417 -3796 -3727 -2944 -1409 210 1056
979 1056 2048 2919 3097 2677 2079 1401 1016 885 1013 372 465 1057 1521 1428 1084 -549 -1990 -3197 -3836 -3855
999 -3855 -3385 -2588 -900 741 1477 1873 1088 742 -139 -755 -814 -313 750 2417 3888 4221 3262 842
1017 842 -758 -1438 -1511 -1750 -2094 -1810 -1017 -310 140 126 -366 -961 -820 -1116 -1428 -1464 -829 186 2024 3029
1037 3029 2376 2132 2074 1369 112 -757 -2335 -2706 -1642 278 1390 1434 858 -443 -1581 -1964 -2531 -3159
1055 -3159 -2243 -749 1227 1935 2689 2056 2038 1982 1165 17 -511 -768 -613 1016 2210 1655 617 301
1073 301 -328 -1263 -1978 -3283 -3777 -3035 -1453 -990 355 1521 1326 1237 1029 422 -515 -654 602 1270 2554
1092B554L35j17q0k77q80j862j349p75j082N30J187Q65J007K95p63j046p42m25
1110b625kJ308J085P24J079J388Q65k89l22j263j437J50j54o67O21n8m25M40p4
1129C44o40j457p11l47l49o9r3O74J689K245J310j96r28j459m87M10R03m2N05
1148A302J165J026K38m70k208j969r12m36l0k00N48M15Q01N85k64q14p46M23K17
1167a329N31O39l79P23J295J104N82K36p79q42j136j184n90OL71P45O44L31n62
1186D06r86q12j436o78m4R73J619J487J397K29k81o60n45n21K21J06k55Q54L02
1205A376k4k21o14k8k36r15q47j364%N84Q55R78M72N81O19m7M5j142j004r3O60
1226c65J040J328Q58J17q2n63j954j908o46k73M54J201j20J88j59K61P7j80q20
$$ plain form
1092 2554 2889 2772 2692 2415 1535 -327 -1676 -2451 -3533 -3003 -1816 -951 56 351 -412 -1458 -2200 -2625
1110 -2625 -2627 -1319 -234 490 1569 2957 3822 3533 3211 1948 511 661 507 -160 461 403 -22 418 344
1129 344 -296 -1753 -2464 -2811 -3160 -3229 -3322 -2648 -959 1286 2596 2400 1472 13 -474 -64 839 797 1302
1148 1302 2467 3493 3731 3261 1053 -916 -1828 -2264 -2294 -2494 -1946 -1531 -730 -145 -409 -1223 -1969 -1546 -1329
1167 -1329 -798 -159 -538 185 1480 2584 3166 3402 2623 1781 645 -539 -1129 -1123 -752 -7 637 968 406
1186 406 -580 -1392 -2828 -3506 -3550 -2577 -958 529 1926 2155 1874 1214 669 148 369 475 220 1074 1376
1205 1376 1352 1131 517 489 253 -662 -1509 -2873 -2873 -2289 -1434 -456 16 597 1216 1169 1214 72 -932 -1025 -365
1226 -365 675 2003 2861 2978 2896 2333 379 -1529 -2175 -2448 -1994 -793 -913 -725 -884 -623 -546 -726 -1546
1245a546m18N9J091Q03J118N59O20O66J15n73o54j143p32L8l12m6o7L33O64P6
1265F51j154j299j216n66O9Q89Q95N04J222J090P27L73l76q30m91j9L19K42N90
1284A620O94J012m04j057j941j257n29o25J05J9M7K52R14J43N34l52m41j66L26
1303a106J39M28Q56J133J226N36K99m55n00j125n02q42r97j71M29O20J031l28
1321F71j336j065n55r01l35L58P52J319J054J402L54M3l31j12j75m05k16K52L60
1340A134J124L46n87k73j115o15n59j122n63n76M39L43J174N53J28L53J22m77
1358a71r01n15N60J016J089R06L64J58K23m85q35j389r44l62n6O91M65L36k06
1377e6k47L1q58o49n84L65J132O15M48M10O68M73N26j70r42j261j52mQ44J52n27
$$ plain form
1245 -1546 -1964 -1905 -814 -11 1107 1666 2286 2952 3067 2494 1840 697 -35 3 -309 -355 -422 -89 575 651
1265 651 -503 -1802 -3018 -3584 -3515 -2626 -1731 -1227 -5 1085 1812 2185 1809 979 488 469 788 1030 1620
1284 1620 2314 3326 2922 1865 -76 -1333 -1862 -2487 -2382 -2363 -2316 -2064 -1150 -1007 -473 -825 -1266 -1432 -1106
1303 -1106 -967 -539 317 1450 2676 3212 3511 3056 2556 1431 929 87 -910 -1081 -652 -32 999 671
1321 671 -665 -1730 -2285 -3186 -3521 -3163 -2411 -1092 -38 1364 1718 1761 1430 1318 1143 738 522 774 1134
1340 1134 2258 2604 2017 1744 629 14 -545 -1667 -2230 -2806 -2367 -2024 -850 -297 -169 184 306 -171
1358 -171 -1072 -1587 -1027 -11 1078 1984 2348 2506 2729 2244 1409 20 -924 -1286 -1342 -651 -186 150 -56
1377 -56 -303 -272 -1130 -1779 -2363 -1998 -866 -251 197 607 1275 1748 2274 2104 1162 -99 -251 -255 589 741 214
1398B14J6L98J19p73p62j090l99l42N37N21O38J056R66O24j11m19j243m12N41
1417G9P35J90M00N62L27l78l21j302j284p86k31L8M09J05K47M01Q34k91o94p8
1437a038J33M65K41p5N33M29J394Q20M8l88q10j339n51k44m59j32L16Q36N66n08
1457B37o02p75r70m92k11L66N36J237J162J313j41m73k24j59K13m6Q6N6K40L27
1477A680j07k57o1o77m99q46j074n67l37L22O66P71J60O11K29M6k74r29j9K56
1497i06R61J132J204K32m2j65q77p75q00p42j27K63P75m0l53j43j33q2l45n87
1517a550m64j00Q01N57Q60M65M36K70M06j24n36q87n92L51P2M20K06L50M55l00
1537A096q70j194j101l47N62N21M63M08M77O70L35m60m29o98LK75M04M06K22N52
$$ plain form
1398 214 230 628 747 -26 -788 -1878 -2277 -2619 -2082 -1561 -923 133 1099 1723 1612 1193 -50 -462 79
1417 79 814 1004 1404 1966 2293 1915 1594 292 -992 -1778 -2009 -1971 -1562 -1457 -1210 -809 25 -266 -960 -1038
1437 -1038 -905 -440 -199 -274 259 688 2082 2902 2950 2562 1752 413 -138 -382 -841 -973 -657 179 745 237
1457 237 -365 -1140 -2110 -2602 -2813 -2447 -1911 -674 488 1801 1660 1187 963 804 1017 971 1057 1113 1353 1680
1477 1680 1573 1316 1255 578 79 -767 -1841 -2408 -2745 -2423 -1757 -986 -826 -215 14 60 -214 -1143 -1162 -906
1497 -906 55 1187 2391 2623 2581 2416 1539 764 -36 -778 -905 -642 133 93 -260 -403 -536 -618 -963 -1550
1517 -1550 -2014 -2114 -1313 -756 104 569 1005 1275 1681 1557 1021 134 -458 -107 -35 385 591 941 1396 1096
1537 1096 226 -968 -2069 -2416 -1854 -1333 -870 -462 15 685 1020 560 131 -567 -564 -289 115 521 743 1295
1557A295K11J59m84j115q73k78m06L49K68k67M16P03K39K07l96l02n09P2K62M64
1577A5N00O00K09N93J07o29q25k94n89m92k75j19O42N55L02np02o45r80J0N24
1598a498R3O28R01J080L34J69k86No77j83l25j26M35j92N78J56k36k79j103k68
1618g94l51l71p98n3N26L89J079O66K51k36R9l26m58p9N91M21R28O72M63o84l99
1639A536l51o57j008o08k64L45K48O99o76J16J16l54m30l61K08k98R35R33K43
1658C72L12O78L14M16p4p68r25QL4L0J45J73j31J62m19l88r13p37n62j58O30P34
1680a067N58O50P13k77k6n20m31J26M05M23P49j87L98J45j37l27r59q71k42J73
1700g04o1p5M7J58M51L27m28k20p3m56M57O5J02K01O25R19N15J83o49q77p16j73
$$ plain form
1557 1295 1506 1665 1181 66 -807 -1085 -1491 -1142 -874 -1141 -725 -22 217 424 28 -274 -783 -711 -449 15
1577 15 515 1115 1324 1917 2024 1395 570 276 -313 -805 -1080 -1199 -557 -2 300 295 -407 -1052 -2032 -2022 -1498
1598 -1498 -1405 -777 124 1204 1538 1707 1421 1426 749 566 241 115 550 358 936 1092 856 577 -526 -794
1618 -794 -1145 -1516 -2314 -2367 -1841 -1452 -373 293 544 308 407 81 -377 -456 135 556 1484 2156 2619 1935 1536
1639 1536 1185 528 -480 -1088 -1352 -1007 -759 -60 -736 -620 -504 -858 -1288 -1649 -1441 -1739 -804 129 372
1658 372 684 1362 1676 2092 2018 1250 325 333 367 397 542 715 584 746 327 -61 -974 -1711 -2273 -2431 -1801 -1067
1680 -1067 -509 141 854 577 551 31 -400 -274 131 554 1303 1116 1514 1659 1522 1195 236 -635 -877 -704
1700 -704 -765 -840 -793 -635 -184 143 -285 -505 -578 -1034 -577 -512 -410 -209 416 1335 1850 2033 1384 507 -209 -382
1722c82j91Q8L87J55M39l0j09l20j121l07K48j01L20K13N72R92L78m12m49O8q6
1743C52J30j86Jj65L83J05L25j74m38k34n70l96l50o62J02O60Q76L07L87l32Q5
1764B06q0l1o32J79K22M70Q33O96P5l50n97o00m67n06m29k08O30R2J26n3j82o6
1786f72L7l25m1k18P4N16P13M79O18J49K32l6l34j68n97j63l93L42K47L1J86j45
1808E32m70n33p24n19k36K7Q43N49K14J93L57K15k91m8k27N8L24L97N55L82k3
1829A575L07J1o17p14n90m56l82L15l80K91j6L94L30m8p65n39k53K70M92N35J97
1850d3O90L94N10n5m47m39m25J79k71j25K73J35L73L7j75n85j115k01N8J41j47
1871a238L01K64O54N10j58j43k81L4M2M7K95J16o1O11L33j07n06m50l59Po03l64
$$ plain form
1722 -382 -573 -485 -98 57 496 466 357 37 -1084 -1391 -1143 -1244 -924 -711 -139 853 1231 819 370 438 352
1743 352 482 296 297 132 515 620 945 771 333 99 -471 -867 -1217 -1879 -1777 -1117 -241 66 453 121 206
1764 206 126 95 -537 -358 -136 334 1167 1863 1938 1588 991 391 -76 -582 -1011 -1219 -589 -497 -371 -424 -606 -672
1786 -672 -635 -960 -1001 -1219 -1145 -629 84 563 1181 1330 1562 1526 1192 1024 427 264 -129 213 460 491 677 532
1808 532 62 -471 -1195 -1714 -1950 -1923 -1080 -531 -317 -124 233 448 157 109 -118 -60 264 661 1216 1598 1575
1829 1575 1882 1893 1276 562 -28 -484 -866 -551 -931 -640 -656 -262 68 20 -745 -1284 -1537 -1267 -775 -240 -43
1850 -43 647 1041 1551 1496 1049 610 185 364 93 -32 241 376 749 786 611 26 -1089 -1290 -1232 -1091 -1238
1871 -1238 -937 -673 -19 491 333 190 -91 -57 -15 32 327 443 382 993 1326 1219 713 263 -96 -89 -692 -1056
1893a056l3M68N74M33L5j72k36j32m83j90K32qN98M16O61P3j25l60j72n02k20
1914a99k42J31n4M96K63k3k87m99j17O8l39j52O6M40M59L59P0K18L22l3k78m96
1936A73q7l64K6N70J16K49j83M3k14o56l57q04m8J89N97K56O41M31m10J76k50
1957I4r1p13R4N94O95N17j45k0l67M90n48j72n44k90l9K03j12j07j01J22O6J3
1979c61j60l22k76M6L30M45K77O47N17K27q9o35j03m11K3q8K83Q1J99L7J22n80
2001B09l93n84l48k40O4L38J61J09L54L26J06l33J8j32M70K4l3J13M03L00L89
2022A321O7l64n19j60k18q09q9J60J33L45M84l59m97k78l31Oj49J33N82K67P05
2043D30M55n3q3k19PR9l36K3P7p1J88Q6r7k67N9l62j80l50m69k09L98O34K15K42
$$ plain form
1893 -1056 -1089 -621 -47 386 421 249 13 -119 -602 -792 -560 -568 30 446 1107 1180 1055 695 523 21 -199
1914 -199 -441 -310 -364 132 395 372 85 -414 -531 -463 -802 -954 -888 -448 11 370 440 658 980 947 669 173
1936 173 86 -278 -252 318 434 683 500 543 329 -327 -684 -1488 -1536 -1347 -750 -494 147 578 168 344 94
1957 94 3 -710 -616 -22 673 1190 1045 1025 658 1148 600 428 -116 -406 -445 -242 -354 -461 -562 -440 -374 -361
1979 -361 -521 -843 -1119 -1073 -743 -298 -21 626 1143 1370 1281 646 543 132 155 67 350 431 630 667 789 209
2001 209 -184 -768 -1116 -1356 -1292 -954 -793 -684 -330 -4 102 -231 -213 -345 125 149 116 229 632 932 1321
2022 1321 1388 1024 505 345 127 -682 -771 -611 -478 -133 351 -8 -505 -783 -1114 -1108 -1257 -1124 -542 -275 430
2043 430 885 832 749 530 537 636 300 323 400 329 517 603 506 239 298 -64 -244 -594 -1063 -1272 -874 -240 -25 217
2067B17j09L15l53L0k32k54j65M37M52O69O0j85j80l21l63k24n31K68P9J16K79
2088EON0l56r0L57k27l90K9L20M51M15k45N00qJ04m45l73j97j38k5j33L08l03
2111c85M39L8O3lp35m61Q8K22M37p8L95J86L29K84k53k39j89n16Q4K54L77k73
2133F4L51L13l52k43l68n12j55J5J11N9L57K45l3J49M29j88n18J01k3L67n3J62
2155B78K12M96J74j2k14l20l69l52k56k22j06m1P07n0l1k00l57l91M7J87k1L71
2177d70N25L49O16l16J52j47j32J26k47oj64L2N23O7l31k81m74j41k57k93j64
2198a033n82P21M33j18N29R6j39K20J2l79k00J33P28L35J54J68j22K42m79k30
2218D89o26k29q2j8J96K40k50k49Q8J68l10l60J9j05M13N99K62J89L11j30J49
$$ plain form
2067 217 108 423 70 100 -132 -386 -551 -114 338 1007 1067 882 702 381 18 -206 -737 -469 -390 -274 5
2088 5 11 61 -295 -385 -28 -255 -645 -616 -296 155 570 325 825 817 921 476 103 -94 -232 -257 -390 -82 -385
2111 -385 54 92 155 152 -583 -1044 -956 -734 -297 -375 20 206 535 819 566 327 138 -378 -294 -40 337 64
2133 64 415 728 376 133 -235 -747 -902 -887 -776 -717 -360 -115 -148 1 430 242 -276 -175 -198 169 116 278
2155 278 490 986 1160 1148 934 614 245 -107 -363 -585 -691 -732 -25 -75 -106 -306 -663 -1054 -1007 -820 -841 -470
2177 -470 55 404 1020 704 856 709 577 703 456 450 286 318 841 908 577 296 -178 -319 -576 -869 -1033
2198 -1033 -1615 -894 -461 -579 -50 46 -93 127 139 -240 -440 -307 421 756 910 1078 956 1198 719 489
2218 489 -137 -366 -448 -466 -270 -30 -280 -529 -441 -273 -583 -943 -924 -1029 -616 -17 245 434 745 615 764
2239G64j96m3k24k54J3Q7K60K27l85j23K32k82m05m26j75o7N88j44K62L91J75
2260B75k23J21k2n86j43L78L53J60L00pJ21J24m12l04l36m30J6k0M76Pj59j38
2282d49M00L0j95j91L8J1O7K88J45K94L18N2L6Lk60n62k59P7m20K30K18J62P7
2305A10K09o35j47k71M1M2JJ91M41K26L83Lk79p3N5J7J78k8j35O9P8K33n52J85
2329C42k27m14j63k33l65N2j55N49K41N97j92mj41j22%m7M74J41M35K90L53m34
2351I77J9p22J54m32j28q3m1J01L7j40l5q0L4k69j95j31L08J50K82L75P7L56J9
2374F33J6j54p6n15L63q5L74m5n3J43j30l36k03m75k04j73J70Q8Q0J98J55j58
2396c87L19M92k35k94J4J21J51K74pN38k22J7k05j29k99k46M6j45J11J8k0N2R
$$ plain form
2239 764 568 525 301 47 60 147 407 634 249 126 358 76 -329 -755 -930 -997 -409 -553 -291 100 275
2260 275 52 173 151 -435 -578 -200 153 313 613 606 727 851 439 135 -201 -631 -615 -635 -159 -152 -311 -449
2282 -449 -49 -19 -214 -405 -367 -356 -289 -1 144 438 756 808 844 847 587 25 -234 -157 -577 -347 -129 33 110
2305 110 319 -316 -463 -734 -693 -651 -650 -459 -18 208 591 594 315 242 297 314 492 464 329 398 476 709 157 342
2329 342 115 -299 -462 -695 -1060 -1008 -1163 -614 -373 224 32 28 -113 -235 -235 -282 192 333 768 1058 1411 977
2351 977 996 274 428 -4 -132 -215 -256 -155 -118 -258 -293 -373 -339 -608 -803 -934 -626 -476 -194 181 258 614 633
2374 633 649 495 419 -96 267 182 556 511 458 601 471 135 -68 -543 -747 -920 -750 -662 -582 -384 -229 -387
2396 -387 -68 424 189 -105 -91 30 181 455 448 986 764 781 576 447 148 -98 -52 -197 -86 -68 -88 -36 -27
2419b7j4k10m05j46K05N7J54J99L07N6L64Q7l75K71n28K60j32K5q7M56q9Q1j24
2442C85l13m05j48QJ09j69J81K32l7J50N34n27l7Rj6K8Nj22K79K33p5k7J27m31
2466b7l88M26m05m2j54J83L96J0L09p8j36J26m36j15J15J17O9N15o5K95k39Q0
2488E56j84l80J56o28k8KM27J71K42n13j19P4Nk22P8J84j10M15K04J44k37L42
2510E79j59J40k93j53o4j75L70L09p3l75R4J64m56k77l57k72J44J52K13M74m4
2531e9j0J70R2j90l46J09J54M24K75j21K58K0p2p3k01l70l99o1K35q1kn5L5j1
2555b79j81J97k5k33j1L36q6J07L82L90Q9J48k80n17J48m48K56L82j17j41J41
2576B58L82j89n62k89l63K42k76J28J56NL53L14j6l63J00J19K6j63K17j25L70
$$ plain form
2419 -27 -41 -251 -656 -802 -597 -540 -386 -187 120 176 540 627 252 523 -5 255 123 148 61 517 428 509 385
2442 385 72 -333 -481 -473 -364 -533 -352 -120 -157 -7 527 0 -37 -28 -44 -16 -11 -133 146 379 304 277 404 -27
2466 -27 -415 11 -394 -436 -590 -407 -11 -1 308 230 94 220 -216 -331 -216 -99 -30 485 420 715 476 556
2488 556 372 -8 148 -480 -508 -506 -79 92 334 -179 -298 -224 -219 -441 -363 -179 -289 126 330 474 237 579
2510 579 420 560 267 114 50 -125 245 554 481 106 200 364 -92 -369 -726 -998 -854 -702 -489 -15 -59
2531 -59 -69 101 193 3 -343 -234 -80 344 619 498 756 776 704 631 430 60 -339 -400 -165 -246 -248 -303 -268 -279
2555 -279 -460 -263 -288 -521 -532 -196 -282 -175 207 597 686 834 554 37 185 -263 -7 375 258 117 258
2576 258 640 451 -111 -400 -763 -521 -797 -669 -513 -508 -155 159 143 -220 -120 -1 25 -138 79 -46 324
2597C24j4O42m27j09q8k92L3l81j04j51K26L39L52k99j47j13N9j92O3m0J17J68
2619c4K00M75k07j27j61k07N1P1J69j94k1K5j59L75k81J20k2l65j93k7J66J4M4
2642b88K55M21k6k9j43J40l1m10k88L66P0K12K17j24l47j62p6o3k6j21J02R6K75
2665B0l35L65J98R1j02k32K82l5k91L96p5K00k23l7J58n2k12q8l57k36L59k11
2687d17M06l13L23k38J79k62k58P7O8K08O22j98R8J05K35j02p3k0l15J5M6k29
2709d3J21J90n6J04m00K7m67j96K94k70J62J23J54J6K34J27P3n13J69K31O6J15
2731B61k8M18n7jk0K4l48k59j09J09j96m71K65L73P0l27J89q7j30M4q7J62j18
2754c23J78L13L11j03J45k75k97K51R1j92J25K7M0J53k11k6k61j75j88N5N7m8
$$ plain form
2597 324 310 952 525 416 328 36 69 -312 -416 -567 -341 -2 350 51 -96 -209 -150 -342 -279 -319 -202 -34
2619 -34 166 641 434 307 146 -61 -10 61 230 36 15 40 -119 256 -25 95 73 -292 -485 -512 -346 -332 -288
2642 -288 -33 388 362 333 190 330 299 -111 -399 -33 37 249 466 342 -5 -167 -243 -306 -332 -453 -351 -255 20
2665 20 -315 50 248 339 237 5 287 252 -39 357 282 482 259 222 380 328 116 28 -329 -565 -206 -417
2687 -417 -11 -324 -1 -239 -60 -322 -580 -503 -435 -227 395 197 295 400 635 533 460 440 125 140 186 -43
2709 -43 78 268 212 316 -84 -57 -524 -720 -426 -696 -534 -411 -257 -241 -7 120 193 -320 -151 80 146 261
2731 261 233 651 594 593 573 597 249 -10 -119 -10 -206 -677 -412 -39 31 -296 -107 -194 -324 -280 -367 -205 -323
2754 -323 -145 168 479 376 521 246 -51 200 291 99 224 251 291 444 233 207 -54 -229 -417 -362 -305 -353
2776c53o9O4L51P7LK59k27k70J63q1J39m3K36Q6K45k59j20k0m6j5m07j18J49p
2800b63K85M1n0J45j76j44Ln3j7K27J55j79K61L9k28K15n9j88k28j07K74p7j19
2823b43K72k2j19K98j17m2j99k61l6L04J68QK18l0J85j31k37r8K37k77M3J51r1
2846a9N6N2n7p5j06j07j79J78n7r1J23J44L52j6J45m17K45j42M2j7j07L80M2O7
2870D36lP1l8m38l53J09j32L31j49l41N77k38J01M5l45K6j01L78P8j43J95K59
2892C25j06L70k22j26k87K26n1j89J53j05J00J5J02q3k02n6k27j12j32L06J80
2913a21J00j48J94N2K16l87J51l57L28j73j82O21J36L14n95L15j73k62k7J03m11
2934c06N8J31J25L2p0J04j23o3j74m5j2P0K06J63J15J90p9Q4j84J16k95j36r9
$$ plain form
2776 -353 -422 -358 -7 70 73 332 105 -165 -2 -83 56 13 249 335 580 321 201 181 135 120 -287 -405 -256 -263
2800 -263 22 63 13 158 -18 -162 -159 -212 -229 -2 153 -26 235 274 46 261 202 14 -214 -321 -47 -124 -243
2823 -243 29 7 -112 186 69 27 -172 -433 -469 -165 3 11 229 199 384 253 16 -82 155 -122 -79 72 -19
2846 -19 37 89 32 -43 -149 -256 -435 -257 -314 -405 -282 -138 214 198 343 -74 171 29 71 54 -53 327 369 436
2870 436 433 504 466 28 -325 -216 -348 -17 -166 -507 70 -168 -67 -22 -367 -341 -442 -64 14 -129 66 325
2892 325 219 589 367 241 -46 180 129 -60 93 -12 88 103 205 122 -80 -136 -363 -475 -607 -301 -121
2913 -121 -21 -169 25 77 293 -94 57 -300 28 -145 -327 294 430 744 149 464 291 29 2 105 -306
2934 -306 -248 -117 8 40 -30 74 -49 -112 -286 -331 -343 -273 -67 96 211 401 322 406 222 338 43 -93 -192
2957a92L64k87L37k71J24J67j37j8m80K0r9M59R1J69m61J17L89M1k83j43j69M3
2979b19k29L89M20j99J5j97R3P0m1l17k9J76j69OK32K37J84j64k49N8j38o1K88
3002A56j35nQ8J0R7J6ol29j5m6J15%m35M23j79J13M01j27j51j99J87j15q5J97
3026b4o1L62j02K59k34K1k13J53l28L3R8J89p9K5p0mk69L9R5K31m72j13K56J46
3050f2J06K3M7J50k1j96L15j54k13mM62j59Jq7O3k40M2l11m11L74kO7L10j14q1
3075i5j92N6PNo9K24o2K04K63j42K37k66OJ98k84j27O1r7M81l12k3k47N1J46J71
3100A94k68j28k80P4P1J25J59r8J64K4j1P0k36j32N53n6M4l2K9j12n4J22k4j38
3124F0j26p2k49J31P1K45j76R1J30M3l51J64k39j68J11K16K69J1J91r9j17k29
$$ plain form
2957 -192 172 -115 222 -49 75 242 105 87 -393 -373 -472 -13 78 247 -214 -97 292 333 50 -93 -262 -219
2979 -219 -448 -59 361 162 177 -20 73 143 102 -215 -244 -68 -237 -231 1 238 422 258 9 67 -71 -132 156
3002 156 21 16 104 114 211 227 221 -108 -123 -169 -54 -54 -489 -66 -245 -132 269 142 -9 -208 -21 -136 -221 -24
3026 -24 -85 277 175 434 200 221 8 161 -167 -134 -36 153 74 99 29 25 -244 -205 -110 121 -351 -464 -208 -62
3050 -62 44 67 114 264 243 47 362 208 -5 -9 453 294 295 208 271 31 73 -238 -649 -275 -277 -210 100 -14 -95
3075 -95 -287 -231 -224 -219 -288 -64 -126 78 341 199 436 170 176 374 90 -37 24 -73 408 96 73 -174 -123 23 194
3100 194 -74 -202 -482 -408 -337 -212 -53 -151 13 37 26 96 -140 -272 281 225 269 237 266 154 100 222 198 60
3124 60 -66 -138 -387 -256 -185 60 -116 -25 105 148 -203 -39 -278 -446 -335 -119 150 161 352 253 136 -93
3146i3K06k87M48l20J50n7K75k72K02k39o4m7j54K19oN0L21l16J80j63K42l29
3168e4m6M6J37m22N43k60r6K37l2K13m37J7n5L24l59J28J48J29J48N4j48L0r1
3191A54k18M6Rj30J81J36K4j38j88J55q7j93J09K62k87k20K90K27m3j04J28k4
3213H9NQ6l37K65KR8J68M9k30J61j61k04j3K62n06j58L69j95L96l91K83j01j15
3236a78M4k85J91o5j53O09q9J42J34j7j03q7R9k06J03K99n32K58j8m7k31L17k96
3259a11pk30o3J47K31m4p4q4L88k02n7j73J65r3K57J31p3j1K47R4j8j56m1l05
3283h2j24J60j11J38Q2J79l71J15o7j52J13q9J48k4j44L3J08L20l51K37j54K77
3305B41j66j8k20O3J34J75P8l39l65M04j86J38k21L49k75l5K23K07j96J42j17
$$ plain form
3146 -93 113 -174 274 -46 104 47 322 50 252 13 -51 -98 -252 -33 -39 11 332 16 196 33 275 -54
3168 -54 -100 -54 83 -339 204 -56 -152 85 53 266 -171 -154 -209 115 -244 -116 32 161 309 363 215 245 154
3191 154 -64 -18 -9 -139 42 178 202 64 -124 31 -56 -249 -140 122 -165 -385 -95 132 89 -15 113 89
3213 89 94 180 -157 108 110 208 376 425 195 356 195 -9 -22 240 -266 -424 -55 -250 146 -245 38 -63 -178
3236 -178 -134 -419 -228 -293 -446 163 74 216 350 333 230 143 242 36 139 438 -94 164 146 99 -132 185 -111
3259 -111 -118 -348 -411 -264 -33 -77 -151 -235 153 -49 -106 -279 -114 -207 50 181 108 97 344 438 420 264 223 -82
3283 -82 -206 -46 -157 -19 63 242 -129 -14 -81 -233 -120 -209 -61 -85 -229 -196 -88 232 -119 118 -36 241
3305 241 75 57 -163 -100 34 209 287 -52 -417 -13 -199 -61 -282 67 -208 -243 -20 187 -9 133 16
3326A6q5M3k46K66l3po1K87r6K7q5J50j34k96K43l45R0J07L31j83LK03m40N01
3350B56j76k0P6j2k3j6J64N3j61P3k34J67j87p4m5m6J67J47M7j66o0j38L05n61
3374d64L05o7K1L67J91k10J55k13L05l47J54j6l67O57m63R8k24J68k06q7K09l07
3396c41J11k19M0M29k01K44k14K64l0J42k37j47j1L33j70l1K92Q5k6mj77l7K53
3419C48k42l40J27p8J05j6o7J96j92q2M7N7k5KO2j42L50LJ03k79J09J9L6P7j90
3444a2q6K33J03j07O3j34j29K7k34N9R0n0J05R3q2J65j10k07J97k68K97j66K63
3467A10j91J33K97j17J3j78jr9r9L2K16k18J24p9M4R6j2L04l07j93K52k82n7L90
3491A78o5J07j80M5J7J87n9l22k51r8M74J30L3p4j70m2J71k95O5Q4k9J17qo1L70
$$ plain form
3326 16 -69 -26 -272 -6 -39 -46 -107 180 84 111 26 176 42 -254 -11 -356 -266 -159 172 -11 -8 195 -245 256
3350 256 80 60 136 124 101 85 249 302 141 214 -20 147 -40 -114 -159 -205 -38 109 156 -10 -70 -208 97 -464
3374 -464 -159 -226 -205 162 353 143 298 85 390 43 197 181 -186 471 8 106 -118 50 -156 -243 -34 -341
3396 -341 -230 -449 -409 20 -181 63 -151 113 83 225 -12 -159 -170 163 -7 -38 254 339 313 309 132 95 348
3419 348 106 -234 -107 -185 -80 -96 -163 33 -159 -241 -194 -137 -162 -160 -98 -240 110 113 216 -63 46 65 101 178 -12
3444 -12 -98 135 238 131 194 60 -69 -42 -276 -217 -127 -177 -72 21 -61 104 -6 -213 -16 -284 13 -153 110
3467 110 -81 52 349 232 245 67 66 -33 -132 -100 116 -102 22 -57 -13 83 71 375 68 -125 127 -155 -212 178
3491 178 113 220 40 85 102 289 230 -92 -343 -441 33 163 196 122 -48 -90 81 -214 -149 -65 -94 23 15 -46 324
3516C24j71j44J27j53J3k1j3M4R9J36j18k89J46K81m54Jj33mK50N3r2k73M92j09
3540hN4JO6k18J13Q1R3j20J11R0j17K9Rl49K07k3J4l40K18q9K11j12N7Q3l57K43
3566e3k6k44K37j98K06Q4l8J81Q3l8nJ29j07j40K44Ml01l6j74L16l05l22L86o2
3590a79J18m04L97n9L6L15l22L3M1K9J61k77L92o7%k3J43k7k39K82m41j05J91
3613ep0J76P7k07n6R8J36l38J94j86L4J94J58k45Q3J46J15O2k89j61J57Qj7l5
3637B9Q1J37k03J53k29j6j54J93j73J7q3%L37k56p0L43k80L97l86R6P0j89J83
3660cK50j66j58J88l5J40j19j00j91J64R0NJ00j97J65j71J34j63K62j81m1l6K5
3683c8K98l46k9K36j2j57Q0m47O5N28j62j86J85k8J61j61J68j77k34J24K6j7Q5
$$ plain form
3516 324 153 9 136 -17 -4 -25 -38 6 105 241 123 -166 -20 261 -193 -192 -325 -329 -79 -26 -118 -391 101 -8
3540 -8 46 47 113 -105 8 89 182 62 173 263 146 175 184 -165 42 19 33 -307 -89 -178 33 -79 -22 61 -296 -53
3566 -53 -79 -323 -86 -284 -78 6 -32 149 232 194 189 318 211 71 315 319 18 -18 -192 124 -181 -503 -117 -179
3590 -179 -61 -465 -68 -127 -91 224 -98 -65 -24 5 166 -111 281 214 214 191 334 307 68 350 -91 -196 -5
3613 -5 -75 101 178 -29 -85 13 149 -189 5 -181 -147 47 205 -40 43 189 304 366 77 -84 73 81 64 29
3637 29 110 247 44 197 -32 -48 -202 -9 -182 -165 -248 -248 89 -167 -237 106 -174 223 -163 -67 3 -186 -3
3660 -3 247 81 -77 111 76 216 97 -3 -194 -30 60 65 165 -32 133 -38 96 -67 195 14 -27 -63 -38
3683 -38 260 -86 -115 121 109 -48 32 -415 -350 178 16 -170 15 -13 148 -13 155 -22 -256 -132 -106 -123 -38
3706c8O9R2L75m63j63J4J30J04l7j36q5J66k1L60k27j12r0rj29p6J36J21N2Rj8
3731B4k4j42L21L6o2r8k70K95m5M30k21j4l2j29j89L60m57J63j15J97j30J18j30
3754a14J05l8q9n%oQ2K60k52J20J46J5l8j4o4O7j53l1L4k70J92J28K43J11m67
3779c8p2J0P6k37R9J22J46j80j61j30J32K45j63R7J90j58q8K80k4O5k22K32l42
3802a21k9P7K44k39l4R0j91L02n4j64q9L41l82J00K29k98L09l15K33p2J91n3J7
3825I2J17k23J73j13o0J34j6L03m04O6lk8L7o0k03K95m9J8l23K49j40K85k60n7
3849a70J07j91L27q7K4Q5J49l06J54J13k20k4R6p2j77L47j05j35l5L43k49M9r8
3872g5o2RL6K4J67k6l86N01l09r4J31j80K64p6j42J58J00Q6L0m03N44k92k1l69
$$ plain form
3706 -38 31 123 498 35 -128 -114 16 120 83 -53 -138 28 7 367 140 28 -62 -71 -200 -276 -140 -19 33 42 24
3731 24 0 -142 179 215 153 55 -215 80 35 465 244 230 198 69 -120 240 -217 -54 -169 28 -102 16 -114
3754 -114 -9 -47 -136 -141 -141 -147 -65 195 -57 63 209 224 186 172 108 175 22 -9 25 -245 -53 75 318 429 -38
3779 -38 -110 -100 -24 -261 -162 -40 106 -74 -235 -365 -233 12 -151 -54 136 -22 -110 170 146 211 -11 221 -121
3802 -121 -150 -73 171 -68 -102 -12 -203 99 45 -119 -208 133 -249 -149 80 -218 91 -224 9 -63 128 75 92
3825 92 209 -14 159 46 -14 120 104 407 3 69 66 38 75 15 -188 107 58 76 -247 2 -138 147 -113 -170
3849 -170 -63 -254 73 -14 10 95 244 -62 92 205 -15 -39 57 -15 -192 155 50 -85 -120 223 -26 23 -75
3872 -75 -137 -128 -92 -68 99 73 -313 188 -121 -215 -84 -264 0 -76 -218 -60 40 126 156 -247 297 5 -16 -385
3896c85L59j20J61J82N3j40J7j25j64J74j8J11K74o47L88M1j98K5J25j30j21Q0
3918e8o8J00j78L03J35l0k61J95j29K31j76l3J86R1k90L91l85p1J02j00r4Q4k3
3941g8j36J04L8l68M07j79M6m2K94j70k1N2p8K87j16j08K81N1j11O5o4n9l17J41
3965h1J5K8P8j81K38M8k93j31R2k66J23K52jK07j62J61k56R0j00K42p3j39J97
3988H8Jl35K61L03j82k00J56m5l02J26J83m1l15M28j18k7J19j10j36Lk8J2J88
4011B9j66K72J26M6l64nk51L60k72K83k14L47J3k13r4J79N7l19R8O9j49M2P6K86
4035B36k23J9L01j20j76j60j12L15J96k12k23j12K74J56k42q6OK05k71J9K42R9
4057A31l15J82J47k58J17o8l7J36N2k40J87O5P2j46L4J7J71m24J77J30k38J08
$$ plain form
3896 -385 -26 -146 15 197 250 110 127 2 -162 12 -6 105 379 -268 120 161 -37 -12 113 -17 -138 -58
3918 -58 -126 -26 -204 99 234 204 -57 138 9 240 64 31 217 308 18 409 24 -47 55 -45 -139 -55 -78
3941 -78 -214 -110 -72 -440 -33 -212 -166 -208 86 -84 -105 -53 -131 156 40 -68 213 264 153 218 154 95 -222 -81
3965 -81 -66 -38 40 -141 97 145 -148 -279 -187 -453 -330 -78 -79 128 -34 127 -129 -39 -139 103 30 -109 88
3988 88 89 -246 15 318 136 -64 92 47 -255 -129 54 13 -302 126 8 -19 100 -10 -146 -143 -171 -159 29
4011 29 -137 135 261 307 -57 -62 -313 47 -225 58 -156 191 204 -9 -103 76 133 -186 -88 -19 -168 -126 -50 236
4035 236 13 32 333 213 37 -123 -235 80 276 64 -159 -271 3 159 -83 -169 -163 42 -229 -210 32 131
4057 131 -184 -2 145 -113 4 -64 -101 35 87 -153 34 99 171 25 59 76 247 -177 0 130 -108 0
4079@r8K6j3L54l76J17K13k09J8J3K24k07J76j91J23j2J9L6J12j77j06j38J68
4102G2m7j23J71j1N1n45L17N0l34L69o7J81Q8l30L64M2j11l8l75K78jK23N6K1
4126C01j15N1kk09j29%P3R3l37K42k77L51j51K06lLm30L09K60j10j46L15r3l66
4150a64J97Q6k4R7k11j28M58q8l50L10j24j50L07l74J77N3j17rK95l82oMp2R5
4174a20Q2K43j69J59k85P5O7L3k6j13L09m19o7Q9N5J09k95o2L6K54M1K1O1j04
4198b6k43J03R6j28K56j07J03k1Qq1J81k15Q3J75j50Q4k11J88l8n6K5K0J00k32
4222h6J38n5nm8K21j78J32Q7j11j81J75k2J31k05k83N13l72P1L5n4J84j26j70
4245b09K8J10J8k9L3J80j65K59J40j92j20rR3l6K6Qk84L50l7m0j91J43Kj15j89
$$ plain form
4079 0 -98 -72 -85 269 -107 10 223 14 32 45 269 62 238 47 170 158 177 213 325 148 42 -96 72
4102 72 25 -98 73 62 113 -432 -115 -65 -399 -30 -97 84 172 -158 206 248 137 99 -276 2 1 224 280 301
4126 301 186 237 235 26 -103 -103 -30 63 -274 -32 -309 42 -109 97 94 97 -333 -24 236 126 -20 295 202 -164
4150 -164 33 119 95 192 -19 -147 311 223 -127 183 59 -91 216 -158 19 72 -45 -54 241 -141 -147 -143 -215 -120
4174 -120 -38 205 36 195 -90 -15 52 85 59 -54 255 -164 -231 -142 -87 22 -273 -335 -299 -45 -4 17 78 -26
4198 -26 -269 -166 -70 -198 58 -49 54 33 41 -40 141 -74 9 184 34 118 -93 95 57 1 26 46 146 -86
4222 -86 52 -3 -8 -56 165 -13 119 206 95 -86 89 67 198 -7 -290 223 -149 -78 -43 -97 87 -39 -209
4245 -209 -181 -71 -53 -82 -49 131 -34 225 365 173 53 44 137 101 127 135 -149 201 164 124 -67 76 78 -37 -226
4270b26P2J01J43l2j82R8P0j5R0K6j71O8k0j46Q1K22k27N0o5R1m7M1K1K16m22
4295a63J07k04K23j44K51k53J05P9j09L79k99LO2J42p7j61K8q3J46j11o3K35J64
4318B57k08R6p3j19K67l81j95J30J80m4R1n4Q0l52K63K09j85p2K29J3j76P8k32
4341a98M65l55L59n62J81P6J08r6J41k02m0Q4N2j02K36L6j98j12r5N7K73j89L23
4364B42k17l3q8K00k41L83j61k50K82j04N5r5j8J53j48m0KnN9j00K2K85l03J03
4388a7L0N5J2l38J17R7j32O4P8j76nJ25m9J82J11k35J50Qk59K60o2o0J49j42n5
4413i2K17k37l6K28k5p0J32K1k28K70k99L84l80K14k70K42j62J82oJ76j45j00
4435A6j24J44Mj2j15j40K32N6m0j99J49L8J54j96o2L84m39O9R5j78K52K8q6n3
$$ plain form
4270 -226 -154 -53 90 58 -124 -26 44 29 119 145 -26 42 22 -124 -43 179 -48 2 -63 28 -19 22 43 259 -163
4295 -163 -56 -260 -37 -181 70 -183 -78 1 -108 271 -28 -25 37 179 102 -59 -31 -114 32 -79 -142 93 257
4318 257 49 145 72 -47 220 -161 -356 -226 -46 -90 1 -53 27 -325 -62 147 -38 -110 119 132 -44 34 -198
4341 -198 267 -88 271 -291 -110 -34 74 -22 119 -83 -123 -39 13 -89 147 183 -15 -127 -222 -165 108 -81 242
4364 242 25 -8 -96 104 -137 246 85 -165 117 13 68 -27 -45 108 -40 -80 -78 -83 -24 -124 -102 183 -120 -17
4388 -17 13 68 80 -258 -141 -44 -176 -112 -34 -210 -215 -90 -139 43 154 -81 69 77 -182 78 16 -44 105 -37 -92
4413 -92 125 -112 -148 80 55 -15 117 138 -90 180 -119 265 -115 99 -171 71 -91 91 85 261 116 16
4435 16 -108 36 40 28 -87 -227 5 61 21 -178 -29 9 163 -33 -95 289 -150 -81 14 -164 88 116 30 -23
4459b3k4l8J05n3j27M1j3PO5r7J98K5L0j59m6l8K39j87R2R4L7j92N8J22j34o0
4485g8j51Q9J52j5j34K13jJ2k29L83k38p1j10J82M1j47L52l08K18k45L04r6L1
4508A54k6L1R3j77j4J91m6k22o8qO9j5R8J55r8j84J69J0j8k72k8L11j78K46l9
4533A34j09K0J03j09P1mm0k76J78M4P3j61J60q1N2J34q7j25K99j33k70J32qL2
4557B9J31l5k48K54p9k31K90k79K43k76L2L75l6k59K18k63j33O29l96J25j37J33
4579H7O6J14l84M25l01J36n2r2m5j41J52l4K52j93K5L1J07j44N7j90J75Qj48J35
4603D6P5j03j62J08M5j09O3J40m3L6j59L8M4P6o2l16L56k10O2k36J42K26K7j44
4627f0j41Q9R0Mk19K06K7L2J43k17Q5j03r3L3J46j84M79m04J91k10J37J57k92
$$ plain form
4459 -23 -47 -85 20 -33 -160 -119 -132 -125 -60 -157 41 66 96 -63 -109 -147 92 -95 -3 91 128 -64 -6 116 -18 -78
4485 -78 -229 -140 12 -3 -137 76 75 87 -142 241 3 -68 -178 4 45 -102 250 -58 160 -85 219 123 154
4508 154 128 159 252 75 61 252 206 -16 -84 -92 -23 -38 60 215 117 -67 102 112 94 -178 -206 105 -73 173 134
4533 134 25 45 148 39 110 106 66 -210 -32 12 85 -76 84 3 55 189 102 -23 276 143 -127 5 -3 29
4557 29 160 125 -123 131 52 -179 111 -168 75 -201 -169 206 170 -89 129 -134 -267 362 -34 91 -46 87
4579 87 153 267 -117 308 7 143 91 -1 -46 -187 -35 -69 183 -10 15 46 153 9 66 -124 51 59 -89 46
4603 46 121 18 -144 -36 9 -100 -37 103 60 96 -63 -25 19 95 33 -283 73 -137 -75 -311 -169 57 84 -60
4627 -60 -201 -112 -22 -18 -237 -31 -4 28 171 -46 39 -64 -157 -124 22 -162 317 -87 104 -106 31 188 -104
4650a04n6J00J14%j75K92l03J04q2j08J0J65M0j38L12k12M9l4K12q9J15m07L45
4673A50Oj19P3k4o3k75J34K47k77L20k39r1K85n45M26K62k11k01K23k6j70J66
4695E1M82o26j86L47l3o1j53L39J00j90J39j68j62l5L6L57j23j35n4M5n9J03j13
4718i9J04L5j19M20n64K68k9k04M1J94O1l43L72k12J19N5m9j51Q3J94oJ64k65
4741F9j89R3r9K46J22m32J74j64M12n25M88k07k02N5K05j35j44L00p6J5J57m0
4763A23j40j20L31l64Q8K09k05K02J98J0m41pJ17J19k4j81PJ13k4K06j65o5j12
4786a25J97j47k69N56k89J25N9k18L13k51M5k35p1L70M5J83k87lJ86k88J06j53
4808a51N1J66k10J20j07Q3k1J2j73R8j39K27K78l21J77k54K65k0j42K77j43q3
$$ plain form
4650 -104 -160 -60 54 54 -121 171 -132 -28 -110 -218 -208 -43 -3 -141 171 -41 8 -26 186 97 212 -195 150
4673 150 156 37 110 86 23 -252 -118 129 -148 172 -67 -158 127 -418 8 270 59 -142 81 55 -115 51
4695 51 533 -93 -279 68 35 -26 -179 160 260 70 209 41 -121 -156 -120 237 114 -21 -75 -30 -89 14 -99
4718 -99 5 40 -79 341 -223 45 16 -188 -147 47 108 -235 137 -75 44 99 50 -101 -18 176 170 334 69
4741 69 -120 -27 -126 120 242 -190 -16 -180 232 -293 195 -12 -214 -159 46 -89 -233 67 -9 6 163 123
4763 123 -17 -137 194 -170 -82 127 -78 124 322 332 -109 -116 1 120 96 -85 -78 35 11 217 52 -13 -125
4786 -125 72 -75 -344 212 -77 48 107 -111 202 -49 -4 -239 -310 60 105 288 1 -2 184 -104 2 -151
4808 -151 -100 66 -144 -24 -131 -48 -69 -57 -230 -132 -271 -44 234 -87 90 -164 101 81 -61 216 73 -10
4830a0J45j22J0o4J98K5k21J16j01n2J27l2k24P1L16n6l8K8j15r4M15k71j28j2
4854h9K21pj26L8m4L7J67pl75K27n4L2K13k99rj82J93RK6J24k86J60J02j94K87
4879A64k29j69L33l04L1J96j46R5l6K37k01O7J25j09j24n3J54L2r5j8j35J22R9
4902C6j24L22k89K36j5k39L8M2k0j1j35j37J80J29k03K79r8K39k40J17q5q3J21
4925F0j5j09J46m9j81O9j31K19J85O2j20q1j71L00r4k24J52J25j66J04J09l1k82
4948a23L57l18oR5J24q1j0J85l81Q5N2j93K16J54l15K37N9j69N2n5O5k8j09J86
4972G9j31j80R1L26j03P0o5j71n5J18j6n9K50n1K3L8K0k8k86L88k55P7j25rk0
4997g4j54K61J15k65J2j37L87j22l35K57k4N4R6m10L06N1O5r3j94L77k16q7lL82
$$ plain form
4830 -10 135 13 23 -41 157 182 -39 77 -24 -76 51 19 -205 -134 182 126 88 116 1 -93 322 51 -77 -89
4854 -89 132 125 -1 37 -7 30 197 190 -185 42 -12 20 233 -66 -75 -257 -64 -55 -29 95 -191 -31 71 -123 164
4879 164 -65 -234 99 -205 -174 22 -124 -29 -65 172 -29 38 163 54 -70 -123 31 63 -32 -50 -185 -63 36
4902 36 -88 234 -55 181 166 -73 -35 7 -13 -24 -159 -296 -116 13 -190 89 -9 230 -10 107 22 -61 60
4925 60 45 -64 82 33 -148 -79 -210 9 194 256 136 55 -116 184 90 -134 18 143 -23 81 190 159 -123
4948 -123 234 -84 -90 5 129 48 38 223 -158 -73 -21 -214 2 156 -159 78 137 -32 20 -35 30 2 -107 79
4972 79 -52 -232 -141 185 82 152 87 -84 -139 -21 -37 -96 154 103 126 164 184 156 -130 258 3 80 -45 -54 -74
4997 -74 -228 33 148 -117 -105 -242 145 23 -312 -55 -79 -25 71 -339 -33 18 83 -10 -204 173 -43 -130 -133 249
5021B49j91n9J35l52J26J6K34J01k84J3lm5N3J5j19J70l64N03J93l03J2k66J57
5044iJ66m54M81k55m0J70j36ok2J58mj0K16k73K23j60p7P0J4O0J9j41k7J6K2k46
5070b45R4J19j03K64Lj83N6K15n1o7j10K8L6j80J56L0R5j48J33j68K45l87K50
5093H2O3q3l46J62K64l61M36k05N7m0J12n0l63M60k25P7L2o7M1J20m7j07J19j39
5117hM3k14k5J29N6J75J15k84j9J0J08J3J81l21r8N6J4J05j3L5k1J13j90J00O
5142F6j70J16j69M4K27j92k0j10L07J42l64M4j86K28j66K18L18k18j38J46j40
5163a7J83k58o5M08m01J51N3q6J37q9j0J05l41L34L3k37l2n1J95j27K88k71M3
5186e5j90K64P5k09k5R8l2K02M7n4R9k38N4j22K81j33j78pR1J40j14j61L38m42
$$ plain form
5021 249 58 -1 134 -218 -92 -76 158 259 -25 -12 -15 -60 -7 8 -111 59 -305 198 391 88 100 -166 -9
5044 -9 157 -297 184 -71 -111 59 -77 -83 -105 53 49 39 255 -18 205 45 -32 38 52 112 131 -10 -37 -21 1 -245
5070 -245 -151 -32 -135 129 132 -51 5 220 169 102 -8 20 56 -124 32 62 157 9 142 -26 219 -168 82
5093 82 145 62 -284 -122 142 -219 217 12 69 29 141 91 -272 188 -37 40 72 5 46 166 119 12 131 -8
5117 -8 35 -179 -204 -75 -19 156 271 -13 -32 -22 86 99 280 -41 -139 -83 -69 36 23 58 37 150 -40 60 66
5142 66 -104 12 -157 -113 114 -78 -98 -208 99 241 -123 -79 -265 -37 -203 15 333 115 -23 123 -17
5163 -17 166 -92 -157 251 -150 1 54 -32 105 16 6 111 -230 104 137 -100 -132 -183 12 -115 173 -98 -55
5186 -55 -245 19 94 -115 -140 -42 -74 128 175 121 220 -18 36 -86 195 62 -116 -123 -32 108 -6 -167 171 -271
5210b71K78R8k88L74k86L45m02K42j16n9o7N8K63k7k54K29nq1MJ37j14o0kJ26
5234A22j04m6j22q9K21p3O0j16L7K22k60K18J12j51Q4k98J31J78o2p2JK9j49J86
5258E9j38K0R0k6k22J18J87l88J25P3J65j52J36m6K0j59NJ85k78M3J56L56j58
5281A71O4K1l56L7M1j17L95k36P8Q2k84J46J9r9K21L1j95j20m0L9M2M4K39j02
5305A21K08k85J73k20L56m86m4K03k49J83J95j91J87J16j48j24r2j90L95k75L38
5326A71k22J92q5k6j5j2j13k8R9k45K33M0p4J7l1K88k58j48J03J89J6K6o0k7J12
5351A42j35j34J37J58m09J30J6J89k00J50j68L55l03J96l28J4K11J24j02Ok64
5372b15M56k74mj44J07k10K90J22l7j07l6J33j56L34k93R6J4j58K87j34l3j48
$$ plain form
5210 -271 7 105 -183 191 -95 250 -152 90 -26 -85 -152 -94 169 142 -112 117 112 31 35 172 58 -2 -4 122
5234 122 18 -28 -150 -239 -18 -91 -31 -147 -110 112 -148 70 182 31 115 -183 -52 126 64 -8 -7 22 -127 59
5258 59 -79 -59 31 5 -217 -99 88 -300 -175 -102 63 -89 47 1 21 -138 -133 52 -226 -183 -27 329 171
5281 171 235 256 -100 -63 -22 -139 256 20 98 180 -104 42 61 -38 183 214 19 -101 -141 -102 -60 -16 223 121
5305 121 329 44 217 -3 353 -133 -177 26 -223 -40 155 -36 151 267 119 -5 -97 -287 108 -167 171
5326 171 -51 141 56 30 15 3 -110 -138 -39 -284 -51 -11 -85 -68 -99 189 -69 -217 -114 75 91 117 57 30 142
5351 142 7 -127 10 168 -241 -111 -95 94 -106 44 -124 231 -72 124 -204 -190 21 145 43 49 -215
5372 -215 241 -33 -37 -181 -74 -284 6 128 91 -16 -52 81 -75 259 -34 62 76 -82 205 71 38 -110
5394a10JK16k13k1n3J54j90K75l2n4m9P2q9L04o9n9m34K12J56M2j25J69J4j87
5418g0J32j44K05k31K64l48J66P4O3l41K97N8j13j44n9J36m0L24n28K92m4N5n5
5441e1M34l87p5J48k20J44j64j42L25K99m45M25m08Q0MJ24j67M1J27k5j75K25
5463A17J0k08m1M32m44M1M3j00m6K68k20K42P6K5j81k7m2N8l3J23Kk62N44j22
5487B55l05J1j56J10q3n0M34k63j71k4J76K76l15K25r3J65j64j07j14L6J26K79
5509B48k62j43L74m9L7r2L5q0q4L68m58J89J7q3J5k03J60k82J30M3J90M3k91R2
5533h6no8m2J83O2p4n8r6o9N76m23R1o8J64K11n61K72R1m7R1p0k45J20Kj09K51
5559I3j7k21J02n5M5K51j65k2j63K84R0l03l4K17k76J37K59k07J20N1m5k2j55
$$ plain form
5394 -110 -109 107 -106 -127 -180 -26 -216 59 27 -27 -76 -4 -93 211 142 83 -351 -139 17 59 -66 103 117 -70
5418 -70 62 -82 123 -108 156 -192 -26 48 111 -230 67 125 12 -132 -191 -55 -95 229 -299 -7 -51 4 -51
5441 -51 383 -4 -79 69 -151 -7 -171 -313 12 311 -134 291 -117 -37 -33 91 -76 -35 92 67 -108 117
5463 117 127 -81 -122 310 -134 -93 -50 -150 -196 72 -148 94 170 195 14 -13 -55 3 -30 93 95 -167 377 255
5487 255 -50 -39 -195 -85 -168 -218 216 -47 -218 -242 -66 210 -105 120 27 192 28 -79 -193 -157 -31 248
5509 248 -14 -157 217 168 205 113 148 68 -16 352 -106 83 100 17 32 -171 -11 -293 -163 -120 70 113 -178 -86
5533 -86 -91 -159 -201 -18 44 -30 -88 -184 -253 323 -100 -9 -77 87 298 -263 9 100 53 144 74 -171 -51 -49 -158 93
5559 93 76 -145 -43 -98 -53 198 33 11 -152 132 222 -81 -115 102 -174 -37 222 15 135 186 141 119 -36
5582c6Q8pj84L55k10j06j3J43k9J41j4m69K86J97k20K09j0q5P6j05M1J77k69J34
5606I0l7k1o3l9J02L3j26L6N0j8l05K28n2J11o5K8L1J43q0J00j58j21J61q9r0
5631a51p5Q9l4O6R9k07K15j56K77j72J40j09R0j28Q1K29m18K04L5j29N4L0l7L3
5655B6k11J62J07n1L9j56J36K15p7j67R0j17j30P6K89l64K81jk06pN4J38j28R7
5679I5j39k98K65k1L20m20J97j41K69Jj17l0k4j33K57j55O3J12nk9l29M53j93
5702bo8J54k8K8k02l5m9L56j11k24J44J29p8K25r1j37p0o4J32k39J02K1K03j7
5726G9P8j46J06j51J6L95o34J15K56j06k44K41m3J7J87j49L2j56j04K85j76KJ01
5749AO3p9k22K60l62K39l4R4R3K8J53k34m0K1P9J2m1l32L10JK27j59q6m3l3j58
$$ plain form
5582 -36 52 45 -139 216 6 -100 -113 30 1 142 128 -341 -55 142 -78 131 121 36 112 7 48 225 -44 90
5606 90 53 32 -31 -70 32 65 -61 -25 25 7 -298 -70 -122 -11 -76 -48 -17 126 46 146 -12 -133 28 -61 -151
5631 -151 -226 -137 -171 -105 -6 -213 2 -154 123 -49 91 -18 72 -56 25 254 -164 40 75 -54 0 30 -7 26
5655 26 -185 -23 84 33 72 -84 52 267 190 23 113 -4 -134 -58 231 -133 148 147 -59 -66 -12 126 -2 95
5679 95 -44 -342 -77 -98 222 -198 -1 -142 127 128 11 -19 -43 -176 81 -74 -11 101 96 67 -262 191 -2
5702 -2 -70 84 56 84 -118 -153 -202 154 43 -181 -37 92 14 239 148 11 -59 -123 9 -230 -128 -107 96 79
5726 79 157 11 117 -34 -18 377 -257 -142 114 8 -236 5 -38 -21 166 17 49 -107 -211 74 -102 -100 1
5749 1 64 -15 -237 23 -339 -100 -134 -40 53 81 234 0 -40 -19 60 72 31 -301 9 10 237 78 -8 -51 -84 -242
5775b42Q0K61Q9l05K77j7j24k65J68J60J42k23J10p2k6J82n4%k88j24Q9M73l42
5798e1k10L03K3J2K3j60O6R5q0j44K22M6k07Q0nJ2M9l19K41L6k42K51l4M0M9n2
5824D4JJ31j31kr3M3J2L9K10p6j28j43M53j97m8j97J5MJ7q7n5K6J93P8j34J93
5850A68l59J49n5J58J84j24l94J59J24l55L86Q7j05nN6J02k71J57j06j29L38k78
5872a13J61o2j23r1K45L3j20K8j53L80Q2l51J85k1j43J69j98J39J6j6j53j2p2
5895a90L08j13J95l08M90o21L83p8j49L31k26l26N00l98L17L9j25J26j27j89l4
5916a95J26K64m45K32Rj60K13K97k65j01Q5r5J84r4j95J24o0P8OrK42k11k77M40
5940A93k83J6M5q4K2J33R9k86P4O7N3P2n0Oj20P6j03J16m7P5J68l5k46j90L59
$$ plain form
5775 -242 -162 99 188 -117 160 143 19 -246 -78 82 224 1 111 39 13 195 141 141 -147 -271 -182 291 -51
5798 -51 -261 42 65 77 100 -60 6 101 21 -123 99 145 -62 18 13 25 74 -245 -4 32 -210 41 7 47 96 44
5824 44 45 176 45 43 -50 -7 5 44 254 178 50 -93 360 163 115 -82 -67 -63 -46 -133 -188 -162 31 109 -25 168
5850 168 -191 -42 -97 61 245 121 -273 -114 10 -345 41 128 23 18 74 176 -95 62 -44 -173 165 -113
5872 -113 48 -14 -137 -228 17 50 -70 -42 -195 185 267 -84 101 80 -63 106 -92 47 63 47 -106 -118 -190
5895 -190 118 5 200 -108 382 -239 144 66 -83 248 22 -304 196 -202 115 154 29 155 28 -161 -195
5916 -195 -69 195 -250 -18 -9 -169 44 341 76 -25 60 -35 149 55 -140 -16 -76 2 8 -1 241 30 -247 193
5940 193 -90 -74 -29 -113 -91 42 141 -145 -71 -4 49 121 71 77 -43 33 -70 46 -1 74 242 207 -39 -229 130
5965A30j08j09J96k80J04R2k86J99l4K36j39r3p8L34j54o5j16R4K17N5k12O8m5
5988FK65l36K0J36j83J35q6K35Lm20L93l02J62l2Jj27j37L49j42O6J7N9l38M77
6012B21j75J36k88M05l43K58l76J38MJ90r0L3k08J76K4r2l1K1p1K47rl06O4N9
6036a3q5L3k31J91K86l36J68j04K49j74n1q7K5K53p2k47R4Q3k9j72J96m4L2L6
6060Aj81K01M1k47J58K31l40m6K19K2j33L07k85k70J34L54j29j34N1p0L66q1j34
6083C5K43p0l29J07K41K0j30j10noj30K1K20k51K04j1k39M61k41K67kk6l23j85
6107b39M31l01M7o4o6L17k22L98l61K40q4j07k33J60J76k28R4J37j35J00k17J21
6129c6j61K87J68q5k40O5J6p6K27k20J29k72J04J59M3j36kj55K41j90J23L2k3
$$ plain form
5965 130 22 -87 109 -171 -67 25 -261 -62 -96 140 1 -92 -170 164 10 -55 -171 -77 140 195 -17 51 6
5988 6 271 -65 -45 91 -92 43 -43 192 195 -225 168 -134 28 -4 -3 -130 -267 82 -60 6 23 82 -256 221
6012 221 46 182 -106 299 -44 214 -162 -24 -20 170 80 113 -95 81 105 13 -18 3 -68 179 170 -136 -72 -13
6036 -13 -98 -65 -296 -105 181 -155 13 -91 158 -16 -67 -154 -129 124 52 -195 -101 -18 -47 -219 -23 -67 -35 1
6060 1 -180 21 62 -185 -27 204 -136 -182 37 59 -74 233 -52 -322 -188 166 37 -97 -46 -116 250 169 35
6083 35 278 208 -121 -14 227 247 117 7 2 -4 -134 -113 107 -144 60 49 -190 271 30 297 295 269 -54 -239
6107 -239 192 -109 -62 -126 -192 125 -97 301 -60 180 96 -11 -244 -84 92 -136 -42 95 -40 60 -157 -36
6129 -36 -197 90 258 173 -67 -2 14 -62 165 -55 74 -198 -94 65 108 -28 -30 -185 56 -134 -11 21 -2
6152bN5J4l25M88j92N8j82J72j68K67J2j36j47P1Q5j76L7m2r3L9J78m6j74J49
6176e8J38k46K94j04r6K24M8k70P6J53j96L15k62P9r5M6J20l18j47J01L16j18
6198@k38K30Rq6J89k92K3j9L53k14m4L02o0j99P6r9J79j45J18M1Nl18J65k4K78
6223B30j19k15J07j26P8J3J22J7j10J06O5k39k6J70j20M6J04j75j25L07j73K13
6245A50r2n2k25L94j66N3k60K57j15N3J69m02j82N94j62N8j24r5N7J47l7r0R4
6268B4j48J29o8R8j55K07j46J93j85o9k1Q3l0K0L07l62N7P7k54K36m4J4k9Q6p7
6293e7N5P0k57J79j7K55k16r7J03j43J29R5o6L4l82M08k9o8j96J26j8J5K68Q4
6317B75k22j58O2LK50k76P6m0J36j33R6o3K3J12j68j10Q4K03j49k14K50J72k08
$$ plain form
6152 -2 53 67 -258 230 38 96 -86 86 -82 185 197 61 -86 -15 70 -106 -69 -111 -204 -165 13 -33 -207 -58
6176 -58 80 -166 128 24 -72 152 200 -70 6 159 -37 278 16 95 0 46 166 -152 -299 -198 118 0
6198 0 -238 -8 1 -85 104 -188 -165 -184 169 -45 -89 213 153 -46 30 -69 110 -35 83 124 129 -189 -24 -48 230
6223 230 111 -104 3 -123 -45 -32 90 107 -3 103 168 -71 -97 73 -47 -1 103 -72 -197 110 -63 150
6245 150 58 6 -219 175 9 62 -198 59 -56 -3 166 -236 -418 176 14 72 -52 -147 -90 57 20 -70 24
6268 24 -124 5 -63 35 -120 87 -59 134 -51 -120 -141 -58 -88 -68 239 -123 -66 11 -243 -7 -51 -37 -66 20 -57
6293 -57 -2 68 -189 -10 -27 228 12 -85 18 -125 4 99 33 67 -315 93 64 -4 -200 -74 -92 -77 191 275
6317 275 53 -105 -43 -40 210 -66 10 -30 106 -27 69 6 29 141 -27 -137 -53 150 1 -213 37 209 1
6340AM3M4k0j10rJ89n0J23k84O6L1m4J88l15M72k93O7k34Q5L4J34n4j94K24j48
6365e4K03l68K43k07K62l8q1k52Q4M43o1k12r1K22pj20l0P0r0K0K9k57L84j59
6389f7n7L00k36O0J34j43o3r1J13o4M10l52jN5J59l57N4O6J08j5r4M17m58J49
6413B7k07J27J14N4j47j6p8K89o7q3j27j38K28Jj92K48j5O9J25j6k58K9L37l84
6437h0j47k01O82j98k41L48n60J08rM41k10jj20K08K9N0l45J20Q1j66J99j47L03
6460A44J85j72p2j12q8J21j05L41l57K66j79kJ05j17O1J14p1p8j08J00N0m6N3
6483C3m0J03n9OJ59k44J90k9l53L64j62j07K74j00Q0j15J02j36J49q6R7j87O6
6506En4n9n6J4J51n7j55J28J30L1n8n6j94L74j80k6o5PL3Q9O4o9j56K32k28L8
$$ plain form
6340 1 44 88 68 -42 -51 138 88 211 -73 -7 24 -20 168 -147 325 32 99 -135 -50 -16 118 64 -130 94 -54
6365 -54 149 -219 24 -183 79 41 -40 -292 -208 235 174 -38 -129 93 86 -34 -64 6 -84 -64 -35 -292 92 -67
6389 -67 -124 176 -60 0 134 -9 -72 -163 -50 -114 296 -56 -57 -2 157 -200 -146 -80 28 13 -81 336 -122 27
6413 27 -180 -53 61 115 -32 -48 -126 163 96 13 -114 -252 -24 -23 -215 33 18 87 212 196 -62 -33 304 -80
6437 -80 -227 -428 254 56 -185 163 -397 -289 -298 143 -67 -68 -188 20 49 99 -246 -126 -45 -211 -12 -159 144
6460 144 329 157 85 -27 -115 6 -99 242 -115 151 -28 -30 75 -42 19 133 62 -16 -124 -24 26 -20 33
6483 33 -7 96 37 43 202 -42 148 119 -234 130 -32 -139 135 35 115 0 102 -34 115 29 126 -61 5
6506 5 -49 -108 -164 -150 1 -56 -211 -83 47 78 20 -36 -230 144 -36 -62 -127 -120 -87 2 66 -3 -159 73 -155 -117
6532a17K10k22J50K64l74J23J0JO8k43k36K20j61N82m95L04L1q5J65k40k0N8K25
6555B18l21J60j15j43J31J95j05j23k2J40K84k47r9J51j74j90J95J88j44J09j40
6576e2q1P7j17J99J7j42k4L4J11j52N4j7J94N4l22j32N05j20k28K16l48J98L10
6599B34m49J69oK2L6j23J32k2R7J76j28j61R0o5n8q9K95l56K45K46j03j05r5o0
6623g8L16j89O2j44j35K12l5j90L18j57K96k88K74k27k21J3k9N4K50o1k7q1L8
6646b9Q6j05rK95k49N5K19q8n46J86L61k89L3j57J82R1P5r4k9K86k37r5J29K60
6670C31m31q7L67j51R8J8rj65J28J02k84N9J10k14J17k7J20n7k08M10k82J11N6
6693A12l8o5J61p3l0r6K5QR5j44N3j64L53m0k80K88j50j7K17m7o5j1j38K30l23
$$ plain form
6532 -117 93 -129 21 285 -89 34 44 45 113 -130 -366 -146 -307 275 -220 84 115 30 195 -45 -65 -7 218
6555 218 -103 57 -58 -201 -70 125 20 -103 -125 15 299 52 -47 104 -70 -260 -65 123 -21 88 -52
6576 -52 -133 -56 -173 26 43 -99 -123 -89 22 -130 -76 -93 101 155 -167 -299 206 86 -142 74 -274 -76 234
6599 234 -215 -46 -52 -30 6 -117 15 -7 90 266 138 -23 67 2 -56 -145 150 -206 39 285 182 77 -18 -78
6623 -78 238 49 111 -33 -168 44 9 -181 137 -20 276 -12 262 35 -186 -173 -202 -148 102 41 14 -67 -29
6646 -29 57 -48 -57 238 -11 44 263 175 -371 -185 176 -113 -80 -237 -55 36 111 17 -12 274 37 -58 71 331
6670 331 -100 -187 180 29 127 145 136 -29 99 201 -83 -24 86 -128 -11 -38 82 25 -183 227 -55 56 112
6693 112 74 9 170 97 67 -29 -4 4 99 -45 8 -156 197 157 -123 165 15 -2 215 168 103 92 -46 184 -139
6718a39l9J25j99N16r6P7j74k77N3j72L39k59K89p2N6j7k04K56K91m27J09l6n1
6741e1J84j72j54J8J49N9l31M13O5j53Q9j62p6J81j94j50J16N4K76k34L7PK78
6764B49l72l17K01J3K50j99K61j38Q8p1p6P7q5N6J16l3N2j58L0J41j64RM7J03
6788H0k08J68j19r8K37j24R6q7L38k09q3P6j6o2j7N0Q6p8J13k75j7K89r9l0j52
6813a41J65J93m27J74LJ8J23k3j23J37r8J8L77l49p8J90j51q6QJ51NJ42m6m17
6837b35M58m03J58N8M4j1j17N7j90J1Q3J86L5k61J61J12l8o5O0r0K2M8m09M24
6861I8lP2k37J9R3K79k91o4J4J25j54j81L90m47L76O3l85J54j38L62j59n6K8J49
6885A07Q8k70oJ48k1M6m88N00j16j81l3N37n2m46K90j40j21J61p4K5j06J78o6
$$ plain form
6718 -139 -178 -53 -252 264 168 245 71 -206 -153 -325 14 -245 44 -28 28 11 -193 63 354 -73 36 0 -51
6741 -51 133 -39 -193 -175 -26 33 -298 115 180 27 116 -46 -122 59 -135 -285 -169 -115 161 -73 -36 -29 249
6764 249 -123 -440 -239 -226 24 -175 86 -52 36 -35 -111 -34 -119 -63 53 20 72 -86 -56 85 -79 -70 -23 80
6788 80 -128 40 -79 -177 60 -64 32 -55 283 74 -9 67 51 -11 -28 22 108 30 143 -132 -149 140 41 11 -141
6813 -141 24 217 -210 -36 -33 -15 108 85 -38 99 1 19 396 47 -31 159 8 -78 -70 81 86 228 182 -235
6837 -235 223 -180 -22 36 80 69 -48 9 -181 -170 -87 99 134 -127 34 146 108 43 103 13 35 83 -326 98
6861 98 95 167 -70 -51 42 321 30 -34 -20 105 -49 -230 160 -287 89 152 -233 -79 -217 145 -14 -70 -42 107
6885 107 195 -75 -81 67 46 92 -396 104 -12 -193 -226 311 259 -187 103 -37 -158 3 -71 -46 -152 26 -40
6908d0N9r1n1L70l01JL89o55L29p7N0J35r6p9J21k85L47p9q1Q1J7j10r3J56k49
6933b32m8J87j2J49p9J53J00m14O1J31p0L7j93R4p1J13J95L7k05J53r9J27j6n8
6957D0q2j06L77m27K27j92K10K0n3J41l59P4J94j43M8q1l3O4K30k27j41K05O4
6980E0k42j48O3K53Q7j4lk24K67l27N31k63q0j07J22L9o5o2J86o9J46m40M16k86
7004a70L77m79M73k85m6K99J04m26J66j92J22J46j32J17j80j21R7N8K52N0n51
7025c21L23P9P2j1j54o7J34J1j30J49m07K51QK04j62l6l8K01l48Q3K91j16p9L06
7049B43k65O4j74o4L43k34J30k57K38R4m1M4O8m36L8M46k80J31j85q1K31q8J58
7072A23m8j78K36o1k58K13P5j45J54Q4l5l9j13JO9j16L51l48o1k9J78Q9n2o9j07
$$ plain form
6908 -40 19 -72 -123 247 -54 -53 336 -319 10 -67 -17 118 22 -57 64 -221 126 47 -34 47 64 -46 -139 17 -232
6933 -232 -280 -93 -105 44 -35 118 218 -196 -135 -4 -74 -37 -230 -136 -207 -94 101 138 -67 86 -13 114 98 40
6957 40 -42 -148 229 -198 29 -163 47 67 14 155 -204 -130 64 -79 -31 -112 -145 -81 149 -78 -219 -14 50
6980 50 -192 -340 -277 -24 63 49 46 -178 89 -238 293 30 -50 -157 -35 4 -61 -123 63 -6 140 -300 116 -170
7004 -170 207 -272 201 -84 -130 169 273 -153 13 -179 -57 89 -43 74 -106 -227 -130 -72 180 230 -321
7025 -321 2 81 153 142 -12 -79 55 66 -64 85 -322 -71 -63 141 -21 -57 -95 106 -242 -159 132 16 -63 243
7049 243 -22 42 -132 -196 147 -87 43 -214 24 118 77 121 189 -247 -209 237 -43 88 -97 -178 53 -35 123
7072 123 75 -103 133 72 -186 27 102 -43 111 195 160 121 8 9 78 -38 313 -35 -96 -125 53 142 90 21 -86
7097h6K80k69P1Oq9O4jK2K52j22N6m47K50k2l30L69P8p7j1j15R4J17N9j21K37
7122B65k15r5N7k3J3n3K30k56J63l3k17k1L49j31j41J15J4NL0K3j55R2K77r9k15
7147b1J19n1j30j00J61O2j11L95l71L32l89j32J52L30j28k44K42P5l95K23J50
7168A69n06K61j03J52j33J81K14M4j53j19j31J09K20j79n0R0k09P0P8o5L8M5P0
7191I3lN9m09K26j20M6L0R6j00o6J36K5j08M00n85J42K45j74L0l1K64l45p6K83
7215E8J02k7j2N7k14r0Q4p0L1k9J67j34J55n9p5J12J9n7l4j10J37N4M2K50n90
7240b33L30P0j69j32J26O3j83K78k19q4J85J48l3o0j1n7o0K05j29K7j77K6J36
7263D7L9N9j94L02m25K33K28k66k20L75j39k15J63J37J63k39k08J97j8n3oJ7K03
$$ plain form
7097 -86 194 -75 -4 2 -87 -23 -24 -2 250 128 184 -263 -13 -35 -365 4 82 5 -6 -121 -27 90 149 28 265
7122 265 50 -45 12 -11 2 -51 179 -77 86 53 -164 -185 164 33 -108 7 21 26 56 79 -76 16 293 194 -21
7147 -21 98 47 -83 -183 -22 40 -71 324 -47 285 -104 -236 -84 246 118 -126 116 191 -204 19 169
7168 169 -337 -76 -179 -27 -160 21 235 279 126 7 -124 -15 205 26 -24 66 -143 -73 5 -60 -22 23 93
7191 93 90 149 -260 -34 -154 -108 -78 18 -82 -148 -12 13 -95 305 -280 -138 107 -67 -37 -68 196 -149 -225 58
7215 58 160 133 121 178 -36 -126 -42 -112 -81 -110 57 -77 78 19 -56 56 75 18 -16 -126 11 65 107 357 -233
7240 -233 97 167 -2 -134 -8 55 -128 150 -69 -153 32 180 147 87 76 19 -41 164 35 62 -115 -89 47
7263 47 86 145 -49 253 -172 61 289 23 -197 178 39 -176 -13 124 287 48 -160 37 19 -34 -40 -23 180
7286A80l55K02Q8k38K10j02k17K99kj40M8j49K00m0n2j5L03m64J17J19j16L1J3
7309h0Q4l4J10j65L63l76J78J10l22K64j50N3j33M1R6n4P7l2j8K21l56L20k19
7332b2J4P8k02K25j08RL1m2J27l4j07J5K32m64J69J17J43l5Q7p6r9N3J20k32J73
7357A72k38K65k75j0N8k14K74J1K4J26k29K92l74K86r1J05j96J61n1m6L23m21
7379d8J93k66J27q0L95l74j81J79J56j26LJ73j33l1K0j91K24j05l0J84o0J2k68
7402b27L94j27K07j68J33l64K55k58M1J30J86j07k19J59l9J79K8k35J26r6j89
7423a91JJ32l0j47K62j43K29k54J46j4K80n7k86l5L00j99M2Nk5po3K0J58k77L57
7448B04k41J57m5k59J43P0J76k62K08k56J65j93K93k93J40Q1k15K67j17k34M3
$$ plain form
7286 180 -175 27 115 -123 87 -15 -232 67 65 -75 -27 -176 24 -16 -68 -83 220 -244 -127 -8 -124 -93 -80
7309 -80 4 -30 80 -85 278 -98 80 190 -132 132 -18 35 -98 -57 39 -15 62 30 12 233 -123 197 -22
7332 -22 -8 70 -132 93 -15 -6 25 -17 110 76 -31 -16 216 -248 -79 38 181 146 233 157 58 111 231 -1 172
7357 172 -66 199 -76 -86 -28 -242 32 43 67 193 -36 256 -118 168 77 182 -14 147 96 50 373 -48
7379 -48 145 -121 6 -74 321 -53 -234 -55 101 -25 -22 151 18 -13 7 -184 40 -65 -95 89 29 41 -227
7402 -227 167 40 247 79 212 -152 103 -155 -114 16 202 95 -124 35 -4 175 203 -32 94 -2 -191
7423 -191 -190 -58 -88 -235 27 -116 113 -141 5 -9 271 214 -72 -107 193 -6 36 41 16 9 -54 -34 124 -153 204
7448 204 -37 120 75 -184 -41 29 205 -57 151 -105 60 -133 160 -133 7 88 -127 140 23 -211 -168
7469a68p6J81m7J52j86K39J13j35L23n51r1K88j70K31l55J93K6K7R7l1m2Qp3J09
7493F2M8j07l7j53K30Mr1j15q3L47l7J3k71L17j46J8k54L36P2NL4k14K9L5m8o2
7519f8J50J37j87n3M5j76N3J71P7j82j42J24J89l61J96J34l07L59J43m48J53j1
7541dp2R9J13l0j05K00p7o2j03J14k15j05K66j07K02k79j3K65j2j55K00M0l7j37
7565a4O5k8J5J1j39n3K44o9J02l84J38K89j02k69K86pj62K86m57J24M4Q7O1M2
7589A10j96q9L7M6R2p0J47j00k3p5P2K97k85P2J96n26O10m73q7J58PN6j94L09
7613I1J48k48N8q9R0m8K0J71j29j13p6K05J21m09K89j95L52k40q7j87K06J16m1
7636EJ55p1m55N38J6p7j10J30j51K40k60J24M4l9k34O2N8j45L6K98j64j2q6rl5
$$ plain form
7469 -168 -244 -63 -110 42 -144 95 208 73 396 -155 -246 42 -128 103 -252 -59 -33 -6 91 60 18 26 -47 62
7493 62 110 3 -34 -187 43 47 -44 -159 -242 105 68 81 -190 127 -19 -1 -255 81 153 158 192 -22 7 42 -6 -68
7519 -68 82 219 32 -21 24 -152 -99 72 149 -33 -175 -51 138 -223 -27 107 -200 159 302 -146 7 -4
7541 -4 -76 23 136 106 1 201 124 62 -41 73 -142 -247 19 -88 114 -165 -178 87 75 -80 120 160 123 -14
7565 -14 51 23 38 49 -90 -143 101 32 134 -250 -112 177 75 -194 92 85 -77 209 -248 -124 -80 7 68 110
7589 110 -86 -175 -138 -92 0 -70 77 -23 -46 -121 -49 248 -37 35 231 -295 315 -158 -245 -87 -80 -24 -218 91
7613 91 239 -9 49 -40 50 2 22 193 64 -49 -125 80 201 -208 81 -114 238 -2 -89 -276 -70 46 5
7636 5 160 89 -366 172 188 111 1 131 -20 220 -40 84 128 89 -145 -83 -25 -170 -134 164 0 -12 -98 -107 -142
7661a42J22J14k7k37o5M00k11J12n9N4J69o1n0m0r7K24r0k23j18K42J78n3j78
7684c6J71k03N5n2j15J1J58J4j6l6K68k46K69j81J71k47j62J26j50K00j33L09
7706A75m43K05m4K36k24Q4Q6K84k88j91J49j89K48k97J45N9q9L61k47q2J14j72
7728a20k81L80j34J36j5J48q8O6j73J24L4L0l43J99O5k33K89m56N84j13L1Q2n17
7751c05K82O0JL0j42L8L14k62%l9JJ15j74J8Q0j5j00J63qR0q1P8n9j30K25o0k15
7778i5J55J87m78J08L3J78L2K3q7j13R6k6j7O7jO1k40K8J51K30k75k1J10K1l97
7803b70J97j1J5j8q9J94N1K8l8o9j16QM5P5k49J81J92j77q5Q0K03m53J98N6Q4
7828C2k47Q9J52j70J86j03j90K92o5J4n4J75m40L60l4j03P8K29j82L01m75o7K27
$$ plain form
7661 -142 -20 94 67 -170 -235 165 -46 66 7 61 230 169 119 79 -18 206 116 -107 -225 17 195 142 -36
7684 -36 135 -68 -13 -65 -180 -169 -11 3 -13 -49 219 -27 242 61 232 -15 -177 -51 -201 -1 -134 175
7706 175 -268 -63 -107 129 -95 -11 75 359 71 -120 29 -160 88 -209 -64 -5 -94 267 20 -62 52 -120
7728 -120 -401 -21 -155 -19 -34 114 26 92 -81 43 77 107 -236 -37 28 -205 84 -372 212 99 130 212 -305
7751 -305 -23 37 38 68 -74 -36 278 16 16 -23 -22 93 -81 -63 17 2 -98 65 57 147 66 144 85 -45 180 120 -95
7778 -95 60 247 -231 -123 -90 88 120 143 56 -57 39 13 -4 63 62 123 -117 -89 62 292 17 -4 106 127 -270
7803 -270 -73 -84 -69 -87 -176 18 69 97 59 -10 -126 -118 -73 2 -247 -66 126 -51 -136 -56 147 -306 -108 -52 32
7828 32 -215 -126 26 -144 42 -61 -251 41 -24 -10 -64 111 -329 31 -3 -106 -28 201 19 320 -155 -222 5
7851ELPo1J01K1k15K93N0l91K09j72J75l15MK59J26J82k09M3j26R8j82p6L6J83
7876D8j41Q8J33j41K15l94K95j37J53k29Ro9r7K23J54n4l31J51J78J52o5l50J80
7899b9N7J54k33j0P0K8k18K32q6p5K90m18K68l31J58K12q4L0N3j98J80Q0l98J07
7923a61K53n2k0L3k56L33r8j37R6l6L04k38j11L41k55K7j2j52K5L02J6Q5j05j81
7947AJ57l17J57j3n5j27K51J24p1l6N9j73%K0K58l25Q3M0j48J44j49J73q8K43
7971B08j54kJ20k91J28j89K72j71K38M2p3j13l64N43k75q0K60j57m7J96k84J27
7993f6P5j02J87q6M2j68J85j42j25K63J07q4m3k01J54j16K38L6j60l5J51p9K42
8016B73k83q9o3J05J14j21Q5l1O2nj3O4j00k05N6k9K93k20L12j87L9n1J81j64
$$ plain form
7851 5 8 15 -46 55 76 -139 154 204 -187 22 -150 25 -290 -286 -27 99 281 72 115 -11 87 -95 -171 -135 48
7876 48 -93 -5 128 -13 202 -192 103 -34 119 -110 -101 -170 -267 -44 110 56 -275 -124 54 206 141 -209 -29
7899 -29 28 182 -51 -61 9 37 -181 51 -35 -110 180 -238 30 -301 -143 69 -15 15 68 -130 50 130 -268 -161
7923 -161 92 40 20 53 -203 130 32 -105 -9 -45 259 21 -90 251 -4 23 11 -141 -116 186 202 287 182 1
7947 1 158 -159 -2 -15 -70 -197 54 178 107 71 130 -43 -43 -23 235 -90 -7 33 -115 29 -120 53 -35 208
7971 208 54 52 172 -119 9 -180 92 -79 159 201 128 15 -349 194 -81 -161 99 -58 -105 91 -193 -66
7993 -66 9 -93 94 8 50 -118 67 -75 -200 63 170 86 43 -158 -4 -120 118 154 -6 -41 110 31 273
8016 273 -10 -99 -162 -57 57 -64 21 -10 52 47 34 98 -2 -207 -151 -180 113 -107 205 18 57 6 187 23
8040B3R4O3l47K1R9p5J7j8o6N4J76ro5M5o7n0K8m6M8J90k52Q9j9J48nj33J72k69
8068a54J36N9J69k49K31j94k1J09Lj84J29J61j69j62K1J70j59J08J96o5k35J32
8090C2K15J65o21J37j29L45k44L63l71K28n5r0R3J36l8m08J35R7j49j8J35j74
8112b16L50l78K67k20J34j83Q5J21q3Q3J50k22K27n3j63K3nK03j65K34j94j40
8134a45L31j90p8j56L22m0r6L86m26R1k02L05J94j47j39K15j06K5l06NK01l77
8156c33O26O2m17J5Q5K33k3l30m4K57k06J16J64k40K20k41K75j48Jr7OQ6n3j25
8180a11J71o6K38l1j55K5J53n0j80j19K03
$$ plain form
8040 23 117 180 -167 -146 -47 -122 -105 -123 -189 -135 41 32 -33 12 -55 -105 -77 -123 -75 115 -137 -48 -67 81 76 -57 115 -154
8068 -154 -18 41 210 -39 192 -2 -23 86 89 -95 34 195 26 -136 -115 55 -104 4 200 135 -100 32
8090 32 247 412 -209 -72 -201 144 -100 263 -108 120 65 -25 68 204 166 -242 -107 -10 -159 -177 -42 -216
8112 -216 134 -244 23 -197 -63 -246 -161 -40 -123 -40 110 -112 115 62 -101 -78 -83 120 -45 189 -5 -145
8134 -145 186 -4 -82 -238 84 44 -52 334 -92 -1 -203 102 296 149 10 225 119 144 -162 -157 44 -333
8156 -333 293 355 -62 -47 38 271 248 -82 -126 131 -75 41 205 -35 185 -56 219 71 72 -25 -19 67 14 -111
8180 -111 60 -6 232 201 46 71 224 174 -6 -125 78
8191G8
$$ Imaginary data points
##PAGE= N=2
##DATA TABLE= (X++(I..I)), XYDATA
0@%%%%%%%%%%%%%%%%%%Oj4J6j6J6j6J9k7L2l3M1m8N4o2P0p9Q9j02J14j27J42j59
40h4J79k00K21k45K72k99L28l65M03m43M90n39N92o52P21p98Q82r81J097j229
60f50J386j574J808k108K504l061L903n349Q521k8396J2427J5175l5404q494k8222
75f7534j7739J1641P095j3236K3925M1449K4757J9574J9194q756n337J8305J0310
88F3648p424K956k258j5371n940J163j6720j7322m308j1012j7645o480j2659k3746
102g3118o639J3324R632J6848K5159Q788k642P684O888o41J1020J5744M525P336
116D3908J5312K975o981l815j1675j9927j4024j2611j7006p141J104k680O4N141
130b7356l104p481K16K357n57O108J1503J0227J5075K0544J3532L477o06o233
$$ plain form
0 0 0 0 0 0 0 0 0 0 0 0 0 0 0 0 0 0 0 0 6 -8 8 -8 8 -8 11 -16 16 -17 24 -24 30 -32 38 -41 48 -54 60 -67 75 -84
40 -84 95 -105 116 -129 143 -156 172 -193 210 -233 257 -282 310 -342 379 -419 463 -518 579 -650
60 -650 736 -838 970 -1138 1366 -1695 2208 -3141 5380 -23016 -10589 4586 -30818 -39312 -67534
75 -67534 -85273 -73632 -66537 -79773 -55848 -14399 10358 29932 49126 40370 35033 53338 63648
88 63648 56224 59180 56922 41551 35611 36774 20054 2732 -1576 -12588 -30233 -36713 -49372 -73118
102 -73118 -79757 -66433 -56801 -39953 -14794 -6006 -8648 -964 5924 5283 16303 32047 36572 43908
116 43908 59220 62195 55214 51399 39724 19797 5773 -6838 -23844 -30985 -29881 -32561 -32497 -27356
130 -27356 -30460 -37941 -37725 -35368 -35925 -29817 -18314 -8087 6988 27532 41064 44541 43935 37702
144C7702j0022m693K49m034n409j339k909n771m359p885j1904q391l898n435k396
159d0494L707N483Q826J5349J1653K652J922K888N97L850M112j436o4O065M833
174B9943j04j971q675j5153j1177o117o615m717j30L36K271N366J464j362J632
189a5009L190J837K419M166M203O747J1015R977M125J88m641q274o533n566p088
204G56m758J77J74j196r14k473o332n793m522l892j33O581Q873R017Q284M749
220H598J588K968L723J410j259j198j827o36L05Kj603j231k554n024p840q524
236a3102q839m931J352M335L720L637M772M701K756J226j200k325J700O284P410
251A1496O990N466N37k437k358m546p047o648m120k983j530j080j353j032J043
$$ plain form
144 37702 27680 22987 23236 19202 13793 12454 9545 3774 -585 -8470 -20374 -28765 -32663 -38098 -40494
159 -40494 -36787 -31304 -22478 -7129 4524 7176 9098 11986 12583 16433 20545 19109 19045 25110 29943
174 29943 29839 27868 19193 4040 -7137 -13254 -19869 -24586 -24716 -24380 -22109 -16743 -15279 -16641 -15009
189 -15009 -11819 -9982 -7563 -3397 806 7553 18568 28545 32670 32858 28217 19943 13410 7844 756
204 756 -4002 -3825 -3651 -4847 -5761 -8234 -14566 -20359 -24881 -28773 -28906 -22325 -13452 -4435 3849 8598
220 8598 10186 13154 16877 18287 17028 15830 14003 13367 13672 13674 12071 10840 8286 3262 -4578 -13102
236 -13102 -21941 -26872 -25520 -21185 -17465 -13828 -9056 -4355 -1599 -373 -1573 -3898 -2198 4086 11496
251 11496 18486 23952 24489 22052 19694 15148 8101 1453 -2667 -5650 -7180 -8260 -9613 -10645 -9602
266i602M78j908l185k560j785K242P054O194N603N317M873L082J521r02m481k846
282I095j320j309j257J115P20j014j305l628o470o499l789j534l40J441K241L512
298a0341O191O354K596k26j242k058j513K017L546M147M705K747q29l214n225
313G655o039m497j466k186k582q38J332J263J206R83q75k28Q30O84n88J064J821
330b461L037N075N868K882J023p53l082n612o352n076j292L710N192K334j378
345C115m361n738m777j038K25M29K770M520M346L183J874l70M83K727R07q67j037
362F391p41j279l8J357n56j181j32r49k988m717o756n214n42M638N630N151M124
379B198K22k102k279j345m35K598M662M367L396K003o26k194j448k326m447l373
$$ plain form
266 -9602 -9124 -11032 -14217 -16777 -18562 -16320 -9266 -3072 2531 7848 12721 15803 17324 16422 11941 9095
282 9095 7775 6466 5209 6324 7044 6030 4725 1097 -5373 -11872 -15661 -17195 -17535 -16094 -13853 -10341
298 -10341 -4150 2204 4800 4574 3332 1274 -239 1778 5324 9471 14176 16923 16094 12880 7655
313 7655 1616 -2881 -4347 -6533 -9115 -9953 -8621 -7358 -6152 -5169 -6044 -6272 -5442 -4758 -5346 -4282 -2461
330 -2461 576 5651 11519 14401 15424 14671 11589 5977 -375 -5451 -6743 -3033 2159 4493 3115
345 3115 -1246 -6984 -11761 -12799 -12574 -12145 -9375 -4855 -509 2674 4548 4178 4661 7388 8295 7428 6391
362 6391 5650 4371 4333 5690 5134 3953 3821 2872 -116 -4833 -11589 -16803 -17345 -12707 -7077 -1926 2198
379 2198 2420 318 -1961 -3306 -3741 -1143 3519 7886 11282 13285 12659 10465 9017 6691 2244 -1129
395a129r80j155p44p12j297j092R29R52r00o62m62j726M11K350K417L550N534
412E284N534K828r92l862m770j864O05J095M82P24o46j395j77k263m907m916j808
429a1048q98R95K351J389J885L576J891N65j84M96J23J151K303P23J26J792K245
446I481J002j03k553m957l963j961k537j283R78R73M65P93K98j603o82k28l28
463f208M53J107K239L007N235L981K3j140j620k087j438o74j394j266P82J159
479B159K82o98j806l680k166j511j565r00J649K998L862L168J089p47j32O76M70
496C148n2J79l95j25J865K141l69m00j572k814k757k686k876j380J185J485J209
513d214J780J246Q03j33o94j658j260O03K694M062M113J716q74l48j627l170k583
$$ plain form
395 -1129 -2109 -3264 -4008 -4720 -6017 -7109 -6180 -5228 -6128 -6790 -7252 -8978 -8567 -6217 -3800 -250 5284
412 5284 10818 13646 12654 8792 4022 2158 2763 3858 4340 5064 4418 3023 2846 583 -4324 -9240 -11048
429 -11048 -11946 -10951 -8600 -7211 -5326 -1750 141 706 522 1018 1141 2292 4595 5318 5444 7236 9481
446 9481 10483 10380 7827 2870 -1093 -3054 -5591 -6874 -5896 -4923 -4458 -3665 -3367 -4970 -5652 -5880 -6208
463 -6208 -5755 -4648 -2409 598 5833 9814 9837 8697 7077 4990 3552 2878 1484 218 1000 2159
479 2159 2441 1743 -63 -3743 -5909 -7420 -8985 -9885 -8236 -5238 -1376 1792 2881 2134 2002 2678 3148
496 3148 3096 3275 2880 2755 4620 6761 6392 5992 4420 1606 -1151 -3837 -6713 -8093 -6908 -5423 -4214
513 -4214 -2434 -1188 -385 -518 -1212 -2870 -4130 -3527 -833 3229 7342 9058 8184 7836 6209 3039 456
530D56j052q94N54j95j9j070q18L76l22n58j688j996k4J840L046J985J896J903
548C420K122J786L67j475k425j624j149P91R06R79N28j04q85l101m267l440j879
565i450P66J495J197J252J619K187J346O72m56r17m50J102K138K119J543J148
581G311R13M47k130k501k375j881j419j306j510q19K34J297J075L07j520k239
597f116m22P67R62J276J509K701L438L265J132n28j177j800j987j121p70j19J278
614B288K341J80j795l705l979k614m91O71j3N56J842J412J489J635M41q0P40P43
632A661Q73O40L08M83P20J547M6p16n1j257l037l093k524k621J74K412K249J499
650f87M80j647k017j265m55J72J958L973K868J469J288l55q87o5j073j808r06
$$ plain form
530 456 -596 -1490 -936 -1131 -1150 -2220 -3038 -2662 -2984 -3542 -5230 -7226 -7250 -5410 -2364 -379 1517 3420
548 3420 5542 7328 7695 6220 3795 2171 1022 1813 2719 3698 4226 4122 3237 136 -4131 -7571 -9450
565 -9450 -8684 -7189 -5992 -4740 -3121 -934 412 1084 628 -289 -739 363 2501 4620 6163 7311
581 7311 8224 8671 6541 4040 1665 -216 -1635 -2941 -4451 -5270 -5036 -3739 -2664 -2357 -3877 -6116
597 -6116 -6538 -5771 -4809 -3533 -2024 677 4115 7380 8512 7984 6807 5007 3020 1899 1129 1010 2288
614 2288 4629 4809 3014 -691 -4670 -7284 -7775 -7104 -7117 -6561 -4719 -3307 -1818 -183 258 178 918 1661
632 1661 2534 3174 3482 3965 4685 6232 6278 5562 5511 4254 1217 -1876 -4400 -7021 -6847 -4435 -2186 -687
650 -687 -207 -1854 -3871 -5136 -5591 -5419 -3461 512 3380 4849 6137 5782 4895 4830 3757 1949 1043
667A043qj53N70q6j151k130k45N3m28q79j088j699N1K073R64J810L451K410J89
686D747m56j811k313q23J520J702J568P58m18j031q17j547l752k254n81J23O62
703d723K005J000J74Q74K25r19k85M69K55J800J650R5l39J426J749O50m34j690
721C982l246k378l32m92m89M46L81J94J041l11j597j896o09N57J088J700J587
738c74K172K806J780o51j237j629j594R5R12L93n78m09J30j87r60j321k399j484
756d535j311o27KJ524J845J423J643J326m12j57J69N50K87j24M64J254K091J102
774F514n44j220j438k519j930j553j469m27R14J114L05O5l23p99k0L69r72m52
792d385R42K631L037K946R64n93p34j140p81o91p43o28k61Q55L75p52j056j108
$$ plain form
667 1043 1035 882 1452 1366 215 -1915 -2160 -2107 -2535 -3414 -4502 -6201 -6150 -4077 -3113 -1303 2148 4558 4747
686 4747 4291 2480 167 -656 864 2566 4134 4892 4474 3443 2626 1079 -2673 -4927 -5508 -5385 -4723
703 -4723 -2718 -1718 -1544 -670 -445 -1364 -1649 -1180 -925 875 2525 2620 2281 3707 5456 6106 5672 3982
721 3982 736 -1642 -1974 -2466 -2955 -2509 -2128 -1934 -893 -1204 -2801 -4697 -5306 -4749 -3661 -1961 -374
738 -374 1798 4604 6384 5733 4496 2867 1273 1368 2280 2673 2095 1686 1816 1629 669 -652 -3051 -4535
756 -4535 -5846 -6473 -6471 -4947 -3102 -1679 -36 1290 878 721 890 1440 1727 1603 2067 3321 5412 6514
774 6514 5970 4750 3312 793 -1137 -2690 -4159 -4586 -3672 -2558 -2253 -2188 -2511 -3310 -3330 -2961 -3933 -4385
792 -4385 -3443 -812 2225 5171 6135 5542 4808 3668 2887 2196 1453 825 564 1419 1794 1042 -14 -1122
810a122j206q64j470j088j70R72J755J526J323J395M61M00M72k92p60n51J45P76
828A702J598J336N65j40j231l020k991j632l45K67R50P65K33P83N04j29r75r34
846b694o27O80J492K034R38Q79J302L54r6o26j394j375m63m87n07r83r9P3J653
865E4J224o80k379k277o59K32R10J489J235J315K094J559L2r19j865j150q0N50
883F85N17L78Q93O50m84j390k168k070q32L09K85L68P1J16R70J353J204P8p96
902A37O0J33L4R1L29J305J419J225o4r49j460j462j569j495j258l53Q83J709J472
921A87J79j024j782j236k07L89Q59J543J912J655P92L14j0l12k97o00n69j151
939F42n23M28L38M96m50j009o27o32r98q82j245l48L24J345K098J446J175M63
$$ plain form
810 -1122 -2328 -3192 -4662 -5750 -5920 -4948 -3193 -1667 -344 1051 1512 1912 2384 2092 1332 781 926 1702
828 1702 3300 4636 5201 5061 3830 810 -2181 -3813 -4158 -3891 -2941 -2176 -1943 -1160 -656 -785 -1760 -2694
846 -2694 -3321 -2641 -1149 885 1823 2702 4004 4358 4262 3636 2242 867 404 -83 -590 -1573 -1672 -1599 54
865 54 1278 598 -1781 -4058 -4717 -4485 -3575 -2086 -851 464 2558 4117 4149 3230 1365 215 135 685
883 685 1202 1580 2473 3123 2639 1249 -919 -2989 -3821 -3512 -3227 -2859 -2788 -2672 -1702 -349 855 933 137
902 137 197 330 364 455 784 2089 3508 4733 4669 3720 2260 798 -771 -2266 -3524 -3877 -2994 -1285 187
921 187 366 -658 -2440 -3676 -3883 -3494 -2635 -1092 820 2475 3267 3581 3571 3259 2962 2362 1793 642
939 642 119 547 885 1381 931 -78 -705 -1337 -2335 -3217 -4462 -4810 -4486 -3141 -1043 403 1578 2041
957B041K05j033j104o05MJ489K147R71L4o30o83p79j116j902j513r25J67Q75J189
976a168N62n01j99Ol85n82o10R02R31J239R51N78N88J033L37q6j189j665j653
995i11j01N42P22M22K66l68J53q57j407j465r10J03K2J208J894J764J041P14o86
1014B146j818n75o15N46J169N57K25K41P84j89j084j235r28j021rq11q8O59J128
1033i18J123R91J28j315o50J65Q4l37QR8R74J832J977l83j450j827j538j010K36
1052a812j64M6R00J497K64m6p85j182m41P9J9k83P71J311J471J350R95p98j413
1071A779q74l46n23k24n17k00O79J014q8n66k22j065j275m62n64J08Q89J827J313
1090F83Q90M50k03j32M2o00r64q0N15P35P71R26J7m74j208j816k163n66m65O31
$$ plain form
957 2041 2246 1213 109 -496 -492 997 3144 4115 4149 3519 2836 2057 941 -961 -2474 -3399 -3232 -2357 -1168
976 -1168 -606 -1107 -1306 -1300 -1685 -2267 -2877 -1975 -1044 195 1146 1724 2312 3345 3682 3596 2407 742 -911
995 -911 -1012 -470 252 674 940 572 725 -132 -1539 -3004 -3914 -3811 -3789 -2581 -687 1077 2118 2832 2146
1014 2146 328 -247 -862 -316 853 1410 1635 1876 2660 2471 1387 152 -776 -1797 -1806 -2617 -2705 -2046 -918
1033 -918 205 1196 1324 9 -641 -476 -392 -729 -721 -623 351 2183 4160 3777 2327 500 -1038 -2048 -1812
1052 -1812 -1976 -1930 -1030 467 731 685 -100 -1282 -1723 -1644 -1625 -1908 -1137 174 1645 2995 3990 3192 1779
1071 1779 905 559 36 -188 -705 -905 -226 788 700 134 -88 -1153 -2428 -2890 -3454 -3346 -2457 -630 683
1090 683 1573 2023 1820 1688 1730 1130 166 86 601 1336 2107 3033 3050 2576 1368 -448 -2611 -3177 -3642 -3011
1110c011J253R03l73L51O54Nm86n92l80J20J251J388R43N88P99k6l59R2j400j265
1130D55q18r0k20l30L2L48R20L55q00j868j672q18M07J574J711P56R27J210M60
1149B539Q4r47j201q81M95J207L42M87L61q0m30o74j554j794n02J52M13K5J10
1168a848l15Q03J310J022j077J52p45m50L18N42O03J017J239R93j21n32j326j691
1186a06j072n58k12R9J690P52L85k11j158j508p16l1J83J043J134P81R87L57k20
1205A619k90O9q1r8o12j132k64M02J078R1M0m46l18r17m86q00j087j73J014J722
1225f69J782N18J97n21j71k86j225n16N62J242J113O52j06j154p06n88m69r26
1243a271j098n87M19J155Q70n4N8K93k07j92K95j093O66P29P64J282P04L63L68
$$ plain form
1110 -3011 -1758 -855 -1228 -877 -223 -218 -704 -1296 -1676 -1556 -305 1083 2026 2614 3413 3387 3028 3120 1720 455
1130 455 -363 -453 -673 -1003 -971 -623 297 652 -148 -2016 -3688 -4506 -4099 -2525 -814 -58 869 2079 2539
1149 2539 2623 1676 475 -406 89 1296 1638 2125 2486 2406 1976 1302 -252 -2046 -2548 -2396 -1983 -1958 -1848
1168 -1848 -2163 -1360 -50 972 -105 47 -698 -1148 -830 -288 315 1332 2571 3564 3443 2911 1585 -106
1186 -106 -1178 -1736 -1948 -1849 -159 593 978 767 -391 -1899 -2615 -2646 -2463 -1420 -286 495 1482 1839 1619
1205 1619 1329 1398 1317 1219 607 -525 -789 -387 691 782 822 376 58 -859 -1345 -2145 -3232 -3405 -2391 -669
1225 -669 1113 1631 1828 1307 1136 850 -375 -891 -329 913 2026 2678 2572 1418 712 124 -345 -1271
1243 -1271 -2369 -2956 -2537 -1382 -512 -566 -508 -215 -422 -614 -319 -1412 -746 -17 747 2029 2733 3096 3464
1262C464l77m84j376j686j165R9P83O6M46j76N2m12n63r54o75j34j06J062J588
1281e48R04R74J113N21m52j215q95o0N83O27K79R6J4l20l85l25j357j337j067
1300b850j57q9L04O01L99J161M59L97j68o86L8J15J57P76N43R31J174J181l16
1319C970j102j475j642p21j51j12L61M22P72l86o13o38p98m60j53K97N95L19J391
1338a24J215Q90P0j5n24n10Q7k74j81k43Q3N96M03O6m33j099o29q41r74m01m76
1359c314J277J463J028J34J05m44k4l19k53J54o7P03Q30J413Rn69o77p74n45r92
1379h62n93m11K11Q97K02kj29J70J0Rn19m03k82Q35J318Q56N19J61N1L4k03j110
1401G59j069n54N4K30J87M17L42K63m76p80p65j141o08P99J349J368K26N80K90
$$ plain form
1262 3464 3087 2603 1227 -459 -1624 -1525 -742 -676 -230 -406 -354 -766 -1329 -2283 -2958 -3092 -3198 -2136 -548
1281 -548 356 1330 2443 2964 2512 1297 402 342 925 1552 1831 1927 1941 1621 1236 911 -446 -1783 -2850
1300 -2850 -3007 -3096 -2792 -2191 -1792 -631 -172 225 57 -629 -591 -476 -319 457 1000 1931 3105 4286 3970
1319 3970 2868 1393 -249 -970 -1121 -1233 -872 -450 322 -64 -677 -1315 -2113 -2573 -2726 -2429 -1834 -1515 -124
1338 -124 1091 1981 2051 2036 1512 1002 1089 815 634 391 474 1070 1473 1539 1106 7 -622 -1463 -2437 -2838 -3314
1359 -3314 -2037 -574 454 588 693 249 225 -94 -347 -193 -260 443 1273 2686 2695 2126 1449 675 130 -862
1379 -862 -1455 -1866 -1655 -758 -556 -558 -687 -517 -507 -498 -1017 -1420 -1702 -867 451 1307 1826 1987 2038 2072 1869 759
1401 759 -310 -864 -810 -580 -393 24 366 629 153 -627 -1392 -2533 -3141 -2342 -993 375 601 1181 1471
1420A471L16q0l87o93o90Q6Q52L86J03K87m58k78n41j065p66m47l16K26N18k35
1440a711M62M88Q56L43K12p96o18n8M69J025O22N89Q91J92k01o57j547q82p05
1459a026k56k24L47Q16Q7K74l25r53r53j55P3P73N22M46R95M00Q41R5m25M81R0
1480A923p45k58k57k85K2Q45J86J81r98p55p69o62n53q90Q1Q24J294R30L97J16
1500F27p28k58k92j02L04O17R65Q37O40k29o94o62k36m06l45j092r1J75M08J15
1520d47J01R3m22P1m4k95n94R7N93P44P88Q28m3N25j02p21q83r17k25MJ096N13
1542G60K15m87l34m08l13o39o22k73N53O80K79Q30P65l1Q0kp03m55m19L97M45
1563C18N43m1J08k03K69m20q33j112k35n32O48M78K22P82K65P0J49N9n15k95j29
$$ plain form
1420 1471 1787 1707 1320 627 -63 23 875 1261 1364 1651 1193 915 374 -691 -1457 -1904 -2220 -1994 -1476 -1711
1440 -1711 -1249 -761 95 438 650 -146 -764 -822 -353 672 1294 1883 2774 2966 2765 2108 561 -321 -1026
1459 -1026 -1282 -1506 -1159 -343 -256 18 -307 -1260 -2213 -2368 -2295 -1522 -1000 -554 441 841 1682 1777 1352 1833 1923
1480 1923 1178 920 663 378 400 1245 1431 1612 614 -141 -910 -1572 -2125 -3015 -2934 -2110 -816 114 511 627
1500 627 -101 -359 -651 -753 -449 168 1133 1970 2610 2381 1687 1025 789 383 38 -1054 -1145 -970 -562 -447
1520 -447 -346 -253 -675 -604 -648 -943 -1537 -1440 -847 -103 685 1513 1470 1995 1893 1172 289 -628 -853 -849 247 760
1542 760 975 488 154 -254 -567 -1206 -1828 -2101 -1548 -868 -589 241 1006 975 1055 1053 350 -105 -524 -127 318
1563 318 861 820 928 725 994 574 -259 -1371 -1606 -2138 -1490 -1012 -790 -8 257 327 476 535 20 -275 -404
1584d04O97P5N01K28P96L46m00q42j168q64j76l29L33M32K21L52K06l14m78m70
1604a258m19L71N11K14M68R77O53N09j33j04n15m34M3k58O1o22j82K97K70j9k62
1625A68r88q31n13l07j8K42J099J026N26K61K18k54m21O3k48J30M72N50N40M26
1645B141N1o59m32r00o89o08l62M1nN16L18l55J70q8J12O1l56j23m8N43J353M82
1667A163M34J61j5l4k48m10r87l98n7M45M49P8K0n22j20q53m65n07k24N52Q85
1688f53P03K01N0L61k40K37k10l83k36R8J071n5L95k95q0j98j77p10o98n79P8
1709a320K26J22J90K49M82N62O3p29n60k85p1P38Q18L43K17P62L8m93o92j015
1729c55m33J66j8K88K17J32j17L00j17q10o16l6L90M62K83J65N56J53O36k9%m23
$$ plain form
1584 -404 293 368 869 1097 1893 2239 1839 997 -171 -1035 -1211 -1540 -1207 -775 -554 -202 4 -310 -788 -1258
1604 -1258 -1677 -1306 -795 -581 -113 864 1517 2026 1893 1789 1274 840 883 625 686 64 -118 179 449 430 168
1625 168 -820 -1651 -2164 -2471 -2489 -2247 -1148 -122 404 665 883 629 208 271 23 153 625 1175 1715 2141
1645 2141 2192 1533 1101 201 -488 -1096 -1458 -1417 -1422 -906 -588 -943 -773 -861 -749 -688 -1044 -1167 -1215 -672 681 1163
1667 1163 1597 1758 1743 1709 1461 1051 64 -334 -391 54 503 581 601 79 -41 -894 -1359 -1866 -2090 -1538 -653
1688 -653 50 251 301 662 422 659 449 66 -170 -72 999 944 1339 1044 964 766 589 -121 -819 -1398 -1320
1709 -1320 -1094 -972 -782 -533 -51 511 574 -155 -715 -1000 -1071 -333 485 828 1045 1807 1845 1352 660 -355
1729 -355 -788 -622 -640 -352 -135 -3 -120 180 63 -747 -1363 -1399 -1009 -547 -264 -99 457 610 1246 1217 1217 794
1751G94m13l06k7j1m14M95L98K07jo53p70n47j37j60PJ88P55L55R05M77p05k62
1773A75m39K39l6J77O42M09L80J62j90q67l1p65l66K3n98j89j37M67N67J24k19
1794d72k42k9j26o5k8K41M26P62Q55N83%j83l43l04r44l56J06l7N62J75k01m29
1816d9j58k22p31k33k59O8N8O50O09N59J51K31j90J89n34j04K1M01L49M70J05
1837A381n2J6k85o0j025m62q09K4m6M90L37K37P3K30m01j64n57j10K79N58M16
1858G0L72L93L11M48r5m46j185j77Q4L82O8M5j70O9J23q1p78m25m09J70J01L51
1880g79K38M89M24L42qk89k38k80O7J37K14k47L12M31J97J14m76n70l64n86o7
1901i39m7K92K23O37L17j03r7o66R4m9K26j41J42M83L66O97k93n88k93k87k33
$$ plain form
1751 794 381 75 48 37 -377 118 516 723 722 69 -701 -1248 -1385 -1545 -1538 -1350 -595 -240 665 1142 437 175
1773 175 -264 -25 -61 116 758 1167 1547 1709 1519 652 621 -144 -510 -487 -1085 -1274 -1411 -944 -377 -253 -472
1794 -472 -714 -743 -869 -934 -962 -721 -295 467 1322 1905 1905 1722 1379 1075 131 -225 -119 -156 406 581 380 -49
1816 -49 -207 -429 -1160 -1393 -1652 -1584 -1526 -876 -267 292 443 674 484 673 139 35 56 457 806 1276 1381
1837 1381 1329 1345 1060 1000 -25 -487 -1296 -1272 -1318 -828 -491 -254 -181 49 -352 -516 -1073 -1183 -904 -346 70
1858 70 442 835 1146 1594 1499 1053 -132 -309 -225 157 225 270 100 169 292 211 -567 -992 -1401 -1231 -1130 -779
1880 -779 -541 -52 372 714 706 417 179 -101 -34 103 317 70 382 813 1010 1124 648 78 -286 -872 -939
1901 -939 -986 -694 -471 166 483 380 283 -383 -289 -338 -112 -253 -111 372 738 1435 1142 554 261 -26 -259
1922b59k41r4rJ54L57J78P8k97p4r6p7k33l60N3O13P75K73K58L09n00l40N5j80
1945C43n50l52L14K12P26J31l94m58m53k00k91l89k57O25N13O72J28J24l75K23
1965B92k4O8k44J33k3K31N53K08j72q0m79n0l98l85n35l78L27M37L52j6M9K4k63
1988c73p1m77l82M81J73R11N28O95k10k61P5m62n91k1L19L0j28K33m3J98k78l89
2010d3p34k82J03j83K89K02j51K01N79M26J23k0k35o11L10J17L44R0K88N69J52
2031A534l13o34o26m42j11r7J17K11j14K14M52j80m34l94k61K00L08J83J47M61
2051B21M43R0M66l42l95k80P7k44j56L5N9K64L45J36o19j0l39m75j52k02o9L81
2073g66N05P41O6J56o38Lj6j93l84K01K59Q63M9J00l21l30k54n03L82l97k36j55
$$ plain form
1922 -259 -500 -594 -603 -449 -92 86 164 -133 -207 -303 -380 -613 -973 -920 -307 468 741 999 1308 808 468 523 343
1945 343 -207 -559 -245 -33 693 824 430 -28 -481 -681 -972 -1361 -1618 -993 -480 192 320 444 69 292
1965 292 268 336 92 225 202 433 986 1194 1022 942 463 413 15 -370 -905 -1283 -956 -519 -167 -183 -134 -110 -373
1988 -373 -444 -921 -1303 -822 -649 262 790 1485 1275 1014 1089 627 36 15 334 364 236 469 426 624 346 -43
2010 -43 -777 -1059 -956 -1139 -850 -648 -799 -598 -19 407 530 510 275 -336 -26 91 435 525 813 1382 1534
2031 1534 1221 587 -39 -481 -592 -689 -572 -361 -475 -261 191 11 -423 -817 -1078 -878 -570 -387 -240 221
2051 221 664 754 1220 878 483 203 280 36 -120 -85 -26 238 583 719 100 90 -249 -724 -876 -1078 -1147 -766
2073 -766 -261 480 546 702 64 67 51 -142 -526 -325 -66 797 846 946 625 295 41 -462 -80 -477 -713 -868
2095h68P60J92J71j75Q7k74J32j08k30r1O28M3P4N29j89j04j42k30J7p16k09P3
2117f30J52M65K6J02j00r8r6l95j05m8R1L75N74L12J96j8j72K67m41n24k60K80
2139d7K47J89j08L5j82m4l62l08k26k34j01K48L26k8L11K73K02K76k79L9p7k31
2161h1N04J90r8K34M55L0N2n99q12j42m60q4K52k21L39K89j44j72l56j72MK98
2183f94J01K29J56N26L34O51l29k15j0k13m7l33j09K04j75O08m22j09j00p34p7
2204g58j33j03o9R7L9O26L31L83k28j02j28J03J53j71L15J57L12L56J08l64l68
2225E56n14k78j51l96J45K23o6N01k22m0J4l63P6q3Oj24J96O18L14K40P2j60J23
2248F87k50j37Q4l80j14L4L51K28k62Qk58l73l19j1k69L22K49L20L34j18Q8J63
$$ plain form
2095 -868 -108 84 255 80 167 -107 25 -83 -313 -404 224 267 341 870 681 577 435 205 222 -494 -703 -630
2117 -630 -478 -13 13 115 15 -83 -179 -574 -679 -727 -636 -261 313 625 821 803 631 898 457 -67 -327 -47
2139 -47 200 389 281 316 134 90 -272 -580 -806 -1040 -1141 -893 -567 -595 -284 -11 191 467 188 227 150 -81
2161 -81 423 613 515 749 1204 1234 1286 687 -125 -267 -727 -811 -559 -780 -441 -152 -296 -468 -824 -996 -992 -694
2183 -694 -593 -364 -208 318 652 1303 974 759 749 536 489 156 47 251 76 684 262 153 53 -681 -758
2204 -758 -891 -994 -1063 -966 -927 -301 30 413 185 83 -45 58 211 40 355 512 824 1180 1288 924 556
2225 556 42 -236 -387 -783 -638 -415 -481 20 -202 -242 -228 -591 -515 -598 -592 -716 -520 98 412 652 724 564 687
2248 687 437 300 384 4 -110 -76 275 503 241 249 -9 -382 -701 -712 -981 -659 -410 -90 244 126 214 377
2270C77o2l05r6M1M73k70L21R2q4J28o01K50m09n17N7kK5J58Q4j34N46K20K2q4
2294B30p2n40k47M93L93K9L83K29j27p5l13n37m3k94K30L2lK69j65R1k02l47q8
2317f74Lk04M76J89J32J80L90K47J15l53jj09k42L44m49k91O90k04J11j51j70
2338B9l89j71k60m56K95q3K08M43M68J0J43l44K15P9m4K33m6K27J98J55J9k03
2360G26j20n04j11N2m40l0j21K57R0j50l0j57r8J01m06K33M1K72N16M81K32Lo
2383H31l45j47K9l09O7J41j93M92j00P5n00j89j53k74k57o5n0M19J76K28J88M6
2405A10Q0j52M9m2k47N0N25J35O5K1O9q0l96K64o84M6j23J14n3J23J2j10J6K16
2429Hl35k14K7j6K94J82K81J64Q3K77q7k77l39j41k0j21J75J41o5L03m3j20j68
$$ plain form
2270 377 315 10 -86 -45 428 158 479 571 487 615 14 264 -145 -662 -605 -607 -582 -424 -340 -474 72 292 314 230
2294 230 158 -382 -629 -136 257 286 669 898 771 696 383 -154 -197 -491 -261 -229 -232 37 -128 -37 -239 -586 -674
2317 -674 -671 -875 -399 -210 -78 102 492 739 854 501 500 391 149 493 44 -247 443 239 350 199 29
2338 29 -360 -531 -791 -1247 -952 -1035 -827 -384 84 94 237 -107 108 187 143 376 330 557 755 910 929 726
2360 726 606 102 -9 43 -397 -427 -548 -291 -201 -351 -381 -538 -636 -535 -941 -708 -667 -395 121 602 834 837 831
2383 831 486 339 368 59 126 267 74 566 466 541 41 -148 -301 -575 -832 -897 -947 -528 -352 -124 64 110
2405 110 190 38 87 45 -202 -152 373 508 573 594 663 583 187 451 -233 -187 -310 -196 -249 -126 -114 -224 -208 8
2429 8 -327 -541 -514 -530 -236 -54 227 391 474 751 664 387 48 -93 -113 -234 -59 82 17 320 277 157 -11
2452a1j80m70K37l9O6K54J55L02J38k9l10N3l54L59j22j64R1j53L89j29J09J04
2474B96n19m14L28K6j44j55J99N20J41r4r3lj97k82N60j21J21L7P0N01j26L1p43
2497f1l2K4k82J2n3k6L12j64K48j20k48p4J77r9J97k1n8L93M01J86Pk12k32K8
2521C03k60J40l55K10K47r6o2L19n59j86k39j21n4j82L65L41L9L69J22l34K40
2542B47P2Q2k40K1O6J9L28J09k24j44J07k34J73m73l76q4R0k1P7J20N9J22k63
2565c67N1j79l8Q6M71j27K85L50M9P6NK5o12l1O2j28L55J14l71k7O9k78L5m37
2589e62k4j70K17n8K18j78O90R0P6J38k70k51j85J95K50J1K44l3R6Q1l18l54k25
2612c22j65K92j57l35Q09k20J96J24j00j07k08r6n9M40nj11L49J82m0O6k69k60
$$ plain form
2452 -11 -191 -661 -424 -463 -397 -143 12 314 452 423 113 166 -188 171 49 -115 -24 -177 212 83 192 296
2474 296 -223 -637 -309 -283 -427 -582 -383 137 278 184 91 88 -109 -391 169 48 169 206 276 777 651 682 -61
2497 -61 -93 -69 -351 -339 -392 -418 -106 -270 -22 -142 -390 -464 -287 -386 -189 -210 -268 125 526 712 719 507 275 303
2521 303 43 183 -172 38 285 189 127 446 -113 -299 -538 -659 -713 -895 -530 -189 -150 219 341 7 247
2542 247 319 401 161 182 248 267 595 704 480 336 443 209 382 -91 -467 -551 -461 -482 -405 -285 -226 -104 -367
2565 -367 -316 -495 -533 -447 24 -103 182 532 581 657 662 687 75 44 106 -22 333 447 76 49 118 -160 -125 -562
2589 -562 -586 -756 -539 -597 -379 -557 133 223 299 437 167 -84 -269 -74 176 187 431 398 494 575 257 -97 -322
2612 -322 -487 -195 -352 -687 122 -98 98 222 122 15 -193 -289 -348 92 87 -24 325 507 467 533 264 4
2634Dk4k2m5l62L62l62K95Q5L00l08m9l98K64j6L4P7K83L72J53p8k9j67m54mJ17
2659B8l0L3j39L69j72k3j58k31J95r9l56k0K47J10K92j65K71M2o1J35l15P1M8
2682G2M47j32Mj03L23J26o11n4l0n11j30L57j09R7jJ78j54R3j98L58k59N2l5J25
2706i5L80j39K03M12r4J22l17j25m51P8K34j40J76l97l0r3Q2p7l78k37K53K83
2728c50J07p9%M45J34k63K54j95j6M62m65L25o3l8J73L01n2l42k22k32k26k89
2750f31L20J18J8j5j13P1K8p9J49l28K53K5J4L24J79L12p5j71R4l08l33M64j51
2773A65j33NK2J39J32k92Mk59j18j71J6k9J95K33j4K41k89M59l81j02L85j57m0
2796A1Q6m5L31J35k91K26n06j45J89m76K30K04K65k10M8P6q5j11j87L31l30J98
$$ plain form
2634 4 -20 -42 -87 -449 -87 -449 -154 -69 231 -77 -126 -524 -260 -276 -242 -165 118 490 643 565 536 369 -85 -89 28
2659 28 -2 31 -108 261 89 66 -92 -323 -128 -227 -583 -603 -356 -246 46 -119 152 194 133 268 -47 24 72
2682 72 519 387 391 288 611 737 126 72 42 -469 -599 -242 -351 -254 -255 -77 -231 -138 -336 22 -237 -185 -220 -95
2706 -95 285 146 349 761 667 789 472 347 -104 -26 208 68 244 -153 -183 -276 -194 -271 -649 -886 -633 -350
2728 -350 -243 -322 -322 123 257 -6 248 53 37 499 34 359 296 258 431 732 680 338 116 -116 -342 -631
2750 -631 -311 -193 -175 -190 -303 -232 -204 -283 -134 -462 -209 -184 -170 154 333 645 570 399 493 185 -148 316 165
2773 165 32 37 59 198 330 38 42 -217 -335 -506 -490 -519 -324 -91 -105 136 -153 306 -75 -177 208 51 11
2796 11 97 52 383 518 227 453 -53 -198 -9 -485 -255 -51 214 4 52 128 43 -68 -255 76 -254 -56
2818e6K54l19K25p9N4N0J17l53K18O4m33P1k34K11L42K37j84k17K1j91j46J12
2840b36Rj28O34J18n2o1J41j66n25L30k92L20K5ro3n0J3K9j66J62l06L0p3R1n4
2865b79L3K87J24K44J5l64j75J21Q3J14j43K10J41j2N2j68jn16J72m83J17p1j70
2888f69K50L6K35J51j19k12M2J40k0k8L15Q4j72M51m7Qj91j7j52J3l6l4P9k46
2912a39M5J80P1n15L7N2K7j56Q8K5J59J88j5J73j86M3m2J33j27J44M7Q8o7k7q6
2937A40K65m15r6J8j9k20l8O2J34M1K25j27k15Q4J00j79J0n1J94M1J71R5K39K55
2961G14o35J36n23L25l4P1K07l19K73j27P2J8k75k07j3J66K07K84j90q8r0K76
2983B48J65m43q1n9R9n8J57j12p4J67J08q4J8k19j61R5J30K97k8j56J9J31j89
$$ plain form
2818 -56 198 -121 104 25 79 129 246 -107 111 175 -258 -187 -421 -210 132 369 185 -32 -11 -202 -348 -236
2840 -236 -227 -355 279 397 345 284 425 259 -266 64 -228 92 117 108 45 -5 8 37 -129 33 -273 -243 -316 -225 -279
2865 -279 -246 41 165 409 424 60 -115 6 89 203 60 270 411 399 451 283 282 -234 -62 -545 -428 -499 -669
2888 -669 -419 -383 -148 3 -116 -328 -286 -146 -166 -194 121 205 33 484 437 445 254 237 85 98 62 28 107 -139
2912 -139 -94 86 157 -358 -321 -269 -242 -398 -310 -285 -126 62 47 220 34 77 35 168 41 185 232 320 253 226 140
2937 140 405 -10 -106 -88 -107 -327 -365 -303 -169 -128 97 -30 -245 -161 -61 -240 -230 -281 -87 -46 125 220 459 714
2961 714 79 215 -308 17 -17 54 261 -58 215 88 160 178 -97 -304 -317 -151 56 340 150 62 -28 248
2983 248 413 -30 -111 -170 -71 -129 28 -84 -158 9 117 33 51 -168 -329 -234 -104 193 165 9 28 159 -30
3006c0O4J05k65k11K35K04j69L1k3Q9K40l06p4q1j81J30n3K00J84j6Q6K75m92
3029e8J73k08r8P8L78k67J45J44J29o1j31n5m29K78j21P0M0k76K8K10M6r5R6j63
3053a47j00J04l2K2l2L55J18p9j62L12l21P3J54k25q3J33M1N8K29k64j82J11j02
3076a9j35j56K50J64m68K43m0K36l48J64Q5k45K98K1n4J58l31M31K49o7k70MJ28
3099B98k53j45MJ52j22K21k70J28n9j96R0k04J41J38k7jJ60K9j33J14J04j52n7
3122d0j89J09J35J07K09Rk48l4L53m31Lj92K15j09J30p7L1J41j05J85r2k03j04
3145a97P3K7J29j21L61l2p9j74K39j92j51k25J83J32l0J03j06K90m5pm3l42P4
3168a33qK99J27m84M08j93p4K42k43j36rO6K3K92n17N30k85j8L80l54K6L9j44
$$ plain form
3006 -30 34 139 -126 -337 -102 102 -67 -36 -59 30 270 -36 -110 -191 -372 -242 -295 -95 89 73 159 434 -58
3029 -58 115 -93 -191 -113 265 -2 143 287 416 355 224 169 -260 18 -103 -33 7 -269 -241 -31 15 -80 16 -147
3053 -147 -247 -143 -175 -153 -185 170 288 209 47 359 38 111 265 40 -43 90 131 189 418 154 -28 83 -19
3076 -19 -154 -310 -60 104 -364 -121 -161 75 -273 -109 -24 -269 29 50 -4 154 -177 254 503 436 166 170 298
3099 298 45 -100 -96 56 -66 155 -115 13 -46 -242 -152 -356 -215 -77 -104 -105 55 84 -49 65 169 17 -40
3122 -40 -229 -120 15 122 331 340 92 58 411 -20 -17 -209 6 -103 27 -50 -19 122 17 202 110 -93 -197
3145 -197 -124 -97 32 -89 272 240 161 -13 226 34 -117 -342 -159 -27 -57 46 -60 230 185 178 135 -207 -133
3168 -133 -141 158 285 -199 209 16 -58 184 -59 -195 -204 -138 -115 177 -340 190 -95 -113 267 -87 -61 -22 -166
3191a66K67r5J29rL00o9J33j75j88p9r2j95M05J14k7p4l33K11l8oK9k54J90k54
3215b76k12M86L7K36k16j25K18j03O8j11P9QR3J37p8j09l18K22J6n7r7o1P7R7
3239A1M8k02N4op6M6l57L53L5j13J12K71J54J51n67K86J20n8l74K01J7p9K8O3
3263A18qj40K76k22lr7k03O1L0K33j30K2J7O4j63J61l4J3Ln7O7O6j6j64N97k58
3289B33q6k77K6J05q7L77l32J62j62J4j95L85l45K24k63J36n5M8K94j32OJ5q2
3312Ij4j20j57K72R1J8j38J06j88L89n66L17o0r0L1n5J81k49M28K38n81L97j25
3335A34j55R2O0k35K47j71K8P7N9l79J81J7r1j37L6R2l9K14kJ14J52l96J91N0
3359A39l72K35j53j50K08N25o0m13J00j82L63l60j65J24j27R5m1K44Qn9j40J53
$$ plain form
3191 -166 101 6 135 126 426 357 490 315 127 48 -44 -239 166 280 253 179 -154 57 19 13 42 -212 -22 -276
3215 -276 -488 -2 35 271 55 -70 148 45 113 2 81 89 182 319 241 132 -186 36 52 -5 -102 -163 -86 11
3239 11 59 -143 -89 -95 -171 -125 -482 -129 -94 -207 -95 176 330 481 -86 200 320 262 -112 89 106 27 55 118
3263 118 110 -30 246 24 21 -76 -279 -218 -188 45 -85 -63 -46 18 -145 16 -18 -5 -2 -59 8 74 58 -106 491 233
3289 233 147 -130 -104 1 -86 291 -41 121 -41 -27 -222 163 -182 42 -221 -85 -140 -92 202 70 76 91 9
3312 9 -5 -125 -282 -10 81 99 -39 67 -121 268 -298 19 -41 -131 -100 -155 26 -223 205 443 -138 259 134
3335 134 -21 71 131 -104 143 -28 0 77 136 -243 -62 -45 -136 -273 -237 -145 -184 30 28 142 294 -102 89 139
3359 139 -233 2 -151 -301 -93 432 372 -41 59 -123 240 -120 -285 -161 -288 -193 -234 10 18 -41 -181 -28
3381b8j72m3N6L82j71J6L50k48j9K38j87m7L7Jj17o1J35j11k76L12j33J68k43
3404a61P0k25L4K75k15p6K56mK73m0k3j79o7J00J28j03K26o6J6j06l2J33m59J33
3428a12q7OJ09r7J68o7k85J90j12K60j08J25j5l20N27j2l2p6L72l31m0q8J82l87
3452b30J88Q9J30J03j84K81k95q4k81R1L6m8j83M53j72L46n7l48J60j63j45M10
3474I7o4O8j03L33j58r0m2J96n39K55J99l15Q2k78K38K20j00J19j7j95j9q2M0
3497a55L30l15k8N09m26J22q9l4J30k32P9rK11J04j41k91J50N2j95J76K27k53
$$ plain form
3381 -28 -200 -243 -187 195 24 40 390 142 123 361 174 127 164 165 48 -13 122 11 -265 47 -86 82 -161
3404 -161 -91 -316 -282 -7 -222 -298 -42 -46 227 187 164 -15 -82 18 146 43 269 203 219 113 81 214 -245 -112
3428 -112 -199 -193 -84 -181 -13 -80 -365 -175 -287 -27 -135 -10 -25 -345 182 170 138 62 434 103 63 -25 157 -230
3452 -230 -42 47 177 280 96 377 82 -2 -283 -192 -156 -204 -387 66 -106 240 183 -165 -5 -168 -313 97
3474 97 33 101 -2 331 173 83 41 237 -302 -47 152 -163 -81 -359 -121 99 -1 118 101 -94 -113 -195 -155
3497 -155 175 -140 -168 341 -85 37 -52 -86 44 -188 -109 -118 93 197 56 -235 -85 -33 -228 -52 175 -78
$$ [...]
8191e9
##END NTUPLES=NMR FID
##END=
