##TITLE=1H_LR-0169-C1-EtOAc
 CD3CN
 8 sc, 
 20.2.2023
##JCAMPDX= 6.0         $$ Bruker NMR JCAMP-DX V2.0
##DATA TYPE= NMR FID
##DATA CLASS= NTUPLES
##ORIGIN= UXNMR, Bruker Analytische Messtechnik GmbH
##OWNER= root
$$ XWIN-NMR		Version 3.5
$$ Mon Feb 20 14:42:31 2023 Russian Standard Time (UT+4h)  she@DPX200
##.OBSERVE FREQUENCY= 200.13135
##.OBSERVE NUCLEUS= ^1H
##.DELAY= (6, 6)
##.ACQUISITION MODE= SIMULTANEOUS
##.ACQUISITION SCHEME= undefined
##.AVERAGES= 8
##.DIGITISER RES= 18
##SPECTROMETER/DATA SYSTEM= spect
##.PULSE SEQUENCE= zg30
##.SOLVENT NAME= CD3CN
##.SHIFT REFERENCE= (INTERNAL, CD3CN, 0, 15.7039)
##AUDIT TRAIL= $$ (NUMBER, WHEN, WHO, WHERE, WHAT)
$$ ##TITLE= Audit trail, XWIN-NMR		Version 3.5
$$ ##JCAMPDX= 5.01
$$ ##ORIGIN= Bruker BioSpin GmbH
$$ ##OWNER= she
$$ F:/spectra/data/she/nmr/H-F/1/audita.txt
$$ ##AUDIT TRAIL=  $$ (NUMBER, WHEN, WHO, WHERE, WHAT)
(   1,<2023-02-20 14:41:23.26 +0400>,<she>,<DPX200>,
      <created by zg, POWCHK disabled, PULCHK disabled
       configuration hash MD5:
       00 E9 B6 7A A2 85 ED C7 34 08 36 98 17 FE 4E 26
       data hash MD5: 16K
       24 52 E6 68 EB FB B6 99 42 3E E9 C4 3D 02 59 D9>)
$$ ##END=
$$ 
$$ hash MD5
$$ 57 59 E3 9A 1A 47 F7 17 F4 4B 8F F2 D3 2D 65 4A
##$RELAX= 
##$RELAX= 
##$RELAX= 
##$RELAX= 
##$RELAX= 
##$RELAX= 
$$ Bruker specific parameters
$$ --------------------------
##$DU= <F:/spectra>
##$EXPNO= 1
##$NAME= <H-F>
##$PROCNO= 1
##$TYPE= <nmr>
##$USER= <she>
##$AMP= (0..31)
100 100 100 100 100 100 100 100 100 100 100 100 100 100 100 100 100 100 
100 100 100 100 100 100 100 100 100 100 100 100 100 100 
##$AQSEQ= 0
##$AQ_mod= 1
##$AUNM= <au_zg>
##$AUTOPOS= <>
##$BF1= 200.13
##$BF2= 200.13
##$BF3= 200.13
##$BF4= 200.13
##$BF5= 200.13
##$BF6= 200.13
##$BF7= 200.13
##$BF8= 200.13
##$BYTORDA= 1
##$CFDGTYP= 0
##$CFRGTYP= 5
##$CHEMSTR= <none>
##$CNST= (0..31)
1 1 145 1 1 1 1 1 1 1 1 1 1 1 1 1 1 1 1 1 1 1 1 1 1 1 1 1 1 1 1 1 
##$CPDPRG= <>
##$CPDPRG1= <>
##$CPDPRG2= <>
##$CPDPRG3= <>
##$CPDPRG4= <mlev>
##$CPDPRG5= <mlev>
##$CPDPRG6= <mlev>
##$CPDPRG7= <mlev>
##$CPDPRG8= <mlev>
##$CPDPRGB= <>
##$CPDPRGT= <>
##$D= (0..31)
0 1.2 0 0 0 0 0 0 0 0.06 0 0.03 0 0 0 0 0.0002 0 0 0 0 0 0 0 0 0 0 0 0 
0 0 0 
##$DATE= 1676889682
##$DBL= (0..7)
120 120 120 120 120 120 120 120 
##$DBP= (0..7)
150 150 150 150 150 150 150 150 
##$DBP07= 0
##$DBPNAM0= <>
##$DBPNAM1= <>
##$DBPNAM2= <>
##$DBPNAM3= <>
##$DBPNAM4= <>
##$DBPNAM5= <>
##$DBPNAM6= <>
##$DBPNAM7= <>
##$DBPOAL= (0..7)
0.5 0.5 0.5 0.5 0.5 0.5 0.5 0.5 
##$DBPOFFS= (0..7)
0 0 0 0 0 0 0 0 
##$DE= 6
##$DECBNUC= <off>
##$DECIM= 32
##$DECNUC= <off>
##$DECSTAT= 4
##$DIGMOD= 1
##$DIGTYP= 9
##$DL= (0..7)
0 120 120 120 120 120 120 120 
##$DP= (0..7)
150 150 150 150 150 150 150 150 
##$DP07= 0
##$DPNAME0= <>
##$DPNAME1= <>
##$DPNAME2= <>
##$DPNAME3= <>
##$DPNAME4= <>
##$DPNAME5= <>
##$DPNAME6= <>
##$DPNAME7= <>
##$DPOAL= (0..7)
0.5 0.5 0.5 0.5 0.5 0.5 0.5 0.5 
##$DPOFFS= (0..7)
0 0 0 0 0 0 0 0 
##$DQDMODE= 0
##$DR= 18
##$DS= 0
##$DSLIST= <SSSSSSSSSSSSSSS>
$$ [...]
##$SUBNAM2= <"">
##$SUBNAM3= <"">
##$SUBNAM4= <"">
##$SUBNAM5= <"">
##$SUBNAM6= <"">
##$SUBNAM7= <"">
##$SUBNAM8= <"">
##$SUBNAM9= <"">
##$SW= 18.05172834244
##$SWIBOX= (0..15)
0 0 2 0 0 0 0 0 0 0 0 0 0 0 0 0 
##$SW_h= 3612.71676300578
##$TD= 16384
##$TD0= 1
##$TE= 0
##$TE2= 300
##$TE3= 300
##$TEG= 300
##$TL= (0..7)
0 120 120 120 120 120 120 120 
##$TP= (0..7)
150 150 150 150 150 150 150 150 
##$TP07= 0
##$TPNAME0= <>
##$TPNAME1= <>
##$TPNAME2= <>
##$TPNAME3= <>
##$TPNAME4= <>
##$TPNAME5= <>
##$TPNAME6= <>
##$TPNAME7= <>
##$TPOAL= (0..7)
0.5 0.5 0.5 0.5 0.5 0.5 0.5 0.5 
##$TPOFFS= (0..7)
0 0 0 0 0 0 0 0 
##$TUNHIN= 0
##$TUNHOUT= 0
##$TUNXOUT= 0
##$USERA1= <user>
##$USERA2= <user>
##$USERA3= <user>
##$USERA4= <user>
##$USERA5= <user>
##$V9= 5
##$VALIST= <valist>
##$VCLIST= <CCCCCCCCCCCCCCC>
##$VD= 0
##$VDLIST= <DDDDDDDDDDDDDDD>
##$VPLIST= <PPPPPPPPPPPPPPP>
##$VTLIST= <TTTTTTTTTTTTTTT>
##$WBST= 1024
##$WBSW= 4
##$XGAIN= (0..3)
0 0 0 0 
##$XL= 0
##$YL= 0
##$YMAX_a= 242182
##$YMIN_a= -415849
##$ZGOPTNS= <>
##$ZL1= 120
##$ZL2= 120
##$ZL3= 120
##$ZL4= 120
##$ABSF1= 10
##$ABSF2= 0
##$ABSG= 5
##$ABSL= 3
##$ALPHA= 0
##$AQORDER= 0
##$ASSFAC= 0
##$ASSFACI= 0
##$ASSFACX= 0
##$ASSWID= 0
##$AUNMP= <proc_1d>
##$AZFE= 0.1
##$AZFW= 0.1
##$BCFW= 1
##$BC_mod= 2
##$BYTORDP= 1
##$COROFFS= 0
##$CY= 11.3945322036743
##$DATMOD= 1
##$DC= 2
##$DFILT= <>
##$DTYPP= 0
##$F1P= 2.36226072786647
##$F2P= -0.459571619588291
##$FCOR= 0.5
##$FTSIZE= 0
##$FT_mod= 4
##$GAMMA= 1
##$GB= 0.15
##$INTBC= 1
##$INTSCL= 1
##$ISEN= 128
##$LB= 0.24
##$LEV0= 0
##$LPBIN= 0
##$MAXI= 10000
##$MC2= 0
##$MEAN= 0
##$ME_mod= 0
##$MI= 1.114404
##$NCOEF= 0
##$NC_proc= 0
##$NLEV= 6
##$NOISF1= 3.799351
##$NOISF2= 2.8
##$NSP= 1
##$NTH_PI= 0
##$NZP= 0
##$OFFSET= 15.70392
##$PC= 1
##$PHC0= -19114.45
##$PHC1= 14.60078
##$PH_mod= 1
##$PKNL= yes
##$PPARMOD= 0
##$PSCAL= 0
##$PSIGN= 0
##$REVERSE= no
##$SF= 200.130013532006
##$SI= 16384
##$SIGF1= 3
##$SIGF2= 2
##$SINO= 400
##$SIOLD= 16384
##$SREGLST= <1H.CDCl3>
##$SSB= 0
##$STSI= 0
##$STSR= 0
##$SW_p= 3612.71676300578
##$SYMM= 0
##$S_DEV= 0
##$TDeff= 0
##$TDoff= 0
##$TI= <>
##$TILT= no
##$TM1= 0
##$TM2= 0
##$TOPLEV= 0
##$USERP1= <user>
##$USERP2= <user>
##$USERP3= <user>
##$USERP4= <user>
##$USERP5= <user>
##$WDW= 1
##$XDIM= 8192
##$YMAX_p= 0
##$YMIN_p= 0
$$ End of Bruker specific parameters
$$ ---------------------------------
##NTUPLES= NMR FID
##VAR_NAME=  TIME,          FID/REAL,        FID/IMAG
##SYMBOL=    X,             R,               I
##VAR_TYPE=  INDEPENDENT,   DEPENDENT,       DEPENDENT
##VAR_FORM=  AFFN,          ASDF,            ASDF
##VAR_DIM=   8192,          8192,            8192
##UNITS=     SECONDS,       ARBITRARY UNITS, ARBITRARY UNITS
##FACTOR=    0.0002768,     1,               1
##FIRST=     0,             0,               0
##LAST=      2.2672688,     0,               0
##MIN=       0,             -415849,         0
##MAX=       2.2672688,     242182,          0
$$ Real data points
##PAGE= N=1
##DATA TABLE= (X++(R..R)), XYDATA
$$ [...]
1819c6l53J03O84j19o59k54Q05K0o1P43J66j300o17L87Q69P7k65J20l76o05J17
1840e54P70j6p61J21L80j71k00L00M30o70j22Q35J20p02J04P47p5l30l08M04p7
1861B25l24M74M85o50l71m6k17L83j12O01j01m68p09K78K87n7M18P19n44l29N7
1882aL22k66P8M74l8l69m66K79R5k26lR7j54l03L93J99l20k94Q5O2Q9J28K21K37
1906C19K51o91K12j60q4P6N52J88l97j86j76q0q8J01M25r2n61M5m6q6K05L92m8
1929G1k75pO9J20R6J41Jj18J62O9K00p9o0j09m04J00L2j37L29k85k56J98m36M6
1953e32K57M9L19K45l48k58j20K16M40N76n18l0l03K36j95O5m2J47k16K91k54
1974B5Q4m57J69j49L53k1j02Kk68j9L19J45k18J46l52M17J86L01Pn79l79L16O58
$$ plain form
1819 -36 -389 -286 398 279 -380 -634 171 191 130 873 1039 -261 -878 -491 378 455 190 310 -66 -671 -554
1840 -554 216 200 -561 -440 -60 -231 -431 -131 299 -371 -493 342 462 -240 -136 611 536 206 -102 302 225
1861 225 -99 375 860 210 -161 -207 -424 -41 -153 448 347 -121 -830 -552 -265 -322 96 815 271 -58 -1
1882 -1 321 55 133 607 569 200 -266 13 108 -118 -121 -24 -178 -481 -88 111 -209 -503 -418 -356 -267 -139 82 319
1906 319 570 -121 91 -69 -153 -77 475 663 266 80 -96 -176 -264 -163 262 170 -391 -346 -392 -478 -273 119 71
1929 71 -204 -211 -142 -22 74 215 216 98 260 329 529 450 390 281 -123 -23 9 -128 201 -84 -340 -142 -578 -532
1953 -532 -275 -226 93 338 -10 -268 -388 -172 268 844 326 296 -7 229 34 99 57 204 -12 279 25
1974 25 109 -348 -179 -328 25 4 -98 -96 -364 -383 -64 81 -137 9 -343 74 260 561 568 -11 -390 -74 584
1997E84J86m30m5k90l39J0K99R5k80J70m7k12R3j99k4K98L85j39K14k03l72J23
2019a23M26J32J00p4k34j59O3K16p7j12m70j82K96K02K53o12J12n15K83L89K53
2040A67m0j36j26J28KK53j28J05J53R9L1m14O9l41k56M75N59n02m30k16k30J81
2062e97L55M24k11k17j55L36Q3L14l15p0J79K49K17l77K29o47J36K99K09l80N6
2083A17k99M3l2k9nm90K80L08J40l8m0n18J47M41l5M29K35n88m96N58K46k67M12
2106E19q6o02M16j14r3l63K54k95R2JK91l71L8L24k08P2M44n17K25J98K29k16
2128B38K15k55n50L06K85J96l45R5k70l20L61M34j91j19r8Q0n63L96J8k19K39
2149f7K72k41J52k35J06l10N17J48n02L61R6j60k86N59j5m24j23QM7L6K77k84
$$ plain form
1997 584 770 340 295 5 -334 -324 -25 70 -210 -40 -87 -299 -206 -405 -429 -131 254 115 329 126 -246 -123
2019 -123 303 435 535 461 227 68 131 347 270 158 -312 -494 -198 4 257 -355 -243 -758 -475 -86 167
2040 167 127 -9 -135 -7 -5 248 120 225 378 477 508 94 163 -178 -434 41 600 98 -332 -548 -778 -597
2062 -597 -242 182 -29 -246 -401 -65 18 332 17 -53 126 375 592 215 444 -203 -67 232 441 61 117
2083 117 -182 -139 -171 -200 -205 -695 -415 -107 33 -5 -45 -563 -416 25 -10 419 654 66 -430 128 374 107 519
2106 519 433 -169 247 133 40 -323 -69 -364 -272 -271 20 -351 -313 11 -197 -125 319 -198 27 225 454 238
2128 238 453 198 -352 -46 239 435 90 185 -85 -405 -44 390 199 80 -18 62 -501 -105 -87 -306 -67
2149 -67 205 -36 116 -119 -13 -323 194 342 -160 201 297 137 -149 410 395 -29 -152 -144 -97 -61 216 -68
2171f8l91j5PM27K58k12j3q4o2K08o6P10o55p7K10Rl80O4M56j50j58J20j88j52
2195b02m8J60p1j4k15K04K01k68K66j30L32k56O0Q5J4m9J82K37l68k09J06j09
2217i2j00N32K52p34k27J20R4k36L60M9n2L29l65j41J91L07n08J99N29l65qP6
2239B10j6n25J34O61l38l29K02J89j50LJ05k60l4o1J34J20K00n01J77M4j46K06
2261B5L30j6l74N6p7p8k3K83M29m24j77K62j80l47L58K33j32j9l08J46mo1K8L24
2285B54k12p9j58M26j88j52J67Jm02J73J64K06J8k20j2j19L0l6K80j03o4k12J40
2308i8r2k09O39q9j03p6J82L8k63J37L47o6l37J28p1j47n7M8K73j41n5q9q3L22
2332A38J13j02k18L0j68K98M10o52Q8P2L2l41M04K39l55j0P0j98q0J49NK01L4
$$ plain form
2171 -68 -459 -474 -467 -40 218 6 -7 -91 -153 55 -11 699 44 -33 177 186 -194 -130 326 176 18 138 -50 -202
2195 -202 -250 -90 -161 -175 -390 -186 15 -253 13 -117 215 -41 19 104 118 69 251 488 120 -89 17 -92
2217 -92 -192 340 592 -142 -369 -249 -155 -391 -31 18 -34 295 -70 -211 -20 287 -221 -22 507 142 134 210
2239 210 194 -331 -197 464 126 -203 -1 188 38 41 146 -114 -148 -209 -75 45 245 -256 -79 -35 -181 25
2261 25 355 339 -35 21 -56 -134 -157 126 555 131 -46 216 36 -311 47 280 148 129 -179 -33 -37 -98 -70 254
2285 254 42 -37 -195 231 43 -109 58 59 -343 -170 -6 200 218 -2 -14 -133 -103 -139 141 38 -26 -238 -98
2308 -98 -190 -399 240 151 48 -28 154 192 -71 66 413 347 10 138 67 -80 -137 -89 184 43 -12 -101 -184 138
2332 138 251 149 -69 -39 -207 91 501 -151 -63 9 41 -300 104 343 -12 -22 48 -150 -230 -81 -76 125 159
2355A59j01Q1j68j00j52L64l4J03j5p3n7k80O85l78P6K7j4j98O9K94m56K45q7
2378a0m4J91j88Q1l1N4k87L16J11j22J21K38k29j46R1l60L22j80PK18K71m99p0
2401a45K6j49M30MP2n85Q0j77K34K29K30p9q6l33K72K67l52M16j72k34J11j50
2423i1R3j5L35l76Q0k56J20J05k8J24j36j43j6K23k99L92p7M23l32q6j73q8K83
2446F2J51p2o3N6k77J44L04k22J65j46rj08N1m82M23J74k48P9k28L72j6o6J85
2469B29m70J37K71q3J06J37o6k68m9j8K94l63N21r4k41%J6l40R4R7j06K66o5q3
2493g8j9k38M72m09N10J16l03l55K06J32j03M82m21k7J96n8j56J05J53k87lK24
2515A39l39L11m3k7r4j0O6j3J57p1p3j38J37j28j53K01K1J59j64K85l21k3K80
$$ plain form
2355 159 58 139 -29 -129 -281 83 49 152 137 64 7 -273 412 34 110 137 123 -75 -6 288 -168 77 -10
2378 -10 -54 137 -51 30 -1 53 -234 82 193 71 192 430 201 55 146 -214 108 -72 -65 153 424 -75 -145
2401 -145 -119 -268 162 166 238 -347 -267 -444 -210 19 249 170 84 -249 23 290 -62 354 182 -52 59 -91
2423 -91 2 -13 322 -54 26 -230 -110 -5 -33 91 -45 -188 -204 19 -280 112 35 458 126 40 -133 -221 62
2446 62 213 141 78 134 -143 1 305 83 248 102 93 -15 36 -446 -23 151 -97 -18 -246 126 110 44 229
2469 229 -241 -104 167 84 190 327 261 -7 -56 -74 220 -143 378 284 43 43 59 -281 -187 -90 -196 70 5 -78
2493 -78 -97 -335 137 -272 238 354 51 -304 -98 34 -69 413 -8 -35 161 103 -53 52 205 -82 -85 139
2515 139 -200 111 68 41 -53 -63 3 -10 147 76 3 -135 2 -126 -279 -78 -57 102 -62 223 -98 -121 159
2538A59n0o2Rn4j93L0K32j05j38K91m1m5k6P9P4l09K78k24R1R5n1L6o7Q1j15M7
2564B2j56L48k76K78r8l16K39j88j87K13J03n9j61J61N8j86J91J06l31J27L23
2585B11o2j7oj7k93J88K31p0k44R8kp8Q9K77l17k03L35o7Q7m4m24K11K7M9k0O5
2611DQ7k86K32R2J59l22K33R3j72n5J73j20j39MK56j36m9j24j99L16J2k10NO1
2635h5j96M69m9n89L57J15J0p3O5J72p2k64J07J33r1k91J61L22j96j21k23L53
2657A4k45J28J96L5j34j14O1j44j3K75M6p1k39J43J92m64M49M14k55l33O5p7k4
2680i5J56j59J93o1j91P3K92k24L9J82j09q0l0L7J73j52m51M59J2j72j65M39L16
2703D82m58M1J2k7r2M8m9J08k77L84O8n63N2K29J25m7k42M96p3m84K12RN7k11
$$ plain form
2538 159 109 47 56 2 -191 -161 71 -34 -172 119 78 33 7 86 160 -149 129 -95 -4 91 40 76 9 90 -25 22
2564 22 -134 214 -62 216 118 -198 41 -147 -334 -121 -18 -77 -238 -77 -19 -205 -14 92 -239 -112 211
2585 211 149 132 126 109 -184 4 235 165 -79 19 17 -61 28 305 -12 -215 120 53 140 96 -328 -117 -90 -41 -61 4
2611 4 91 -195 37 129 288 -34 199 292 120 65 238 118 -21 -17 239 103 54 -70 -269 47 59 -151 -146 -85
2635 -85 -281 188 139 -450 -93 22 32 -41 24 196 124 -140 -33 100 9 -282 -121 201 5 -116 -339 14
2657 14 -231 -103 93 128 -6 -120 -59 -203 -216 59 105 34 -205 -62 130 -334 115 529 274 -59 6 -71 -95
2680 -95 61 -98 95 34 -157 -84 208 -16 23 205 96 16 -14 23 196 44 -407 52 64 -108 -273 166 482
2703 482 24 65 77 50 -42 6 -43 65 -212 172 240 -323 -271 -42 83 36 -206 290 217 -267 -55 -46 11 -200
2727b00M46L2k71q6J74J71m06o6L46q9k62J08N5n0k58L40O7ok05L71J35n23j14
2750b91L96K76l42k40L91J22m47l26Q13j37o14M55K09j87k34P7J87k06p3L19k10
2771f2j71lM0K00J57k77N00k73k73J74K81l39l44N67P3j41m69O41l4l43k2J71
2793E3j4k74J83N06o16l97M21L15m12lL94J30l38l37N74j29k92r2O28J07n97q
2815a98N25L8p70M63J7k12l06N05K48m07l2K41m4m97K57L39Q0n89J67M79m51p0
2837b17K72K55q0m51M79o7m22m0O28O2o01k09R21l41k51k67P32l04m99K93M79
2858C72l88m56N08M03l56j77N31L0n13q6O12m35n14M97M44m19j71P5M00o32k24
2879d99P80o9m98J13M07j0n57K53L81K0o21L16N43n52m92Q15L4n58j01O38k55
$$ plain form
2727 -200 246 278 7 -79 95 266 -140 -206 140 51 -211 -103 -48 -98 -356 -16 51 45 -160 211 346 -177 -291
2750 -291 105 381 39 -201 190 312 -135 -461 352 215 -399 56 265 78 -156 -79 108 -98 -171 148 -62
2771 -62 -233 -236 -196 4 161 -116 384 111 -162 12 293 -46 -390 177 250 109 -360 281 247 -96 -118 53
2793 53 39 -235 -52 454 -162 -559 -138 177 -235 -238 156 286 -52 -389 185 56 -236 -328 300 407 -190 -198
2815 -198 327 365 -405 58 75 -137 -443 62 310 -97 -129 112 68 -429 -172 167 247 -342 -175 304 -147 -217
2837 -217 55 310 230 -221 258 191 -231 -271 357 419 -182 -391 530 189 -62 -329 403 99 -400 -107 372
2858 372 -16 -472 36 439 83 -94 437 467 -46 -132 480 45 -469 28 472 53 -118 -43 357 -275 -499
2879 -499 281 212 -286 -173 234 224 -333 -80 301 321 -300 16 559 7 -485 330 364 -194 -295 343 88
2900H8k16J07L64m1p89J68Q37l78l76L33J49k58j94K77L33m19m63P04N6n42j3
2921b73Q90l52m89Q6M50k76n24L93K89k41l49N33J03l96q6L16K65n05j31M95m8
2942A50m75J10O10l90l57M29M95l72p24N39Q4l13m8M63j64l65j01P75k14m58M2
2963b84N77j54o50N62M71l80n89O25J22n32l5M22K26o35L0M44K3p24M48J85k7
2984A25n52O67J6l93k74L36M05l50j56N13K1o31k6N97k6n76L54K03r7n07N08J29
3006B86n45o9P56L9p90J0N95P2o78J59N88k60n00L41L87l71m10M57J08k77j81
3027b83J26M22n26q3O83l28n00L48L26l11j12o4O55l90k99J73M49k82l52O79K9
3048C60q13L05M47j58m48K58K47k25k94L54L56l39l79N11J74m82k36M67L43m90
$$ plain form
2900 88 -128 -21 343 302 -487 -319 518 140 -236 97 246 -12 -206 71 404 -15 -478 226 282 -260 -273
2921 -273 617 265 -224 -138 312 36 -488 -95 194 -47 -396 137 240 -156 -242 74 339 -166 -297 198 150
2942 150 -325 -215 395 5 -352 77 572 200 -524 15 99 -214 -262 201 37 -328 -429 346 132 -326 -284
2963 -284 293 139 -511 51 522 142 -447 178 300 -232 -267 155 381 -254 -224 220 243 -481 -33 152 125
2984 125 -427 240 256 -137 -411 -75 330 -20 -176 337 358 -273 -299 298 272 -304 50 253 156 -351 157 286
3006 286 -259 -328 428 467 -323 -313 282 354 -324 -165 423 163 -337 4 391 20 -390 67 175 -102 -283
3027 -283 -157 265 -261 -344 339 11 -489 -141 185 -126 -238 -302 353 -37 -336 -163 286 4 -348 331 360
3048 360 -453 -148 299 141 -307 -49 198 -27 -321 33 389 50 -329 182 356 -126 -362 105 448 -42
3068d2l2L14l0n10L89J07O4n56L07N41m44n81M50L74l75m01P55j56l70J26M36
3089C66l32l19J92N08o4n91K11J58k6m06L67J59l85j17O25O2p57J08L14N2l65
3110b40R8L42m69J16J08M08l55l03M98J12m98l1L68k51R2j23K31J7m66J83N17
3131C54l18l76J71K26k70m2J57J72r2j39J95K26o77J04M96o6l73J72J47n5k18
3152b06L83K51m34j18K37P5n51L41J02K8m46K24L86k66j84p2O16k96m43K77k1
3173a17j01J76K68j19l93L01K37j93j38j07L92j52j04K26k42j08n0N2R3q9o9L21
3195H4R0j5j30O0J50l77K26M1J40m10J57K26l68Q1K16k0l63O3K76m4l11O2K79
3218A13l7J6k96M78k28r0J30k7Ok03M51J11l72j65M73j75k88nJ58J37l41J25L35
$$ plain form
3068 -42 -74 240 210 -300 89 196 260 -296 11 552 108 -473 -23 351 -24 -425 330 174 -196 -70 366
3089 366 34 -285 -93 415 351 -240 -29 129 103 -303 64 223 -162 -279 346 408 -349 -241 73 125 -240
3110 -240 -142 200 -269 -153 -45 363 8 -295 203 315 -183 -214 154 -97 -5 -128 103 120 -346 -163 354
3131 354 36 -340 -169 57 -213 -255 -98 74 -18 -157 38 264 -413 -309 187 121 -252 -80 67 12 -206
3152 -206 177 428 -6 -124 113 188 -363 -22 80 108 -338 -114 272 6 -178 -250 366 70 -373 -96 -117
3173 -117 -218 -42 226 107 -286 15 252 59 -79 -186 206 54 -50 176 -66 -174 -224 -172 -79 -168 -237 84
3195 84 174 159 29 89 239 -138 88 129 269 -141 16 242 -126 -45 171 151 -212 -149 127 83 -228 -166 113
3218 113 76 92 -204 274 46 -44 86 59 65 -138 313 424 52 -113 360 185 -103 -108 50 187 -154 -29 306
3241C06m33K8K32L9j55l91K62K26l0k41M70k7m99K18J34j05j83J07J89k54j75
3262b82J52J94q1m0K69k50j01j4M08k18m9M8K21k41o6j09K95ll33q1J15J41J57
3285A32Pj27m7r8K35K5m51K79Q0l65J1M19n2L3k02J47P8j26j04k8J75J8M2k13
3309a32K31j19j95K97k43L05k69J4Q2J92KK3k60K1J10k5r9J13J71l68K2K06j51
3332g2K42j74j00L35l32nk4P2K84j09k36K05n5j84L00R3n4J3j34k96R7J66PN2
3356I1k11J17j01OK22J39j03j73j25L01m21K38k6K39j11m2M2j05kok8K4q9j8K50
3381A08L8k61L36l4m28J72k0qP9J7j51L16k37L6p1K07k17K72m2k07J76j61J22
3404D2j11J05j63l8M02ok97P0J45j71K01O0j30p5j53mJ27M7n4j90K15q2Q0J14
$$ plain form
3241 306 -127 -99 133 172 17 -374 -112 114 84 -157 313 286 -213 5 139 34 -149 -42 147 -107 -282
3262 -282 -130 64 -17 -57 212 -38 -139 -153 255 37 -12 36 257 16 -50 -159 136 133 -200 -281 -166 -25 132
3285 132 139 12 -35 -133 102 127 -324 -45 35 -330 -319 100 48 81 -121 26 104 -22 -126 -154 21 39 81 -132
3309 -132 99 -20 -215 82 -161 144 -125 -111 -29 163 165 188 -72 -51 59 34 -65 48 219 -149 -127 79 -72
3332 -72 170 -4 -104 231 -101 -106 -130 -58 226 117 -119 86 31 -153 147 240 186 199 65 -231 -134 32 39 91
3356 91 -120 -3 -104 -98 124 263 160 -13 -138 163 -258 -20 -46 193 82 40 82 -23 -25 -31 -59 -35 -124 -142 108
3381 108 146 -115 221 187 -241 -69 -89 -97 -18 -1 -152 164 -73 -37 -108 99 -118 154 112 -95 81 -80 42
3404 42 -69 36 -127 -165 237 231 -66 4 149 -22 179 239 109 34 -119 -123 4 51 -3 -193 22 -60 20 134
3428A34j64j98J4K72k3mj5K83m26N13n91K80K6j43N0N1k37K41Rj91J8K78k03J29
3452A03K01m39J7K08j81L17R8l94Q5K58l26j95M82k10Km3L51l08j47J99j56P9
3474AK4k2M6q1PJ93j09o7Q1J52k03j37L30r0p5j92J21k53L27K51k26r6K23l88
3498a83J64K22j60j2o6J27p3j72p2J01m2K2Q4K37m50M74k87L66m72J74J43l27
3520b02L7J65J14q5j89M35j66R0l20J02l6k19L81r8J8j05L14m09K62q3L98o89
3542b85M28M2j83L1rj30K2L8j01J40n8q6k23L81j9o6Lq3J80R5J75k63O7j66K89
3567B19k03j8Om0R3k36J66K4n5j27J12J24l9o8N5J48j87j33K70k39P4J01n3k03
3591b09K94j88L96j73q8QNj55J17j37K10N9j83J12j9k73K05K07k12m2R2p0m9J02
$$ plain form
3428 134 -30 -228 -214 58 35 31 16 299 -127 386 -205 75 101 -42 8 59 -178 63 72 -119 -101 177 -26 103
3452 103 304 -135 -118 90 -91 226 324 -70 15 273 -53 -248 234 24 26 -17 334 26 -121 78 -78 1
3474 1 25 3 49 -32 -25 168 59 -8 73 225 22 -115 215 125 50 -142 -21 -274 53 304 78 -18 205 -183
3498 -183 -19 203 43 31 -35 92 19 -153 -225 -124 -166 -144 -60 177 -273 201 -86 280 -192 -18 125 -202
3520 -202 -165 0 114 29 -160 275 109 199 -121 -19 -55 -274 107 9 27 -78 236 -173 89 6 404 -285
3542 -285 143 185 2 33 24 -106 -84 -46 -147 -7 -65 -151 -374 7 -12 -78 -75 -158 22 117 292 29 96 -70 219
3567 219 16 -2 4 -36 57 -179 -13 11 -44 -171 -59 65 26 -42 13 161 -26 -159 111 -128 -54 47 -6 -209
3591 -209 85 -103 293 120 32 40 45 -110 7 -130 80 139 -44 68 49 -224 -19 188 -24 -66 26 -44 -93 9
3615Io2J41j99J99j10J08q2M8Q1j25j23J98J16m16J53K36j75j9QL1p5j08K98k02
3639g0R4ml9J5j49K37j11k1Q8K9j32K01ok6M8l04K34l08M27q7k68M06l46N1Q8
3664D7k62M90m05J7K62j49L0j50L20l30J86j72R3J76j3j05L5PJ32l69l5L30l12
3687a77M2L37l27l6K18m18L36j7J27J90m75K53J95j49k77M2K95j84k2K0q7L39
3709B25j25l13M5j37M59j53k46M20Pj75l1qJ95L0O7k52J83l41J43Qj1Lj41J62
3733A4K65l44n1P1K1M5k2o3J67j58J3J02J06k44J35m08K51K08L4q7r0K04m12L71
3757A28jKj25l2O0q3jj7J15k79L08j98J23rJ98j60j0j37j16K57Q8k75J30J66l09
3782a77K41j01J23n1l13J95J41k00Q6Q4J05k79P2k36K05M5Q9j53J73J01l05K28
$$ plain form
3615 9 -53 88 -111 88 -22 86 4 52 133 8 -115 83 199 -217 -64 172 -3 -22 -14 17 -58 -166 132 -70
3639 -70 24 20 -19 -4 -153 84 -27 -48 40 69 -63 138 132 106 154 -150 84 -224 203 116 -152 254 -92 -41 47
3664 47 -215 275 -130 -113 149 0 30 -120 200 -130 56 -116 -23 153 140 35 70 77 209 -160 -195 135 -177
3687 -177 -135 202 -125 -161 57 -361 -25 -42 85 275 -200 53 248 99 -178 -136 159 -25 -47 -27 -114 225
3709 225 100 -213 -168 -305 154 1 -245 175 182 7 -24 -32 163 193 260 8 191 -150 -7 1 -10 -7 -148 14
3733 14 279 -65 -116 -45 -24 21 -1 -64 103 -55 -42 60 166 -78 57 -351 -100 108 142 55 -35 169 -243 128
3757 128 127 129 4 -28 32 -51 -52 -69 46 -233 75 -123 0 -9 189 29 19 -118 -234 23 111 -164 -34 132 -177
3782 -177 64 -37 86 35 -278 -83 58 -142 -56 28 133 -146 -74 -310 -105 -60 29 -124 49 150 -155 73
3804G3k76L13Q9j74p1K08l8j17J74q0r2PO7n1p6n1J8m0J07j19J11k34N20j52k25
3829a09J81J06j08j22p9K69J9n4q9K56l03K26%n3l37J64k45RL27k77L53j11k92
3852b69M23L3j69j01j90J72q2R4J5Q1J78l3l52M30K7j50l22K44r5J40j28J23k16
3875a47l6K90j00j42Nj0K10l05M27r1K05l18j05J55j63K77j99J29j27J31m1p6
3897c1j45o6L51j84J98R3k33J17j98N4P0l8Q8j09nJ04p9k41J87O0Q4j57k04J56
3921a28J57P9j60P1J5j8o1k3N7p3K78l85K43j78ML3J53j81J03O7j69J38mj56K48
3946A10n6NJ47k27J23J07j21k01J37k6K7P8R4q2p9L3J5l55J61J78L4j80Q7J80
3970A89k43K49k8k66j45K86J42q4r0P8O6k04J63k21Q0j38L2K73k90l03L94O8J6
$$ plain form
3804 73 -203 110 199 25 -46 162 124 7 181 101 9 16 83 32 -44 -95 -77 -117 -10 -129 -18 -252 268 116 -109
3829 -109 72 178 70 -52 -131 138 157 103 14 270 -33 193 193 140 -197 -33 -278 -269 58 -219 134 23 -269
3852 -269 154 187 18 -83 -273 -101 -183 -89 -74 7 185 152 -200 230 257 107 -215 29 -66 74 -54 69 -147
3875 -147 -183 107 7 -135 -130 -140 70 -235 192 101 306 -12 -117 38 -125 152 -47 82 -45 86 45 -31
3897 -31 -176 -242 109 -75 123 216 -17 100 -98 -44 26 -12 76 -33 -38 66 -13 -254 -67 -7 77 -80 -284 -128
3921 -128 29 108 -52 19 34 16 -45 -68 -11 -84 194 -191 52 -126 -122 -89 64 -117 -14 53 -116 22 18 -138 110
3946 110 54 59 206 -21 102 209 88 -113 24 -2 25 103 197 115 36 69 84 -271 -110 68 102 -78 9 189
3970 189 -54 195 167 -99 -244 42 184 100 10 88 154 -50 113 -108 -28 -166 -134 139 -151 -454 -60 8 24
3993B4m5k44L75j33Mj9J88K19m76K42j00j0O4j74j24K77j36J76k25K52P6j80j22
4016i1k18J57O9K00k38K90j42j11J88o5kj48j77L01Mj00RK22k01p8L4N51k20n04
4040b70R1L02Ml95M04n1n2Q5J43l15J19p9lk00M64M9m39o6J32L38m88M24k4o0
4064A13O7j61N3nk27J51ol3J28j47Q2N9j22K49m2l3k98R0J36q8o2O1K38k24j60
4089a81J41j65K14k8J45k12n8L17r0J6k31K51j20J5j0J7J21j08p5O7j09M6o5J37
4113C5j5p6j67K3J00j36L38j41lj98K57n0k3J27j41M13P9k78j50L5k6j79L32q8
4137F8j66K07k42J29lj03P0O2l1p2P4q6oR0R5J29l12L4j70J66L3n4R0k41K16J17
4163I4j51n0R7J05l30J95j71J30Q7j90M87k57n6K26k35q8L96l93Q0JJ41M9k70
$$ plain form
3993 24 -21 -265 110 -23 -19 -38 150 369 -107 135 35 25 89 -85 -209 68 -68 108 -117 135 211 31 -91
4016 -91 -309 -152 -83 117 -121 169 27 -84 104 39 37 -111 -288 13 17 -83 -74 148 -53 -131 -97 454 234 -270
4040 -270 -179 123 127 -268 136 85 33 118 261 -54 65 -14 -17 -217 247 296 -143 -209 -77 261 -227 197 173 113
4064 113 180 19 72 67 -160 -9 -15 -48 80 -67 15 74 -48 201 159 126 -172 -82 54 -34 -96 -35 203 -21 -181
4089 -181 -40 -205 9 -19 126 -86 -144 173 83 99 -132 119 -1 14 4 21 142 34 -41 26 -83 -37 -102 35
4113 35 20 -56 -223 -200 -100 -236 102 -39 -42 -240 17 -33 -56 71 -70 343 422 144 -6 29 3 -176 156 68
4137 68 -98 109 -133 -4 -7 -110 -40 22 -9 -81 -7 -93 -99 -9 86 215 -97 -63 -233 -67 -34 -88 2 -239 -23 94
4163 94 -57 -107 -10 95 -235 -40 -211 -81 6 -184 303 46 -10 216 -19 -107 289 -104 -24 -23 118 167 -103
4186a03o4L15l7k99L33k66J20R9l54M67l07PM3o0K2J57j20MJ80m04M06j96N0j22
4210a29O2J92o6k21o9M27j66m21K73K82j17j77J53j24L34J28l00j34J02j37K05
4231I7J11l49J16Q1r9j31J18J20L8j92L14l43q4m3K67J54m91L67j05L6j20J06
4253c2K0n0N8O6j37j91J59N1K03m50L37K35l93M1L03k70j02K55L3j64P3n8O8j19
4277f4K14j77j11K9j61P7J30J60j71K17P8l57r6L21j95K06j95J51K9n7j16k05
4299b93J82j25L30N2L2m00L18j97N0K1J08%j3j37J87J20k56r0K82k23q0L6Q3K5
4323A2k21M73k23Lp5K9K3k6k93O84l89Q6k93M21J24m89J08M09l64k45L04O4j59
4346c7p3j0L04j91j54L33j73N2n6R8j24j87L05P7q0l92N7M19j78k36M69j82j6
$$ plain form
4186 -103 -167 148 111 -188 145 -121 -1 98 -256 211 -96 -89 -46 -106 -84 73 -47 -43 137 -267 139 -57 -7 -129
4210 -129 -67 125 59 -162 -231 196 30 -391 -118 164 47 -130 23 -101 233 361 61 -73 29 -108 97
4231 97 208 -141 -25 56 -43 -174 -56 64 102 -90 224 -119 -203 -246 21 175 -316 51 -54 -18 -138 -32
4253 -32 -12 -62 -4 62 -75 -266 -107 -56 147 -303 34 269 -124 -83 220 -50 -152 103 136 -28 45 -13 55 -64
4277 -64 150 -27 -138 -109 -270 -193 -63 97 -74 143 221 -136 -232 89 -106 100 -95 56 85 28 -88 -293
4299 -293 -111 -236 94 146 178 -222 96 -101 -51 -30 78 78 65 -72 115 235 -21 -111 171 -52 -132 -96 -13 12
4323 12 -209 264 41 44 -31 -2 21 -5 -298 386 -3 83 -210 211 335 -154 -46 363 -1 -246 58 122 -37
4346 -37 -110 -120 184 -7 -161 172 -1 51 -5 93 -31 -218 87 164 84 -308 -251 168 -10 -246 223 41 25
4369B5n1Q0J0j78J17j09K85k69Q4J19K65m33%J0j60j10K31M8n6JJ51J31m16K96
4393G1J92l25Nj8J10J10l24J83M46m79J98j29J91j53l32M49l21P8p5M40n07K81
4415I1K7j59j68o9L89l9j05k3J33j04k09J4K76r1j46L8K51pj32p5L11k42J1R9
4439G1Ql68K40Q9J46k74O7J13j6j01J81j41Qp2j47L86n1nj94L13m15n4K29J35
4463A48m33L59L55m52K7p3M1J92m34K17Q7n8j20L3R2r3J12L1Q4l12k6M37j89q5
4487f0J91n3j26J03j09J7K8k00M04k63r3J59L10k67j3K12k26N4l23K54Q0l28Q9
4510a60P4J39k45K07r3L89m23Q3O4j81J71j1J07k80K2N6M30j90k10K72j19l08
4532b06J86Q1N4k74oN38l51o2r7K89O7l46K54K87n91j12L11K68m10J4L78j79n32
$$ plain form
4369 25 -26 54 64 -114 3 -106 179 -90 -6 113 378 -55 -55 -45 -205 -315 -84 -36 -92 -91 60 191 -225 71
4393 71 263 -62 -57 -75 35 145 -179 4 450 -29 169 40 231 78 -254 195 -126 -48 -123 317 -190 91
4415 91 118 -41 -209 -278 111 72 -33 -56 77 -27 -236 -222 54 -37 -183 -145 106 99 -33 -108 203 -39 -28 71
4439 71 79 -289 -49 40 186 -88 -21 92 76 -25 156 15 23 -49 -196 190 139 134 -60 253 -162 -216 13 148
4463 148 -285 74 429 -23 4 -69 -28 164 -270 -53 34 -24 -144 -111 -19 -112 0 31 115 -197 -223 214 25 -60
4487 -60 131 78 -48 55 -54 -37 -9 -209 195 -68 -161 -2 308 41 28 240 14 68 -255 -1 79 -249 -160
4510 -160 -86 53 -192 15 -78 311 -112 -29 35 -146 25 14 121 -159 -137 -81 349 159 -51 221 102 -206
4532 -206 -20 61 115 -159 -165 373 22 -40 -137 152 219 -127 127 414 -177 -289 22 290 -120 -106 272 93 -439
4555d39K84N90n81M8N7M45l02k03J24L4Q7l95K75J9k9j57M34k8k58n2K99j84l64
4578b96L92j17M6j27K35L4l73J13P1J72k10j9J42j83J08J95l48K84l0p1R2j41
4600c1l4M5J17k32n2O36l6o19MK75j67q7P0J66J17l54J91k5r5nN2K79k25k36L81
4625A35j75J11k91M80j03n33K61K56k76P1m8K97l93K12j23Q8k24m4M16j49nK6
4647a1K9J98m60J27R1j2n1J81q3j23N0K49J09l70q1Lo4J48K07J85n39j28L48K17
4671B20k01J6j94K07J37m68L35m3R2k2l43J51j90J07J54P9k3N7P3k66j15L20L14
4694C97m05j14k9J8J13n6j6K33l12K89l02J10K41J0J79l03k5N1K3l10N0J15J56
4717A13j07j37k9M15j89l09R8K73k93L82j27j60j3P0J65k13J04J31N1l52M22r4
$$ plain form
4555 -439 -155 435 -146 -98 -41 404 102 -101 23 57 144 -251 24 43 14 -143 291 263 5 -47 252 68 -296
4578 -296 96 -21 25 -102 133 167 -206 -93 -22 150 -60 -79 63 -120 -12 183 -165 119 89 18 110 -31
4600 -31 -65 -20 97 -135 -187 449 413 -206 -202 73 -94 -181 -111 55 172 -182 9 -16 -111 -116 -64 215 -10 -246 135
4625 135 -40 71 -220 260 157 -376 -115 141 -135 -64 -112 185 -208 4 -119 -31 -255 -299 117 -32 -37 -11
4647 -11 18 216 -244 -117 -26 -38 -89 92 9 -114 -64 185 294 -76 -157 -154 -218 -70 137 322 -217 -345 3 220
4671 220 19 35 -159 48 185 -283 52 9 101 79 -264 -113 -303 -196 -42 37 14 71 144 -122 -237 83 397
4694 397 -8 -122 -151 -133 -20 -76 -92 141 -171 118 -184 -74 167 177 356 53 28 79 102 -208 -158 -43 113
4717 113 6 -131 -160 255 66 -243 -145 128 -165 217 90 -70 -83 -13 152 -61 43 174 225 -127 295 201
4739B01j82j90J39p8K04o8M7o6j55q8K63l8jk50K19n1K38j53oM7k0nl2K0l0M0
4765Ej18k03J84O9L21l47j09K72O6pj09K00j75kj21M8J7l8j08J64j17R1P6l1j82
4790a54l4J69J4J68k32J38j2q9j36K00j35J53qn9k0l8m8J31J21o2j13PK8l7M7
4815aK79k26j11m8K27o5j07K04j59p7J77m7j01N8L0P1l34N9K4J65K44l96K06r9
4839b7k29R3K36k8k39M63k13r0J66j52l3J61p2J35k96J28j5Q9q9J72j26j9j58
4862a43K49k66l9L05j37lJ60k9P2l25J13L13m13N1J66m7J3M8k20o0n2J25L10j38
4886E3J55k81Q3j8m3j49L39j99q7J21j24J97J13k89R1Q9n1k92K33P9Q3Q1l01N8
4910e9J41J08l34K59J6p7j8m1j69L48o9j99M31m16P4j44Q6L2J23R8l12m1K09n3
$$ plain form
4739 201 19 -171 -32 -110 94 26 73 7 -148 -236 27 -11 -12 -262 -43 -94 144 -9 -15 32 12 7 -25 -5 -35 5
4765 5 -113 -316 -132 -63 258 -89 -198 74 140 133 24 224 49 47 -74 -26 -9 -47 -155 9 -108 -17 59 28 -154
4790 -154 -188 -19 -5 163 -69 69 57 -32 -168 32 -103 50 42 -17 -37 -75 -123 8 129 67 -46 -39 -11 -48 -1
4815 -1 278 52 -59 -107 120 55 -52 152 -7 -84 93 46 -55 3 33 104 -230 -171 -147 18 262 -134 72 -27
4839 -27 -256 -163 73 45 -194 269 56 -34 132 -20 -53 108 36 171 -125 3 -12 77 -12 160 34 15 -143
4862 -143 106 -160 -199 106 -31 -34 126 97 169 -156 -43 270 -143 -92 74 27 40 88 -132 -192 -244 -119 191 53
4886 53 208 -73 10 -8 -51 -200 139 -60 -147 -26 -150 47 160 -129 -38 51 0 -292 -59 20 103 184 -117 -59
4910 -59 82 190 -144 115 131 54 36 -5 -174 174 105 -94 337 -79 -5 -149 -63 -31 92 190 -122 -163 46 -7
4934gJ02j48j18L79O1k96J50k8j30k61M20m3k84K09J97m80K88J14Jk03j15K56
4956F4o4j01K57j02K02j61L3k43J65k65O5K60l64N9K84j22o8k85Q5J20M5j4L9
4979a11J14K46m87M47k0k05p0L86m53K20K6j1O9K1j44k6j8R8M5k03K67j15k99
5002b23J46L00j53j40N5P4j28M5oj01K14m3R9n8m5J41l70M7j53J30K81k34J7q6
5026a91K43j99J68k25L05j15l1N9o4k95L27q4j37J88j2MO1J3Q7j79M8J70k05K34
5050A70l89K22L09o7p5Q8k81L56m29J20k04L77j27P5n8n5k82J99ML01l97J67J14
5073A38k34oK04m0j76K91k0j30J81O9l58J29o0M4PR7k29K09j09O9K65m12j75K08
5097c8J7k91L80K76l14l2K02j97l9J21k00L8J77o5J4r3k29N2p9L96j19J11J5p8
$$ plain form
4934 -7 95 -53 -171 208 269 -27 123 95 -35 -296 124 81 -203 6 203 -277 11 125 126 -77 -192 64
4956 64 0 -101 156 54 256 95 128 -115 50 -215 -150 110 -254 -195 89 -33 -101 -386 -301 -181 -136 -150 -111
4979 -111 3 249 -238 209 189 -16 -86 300 -153 67 93 82 151 172 28 2 -16 82 127 -76 191 76 -223
5002 -223 -77 223 70 -70 -15 59 -69 -24 -30 -131 83 40 139 81 36 177 -193 -146 -299 -169 112 -122 -105 -191
5026 -191 52 -147 21 -204 101 -14 -45 14 -50 -345 -18 -102 -239 -51 -63 -59 2 15 102 -77 -29 141 -64 170
5050 170 -219 3 312 245 170 258 -23 333 -96 24 -180 197 70 145 87 32 -250 -51 -47 254 -143 24 138
5073 138 -96 -102 102 62 -114 177 157 27 208 277 -81 48 -12 32 39 136 -93 116 7 76 341 -71 -246 -38
5097 -38 -21 -312 68 344 30 -2 200 3 -36 85 -115 -77 100 35 49 -44 -273 -221 -300 96 -23 88 103 25
5121B5R8l01Q1P7J36j72k11K31J82k23K4J38k37L63k27R3j3m4k44L31r4K9k21
5144a79J68o4K44j04o3Qr4L12j97K44l02K79P4k86j18K16nm11M68qk39J3m7K05
5168A14Q4N0k08j6K04l84P2K05j24K07j68o3Q6n0j40J44o9J80k61J7J96j36P1
5191A1m1N8O3J00j73j33K00r8Pj77K15j16j65J99L7J60j88j43R2J92l3j8K69k56
5215F2R1o2j0l4N1j53j00K05jk9k16L12Oj98L92k25O6k58p0p4N6J84j39Q3Kj08
5241a67J80j48KJ77l3J16q0J18j16j22K08Q2k20P4j61J35O6j9J60j44l25K38J59
5264A80K4M8q8o4L0k40L66p3n10L79k07K34J03l76J74j04j9J13J47n1J1K31m08
5287a00o1R0r9K44O3M8m24J50QJ04J50k54r1K39O2L1k8j08J45j39k28K89l96N81
$$ plain form
5121 25 123 -178 -97 -20 116 -56 -267 -36 146 -77 -53 85 -152 211 -16 77 64 20 -224 107 13 42 -179
5144 -179 -11 -75 169 65 2 10 -84 228 31 275 -27 252 326 40 -78 138 133 -278 190 182 -57 -44 -91 114
5168 114 198 248 40 24 228 -156 -84 121 -3 204 36 -27 59 9 -131 13 -56 124 -137 -120 76 -60 11
5191 11 -30 28 91 191 18 -115 85 -13 -6 -183 32 -84 -249 -50 -13 147 -41 -184 -92 100 67 49 318 62
5215 62 153 91 81 47 98 -55 -155 50 49 20 -196 116 122 -76 316 91 157 -101 -171 -245 -189 -5 -144 -61 -59 -167
5241 -167 13 -135 -133 44 11 127 47 165 49 -73 135 217 -3 71 -90 45 111 92 252 108 -217 21 180
5264 180 204 252 164 100 130 -110 256 183 -327 52 -155 79 182 -194 -20 -124 -143 -30 117 66 77 308 -100
5287 -100 -161 -71 -170 74 137 185 -239 -89 -81 23 173 -81 -172 67 129 160 132 24 169 30 -198 91 -305 276
5311B76k71J10m0k48J41K40K1l38l9J42J17l46J30L5J59j90K47j53O9j24L8J69
5333A45j69K21k65J28j36J54M0j80qM7J24k96J39L13j39k15J81J1Kk44J9M2J81
5356I5N5k44J15R5l15K23p1K14j28J11k75j4J07K08l79K77J4k00K17l90L05R4
5378A14r2j86L08o7j32R5N8l74K98r6k72L75q6Qj48K95j19k2m6J8p5M07k33k77
5402b49K41oj05M39k05j63m0l8L04j15k81J11K20k37L06j06o3l24L90j14K57k56
5424c4O5j17j41L34M8m4k26QO7J58j52q8j3J58m2k7L52l50J50k73K15o7m4j14
5448a77J15J44k54J00K77No5k62J1R6l2l1k1j18K41J3J75O3m87K62j85L12n2n3
5472G7o8J29K6l1k35j1P3j39K18j16kO6R0J5mj01O8r4L03k47R8k6O5j53k51K34
$$ plain form
5311 276 5 115 75 -173 -32 208 229 -109 -148 -6 111 -235 -105 -70 89 -101 146 -7 62 -62 -24 145
5333 145 -24 197 -68 60 -76 78 118 -62 -70 -23 101 -195 -56 257 118 -97 84 95 97 -147 -128 -86 95
5356 95 150 -94 21 116 -199 24 -47 167 39 150 -125 -139 -32 176 -203 74 88 -112 105 -285 20 114
5378 114 22 -164 144 77 -55 40 98 -276 22 -74 -346 29 -57 -49 -197 98 -21 -43 -89 -71 -146 261 28 -249
5402 -249 -8 -14 -119 320 115 -48 -88 -126 178 63 -218 -107 113 -124 182 76 13 -311 79 -35 222 -34
5424 -34 31 -86 -227 107 155 111 -115 -107 -40 118 -34 -122 -135 23 -19 -46 306 -44 106 -167 48 -19 -63 -177
5448 -177 -62 82 -172 -72 205 210 145 -117 -106 -10 -42 -73 -94 -212 29 42 217 280 -207 55 -130 182 130 77
5472 77 9 138 164 133 -102 -113 -40 -179 39 -77 -79 -13 77 92 88 -13 55 -39 264 17 115 89 154 1 -250 -16
5498a6N6Q2K1R1k57j0mJ3p7R4l3J62k42L04r7p6j9RONJ73j99L94m22QR6o6J78
5526A74k84J91j42k53L25R8K92k80J16O9o64M02p1J05l5k18K97q2q2K3R7k05L79
5549B52k80K16r5l1O2m3M8k79J40o3J27p2m1J78j59q4J2j10O6J82n0q0K50nk31
5574i0m2L02j51o6ol0R7L06j13k37JPj84J10K34L7j64M7Kr1m7j24K50mJ11j65
5600a0j1N4j00M7J04l3p0j0k65J74J66Qm39Q4K34J43k1P4j66J63j38P9K4j22O3
5625C2P6n8j83Q3k4K13j31J37o9Q0k24N1N4J16L2j64M1J1k10M6J70J52k6j07r
5650H9k81K83n5l7J29l23K78j07k17n2K62J32j4k30L49l62P5L79j92n2k87L15
5672H2p5J30O9k73J49j03R8m9q9jK60k58K36m36M41o2j82R8O6N9j8k84O9j78K82
$$ plain form
5498 -16 40 122 143 234 -23 -33 -37 -24 -101 -7 -40 122 -120 184 87 11 -8 1 7 12 185 -14 380 -42 -34 62 -4 174
5526 174 -110 81 -61 -314 11 109 401 121 237 306 -358 44 -27 78 43 -175 122 40 -42 -19 78 -127 252
5549 252 -28 188 93 62 124 81 129 -150 -10 -73 54 -18 -59 119 -40 -124 -112 -222 -156 26 -24 -104 146 141 -90
5574 -90 -132 170 19 -47 -53 -83 14 320 207 -30 -29 -22 -206 -96 138 175 11 58 60 -31 -78 -202 48 44 155 -10
5600 -10 -21 33 -67 -20 84 51 -19 -29 -294 -120 46 54 -385 -301 -67 76 55 129 -37 126 -12 67 91 -31 32
5625 32 108 50 -133 -50 -74 139 8 145 76 156 -68 -17 37 153 185 21 62 73 -137 -91 79 231 205 98 89
5650 89 -192 91 36 -1 128 -195 83 -24 -241 -293 -31 101 87 -143 206 -156 -81 298 106 54 -233 82
5672 82 7 137 206 -67 82 -21 77 28 -61 -62 198 -60 176 -260 181 119 -63 35 101 160 142 -142 -73 -251 31
5697C1N5J12r1m62L38R5m6j85M56j65k57p7K19n5J08q9J32m2l19J01K53k7r9j90
5721b04M72n49k8N95k26k87O2J98O4k3q6Rj33J17J50m0j10j34K09Qj7Q8j37L41
5745C39n98L05k47J51k07Q6L35n00K19J62k7j37k67K32L94k0l34J40O0k94K32
5766B4L3J7k9p0P9M9m71L84N91p88j51J66K83j48J11J61j08k45j15m2L49n3j10
5789h3L16l36J8l6K59j81J8k1J11j81J02K0p5J16O6J03k2k99QL56q9l95J86O5
5813B6K3q9n8K93o2l00L01o9k18K68k30K43k52J85K32o76K09P7K16k30mJ18j13
5836a10J26K4Q6m19J10J14J44j00k40K67op7N9j9M5q0l6K48K7l58J89j20J99k75
5860b02P1M48k57m2k02J95K62m50K62K10l28j70K94j94r2M6K38q0k11J2M48k11
$$ plain form
5697 31 86 198 107 -355 -17 78 32 -153 303 138 -119 -196 23 -32 76 -13 119 77 -242 -141 112 85 -14 -204
5721 -204 268 -281 -309 286 60 -227 -165 33 97 74 -12 -3 -136 -19 131 91 -19 -153 56 64 47 135 -2 339
5745 339 -259 46 -201 -50 -257 -171 164 -336 -117 45 18 -119 -386 -154 240 220 -114 26 86 -208 24
5766 24 57 74 45 -25 54 103 -368 16 607 -181 -332 -166 117 -31 80 241 133 -112 -227 -269 80 27 -83
5789 -83 233 -103 -85 -121 138 -43 -25 -46 65 -116 -14 6 -69 47 113 216 194 -105 -97 259 170 -225 -39 26
5813 26 49 -40 -98 195 133 -167 134 65 -153 115 -115 128 -124 61 293 -383 -174 -97 119 -111 -115 3 -110
5836 -110 16 40 126 -293 -183 -69 75 -25 -265 2 -4 -81 -22 -41 4 -76 -112 136 163 -195 -6 -126 73 -202
5860 -202 -131 317 60 18 -184 11 273 -177 85 295 -33 -203 91 -103 -195 -149 89 9 -202 -190 258 47
5882D7j2nJ24j86m4K84m11N17m95J12M09k84j15J00k2l62M31P0j36j08O7L88n45
5905a76J57J03K7j92Q9j1K68l76K9J48j50K65k68J10J5j75L1J34Q3k03K65j15
5927E8j24j73L63j59J7%R6R0k12K5K87k49l8K37l01N8K71k46k7R9k39M45j51k51
5951a24J00L77m38j08J87K68m3n31K80O0q8j41Q0J07j6J19j5j09m01M27qJ10m15
5974c22M38j61L01k63J82n3o0j46J69o6j61m1K63o1j10n3J41k5Q2M4J47k25l41
5997c21K63Q4j65n7J6K51j33P4O8q9Q5j18K22L0m42K29rj2j13M07ol38k9J50J5
6022F2j3o1Q2j24k48J0O56p3k31J04m2Q1m24O55m23J25k55J08J98m99L27J97k86
6045g4o0K53P0k66k83K74q0L1Q2Q6P6j82J56K75n64K40j88L23r7j96J75J45N4
$$ plain form
5882 47 35 30 154 -32 -76 208 -203 314 -181 -69 340 56 -59 41 19 -343 88 158 22 -86 -19 369 -176
5905 -176 -19 84 111 -81 8 -3 265 -111 -82 66 -84 181 -87 23 38 -137 -106 28 111 -92 173 58
5927 58 -66 -239 124 -35 -18 -18 78 168 -44 -19 268 19 -19 218 -83 -25 246 0 -27 72 -167 278 127 -124
5951 -124 -24 353 -85 -193 -6 262 219 -312 -32 28 -60 -201 -121 -14 -30 89 74 -35 -436 -9 -17 93 -322
5974 -322 116 -45 256 -7 175 122 62 -84 85 19 -142 -183 80 19 -91 -144 -3 -28 54 98 245 20 -321
5997 -321 -58 26 -139 -196 -180 71 -62 12 80 -9 76 -42 180 210 -232 -3 -12 -24 -137 270 264 -74 -103 47 62
6022 62 49 -12 70 -54 -302 -292 364 291 60 164 122 203 -221 434 11 136 -119 -11 187 -312 15 212 -74
6045 -74 -134 119 189 -77 -360 -86 -166 -135 -53 33 109 -73 83 358 -206 34 -154 169 72 -124 51 196 250
6068B50l47k55M41l4j33J5J56m0m2l1M5j4O2K5q8l1P7K64k60k65K85j47K4j00
6092a43l2J91l15L02K05k17R4j96J83j78r2J48K29k50m1n0L56j34j23K88l58L1
6114a02m9J43r8K35m0K40m94J49j35J34j12k56J92L01N4k64K24k23K08p1M9N3
6136A38l46l2K23M4j95o2M14j98M0p8L21l24k9J79j96p0M77k07j84j4j29K71m
6159C9L2P5j19p7k1L9NL7M5R4r6j23K2L72k02J3L2Jk90L2J93j19j65L67R0k23
6185E3J62Pk33N6J20Q7k08j39J35P3j02J40j62l9K15m8j48J39j45p1R4r9K32k8
6209I1l12L85l16K05k6j29J91k80O7J47k18L34N0Oj57o0K38m3k62NL15l35J31
6232B7m6J40n46L73j66L58r2J9M7l52K05J04K9L5j92J3R8q0o7K42L7l28L28j20
$$ plain form
6068 250 -97 -352 89 55 -78 -63 93 53 11 -20 25 11 73 98 10 -21 56 320 60 -205 80 -67 -43 -143
6092 -143 -175 16 -299 3 208 -9 85 -111 72 -106 -198 -50 179 -71 -112 -162 194 60 -63 225 -133 -102
6114 -102 -151 -8 -106 129 89 329 -165 -16 -151 -17 -129 -385 -193 108 162 -102 122 -101 107 36 85 138
6136 138 -208 -240 -17 27 -168 -230 184 -14 26 -52 269 -55 -84 95 -101 -171 306 99 -85 -99 -228 43 39
6159 39 71 146 27 -50 -71 -32 -27 10 55 149 53 -70 -48 324 122 135 167 168 -122 -90 103 -16 -181 186 276 53
6185 53 215 222 -11 45 165 252 44 -95 40 113 11 151 -11 -50 165 117 -31 108 -37 -108 -14 -113 119 91
6209 91 -221 164 -152 53 27 -102 89 -191 -124 23 -195 139 189 195 38 -22 216 173 -89 -84 231 -104 27
6232 27 -19 121 -425 -52 -218 140 48 67 114 -238 -33 71 100 135 -57 -44 54 -26 -93 149 186 -142 186 66
6256F6l48K75L02l57j18J68l71L79r2J85j64J17q6rj84P2kR9Q5j5N2p3J07j53
6280f5n0L73k39Q1l53L08q8k01M05m13J27J6k3J32R8j34N1M0m5K6R8k08J43P1
6304A50rj59rl7L0k31J57J03l8L19l58N7q8Q5R4j92J73l7N9j29P0K30k92R0O6
6329A04j71j9L44j11j59O0j39Q4J07n7j1o2p2J84j47k18K10K45k50r9K52j66J05
6352A4J70o9j39j04J84k4L0l46K20k2K10j01j00K13j23K11j48k4l8P4k25L71j10
6375A24q6K6l1r3Q1q8J11j03J07j36j36L15j72P3j31K35k26K30k22O8M13l76j53
6398a70j06M19r5R6j23n1J47j11j66K39j48J50j8K4r7N5K89m20m1l8L17j55J08
6421A05k20J2j56J96J28M4j54j9k18K01J3j99L22Q8k77oJ94J1J31l41N6K28l00
$$ plain form
6256 66 -282 -7 295 -62 -180 -12 -383 -4 -96 89 -75 42 -44 -53 -237 -165 -167 -68 17 2 54 -19 88 -65
6280 -65 -115 258 19 100 -253 55 -33 -234 171 -242 -115 -99 -122 10 108 -26 25 65 20 46 144 -64 79 150
6304 150 141 -18 -27 -64 -34 -265 -108 -5 -43 276 -82 -25 -113 -28 66 -126 47 10 69 -60 10 240 -52 38 104
6329 104 -67 -86 258 147 -12 48 -91 -7 100 43 32 -30 -102 82 -65 -283 -73 172 -78 -177 75 -91 14
6352 14 184 115 -24 -128 56 32 62 -284 -64 -86 124 23 -77 136 13 224 76 52 14 88 -137 234 124
6375 124 38 64 33 -60 21 -67 44 -59 48 -88 -224 91 -81 -8 -139 96 -130 100 -122 -54 359 -17 -170
6398 -170 -276 143 48 144 21 -30 117 6 -160 79 -69 81 63 87 -10 45 334 -86 -127 -165 152 -3 105
6421 105 -115 -103 -259 -63 65 109 -45 -64 -282 -81 -68 -267 55 143 -134 -140 54 65 196 -145 -89 139 -161
6444a61M9L8K60r3Q0l92MK53l7J35k18L5J35l5k9n5j4J33j20lk46J78K90m56J87
6469h2k4L66k58R3j74k79P91n56L0k6K2j22M38l52K67j29Q2n0P0k03K09l40L28
6492A01m1q0J78l5k43n9J52J15r7K32l37J75j71J96j3l03J42L2J65q4j37J7p5
6515a70M43k46n0j92K31J38k55p6J91J35j10r1J09k58L41Oj63J01k1k55L63j31
6537D0o3q0J20o7%j17L3J7N6j29K58o4o9k04J63j29K31j18J52j64J37j71K72j68
6561f4PK8m6J34k13K98l48K49p9j38L01j27K37j72j2j17kkr9K57L17n10j42N0
6585a93N5L63j60J5j57Q6n9j84K34l0M8O4l9j21p9R4J17K48m81K75r2J10k17K39
6609A36q6n3P5p5O6j22J78k22K24k22N6Q8J9j58n0J71M8K67l14jn6N4L5k24Q0
$$ plain form
6444 -161 -112 -74 186 93 173 -219 -215 38 1 136 -82 -47 88 53 24 -31 -45 88 -32 -35 -281 -103 187 -269 -82
6469 -82 -106 260 2 95 -79 -358 433 -123 -93 -119 -97 -219 219 -133 134 5 87 37 107 -96 113 -227 101
6492 101 60 -20 158 123 -120 -179 -27 88 -9 223 -114 61 -110 86 73 -230 -88 -56 109 25 -112 -95 -170
6515 -170 273 27 -23 -215 16 154 -101 -177 14 149 39 -52 57 -201 140 146 -17 84 63 -192 171 40
6537 40 -23 -103 17 -50 -50 -167 -134 -117 -61 -190 68 4 -65 -269 -106 -235 -4 -122 30 -134 3 -168 104 -64
6561 -64 -57 -29 -75 59 -154 144 -204 45 -34 -172 129 2 239 67 55 -62 -64 -66 -165 92 409 -101 -243 -193
6585 -193 -138 225 65 80 -77 9 -50 -234 0 -30 18 82 43 -78 -157 -63 54 302 -179 96 4 114 -103 136
6609 136 50 -3 72 -3 63 -59 119 -103 121 -101 -45 43 62 -96 -146 25 73 340 26 25 -31 23 58 -166 -86
6634h6J17p2k37M42m05M27q4n6k98L57k36p5L10k09K37p8Q3k20J53q1k31J92L10
6657B60k12k2j25L02m32K44k27n0K72j85K73J12k36j35K69k89L82n55L93J06j5
6678A30n0j37L17j96l58M19j78j58K06k08M29l41J67k98L61j24p7R8M2q6P4K07
6700B39k28OJ12j37M7p9R8j73L5qp8J6Q9P4o3O2N1J9j33j9O8J38j40n6Q8j42K12
6727I8m60K61K96k23j60J03m02M82jj11J79k15J43q3J4l6N3J84l74M05j13J21
6749A61j93J66r6M2n2j48K54j9k12J01O9j78m1J72k5l9n2l4J92j2j18k5J97l1
6773G9j17J02O8j41j91J00K31Qj10j21P6qr4J55K3n4mJ00n7n1r6J8O0o2J54j10
6799d2p8K89k37K6J43j46L7P8J39l85J28J31QM6k46K0N1m1J78j68J59r9K1LRk2
$$ plain form
6634 -86 31 -41 -278 164 -241 186 102 46 -252 105 -131 -206 104 -105 132 54 137 -83 70 -11 -242 -50 260
6657 260 48 26 -99 203 -229 15 -212 -262 10 -175 98 210 -26 -161 108 -181 201 -354 39 145 130
6678 130 80 -57 260 64 -294 125 -53 -211 -5 -213 216 -125 42 -256 105 -19 -96 2 44 -42 32 239
6700 239 11 17 129 -8 39 -40 58 -115 -80 -88 -166 -150 -61 13 -50 12 63 82 -51 -70 -2 136 -4 -60 28 -114 98
6727 98 -362 -101 195 -28 -188 -85 -487 -5 -6 -117 62 -153 -10 -93 -79 -115 -62 122 -252 153 40 161
6749 161 -32 134 38 80 28 -120 134 115 -97 4 73 -105 -146 26 1 -38 -90 -124 68 56 -62 -87 110 79
6773 79 -38 64 132 -9 -200 -100 131 139 29 -92 -16 -24 -118 37 60 6 2 102 45 -6 -102 -84 -24 -86 68 -42
6799 -42 -120 169 -68 -42 101 -45 -8 70 209 -176 -48 83 91 137 -109 -89 -38 -79 99 -69 90 -9 12 15 24 2
6825Bj29N6O7r4J13j50O9Q5J63j82k9n3K92l05J62j57J94j85J16o6J59j03j77
6848a52J42J9J10k35J64j25J54j32K23j69K19k1j49n9o7j4J52J2M7l46O5M02j85
6871E5J17k09j94J71J48q6j85J43J23l2Lk9k1p9J88J17k44L7J62P1l34J38j90
6894a30J40j01k39M38k92J07l41M88m8J99j14k61J97m4O8j3j94l0O19n35O5K04
6916A83j85M9l26M87r6j05R4J05j67J12o8k2l11K81l2k53L20p8j58K26k12J03
6938e3J78j61r2k6L03j58k44K47j10K23K8k54L7rm9N5p3L65k44J27j9j62J39J2
6962F0J49j84j76K93j35j2J6j3j6J58Q5k20K7K7q7J17n5j59o1L16r5O8j51J5Q6
6987E3j59J88k52L4P0L19l47Q4r9L52k37l7O8k02L75j24m61L24j35O2r4L37k92
$$ plain form
6825 2 -127 -71 -4 -98 15 -135 -66 19 182 0 -29 -82 210 -95 67 -90 104 -81 35 -31 128 25 -152
6848 -152 -10 9 119 -116 48 -77 77 -55 168 -1 218 197 48 -11 -78 -92 60 72 119 -227 -162 240 55
6871 55 172 -37 -231 -60 88 2 -183 -40 83 51 54 25 4 -75 113 230 -14 23 185 256 -78 60 -130
6894 -130 10 -91 -330 108 -184 -77 -418 70 22 221 107 -154 43 -1 67 54 -140 -170 449 -86 -21 183
6916 183 -2 47 -279 208 112 7 101 206 39 151 83 61 -250 31 -1 -254 66 -12 -170 56 -156 -53
6938 -53 125 -36 -128 -154 149 -9 -253 -6 -116 107 135 -119 -82 -91 -140 -85 -158 207 -37 90 71 -91 48 60
6962 60 209 25 -151 142 7 -5 11 -2 -18 140 225 5 32 59 -28 89 34 -125 -186 130 35 103 -48 -33 53
6987 53 -106 82 -170 -136 -66 253 -94 -10 -109 243 6 -31 37 -165 210 86 -375 -51 -186 -124 -218 119 -173
7010a73POk3R0j0J54J2nl4Q2m19L87K3nm6N6p0p7L84k38k93l9M46j11k17K07p9
7037A5Q4j07j11J1J04o3j89Q6L62j22o3o1Q3j38j64K98J65j38j83L67m02K39k0
7060E3P0r9o3K10j11M4j76O3K40j42k19L09J13l09j1m4J43j23Ml2Kj3l2L4O2j57
7086a84L77j20j08Q0J37k88J74J68k94rj31Q5M3J33j17J78n4k34Q8l1K28k11n6
7109a46K09j22l5K27pJ14l96J93kJ36j86Q1j78N1m2J37l6n4n7J9k17Q1K41j56
7133a45J50J67k14K02j00j30p8L6k15L08j11L87k62j74K46N2k88L44j09r0m8Q0
7155Hj87J26K35N6k27Q6j34K2J86j52Q0j62J94k57J22J42K7k27j23L26l76J10
7177a25Q9M1k09K86j59J2P2j09O0J94l03K45j77J82o8l56N63j05o0n1pRJ69L8
$$ plain form
7010 -173 -166 -160 -183 -93 -103 51 63 58 24 106 -313 74 97 92 46 102 32 -45 339 101 -192 -231 215 104 -113 94 15
7037 15 99 -8 -119 -108 -4 -67 -256 -170 192 70 7 -54 29 -109 -273 25 190 52 -131 236 -166 73 53
7060 53 123 24 -39 171 60 104 -72 -9 231 89 -130 179 292 -17 -28 -72 71 -52 -48 -80 -78 -91 -123 -89 -27 -184
7086 -184 193 73 -35 45 182 -106 68 236 -58 -67 -198 -113 -70 63 -54 124 70 -164 -76 -107 121 -90 -146
7109 -146 63 -59 -94 133 126 240 -156 37 35 171 -15 66 -112 -61 -103 34 -2 -56 -113 -94 -311 -230 11 -145
7133 -145 5 172 -42 160 60 -70 -148 -112 -327 -19 -130 257 -5 -179 67 119 -169 175 66 -24 -72 8
7155 8 -179 -53 182 238 11 97 -37 -15 171 19 99 -63 131 -126 -4 138 165 -62 -185 141 -235 -125
7177 -125 -36 5 -204 82 -77 -65 7 -102 -42 152 -151 94 -83 99 31 -325 238 133 73 22 15 24 193 231
7201B31l25j13J29K19j50j07J02p3p7J88J79L4k14j77J37K7p8J37p8l9K5j95J42
7224g6Q8Q1%J31l11J60J30j60j0j03K60q4q0K13j34k23K07k14m3J10o3m9L96l46
7248a20K19j11L3JO0n9j67J32k9K14o0o1j09K59j8k43J08O4k63L85j17m8k53R2
7272i1L5J2j5j62L47J7k70O1k1J16M8j7O9J9k45J61j08j01o2L71j1j37j04J02
7296A4m5j5J46o2j91M7q7L78J9j62J79j44j62J69j0k31M6J65j95R1j27o3L16k67
7320a91J95M13k77j51J9n3l3RQ8l0j31k2J27P2J26k15lj03L83j45np5q7J34J03
7345A48k75k40M91K2j50j33J39J95j85j8Q1QQ0m16L53j63J30p0n8j21K63j16J56
7368A21K4m42K71K8j51o6L69q6q1q2R7m2m1J71l5j0j36R3Q2l1j08J13J11k21P4
$$ plain form
7201 231 -94 -207 -78 141 -9 -116 -14 -87 -164 24 203 237 23 -154 -17 10 -68 69 -9 -48 -23 -218 -76
7224 -76 12 93 93 224 -87 73 203 43 33 -70 190 106 26 239 105 -118 89 -125 -168 -58 -121 -170 226 -120
7248 -120 99 -12 21 22 82 23 -144 -12 -41 173 113 52 -57 202 184 -59 49 113 -150 235 118 70 -183 -91
7272 -91 -56 -44 -59 -221 126 143 -127 -66 -87 29 77 60 129 148 -97 64 -44 -145 -207 164 153 16 -88 14
7296 14 -31 -46 100 38 -153 -106 -193 185 204 42 221 77 -85 84 74 -157 -111 54 -141 -50 -177 -240 76 -191
7320 -191 4 417 140 -11 8 -45 -78 -69 19 -11 -142 -164 -37 35 161 -54 -57 -160 223 78 73 -2 -89 45 148
7345 148 -127 -367 124 146 -4 -137 2 197 12 -6 75 83 163 -253 100 -63 67 -3 -61 -182 81 -35 121
7368 121 145 -297 -26 2 -149 -215 154 68 -13 -95 2 -40 -81 90 55 45 -91 2 84 53 -55 58 169 -52 22
7393B2Lp5j69K82l9P4j50M1mk08J47J46j09K5n19O18j64kq4M38l34q8m8K49J40
7418A92k34j16M08l29J6rK88j97m3l4r6K12k81J45Q9j74L47j29P7j34K2m0j19
7441a39J5K6J74q1l9J77k46O2J11L1k22J84P0l4Q6l64p5K47k78K73K0NM5k36K25
7466C7J2j74n8J72R3k09j29M38p2O2l93J42Q4J25k1q3P6j80L42k73L2j95L1J72
7490C1J2k31J33L34j38q5K2k29N9J66j22J18j84R1O4n2j65J23L9j46K40K5j02
7513CM6j03J03m1J5n4O1J36j72n9Jj09K59j46o0J18O7k50J37N5j40R3J19mq3m2
7539e0k1k98N85k27M3j88L82Mm01L3N7k69K04J9L52k67R3nl33L04r9K14l77L08
7563F3O6j89N4p7J6J30M2j78Nj6L4J62j45K68l65J15l14L72j05k0J72k30O9K01
$$ plain form
7393 22 25 -50 -219 63 24 98 -52 -11 -15 -223 -76 70 -39 -14 -533 85 -79 -81 -165 273 -61 -149 -197 52 192
7418 192 -42 -158 250 -79 -63 -72 216 19 -24 -58 -154 58 -223 -78 11 -163 184 55 132 -2 20 -20 -139
7441 -139 -124 -98 76 -5 -44 133 -113 -51 60 91 -131 53 123 89 175 -189 -264 -17 -295 -22 -2 3 48 -188 37
7466 37 49 -125 -183 -11 82 -127 -256 182 110 172 -221 -79 5 130 109 26 102 -78 264 -9 23 -172 -141 31
7490 31 43 -188 -55 279 141 56 78 -151 -92 74 -48 70 -114 -23 41 -11 -176 -53 -14 -160 80 105 3
7513 3 49 -54 49 8 23 -31 30 166 -6 -65 -64 -173 86 -60 -120 -2 65 -185 -48 7 -133 -40 79 75 -8 -50
7539 -50 -71 -369 216 -11 32 -156 226 230 -171 -138 -81 -350 -146 -127 225 -42 51 46 -287 17 -82 132 -245 63
7563 63 129 -60 -6 -83 -67 63 105 -73 -68 -84 -50 112 -33 235 -130 -15 -329 43 -62 -82 90 -140 -71 130
7587A30l24P8l7K25r2K03m01J39j61K37J15k33L9P1J51l85M26j90J65p4p5j48
7609a41q8J47K28j22P1j78J6P8j40K67L7k31o9J75j02K7Q6J56l12j7p5k1J01J21
7633A4J17j75L60P5l21nj53m2J74K56k81J03j28J50j34O9l13L53r2k71K16K8l36
7656c36N5L74j09j07K24j85N3Oo9m4J55L55k00j25j73L07k38N6l3K6J03M6j33
7679Hj90J22K42l41J00K13l4j0k02J80J12j37P4j74k99M95m56P7M68j63Nk31j05
7702b46L05j50K00k07R6K67j43j18o7L1j06L49k59O2J18k95M6K22q3j2K2K20k84
7725c2M8P4m0k58j00L32j53J85j0L0Kl12J67o2J02j75Q7L10j78j26J68J8j56L5
7749d4QL9N4j97M2Q8k9K17k65L50j81k28K83j08K1O1l4k39N2J79N1j3M3m15K45
$$ plain form
7587 130 -194 -116 -153 72 -20 183 -218 -79 -240 -3 112 -121 -82 -11 140 -245 181 -9 156 82 7 -141
7609 -141 -229 -82 146 24 95 -83 -67 11 -129 138 175 -56 -125 50 -52 -25 61 217 -95 -112 -187 -208 -107 14
7633 14 131 -44 316 391 70 65 -88 -130 44 300 19 122 -6 144 10 79 -234 119 27 -244 -28 0 -336
7656 -336 -281 93 -16 -123 101 -84 -31 -25 -94 -138 17 372 172 47 -126 181 -57 -1 -34 -8 95 141 8
7679 8 -182 -60 182 -159 -59 154 120 110 -92 88 200 63 137 -37 -336 159 -297 -220 248 85 90 -141 -246
7702 -246 59 -91 109 -98 -2 265 122 4 -63 -32 -138 211 -48 14 132 -163 -117 105 22 10 32 252 -32
7725 -32 16 90 50 -208 -308 24 -129 56 46 76 78 -234 -67 -129 -27 -202 -115 195 17 -109 59 77 -79 -44
7749 -44 -36 3 57 -140 -98 -10 -39 178 -87 263 82 -146 137 29 50 111 77 -162 -110 69 120 107 150 -265 -20
7774b0J28j8P1j50k08P9K2N1K89j2j30j9P0j21J48j11k5n9J49k00J40r6M1P5k5
7799F9j00J62r2k01K37R2l92L9K34j3M1j46PJ24l58k6N38j82j14r2K18p2lJ53
7823A23N5j97J97k05j89K61m8k79J83k5qK76K6j69J00j93M8L2J6K6k31J56J04
7846E9J1k41J42N7j54P6Q1j55p3L07j42qK76l08J3K8Oj05K30l1m4p4M2j3J33p3
7872D0O0O4j69J72N1J5k38n3Q0k32o0M80k25k24L04j95J03j1n7J25l8q5m7K86
7896A46M0l78L52j04k09NK18l7j7K78l43J27j24nR4k8J41l71J33J57o0j45K05
7919G5l48K96j59K0K03j17J19p8j02J49j60J1l2K05j32J37j74K0j18K37m3n00
7941d91O78o30L51L03o4q3R1j31L91m12R2j27mj1M9p3J64j59L2O2J4m6j67K46
$$ plain form
7774 -20 108 90 161 11 -197 -118 -96 -45 244 232 102 83 153 32 180 69 44 -15 134 -66 74 -22 19 94 69
7799 69 -31 131 39 -162 75 167 -225 -186 48 35 76 -70 -63 61 -297 -323 215 33 -81 -173 45 -27 -30 123
7823 123 178 -19 178 -27 -216 45 -3 -282 -99 -124 -132 144 170 1 101 -92 -44 -12 4 30 -201 -45 59
7846 59 70 -171 -29 28 -126 -50 31 -124 -197 110 -32 -40 236 -72 -59 -31 -25 -130 100 69 25 -49 -7 -20 113 40
7872 40 100 164 -5 167 218 233 -5 -58 22 -210 -270 210 -15 -239 65 -130 -27 -38 -95 30 -8 -93 -140 146
7896 146 186 -192 160 56 -153 -148 70 33 16 294 -49 78 -46 -51 43 15 156 -215 -82 75 15 -130 75
7919 75 -273 23 -136 -116 87 -30 89 11 -91 58 -102 -91 -123 82 -50 87 -87 -67 -185 52 9 -491
7941 -491 187 -443 -92 211 147 64 155 24 415 3 95 -32 -36 -47 2 -71 93 -66 -34 28 42 -4 -171 75
7965G5j66l1J16K06k72O3j97O1M04k55j02L3rJ81r3J60l29J00J90m4k42J79K3
7988E1J81k74qP3K83l13J0m6j09L61k70Q9J68k71J94r6Q0o7J9K4j66N4j31%L98
8013B34l80K45j45q4M7L2O5p3K15l51K41R5k92L00o6l8j40J64k03K7K06L2q7N4
8037I8p2j19L9L3n3J63P1l25J48p9k4K64J34k76o2K72k86Q2J10M4j26l5j30L55
8061B26l42j7J76j61n7J98J11K0k9p9M1r6k27K28K2JP4R4l18mO5J33j84R7k64
8086b92L70P4k72K47j83j26J74J67k45M18k07o9k5p4N8l0K46k58J17j4p6p6Q3
8109Gj60K73j39K70j62j98Q1K9M5r2p8J47j03j6L41j29k23K07l2J19q0j93L08
8132B22j36p7OP4k88K29J94l8j87J14n1J60j25j83MK79j61j26Q0J75K13l11K8
$$ plain form
7965 75 -91 -122 -6 200 -72 -9 -206 -145 259 4 -98 -65 -74 107 14 174 -155 -55 135 91 -151 28 51
7988 51 232 -42 -50 23 306 -7 3 -43 -152 209 -61 28 196 -75 119 23 103 36 55 79 -87 -33 -164 -164 234
8013 234 -146 99 -46 -130 -83 -51 14 -59 156 -195 46 141 -151 149 83 45 -95 69 -134 -107 99 131 44 98
8037 98 26 -93 -54 -21 -74 89 160 -165 -17 -96 -120 144 278 2 -60 212 -74 8 118 162 36 1 -129 226
8061 226 -116 -133 43 -118 -175 23 134 154 125 46 87 -9 -236 -8 14 15 89 183 -135 -139 -74 59 -125 -28 -292
8086 -292 78 152 -120 127 -56 -182 -8 159 -86 332 125 56 31 -43 15 -15 231 -27 90 76 0 -76 7
8109 7 -153 120 -19 251 89 -109 -28 1 46 -46 -124 23 -80 -96 245 116 -107 100 68 187 107 -86 222
8132 222 86 9 15 89 -199 30 224 186 -1 113 62 222 97 -86 -82 197 36 -90 -10 165 378 67 95
8155I5k17Q2J32J31j13j03o6J25k10J78j19J18J79k78L10k04o6j11O5K91j98Q2
8177A03M5J5k78P0j59M3K17Q0k73K30j85L2Q4O
$$ plain form
8155 95 -122 -40 92 223 110 7 -59 66 -144 34 -85 33 212 -66 244 40 -26 -137 -72 219 21 103
8177 103 148 163 -115 -45 -204 -161 56 136 -137 93 -92 -60 24 30
8191C0
$$ Imaginary data points
##PAGE= N=2
##DATA TABLE= (X++(I..I)), XYDATA
0@%%%%%%%%%%%%Qj6J6j6J6k3L1l2M0m8N6o7P5q8J04j20J39j60J83k09K36k66L01
35A60l40L81m26M77n32N93o60P31q08Q93r85J086j200J323j457J605j768J949
53A022k151K379k634K927l267L658m123M687n379O258p417R014j1360J5160k2295
68a3521M0082j62672k79738L86342K18496q2680j8122n2897j62000J31495K37397
79B42182p9288j99646k2809K3089Q8500J15295j28530k22614P2090J46944j5527
90A9686O41k9293j87479N986K72102M4804k17945l8119R9124L1644R3531P1881
102A66563j64074j20823J40702J10268n2813m7802l7693j4090R9471M6144j36113
113a0260q5955M5422J1991M1859Q2468j16924j75743J06691J75261m6677o8106
$$ plain form
0 0 0 0 0 0 0 0 0 0 0 0 0 0 8 -8 8 -8 8 -15 16 -16 24 -24 32 -35 40 -48 56 -64 75 -85 98 -111 125 -141 160
35 160 -180 201 -225 252 -280 313 -347 384 -424 469 -516 570 -630 693 -764 841 -927 1022
53 1022 -1129 1250 -1384 1543 -1724 1934 -2189 2498 -2881 3377 -4040 4974 -6386 8774 -13521
68 -13521 26561 -136111 -415849 -29507 188989 106309 88187 35290 -126710 4785 242182
79 242182 162894 -36752 -59561 -36472 52028 167323 38793 -183821 -111731 35213 19686
90 19686 20327 -8966 -196445 -190459 81643 126447 -91498 -129617 -30493 1151 94682 166563
102 166563 2489 -118334 22368 132636 79823 32021 -5672 -19762 79709 125853 -10260
113 -10260 -96215 -50793 -38802 3057 85525 -31399 -207142 -100451 74810 28133 -39973
124c9973J6307m7430N515J51803K8323j52378m2172R6707O5506L3086k7214j18605
136c0525l0843J01241L1262n0302j7129m2257m3366R3699P9337j15817j00143
147a24843P0518M9304j9821L2371k162q2103J8550J11330R128o6675j3077J8474
159I94K8782M3658k0109p0527j734M0489P327J8398k112p9894k8040Q1740J5519
172C4491p9377r682M0611j1650P573M4155l5122o2276L9943O7256n358k9713j3722
185a2871j990L0405L4769j3555k5735m313p574J2187L6439k4755o6311J4918N3817
198B5431j9630l3390J7203m104k2422L2010K7153m6749l2764L7805L8088K486
210B1117r258j6924n902K1260J7118j745o333j9118j4385L0839K6636l7034l3105
$$ plain form
124 -39973 -23666 -71096 -65581 86222 114545 -37833 -80005 16702 82208 115294 88080 -30525
136 -30525 -61368 39873 71135 20833 3704 -38553 -81919 11780 91117 -24700 -124843
147 -124843 -54325 -5021 -24842 7529 5367 -76736 -58186 53144 62272 -4403 -17480 994
159 994 29776 73434 53325 -17202 -18936 21553 28880 47278 45166 -34728 -62768 18972 34491
172 34491 -44886 -54568 -13957 -25607 -18034 26121 -9001 -71277 -31334 35922 30564 851 -12871
185 -12871 -14861 15544 50313 36758 11023 6710 -864 11323 47762 23007 -43304 -28386 25431
198 25431 5801 -27589 -10386 -14490 -36912 -4902 22251 -24498 -57262 -19457 18631 21117
210 21117 11859 -5065 -10967 10293 27411 25666 19333 215 -14170 16669 43305 6271 -26834
223b6834K6441J4921k0612P91M384k9762o296M1853J4007l3276j5970J6926J5257
236A830N615J39o375l754K210Q405J2920l678k2695L557L0476l408l3615l155
250a1528J4541p942k03J8600j2168l0983J0630K9782n734k1288j378Q305N341
263d025O864L691m950n103K047J2412J0031j3049j9022J0889K1802p243j7619
276c275J424J57p796J2402J6543j7674k5216P828J6798m693p823N458N424m75
290i18L781K914r515r748Q311K0318N873j6413j2309O436P859R2K287r44j4041
305f017o522J4933R438j4243j2281O363O453p43L323L527p225o264N647O911l762
320d62n129N834R880J002p142l339O87l681j714Q251N946p185n791M557k340j2924
$$ plain form
223 -26834 -393 14528 -6084 -5293 -909 -30671 -36967 4886 18893 -14383 -30353 -13427 1830
236 1830 7445 7584 1209 -2545 -335 8070 20990 17312 -5383 -1826 28650 25242 -8373 -11528
250 -11528 3013 -4929 -5132 13468 1300 -29683 -19053 10729 4995 -16293 -17671 -9366 -4025
263 -4025 2839 6530 1580 -3523 -1476 10936 20967 7918 -11104 -215 21587 14344 -3275
276 -3275 -1851 -1694 -9490 2912 19455 1781 -23435 -15607 1191 -3502 -11325 -5867 -443 -918
290 -918 2863 5777 -3738 -13486 -5175 15143 21016 4603 -7706 -1270 6589 6681 8968 8024 -6017
305 -6017 -12539 2394 11832 -2411 -14692 -8329 -1876 -2619 704 4231 -2994 -9258 -3611 3300 -462
320 -462 -5591 243 10123 11125 3983 644 1331 -2350 -4064 4187 10133 2948 -2843 1714 -626 -13550
336a3550K883J6782K041j0550k444N70o314L455J5578K268j3361l477Q481M411
350F773k505l023l338j786L727P503L770o442j1773j322R161J285n829P16K459
365f24l069J958P219m262j1188K115R982L417M21n83n799n244R57N019O336L821
381A0476n597n732Q58l374n041P491P430q374l945R325j686r218M738M579q685
396f755J621J2721k731p825L448Q97l530O239K480q084k59N940k838k37M195r644
412d362p692J2414P291p936R71K119j2517k476J4618J251p380O116L768q249Q70
427a194M969o664n6Q982o99l886L634m983p919P856O367p475Q68N622j0336m972
443i886J2172Lq684N331K876q501L827J1223o144n974M647l452k797J1468L434
$$ plain form
336 -13550 -10667 6115 8156 -2394 -4838 -4268 -10582 -7127 8451 10719 -2642 -6119 2362 6773
350 6773 4268 1245 -2093 -3879 -152 7351 11121 4679 -7094 -8416 745 2030 -3799 -3083 -624
365 -624 -3693 -1735 5484 1222 -9966 -7851 2131 5548 5969 5386 -413 -5657 -4700 319 6655 10476
381 10476 4879 -853 5 -3369 -8410 -919 6511 -1863 -5808 3517 1831 -7387 -2649 1930 -6755
396 -6755 -5134 7587 4856 -2969 479 1376 -2154 4085 6565 -1519 -1778 4162 1324 1087 5282 -4362
412 -4362 -12054 360 7651 -285 686 2805 -9712 -12188 2430 3681 -3699 2417 6185 -2064 -1194
427 -1194 3775 -2889 -2945 6037 5338 1452 5086 103 -7816 40 6407 -1068 -200 5422 -4914 -9886
443 -9886 2286 2289 -6395 -1064 1812 -6689 -2862 8361 2217 -3757 890 -2562 -5359 6109 9543
458I543j0081J240L909p872J132R157p370p219J1204K653j0474J277K278r823
472a0446M293J4979l880r492K785k202n259J1198Q692r342l048N981m830j251
486a822R516k351r519L799K589o024N195O580r062m327O340m345m971R547K516
501C661r168K898N141p003J28Q724l465k846R367p03j0055K009K146n419P100
516B515J0922q933r676N579k355n558J0089M125j2632j647Q164l270o80R124n183
531E84j0181P760O067p619L421Q777q069m936Q287q49o081Q033L572r496j198
546a928K821o739q7J0009l87n085K852j927p505L768M852n573J567P635k119m041
562a887M217j154l255N366K104n942R33L796m688q99N962k825n206L962J410m295
$$ plain form
458 9543 -538 702 4611 -3261 -2129 7028 -342 -7561 3643 6296 -4178 -2901 -623 -10446
472 -10446 -6153 8826 4946 -4546 -1761 -3963 -9222 1976 10668 1326 -1722 4259 -571 -1822
486 -1822 7694 5343 -4176 -377 2212 -3812 1383 7963 -1099 -5426 914 -3431 -8402 1145 3661
501 3661 -5507 -2609 2532 -4471 -4343 4381 916 -1930 7437 6734 -3321 -1312 834 -4585 2515
516 2515 13437 4504 -5172 407 -1948 -7506 2583 6708 -5924 -7571 593 -2677 -3357 5767 584
531 584 -9597 -1837 4230 -3389 32 8809 740 -4196 4091 3242 -2839 5194 8766 -730 -1928
546 -1928 893 -5846 -5933 4076 3689 -1396 1456 -471 -7976 -4208 644 -4929 -3362 4273 2154 -1887
562 -1887 2330 1176 -2079 3287 5391 -551 382 4178 -510 -1409 4553 1728 -3478 484 1894 -2401
578b401L156O25q222l11P439j545j440O577o33o597K227J459m877L714O798l364
594B605k511N609j819n871K706J811m983K118M659m291l680K986k373l346O173
609b07M491m626k077k3l207J525O177j76k640M073J094l910Q30K573l736j270
625a109K823l76r20K739j64m368k62R26k622j010L573J241r63l26k322j968L411
642a697L476K21Q43N45l481k379J852J203R13L158M08l458j561j00j870k43J883
659b87L44j403J59q26j81J309L70j637P66J094j521M62L417K43j718P13j51k065
677i12J910M317j159l229j498j709j354L753K974j106j798j358k638K65K071l18
693a789o64K275J044j263J127L04k574J36M348J48k123O18m29k293J754K984j001
$$ plain form
578 -2401 755 1380 -6842 -7153 286 -1259 -2699 3878 3245 -3352 -1125 334 -4543 -829 5969 2605
594 2605 94 5703 3884 -1987 719 2530 -2453 -335 4324 33 -3647 -661 -3034 -6380 -207
609 -207 4284 -342 -2419 -2442 -5649 -4124 2053 1877 -763 3310 4404 494 1324 3897 161 -1109
625 -1109 1714 1338 418 3157 2993 -1375 -1637 -711 -3333 -4343 -770 471 -492 -818 -3140 -5108 -1697
642 -1697 1779 2000 2843 3388 -93 -2472 -620 583 1496 4654 5062 1604 43 -57 -1927 -2170 -287
659 -287 57 -1346 -1187 -2013 -2194 -885 -515 -2152 -1386 -292 -1813 -1351 2066 2309 591 1304 1153 -912
677 -912 998 5315 4156 927 -571 -2280 -3634 119 3093 1987 189 -1169 -3807 -3542 -1471 -1789
693 -1789 -2453 -178 866 -397 730 1034 -1540 -1404 2944 3092 969 1587 1158 -1135 619 3603 2602
710B602k463p96q32M3J702p9j477p58j338l93L874K559j617k182o9j370m87M327
728A246K991j957j479J038o15j070P17J08p63j52R09J19j284j780q22J714K056
745I76j366p54j08j735k48L488K278k176j640J411P11l0K113J06l008k047J168
762h61K074J434l95p16j597k152r73R58J873K37n00R25n15k324N61J787O19m1
780C94Q95M22j574j018J015Q25K57J31O39j82k006p76Q58L11j395j92J337m87
798e46n29J403Q80j943j982O63J021M93J504J595m76j866j070L31J39P34J565
815A916R11j496k169j244O84J208R59R92l02k575j606K86J193N51M20J046J31
832I05r62R5J321q06j470L94J729m56m21J132L22k084l91J147r16j187R37J130
$$ plain form
710 2602 139 -657 -1489 -1446 256 177 -1300 -2058 -3396 -3789 85 2644 1027 -1155 -1224 -2594 -3081 1246
728 1246 4237 2280 801 1839 1224 154 871 979 216 64 973 1092 -192 -1972 -2794 -1080 976
745 976 -390 -1144 -1252 -2987 -3235 253 2531 355 -1285 126 837 807 2920 3026 18 -2029 -861
762 -861 1213 2647 2252 1536 -61 -2213 -3186 -2228 -355 -118 -618 307 -208 -2532 -1971 -184 435 394
780 394 1289 1711 137 -881 134 959 1216 1347 1986 1804 -202 -978 -120 191 -1204 -1396 -59 -546
798 -546 -1075 328 1208 -735 -2717 -2054 -1033 -540 964 2559 2083 217 -853 -522 -383 351 1916
815 1916 2827 1331 -838 -2082 -1398 -190 769 1761 1459 -1116 -2722 -2436 -1243 -692 -272 774 905
832 905 -57 38 1359 553 -917 -523 1206 750 329 1461 1783 -301 -692 455 -461 -1648 -711 419
850D19l60k38o62j202n76J441K208J527j9l029k176Q20J048J223K512J154k846
867A244k150R30l00j286J585J451j264p09N18k10j249M90K18J40j51O79J00K07
885B43m93j33M81M91k5N3J240m30j038k83j13j525k50K287P08L84n33k002k054
904b992k38J567J826J556j55j923p56K7k37J455K219o67j526O38o9j867P87K063
922A708r89q15J203n09j619R2N63j009J69J173n45J46J572q89j330J033j73j848
940b067J386K482k02k24N07j707k323J806J282j05Q09K57k401j996R47J39J084
957c26K069l92k286o15M8m07J295K070j233p16J272o7o60J170J47j792l7J490
975A030o66m2P66j37j753K50k03m72Q13J066j036k40L83j091m29J574J110k09
$$ plain form
850 419 59 -179 -841 -2043 -2619 -1178 1030 2557 2538 -491 -2667 -1847 -799 424 2936 4090 1244
867 1244 -906 24 -276 -1562 23 1474 210 -499 19 -191 -1440 -950 -732 -592 -743 -64 36 243
885 243 -250 -383 98 589 564 617 1857 1427 389 106 -7 -1532 -1782 505 1213 1597 1064 -938 -2992
904 -2992 -3230 -1663 163 1719 1564 -359 -1115 -1088 -1325 130 2349 1682 156 794 725 -1142 -355 1708
922 1708 719 -96 1107 598 -1021 -929 -366 -1375 -1206 -33 -578 -432 1140 251 -1079 -46 -219 -2067
940 -2067 -681 1801 1599 1375 1882 175 -2148 -342 940 835 1644 1901 -500 -2496 -1549 -1410 -326
957 -326 1743 1351 -935 -1550 -1502 -1909 -614 1456 223 -493 779 712 52 1222 1369 -423 -460 1030
975 1030 364 322 1088 951 -802 -552 -755 -1227 -414 652 -384 -624 -241 -1332 -1761 -187 923 714
993G14R14k98j815j371J439N39O48J622j01k276o19K34j60O12M69q62p22K94J53
1012e86J14O15k78r11J01R58MJ03L83K2o69M15K46K08L51l82j39Q3k39j320j9
1033i40P94J4O04O01m81j498j032M6M70K093M77o71p77k15q7N55J434r7q20l59
1053A11K9K9P0M52k26m25J9Mn79O34k06q12P9K33p41R2J797J27k83j29p53q66
1075a344O20J135K94O45N21j064j275j59K07N64J225l25j355m4j44q21M27J482
1093E89m78m10L36l46j222J007O21o32Q67O14r93K7J555j33r96k4j041q79K076
1112E38J668j540o35N13j884r13J880J061j101L67O28j619m83J606j21p48K174
1129A391N85j616p6n46j299J455J825q12k43Q94k044j585J911J052j350m31J021
$$ plain form
993 714 1628 1330 -485 -1856 -417 122 770 2392 2291 15 -604 -370 -530 82 551 -311 -1033 -739 -586
1012 -586 -472 143 -135 -1046 -945 13 17 120 503 525 -144 271 517 725 1076 694 555 638 399 -921 -940
1033 -940 -146 -132 472 1073 592 -906 -1938 -1892 -1422 671 1148 477 -300 -515 -602 -47 1387 1290 470 111
1053 111 140 169 239 691 465 40 59 63 -516 118 -88 -900 -821 -588 -1329 -1237 560 687 404 275 -478 -1344
1075 -1344 -724 411 705 1350 1871 807 -468 -627 -420 144 1369 1044 -311 -355 -499 -1320 -893 589
1093 589 111 -299 37 -309 -1531 -524 97 -535 332 946 -47 -20 1535 1402 406 382 -659 -1538 538
1112 538 2206 666 31 544 -1340 -2253 -373 688 -413 -46 582 -1037 -1520 86 -35 -783 1391
1129 1391 1976 360 284 -262 -1561 -106 1719 907 664 1558 -486 -2071 -160 892 -458 -889 132
1146A32j191j3K164j81k060J01K67M9J127J074n17r66l97o39P89J665J00j444
1164F0O93k12j612k07J252m40j49J969K8k066k96Qp36R98J827J40j006j90o81
1183f20k3J284J72j003R65j86j099O69J527j321j180R20J05j628J369J534j605
1200a20j563R87Q3m81J191J280j77j034o92n30N41O28M0J248P21j617j727J232
1218A0J93j481R85K081r70k471J379R01k168L59K271j89j291n49Q13K5k98N69
1236A69O52q9j341N25J632k23j870L53O82j483n19K783Q47k481p23J097q54j471
1254b314J828J997j055j294P43M51r46n51J605J156q79j152J196O8k255N15K587
1271A700J96k394q1J650j709j382J752J599j929j108J703P76j173j22J143o20
$$ plain form
1146 132 -1059 -1072 1092 911 -1149 -1048 -781 -732 395 1469 952 -14 -411 -1050 -261 1404 1504 60
1164 60 753 541 -1071 -1278 -26 -466 -615 1354 1382 -684 -980 -972 -1708 -710 1117 1257 251 61 -620
1183 -620 -643 641 813 -190 775 589 -510 159 1686 365 -815 105 210 -1418 -49 1485 -120
1200 -120 -1683 -696 -613 -1094 97 1377 1200 166 -526 -1056 -515 113 153 1401 2122 505 -1222 10
1218 10 203 -1278 -293 1788 818 -1653 -274 627 -1541 -1182 1089 900 -391 -940 -127 -102 -400 169
1236 169 821 732 -609 -84 1548 1325 -545 -192 490 -993 -1512 1271 2118 -363 -1086 11 -843 -2314
1254 -2314 -486 1511 456 -838 -95 356 -590 -1141 464 1620 741 -411 785 853 -1402 -887 1700
1271 1700 1896 -498 -579 1071 -638 -2020 -268 1331 -598 -1706 -3 773 -400 -522 621 1
1287Aj731M78K173M00j445N0J626j247j866J625J658j414r77J536J53k847k10
1304b037K346O69j316N5J023j375j697J212K299k86j707P72J473j344j140J677
1320F24J161k415o43K627M20k784L15K351j035k143J226J746k083j380J904J777
1336A668k400j598J945R89j173L80K140l68l518r6L085O94j834R50J304j895k413
1353b140K237K053k426j912K558J014k514O7K394q08k702J063L036j115k836J106
1369i25K210j164j268K202R19k879p64L303J175k931j500K030k47k108J853L103
1385C009j900m131J156K550j105j353K507J086l293r42L527R09l132l14L119J39
1401A832k886P66K238j770k541K479K867k288k894J925J694k672l69K984m37l586
$$ plain form
1287 1 -1730 -1252 921 1321 -124 -74 1552 305 -1561 64 1722 308 -669 867 1020 -1827 -2037
1304 -2037 309 978 -338 -283 740 -635 -2332 -1120 1179 893 -814 -42 1431 87 -1053 624
1320 624 1785 -630 -1273 1354 1774 -1010 -695 1656 621 -1522 -296 1450 -633 -2013 -109 1668
1336 1668 -732 -2330 -385 604 -569 -189 1951 1583 -1935 -2031 1054 1748 -86 864 2168 273 -2140
1353 -2140 97 2150 -276 -2188 370 1384 -1130 -1063 1331 523 -2179 -1116 1920 805 -2031 -925
1369 -925 1285 121 -1147 1055 1974 -905 -1669 1634 2809 -122 -1622 408 161 -1947 -94 3009
1385 3009 1109 -3022 -1866 684 -421 -1774 733 1819 -1474 -2416 1111 2020 -1112 -1426 1693 1832
1401 1832 -1054 -288 1950 180 -2361 118 2985 697 -2197 -272 1422 -1250 -1619 1365 928 -2658
1417b658M33M027K7l227M76K070j633j970K930L048k721k561K608J066k726o50
1433a461L045P66l638o0L042j190l490J921L205j396k699J841J794l152j025L615
1449A118R92k922j064L116N09k680L06K692j230l228J689L289j140l070J411J965
1465A753k703j554L323J171l149r12L377k86l370N31L187p98j916J618K053k420
1481i5k531K377K427j750j351K395K96l553j90L941l81l651O65K947j118k520
1497b092J610K233k787j835K884K420k782j447K508R54l028k67L701l31l477J311
1513d25L474j775l985J884K338j866j292L051J252m123j328K769J357k189k42
1528a100K788p23l206O76L314j186k211J688K581k573j872K767J391l121j164
$$ plain form
1417 -2658 -2225 1802 1829 -1398 -922 1148 -485 -2455 475 3523 802 -1759 849 1915 -811 -1461
1433 -1461 1584 2350 -1288 -1348 1694 504 -2986 -1065 2140 744 -1955 -114 1680 -1472 -2497 1118
1449 1118 2110 -812 -1876 1240 1749 -931 -625 2067 837 -2391 -702 2587 1447 -1623 -212 1753
1465 1753 -950 -2504 819 1990 -1159 -2071 1306 1020 -2350 -1819 1368 570 -1346 272 2325 -95
1481 -95 -2626 -249 2178 428 -923 1472 1768 -1785 -1975 1966 1585 -2066 -1401 1546 428 -2092
1497 -2092 -482 1751 -1036 -2871 13 2433 -349 -1796 712 1666 -1362 -1629 2072 1741 -1736 -425
1513 -425 3049 1274 -2711 -827 1511 -355 -1647 1404 2656 -1467 -2795 -26 1331 -858 -1100
1528 -1100 1688 965 -2241 -1565 1749 563 -1648 40 2621 48 -1824 943 2334 -787 -1951
1543a951L462J63k982M57K813j378k824J105K303j136k384K328K290k620k050
1558b404J918J623k044m30L422M88l826l29L178p76k726K346K239k428k315J816
1574b48J329k349l93K668P83k824r26K657K26k284J23K492k86l049J609K937j825
1591F40k819J954K190k543q01K968L74k881k84K368k47k589R25K147m74k387O83
1608g76J847j810j474K381K323k011j967K006L69k393L25L023j76k795O07J928
1624A407j055j705J308J468j742j166J676J382k044j304J855Q24k113j62K421
1639A050p2k469O16K781j465k404J808J982j212j185J381J89k671j75K921P50
1655A825j961p33J627o25j727Q12K169r22j992J284J803j658j397J977O91j686
$$ plain form
1543 -1951 1511 1674 -1308 -851 1962 584 -2240 -1135 1168 32 -2352 -24 2266 -354 -2404
1558 -2404 -486 1137 -907 -1337 2085 2573 -1253 -1582 1596 820 -1906 440 2679 251 -2064 -248
1574 -248 1081 -1268 -1661 1007 1790 -1034 -1960 697 923 -1361 -1238 1254 968 -2081 -472 2465 640
1591 640 -2179 -225 1965 -578 -1379 1589 1963 -918 -1202 1166 919 -1670 -745 1402 928 -1459 -776
1608 -776 1071 -739 -2213 168 2491 480 -1487 519 888 -1505 -1180 1843 1667 -1128 -521 1407
1624 1407 352 -1353 -45 1423 -319 -1485 191 1573 -471 -1775 80 904 -1209 -1371 1050
1639 1050 978 -1491 -875 1906 441 -1963 -155 1827 615 -570 811 1000 -1671 -1846 1075 1825
1655 1825 -136 -869 758 133 -1594 -782 1387 465 -1527 -243 1560 -98 -1495 482 1173 -513
1671e13l81K269k34k509P94J947m72k044Q55J623j246j040J588Q10k180j429J982
1688a80J305r81n32J314p51j772M39K053o6j648M41J505j003r34J238Q70j578
1705b80o38K066K53j912n52J265K65r10M66J179q43k258J288J659q26j433R85
1722b26R64j420J58J540L67k293n32J816K27j007Q80O23r52j537J224J194r71
1739E5j109R17P14p44r34J267J38j272K55J883K7j842r4R14k90k09J089P87j682
1758a30q63J216N32n37o20N65k62r34P02J101O2j575j06Q25j09l21N98O71q71
1777e6p63J244M29j230j59J246J76p83j00N98r47p04J048J127l11r20l21L83n47
1796e90L2R51J59j050k13R81L92o98k33N89j35o34P16Q14o65o78M97L92m27j038
$$ plain form
1671 -513 -894 1375 1141 -1368 -574 1373 901 -1143 -288 1335 89 -951 637 1447 -733 -2162 -180
1688 -180 1125 144 -388 926 175 -1597 -1158 895 829 -819 -378 1127 124 -810 428 1298 -280
1705 -280 -918 1148 1401 -511 -1063 202 467 -443 23 1202 359 -1899 -611 1048 222 -1211 -226
1722 -226 738 -682 -524 1016 1383 -910 -1442 374 601 -406 474 1097 145 -1392 -168 1026 55
1739 55 -1054 -137 577 -167 -1101 166 304 -968 -713 1170 1197 -645 -739 175 -115 -324 765 1552 -130
1758 -130 -993 223 755 218 -402 163 -99 -1033 -331 770 832 -743 -849 -24 -133 -454 144 815 -56
1777 -56 -819 425 854 -376 -535 711 887 104 4 602 -345 -1049 -1 1126 815 -105 -426 -43 -590
1796 -590 -558 393 552 -498 -711 270 662 -36 -269 320 185 -449 267 1081 416 -262 235 627 200 -838
1816h38J045L07q89j6L62j25r05L61R20J15n73kM4m08j4O98N58k95l20K41K0l42
1838e6k16O24j52o91M54N04j53o54J70O2J09m97P46k19m22m9O93p2p16K59L41
1859F5J45k64L18O84p18q21L30R08N5k84J25k28n39o11M37M49j91J39K09k27n03
1880e22Q2M44q8k74L83K42q2l01Q7J68L8K86j29j45j76N4NJ59n58L14j90j39M21
1903G9M4J90p21j52J3N7M12L14M6J57n98J16j67M19n9M05L17m18l56k05J50M7
1925I0j07N0k54J2j60J99l66L7J17M06j96L45k12J39l2j70M73K09k16j40j8R4
1947C00M4K8n42J10m4L2L99K40p86n01nJ16N72K35K07o17k50J18N8J83j28J62
1969f9J26J43K20m04P6p3J50J33J83n0n15l02o9J04K05J00k66K22k93J18L09r1
$$ plain form
1816 -838 207 514 -375 -391 -29 -154 -1059 -698 222 337 -236 -238 -194 -602 -616 82 640 345 25 266 286 -56
1838 -56 -272 352 200 -491 -37 467 314 -340 -170 -108 1 -496 250 31 -391 -440 253 181 -535 -276 65
1859 65 210 -54 264 948 230 -591 -261 647 702 418 543 315 -224 -835 -398 51 -140 -1 208 -19 -522
1880 -522 -440 4 -84 -358 25 267 185 -116 -29 139 177 463 334 189 13 67 72 231 -327 -13 -203 -342 79
1903 79 123 313 -408 -560 -547 -490 -78 236 282 439 -159 -43 -210 209 150 555 872 454 98 -107 43 90
1925 90 -17 33 -221 -209 -369 -170 -536 -499 -382 24 -172 173 -39 100 68 -102 371 580 364 224 206 300
1947 300 344 372 -170 -60 -104 -72 327 567 -219 -720 -725 -609 -37 198 405 -212 -462 -344 -286 -103 -231 -69
1969 -69 57 200 420 16 92 19 169 302 485 435 -80 -382 -451 -347 -142 -42 -308 -86 -379 -261 48 -43
1991d3j74j85k47M02P14L30l27j87o50L69J38M76j27k22j07p6op1l48K46J27n9
2013b7k49j8o2j59R0L87J76n1k79m3L72J91M8J61m59J22R7J03k4k04k01l07o5
2036d01M95n0P8j52k42l93J39L14J9j4K71r8L70k63O9m50K92L07K01K51j54n61
2058B8l36L95Q3K24r3o09r6J65K86p7k34J16j99j06P02q3k83j98P9N7N78J1l14
2081I6m4J04J4N9j4k57n8j87N71r9j30k79m32m5O76J75K2m6n78j93K33O20k1j73
2105A4K33l45O8J15K37k94J39K7j34L11j5m22L8j0o3k4M8m6k71K44J48k67j61
2128d30K50R8l44R31j46k16K34l16k16J12M89K6l52j88Q7k09L05j03j85k48K04
2149b17j30Q1J45k8n62M14K51j13J24o4K10j68K14K34l80J37J74j65J22J10j81
$$ plain form
1991 -43 -217 -402 -649 -247 467 797 470 283 -367 2 140 616 489 267 160 84 78 7 -341 -95 32 -27
2013 -27 -276 -294 -356 -515 -425 -38 138 87 -192 -235 137 328 376 537 78 200 297 400 376 172 -29 -336 -401
2036 -401 94 44 122 -30 -272 -665 -526 -212 -193 -207 64 -34 336 73 142 -308 -16 291 492 743 589 28
2058 28 -308 87 170 394 301 -308 -404 -239 47 -30 -264 -148 -347 -453 249 166 -117 -315 -236 -179 399 410 96
2081 96 52 156 170 229 215 -42 -100 -287 284 185 55 -224 -656 -701 -25 150 172 126 -452 -645 -412 208 187 14
2105 14 247 -98 -30 85 322 28 167 194 60 371 356 -66 -28 -38 -101 -125 -77 -123 -394 -150 -2 -269 -430
2128 -430 -180 -82 -426 505 359 143 377 61 -155 -43 446 472 120 -68 19 -190 115 12 -173 -421 -217
2149 -217 -347 -266 -121 -149 -711 -297 -46 -159 -35 -99 111 -57 157 391 11 148 322 157 279 389 208
2170B08k55J85k85OP3L9n1k79k10P0L00L77j11q6K34k13l09L84L98l95l2K32j79
2193A01k85K09J11R5j89O0k11K49k00q5J58J15m26j10L79J24n3j62J52l1l14L21
2215HK88r4j93L76n85Q1J51L27l94L06J0j08m10K87k9j87L0J29l26K41J66m88
2237d14N40L2l03N9N45l01o0j43J49J40k60n1K87m9j32O1j10o4o7j85K63k6J64
2260G5j6Q6m34qR2J98J45j63M40o24k1L50k9j34J89o8J91j47l03l07P27l48J24
2283A5J43p0o3l64L55k06P5J56l2j90K53J55j65j03J1j7j66K98J8J9k4k20q8J24
2307h6J56Q2j44k29K1o1L18n0n5j07L15o2j31K8J6k9j6J92P9o0k96K9K48L6j68
2332B6k37l7J14j81P2M55j71q1j26m2K18P6J22k47R6k04J97o6k27J88J80P6k03
$$ plain form
2170 208 -47 138 -147 -141 -68 -29 -80 -359 -569 -499 -199 178 67 -19 215 2 -307 77 475 80 48 280 101
2193 101 -184 25 136 231 42 102 -109 140 -60 -145 13 128 -298 -408 -29 95 42 -120 32 1 -313 8
2215 8 296 202 9 385 -200 -119 32 359 -35 271 281 173 -237 50 21 -166 -136 -7 -333 -92 74 -414
2237 -414 126 158 -145 -86 459 158 98 -45 104 244 -16 -67 220 171 39 100 -10 -74 -141 -326 -63 -89 75
2260 75 59 145 -289 -297 -205 -7 138 -25 415 -209 -230 120 91 -43 146 78 269 122 -181 -488 239 -109 15
2283 15 158 88 25 -339 16 -190 -115 41 9 -181 72 227 62 -41 -30 -47 -213 85 103 122 98 -122 -210 -86
2307 -86 70 152 8 -221 -200 -261 57 7 -48 -155 160 98 -33 -5 11 -18 -34 158 237 177 -119 -90 158 194 26
2332 26 -211 -248 -134 -315 -243 212 41 -40 -166 -208 10 86 208 -39 57 -147 50 -16 -243 -55 125 201 -2
2355bJ74k39O0j82R8L94j50j41k19o4j17L33P4Q4j08J12l25K10k09K38J61m13
2377b31J68J56L9j50j27j18L84j36j06J13j27L01j72O4k67J19J2J74L5Q7p5j29
2399A4K5j38K67K45j92j22j46j02qJ33L27m1k22m47J18L45q5l0j10J11M8K79l18
2422d9j35J20j55L19kJ2o7k8K23j10Oo9j13k65L36J10j67j71N5k9L8j4M37r7j17
2447F8p5R2k15J02k44O4K90K07k28J27%p0J64k88J72j7o9k4l08R6M30k96l49N26
2471A55k37K37J07j3n54K14J0R7R7K23j54k58J55j44J41N3l03K47P0l7l6j30J64
2494A04n3K6j59J45j99o9J82k16m7K42k8K12k00O9k85L68J29q7q2J69J67l84J5
2517A9J87m76L6N18l88R7J62j47k56K75j42m7R0J44r6j96J93l7NJ37j49J4J88
$$ plain form
2355 -2 172 -67 -7 -189 -91 303 153 12 -207 -271 -388 -55 19 103 -5 107 -218 -8 -217 21 182 -231
2377 -231 -63 93 132 -18 -145 -263 121 -15 -121 -8 -135 166 -6 58 -209 -90 -78 96 131 218 143 14
2399 14 39 -99 168 413 221 99 -47 -149 -157 -24 303 262 40 -407 -289 56 -29 -59 -169 -58 -10 269 -49
2422 -49 -184 -64 -219 100 98 110 43 15 238 128 134 65 -48 -313 23 133 -34 -205 -150 -179 -141 -155 282 185 68
2447 68 -7 85 -130 -28 -272 -208 82 289 61 188 188 118 282 -6 166 149 80 56 -252 -156 274 -22 -371 155
2471 155 -82 155 262 249 -305 -91 -81 16 113 336 182 -76 79 -65 76 129 -174 73 143 106 70 -60 104
2494 104 51 77 -82 63 -136 -205 -23 -239 -286 -44 -72 140 -60 9 -276 92 221 134 52 221 388 4 19
2517 19 206 -270 -234 284 -104 -7 155 8 -248 27 -115 -162 -72 72 -24 -220 -27 -64 -59 78 -71 -57 131
2540A31J38o01J39M01l05L68p7j25k93J80j57L40l4K63n20j21J70J28pj14J62
2561F6l01m7K64O7L10j29J86m09j83K18n6J97K71m94k18J19K75l37K62J74rj96
2583C0K03l44K81R4j04k43K96r9l87L15R4k0k59K24K03j77O6k5j46K62l11k52
2605b99J27M06k62j46L30j23m96L76J5p9p7J05L7r9K71j83J68j67K68jm3o7k71
2628b10K6K58O7o2j63K56m89K24P6j92m1P3M21m20K06L01l14q3K9K77m31j3M41
2651B37j42r6j00J86J5j32k7J70J6R9r8k92M98l91j43K29Q8l59K75q0J07j94J76
2674D2J59k69J18j45L00l17J6R8J66m6k99L47K0k98O6n9r1O6J31L54l77j52K9
2697a41J94k05p2L38O2k16J58j48k1N8P3J61j4k06J03N4k90m6K56K57n19M2Ok6
$$ plain form
2540 131 269 -332 -193 208 -97 271 194 69 -224 -44 -201 139 105 368 -152 -273 -103 25 18 -96 66
2561 66 -235 -282 -18 49 359 230 416 7 -176 42 -14 183 454 -40 -258 -139 136 -201 61 235 226 30
2583 30 233 -111 170 264 160 -83 213 114 -273 42 136 116 -143 81 284 107 173 148 2 264 -47 -299
2605 -299 -172 234 -28 -174 156 33 -463 -87 -72 -151 -228 -123 -86 -185 86 -97 71 -96 172 171 128 61 -210
2628 -210 -184 74 141 79 -84 172 -317 -93 -17 -209 -250 -177 244 -176 30 331 17 -66 -37 240 -191 -204 237
2651 237 95 -1 -101 85 100 -32 -59 111 127 226 128 -164 334 -57 -200 29 117 -242 33 -47 60 -134 42
2674 42 201 -68 50 -95 205 -112 -96 2 168 122 -177 170 190 -108 -42 -101 -192 -126 5 359 -18 -170 -141
2697 -141 53 -152 -224 114 176 -40 118 -30 -51 7 80 241 227 21 124 178 -112 -158 98 355 -164 -122 -116 -142
2721a42n2j61M47j78k97L50K51k44j54K49j61rl5J97J27l38K5L59l82k57J2O29
2743B36j03j86K4J73j98k74K89J37k10J58p0R2l97K88J25Rj75K55K2k02k51M28
2765A70K38n63j41L06K9P6l02M34ro89M97L29l73k63k6N19k14j77O5K19j41n8
2787g4Q8O5r8n38N51L86n94ON51k37m15K38J21j31j50K68J70l63k23N55k2j54
2809@k47N12j27l25J7P97n13l73J47M09j76m71O12J6m93n9M32j3k72JL64o7l78
2832b07j59L84Q9m46L59L41l81k63N03j83l43N5K93L67l56l81P39k12m74j5P56
2853D66k38m95L28J06j12m36N90R8m25j43M57N6m48l54R54p8q17M47L47j92m92
2874c81M42K81j61m48L61P0l66j37L85J16n46mQ30k94l60Q8M05n06r2M76K14l95
$$ plain form
2721 -142 -194 -355 92 -86 -383 -33 218 -26 -180 69 -92 -101 -136 61 188 -150 -125 234 -148 -405 -393 236
2743 236 133 -53 -29 144 -54 -328 -39 98 -112 46 -24 68 -329 -41 84 93 -82 173 195 -7 -258 170
2765 170 408 -155 -296 10 39 115 -187 247 238 -451 46 375 2 -261 -287 232 18 -159 -94 125 -16 -74
2787 -74 14 79 -19 -557 -6 380 -214 -208 343 106 -309 -71 50 -81 -231 37 207 -156 -379 176 154 0
2809 0 -247 265 138 -187 -170 627 114 -259 -112 297 121 -350 262 278 -215 -274 158 145 -127 -126 238 171 -207
2832 -207 -366 18 107 -339 20 361 -20 -283 220 37 -306 -251 42 409 53 -328 411 199 -275 -290 466
2853 466 228 -267 61 167 55 -381 209 307 -118 -261 196 252 -196 -550 404 326 -491 -44 303 111 -381
2874 -381 61 342 181 -267 94 164 -202 -339 46 162 -384 -388 442 148 -212 -124 281 -225 -317 159 373 -22
2896b2k81K94L02n78Q8N48k36n28K21M51k96l77M66L12o12PK30M15m68l56J25
2917b95N97m95l9N26n0m99L22K40k67l05Q5K73jl55J58M12l09l58M99K4m91L1
2939b97N69M3o43P1N65m48k59M62M77m89l63L25J36k92m99P60R0l78n1N83j47
2960B15o65L58K02j8l82L72M89m76o38O45K16n15k06Q15l0p03r8Q56k16l41k6
2981a46M28l93m09P10L35o19l06O94r5k33l40L63M19o09J3M14M9o11K28M50l08
3002C4o15L72M53l15j50N31j6n27o6K42K86m52l74Q84j66m97J95M14k26l99K78
3023a14M76l18k19L56j91l13p7R62l84l79N9N44k60n33K57M39m14l27N61J62m73
3044a86k24M19J39j51n1L18K51q01lP63k86m90R6M23j0n43M66O4m29j09M01K39
$$ plain form
2896 -22 -303 -9 293 -285 -197 351 115 -413 -192 259 -37 -414 52 364 -248 -241 -11 404 -64 -420 -295
2917 -295 302 -193 -232 294 244 -255 67 307 40 -265 -180 93 92 -263 -105 307 -2 -360 139 163 -328 -297
2939 -297 272 315 -328 -257 308 -140 -399 63 540 51 -312 13 149 -143 -642 118 208 -170 -221 362 215
2960 215 -450 -92 110 92 -290 82 571 95 -543 102 318 -197 -403 412 382 -321 -419 437 221 -120 -146
2981 -146 282 -111 -520 190 525 -94 -400 294 199 -34 -374 -11 408 -201 -188 226 275 -336 -108 342 34
3002 34 -581 -209 244 -71 -221 310 294 -233 -299 -57 229 -223 -597 287 121 -376 -181 233 7 -392 -114
3023 -114 362 44 -175 181 -10 -323 -400 562 178 -201 -142 402 142 -391 -134 305 -109 -436 125 287 -186
3044 -186 -410 9 148 -3 -54 264 515 -286 -289 474 188 -302 -206 217 207 -336 130 194 -235 -344 57 296
3066B96l61k31L94J12m12L04K16j94m52L69J65k64j31L76Q5n94m5M41r0l05Q6
3087b35M80j64n56K51L89k53j70J22J89l53N9K63K27k68k56N00m0k21KK55O2m33
3109a50Q1K59M4n55K71O05q40n5L90K3l28J03N18l00l73K02O91k74o06J92M53
3130C51k20m83J47M06j44l14N14n5o57L21K30k6r3j69M32k50j85j25N23k69j09
3151a75J34N5J19m44N81j73j76l8kK86k69o8K42Q7l12K48J66k48j59J34K35n09
3173b86OL75J10l35j73M82o0l85K08Q6R1j70k8L02j74k75J28L56k05m63N39k23
3195i4m52N73K53j81l23J30K63k03k42P2N75m35k66L14L05l14MJ53m2K3n9J24
3217A78j90j46J53K57k55j84J88J35N4k30P6J67j32L8j08L62m61r0J23J20j87
$$ plain form
3066 296 -65 -296 98 210 -202 102 318 124 -328 41 206 -58 -189 187 272 -322 -367 74 -16 -321 -235
3087 -235 245 81 -475 -224 165 -88 -258 -136 53 -300 -241 22 249 -19 -275 225 185 -36 -34 221 283 -150
3109 -150 -69 190 234 -321 -50 555 -285 -340 50 73 -255 -152 366 66 -307 -105 586 312 -294 -102 351
3130 351 131 -352 -205 201 57 -257 257 202 -455 -134 96 70 -23 -192 240 -10 -195 -320 203 -66 -175
3151 -175 -41 14 133 -311 270 97 -79 -117 -119 167 -102 -170 72 159 -153 95 261 13 -146 -12 223 -286
3173 -286 -280 95 205 -130 -303 179 119 -266 -58 28 119 -51 -79 223 49 -226 -98 258 53 -410 129 -94
3195 -94 -546 27 280 99 -224 -94 169 -34 -276 -204 371 -64 -330 -16 289 -25 -21 132 90 113 54 178
3217 178 -12 -158 -5 252 -3 -187 1 136 190 -40 36 203 71 109 1 363 -98 -188 -65 55 -132
3238a32J27J85l38P3l8L6j97J44j30M37m68L17P9m8k76l0L17k15K06KJ12j36l82
3261c55O53k54K3j59K08p0j27K8K15n6l42K64%N6k80Q5J94j01J38l17K67L1k44
3284a43J31O0J61j39R9j97J32l31L66m3j16M6p5j83J48J63j51J15L0l0r9K6K8
3307bJ07n7l01J97K35n9pj83J19k00Q7j38K77l6k15M30l76J85O7n8J07k93L65
3330B51k00j88J79m3j62K13j05j1K16k21J40l9q1K7J6J6j59J28j68M13j04j69
3352e1J05r1J04P1j32l6j36Nl6K38k23J21O6o0P7N3L6O5j75j5J80R9k48j92L39
3377A64J00k19j6lJ63l26J17O7K3Kj85K90j39K50k90M0J07j52m3L04k78J73k1
3400A28j57p5J56l3k16N1J19P2k8K2o6J24l3p6P3j49lJ30n4j37j74K67J84j19
$$ plain form
3238 -132 -5 180 -158 -85 -123 -87 -284 -140 -270 167 -301 16 95 47 -229 -259 58 -157 49 51 163 27 -355
3261 -355 298 44 67 -92 116 46 -81 -53 162 106 -236 28 28 84 -196 -111 83 -18 120 -197 70 101 -143
3284 -143 -12 48 209 70 169 -28 104 -227 139 96 -20 26 -49 -232 -84 79 -72 43 73 43 -56 -30 -2
3307 -2 105 48 -253 -56 179 120 113 -70 49 -151 -64 -202 75 39 -176 254 -122 63 130 72 179 -114 251
3330 251 51 -137 42 -1 -163 50 -55 -66 150 -71 69 30 -51 -24 -8 8 -151 -23 -191 222 118 -51
3352 -51 54 -37 67 138 6 -30 -166 -161 -197 41 -182 -61 5 -55 22 75 111 176 1 -14 166 265 17 -175 164
3377 164 264 45 29 26 189 -137 -20 47 70 72 -113 177 38 288 -2 38 145 -7 -50 254 -24 149 128
3400 128 -29 -104 52 19 -197 -146 -27 45 17 39 -27 97 64 -12 61 -88 -91 39 -15 -152 -326 -59 125 6
3424Fj8J3j04K99k15O7l44L29j95K81j23m6J23r2j6j99M96m36L31r0j66j06K05
3447@j23L01L4k27j7J91o7p3m6j65K98j83J23k92M25l4k91N8J65M5k90K78ol48
3471b44K78J67k70Q7Np9LJ37j49l0J17J05l30J68L48l55R3J02k95K93Q2k39j36
3494a42j34K30N5r1j44L85l82K64J79m89K06K3p7m6J94L2M5P0k22J05O6J8o6L5
3518A14k93M52j22k17M40m36K63k07L78m19J81j70n2J93q1j81l8L08j75k7R3K0
3540B4J52N1j48p9J16k00pJ16j12J51m6j16N2j60l9K24p6nN7K0J47k07j30J99
3564a6J26l7j62n6L35m9m29M32L1K7k09j26Q9J3J3L12k70k17L69l49J89j16J13
3587A3J7j78J41q3J50j05P6R9J26k20k2p9r8L25l58l6K63j09r4J30L1J66Mj91
$$ plain form
3424 6 -12 1 -103 196 -19 48 -296 33 -162 119 -4 -50 73 -19 -35 -234 262 -174 157 67 -99 -205 0
3447 0 -123 178 212 -15 -32 159 92 19 -27 -192 106 -77 46 -246 179 145 -146 -88 77 122 -168 110 104 -244
3471 -244 34 201 -69 18 23 -56 -53 84 -65 -95 22 127 -203 -35 313 -42 51 153 -142 151 233 -6 -142
3494 -142 -276 -46 9 -82 -226 159 -223 41 220 -269 -63 -40 -117 -163 31 63 108 178 -44 61 127 145 79 114
3518 114 -179 273 151 -66 374 -62 201 -6 372 -47 134 -36 -88 105 24 -157 -195 113 -62 -89 4 24
3540 24 176 227 79 0 116 -84 -91 25 -87 64 18 -98 -46 -206 -245 -21 -97 -102 -45 -25 122 -85 -215 -16
3564 -16 110 73 -89 -145 190 141 -288 144 175 202 -7 -133 -44 -31 -18 294 24 -193 176 -173 16 -100 13
3587 13 30 -148 -7 -90 60 -45 31 130 256 36 14 -65 -163 162 -196 -232 31 -78 -172 -42 -11 155 159 -32
3611c2J63K3l15J66j97J07J98q7Q1J46k95l04L91r0l1N0o2K51k35J05M6r2N3r6
3635e6j0Q6K05l22m0L47j34m5M3O0o8Jk24nK11q1j87P1O4K11Q3j93k10K71k18
3660a40J59K12j02k07o2P8m5M8J26p6k46J73K39l1j59N5J20M4k84J5K6LJ69j75
3684f0q3K36j12L90l50j00Nl6j99M14O6p1L0o0k34p7K95k98J18M47j7j31j35m91
3708d53L31J30J1j54J54m8K3K58l61J14M5p4L0N7R9L7k88J08p3m4J51R9q7r2J51
3733A24r2M3l36L51k1k63J59l0j2P2N3q4J9J68o2J01j51r5J1nJ2qj17J88o5mJ47
3760A03j30R6l10N1L9K25o3j22J55J32l11pqM21l15L7J87j93J50j08j77K36r7
3783iK38l83RJ80o0J27j05J73k43K51j42J29J23l12J31j20J80r8l23K82j96L07
$$ plain form
3611 -32 131 154 -161 5 -192 -85 113 26 107 253 -42 -346 45 -45 -76 -26 -88 163 -72 33 79 -13 40 -56
3635 -56 -66 20 225 -97 -137 210 76 31 74 134 66 67 -157 -162 49 -32 -219 -148 -84 127 210 17 -193 78 -140
3660 -140 19 231 129 -78 -140 -62 -107 -59 67 -9 -255 -82 157 126 -33 22 142 186 -98 -83 -57 -54 115 -60
3684 -60 -143 93 -19 371 21 -79 -74 -110 -309 105 171 100 130 70 -164 -241 54 -244 -126 321 304 173 38 -453
3708 -453 -122 8 19 -135 19 -29 -6 252 -109 5 50 -24 6 63 162 199 -89 19 -54 -98 53 152 65 -27 124
3733 124 32 75 -261 90 69 -194 -35 -65 -77 -5 48 -36 -17 151 89 190 39 -56 -45 -50 -38 -46 -163 25 -40 -44 103
3760 103 -27 69 -241 -190 -151 74 11 -111 44 176 -135 -142 -150 271 -44 -7 180 -13 137 29 -148 88 -9
3783 -9 229 -154 -145 35 -25 102 -3 170 -73 178 36 165 288 -24 107 -13 167 69 -254 28 -168 139
3805A39J64k58O7Lk74R2J09k4J0J49Lj88r1J37P6k99J16m2O3j00J74j35O6pJ76
3830A26k83K42q4j24K09N4k06j0K00l07J10L0n3K30K05l71M5J00J79k51k58J73
3852d4j96PM14k37lN6k6j6J47j80l5J56l19R6J45J53o9J8j70N0L6K11l43L82k74
3877d1r3j36K04P2k9L9nM0j01J42j19Q6o1l7m0qJ19p1J75k27n4J73O0j61L7R4
3903E8J9j07k7J15k03M3J94J76j78j12q5O8Q4N3q3R8r2L0p1Q5j12J45j67J46n
3928G2j48R9M6K3j38L27m95P1M1K65k69k26K07k5L6K02q1P4K3l72K93j92K61j21
3952b7O9l42L78n3q3N5j45J13m0j02J18q7Q4M4O4Q7j6J53m75L44j11j17J70P2
3976A53k57jJ39k08K76j29j32J68j30rl4O9K5K41j12j46Q1m2K97m14J70J22j50
$$ plain form
3805 139 303 45 112 115 -159 -67 42 18 28 177 180 -8 -99 38 114 -185 -69 -111 -48 -148 26 -109 -43 -50 126
3830 126 -157 85 1 -123 86 140 -66 -76 124 -183 -73 -43 -96 134 339 -32 13 113 292 41 -217 -44
3852 -44 -240 -233 181 -56 -59 -3 -29 -45 102 -78 -113 43 -276 -180 -35 118 49 67 -103 -53 -17 194 -149 233 -41
3877 -41 -134 -270 -66 6 -23 16 11 51 -50 92 -27 59 -2 -39 -79 -87 32 -39 136 -91 -145 28 88 -73 -36 58
3903 58 77 -30 -57 58 -145 -102 92 268 90 -22 -107 -39 45 98 15 113 21 51 -20 65 -47 98 -69 77 72
3928 72 -76 23 69 92 -46 281 -214 -143 -102 163 -106 -332 -125 -150 -114 88 7 81 104 -268 25 -167 94 -27
3952 -27 42 -300 78 25 -58 -3 -148 -35 -75 -177 -59 -146 -62 -18 46 133 117 270 -205 139 28 -89 81 153
3976 153 -104 -105 34 -174 102 -27 -159 9 -121 -130 -164 -95 -70 171 59 -87 -6 -48 249 -165 5 127 -23
3999b3p9K28j11o6J15j40J19J74J08l16k5nK67m32K38j48K49k51R9J10j5j19L5
4022A2j05J25k06L93r9p1nN5j14k11K6J58mP6qj01J03O5l00K99r4j97LO9K90l2
4048A27k28m0O7J35O8R1k17j6l45K74K19r2P6k16P5J31K06l21J5j37M7J04k21
4071a98K45J56q0j18j9J19O1l51K90j70j13L67l04JK96J6l26K17j28J07M4r4k62
4094b44K92m9J24j34qOJ03Q2q3j22J55j67j68K51o7J50k6j29Q5o3LRj60J59K4
4119B3k12K08K22o0o0J06l59K48j11M6r1Q9K00k31j28L96k27K26k61j1o0J81j27
4142GnK50l61K24j74N6j14J8J77r4o1M1J61j04O2q2N5j08J03j08o0J24l8K34j02
4167A01j41J85j38l54K43R7k08O8M5k3l0L50l73J78n6o5R0j4k76L44O3J84m48
$$ plain form
3999 -23 -102 126 15 -51 64 -76 43 217 325 9 -16 -21 246 -186 52 -96 153 -98 1 111 96 -23 12
4022 12 -93 32 -174 219 120 49 44 99 -15 -226 -200 -42 -46 30 22 -79 24 89 -211 88 -6 -203 -200 -131 159 127
4048 127 -101 -141 -74 61 129 220 3 -13 -358 -84 135 43 119 -97 -22 109 315 -6 9 -128 -81 23 -198
4071 -198 47 203 123 5 -14 105 166 -185 105 -65 -178 189 -115 -114 182 198 -128 89 -39 68 112 18 -244
4094 -244 48 -1 123 -11 -19 -13 90 172 89 -33 122 -45 -213 38 -29 121 95 -34 51 -12 -9 0 -160 -1 23
4119 23 -189 19 241 181 121 227 -132 116 5 51 -40 49 249 18 -110 286 59 285 24 13 -47 134 7
4142 7 2 252 -109 115 -59 -3 -117 -99 78 -16 -77 -36 125 21 83 1 56 -52 51 -57 -117 7 -31 203 101
4167 101 -40 145 7 -347 -104 -7 -215 -147 -102 -125 -155 195 -178 0 -56 -121 -31 -45 -321 23 86 270 -178
4190a78M81k54l40J5L08O0k22k2J80K12k90P2k46K34j1l26K74K47l36qM46j91
4212A05mj62K71j13j02n1K50k00o1O4J90j14K9K1k69n9M5N5K8r5J49J84l25p8
4236b42L04k4j21L7r0O6J8p5J71R0j70K29j19Mr4J45m8j74j20M27l95J44J52R
4260A24N5p5l15L01j23n1J72m84L18q9L28k33N4m1J96L9j63No9mJ38j89O3K04
4284A61m10L29K24n05K51m7J4k0j93L00o6L6l06K80L0Q2J7j41kJ2N2J27j90p6
4308d1q4J63j85q0J12K90j04j09o5K00k99K10K5l48K12j4K59m78L21K04j00j84
4330i5J16K8J62Mm72M55k33k57K78l7r3J81K6J91m28Q9N2R4k75L20r3L18n55J30
4354i4K51k08j69K01J12J08j15l0k32J30J51j93K06kj98J88r1j94%M22k72k33
$$ plain form
4190 -178 303 49 -291 -276 32 92 -130 -152 28 240 -50 22 -224 10 -1 -327 -53 194 -142 -150 296 105
4212 105 101 -61 210 97 -5 -56 194 -6 -67 -3 187 73 102 123 -146 -205 -160 -105 -77 -172 -23 161 -164 -242
4236 -242 62 38 -83 -46 -136 -70 -52 -127 44 134 -36 193 74 78 -16 129 81 -93 -213 214 -181 -37 115 124
4260 124 179 104 -211 90 -33 -84 88 -396 -78 -167 161 -72 -18 -59 137 176 13 18 -51 -55 83 -106 -43 161
4284 161 -249 80 304 -201 50 3 17 -3 -196 104 38 74 -232 48 78 160 177 36 34 46 98 225 35 -41
4308 -41 -125 38 -147 -227 -115 175 71 -38 -103 97 -202 8 33 -315 -103 -117 142 -336 -15 189 89 -95
4330 -95 21 49 211 215 -257 198 -35 -292 -14 -51 -144 37 63 254 -174 -85 -33 61 -214 106 13 331 -224 -94
4354 -94 157 -51 -220 -19 93 201 86 56 -176 -46 105 -88 118 116 -82 106 15 -179 -179 243 -29 -262
4376b62L52o7j39j61K57J38j29m45N37K17j05k97J88r4l01L00o1P8j12M5R1j91
4398a61J11K24P0k84J32j8k0k11J84J17m0n29L91m6J70l65L01J84k27l91O71j2
4420B51l63K29M7j02m43L90K21k37o1j5K30k14J7J03l9L3Q5l7j16j56j66L21J30
4443A08r1l01L73j74L3K4K8j28L20l32M33n21R1K41P3j55k16M28l38l8J01M40
4465C99n41R2j6L22l97n1R6o5j44J05K57q0M4k12K36K5k37P0J78N1l34J80M22
4488D00j18m03M3K32k42NL96m20m6p6K17m2j37J59J32k4l16K59Q9k56J9J36J85
4511A92l0k16L57k40p9R1J9j41K0j49K73j28l03N66o3o37K26K86M5j58l18M68
4533H1j34j54K1K94P4k45J41j91M7jJ00J69j45k47J34P3l63L17Q1r9L3J26j71
$$ plain form
4376 -262 90 23 -116 -277 -20 118 -11 -456 81 298 193 -104 84 -10 -311 -11 -72 6 -106 -61 30 -161
4398 -161 -50 174 244 -40 92 74 54 -157 27 144 104 -425 -34 -80 90 -275 26 210 -17 -408 263 251
4420 251 -112 117 164 62 -381 9 230 -7 -68 -83 147 -67 -50 53 14 47 132 95 -21 -177 -343 -22 108
4443 108 17 -284 89 -85 -52 -28 0 -128 192 -140 293 -228 -137 104 177 22 -194 234 -104 -142 -41 399
4465 399 -142 -50 -66 256 -141 -192 -96 -161 -305 -200 57 -23 21 -191 45 70 -167 -97 81 132 -202 -22 400
4488 400 282 -121 -78 154 -88 -83 313 -107 -153 -229 -12 -54 -191 -32 100 76 -240 19 108 -148 -129 7 192
4511 192 162 -54 303 63 -16 75 94 -47 -27 -176 97 -31 -334 232 169 -468 -242 44 89 -69 -387 81
4533 81 -53 -207 -186 108 182 -63 78 -113 -66 -67 33 202 57 -190 -56 17 -346 -29 52 -47 -14 112 -59
4556e9J22l77J64L05k72M9J91J58k45k63L83K4n77N22J86k48l10J18R1K10l50
4577a78K64R3k60j01o4K48J03j79K40k37k35N6K89J90l61L53J1l28m0P3J99k10
4599g4p0J91j50M9m9J74J1Rk05R5J31qm76M70j54j04M3N4j5j2O3j43J32J2J01
4624G5J12l18J31J39k63p4K01J15M7k52L2n6J81j92M3P5J4j54J40m3j68L04O7
4647A56j63j28jK64k80N6J53j2M2j94QL73k35j85o4M95k79o2N68k63k99r9J99
4670E0j58J8KJ00j38K6Q6l0o3O0J55M3k82P5n7K27j14j3p8L05l37QJ37m21K86
4695a13N14p3l58K5j09L12k15K1m2k21R0L72J34o00mL25j52O1K52k49K06l06K91
4718A61P5k37j6o8l7j06L97l20J99o9q6J61j35L27j15k05l4OJ75j67J67j9j70
$$ plain form
4556 -59 63 -314 -150 155 -117 -68 123 281 36 -227 156 180 -397 125 311 63 -247 -129 -38 172 -178
4577 -178 86 179 -81 -182 -246 2 105 -74 166 -71 -306 -250 39 229 -132 221 232 -96 -136 -63 136 -74
4599 -74 -144 47 -103 -54 -103 71 82 91 -114 -19 112 104 -372 98 -56 -160 -117 -63 -78 -90 -27 -170 -38 -26 75
4624 75 187 -131 0 139 -124 -198 3 118 165 -87 -55 -111 70 -122 -79 -4 10 -144 -4 -47 -215 89 156
4647 156 -7 -135 -136 128 -152 -96 57 45 87 -107 -99 274 39 -146 -210 285 6 -56 512 249 -50 -149 50
4670 50 -108 -90 -88 12 -126 -100 -14 -44 -107 -47 108 151 -131 -56 -113 114 0 -13 -91 214 -123 -115 22 -399 -113
4695 -113 401 328 -30 -5 -114 198 -17 4 -38 -259 -169 203 337 -263 -267 58 -94 -33 219 -30 176 -130 161
4718 161 236 -1 -17 -85 -122 -228 169 -151 48 -21 -107 54 -81 246 131 -74 -108 -102 73 -94 73 54 -116
4741a16J95j36J77n7j72J31q1J86J21k34j29L96Rm93J36J2j51j4K9K84j78J93
4763A08q7j36q4J81J55j00k1J4n4J4M9P4l5j9J69j63j58J27j52L5K34Q5l23J21
4787C4J55j94j4J77k03J39p6K34n32K66j3r3J05m1J68Kj39k0j05L4M54l19O1k76
4811a96J05j9J72J45k20L8K7M2l07L65l23qM7K86q4q5p9n9Q8j04J65o8j39m4L55
4836A00j09J99l15L05j93J3j52K4J08m8L4J85j70J42m08n3N38k05J45j47J68J1
4858A72j2m64K78J8M9m8J74o1k15R6J45j0k59J92o2j22n3J92K4R0j0o4j03N6j01
4883i8K17Q7l85K05j03RK8J0J52k72J53Q1l60L20O7l51J16L10l60j08K83o2j39
4906b00J41J11k03J06j40J22R9j84J93k9K7o5q8Q6J14L7k98K04m3J95M1j66j79
$$ plain form
4741 -116 79 -57 120 63 -109 22 -59 127 248 14 -115 281 290 -203 -67 -55 -206 -220 -191 93 -85 108
4763 108 21 -115 -199 -18 137 37 16 30 -24 -10 39 113 78 59 228 65 -93 34 -118 -83 151 236 -87 34
4787 34 189 -5 -19 158 -45 94 18 252 -280 -14 -27 -120 -15 -56 112 114 -25 -45 -150 -116 338 19 80 -196
4811 -196 -91 -110 62 207 -13 25 52 94 -213 152 -171 -179 -132 154 70 -15 -94 -153 -65 -169 -4 -72 -211 -255 100
4836 100 -9 190 -125 180 -13 0 -152 -128 -20 -68 -34 151 -19 123 -285 -338 200 -5 140 -7 161 172
4858 172 160 -304 -26 -8 41 -7 167 106 -109 -13 132 122 -137 55 -7 -129 -182 10 34 124 114 50 -53 3 -98
4883 -98 119 206 -179 26 -77 -68 -40 -30 122 -150 3 84 -276 44 111 -240 -124 186 -174 -282 1 -61 -200
4906 -200 -59 52 -151 -45 -185 -63 36 -148 45 16 43 -22 -110 -24 90 127 -171 33 -10 185 226 60 -119
4929a19q3K75j38J16J17j53J02j96J46M6n2n8J90l33N9N2j05L52k35Q0k1j86Q5
4952e9k74L80J77Nk57j08K28J08l45Q7OJ93m17L14M1J7l45M28N6l24K30m45L14
4975A0p1L83k85j12J10p9r5J39k22K56j5J95q1k34J89m5j37J99k80N9J49L35k34
4998A34k43J63j50M9M3Q4M8m49K16K64n3k02R7K6j08j21K64n2Pk67K57J35J67
5021C09l5j20N5l48J61j6P5j14o9K64j33j50J14j73K60q8j08K76m8rr1P4j48P2
5045A0L9j08N5M7P0j0J2j31J9o8J91q1k3k78L19q1J10k58L2K28j86J12J7j47J30
5070B0J9k96K85K1kk50J39N4J13n5o8Kk21J39J17Q6J96m19M2K09k14K47m93J90
5094a39M58m27j0J72o9j39K08j21N31m34P2j25K15j99J93k06N9J35l09J56J50
$$ plain form
4929 -119 -202 73 -65 51 168 15 117 -79 67 113 61 3 193 -140 -81 -29 -134 218 -17 63 42 -144 -59
4952 -59 -333 47 224 229 -28 -136 92 200 -145 -58 -52 141 -276 38 79 96 -249 179 235 -89 141 -304 10
4975 10 -61 322 37 -75 35 -44 -139 0 -222 34 19 214 133 -101 88 43 -94 105 -175 -116 33 368 134
4998 134 -109 54 -96 -47 -4 80 128 -321 -105 159 106 -96 1 27 -81 -202 62 10 17 -250 7 142 309
5021 309 274 154 209 -139 22 6 81 -33 -102 162 29 -121 -7 -180 80 -8 -116 160 112 103 12 86 -62 10
5045 10 49 -59 -4 43 113 103 115 -16 3 -65 126 45 22 -256 63 -18 92 -166 -134 94 -92 20 37 -110 20
5070 20 39 -257 28 49 47 -203 -64 -10 103 48 -20 -18 -239 -100 17 103 299 -120 -78 131 -83 164 -329 -139
5094 -139 319 -108 -118 54 -15 -154 54 -67 464 30 102 -23 192 -7 186 -20 39 174 -135 21 171
5115A71l44J35j0k60J52N8K15j66M2j78P0J33j2j23K04k07r2K18J17m29N43k89
5137e2J42p3j00J62j52j12J28J15J36j23l6P9j12j09J14N4j16K36k6j81K28j49
5159E3K3r4J39k75M7J09j06J54Q3m1M8j65Q5Q7k87K19q6m9K45k79Q4J40j43J84
5183A75m16m2J64n6J49J49j91r8L82l19k52J71M44k86J08J32k01M6J18J9j39J79
5205B36l57O5k63J21P9O5J74Q5p5k28J37l4J07RM8j33k00M33j66j8j7j88J4j53
5229b59O4Q1J13O6J16M9o4k10n4J26j2Q4l13J15K26j66K0J7J88k38J4L07l70L3
5253f7K54j78j13J13k22j32l2M96k63L04O2l49Q1P0J14k25J97k31J67J14k2q4
5275E4k37J32j45J56J60k42P2j50q2L53j56MK28l49K18L81k00k50j10J87q1J92
$$ plain form
5115 171 -173 -38 -48 -308 -156 -98 117 -49 -7 -185 -115 18 6 -117 87 -120 -212 6 123 -306 237 -52
5137 -52 90 17 -83 79 -73 -185 -57 58 194 71 35 114 2 -107 7 61 -55 181 155 -26 202 53
5159 53 76 -18 121 -154 -107 2 -104 50 133 92 140 -25 60 147 -140 79 -7 -56 189 -90 -6 134 -9 175
5183 175 -241 -283 -119 -175 -26 123 -68 -166 216 -103 -355 -184 260 -26 82 214 13 59 177 196 57 236
5205 236 -121 -56 -319 -198 -119 -54 120 205 130 -98 39 5 112 121 169 36 -164 269 103 85 68 -120 -106 -259
5229 -259 -195 -114 -1 65 181 230 166 -44 -98 28 16 100 -213 -98 128 -38 -18 -1 187 -51 -37 270 -100 -67
5253 -67 187 9 -104 9 -213 -345 -377 119 -144 160 222 -127 -46 24 138 -87 110 -121 46 160 138 54
5275 54 -183 -51 -196 -40 120 -122 -50 -200 -282 71 -85 -81 147 -202 16 397 197 -53 -163 24 -57 135
5297A35Q4k85J27j10J07J41l13o3J0J49o5o5K02J35k55J2J03J87n50L18j75K04
5319C3R6k44J06r8QK4L7J11k49p1K88r4J56l7n6j38K68j9N3K9k1j29P1J5p8P6
5345A37m51K46K55l35J91k94M20j92j00M8M7K62m34K15k03L80l91PJ64M52m85
5366f1j67L16j37M40o10P6L29o2j21L4j53q7J09j00K25J3MM4J18L9j95k00J99
5389E3q7j36L91j33k09P8j48K49k1O2n4o4J08P1l40N17k57o2J0J9J21j14j63J47
5413C8j5J29r1J78n0k18l2K69j86r2R8L3mj21P0K24k00J08j75l4J21p3l2mR3K14
5439B48j18j39j27L0j28N01j92l18J76k8J45j45J73n2o4P7R8l75J14K60Kj49k58
5462b69K27n6J25j47K20N6k48R0R4j45K49j57M6j10J03j12K15Jl19jJ35k02l2
$$ plain form
5297 135 219 -66 61 -49 58 199 -114 -177 -167 -18 -83 -148 54 189 -66 -54 49 236 -314 4 -171 33
5319 33 129 -115 -9 -107 -99 -75 -38 73 -176 -247 41 -53 103 66 10 -128 140 121 174 203 182 53 124 139 61 137
5345 137 -314 -68 187 -148 43 -251 169 -23 -123 -75 -28 234 -200 15 -188 192 -199 -192 -28 424 -61
5366 -61 -228 88 -49 391 -219 -143 186 124 3 37 -116 -203 -94 -194 31 44 48 92 210 249 54 -146 53
5389 53 -34 -170 221 88 -121 -43 -191 58 37 99 45 -19 89 160 -180 337 80 18 28 47 168 54 -109 38
5413 38 23 152 61 239 189 -29 -61 208 22 -70 28 61 57 -64 6 230 30 138 -37 -71 50 -23 -55 -59 34 248
5439 248 130 -9 -136 -106 -234 267 75 -243 -67 -95 50 -95 78 26 -38 39 137 -238 -124 136 138 -11 -269
5462 -269 -42 -98 27 -120 100 156 -92 -2 92 -53 196 39 85 -25 78 -34 181 182 -137 -138 -3 -205 -237
5485b37J03L75j59n1K01k29J95l80K88k24k63N16k71J07J5r1R2Qj97M52q8k85
5507a23RK32j92J79k04R7P1J6j75J04m6J75o1j66n0r9L24n0j74K22j42Qq0K45
5531A20k01J19N3J96l66J43j52j83K69O0J77o77M49j87K14O0j72J06O6m4j96k22
5553c68L37J36k22J40J52L7j14m6j64P8J1Q6j8j08J06Q4k51J81k40J20j2r7L6
5576a36J06j44j1m8L02n0J6k00M58m78P7Q5P9q3l1K34j99j77M96j89K11m00K39
5599A57J2k37K97o2j79j32L29j03K0J03l1P7l04k56J36Q7K63q7m6Q1o9j9K30l16
5623d9R0j68K78k74K84j14q1j07K15r2j83K83o0j47R3K59n7j79R5j54J72r9r0
5646h5j15K39J57k70L33n06Q4O0M7P7p8n6k18L16N0Kj13L13k96pL42k66j9n1j11
$$ plain form
5485 -237 -134 241 82 31 232 3 198 -182 106 -118 -381 135 -136 -29 -14 -105 -13 -5 -202 250 162 -123
5507 -123 -114 118 -74 105 -99 -2 69 85 -90 14 -32 143 82 -84 -134 -233 91 41 -133 89 -53 -45 -125 120
5531 120 -81 38 91 287 -79 64 -88 -271 -2 58 235 -442 7 -180 34 94 -78 28 94 50 -146 -368
5553 -368 -31 105 -117 23 175 212 98 52 -112 -34 -23 63 45 -63 43 127 -124 57 -183 -63 -75 -172 -136
5576 -136 -30 -174 -185 -233 69 19 35 -165 293 -185 -108 -23 56 -27 -58 176 -23 -200 296 107 318 -82 157
5599 157 169 -68 229 167 -12 -144 185 82 102 205 174 251 -53 -309 -173 -86 177 90 44 125 56 37 267 -49
5623 -49 41 -127 151 -123 161 47 -34 -141 74 -18 -201 82 22 -125 -32 227 170 -9 86 -68 104 5 -85
5646 -85 -200 39 196 -74 259 -247 -163 -103 -56 21 -57 -113 -331 -15 35 37 -76 237 -59 -66 276 10 -9 -60 -171
5671a71L29k50j21M63j46l10N7N20l45k2J20j82j79J5K13J30Rj33R1K7j41n7N6
5694b7Q4k38L2k9K04J7j73K32j47R0K33k47m35M05j1L2rk84M16Q4l06L47j55j14
5718AJ29R0j04J23k87P4K03l37K55k54J45l9j25J77P9j75L5J48l69J10K26J22
5740B27k19r7Kj7O0r1K89k61j6R2m6J89m75L38j4l6k13K27M09j94l00K47P0j45
5764B6q7L58j03k19mK44q6J00j50j98J2p4M01k09K8m8p7J78k88L31j71J03K3j49
5788e9L71k98j32j4J86l02J01K75j52o0J91j72L09j47j94L11J37m82nP4j23L11
5810A26K5k5k4l39Q6L91n85L66N6j1p8K0J89n9j69J19p7j9Q2J9r9P8j68K33p9
5835E8k08J88J2nk61J10J41J97l92l8M39k31l1P1O3r1j00J81k27j4j30K36K08
$$ plain form
5671 -171 158 -92 -213 250 104 -206 -149 371 26 4 124 -58 -237 -222 -9 121 130 -3 88 115 -26 -83 -27
5694 -27 57 -181 -149 -178 26 43 -130 102 -45 45 278 31 -404 1 -10 22 13 -271 145 229 -77 270 115 1
5718 1 130 220 116 239 -48 26 229 -108 147 -107 38 -1 -126 51 130 -45 -10 138 -231 -121 105 227
5740 227 8 -89 -87 -104 -44 -135 154 -107 -123 -31 -77 112 -363 -25 -39 -75 -288 -61 348 154 -146 101 171 26
5764 26 -61 297 194 -25 -29 215 129 229 79 -119 -107 -181 220 11 39 -9 -86 92 -196 135 -36 67 90 -59
5788 -59 312 14 -118 -132 54 -248 -147 128 -24 -84 107 -65 244 97 -97 214 351 -131 -136 -62 -185 126
5810 126 151 126 102 -237 -151 240 -345 21 77 66 -12 8 197 138 -31 88 11 -8 74 93 -6 72 -96 137 58
5835 58 -150 38 50 45 -216 -106 35 232 -160 -198 241 10 -21 50 113 22 -78 103 -124 -138 -268 -32 176
$$ [...]
8191a42
##END NTUPLES=NMR FID
##END=
