##TITLE=1H_LR-0169-C1-CH2Cl2
 CCl4
 8 sc, 
 20.2.2023
##JCAMPDX= 6.0         $$ Bruker NMR JCAMP-DX V2.0
##DATA TYPE= NMR FID
##DATA CLASS= NTUPLES
##ORIGIN= UXNMR, Bruker Analytische Messtechnik GmbH
##OWNER= root
$$ XWIN-NMR		Version 3.5
$$ Mon Feb 20 15:01:14 2023 Russian Standard Time (UT+4h)  she@DPX200
##.OBSERVE FREQUENCY= 200.131
##.OBSERVE NUCLEUS= ^1H
##.DELAY= (6, 6)
##.ACQUISITION MODE= SIMULTANEOUS
##.ACQUISITION SCHEME= undefined
##.AVERAGES= 8
##.DIGITISER RES= 18
##SPECTROMETER/DATA SYSTEM= spect
##.PULSE SEQUENCE= zg30
##.SOLVENT NAME= CD3CN
##.SHIFT REFERENCE= (INTERNAL, CD3CN, 0, 15.7039)
##AUDIT TRAIL= $$ (NUMBER, WHEN, WHO, WHERE, WHAT)
$$ ##TITLE= Audit trail, XWIN-NMR		Version 3.5
$$ ##JCAMPDX= 5.01
$$ ##ORIGIN= Bruker BioSpin GmbH
$$ ##OWNER= she
$$ F:/spectra/data/she/nmr/H-F/1/audita.txt
$$ ##AUDIT TRAIL=  $$ (NUMBER, WHEN, WHO, WHERE, WHAT)
(   1,<2023-02-20 15:00:22.56 +0400>,<she>,<DPX200>,
      <created by zg, POWCHK disabled, PULCHK disabled
       configuration hash MD5:
       00 E9 B6 7A A2 85 ED C7 34 08 36 98 17 FE 4E 26
       data hash MD5: 16K
       6D 2F E3 FC 69 CD CB 34 BF A0 05 E6 6E 0C BB 92>)
$$ ##END=
$$ 
$$ hash MD5
$$ 72 DE AD 40 8F BE 60 C5 0B F6 46 7B 70 9D 4C 73
##$RELAX= 
##$RELAX= 
##$RELAX= 
##$RELAX= 
##$RELAX= 
##$RELAX= 
$$ Bruker specific parameters
$$ --------------------------
##$DU= <F:/spectra>
##$EXPNO= 1
##$NAME= <H-F>
##$PROCNO= 1
##$TYPE= <nmr>
##$USER= <she>
##$AMP= (0..31)
100 100 100 100 100 100 100 100 100 100 100 100 100 100 100 100 100 100 
100 100 100 100 100 100 100 100 100 100 100 100 100 100 
##$AQSEQ= 0
##$AQ_mod= 1
##$AUNM= <au_zg>
##$AUTOPOS= <>
##$BF1= 200.13
##$BF2= 200.13
##$BF3= 200.13
##$BF4= 200.13
##$BF5= 200.13
##$BF6= 200.13
##$BF7= 200.13
##$BF8= 200.13
##$BYTORDA= 1
##$CFDGTYP= 0
##$CFRGTYP= 5
##$CHEMSTR= <none>
##$CNST= (0..31)
1 1 145 1 1 1 1 1 1 1 1 1 1 1 1 1 1 1 1 1 1 1 1 1 1 1 1 1 1 1 1 1 
##$CPDPRG= <>
##$CPDPRG1= <>
##$CPDPRG2= <>
##$CPDPRG3= <>
##$CPDPRG4= <mlev>
##$CPDPRG5= <mlev>
##$CPDPRG6= <mlev>
##$CPDPRG7= <mlev>
##$CPDPRG8= <mlev>
##$CPDPRGB= <>
##$CPDPRGT= <>
##$D= (0..31)
0 1.2 0 0 0 0 0 0 0 0.06 0 0.03 0 0 0 0 0.0002 0 0 0 0 0 0 0 0 0 0 0 0 
0 0 0 
##$DATE= 1676890821
##$DBL= (0..7)
120 120 120 120 120 120 120 120 
##$DBP= (0..7)
150 150 150 150 150 150 150 150 
##$DBP07= 0
##$DBPNAM0= <>
##$DBPNAM1= <>
##$DBPNAM2= <>
##$DBPNAM3= <>
##$DBPNAM4= <>
##$DBPNAM5= <>
##$DBPNAM6= <>
##$DBPNAM7= <>
##$DBPOAL= (0..7)
0.5 0.5 0.5 0.5 0.5 0.5 0.5 0.5 
##$DBPOFFS= (0..7)
0 0 0 0 0 0 0 0 
##$DE= 6
##$DECBNUC= <off>
##$DECIM= 32
##$DECNUC= <off>
##$DECSTAT= 4
##$DIGMOD= 1
##$DIGTYP= 9
##$DL= (0..7)
0 120 120 120 120 120 120 120 
##$DP= (0..7)
150 150 150 150 150 150 150 150 
##$DP07= 0
##$DPNAME0= <>
##$DPNAME1= <>
##$DPNAME2= <>
##$DPNAME3= <>
##$DPNAME4= <>
##$DPNAME5= <>
##$DPNAME6= <>
##$DPNAME7= <>
##$DPOAL= (0..7)
0.5 0.5 0.5 0.5 0.5 0.5 0.5 0.5 
##$DPOFFS= (0..7)
0 0 0 0 0 0 0 0 
##$DQDMODE= 0
##$DR= 18
##$DS= 0
##$DSLIST= <SSSSSSSSSSSSSSS>
$$ [...]
##$SUBNAM2= <"">
##$SUBNAM3= <"">
##$SUBNAM4= <"">
##$SUBNAM5= <"">
##$SUBNAM6= <"">
##$SUBNAM7= <"">
##$SUBNAM8= <"">
##$SUBNAM9= <"">
##$SW= 18.0517599122864
##$SWIBOX= (0..15)
0 0 2 0 0 0 0 0 0 0 0 0 0 0 0 0 
##$SW_h= 3612.71676300578
##$TD= 16384
##$TD0= 1
##$TE= 0
##$TE2= 300
##$TE3= 300
##$TEG= 300
##$TL= (0..7)
0 120 120 120 120 120 120 120 
##$TP= (0..7)
150 150 150 150 150 150 150 150 
##$TP07= 0
##$TPNAME0= <>
##$TPNAME1= <>
##$TPNAME2= <>
##$TPNAME3= <>
##$TPNAME4= <>
##$TPNAME5= <>
##$TPNAME6= <>
##$TPNAME7= <>
##$TPOAL= (0..7)
0.5 0.5 0.5 0.5 0.5 0.5 0.5 0.5 
##$TPOFFS= (0..7)
0 0 0 0 0 0 0 0 
##$TUNHIN= 0
##$TUNHOUT= 0
##$TUNXOUT= 0
##$USERA1= <user>
##$USERA2= <user>
##$USERA3= <user>
##$USERA4= <user>
##$USERA5= <user>
##$V9= 5
##$VALIST= <valist>
##$VCLIST= <CCCCCCCCCCCCCCC>
##$VD= 0
##$VDLIST= <DDDDDDDDDDDDDDD>
##$VPLIST= <PPPPPPPPPPPPPPP>
##$VTLIST= <TTTTTTTTTTTTTTT>
##$WBST= 1024
##$WBSW= 4
##$XGAIN= (0..3)
0 0 0 0 
##$XL= 0
##$YL= 0
##$YMAX_a= 114697
##$YMIN_a= -182976
##$ZGOPTNS= <>
##$ZL1= 120
##$ZL2= 120
##$ZL3= 120
##$ZL4= 120
##$ABSF1= 10
##$ABSF2= 0
##$ABSG= 5
##$ABSL= 3
##$ALPHA= 0
##$AQORDER= 0
##$ASSFAC= 0
##$ASSFACI= 0
##$ASSFACX= 0
##$ASSWID= 0
##$AUNMP= <proc_1d>
##$AZFE= 0.1
##$AZFW= 0.1
##$BCFW= 1
##$BC_mod= 2
##$BYTORDP= 1
##$COROFFS= 0
##$CY= 11.3945322036743
##$DATMOD= 1
##$DC= 2
##$DFILT= <>
##$DTYPP= 0
##$F1P= 2.36226072786647
##$F2P= -0.459571619588291
##$FCOR= 0.5
##$FTSIZE= 0
##$FT_mod= 4
##$GAMMA= 1
##$GB= 0.15
##$INTBC= 1
##$INTSCL= 1
##$ISEN= 128
##$LB= 0.24
##$LEV0= 0
##$LPBIN= 0
##$MAXI= 10000
##$MC2= 0
##$MEAN= 0
##$ME_mod= 0
##$MI= 1.114404
##$NCOEF= 0
##$NC_proc= 0
##$NLEV= 6
##$NOISF1= 3.799351
##$NOISF2= 2.8
##$NSP= 1
##$NTH_PI= 0
##$NZP= 0
##$OFFSET= 15.70392
##$PC= 1
##$PHC0= -19106.38
##$PHC1= 7.60078
##$PH_mod= 1
##$PKNL= yes
##$PPARMOD= 0
##$PSCAL= 0
##$PSIGN= 0
##$REVERSE= no
##$SF= 200.130013532006
##$SI= 16384
##$SIGF1= 3
##$SIGF2= 2
##$SINO= 400
##$SIOLD= 16384
##$SREGLST= <1H.CDCl3>
##$SSB= 0
##$STSI= 0
##$STSR= 0
##$SW_p= 3612.71676300578
##$SYMM= 0
##$S_DEV= 0
##$TDeff= 0
##$TDoff= 0
##$TI= <>
##$TILT= no
##$TM1= 0
##$TM2= 0
##$TOPLEV= 0
##$USERP1= <user>
##$USERP2= <user>
##$USERP3= <user>
##$USERP4= <user>
##$USERP5= <user>
##$WDW= 1
##$XDIM= 8192
##$YMAX_p= 0
##$YMIN_p= 0
$$ End of Bruker specific parameters
$$ ---------------------------------
##NTUPLES= NMR FID
##VAR_NAME=  TIME,          FID/REAL,        FID/IMAG
##SYMBOL=    X,             R,               I
##VAR_TYPE=  INDEPENDENT,   DEPENDENT,       DEPENDENT
##VAR_FORM=  AFFN,          ASDF,            ASDF
##VAR_DIM=   8192,          8192,            8192
##UNITS=     SECONDS,       ARBITRARY UNITS, ARBITRARY UNITS
##FACTOR=    0.0002768,     1,               1
##FIRST=     0,             0,               0
##LAST=      2.2672688,     0,               0
##MIN=       0,             -182976,         0
##MAX=       2.2672688,     114697,          0
$$ Real data points
##PAGE= N=1
##DATA TABLE= (X++(R..R)), XYDATA
$$ [...]
1783h7k3k61K66Pq3M31j36m24%J64J22L2N6j66N8N7K8J68o3j38J9j6R4M24m09
1808A20p2J1j82K38J57K5k0j08l8j6M6K04j99j38o3mL17n8q1j74l16K18K57O7
1832A91J49o16K79R2j03J24p6l1L8k53L3P6R8OP7l47J64jK36R3m13p6mR4L35k68
1858a03K44n32K1M49p3J55l19M0R5L7K83j84K4l00L0K45k28K71q1l85K89j07L34
1881B05J8j23k81P7J89Q7mOj90p6L4K43j10j44J04j63Q2j62L82j87K50l94k0l2
1905b09M70J40o19K24j65L02J39j31o1l22K2L08J78l29K58k08j26L24Rm22M03
1926A85l36o8j69K66M54m6k91l23n1L52K46j04j13l64K31K34J9r3k19j22K55J44
1948H7ll16K5j99K73j58l8L51n9o5k21k7L78L48l61j34L1M0JQ5N3l16j66J97L09
$$ y = [-87, -110, -371, -105, -98, -181, 250, 114, -310, -310, -146, -24, 8, 64, -102, -44, 13, 41, 209, 146, 8, 27, 11, 105, 529, 120, 48, 59, -123, 115, 272, 297, 277, 169, 131, 115, 161, 365, 166, 28, -35, -39, 278, 220, 139, -35, -351, -133, 124, 191, 340, -276, 3, 95, -8, 116, 40, 9, 47, -206, -173, -97, 1, 7, 84, -263, -99, -100, 136, 229, -184, -260, -264, -170, 165, -103, 141, -391, -370, 79, 6, 161, -158, -118, -23, 14, 297, 113, 137, -163, -133, 112, -116, 155, 74, -311, -22, -129, 205, 223, 100, -181, -104, 85, 172, 168, 174, -16, -92, -58, 185, 75, -69, 35, -128, -46, -208, 174, -13, 237, -157, -177, -209, 261, 401, -218, 6, -159, 143, 282, 151, 90, -232, -210, 98, 276, -53, 205, -3, -129, 195, 204, -218, 185, -151, -219, -388, -122, 332, 286, -5, -328, -379, -27, 219, 115, 2, -362, -131, 103, 122, 29, -190, -312, -57, 87, 84, -232, -207, -406, -133, -291, -329, 22, -37, -102, -323, -350, 28, 376, 15, -119, -88, -48, -47, 38, 91, -225, -391, -194, 115]
1973A15k0J02k07L0JP8l07J02J79l54r6M40M9O7l9l53mJ82L62j78k9l70L46o4
1997C2J96Kj29O1l28R5J76O4r5K61m76L48o03P36k12q2j54r9J57M40N7n77j64
2020b94K10r3Q8p3P6J15k57n9K27N4j42q3Nl2J38r6k7K85l1k86J17L74j53k10
2044a47q1r8L69q8K50k83j06J75r2j0j10R2J22K44l60J75M9k2j87M1K18j35J03
2067A19J64j93M6l41K32L91r6k37o3R7L58k18p8j31M8Q2J30j13j8J5R5k20j5p4
2091b0J5J92k01M2J3j35L0M0k17j20J54J46K09J23m35R6J71j76J12r1l74J63J92
2114g1k41P0M2K3l9j44K7M38L8l61K74m46J71j35K89K48n79L08PK35l0l56M02
2137A70r8m9k13N25M6m07J29m6J44j74K35Mk92j62K33J75N9o5lj96J02M3J71m43
$$ y = [115, 95, 197, -10, 20, 21, 99, -208, -106, 73, -281, -377, 63, 112, 179, 140, -213, -217, -35, 327, 149, 120, -250, 96, 32, 228, 230, 101, 162, -166, -71, 105, 169, 74, 335, -141, 207, -396, 340, 128, 46, -108, -207, -50, 390, 447, -130, -294, -84, -177, -89, -162, -86, 29, -228, -287, -60, -6, -148, -231, -226, -258, -120, -216, -243, 42, 11, -275, -158, 216, 63, -147, -228, -326, 43, -45, 205, -78, -184, -9, -101, -111, -221, -129, -7, 237, -123, 52, 101, 79, -108, -67, 151, 16, 119, 283, 90, 136, -205, 27, 418, 322, 85, 22, 119, 477, 259, 181, 50, 98, 180, 310, 197, 179, 194, 289, 69, 54, -20, -5, 187, -14, 28, 41, -94, -64, -24, -241, -361, -207, -61, 148, 271, -164, -68, 103, -73, 39, -52, -426, -263, -71, -312, -242, -200, -177, -216, -360, -333, 105, 143, -218, 56, -390, -219, -354, -65, 183, -396, -88, -81, 154, 124, -232, 170, 72, 23, -190, 335, 381, -26, 103, 57, 201, 27, 262, 266, -26, -188, 45, 220, 279, 214, 211, 15, 117, 160, 331, -112]
2161a12J33K03J89l02K58j69k07j46RM15k93L5J5q5o3N2j45J57K4j87L5J16R5
2184B7k27J34o5J08M01o20J74r4L06m67j52L14K58j60J7K20j85p3pQ5j08K3n6
2207a47P1J1J81l83NM05j72J31m6Pk60J34J54j79J23J07p7J26l19l0K05J68n9
2230A56J08k87K44N3q1k69k92M19J69P6k47N7k76J99l09K27Q5QK21k65P3L9k31
2253a23N1L7j67K2K84J56k81K17m00J52L3L3J63l84j8K97L1n2Pk61Q0K59j30j20
2277a14j5J66j0p8j82J9L13j11p8j23j8m3L35j40j12J71j24L73k93n9K17j15J05
2300H4M2k34p0K58j7L9k63j07M62j92L5k5k2J03J35P0k81L5q7Q6Km7j03R6K96
2325B95k96L07m14j03L47Rk28K14N6k6M5k51Op3M37l66j38r6L56K13l9j65k76
$$ y = [-112, 21, 224, 413, 111, 369, 200, -7, -153, -144, 271, -22, 13, 28, -57, -120, -68, -213, -56, -32, -219, -184, -68, 27, -200, -66, -131, -23, 378, -242, -68, -162, 144, -323, -475, -161, 97, -63, -46, 174, -11, -84, -91, -6, -114, -91, -147, -76, -65, 116, -267, -262, 143, -29, 102, 56, 63, -197, -63, 91, -88, 35, 142, 65, 191, -128, -158, 47, 215, 156, 264, -23, 221, 274, 193, -76, -368, 51, 220, 296, 49, 106, -170, 29, -280, -53, 32, 40, 261, -4, 69, 108, -123, -72, -35, -202, -180, 104, 260, -21, 196, -204, -52, -19, 14, 177, -207, -225, 72, 103, 51, 58, -203, -123, 136, 6, -114, -129, 37, 27, -51, -233, -214, 99, -12, -90, -213, -231, -274, 61, -79, -191, -20, -144, 229, -64, -123, 94, -21, 84, 126, -108, -178, 80, 63, 102, -161, -268, 194, 2, 37, 12, -10, 93, 228, 298, 17, 52, -35, 51, 53, 6, -97, -1, 295, -1, 306, -108, -211, 136, 145, -83, 131, 187, 161, 206, -45, -39, -112, 325, -41, -179, -275, 81, 294, 255, 90, -186]
2348a86P2K98p0p2k25j74L44J54k49r2r5L26l23J8K57J70o0l02P5k6J42K54l73
2371a37K0J61k38R4K31M2n27K58J79J47j35J5j82n3N8J28k04L10k34J48m9l29
2393b97L10N6J20j50q0J22j0J70j55j03j45n0M60j46l25J4K34QJ3J13J43j74k01
2416g3P2n9J8K51l9k24o0j52L96l3k68j77M48l10M46l11k5J5k2J00J66j92N3P1
2440I1k07K48l41J6J24k6q5n9J47RK42j89n9j95N15l11k2n9j71L02K0l7J37J6
2464A06j80K99l69L4R1L4L3p7P9j56J64O1N8l14j4L64l5j86j19j52M03P5q3J8
2488A34J08k99R3J15k5k68j8L46K9j36j35j88L24J0j75k63M57N6k87m6J18k22
2510b72K10K63j75J84m15K02j29K53N2m03K97r6J5k72J93j5K77l08L6j84K11K02
$$ y = [-186, -114, 184, 114, 42, -183, -357, -13, 141, -108, -200, -295, 31, -292, -274, -17, 153, 93, -209, -134, -160, -18, 236, -137, -117, 44, -194, -100, 131, 173, -354, -96, 83, 230, 95, 110, -72, -125, -67, 61, -143, 167, -67, 81, 32, -297, 13, 69, 189, 39, -41, 81, 71, 241, 86, -17, -162, -212, 248, 102, -223, -209, 25, 33, 46, 159, 302, 128, -73, -1, -60, -42, 209, 170, -54, -114, -266, 130, 97, -171, -348, 100, -210, 236, -75, -100, -85, -107, -7, 159, -33, 20, 91, -116, 132, -209, -193, -69, -95, -180, -239, -92, -83, 159, -30, -89, -284, 231, -80, -102, -161, -332, -30, -10, -47, 90, 106, -74, 225, -144, -110, -19, 15, 48, -29, 50, -106, 58, 119, 177, -137, -151, 213, 178, -8, -127, -279, 124, 199, 116, 134, 242, -57, 36, 151, 126, -142, -160, 186, 215, 79, -56, -244, 80, 90, -85, -348, 109, 165, -122, -168, -50, -272, -62, 201, 26, 210, -205, -3, -132, 121, 173, -230, 67, -29, -14, -286, -93, -108, 169, -139, -103, -287, -76, 126]
2532A26k76K8j03J6J96n0j55K88J9j90N1l9ml1J43L74l87j20j2J10m8o7K31J89
2556B89j36q9k62Q9J82j83K12j13J3j6J39J72l91M8R8r8l3L37q6l64K97k65K76
2579A16j28N7j24L21l06n0J7J02J49l45n5M55l24N8J57m05K53m7J60k09J49j64
2601a63J71j60J49m6M5j07J49o7p5q8K57R4k5j3k48j9J98J3k56K21k22Q7M5J56
2625I6r6j84J89j73q7O55n35K61k57J79k10K87J38l02p6R3J79N3j08r9q0J98Q6
2648B07K0k90j02K38j46r6L7K61M5j06k2k3Po0K76l99K37M3q5M2k18J01j59K40
2672D8M1m3j27N3j94oK06L4J1q1J02j92J6J43J60q7Rj31k6R2k29J58l3P6n7K63
2698B06k86k04J26p4M02j80Q2j20P8p1p3j37P3p7L47r6n2j27J96k48L01P1j13
$$ y = [126, -150, -122, -225, -209, -13, -63, -218, 70, 89, -101, -50, -89, -93, -124, 19, 393, 6, -114, -126, -16, -64, -131, 100, 289, 153, 64, -198, -109, 73, -110, 102, -11, 2, -14, 125, 297, -94, -46, 52, -46, -79, 258, 172, -192, 105, -160, 116, -12, 45, -79, 242, -64, -114, -97, 5, 154, -191, -246, 209, -115, -57, 100, -305, -52, -99, 61, -148, 1, -163, 8, -152, -3, -49, -4, -111, 38, -29, -104, -192, 65, 159, 134, 121, -127, -146, 52, 65, -191, 30, -192, -105, -60, 96, 0, -184, 5, -168, -255, 400, -135, 126, -131, 48, -162, 125, 263, -39, -115, -22, 157, 210, 102, 3, -77, 121, 207, 227, -63, -165, 73, -73, -169, -132, 129, 174, 68, 46, 23, 30, -30, 246, -153, 84, 127, 42, 84, -134, -33, -192, 48, 89, 46, -81, -28, -222, -228, -22, 12, 23, -58, 44, -148, -132, 11, 171, 84, 93, -38, -64, 28, -201, -43, -76, 0, -57, 206, -80, -284, -158, -232, 170, -10, 72, -48, 30, -41, -114, -251, -178, -255, 92, -4, -56, -183, 13, -235, 66, 137, 24]
2721B4K33k01o3o1K76k39P6R9l55M17k07Qp9J28j15J32L23m63R3K53l21N1J94
2744B03l22K31j47K99j52j5p1j5m4j11O0J36k36M07q7o1L1j66L30l58L59k41k17
2767a87L32r7j21L1k1L67j45l48O0M6l9K75K8k49RJ3Q9m7o5M5P9J68k04j43j30
2792b54P8K86j52j15M01j14k98J81L0q2K43j30jJ84k59q9M3N8r5k2K02P5k54M2
2816d2P9k9p0O4J12kq2L07l52j94J54J34j93J95o8r3M35l21k22K48k23L64j39
2839F2m2k1j66O0L70j95p3J28j49k6j19Q6r5J01R6n5q9J70m3q1P6k9k75N47m42
2864b04l4J91j43P5J11J01k30J6K45j0k6k48j1K63J1j39on6LJ78k29K6J85j29
2888f0j91L44k3J33k88j23L22J65k35j16J01n4J22r4l0ON6m9R4j31m7K15n4j57
$$ y = [24, 257, 56, -7, -68, 208, -31, 45, 144, -211, 206, -1, 7, -72, 56, -59, 73, 396, -67, 26, 279, -42, 9, 203, -119, 112, -35, 264, 112, 97, 26, 11, -33, -144, -84, 52, -184, 223, 136, 75, 106, -60, 270, -88, 271, 30, -187, 145, 48, -73, -42, -63, 304, 159, -189, -129, -83, -122, 153, 181, -68, -59, -46, 43, -4, -69, -24, 55, 223, 19, -124, -254, -176, 110, -42, -157, 244, 130, -168, 13, 43, -39, 204, 74, 73, 257, -2, -91, -48, 10, -85, -107, 95, 170, -84, -42, 37, 8, -62, 2, 114, 112, 30, 337, -15, -209, -55, 79, -114, 81, 13, -80, 355, 34, -188, 60, -163, 201, 62, 20, -1, -167, -107, 263, 68, -5, 123, -26, -52, -171, -85, -180, -79, 17, -38, -127, 43, 0, -81, -5, -34, -309, 238, -204, -238, -47, -190, -115, -4, 97, -133, -117, 128, 118, 92, -156, -167, 96, 107, -32, -38, -94, -91, 87, -142, -116, 69, -60, -251, 93, 70, 203, -85, -208, 114, 279, 44, -72, 29, -25, 97, 3, -27, -21, 35, -14, 80, -51, -98, 117, 63, -94]
2912i4K31J51k10j21K00j86J69j9k33K83j18l09J24jJ60k34K48L52l46l71K90
2933c4k1j9J98l02K16j6M6k12P3R6J3oj95K10m11N45J44k13j81M1j46K03Q3q1
2957C1J53k24nN6J15J9p0K2j81J92j51m7P6J96j5j93L9j9K03k98J9K39q8O7k19
2982h3n0M0J52j77l7l3M54k46lm5J2j9J61j80M1j44K50m57O83l66j13J98K55n05
3006b12j31L77j30j37L26J97l66K19j1L6j4j72k66K41mK46j85j1K73k80k58K88
3028B6Jj91L18j91M0p9K09o3P4q5J4R0j96L05j1k67L08l56K18k86Q1l7M09m42
3052a11J24J71J04j90l16J66L0J19k08Q4q1k38L58J98k72o0K25m2j40mJ83P2r4
3075G8M1Q0j93j08l5J92O7m5k57J65j1K88k37o7j47J54R0k1ol7j21J9p6K1K51
$$ y = [-94, 137, 288, 78, -43, 157, -29, 140, 121, -112, 171, 53, -256, -132, -133, 27, -207, 41, 393, 47, -324, -34, -55, -74, 124, -178, 38, 22, 68, -144, -71, 25, 38, 32, -163, 47, -364, 181, 325, 112, -69, -28, -174, 29, 112, 31, 184, -40, -45, 11, 126, 145, 75, 97, -84, 108, -43, -90, -14, 182, 167, -26, 13, -6, 197, -101, -82, 157, 69, 136, -83, -133, -93, 59, -118, -155, -188, 266, 20, 17, -28, -16, -35, 126, -54, -13, -157, 93, -364, 319, -47, -160, 38, 293, -212, -343, 34, -96, -233, 93, 290, -76, 143, 132, 168, 154, -18, -284, -43, -47, 199, 14, 3, 276, -4, -262, 26, 27, -164, 154, -37, 3, -76, 133, 70, 144, 59, 73, 163, -33, 272, 261, -6, 302, -54, 164, -122, -41, -78, 331, -111, 13, 184, 288, 98, -218, -52, -22, 97, -111, -27, -108, -346, 12, 210, -62, -122, 103, 61, -79, -83, 100, 172, 78, 119, 199, 6, -102, -137, 55, 122, 77, -180, -15, -26, 262, 25, -42, -189, -35, 55, 34, 28, -9, -130, -111, -187, -166, 85]
3100H5M7j86L7P0lJ30k01N7q5R5j54J56K73n06J16M3j49L56J5k73kJ61p1o9q6
3125a44M45m14R1J69j29p0K15j98L2P8j02l8Q1k2J17k52p0K42k79L49j97J55j26
3148f7J90l4R0R8k13l4P7j20j02K81l38K84n7j6j62lj41L82l3q1j30J17J25j40
3172b7m4l1M02k16l06J81Q7K00j0k12r3K5L9n0K58j41R8k77J75j85L05k77P1n0
3196g8j56M59j90k67J80k82L48J6k54O4O3k6J81j74J13J19k40J05Q4J00o7J2r8
3219A2p6N5J1k7L06l33k90K09N7K63m75K80j66J44L8k14L39j93Q8j7p1M8R9l20
3243b33Q0jKj52L83k18K5K86j16L34l54n8P4J25k05Q3L8j60k52L44N9l38L34M8
3267A28k07K86k03l47M26K3L2n0j25J28P9j35m03L27j01J88j75J25NL31l79o2
$$ y = [85, 132, -54, -17, 53, 50, 180, -21, 36, -49, 46, -108, 48, 321, -185, -69, -26, -175, 181, 196, -77, -79, 82, 11, -58, -144, 301, -113, -22, 147, 18, -52, 163, -35, -3, 75, -27, -65, 16, -6, 111, -141, -211, 31, -248, 101, -96, 59, -67, 123, 89, 179, 277, 64, 30, 107, -13, -115, 166, -172, 112, 55, 39, -123, -126, -267, 115, 82, 1, -129, -12, 113, -27, -71, -102, 300, 84, -222, -41, 46, 246, 236, 24, -69, -44, -5, -55, 203, 62, 160, -117, 58, -127, 178, -99, -28, -78, -234, 225, 35, -232, -52, -334, 14, 30, -224, -160, -97, -123, 58, -116, -3, 116, -124, -19, 65, 165, 98, 110, 12, -64, -9, 2, -25, 281, -52, -342, -133, -76, 187, -288, -8, -174, -30, 8, -206, 133, -60, 28, 11, -60, -12, 87, -233, -153, -154, -152, -304, 79, -139, -114, 172, 56, 390, 36, -22, 52, 177, -28, 55, 93, -67, -319, 25, 84, -254, 80, 128, -79, 207, 4, -343, 83, 106, 138, 88, -37, 91, 170, 35, -368, -41, -142, 46, -129, -4, 1, 332, -47, -109]
3289a09M7j21K00L07k15j38J64k0qk3j49K88j27q0P7p7J62r8j48m0J04K76j36
3312A36j40J35l04K1L16N0l90K36o9J36j42R9N7j22o6J78o1J65l66K29l19q2L80
3335G7R7k49R7Q5j97J2N0j4j95O5L41j21l01P6J98k02K96r7m5K77j66m6j01j44
3359b07K11j16J10j86K15J04R6o14L63J48k91L03j98N4Q8j81r7L19J0l70J90j79
3381b28R2K45l6o8rn4m6M0L18k33j83M05lk37kK34j05P8r0j81M9o4J58ol6J80
3407B18m74Q6J21j30K01k19J04M82k66k24L39m9r9l32M25j32k08J81n2J01k3l7
3429A3p8Q0l6m9rq3O7K67l16K21k10K02jK0P4k38O1j02nL10j21j48K05oO9k97
3455a10L25m1n0k50J77j18K4NK22Ll25J45R8r7Q9l3k02J25N8j31k8L2K03k74j5
$$ y = [-109, -62, -183, 17, 324, 109, -29, 135, 115, 107, 84, -65, 223, 96, 16, 93, 16, 178, 80, -68, -108, -4, 272, 136, -4, 131, -173, -152, 164, 214, -176, 60, -9, 127, -15, 84, 141, 19, -47, 131, 70, 235, -131, 98, -221, -303, 77, 174, -75, 22, 107, -90, -78, -28, -42, -237, -172, 169, 48, -253, -177, 21, -181, 115, 18, -27, 250, 84, 38, -63, -207, 4, -112, -2, -188, 27, 131, 227, -387, -24, 124, -167, 136, -62, -8, 80, -101, -198, 121, 131, -239, -49, -228, -136, 109, 73, 5, -4, -58, -104, -64, 254, 21, -162, 243, 240, 3, 1, 235, 130, 208, 118, -63, -14, -78, 80, 74, 38, 218, -256, -170, -49, -179, 22, -197, -93, 389, 123, -101, 238, 189, 90, -242, 183, 51, -157, 24, -28, 73, 50, 13, -65, 15, -21, -70, -79, -162, -95, 172, -144, 77, -133, 69, 68, 88, 162, -76, -15, -117, -122, 188, 67, -81, 124, 118, 187, -110, 215, 174, 124, -126, 51, -67, -43, -38, 184, 187, -138, 7, 105, 8, 97, 64, -138, -13, 45, -86, -114, -82, 121, -153, -168]
3480a68j77K53J08q1R0k56J92O2j96N61l67R7l85J32R1j75J68L4M9J31K44o10
3502b03N5J18R0m7J13ko2rm21M56o7p6O1q1J85r9j90K82k32K43j42l2LJ19j67
3527a05j57M84k72k41K29K19j31QJ05k15J71K9o2m3k43K91j9j82r7J41K41j94
3549d3k5K02q6Q3K7o4R1k88j25P3L3j1j05J12J93m1Jm7R7K7kJj47R0j14J9K84
3576B35j83M6l8M3M4k74Q9K13k34K68k00q8K55p0l09O2K5o8K98K9j61j70J67K0
3600aM2m4l19N29k02J21k64K7K68k50J58J7k98J84J14m7j70J37L5J54J8l26r6
3623b13L97k20Jj6k10J49J62j25J0Q0M5O4M2l81J77p2K78k47K16k55L4o0n4L05
3647A07k75J25K97j58j4J87l27K15k81k44M54k35k6J86O6r3j40K48Kj51R4r6L41
$$ y = [-168, -345, -92, 16, -65, 25, -231, -39, 23, -173, 388, 21, 118, -267, -135, -44, -219, -51, -17, 32, 163, 407, -203, -148, -30, 60, 13, 126, 124, 62, 53, -368, 88, 21, -55, 6, -75, 110, 11, -179, 103, -129, 114, -28, -60, -57, 62, -105, -262, 222, -50, -291, -62, 157, 26, 34, 139, -76, 95, 124, 62, 19, -224, 67, 48, -134, -231, -90, 151, -43, -68, 134, 48, 131, 158, 94, 185, -103, -228, -155, -122, -133, -238, -126, 67, 26, 27, -20, 77, 104, 102, 103, -44, 46, -68, -49, 235, 52, 98, 60, 103, 147, -127, -38, 175, -59, 209, 9, -79, 176, 106, -203, -141, -116, -184, 114, 143, -18, -188, -21, -1, 41, -3, -322, 207, 5, 126, -138, -111, 157, -93, 65, 82, -216, -32, 82, 35, -135, 2, 37, 191, 209, -117, -213, 184, -36, -35, -51, -261, -112, 50, -75, -65, 15, 60, 124, 166, -215, -38, -110, 168, -79, 137, -118, -84, -144, -198, 107, -168, -43, 254, 96, 82, 269, -58, 157, -124, -368, 86, -149, -175, 11, 77, -16, -156, 92, 94, -57, 37, -59, 282]
3670B82j32j98L02o0j96K2n2n9K71k14j48J55o7l9K7K49k67j5K25q3j70QQ7J58
3694H6Jq6l53L16k03K5K45K26j81j05Q7l0j18QK23J46r2m2m6k28J36Q4J03k31
3718b9J52j63n7J61k27J57j73K19J77l18Q2K7J4M1k24J21j21K18rk64J56RO8J7
3742C4%k10M01k10j9l1M2q3N3J85l77K65j67J48n4l0Kn2k5J59j83N7J25J6j83
3767a37M8K42N6l81JJ05p4J76j12J34J5M5J1nR2k32M9j67K79m4l13K65mJ4L3j73
3793g7Q4k02J22j59N7M21j16J12j95k08K64L3O0l84L27j32j34J3j81J65L60l69
3815a39m8K36J5j49L16l76R9K40k91K56l17N67l60n5N5j89n1N5K41j68J82l24
3837b05M11j30j53l2L28l45j03M12j50j45K55m86L73K3L3pj11Q9m2J84j95N6k07
$$ y = [282, 150, -48, 254, 194, -2, 20, -32, -91, 180, -34, -182, -27, -94, -133, -106, 143, -124, -139, 86, 3, -167, -159, -72, 86, 87, 1, -352, -36, -239, -214, 31, 257, 76, -29, 58, 28, -90, -82, 141, 287, 195, 153, 107, -121, 15, 99, 202, -29, 123, -40, -97, 64, -163, -6, -179, 40, 217, -101, -19, 8, 22, 63, -161, -40, -161, 57, 48, -216, -60, -51, 17, 34, 34, -176, 225, 15, -4, -35, 7, -76, -23, 162, -215, 50, -117, 31, -23, -53, -51, -103, -128, 31, -152, -95, 30, 46, -137, -89, 153, 209, -172, -171, -66, -140, 36, -76, 58, 73, 118, 129, 124, 216, -16, 33, -134, 145, 101, -212, 53, 49, 63, 96, -77, 7, -195, -73, -232, -175, 246, 130, 242, 47, -161, 103, 136, 196, -188, 139, 7, -127, -114, -295, -130, 230, -139, -187, 49, 64, -85, 231, -145, -46, 194, -97, 159, -158, 409, 49, -6, 49, -140, -191, -136, 105, -63, 119, -205, 206, 76, -77, -109, 219, -126, -229, 183, 33, -112, 143, -343, 30, 53, 86, 79, -32, 57, 15, 199, 4, 60, -147]
3860a47m3K40k40K61O1M0M7P9m24J29R2O6l19J26j69L65Q6l12K77O6l07J95m1
3883A28n7j3j89R9K44N8l47l1J12r9r4Q3J64J04k74K15j84J8n1K98j71J23l8p7
3907B1q3o0K39j91K8J87j05n6L8J08k30N3J89j97l3pK05K9k29J74n9j84J34J17
3931H8J33m58K61K18j10o7J83k09j46K81qk75o3M11l32Q6j07K7j78J86L4j12J36
3954b1p8o9K16k36L48k38J70j62O3or2rJ24J45m47N54P6l98L5J30j40L22m22J8
3978a17J12m4J32k55K79Q8Q1l18Q3j05P1k15k3K53q4L5N3J48k56J76k08L0P1J36
4002A23j03Op6Q4k59J55J39k3L1n1K68l06J21j37K35k28K7p5R5j5l1j07L30l84
4026a81J79n8j14J22J18j98K03k76K73k18K12Q3N2l75K42Q1j22k42K47mk19L19
$$ y = [-147, -190, 50, -190, 71, 132, 172, 219, 298, -126, 3, 95, 161, -158, -32, -201, 164, 250, -62, 215, 281, -26, 169, 128, 71, 58, -131, -32, 212, 270, -77, -108, 4, -95, -189, -106, 58, 162, -112, 103, -81, -63, -114, 184, 13, 136, 98, 21, -62, -122, 117, -74, -46, 141, 36, -20, 18, 126, -104, -51, 138, -59, -92, -99, 106, 135, -94, 80, 21, -163, -29, 88, 221, -237, 24, 242, 132, 65, 248, 39, -107, 174, 166, -109, -172, 239, -93, -7, -114, -87, -265, -79, -45, -157, -21, -99, -168, 48, -188, 160, -78, 92, -70, -7, -13, -105, -114, 10, 155, -292, 262, 338, -60, -25, 105, -35, 287, -135, -117, -5, -49, 83, -172, 107, 195, 276, -42, 41, -64, 7, -208, -231, 22, -62, -27, 26, 174, -82, 94, -114, -84, -13, 123, 20, 26, -50, 34, -225, -70, 69, 46, 77, 26, 294, -12, 109, -28, 207, -21, 6, -69, 26, 11, -20, -127, 203, -181, -2, -60, -174, -52, 66, -132, 71, -205, 68, -150, 62, 145, 197, -178, 64, 145, 23, -219, 28, 24, -195, 124]
4048A24j82K00k66j5L9K79l41K89m04J98L2R0q5L52k26J15j32j2j47K17QM4j64
4071A3j42J62p1q1j35M58k91K14j31Q2J8k05Q6l56M58r4K26m58J03J91k16R2M3
4094c4OJ99j82n8j3m0K56k17J69o1j53R7P4k68K93k89L01j68K28l53K33nm6J41
4118A10j01n7o3J06J94Q8k98q3jK9P5q5J69l9k10K00q8K8kj55K49m8j85L35r5
4143G3k21K04pN0k22j07K36Q9k77J68P8k59N18k87L87n30j86L72j81J17j46P1
4165f0J54k46Q2K8j62K89r7J10k4k25J75J26k30j39K99j04Q7J46j13p1k4L7P5
4188A13K17m98J86k63K76k58O4M0K32O2j83K77k57Pj31J3J52j05O8O4q1K3K7J24
4212A69j85J80j88J25o9J85l94K79k52j4j50O1M68l43K67K7k1j17j33M8k17L34
$$ y = [124, -58, 142, -124, -139, -100, 179, -162, 127, -277, -79, -47, 43, -42, 310, 84, 199, 67, 55, -92, 125, 133, 177, 13, -129, 33, -38, -119, -254, 204, -87, 127, -4, 78, 96, -109, -23, -379, 79, -15, 211, -247, -144, 47, -169, -77, -34, -28, 171, -11, -69, -82, -122, 134, -83, 86, 25, -128, -31, 43, -225, 68, -221, 80, -88, 140, -213, 20, 15, -31, 110, 9, -48, -111, -5, 189, 277, -21, -104, -105, -76, -1, -86, 83, 44, -166, 34, -54, -26, -28, -183, 66, 18, -167, 168, 73, -148, 56, 49, 99, -123, -230, 6, 95, -182, -14, 64, -195, 323, 36, 423, -107, -293, 79, -102, 15, -131, -60, 94, -152, -70, -42, -204, 85, -12, 98, 74, -151, 24, 150, -80, -219, 80, -24, 63, 209, 96, 25, 1, 38, 113, 330, -168, 18, -245, 31, -227, -163, -123, 109, 171, -12, 265, 8, 15, -116, -103, 49, -56, 12, 76, -5, 18, 45, 169, -16, 164, -24, 101, 32, 217, -177, 102, -150, -164, -314, -253, 215, -128, 139, 166, 145, 28, -105, -57, -274, 60]
4234F0O3k66R7L4m3K02k54J13k90J49m4J18K80n8j93k03K98j44kJ5K99m06j08
4257b83K25J14l0j64JL72l5k36J2M2j93J36J72k82O6J55j47K15K08m85K26o3Q6
4280A12J4j72N1k19j42N81lk11O1l57J96L1J49j37k2M8kk54L99j30j61K13J88
4303B33k37O4J03m3K29l17n8J8n5L2K78j26j17j41K30l10K8J29L60j58j23j14
4325i5N9J45L3j13o7Kk8J68j61K96m01R4J53j11k03K22l7R4j56L8M8J22j71q1
4349a50J11N7Rj5j49o2K27lN5k37L55p4j33j28K18q2n2J14N0j73ML9K22r8Q6l59
4375a68o4K95P5k17Q2p1k62L59p6K59j68l9J99j70j26K93j27O3j04J19j20j89
4397a57L36k65rk21L81j28O2J27m39K42J43M7q8k1j7J15J19j83q3n0J57Q0N6m1
$$ y = [60, 123, -143, -46, -12, -55, 147, -107, 6, -284, -135, -179, -61, 219, 161, -32, -235, 63, -81, -83, -68, 231, -175, -283, -58, 56, 26, -138, -137, 235, 200, -36, -24, 18, -175, -39, 133, -149, -83, 72, -75, 140, 348, -137, 89, 26, 112, 126, -46, 5, -214, -356, 225, 222, 11, 72, -285, -89, -58, 91, -46, -68, -20, -22, -276, 123, -7, -168, 45, 233, -4, 60, 163, 120, 349, 32, -26, -8, -63, -31, 247, 121, 4, -137, 93, -217, -189, -60, 300, 142, 19, -95, -36, 109, 142, 29, -38, -36, -64, 104, -57, 239, -162, -68, 85, -26, -229, -7, -44, 50, -106, -68, -20, 102, -69, -150, -39, 18, 27, 12, -137, -199, 28, 25, 80, -157, 198, 124, -9, -137, 81, -1, -53, 61, 111, -62, -58, -19, 203, 105, 191, -168, -232, 63, 138, -79, 3, -68, -330, 29, -47, 212, 44, 5, 204, 34, -92, 201, 74, 137, 33, 152, 32, -157, 179, -86, -95, -316, 65, -63, -1, 126, -313, -71, 72, 119, 31, 10, -7, 108, 227, 44, -39, -89, 68, 148, 204, 163]
4421A63r8q1j0k21K74j09j58L44r9J60j20J47j39Q2j47K02k49j68J91OJ45L05
4443D20l61k06m9K48L8k24K65P1O8l49L41k76j34P6nq3J46l7L26j15j96l9L3J1
4467c1M8N1K68l36Q3J5p8Q7j48O6j43J84j14Q3k02O2K96k39J04o7p4K1P2J12j53
4492c3r7J14p3J48R4j01k6Q7k61K78l07J96l8J02j30o1r5L43J2j73J33j34J53
4515A31k25L45pj72K3K1j20k5r1P3n3r3j2K9L26k48R3mrK01k11J86j5n2k97J92
4541a4J05j51qJ2K76k13J13q1n4k01K52M0j21N3q6R3j83L67j47q1J7k25M40Q1
4565B84m28N2Q9rK28k94J53R0Rj68j02J33k8L4k7k6J62m9j54K52k23p1J1P9j70
4590a73K70R0k63K22l0J04l73M11J7l39J31k8jL8q1j36q9J2K22J34k74P9N5j50
$$ y = [163, 65, -16, -26, -247, 27, -82, -240, 104, 5, 165, 45, 192, 53, 135, -12, 190, -59, -227, -36, -30, 115, 420, 59, -147, -196, 52, 90, -134, 131, 202, 270, -79, 262, -14, -148, -72, -77, -160, -14, -51, 275, 160, -36, -75, -42, -31, 17, 68, 336, 0, 83, 98, 20, 107, -41, 25, -118, 66, -48, 35, -167, -105, 191, -48, 56, -11, -85, -64, 8, 120, -33, -130, -16, -89, 59, 153, 52, 26, 113, -148, 130, -177, 19, -19, 83, -47, -108, -203, 140, 152, -21, 112, -22, 131, -94, 251, 244, 72, 95, 116, -4, -29, -120, -47, -100, -193, -205, -176, 150, -98, -5, -9, -18, 183, -28, 158, 143, 91, -206, -14, 91, -60, -68, -56, 220, 7, 120, 39, -15, -216, 36, 76, -45, 8, -78, 15, -168, 199, 52, -29, -12, -237, 203, 284, -144, -92, -3, -12, 216, -78, 75, 165, 174, 6, -96, 37, 9, 43, 16, -10, 152, 103, -51, 201, -22, -93, -82, -3, -173, 97, 187, -76, 146, 116, 220, -153, 258, 275, -64, 67, 39, 38, 76, -5, -141, -230, -218, 4, 138, -136, -57, -2, -152]
4614a52L05l9j2l07K81j57K74m31M65k14j07K40q8j59Q6k68L3M95m70J48K45r1
4636G7l26K02J1o0JK1L22k09K29l63P0K4l5J19k67k20N05J40k28k43M53k28j7
4659b2J39j57J06Q2j78j09M7r7K21J67l40l6J77P5j57J25l3O7p7K1K75l63K14
4682A47j27J24k11k20L42j36no2L0Q2N9k06L70l16K01o8j8j88J03p0R3r1Q9L47
4706B69m02J14j6J97l11o2J4N6J98k18K26n1j78K88r3q9o1J00Q4J03K98n17j7
4729f8J8L92k61n7K0l8r3J85j07j64K12P6l45J67L10j44j66K1j25J78K59m7r4
4752A29Q9p7k18J11Q1j06p2J76k19n8K61q2qK2k5M7N3k17J30j02N7L03m50J75
4776@R7j86k26J34J00J78k26q4J92j29K62j5j61J8J02q2J24j1k57M2k35K66J26
$$ y = [-152, 153, 114, 102, -205, 76, -81, 193, -238, 227, 13, -94, 146, 58, -101, -15, -283, -250, 245, -225, -77, 168, 77, -249, -47, -36, -96, -95, -74, 248, 39, 268, -95, -25, -1, -36, 83, -184, -404, 101, 241, 13, -230, 223, -5, -22, 117, -40, 66, 148, -30, -139, -92, -189, 32, 199, -141, -177, 0, 75, -82, 43, 10, 77, 0, 21, 296, -67, 147, 20, 144, -67, -287, 55, -81, -86, -148, -118, -36, 23, -183, 187, -129, 72, 4, -14, -202, -99, -169, -76, -167, -78, 269, -133, -19, -35, 162, -149, -211, -197, -141, 57, -161, 65, 14, -164, 124, 31, -58, -119, -19, 65, 168, 466, -51, -68, -50, 342, 81, 24, 44, 6, -87, 98, -9, -173, 39, 115, -230, -63, 247, 103, -63, -42, -167, 11, 270, 223, 129, 218, 141, -77, 34, 115, 9, -63, 113, -106, -164, 97, 15, 7, 29, 4, 51, 104, -113, 17, -85, -28, 275, -175, 0, 97, -89, -315, -181, -81, 97, -129, -213, -21, -150, 112, 97, -64, -46, 56, -26, 98, 87, -170, -128, -363, -97, 29]
4799B9P3j84J09Om1O1k14K99j48J56j41k73N3J88N19l02k99J46o7%K8J18q8j42
4823a14M9J10k20J90R9q1j85K46N7j17O8Q1j45K09q6k05J47k9j59J85j01p9K54
4846A74m0m38K98K05n6m6k26Q5R3j65Q3K83l62J27J21j00R5k75J29j35J44j65
4868a71M41k56j32K21k69m7J73j50K62j90J33m6J49j9j34j4l2K7N0j78J16k8J23
4891B9m7N5r3K6N0k0j13J66k3p7o7K77K5m21J8J38M31l03j0j15jL4L1n0J42R4
4917A76k07j8O8k1j66K73Q8j58J1M6j71K51k11O0q3J47n7j57m2J14J97m06J21
4940a45K21j18O7j38k08O29j25r6j4k04L70k50Mj05M7j67K50J76k05p1R8m7L1
4963@K4k89L07J18k19n1N2n8M08k11K3j15M2o1R8P5J6p0Ok19Q9J40k19K9K17k30
$$ y = [29, 102, -82, 27, 33, -8, 53, -161, 138, -10, 146, 5, -268, -215, -27, 492, 190, -109, 37, -30, -30, -2, 116, 28, -114, -65, 45, -175, 15, 114, 33, -152, 94, 151, 34, 102, 183, 38, 247, 161, -44, 103, 74, -85, 100, -1, -80, 174, 134, -304, -6, 199, 143, 97, -129, -44, 49, -116, -33, 250, -112, 15, 136, 36, 131, -144, -15, -150, -6, -171, 270, 14, -118, 103, -166, -213, -40, -190, 72, -118, 15, -31, 118, 99, -35, -49, -81, -54, -4, -182, -66, -94, 29, -18, 37, -56, -30, 20, 0, -113, 53, 30, -47, -114, 163, 188, -233, -215, -77, 354, 51, 41, -74, -75, -41, -10, -60, 82, 176, -31, -49, 19, -2, -168, 105, 193, 35, 46, 92, -79, 172, -39, 21, -62, 85, 28, -129, -171, -57, 140, -266, -145, 76, -42, 25, -113, -321, 308, 183, 87, 73, -131, 239, -11, -7, -112, -65, -232, 18, 194, -11, -82, 16, -31, 0, 24, -265, 42, 160, -59, -110, -58, -116, 292, 81, 104, -11, 31, -30, 68, 143, 159, 89, 95, -124, -35, 105, -114, -85, 132, -98]
4989i8j82M68l53L17m3J30m48L07l3J30k64k46L24N8j52K00j5L0j34K6J40o9j14
5012b1L8J15L0l45M3q2K72q9J12L4k37K59j23J22k37J76M2k62K13k2Q2n3r4K50
5036B23q4k37J87q6J30j85j91M65l42m7J86J48k93M69j78j90J79l6j43rJ30r9
5058ck77N07j28j56l4J52k34K67r8J28q8m8J08k01K18l2L3J21l63K50l1j04k99
5081c12K35K46q1j7J05L2l21L14j57J43j79J34Q8Mm08J43j37K70j33r8L14l35
5103a50L38j0l25L24j39k7o6K10j02j49O0N3M5K7qo3O6n1j23J89o0P8m3l75R9
5128b02K17k97J16J8J88k2K13K5k50J91l17K88j38m0j36K09J39q2k41L32J6j36
5150I1l31J78M7J53l31J68o8j80L81k66J44j45j78L33MPJ7R8l43K40k19r1N12
$$ y = [-98, -280, 188, -165, 152, 109, 239, -209, 98, 65, 195, -69, -315, 9, 67, -85, 115, 100, 130, -4, 22, 162, 93, -21, 17, 132, 162, -183, -140, -222, 50, -39, 73, 107, -130, 129, 6, 128, -109, 67, 109, -153, 60, 38, 120, 67, -27, 223, 139, -98, 89, 3, 133, -52, -243, 222, -120, -167, 19, 167, -126, 343, 165, -25, 154, 118, -25, -34, 96, -3, -280, 227, 99, -57, -91, 61, -173, 94, -4, 124, 36, -12, 96, -105, 113, 81, 114, 235, -128, 122, 91, -13, -312, -77, 169, 88, 71, 176, 208, -113, 201, 44, 187, 8, 142, 230, 234, -174, -31, -168, 102, -31, -129, 185, -150, 188, 178, -147, 177, 38, 11, -55, 155, 53, -96, -36, 17, 62, 89, 81, 18, 84, 33, -90, 99, 39, 117, 74, -301, -202, 15, -282, -166, -148, 40, 18, 231, 256, 6, 197, -120, 168, 30, -10, -146, 63, 202, 120, -121, 211, 227, 91, -240, -62, -15, 138, -193, -25, -93, -273, 108, -158, -14, -159, -337, -4, 0, 7, 24, 122, -221, 19, -200, -291, 221]
5173B21k11Q6q4O3J29k16j2j6mM1q5j55K37J13j44L0n6O3K2J17J06m2k47J65J32
5198B53l02J06k16J81J14q2k10J63r4J23o1J39J78k35K2j1q1qM7Q2k24L06o0j59
5222b9J03j33j91R6q9L05L9k39J18J96M6o2j85K69R7k21j63m8M35l34K36j35j63
5245e2r2N1j03L9Q6J90J2Jn0k47K92Mj96K05j87j12L2K34k86L62k88l3L55j89
5269B8n9m8K23j88J3j21K8K9L29l17K08qk54J83k08J67l3j13J2J81r0J53L53n52
5293h4J79j07j69K57r0j23K70j77M03m85Q4J67J61l43o6P1J12n0j50K33k95M17
5315B15m05L01K98k66j06l6K0J71ok20Oj65J90j42J64q3K37k92Q1J31j59P8l5
5338b3j08K46l44K65k50P2K47n2L3k01j49K80K45o7k07J6J66k79J56k74M36l16
$$ y = [221, 10, 96, 12, 75, 204, -12, -24, -40, -44, -3, -88, -243, -6, 107, -37, -7, -63, 0, 22, 139, 245, 203, -44, 121, 253, -49, 57, -159, 22, 136, 54, -156, 7, -87, 36, -25, 114, 292, 57, 79, 68, -13, -21, 26, 108, -116, 190, 130, -29, 74, -59, -250, -154, -243, 62, 101, -138, -20, 176, 222, 160, -25, 244, 341, 120, -43, -91, 344, 10, 246, 111, -52, -144, -93, -196, -157, -71, 119, 131, 132, 82, -165, 127, 131, -65, 140, -47, -159, -127, 107, -179, 183, -105, -138, 217, 28, -31, -79, 144, -44, -31, -152, -124, -95, 234, -83, 125, 117, -137, 46, -162, 5, -28, -141, -129, 52, -38, 115, 468, -84, 95, -12, -181, 76, -14, -137, 133, -44, 359, -126, -42, 125, 286, -57, -123, -52, 60, 10, -140, 93, -202, 215, -190, 111, 409, 143, 37, 1, 21, 192, 186, -34, -28, -193, -3, -145, 19, -64, 173, -119, -38, 93, -66, 12, -23, -131, 115, -229, 36, -214, -142, 105, 53, 86, -115, -264, 16, 261, 194, -13, 3, 169, -110, 46, -228, 208, -108]
5360a08MP3j13J05J55L2J73l96M4J78k47L38j87j20J64J60k81O4k6pL0J37k26
5383e4j85L77J53k22k61K97lj64O1J6J87k01l1j76K43m7J4K6l84N00r6l57N56
5406B49l11J66k89L7J08j25J74j31L49j86k0Q7n8j05nR7l4l23M98R9l19L43k59
5429D2j66N0J82j99L2L00l23Q0J23k33J33j5p9K63l47K61J44j39J10k39k95M32
5451A17k39Q0k30J52K22l2R1j21r7o4J30j05P9O6Q0k27j2o1L34l25J66KJ6r7Q3
5476HJ42k35K7J04j16r8K09j75P0K37r7r1r4LKL5K23j28J22Qm0k00k68L80j77
5501a49L3L62m10K54k24NJ60J14k03K24l5j05k4pp6q5P0P2j31J19k22K10j7j01
5525a66J29M21l06m0j8l44L32R4J60j62N9J50k59j05P4j02J50j97K58J17j79O1
$$ y = [-108, -104, -31, -144, -39, 116, 148, 321, -75, -31, 147, -100, 238, 51, -69, 95, 255, -26, 38, 12, 5, 35, 172, -54, -239, 138, 291, 69, -192, 105, 102, -62, -1, 15, 202, 1, -30, -206, 37, -10, 4, 30, -354, 146, 50, -307, 249, -62, 104, -185, -148, -40, -165, 9, -122, 227, 41, 21, 108, 50, -55, -60, 37, 3, -320, 178, 277, -42, 301, 42, -124, -74, 108, -91, -59, 241, -82, -2, 121, -112, 21, 6, -73, 190, -157, 104, 248, 109, 219, -20, -315, 117, -122, -42, -272, -120, 102, 70, 161, 40, -57, -121, 9, -96, -17, 49, 129, -98, -110, -171, 163, -162, 4, 6, 22, -75, 8, 150, -85, -58, 46, -70, -168, 41, -134, -64, 173, 76, -15, -109, -106, -104, -69, 154, 26, 148, 156, 116, -84, -352, 28, -149, -116, 246, -164, 90, -134, -129, 31, 145, -58, 166, 131, 26, 2, -5, -81, -166, -96, -24, -155, -36, -258, -48, -65, -166, -37, 384, 78, 38, 20, -324, 8, 102, 262, 100, 159, 309, 50, -55, 19, -83, 67, -130, 128, 245, 66, 127]
5547A27j50J23kj47j3p8j11L07k78K73R0k65Q8J47O2k29N8J12q9NkK9j97J21m3
5572f2J51j15k24L9j54N60j47K0l00J67J02l37L53p9J34L9k47J39j15M2l47M50
5594F9J81j28j54K9j33J32J50k95J83r5j45N0J15O3l07K45o1N3l7o6M94j62k54
5617g3J82P3p2j67j35K43J64m56K77J62j46J59j85KK79m35J88p2nj88J84k49Q7
5640a83q1J75J15K4N3l02J60K04P5k21l0Rj4J95k99j33K95j11J62J84k38j96J02
5663e5l8l7J36L1L3j38k15M61lq6Q8k39j3J35j99M04k70K2k07K12R0k98L63j76
5687AO2om1J09j20P0m1Nk0q5J23L4k8m8N9N1n9p3J56o1j16P9O7n9r8j29o8L26
5715I0m1K66o43M83J9l25L51k99n3J53NQ7j5k01J14j7K5J64j02j44k4K95k0k33
$$ y = [127, -23, 100, 98, -49, -62, -140, -251, 56, -222, 51, 141, -124, -36, 111, 173, -56, 2, 114, 25, 30, 28, 57, -140, -19, -62, 89, -26, -250, -211, -365, 195, 48, 68, -232, -65, 37, -300, 53, -26, 108, 147, -100, 39, -76, -34, -381, 69, 250, 122, -32, -3, -136, -4, 146, -149, 34, -61, -206, -156, -41, 22, -285, -40, -101, -48, -85, -151, 343, 181, -73, 109, 182, 110, -57, -192, 51, 215, -241, 36, 198, 52, 211, 26, 28, 307, -128, 60, -12, -17, -205, -21, -270, -183, -264, -89, 26, 50, 103, -199, -39, 165, 240, 19, -11, -2, -16, 179, -120, -253, 42, -69, 93, 277, 39, -157, -55, -93, -130, 6, 37, 70, -68, -283, 178, 175, 89, 177, -62, -75, 60, -139, 265, -5, 17, -190, 22, 112, -186, 177, 1, 63, 57, 16, 125, 5, 75, 34, 39, 19, -66, 57, 91, 63, 15, 74, 125, 66, -7, 149, 88, -28, 51, 118, 59, -39, -168, -236, 90, 49, 315, -328, 155, 174, -151, 200, -99, -152, 1, 6, 93, 78, -123, -9, -26, -1, 163, 61, -83, -107, 188, 168, -65]
5739f5j09K26j79L47r0J8j89J43k20K41q8pJ00m5j08K72k69J59j64j90L11J02
5761A96q2M8j00m0j05J8J41l6J11J4j54j4J6o3J15j23J65l58M73m76M05m15K56
5784hM9l5O9Q7J55k14j62j37O8m9Q8n8K44p7j18L3J19j39Q5j02J89j89M7J6J57
5809A18j35j37J60J36m20K12j3J80j81N0p1K27p5j89K57k00L6n7m1j1J67j32J30
5832A1J71j21r5J45L70o16O9P5O2k27K85r3j53J41j98L71k99K56m47L74Ol03L22
5855A06n2L2k8j04KP9M8N4M8j95l14M36L3j52k59L10J41m91K03N7j8L50j48q4
5879E4O0k88P1K0om8K81k14J1kK45j99J1k63K54jK3qk25J31o6Q6qJ25p4j52L09
5906A27n5l10L33k76K06l4J10j63k00L78l85K44l3J18K36m54J18R7j34O7K6q9
$$ y = [-65, -174, 52, -127, 220, 130, 148, -41, 102, -118, 123, 35, 28, 128, 83, -25, 247, -22, 137, -27, -217, 94, 196, 114, 162, 62, 22, -83, -65, 76, 40, 151, 165, 11, -3, 13, -50, 65, -58, 107, -251, 222, -254, 151, -264, -8, 41, 6, 75, 162, 317, 103, -59, -196, -128, -177, -89, -147, 97, 20, -98, -65, 54, -85, 0, -102, 87, -102, -55, -39, 118, -17, -154, 6, 142, -278, -66, -79, 101, -80, -30, -101, 126, 51, -138, 119, -81, -45, -102, -143, -154, 13, -119, 11, 182, 61, -34, 111, 481, -135, -66, 9, 71, -156, 129, 36, -117, 24, -174, 197, -102, 154, -293, 81, 87, -216, 106, 54, 86, 58, -46, -44, 35, 83, 137, 185, -10, -324, 112, 145, -7, -266, 44, 185, -306, -103, -46, -64, 286, 138, 54, 114, -174, -103, -83, -89, -137, 144, -70, -59, -61, 184, -15, -4, -267, -13, -14, 9, 1, -224, -93, -159, -73, -81, 44, -30, -182, 127, 72, -238, 95, -181, 25, -9, 101, -62, -262, 116, -269, -25, -58, 60, 296, -158, -40, 57, -77, -10, 16, -73]
5928g3k8j1K66j19m1O1R9k39J79k53J30LKj58J33J9N6J92j74J35j17n2r8k00L79
5953I1k0k19J59n2N5J64k88J81j65K82k15j03Q9K32k54K64j31J36j42j7P4k5j29
5976c3k12J79L3nL11n9n0k22J56J24k77R7k41O5K1K84m8r9j45J70N7L0o1j85J26
6001A6P0l3J1M8O7l19N3L06j48k60L44j47nK06k97L58l26j01K34P9j12N0l7j01
6025d4J01j77k64M38LpM5j71j31O8N0L2R8jJ19j23j69K54n6j24J15J28l10Q2J55
6050A11k78K00L3n7n0l0L62j61k14j24RR7N3j62J72p8k9K70j06J67k67j24K72
6073F6r9q0j84K67j13J41N5j71J57k02M3k08K11K07k12J09K98l49J12l5j56j2
6095a55j62N59J37n47J57n4Q2n4J9j28J00J10N1p5Q0j40L2LJ28k13n0M8O8n3J68
$$ y = [-73, -101, -112, 154, 35, -6, 55, 154, -85, 94, -159, -29, -26, -24, -182, -49, -30, 26, 218, 44, 179, 62, 10, -88, -288, 91, 71, -148, 11, -41, 14, 178, -110, 71, -94, 188, -27, -130, -41, 191, -63, 201, 70, 206, 64, 47, 121, 96, -33, -245, -66, -33, -38, 273, 214, 164, -58, 98, 222, -55, 42, -199, -134, -113, 171, 123, 24, -121, 49, 106, 136, 75, -110, 16, 86, 53, 64, 112, 179, -140, -87, 219, 71, -189, 155, 8, 3, 209, -88, 270, -56, -157, 77, 156, 44, 94, 57, -44, 57, -120, -384, 54, 57, 50, 95, -76, -207, -139, -89, -57, 41, 40, 159, 36, -133, 121, 65, -59, 56, 184, -126, -44, 111, -167, 33, 66, 9, -41, -71, 291, 130, -84, -208, -199, -102, -49, -211, -39, -117, -146, 124, 18, 185, -82, -206, 66, -33, -113, -297, -30, -143, -2, 53, -118, 39, -163, -120, -328, -117, 90, -122, -13, 285, -64, 48, 13, -143, -155, -317, 242, 379, -168, -11, -65, 17, -37, -18, -146, -46, 64, 115, 40, 120, -20, 12, 15, 143, -70, -120, -72, -4, -57, 111]
6120A11J25k28J5Q0k94J74J5J15l11K5K33j09R6j77K57n8Q1k91L25l33R4L5j23
6143a43J37L7j58J73k12o4K21P2q5r4M8L3N8q3L15k58L29o12K39J31K9k52K26
6166H7q8r0R6j52J49R4J9o2k56J95%MK0J6K5p1J4j35k6M1K93N0o08N73k79M5J64
6193A18j14k21K02J54k92l2J80j22K74j37j93J65k61L09J29j34n2Q0j26J2K78
6214B17n39K88J56M1k85M24k60k11N53m24J29k28m4j73J98J35j50J51R0O7j92
6235e7k83L07M5K28l86Q6J72k83K58j49k8J7K86J5k03O0j16K42k72k07L55m0J78
6258B25j59k40K06J26o7N2j86J04j8K8J35k61k9o6N6L1K48j35l13L51P2l2k44
6281a16K75o9k02J64K6J21l00r1K12p6o6Q1N3P5l26L52j50J52M8q4KP2k50P5j04
$$ y = [111, 236, 8, 23, 103, -191, -17, -2, 113, -198, -173, 60, -49, 47, -130, 127, 69, 150, -141, 184, -149, -55, -20, -143, -6, 31, -127, 46, -166, -230, -9, 63, -22, -116, -68, -35, 23, -60, 255, -3, 326, -286, -47, 84, 113, -139, 87, -1, -91, 5, -147, 2, 96, 115, 53, -203, -8, -8, -4, 16, 32, 57, -14, 0, -135, -161, -120, 173, 223, -385, 188, -91, -46, 118, 4, -217, -15, 139, -153, -185, -5, -127, 147, 10, -183, -18, -279, 30, 159, 25, -27, 53, -73, -61, 217, -322, -34, 122, 163, -122, 302, 42, -169, 384, -40, 89, -139, -183, -356, -158, -23, -173, -22, 68, 135, -57, -340, -33, 12, 240, -146, -60, 112, -171, 87, -62, -90, -73, 213, 228, 25, 85, -31, 211, -61, -268, 87, 47, 225, 66, -174, 32, 158, 91, 143, -43, 61, 43, 71, 206, -55, -84, -150, -94, -63, 185, 50, -263, 88, 160, 128, -116, 159, 90, -112, 52, 78, 199, -101, -192, 20, -56, -122, -41, 12, 87, -239, 113, -37, 115, 163, 79, 81, 153, -97, -22, -126]
6306a26rJ6K5J67l92L76m0k24J39o8O3J15J31k52j55K06k8R4j60M44o10L64J38
6329B14n05L64r4r2K1j9J7n7J04j58J18J01n5m3J02l02O33m08J0J16o4O4p9J07
6353I5q7J2K1oj54K66r0l53R8J26R4N7J19k00k29K70j29k6O5J60k12N4o0J28J35
6378A54mr4j64P5K27j06j48J35q6J89n1o6j38J41l26K14J83k43J05J60m6m5O2
6401A28n1j08J07J79j53J3p5j84K28j15j88M14m13O3K65j00N2J52k54k5J72l23
6423b16N33m39N5Qq3N19l35Q4k65J66L3j25J26Q1j91J98l21K41o0J13j91J18q6
6446c7k13Q0K20k09K31J77r6j24m1Mj39KM49l85J07o4M3l8L4k54K13q1K39m8O9
6471A39k15J71O0j31j32J43j78j63J10L90k14J09jK3j34k08K72j26k5q6j28J94
$$ y = [-126, -135, -119, -94, 73, -319, 57, 17, -207, -68, -136, -73, 42, 173, -79, -234, -28, -56, 38, -122, 322, -288, 76, 214, -291, 73, -21, -113, -92, -111, -94, -151, -47, -205, -87, 14, -41, -84, 18, -284, 349, -59, -49, 67, 3, 67, -12, 95, 8, 20, 41, 35, -119, 147, 57, -296, -198, -72, 22, 79, 198, -2, -231, 39, -90, -116, -51, 109, -103, -49, -109, 19, 154, 150, 56, -108, -33, 194, 88, -60, 75, -11, 178, 127, 61, -77, 64, -262, -48, 135, -108, -3, 157, 111, 66, 128, 77, -31, 76, 255, 102, 115, 40, -144, 84, -31, -219, 195, -218, -155, 110, 10, 62, 214, -40, -65, 107, -216, 317, -122, -67, -59, -142, 377, 42, 126, -139, 27, 60, -65, 61, 142, -49, 149, -172, 69, 9, 122, -69, 49, -37, -250, -170, 50, -159, 72, 249, 153, 29, -12, -8, -147, -145, 304, -81, 26, -38, 5, -33, 1, -253, -40, -121, 118, 70, 139, -76, 95, 155, 24, -108, 35, -143, -306, -196, 194, -20, 89, 88, 111, -23, -231, 41, -85, -110, -196, -324, -130]
6493a30J30K29l75r2L66m3km8n2r9K04q0k15L34p0j54j02L01j07J6k13M8J13J07
6517F6L04l60n0p4N1K18L5k36J63j28Q4K3J7l1j64J33j5o1N9kj54L19k85L3p4
6542a29P3o8j63J25nJ03j41o9L92o0j35L76k89Pj55R2J86j02k9Q7k79L42l19J05
6566e5K48k92k9J98j80J95O0j92j83L24j96N8r0J79l06L98k8l05M4N6L51j81j11
6589c7k7n3J83j12K93l20J37O7j62L6p7J5J61j01Q2j85J6K10l29K61j13k3k97
6612c75K16K66O5jPk65m3k1K38k49Q1J91m6j95L37k00K01j56r8k08K53P9j46J71
6636A02k8J15k65M09l94j35J86o6K4N7N9Po2J92j36p4L61l75K27j73J54k45P5
6659A5Q9N6O1r3l4p9N8o6J69N2l58m8Q2J3Q4j00L86k26k96J37n0k8J54M4j11J40
$$ y = [-130, 0, 229, -146, -238, 128, 85, 83, 35, -17, -116, 88, 8, -207, 127, 57, -97, -199, 102, -5, 11, -202, -154, -41, 66, 370, 10, -40, -114, -63, 155, 190, -46, 117, -11, 73, 96, 113, 82, -82, 51, 36, -25, 34, 32, -122, 197, -88, -55, -129, -56, -124, -287, -162, -167, -64, -205, -274, 118, 58, -77, 299, 10, 17, -138, -46, 140, 38, 9, 96, -183, 159, -160, -55, 193, -99, -128, 70, -110, 85, 145, -47, -230, 94, -102, -44, -134, 45, -261, 137, 109, -196, -152, -96, 255, 74, -37, -64, -117, 66, -46, 247, -73, 64, 131, -31, 5, -72, -57, 104, 3, 85, -100, -84, 126, -203, 58, -55, -78, -375, -159, 107, 172, 171, 178, -87, -130, -151, 87, -162, -81, 110, 64, -131, 206, 6, 207, 51, -47, -255, -2, 77, -69, 102, 74, 189, -76, 333, -61, -196, -10, -76, -52, 5, 64, 71, 9, 201, 65, -9, 352, -23, 204, 31, 185, -60, 15, 104, 160, 221, 128, 94, 15, 73, 7, 176, 228, -130, -178, -96, -83, 1, -99, 287, 61, -235, -98, -148, -176, -22, 22, -89, 51]
6685E1j03J52ll28N2J94J20l16O6p1N54l26k4j13M5n2J56j0J66k60J00q7J90m79
6709c26K93r4J43K61l62l0l5K17r9R4l55J86J68k24J68J73j47K40j51rk23Q5K01
6732A74k18n5M0l4R5k6Q0j66JL5K36k73J38P5O7k16Ol1P4o3p7O2J2K07j84J55
6758A14m20L00O6Q7j6k15K8r9K54j34J1J56k00J28j27m4J25J15J20l77q3J56P4
6781A9j15J61Nj67K12J7q9k58J11o9L46j70J86m81J62K02k62J69K1J24j86JJ62
6804A01k16M71m56K59J66k71m6M3k58Q5K1L30k94N5M3j05RP1k0o6q3J65q0nqn4
6830a43K88k12m5J61k30J04K69J6l35Q9M5J23j12k05M9J14J58Nn6rl72L44j8K4
6854E2Lo1Rj38O6j8K97k73r%k47M06n1j25K04J90k60J64k26J63k03P5k54L57n3
$$ y = [51, -52, 100, 97, -231, -179, 15, 135, -181, -115, -186, 368, 42, 18, -95, -50, -102, 54, 44, 210, -50, 50, -37, 153, -326, -33, -127, 16, 277, -85, -115, -150, 67, -32, 62, -293, -107, 61, -163, 5, 178, 31, 271, 120, 111, -112, -27, 174, -44, -99, -59, -93, 2, -24, 56, -110, -109, -74, 162, -111, 27, 102, 169, -47, -41, -72, 2, -61, -138, -76, -64, 143, -41, 114, -306, -6, 60, 147, 131, -84, -56, -155, 99, -35, -24, 132, -68, 60, -67, -111, 14, 129, 249, -128, -211, -55, 19, -96, 65, 70, -97, 115, 132, 43, -215, -104, -173, 173, 3, 189, -292, -130, 72, -190, -21, 0, 124, -62, -61, 101, -115, 356, -100, 159, 325, 54, 8, 51, -207, -122, -101, 229, -65, -10, 33, -72, -63, 8, -12, -78, -161, 4, -76, -81, -89, -143, 145, -67, -112, 49, -181, -77, 192, 208, -127, -38, 7, 130, 18, -187, -138, -24, 134, 139, 83, 74, -298, 46, 28, 52, 55, -6, 3, -135, -69, -87, 210, -63, -72, -72, -319, 87, 36, -89, 115, 305, 45, 209, -17, 146, -57, 18, -236, 121, 68]
6879F8o7J74o3n1j27k3J6KJ78K5k93J73Q7j6j7r1J56J14k32J9p9K74l62K57k8
6904I4N5j9j34j29Q4J54o9J20k41R1K12m22K86K01q9k28J65l73J60J75M3l52L6
6927a80K78m34M21O5n8M1k67N0m5K91P8l96J60k31J22J57j06K06j8m44J57m9K00
6950bj01J87j63N8J99m50L57j57P8J15j70r9J94P4j97J53p3J25k51L2N9J21L9
6973A28j26K19l7r8O5l19J65j55J70k5J40pr7P7p5j28J36j37l2K44k74J04K27
6996A65k18J36o6O9j75J51o0l7K45k47K09m1j44L8j08K58k7m82N20j48O1k26K31
7019A04L3k28m6P6J50m6o8j72O7M6J53l6%J65m22J39J50j48M8p8J08l0k01N81
7043C45n6l19K9J05k63J59L6N8k63K36kl23K08k5L18l38r6K72k4l5N9j50R3l3
$$ y = [68, 1, 175, 112, 61, -66, -89, -73, -71, 107, 132, -161, 12, 99, 83, 66, -25, 131, 245, 13, 32, -47, 227, -135, 122, 94, 149, 130, -4, -133, -49, 105, 36, 156, -85, 6, 218, -204, 82, 283, 194, -34, 131, -242, -82, 93, 136, -216, -180, 98, -336, 85, 150, 92, 133, -134, -84, -129, 162, 240, -156, 4, -227, -105, 52, -54, 152, 134, -310, -153, -202, -2, -103, 84, -79, -21, 178, -272, 85, -72, 6, 121, -49, -148, 46, 120, -77, 76, 3, 128, -123, -91, -32, 89, 128, 2, 221, 184, 86, 151, -168, -3, -158, 12, -13, 127, 120, 23, 100, 25, -103, 33, -104, -136, 108, -166, -62, 165, -53, 83, 17, 86, -89, 62, 2, -35, 210, -37, 172, 131, -13, 25, -83, 175, 148, -334, 186, 38, 99, -127, 104, 137, -91, -137, -61, 89, 43, -25, -197, -130, -84, 69, 33, 33, 198, -224, -85, 65, -83, -35, -113, -5, -35, -236, 345, 289, -30, -1, 104, -159, 0, 36, 94, -169, 67, 65, -258, -50, -75, 243, -95, -191, 81, 57, 22, 81, -69, 24, -9]
7067io4n2M4l03M39K5n2N3q5k9j57K23K06k81K02k85J52j02MJ70n5o2j2N0j21
7092a01J75j51nO6J06l02L35m31M41l95N25L0k64j61K2M3j33L82j56N2m9q6R3
7115C6K3O8k58M07k48K07k74o2K12L5k62Q0J82j18k08J83J4j60J31j05J01O6J19
7138A69J40m83kK75j50k30K49J48l10M25j05k3J21l83J3Q0r8J57O8j38J36k34
7160a75m3J93J13j49L04j97q1L1J3KJ03O0m2k5l7N8j21M4K23k82P8j88OK66kl14
7186a62K51l3j09M8o7qj48K54J01k6k57K23R6k01J79r8j87L3NM3J04L0k46L19
7210A44k17j58K11j1L20l36J88k55J83k0M8J90m43K81k98K68q9K14l33j26J60
7231g9L5l9J36K8j64r1J22J19j70K14j7l23K24l5P2J07r4l58L49k95K77j40j13
$$ y = [-9, -73, -125, -81, -384, 55, 80, 28, 81, -4, -33, -190, 33, 239, -42, 160, -125, 27, -75, -71, 99, 44, -18, -30, 20, -101, 74, -77, -82, -16, 90, -212, 123, -308, 133, -262, 263, 293, 29, -132, -110, -67, -200, 182, 26, 78, 29, -57, 36, 59, 127, -131, 276, 28, 235, -39, -101, 111, 146, -116, -36, 146, 28, -180, 3, 17, -143, -12, -117, -16, 50, 169, 309, -174, -176, 99, -51, -281, -32, 116, -194, 231, 126, 103, 224, -159, -146, -66, -164, -7, 61, -77, 59, -175, -218, -25, 88, -61, 243, 46, -35, -4, 9, 11, 114, 174, 132, 107, 70, 128, 7, 51, 274, -8, 70, -118, -112, 154, 152, -162, 89, 56, -53, -5, -72, -80, -228, 26, 127, 101, -156, 67, 163, -38, 141, 43, -144, -111, -106, -63, 41, 71, -175, 144, -73, -231, -20, -31, 289, -47, 141, -114, 69, 49, 97, 287, -156, 125, -173, 95, 6, 220, -113, -239, -79, -44, -83, 53, 81, -83, -174, -52, 67, -103, 111, 94, -229, -5, -40, 32, 139, 45, -313, 36, -259, 18, -122, -235]
7254b35L16j02P5n2J55r3N1O6k98K62K41m68J70m4j71P3J66j14l1j09pN2K31m9
7278H5M6j60J30r7J28k91J25Q2M5n6Q4j04Nm6j06K12q6J38l05K60k6J87k48R2
7302I4l15J96Q9k82J15P2P7p6Q1k7J02k4j52M9J74l30J76k05J92Jj09MN8Q4L0
7327G4k89L32O3k42LJ24k41K5J94N1n0j55j1N9P8k28J91N0j42J1J14N0j25j12
7351a76K25j94j91L63k07l0L98r7l87J55R6M8O1k23M2o2K38J38j02J57j92J21
7373A81k94l3J40J48K7j06l14L72J40j87k46q0J76JN1n1j30K87J19j45k58L25
7395A23P3l01J89r3J4J10Q2j65l8J81l55L42k62J75k9O5k92J75K16l05J47pP0
7418A15j58o1k5K8K4J29q8J1j54LJ87j86K82k68J36n5k3M22r8j19r8j68n2Q7M8
$$ y = [-235, 81, -21, 54, 2, 157, 64, 115, 181, -117, 145, 386, -82, 88, 44, -127, -54, 112, -2, -33, -142, -149, -97, 134, 85, 131, -29, 101, 4, 132, -159, -34, 48, 93, 37, 121, 17, 22, -24, -130, 82, -4, 134, -171, 89, 63, 250, 2, 94, -221, -25, 64, -218, -103, -31, 46, -30, 51, 24, 126, 102, -50, -1, 173, -157, 19, -186, 6, 7, -102, -98, -40, 44, 74, -215, 117, 180, -62, -59, 65, -176, -151, 43, 94, 44, -111, -122, -63, 15, -213, -22, 28, -114, -103, 11, 61, -64, -176, 49, -145, -336, 27, -180, -210, 188, 91, -296, -141, -45, 3, 64, -159, -117, -179, 59, 197, 95, 252, 60, 181, -113, -146, -6, 142, 169, 63, -251, 121, 261, 74, -172, -252, -76, -75, -24, -75, -205, 82, 201, 56, -202, 123, 196, -105, 84, -9, 5, 115, 197, 32, -6, 175, -180, 162, -100, 75, 46, 111, -181, -6, 210, -95, 52, 45, 115, -43, -104, -129, -101, -77, 52, -36, -25, -179, -176, 11, -175, 107, -161, -25, -80, -103, 319, 221, 102, 4, -164, -216, -129, -81]
7443h1J21M4j38l2o4J71P1R6o8j64j61j0J34M9J04m7J83m50L20j34P3k6J12j33
7467c0j17J44%q2l1n4L95o5Qj54J36j20J52n3M1j80l9N85k74l54J30k18J87K24
7491B31k22j33Q1M0j05J71k28J44p4K06j66J66j67K03l6J01j69j40K81l00m4j
7513a61M7L05l24L15k01O3K0k9j1j56L27m90K53k87M51j67L70n29J33j1j08J92
7535Bk84J28P4J74l59L72j2j30P4j61k80K17K49p1J21k96K05J96k58J4J45Jk03
7558h2J34P8k41L94m62J49M4J79k99N5J66l04K59p9J03q1K04j07o2l5j46K51j61
7581d3j33j38K11R7K65l00j67J73p2J93P2j7k96N4R9K48k16l09M18K5j91Q4k01
7604a44J81rL66m57KJ68j80L39k40k62M83k10o3K84k40j5j7j45J68j81J67n2J47
$$ y = [-81, 40, 84, -54, -86, -150, 21, 92, 188, 120, -44, -205, -215, -81, -32, 72, 25, 208, -242, 78, -56, 17, -9, 103, -30, -147, -3, -3, -85, -116, -170, 225, 160, 168, 14, 150, 30, 182, 129, 170, -10, -49, 536, 262, -92, 38, -180, 7, 231, 9, -124, -43, -3, -108, 63, -165, -21, -95, 111, -55, 111, -56, 147, 111, 212, 43, -97, 184, -116, -160, -161, -114, 191, -133, 182, -19, 44, 64, 35, 24, -132, 195, -295, -42, -329, 122, -45, 325, -204, -71, -82, -190, 2, -282, -154, -80, 94, -265, 107, 95, -35, 39, -122, -402, -185, 64, -7, 114, -182, 23, 219, -39, -25, 120, 121, -82, 52, 130, -111, 283, -179, -30, 14, 193, -106, -51, 115, -189, 70, -9, 94, 13, 217, 110, 48, 13, -133, 118, -43, -176, -314, -103, -6, 259, -41, -208, -35, -107, 86, 158, 141, -155, -101, -2, 246, 30, -279, 139, 164, -27, 57, -144, 37, 28, 394, -63, -61, 107, -73, 266, 26, -236, 247, 37, -26, 258, 18, 3, -14, -159, 9, -172, -5, -57, 90]
7627I0j69L9lQ4k25J87K6Q1o4k12K35j0l51J25J82J0M4j37J22M7k55J56pp2K78
7652B01k38j97L12j54M3k1K8J15k3o6j16L80j97j36K36q3k02K22P1l23J64J35
7674A51j80R6j57K14j76K6J47j10l50L22Mn0l0J1K35k01j8m2qK69j37j23K67m23
7698b63N42m10j27J62L76j92j26o4J52Qk08K27P2j49j52Q0k0J64j87J96m1r6J24
7721F8n4l05L42J63l52L34j48j14M9m2J2K22k9rn2M1J67k86l2J61j72K07l77J33
7745g3p6Q5K56k10K01k29J82N6M4m25K01k1L1k46J85j15K00r1j47K72l04K34K11
7768B21k21q5J79k63J3J38q5Kj07P6j55J79OM79k87J13k12O9J63j85j37r9R0J34
7792B6L9J5k38Q3j44J08J43N6Q3L1l30L61k47j30Q7l2J67n6J77k35K63k51k0k35
$$ y = [90, -79, -40, -43, 41, -184, 3, 29, 110, 46, -166, 69, 59, -292, -167, 15, 25, 69, -68, 54, 101, -154, 2, -5, -77, 201, -37, -234, 78, -76, -33, -54, -26, 89, 66, 0, -116, 264, 67, -69, 167, 84, -118, 104, 175, -148, 16, 151, -29, 67, -90, 124, -52, -26, 121, 11, -339, -17, -13, -63, -93, -82, 153, -48, -66, -108, -116, 153, 16, -107, 160, -263, 279, -131, -258, -96, 280, 88, -38, -102, 50, 58, -150, 77, 149, 0, -152, -72, -92, 72, -115, 81, 40, -56, 68, 14, -291, 51, 214, -138, 196, 48, -66, -17, -59, -47, 175, 146, 137, 85, 126, 293, 7, -25, 136, -36, 171, -206, -73, -149, -64, 192, -18, 183, -46, 136, 192, 236, -189, 12, -9, 22, -224, -39, -154, 46, -45, -192, 80, -224, 10, 221, 0, -85, 94, -169, -156, -18, -103, -101, -208, -132, -287, -108, -102, 377, 90, 203, -9, 60, 223, 38, -99, -198, -108, 26, 65, 80, -158, -75, -219, -111, 32, 88, 171, 202, -128, 233, -14, -144, -57, -89, 78, 22, 199, -36, 227, -24, -44, -279]
7816b79L27k82M56j83j12L6j5q1j2O7l3N3J4j89M59k76J69l36L00k06O3M2j3P0
7840C9L61j90j84m2J53l56oL85k47J31j39J27m0q4l4N00n76O4J65p6K8j16k9j6
7864a82K8J82K86l80J16k09J20J24q0o5N3K04p1j52P5j64K1P6j08J75Lj61J64
7887E5j17m7K44q1n5mJ60k07Q0l2O9l1L2k4r4n0J20j07J66k31K21j95M3J96o2
7912D9l3m3J66L6k05k1l25N27mp1p6r9O7J99p7j59m5O5O9k1P5r6j31L50k21lR4
7939F7rq8J67O9k99R4j86P0L45j54j50j2o1K44k4P4k52K68l49l5L13j23m8J70
7963I1j19Q6k58J53n6K10j95j67L01mQ3l15J94M2N3R9j93J01K21l58K77j41p5
7986C0L8k11Jj61J2L33j03K29j06q3j01K33j86j8%N0J44j56j6J30j65O8p4L9K06
$$ y = [-279, 48, -234, 222, 39, -73, -37, -52, -133, -145, -78, -111, -58, -44, -233, 226, -50, 119, -217, 83, -123, -60, -18, -31, 39, 400, 210, 26, -16, 137, -219, -225, 160, -87, 44, -95, 32, -8, -92, -126, 374, -202, -138, 27, -49, -21, -137, -166, -182, -154, 28, 314, -66, 50, -159, -39, 85, 5, -60, -7, 197, 126, -26, 49, -115, -94, -18, -126, 49, 52, -109, 55, -62, -109, 135, 54, -1, -5, 155, -52, 28, -4, 65, 34, 66, 42, -52, -102, 18, -89, 77, -154, 67, -128, -85, 111, 49, 16, -27, 139, 175, -30, -51, -376, 151, 147, 76, 0, -99, -32, 167, 90, -69, -114, -49, 20, -1, 74, -22, -153, 197, -24, -27, 67, 58, -30, 137, 206, -93, 1, -185, -115, 230, 76, -74, -86, -147, 97, 73, 147, -105, 163, -186, -221, 92, -31, -79, 91, -28, 58, -200, -47, -103, 107, -88, -255, 46, 42, 125, -190, 4, 46, 99, 198, 5, 106, 327, -31, 246, 105, 30, 68, -143, -142, -303, -291, 42, -61, 168, 62, -21, -122, 111, -75, -93, -93, -43, 101, -55, -71, 59, -106, -38, -112, -73, 133]
8011A33k3o7J37j8%l10l9J95j61K05m31L56m7J0j8Q%K89k30Q1j88J33j81J91M6
8036G1k66J05j03J89j61K42k74J43j2J10R3k06J32k48L92k82R3J39k29K44k52
8057h0R6J96m04K51J0j0j24N8J37p6M6m5rJ44J4k35M1Or2j48P4K40M3k26K85l23
8083a31J7j07M48m00J89L0l6j61K30O4r2p0j53M9K27j44J64j37J10l39K53K71
8105B82k04P2k71K06m1j36n5K97l50J51J14p3N7K7k87K67K9j86k09K35K80l56
8127a51j37K66J42j17j14K74m39K53J2j45m9P3j51N26j83n6J75j39J4n5J2J25
8149A36qJ6l04J53r9L76k81O0k27n3K19j7r1R9q6J07j6P5M6Q4k68J8O3k2K53k72
8175c9k8jp4m5K44J18l40L55l29O3j9O7m7m2J99j80
$$ y = [133, 110, 43, 180, 162, 162, -148, -187, 8, -153, 52, -379, -23, -70, -60, -78, -70, -70, 219, -11, 70, -118, 15, -166, 25, 71, -195, -90, -193, -4, -165, 77, -197, -54, -66, 44, 137, -69, 63, -185, 207, -75, 18, 157, -72, 172, -80, 16, 212, -192, 59, 69, 59, -65, -7, 130, 54, 100, 55, 46, 190, 204, -31, 10, 16, -76, -224, -150, 90, 133, -93, 192, -131, -114, -221, 227, -173, 16, 46, 10, -151, 79, 143, 51, -19, -172, -123, 104, -40, 124, -13, 97, -242, 11, 282, 78, 150, -121, 85, 44, -92, -147, 150, -200, -49, 65, -8, 49, 76, -211, 56, 85, -101, -310, -75, 205, -151, -288, -22, 120, 3, -111, 163, -276, -23, -11, -156, -205, -132, -283, 243, 60, 4, 179, 40, 54, -1, 11, 136, 128, 144, -160, -7, -106, 270, -11, 49, -178, -231, -12, -29, -120, -21, -107, 0, -16, 59, 105, 189, -79, -61, 2, -20, 233, -39, -67, -68, -142, -187, 57, 175, -165, 190, -139, -76, -95, -28, -75, -117, 82, -98]
8191i8
$$ Imaginary data points
##PAGE= N=2
##DATA TABLE= (X++(I..I)), XYDATA
0@%%%%%%%%%%%%%%%pJ5j6J6j6K1k9L2l2M0m8N6o5P3q6R9j11J24j42J61j80K03
37A08k27K53k83L14l47L85m27M71n21N75o34O98p66Q43r31J026j133J253j389
56g32J545j721J929k176K473k839L303l915M755n987P971j1648K0647p9694j16887
71a82976J52231O44n253J0441r3217J1844N7481n8539K3982K0605l8101L8600
83f2258k1705n5887O9889L116l5354M0126j4481K377M9175m5827j1955M5386j5538
96e2936K5472M1556l0258P277o527l9124O5550M9091l4514P453j3954k3547M7723
109D3262J4445r011K2982j9739j0537K3051k1658P131L3533k6850o216J5153k0081
122D5465J0844M162k7742J1423L079j4482J4898j3854k7903J4114K742l261J0321
$$ y = [0, 0, 0, 0, 0, 0, 0, 0, 0, 0, 0, 0, 0, 0, 0, 0, -7, 8, -8, 8, -8, 13, -16, 16, -16, 24, -24, 32, -33, 40, -46, 53, -58, 66, -76, 85, -95, 108, -119, 134, -149, 165, -182, 203, -224, 247, -274, 301, -333, 365, -401, 442, -489, 537, -596, 657, -732, 813, -908, 1021, -1155, 1318, -1521, 1782, -2133, 2622, -3365, 4606, -7042, 13605, -66089, -182976, -30745, -30101, -35354, -24913, -118130, -106286, -48805, -107344, -83362, -62757, -100858, -62258, -83963, -139850, -69961, -66845, -102199, -62073, -76554, -74177, -25002, -70829, -82784, -37398, -52936, -27464, 14092, -16166, -8889, -15416, -54540, 11010, 60101, 25587, 33040, 19086, -4461, 43262, 57707, 48696, 71678, 51939, 41402, 64453, 42795, 49926, 83459, 56609, 50393, 65546, 45465, 56309, 60471, 32729, 44152, 47231, 32749, 47647, 33793, 5890, 20004, 22746, 19485, 29806]
135B9806k6252k1295J3648L84L226M153j8603n212K612j3008J114R718R91N821
149a2897q154k5276J230J6118M691K522m940o822L643k06m387M882N840O213O992
164a0551o262q798N828L244J628Q239K117j214L598Lk107r86q4R670J1836k282
180A3879q412n916q94J2899J0209p727p477K772K470J993P9k821K475K179n381
195A0327l051P34M549Q423n868j4191n40N655M824M863o941q946M061L727o66
210F960l295o961L497Q661k074k244l187p564J774M655q96L008K395m524l234
225c029m835k502P601O163J218l043j1646l127J1586M761m303m089k782M873O572
240C418n134o494L04L448M788k065n260M588K548n451j524L80J651N547m73n423
$$ y = [29806, 3554, -17741, -4093, -3709, -483, 3670, -14933, -20145, -17533, -30541, -29427, -19709, -18718, -12897, -21051, -46327, -45097, -28979, -24288, -21766, -26706, -33528, -29885, -30091, -34478, -29596, -23756, -17543, -10551, -16813, -25611, -19783, -16539, -14911, -6672, -4555, -5769, -2171, -2168, -4275, -5261, -5345, 4325, 16161, 13879, 5467, -449, -1343, 11556, 21765, 14038, 6561, 9333, 11803, 13796, 13875, 11054, 13529, 15708, 10327, 7276, 8010, 12559, 20982, 15114, 923, 383, 6038, 10862, 15725, 8784, -162, 3899, 7626, 6960, 3665, -3296, 201, 8862, 6788, 4544, 1357, -6207, -4433, 222, -674, 2334, 4729, 205, -3029, -7864, -10366, -2765, 3398, 4616, 1573, -10073, -13200, -1614, 3147, -1156, -5245, -8027, -3154, 3418, -1716, -8210, -7906, -4458, 330, -1735, -6995, -2407, 141, -5310, -6834, -6454, -4803, 744, 271, -5152]
256e152j594O09L854L662l812m170j92J862P979K551j0212n458L808N467L637
271B839j706k944K474k36m172o76K853O384M941o992p423K861N328K046p76m003
287G98m36M411L477J03n251n759L576N564J549O09l062m444K004J960k019J424
303D504K764N41l316m440n45N732K698k708n130m388M195Q463q14p368n919k8
319e759N083N201k017l888k032k02J246k166p30M423R24l745k356l36J736K604
335b014k034m050OL424N400n06p448m861K066N495P079L35q163m375K916L837
351b893J643k54N7J202n63k139m8J950L365Q07m923j858N625M641j240m443l975
368c046K009O316M139j951o004l114L193N229J067k252l099j175L004K456j602
$$ y = [-5152, -6746, -6137, -2283, 1379, -2433, -6603, -6795, -4933, 3046, 5597, -4615, -10073, -6265, -798, 2839, 1133, -1811, 663, 427, -3745, -4421, -1568, 4816, 9757, 2765, -4658, -1797, 3531, 5577, 4801, 798, 362, 4773, 8250, 8353, 3102, -2657, 919, 6483, 8032, 8641, 5579, 1135, 3139, 5099, 3080, 4504, 7268, 7809, 4493, 53, -492, 5240, 7938, 5230, 100, -4288, -93, 8370, 7556, 188, -5731, -5759, -676, 4525, 2508, -1380, -3412, -3614, -2368, -4534, -5264, -841, 83, -3662, -6018, -6354, -4618, -2014, -4048, -8098, -8092, -4668, 732, 226, -7222, -12083, -10017, -4522, 2557, 2892, -5271, -9646, -6730, -2893, -1250, -1504, -1447, -245, -808, -2947, -2995, -1045, 2320, 3127, -1796, -3654, 1971, 6612, 5372, 929, -3046, -1037, 5279, 9418, 7467, 1463, -1651, 1542, 6771, 7838, 5586, 2487, 1312, 4316, 6772, 5170]
383E170j068L33o61k443p12L645M222j249o038n008O43O818N323l297p173k577
399d072K608L654J114l263l455L06K987J659k577l395k8J351m36Q98K092j91j956
416b704l913l276L237P008K853l688p133k381L861N207J697j614m991r32M532
431b237K864j604k198j478K058K919M28j063K30p6n93j440j79N723K898l989m165
448a902n66L555N299j28m912k953J793M977K968l473l447j154N55L980K876k345
464E123j979K98j495r31Q36K027K770j595m339j511J218K769J907m695l151L321
480E73L075K11l424m569p02L898K985J248l326m846Q20J133j68J817M17n03r4
497a455k569k130J988K896J189k534l781J409M201P54j884k967k369L981M282
$$ y = [5170, 4102, 4435, 3774, 1331, 619, 4264, 8486, 7237, 1199, -3809, -3166, 3652, 8975, 5678, -1495, -4072, -1464, 2190, 3304, 41, -3414, -3108, -121, 1538, -1039, -4434, -4462, -3111, -3547, -2649, -557, -748, -2704, -6617, -9893, -6656, 352, 3205, -483, -7616, -9997, -6136, -929, 768, -846, -5837, -6769, -2237, 627, -977, -3175, -4653, -2595, 324, 752, -311, -81, -157, -750, -2190, -2369, 3354, 6252, 2263, -1902, -2468, 1087, 6386, 6258, 1346, -1607, 186, 5163, 8131, 4658, 1211, 57, 612, 4592, 7468, 5123, 3144, 3442, 1947, 1016, 1852, 3879, 6649, 5054, 715, -796, 422, 3191, 5098, 403, -2748, 573, 3648, 3859, 435, -4134, -4836, -938, 2047, 3295, -31, -4877, -4057, -2924, -3092, -1275, -858, -1361, -1455, -4024, -6154, -4166, -1270, -81, -2615, -6396, -4987, -786, -32, -1916, -4883, -7252, -3271, 1011]
512A011o81k382k000K53K997J65q39P64j67R83Q50k480K89L302J98k155j205R31
530a66M049J960l155l633j382L238M956J80l068j462j003P83K159m5o23M83j22
547C149j28j237j627J504J696q14j517k26O38K292j193m266j191K603M155k58
563C580l972k487M79J594J513o46j742l44J193m03j012k02M87M90m91j159m30
580c552J351K182m61l791j728K701L705Q86k465l040J61K139J989l51j887L52
596a809J227J56J96n10l51P83M95J25j53N49J295k79k788r49K199L423J389k326
614B672l873o61L132K792pk774j029J589J92J98r7j251K62N20k6l49Q14L61r10
633A555j606j577J671K666J066j752m076j351L722K860j198k693j481Q73K356
$$ y = [1011, 330, -2052, -4052, -3799, -802, -637, -1476, -712, -879, 104, 954, -1526, -1237, 2065, 2263, 108, -1097, -166, 3883, 5843, 2688, -945, -2327, 911, 5867, 6047, 2979, 1517, 514, 1297, 3456, 3411, 2788, 3271, 3149, 3021, 1784, 157, 1661, 3357, 2543, 1026, 800, 1438, 3730, 2537, -1729, -2920, -317, 3838, 3580, -392, -2879, -2400, -806, 707, 61, -1681, -2025, -832, -1235, -2247, -2449, -1962, -1472, -1963, -3122, -3552, -2201, -19, -480, -4271, -5999, -3298, 407, 1293, -1172, -4212, -4051, -1912, 77, -274, -2161, -1809, -582, -426, -230, -740, -1091, -308, 187, 312, 159, 708, 2003, 1724, -1064, -2013, 186, 3609, 4998, 2672, -1201, -1862, 1270, 4062, 4055, 1281, 252, 1841, 2033, 2231, 2134, 883, 1145, 1665, 1639, 1290, 2104, 2465, 1555, -51, -1628, 43, 2709, 3775, 2023, -2053, -3404, 318, 3178, 1980, -713, -2194, -1321, 1035]
648A035J60j655j287n66J183J188n70P95j94k351l58K87P54K571Q94k334k820
665c268j541K822M062o71k901j618L19L401J296l052j879R46J472J132K6q51j06
682d11p89m60R31J221P58M20j912k361R88K040J752J48l179j597J466K424K073
699C512k025l933N90K610J711K5j547j871R35N55k26J060N79Q9r07j796J36K069
717A566N98j70j451j725J609K751p2k596k668M95L333K143j344j913k679M88K348
734G13N56j17k34o04j315j01k31J381P48l96j199j588Q10K302M03k607j680M80
752b679J859K427q09l094j355J248K105K49q84q15R0l23N45P48J18m8l30j140
770b088M6J564J421j97j587j655K91K199K545L6k697k446J458K253R45o23j398
$$ y = [1035, 1195, -460, -1747, -2313, -1130, 58, -512, 283, 89, -2262, -2620, -2333, -1579, 992, 1886, -448, -3268, -4809, -1987, 2075, 1404, -1497, -3115, -2796, 605, 1901, -1151, -3030, -2084, -612, 520, 546, -305, -411, -1200, -1660, -729, 492, 1250, 1670, -242, -2603, -1615, 425, 2177, 2325, -854, -2451, -985, 1439, 3512, 1487, -2446, -1856, 754, 2465, 2490, 943, -928, 7, 562, 336, 1396, 1975, 2064, 1157, -639, -503, 1566, 2164, 1994, 543, -1182, 427, 3178, 3106, 510, -2158, -1663, 1670, 3813, 2469, 556, -2123, -1635, 713, 1269, 1152, 918, 314, -1001, -1102, -1333, 48, 796, 400, -799, -2387, -1577, 725, 1128, -1479, -3159, -2679, -820, 1607, 798, -2296, -3651, -2403, -298, -49, -933, -1748, -1658, -1981, -1436, -688, -570, -618, -948, -2088, -2042, -478, 943, 746, -841, -2496, -2205, -6, 2539, 2575, -122, -2568, -1110, 1143, 2088, 1465, 67]
787F7K10J400J37p88o84R89M58j89n10N90P43o94r99p22L56K100J430j430k081
806C83j713R69K398Q40r15j652r23J042J294r11j169M21K17j39l03j61L31r2p50
825h33r76J77J234J119q15j647q96N18J445O34n82k252j66J784J297p11j734m80
843b884J121N40M43J69k29m92j18q17J09K249J115p55j550j107R08J638R18j13
861A145j728o55J551J426m94q54q32O34J745M38r10r85M16O51m50k44J083J002
879B939q93j428q92P59K029R26j623j937J7J036J411l88j353p67J9Q96J312j099
897I64r11k23k98p9K27M91J82n1j366l62l49J030J310r49j849M56J037O79o1j581
917a703j407Q08J717Q66q08j468l32P85J60M16O03k11J7n91r50Q91J152P43o73
$$ y = [67, 277, 1677, 1814, 1026, 342, 1331, 1789, 1600, 1090, 1680, 2423, 1729, 730, 8, 364, 2464, 3894, 2464, 383, -1330, -361, 2037, 2877, 1962, 310, -613, 429, 1723, 812, -357, 64, 281, 142, -161, -322, 9, -83, -833, -1809, -1632, -398, 721, -94, -1741, -2637, -2119, -674, -40, -622, -2874, -3040, -1256, 41, -670, -2404, -2884, -1763, -1223, -780, -611, -840, -1332, -1450, -2267, -2158, 91, 1206, 451, -1099, -2206, -1298, 340, 1258, 1145, -583, -1238, 313, 1739, 1245, 391, -441, 193, 1938, 2376, 1466, 481, 897, 1548, 1098, 854, 1937, 2939, 2046, 618, -274, 485, 2514, 3440, 1817, -120, -103, 933, 2344, 1956, 603, -164, -145, 751, 2063, 964, 53, -170, -468, -547, -320, 171, 353, 302, -1064, -1426, -1775, -745, 565, -384, -2233, -1777, -740, -61, -122, -1703, -3110, -2302, -585, 281, -527, -1995, -2327, -1542, -1382, -966, -363, -574, -557, -1148, -2098, -1207, -55, 688, 15]
936A5j242j24J329J083j61j117q59K21J998M44o24j071n20O44J539K74p43p26
954C60R6M21q4m72J043N10j079m24k74Q77J447o11j563q34P96J416N20j043j156
973e4m21r8J326P87n57p48m18j48M63J81k81q1k49k03k2M7R35j37j286j101Q90
994a175J291P89r14j886j60P69J449L19q03j058N8L80M86K96l05m95n3R5LM39
1014d75P82L9j675l66O14J761O72j132j532p5R11J063L66q93o13j98R07N46L92
1033A094o67o06K38M67J35J11k4o5p17k01R16P77L48p60j757m19J723J534k95
1052A832j014j056L04J019J37K43j217o49N41P31k49K74m94m77r7M5L21O77l34
1071E37n24q69l90J322J129r97p37q16L16J205Q27p03j124o93M59R95L57n38l54
$$ y = [15, -1227, -1351, -22, 1061, 900, -217, -1076, -855, 1143, 1587, 963, -108, -628, 16, 1555, 1829, 1086, 360, 456, 877, 793, 321, 1364, 1874, 795, 371, 97, 974, 2421, 1810, 247, -587, 209, 1625, 2145, 1102, -54, -475, -573, 753, 1540, 983, 235, -183, -331, 132, 313, 32, -49, -298, -501, -523, -476, 459, 322, -964, -2065, -1175, 116, 905, -9, -1895, -2055, -1286, 163, 482, -321, -1379, -1321, -941, -455, -159, -464, -959, -1012, -917, -914, -475, 307, 346, -1329, -1695, -1081, 680, 1352, 220, -1312, -1387, -476, 587, 953, 60, -553, -751, 156, 702, 1094, 427, -179, 59, 526, 661, 772, 748, 683, -34, -235, 681, 1458, 1806, 1046, -711, -1130, 593, 2127, 1832, 818, -238, 66, 1085, 1222, 1465, 248, -401, 140, 871, 622, 896, 402, -75, -172, -127, 194, 871, 537, 13, -856, -1246, 76, 1205, 208, -529, -1345, -1029, 176, 1003, 300, -824, -1517, -1058, -63, 294, -244, -598]
1090e98p53J06Q55J32Q1L51q12o20P5N57J145k08j170n38M08Q50P41q26r74J59
1110a039P37N28L79q23m09k24J65J109M52m70k91l70k76M54P32J59J30n40q28
1129d25L33J203M20m79j571J40J222K97K0k45q10J72N91k29L52j08o81r5P30k33
1149F04M14k94k55l26k91Q7P17J90r08l38o72P07J237j73q81o31k78Q21O36o43
1169b77M9p71J31Jr8L21J53j75k37l7JM75J06m44p61L63K16R53L3j143m35K56
1191a320P94O67j90n08j38KM17M31J14l45J70m40j2N81J82M28k29m40J23K33O86
1212A206K33o24o50j20J114K48Lp02m01M54L93L28l57n20M27p27K86L45K74k05
1232A005p38k54N8L06P74l29p13q50J29N49N08n5r66m63J76P95N0o54n4j25r0
$$ y = [-598, -1351, -1245, -390, -258, -177, 174, -638, -1258, -1183, -626, 519, 311, -859, -1397, -989, -139, 602, -224, -1198, -1039, -302, 226, 605, -218, -627, -851, -686, 423, 875, 405, 114, -256, -532, -78, 654, 813, 943, 403, -425, -92, 1111, 1531, 1052, -519, -379, 843, 1140, 1160, 915, 105, 277, 868, 639, 991, 883, 202, 107, 837, 604, 1018, 724, 469, 143, -148, -61, 656, 846, -62, -400, -1072, -365, 872, 699, -182, -813, -1091, -270, 366, -277, -228, -999, -868, -867, -965, -644, -491, -666, -903, -940, -939, -464, -358, -802, -1563, -1200, -984, -31, 2, -1141, -1576, -1320, -526, 141, -49, -557, -695, -693, -276, 155, 269, -76, 94, -346, -358, 223, 405, 833, 604, 164, 287, 520, 1206, 1439, 815, 165, 45, 1159, 1407, 1410, 708, 307, 761, 1154, 1482, 1125, 605, 1032, 305, 591, 936, 1210, 1005, 267, 13, 71, 377, 1151, 822, 109, -741, -612, -63, 445, 390, -576, -1039, -863, -68, -18, -672, -726, -851, -941]
1253i41J91K02L9n91J65m23M46L91L6p5n39l60L77M89N35j2q43p23Q30O68L4Q2
1275b2n88k44N41M18K97N0j72j89k92K79M76L70q2o50r3J34P05M96m71k64n24
1296A75O53O19j73l75k02n16N42N07nn37j90l85K84L55p0J60l87m14M6Q4L81J40
1318F92n14p51N9M10m6M13l78q66n2O67L54J40p04m61m8P00J59j57j55q4k25p3
1340i20L48L89J15o66l46J18M71M51m8o4p52O1N26O84M8p00n35J38P40M16Q5n74
1362a5N8k44J60M21L43j01m37j41J95J94O20k56n32k12K64M47J60o0o62j57MO24
1384F73L03n57j61n93M80K89L14k37l14m60L3L05K78J69l33n47k41M12M53J56
1404D22m46n16m0J11M67M58l49j070N39J52m6K11J16p62N0L12J01M48j24l28j33
$$ y = [-941, -750, -548, -509, -1100, -935, -1358, -912, -521, -485, -560, -1099, -1459, -1082, -593, -58, -70, -913, -1636, -806, -138, -104, -22, -610, -854, -313, 105, 402, 452, 280, 91, -201, 78, 554, 924, 842, 192, 99, 233, 938, 1434, 963, 699, 175, 828, 1447, 1274, 899, 697, 181, 723, 1230, 1225, 688, 498, 113, 397, 752, 682, 842, 455, 41, 87, 171, 552, 692, 178, -573, -514, -104, -150, 263, -115, -981, -1033, -366, -12, 128, -576, -1037, -1085, -385, -226, -383, -538, -622, -847, -920, -572, -183, -68, -734, -1080, -962, -491, -40, -88, -152, -904, -843, -317, 367, 415, -285, -820, -682, 58, 474, 559, -15, 43, -201, -41, 380, 723, 622, 185, 44, 239, 433, 1053, 797, 265, 53, 317, 764, 924, 864, 202, 45, 49, 673, 976, 419, 258, -335, 145, 434, 748, 511, 197, -263, -230, 75, 353, 522, 189, -358, -599, -187, 266, 422, -24, -540, -580, -469, -2, 456, 107, -963, -424, -272, -318, -107, 9, -753, -703, -391, -290, 158, 34, -294, -427]
1425d27m24Q02L40j67k15l25j46J92N00K0J2q03J0N08J31M43m04m32q3M36p8K46
1447A36l9j21j33l10P23J09R1l37k02P1K00L15j64l28j40J35M04K0M33o94j76
1468gk19K94N07j37R9k63k91l4J82M08N7k65m67j07L98M83l2l77m08k0P9L81m6
1491B15k25m52J21N31K7k85om47K33K99j12K63k04n56j4K33K1L21r7l08m27M62
1513d07K3L76r0l54k07j1L72L84n8l7n38J00M07L13l68j61PJ60L4K34k56L2k71
1536c16j71P11K68k8l29l03P6l0N17L35k04k88m10K71J28L90N7m99P4l00M56n1
1558C54J42m43R6p6J29L45j07Qm84m3R9K74J17r6m18k98N65J34k4j28j76n26J24
1581d32K76K66l91l5k49L3R7K92O2j05m08K38j93M31K28p31K04j52J15K42N3J42
$$ y = [-427, -851, -49, 291, 124, -91, -416, -562, -370, 130, 150, 162, -641, -631, -123, 8, 451, 47, -385, -468, -32, -110, 136, 97, -24, -157, -467, 256, 365, 456, 119, -83, -12, 188, 503, 339, 11, -129, 6, 410, 430, 863, 169, -7, -226, 68, 575, 438, 537, 274, -17, -51, 131, 539, 596, 331, -136, -243, 155, 638, 606, 229, -179, -199, -120, 261, 215, -10, -462, -341, 190, 217, -68, -74, -521, -288, 11, -101, 162, -42, -598, -612, -379, -358, -37, -134, -442, -869, -407, -384, -8, -98, -452, -659, -670, -298, 86, 28, -9, -547, -447, -40, 273, -95, -256, -249, -89, -55, 179, -77, -45, -316, -487, 224, 492, 464, 135, -168, -92, -122, 395, 730, 526, 238, -172, 99, 227, 617, 674, 175, 249, -51, 405, 354, 496, 53, 149, 73, 202, 547, 440, 448, -36, -79, 20, 294, 411, 315, -103, -401, 164, 298, 274, 146, -30, -556, -432, -156, 110, -281, -316, -565, -532, -435, -143, -81, -186, -594, -356, -549, -118, 110, -621, -417, -569, -454, -212, -159, -17]
1603a7m92r7NN06M93p98J60l18K78M30kj24k2l62K39K32Q5M00m21m50L61J01K62
1626D49R4l31l50J12L93J88j15M4j37j64J53M34J49n60n9k27QK83L7p6J56l77
1648A04k93L65K42j62m04j44J40N46j49j23J30l52k73J32M07k33K19o23k01K86
1668c86N9M20k59l20n5J70J15P3j67j29r3K85M7K43j42j28l4Q8K53P1q2k47k27
1691d45O7L33L02J91m94k67O1L42J58M6l11L8j30J47J40K49j39k24q1L8L34L62
1713G17j88n34K42o5j17M97k13k47m1Q0K13K2R8n61J41r7L48r0j00r6n3nj28L92
1737B15k05J6k87k62L50J29M57k74k53l21J47N67j48l76r0j90K31L20j93K4P9
1758f4l29n2n5L60M5k81k23L10j01N46k57J45j07l59L38J65K54k8m72J51j6M73
$$ y = [-17, -509, -606, -601, -95, 398, -400, -240, -558, -280, 150, 148, 24, 2, -360, -121, 111, 196, 596, 175, -275, 86, 187, 449, 543, 212, -138, -26, 367, 555, 440, 484, 347, 183, 336, 770, 919, 359, 300, 73, 81, 364, 401, 325, 481, 104, -189, 176, 418, 256, -148, -292, -152, 394, 245, 122, 252, -100, -373, -241, 166, -67, 152, -471, -672, -386, -327, 93, -166, -486, -541, -371, -256, -183, -350, -479, -572, -287, -240, 3, -139, -267, -301, -213, 40, 111, 29, -218, -445, -378, -45, 257, 448, -46, -313, -252, 90, 248, 294, -17, 21, -109, 38, 178, 427, 288, 64, -17, 21, 355, 717, 529, -5, 237, 172, 55, 552, 339, 92, 51, 131, 344, 366, 464, -97, 44, -53, 295, 205, 105, 9, -44, -49, -177, 215, 10, 26, -261, -523, -173, -44, 413, 139, -114, -435, -288, 279, 131, -245, -335, -525, -294, 26, -167, -143, -64, -393, -445, -500, -140, -95, -376, -599, -289, -390, 156, -101, 44, -63, -422, -84, 81, 335, 307, -165, -14, -30, 443]
1780D43M8n45K75nJ2P5N6q0j23K26l22QN00k35J18n55K80M9M8L5n5l9k80K5K20
1805A79K68l21l68K93M8j47K34k40l4o0O2j2L30J0k33q0k33j0N10j14j87l17K13
1828b09J66O4Q3J12n58O8L00K57l80M3J35j73Q7j23K95j88Q2j17l9q0L96P2m65
1851a72M9N9L02J22j49j29m72K44J63K54m2k26lj47LJ53K11k94K00l5J36k99J73
1874A01O7k42J39j62J05J89q0J61o57K99L10N7K5n98J31MJ64K28l57o8l3m9J16
1897a50K41K11J47n41m3M05m52L55q5q6l06K33l7J38J25Rk58R0K3O8l2j10k10
1920b65L7J00K32j96K71l08K7j56M04j63K59l51j49K12J89k5j95l5j25L4K28J30
1942A55k31r1o3J79RM1l2k06L2J48j12J32k7J42k74P7J93j1K29j76k63j58N49
$$ y = [443, 491, -54, 221, 216, 228, 303, 359, 279, 156, 382, 60, 68, 568, 333, 451, -104, 176, 225, 273, 308, 253, 214, -66, -41, 179, 447, 126, -242, 51, 99, -48, 186, -54, -88, -148, -86, -98, 232, 242, 9, -71, -304, -314, 196, 82, -105, -422, -209, -43, 21, 104, 216, -342, -274, 26, 283, -97, -54, 81, -92, -5, -128, 167, -21, 61, -56, -95, -175, 221, 293, -172, -123, -64, 238, 360, 211, 82, -390, -146, 17, 271, 229, 3, 0, -147, -144, 9, 220, -74, 126, 91, 227, -72, 101, 168, -74, 65, -97, 8, 197, 117, 278, -379, -80, 230, 287, 312, -286, -155, -151, 13, 241, -116, -184, -217, -266, -150, 91, 302, 449, -92, -135, 270, -182, 173, 88, 2, -304, -71, -108, 30, 155, 164, -94, -4, 19, 87, 55, -55, -265, -228, -128, 104, -92, 179, -129, -102, -258, 146, -17, 242, -109, -258, -46, 143, 118, -77, -112, -237, -203, 25, 155, -76, -167, -230, -51, -42, -1, -33, -239, -207, -59, -171, -39, -66, 76, -198, -121, 72, 61, 290, 114, -149, -307, 242]
1965B42L3l5r4k57K37J18N0j25l41K71J20k91J62J26j10n9J89l36r7N52k09J68
1987C14k85k50K38K78m3l39J81p4pQ8J02l88N8N7J90J63m80j88K70j34M18l56
2009a87J29j47J21p3r1L9J72j55Q5q1j47K90oM8k31j13K92J66j67K94k29j75J61
2032eJ9J16n5j85j72N29k07jL82r4l37r7K20R4K80k59p6k02O8P5J27k97K31q3
2056G1r6o9L71k27J59j64j84K05n6K78Q7j35l17p0J2L41j01l65K17o3J87J91j77
2079I5l47j32K35K1J4q8J04J15L6j66p5J34j49l1j27J42j53L37k83O3L7J21J08
2102A1J8l9j71J23k7K07r5m8j01j84K60q6L22j97l10L08j87K08K1J58K72o84J04
2125a17M08J69l5m73K8J38K17k44O4j28K87J11k21K03m12R3j30J30N3Q2j4K5j46
$$ y = [242, 275, 240, 146, -111, 126, 244, 294, 169, -172, 99, 219, -72, 90, 216, 106, 47, 236, -100, -197, 355, 146, 314, 29, -221, 17, 295, 252, -87, 94, 20, 13, 101, 203, -185, -127, -70, 120, 283, -197, -385, -115, -249, 169, -187, -58, -205, -84, -157, -248, -209, -37, -192, -107, -188, -335, -45, -51, -3, -234, -347, -55, 111, -56, 238, 9, -166, -5, 14, 130, 75, -110, -282, 247, 40, 39, 421, 327, -10, -107, 113, 207, 487, 228, 152, -50, 18, 93, 220, -77, 154, 71, -25, -94, 277, 50, 209, 45, -139, 66, 10, 288, 375, 240, -77, -147, -135, 206, 105, -260, -43, -106, 81, 272, 95, -252, -384, -149, -128, -114, -202, -98, 17, 53, -113, -188, -54, -203, -234, -361, -219, -372, -35, -318, -255, -218, -97, 11, 29, -10, -181, -58, -85, 122, 27, -21, -122, -306, -46, -132, 190, -7, -317, -9, -196, 12, 33, 191, 463, -221, -117, 291, 460, 425, -48, -20, 118, 335, 91, 155, 27, 314, 425, 204, 407, -5, 88, -42, 88, 141, 223, 209, 234, 88]
2148H8J63j46M3K29j89m9j60k83M32J32l15k06K62j81K71j95k02q0M07j15j10
2169b04J80J59n9j30j77j47L62R4J7k17Q9p9J02K10k63j39j08KL20K61l67j4Q7
2192b1P1kn2j16J52j17J22p4j12O04l08k71J26K13L6K52r0n16J5J70J08J92l99
2215a7N6L6j27K04J15j25J19k18l9n8J48J38m4j61lk23L29P4M8k95m2MK02j18
2239Ck86K00P8K50l74J27J00k47pL44l64J72M5l6n02K00L45n8J70l8l93M3K1j56
2263c63K2K85j22M5L31j98j13J44j72J93j47KJ42J67j54l98L38M8K3J22j60L3
2285F8o4%j01M4N00n38J18j18J48k1o0j42L91J25j04m1l56K54K63l98j3K53j33
2308G5N7J6k90J47N9m2j76j10L05J07J35k10j28J66m44K38L39l94J79k14L48M9
$$ y = [88, 251, 105, 148, 377, 188, 139, -21, -304, 128, 260, -55, -261, 1, -180, 91, -104, -306, -386, 21, -94, -204, -24, 135, 76, -54, -231, -378, -16, 78, 95, -122, -33, -112, -10, 200, -63, -202, -310, -308, 12, 273, -94, -108, -21, 50, 48, -4, -120, 32, -85, 37, -37, -149, 455, 147, -124, 2, 215, 251, 503, 413, -103, -88, 82, 190, 382, -17, 39, 75, -52, 152, 267, 142, 261, 43, 4, -54, 94, 232, 188, 27, 24, -199, 130, 204, 252, -43, -85, -81, 121, 3, -283, -83, -5, 245, -129, -2, 98, -149, -156, 188, -176, -4, 41, 5, -497, -297, 48, -10, 160, 122, -271, -228, -207, -363, -341, -56, -178, -133, 198, 0, -113, 31, -141, 52, -95, -93, 49, 216, 62, -336, 2, 50, 73, 195, 35, 68, 4, 4, -97, -53, 447, -91, 27, -91, 57, 36, -24, -166, 225, 350, 246, 205, -151, 103, 366, -32, -45, 208, 75, 132, 148, -142, 5, 64, 22, -154, -264, 41, 148, 283, 73, -55, 111, -333, -95, 244, -150, 29, -185, 163, 212]
2330B12l01P1J9P7r3j44J19KJ9k46Q3J6M3O8J16j05k28J74p5m1Nj6J43q8M4K2
2356a04O4LJ44k03J15j46J21J92j78J94k01L85j79k28K05k87J04J73On4j31J23
2378A18k22L88k22L4k5J34J6j39p2N1m1j17m6K81J93k32Lj93Q9K76l3j63K6j83
2402g9K05j83M50j56m18L1L53q7k65l7K90Ml04J34j8Q8Q8j80P3j19j46J63L92
2425B79l1m01K26j80k52N92l36J74j08m9P1k49m9K95O1k35J00o4M45j74k85J18
2447e2m2nK44k34K10l15J8M04k54m3J72j19Q7K45k29j51k62N49M4m72L67n2j72
2470f2L3k23J72M41j86n0j52k85N14L3j95k13K38l5j29L18k99n1O8p9L32J3l88
2493a85J48k94L17J47k30J46n8p7J00j68J63J11p6m3j38J13J38l63J69j53%O9
$$ y = [212, -89, -18, 1, 78, -15, -159, -40, -38, -19, -265, -182, -166, -123, -55, 61, -44, -272, -98, -173, -214, -209, -225, -82, -170, -126, -104, -40, -37, 107, -96, 19, -127, -6, 186, 8, 202, 1, 386, 207, -21, 184, -103, 1, 174, 180, 126, -5, 118, -104, 284, 62, 96, 71, 205, 221, 82, 10, 61, 20, -97, -143, 138, 331, 99, 102, -91, -2, 274, 241, 78, 104, -79, 126, -57, 393, 237, -181, -150, 203, 116, -149, -186, 104, 108, -196, -62, -80, 8, 96, -84, -11, -130, -276, -113, 279, 248, -153, 73, -107, -359, 233, -103, 71, -37, -86, -15, -264, -313, -18, 43, -192, -92, -156, 289, 115, -170, -52, -94, -99, 145, -89, 121, -194, -176, 228, -26, -69, 103, -16, 71, 316, 87, -64, -326, 223, 267, -205, 162, 110, -62, -29, -252, -80, 361, 175, 125, -27, -312, 202, 235, 40, -173, 65, 30, -99, 219, -80, -131, -63, -142, 190, 203, -185, -37, -331, -14, 133, -97, 49, -9, -86, 14, -154, 9, 120, 44, 1, -137, -24, 114, -249, -80, -233, -233, -164]
2515a64P9%J00n8q0l0L3K87k18L4J5J04l1QNj6q9N7k13L85k4Ok26q5K09o1j13
2542h6J67j53K58j45k34K39j6J58j41jl09M23j49o7K62m41L54j54O0j11o9K41
2564H6j5KK47m61j21o1L71O8Jk56J74Qj63J64%j6J33p8j44P6k4J3j39j23J47K11
2590A00J50k23k77N18n27L11M6j53M9q0n1K29Q0l01J24r0n7L55j61J34J22n06
2612b08Q8J7O0J94K7k66JJ58QM5M3n6j19k6M7O6j45O5m5kJ81J9j09J36Ql33J23
2639b3N8L60n03J15j2J89j4j05n4l6j75L8mK90k92k31N03n7k4j40K72K32l51n9
2663b3k78M78k52K92k38l00K49M3JL1j69Q5L69m08J34j38M1L11l25o7J95J47k46
2686f8j54L17J32k90K2J94k08n7O5L69n94K12k58L09LL69l42j1j02J62J57j86
$$ y = [-164, -85, -85, 15, -43, -123, -153, -120, 167, -51, -17, -2, 102, 71, 79, 84, 68, -21, 36, -177, 208, 184, 190, -36, -121, 88, 27, -86, 81, -72, 186, 41, -193, 46, 30, 188, 47, 46, -263, 160, 11, -56, 206, -235, 119, -35, 25, -86, -155, 86, 71, 73, 320, -141, -262, -323, 48, 116, 117, -139, 35, 43, -120, 44, 44, 28, 161, 83, -61, 15, -9, 4, -135, -258, -111, 100, 250, 27, -250, 268, -259, 52, 98, -55, -6, -86, -137, 92, 172, -129, -5, -95, -152, 203, 42, 176, 298, -208, -120, -103, -43, 151, 178, -88, -87, 71, 79, 124, 167, 111, -8, -34, 13, 79, -66, -1, -46, -48, 133, 152, 43, 179, 187, -146, -23, 35, 395, -108, 7, -5, 184, 170, 65, 11, -25, -200, -162, -166, 124, -168, -399, 104, 47, 23, -117, 155, 387, 36, -23, -301, 177, -75, 217, -21, -321, -72, -29, -28, 3, -166, -81, 288, -120, 14, -124, -83, 228, -97, -164, 31, 178, -68, -222, 95, 227, -63, -41, 153, -55, -112, -47, 322, -272, -60, -318, -9, -6, 363, 21, 10, -92, 70, 227, 41]
2708D1N8p6J30O1k76J34P7p9k48L90m97N51k29J98l11M7J39p1J63j10l81J89J14
2731A4k01J34n6N9k74M32k05J75k70J62j5k00R8pK3qK75k89J30%r2J42j13M9j35
2756a72O12n08q1O4o1K27o5p5J77o2j16j4r9J94M3m6n3j12Q2J73M4l52K77l20
2780b43M44j91K40k90J9J04j04J86qj41l3l3ko3K40r3M1J89k88q1R3mP6L7j71
2805g6J08k3n6N4O5j49J03J00K31m55L38m11K69K23m81K15J27L9l25L35k82R9
2827D8J33l2l85mJ25K93r8q0ql50N77n7q0J11k91j10j5J83j1n4rM3J11l71K89
2852d2k48L49j58L25N9k10k69o9J89J05R7J03l80J42J28r9m3jL07l48J70k24j21
2875b38J17J71K03l69J90n5L03m37P0Q7k93K59N3m8j35pK80j74J99j85k81K54
$$ y = [41, 99, 23, 153, 214, -62, 72, 149, 70, -178, 212, -285, 266, 37, 235, -76, -29, 110, 39, 202, 92, -289, -100, 14, -187, -53, -109, -50, -324, 108, -97, 78, -192, -30, -45, -245, -147, -154, -131, -139, 136, -153, -23, -23, -115, 27, -86, -37, -172, 440, -68, -149, -85, -146, 81, 16, -59, 118, 56, -60, -74, -173, 21, 64, 18, -35, -147, -65, 108, 152, -200, 77, -243, 201, 10, 250, -40, -21, 83, -21, 165, 157, 16, -17, -50, -52, -115, 125, 32, 73, 262, -26, -107, -14, -18, 58, 95, -76, 32, 9, -47, 7, 72, -77, 26, 126, 357, -98, 240, -171, 98, 321, -160, 55, 182, 221, -104, 231, -51, 48, 181, 149, -236, -240, -115, 178, 80, 0, -8, -358, 219, 162, 82, 193, -98, -208, -223, -40, -51, -105, -114, -71, 40, -331, -42, -290, 59, -99, 226, 285, 75, -194, -263, -74, 31, 128, 231, -149, -7, 121, 22, -21, -22, 285, -63, 107, -117, -238, -121, 50, 253, -116, 74, 19, 322, -115, -45, 42, -251, 8, 61, 13, -122, -129, 151, -23, 176, -9, -290, -36]
2897c6P2k0K56m69MJ30l2M4M0mr5J25q7oK3J06q4J01p1J65j28K58k06j15Nn7J81
2924A00K13l52J34l0j48q4J32k8K35n0l08Q6P8r8lL23K36l83j25pj03J40JJ35
2948I4J52K3j23j32l1J42j45j9P6J23O3k10j56J57j7k2k5j20L82l45K73j23p8
2971f1J31j79M6K30j09p8J43j05rO4k15R6N7j25k20J76K36j10O4K7k93K08J95
2994A69j97m0J82j34L2J68n04K31J17J51o6o6j05J57J94k53l60N02k39L5o3J97
3016A08l48K50N3l05J10o1j40M20Q8j81N3j06P8p3J21J5n4J82k97J57n8j52K30
3039I0l28K76O4M3k38M43m83J02J72j06j0k3O0l0J89k35K79l29L08k53j77J55
3061c1J48j15Q4j77J63k63l5L15j39j21K46n4J05ol9j28J10K9k48J41K08l15L87
$$ y = [-36, 36, 16, 272, -197, -193, -63, -95, -51, -11, -15, -110, 15, -72, -78, -55, 51, -33, 68, -3, 162, 34, 292, 86, -29, -24, -81, 100, 313, -39, 95, 65, -83, -167, -35, -63, 172, 122, -186, -100, -22, -120, -123, 200, 436, 53, -72, -79, -182, -42, -41, 94, 246, 269, 146, 14, -17, 125, -20, -39, 37, 160, 223, 13, -143, 14, -3, -25, -50, -170, 212, -133, 140, 17, -61, 70, -109, -63, 167, 58, -20, 123, 18, 9, 73, -142, -46, 11, -114, -334, -158, 78, -32, 32, 59, -234, -26, 169, -28, -68, 114, -20, 12, 180, -324, -93, 24, 175, 109, 43, -62, 95, 289, 36, -324, 178, -61, -26, -89, 108, -240, 10, 63, -242, -132, -193, -333, 87, 175, -6, 47, -59, 19, -54, 67, 82, 28, 210, -87, 70, 12, -140, 90, -238, 38, 102, 145, -93, 350, -133, -31, 141, 35, 25, 2, 62, 32, 221, -14, 265, -64, 244, -9, -186, -31, 117, 2, 86, -91, 72, -191, -226, 89, -50, -171, 75, 21, 126, 120, 81, -47, 63, 92, -156, -15, 193, -122, 265]
3084B65l07J12k28L2J45p3P7k0p9o4o6J74J1q6M35k51k65O1J31J20J58l33O3k37
3108b25N9R8k7m0J78m6M1K61l70j22K05j79R6j14M04k16O9k19M0j05L49j79N8
3131A6M4k10J78l2j2N8k62K16L8K47k22K23k09PJ36j8l54K39O2Q4l02J22j2n9
3155b2O4l29K54j52J24Q0kk27J84J44O9l73J43K9J71l96M19lk35j46L30k61J85
3178E0N8J62j81%j97P5m8q0J90j84K56j01j01J92k36R8J40J58k87O6J8L9J97k26
3202E8QJ50m43J18P8Q1k6J0J54k70q4N8m8K76j57j10J74P2P0j97m2n9J23L62l23
3227C3k18K08K52j05j02N8O4k25K6p9N4J92j58j4O0j97K0K88j92j0j04J20J70
3250A41lk24k99N28o4j14l2L7k31K17P3j12p2m8P7K04j10k8%Q3O0j29J03Q6l13
$$ y = [265, -42, 70, -158, -126, 19, -54, 23, 3, -76, -140, -206, -32, -21, -107, 328, 77, -188, -127, 4, 124, 282, -51, 12, -225, -166, -68, -95, -135, 43, -3, 38, 299, -71, -193, 12, -167, -71, -185, 219, 3, 72, -147, -107, -212, 137, -42, 16, 60, -150, 28, -4, -16, 42, -220, -4, 34, 281, 59, 282, 73, 80, 216, 198, -156, 83, 145, 229, -73, 49, 37, -22, 42, -287, -33, -185, -61, 19, 17, -210, -26, 118, 187, -186, -43, -14, 157, -239, 180, 177, -58, -204, 126, -135, 50, 108, 270, 89, 89, -108, -33, -81, -161, 29, -155, 101, 0, -101, 91, -145, -47, 93, 251, -36, 30, 48, 87, 284, 58, 66, 216, -227, -109, -31, 50, 24, 34, 188, -82, -166, -108, -156, 120, -37, -147, 27, 99, 169, -28, -70, -129, -6, 356, 33, -185, 23, 275, 170, 68, 126, 190, -35, -9, -88, -34, 158, 0, -14, 46, -151, -131, 157, -35, -45, -149, -29, 141, 138, -86, -385, 143, 79, -35, -67, -30, -261, -44, 29, -83, -155, -203, -126, 78, -32, -60, -60, 23, 83, -46, 57, 143, -170]
3275a70M33k50J8k6Q0Jk8k10L11j16l24N63k76j70P5K77p7k15J12J18l5O5l8j55
3299c7j94J67J4j7J23j16O2K11k4j24k07K22J31k54j2j01K48j35J70k1K8M9q3
3322A00J65j90q5J02P1j60j19P4L6p3J62K6l39O5K04j73J38j67K54K72l23k73
3344b33L97j27j23M4j54J03M96k13j62L3k98J21j2o0J37J20J83l89J23J89j63
3365A2J19k41J69j78J9K93p8p2J07J2j96J83Q7l09PK20l26J76k4J71J41j69j81
3388e8j55J14K4K63k36P2K3j72K48k31l8M47m49J07l2P4k31L63j01k04J86j70
3410a56j44J27k8J29k83M98R2l2k57M5R8J81l77J05j6j59J60M7o9N9n9L6L9q5
3434d9m2K01l52P4K23j58LJ76j99J75l92K27K13q4k01L18R9l33O1L4p2K5M9j42
$$ y = [-170, 263, 13, 31, 5, 85, 86, 58, -152, 159, 43, -281, 282, 6, -164, -89, 188, 111, -104, 8, 126, 91, 156, 118, -37, -231, -64, -50, -67, 56, -60, 2, 213, 189, 65, -142, 80, 211, -43, -55, -156, 92, -43, 127, 106, 134, 183, 100, 265, 75, -10, 92, 163, 3, -116, -42, -6, -79, 83, 109, -230, -165, 39, -134, 4, -163, 91, 363, 40, -233, 164, 37, -86, -42, -196, -93, 403, 190, 28, 61, -237, -116, -128, -188, -51, 69, 252, -137, -14, 175, 12, 131, -110, 59, -119, -100, 193, 115, 43, 150, 162, -34, 149, 236, -73, -66, 154, -172, 4, -20, 151, 292, 123, -58, -213, -99, -75, 188, -48, 24, 47, -125, 123, -108, -146, 301, -148, -41, -73, 1, -230, 133, 32, -172, 14, -156, -300, -173, -201, -72, -355, 143, 235, 203, -54, -9, 89, 270, -107, -2, -18, -177, -17, 30, -39, 20, -39, -3, 36, -49, -91, 110, -242, -168, 55, -103, -100, 76, -123, 52, -340, -113, 100, 16, -185, 133, 232, -101, -40, -6, -78, -53, -4, -146]
3458a46J60l3J24O8k16q4L21k76K01QRN4m82J67L69j79k37J13q5R6R9n9J72j23
3482D1J15r6j29K22o6l08L02R3j13j61K20k74J18K69N0o14L83j37j71L7J45O7
3504gK0O0n3Q3q6r3M8m4oj40J07J73m3p6K81j25k89M9R5J79k93k0N1L47j18P4
3530A74n4o3J25j79q1Q7J23L5k12l7j14L57j63n2K35l46J63l8P9l0j16k5j19K50
3554aK97l40P4l7q6J2K32k09J55j77Q6OJ3j21l9K08j03K03k44jl1L41l52q5K31
3579C2k4l8j18J25J09j61m3O3j49NJ92L26m44K30l18L44j94L8J34M8r3j84L37
3602B17k88J36q2j08j6L15j51k6k46K49M7j33J18L8O3l14J21J43j27j02J56j01
3624i1k3o7J07j9J24q3Q5R2n27O77m20K98L4l3l73K7J86J5j53n7J47r8J11L0j99
$$ y = [-146, 14, -19, 105, 173, -43, -127, 194, -82, 119, 127, 136, 190, -292, -125, 244, 65, -172, -59, -144, -48, 51, -8, 164, 41, 156, 60, -69, 153, 87, -221, 81, 174, 61, -100, 120, -154, -36, 233, 283, -331, 52, -85, -256, -219, -74, -7, 13, 73, 20, 103, 17, -76, -28, -72, -78, -218, -111, 62, 19, -57, 224, 99, -190, -141, -46, 133, -160, -180, -129, 218, 100, 174, 120, 57, 182, 3, -78, 9, 132, 167, -45, -82, -196, 161, -2, -54, 181, -165, -2, -40, 39, 9, -107, -132, -251, -1, 296, -44, 30, -7, -93, -81, 151, -58, 97, -80, 6, 12, 25, -96, -135, 73, -30, 173, -71, -72, -103, 238, -114, -199, 32, 8, -30, -148, -23, 86, -75, -118, -55, -204, -199, -7, 319, -125, 105, -213, 131, -63, -25, 109, 157, 64, -120, 217, -71, 65, -17, -125, -141, 174, 23, -3, -249, 0, 47, -86, 32, 70, 133, -181, -60, 83, -44, -146, 10, -91, -114, -181, -74, -93, 31, -52, 33, 125, -402, 275, -145, 153, 187, 154, -219, -192, -6, 9, -144, -201, -54, -152, -41, -11, -210]
3649b10M8K01N4p5k71J49K56j53O1j18K26j50N8r3K5l1j52K67j37n7J8J94j84
3672g4L30k03m4k16L11k54K81R5l14K07j68k10J17LJ93K7p3m6k41l7M51m6l62
3695b73N5L22k10j28j6M01n6q3J37r5J01n0k85J82k43L90j89K6J03q3m2k6o7P3
3719e6L17k84J94o9k36J41k34L04q0kJ23k8m9J94m39L16j80n7j32K30n6O3J27
3742A07j7j16J55m69N35M9k92O2j9j3j87J02K24j55J96j58j60O3p6j6K68l30K60
3765A3j44J74m7o1J38j10J18l52Q7K55K07j56j87R5j56Q2j68M72l00J52q3j31
3787a02Qk1O6J20kJ6m1J16m1k15m9M2J98m3K70m74J27p0J87m5N2k77M83k00k68
3812a63J45K43k38K20j45O8p2K18j98j44Q0r4N3k29P0K09K4K0l19L09Rl21K67
$$ y = [-210, -162, 39, 93, 18, -253, -104, 152, -1, 60, -58, 168, 18, 76, -17, 8, -23, -175, 92, -45, -102, -84, 110, -74, 256, 53, 9, -207, 104, -150, 131, 226, -88, 119, -49, -259, -142, -139, 54, 81, 8, -38, -279, -316, 135, 89, -273, -218, 104, -106, -234, -250, 151, 95, 12, 149, 54, 155, 105, -180, 2, -241, 149, -40, -14, 89, 6, -36, -62, -129, -56, 261, -23, 171, 102, -134, 7, -227, 77, -3, -5, 118, 90, 41, 235, -204, 112, -68, -125, -257, -27, -83, -20, 107, 90, -26, 129, -340, 195, 244, -48, 14, -5, -18, -205, -103, 121, -34, 162, 4, -156, -93, -169, -185, 83, -247, 13, -131, 43, -4, -65, 73, -37, 81, -271, -184, 71, 278, 122, -65, 30, -126, -44, -212, 260, -40, 112, 29, -102, -94, -115, -49, 71, 69, 85, 44, 160, 119, -96, -145, -103, 95, 52, 322, -152, -25, -95, 92, 47, 99, -178, 305, 105, -163, -18, 225, -13, 207, 62, 130, 58, 276, 78, -66, 14, -80, -27, -256, -186, 23, 47, 67, -252, 57, 66, -255, 12]
3835A2L41m99J4K15k98Q6j19K50J4q8L78n88K08J21k63J37j6K45k22L87m32jM45
3858C27j77r5L1j35k15J02L8K78k8q7P6j74J98j72J22k03J12l1P6p2j25M6J68
3881F0m0O8J49k20j68K8L08m85M10K0j75L2k22K85M5j83J77k4k4l3o6J13L38k83
3905A10j34L5k01L23Q7j56j9j64J52K86k62k22L82j64L3M7k26J58j77m29N02J44
3927A05k6j93J49J24j88Q5K8k97K76r6K06k90J64n5J05n4L2j42O4L12l2p0k37
3950c0M4j01L5L22m15l0K38J23J1K1j44r9j34J38m15K20L10K00k41n5j1N8k27
3973a82L48J74m02M2j59J41l4J47j91J43J17lj43N5R4l89K99PL7N5r9Oj8K8n6
3998A7j56M78m59j83M88j69L27l37KJ7l01L47r3q2KK29l0ql75M77j73k06K58l4
$$ y = [12, 353, -146, -132, 83, -215, -129, -248, 2, 16, -72, 306, -282, -74, 47, -216, -79, -95, 150, -72, 315, -117, -118, 327, 150, 55, 86, -49, -264, -162, -124, 154, 126, 39, 115, -59, 139, -33, 89, -114, -2, -33, 43, -29, -154, -108, 60, 20, 88, 237, 17, -151, -123, 185, -300, 110, 130, -45, -13, -235, 50, 95, -88, 89, 65, 41, 8, -58, 55, 393, 110, -24, 11, -190, 133, 220, 64, 45, -119, 33, 319, 57, -165, 217, 53, 86, 133, -93, 65, -112, -541, -39, 105, 79, -114, 35, 159, -29, 56, 84, -213, 63, -33, 173, -117, 47, -8, 97, 43, 75, -67, -3, 309, 277, 207, -30, 14, -87, -52, 270, -145, -175, 63, 186, 197, 218, 74, -25, -159, -21, -436, -216, 94, 294, 53, -2, -13, 45, -182, 166, 340, -62, -20, -179, -38, -72, 75, -116, 27, 144, 141, -2, 53, 147, -242, 57, 64, 101, 156, 57, 63, 45, 73, 17, -139, 339, -120, -303, 185, 16, 343, 6, 8, 25, -276, 71, -22, -104, -102, 127, 97, 89, -286, 191, 18, -188, 70, 36]
4022C6K14k21j09K80l08MO4j06QK02p7j31K18k22oP4K50j36n8K71k55Q4K11k82
4046Ej17J37j02L6J45m4lj21RJ63m0N1k01n5J13J14L8k43J42k06N3K0p0K16r5
4071e5q0K66j77M7m7J82J07j22j00JK4j53J61j22l4OO3j07K01p1o1O2J57j68p
4096b7J52k07J95p8j2J57k62j76J42J31j16J48n2p8J69K5j19J14k82J2L56l42
4118a50J62j19J96j18j65J61j70K34p9M3j22N2K67k91N6M9k04O3L68j00j17P1
4140H7j49qK8n1m4QJ77L9l93K33P3j27P5J46q9O4Kj6j04J00p6Q6q1M6oK0K40l12
4168c2J85k19J5o4l4J41j0k31J81O1N8p3J47k31J43j6k16P7L17j10rk17K83k21
4192g5j31M85l90p9J62j01R0k26m2P22n02J34j17J8J66k88K72j51l4L6j5K02r
$$ y = [36, 250, 29, -80, 200, -108, -104, -40, -146, -138, 64, -13, -144, 74, -148, -154, -80, 170, 34, -24, 247, -8, 76, 287, 5, -112, 25, -77, -41, 104, 60, 57, -64, -55, 108, 68, 119, -82, -137, -24, 90, 128, -115, 27, -179, -126, -106, -176, 40, -55, -135, 131, -46, 1, -46, 136, 243, 121, 21, 22, 46, -107, 54, -68, -102, -96, -33, -140, 61, -10, -71, -9, 148, -20, -27, 125, -82, 113, 35, 23, 180, -82, -258, -116, 15, -101, 47, -5, -83, 86, 111, -8, 106, -176, -164, 192, -150, 12, -107, 89, -29, -194, -33, -203, 31, -48, -5, -127, -75, 192, -99, -43, 6, -198, -135, 233, 133, 16, 87, -62, -70, -42, -93, -137, -129, 48, 87, -306, -73, 0, -127, -52, 94, 5, 69, 71, 55, -49, 51, -25, 61, -20, 26, 20, 40, 280, -32, 153, -66, -51, -115, -149, -8, -18, -249, -68, -7, 51, -22, 125, -106, 37, 21, -195, -118, 199, 89, 80, -137, 146, -75, -206, 279, -111, -190, -28, -129, -39, -265, -307, 415, -87, 47, -70, -52, 114, -174, 98, -53, -87, -51, -66, 136, 127]
4215A27j03k17R1O8O1N0Oj37O1Q0K6o8j96J22j67K78L1j42J06J43m07K79qk18
4239a34N2K56k43j0M5J8J64p1o7m0R6J50l11K00j8r0j58L9L39l34m3K21P3l80
4263b46L12j9o8K35j91K1n1N8k09K19j4J66M1l93L80r5k53Q4M4j73J36L5N7Q0
4287A56R7j56j14k05n6L42L3J2k3j14r0m3R7q8J99q6J85n7k89JJ64N6J14k10P2
4312cJ2r2O1L27k06j28J67j80J78j4q2l8k44P5K39p7j90J38J97q7j71K58K1l06
4336a45O0L79k60k14J7K12j01LK68l03K2j72J56K40k44L4k2l9M04l40qR7l05R9
4360a62K43J50m65K66K8J94k86J41M9m7k51J11K5j01m3P3q2R3K82k43J83j49L7
4383D6L27l81j09K50j95N7Q2k46N07m40J51nq6J29P5k58K48k23N8K20l19L9j3
$$ y = [127, 24, -193, -102, -34, 27, 77, 83, -54, 7, 87, 113, 45, -151, -29, -196, 82, 113, -29, 77, 220, -187, 92, 84, -134, -82, 174, -69, -79, -34, -16, 148, 77, 10, -30, 66, 216, -95, 105, 87, -3, -161, -122, 217, -117, -160, 61, 134, -246, 66, 47, -21, 214, 23, 44, -7, 51, -158, 61, 47, 213, 254, -139, 241, 146, -107, -23, 21, -152, -16, 19, 76, 156, 253, 97, -17, -222, -278, 64, 97, 109, 86, -28, -118, -161, -64, -152, 47, -39, 146, 89, -200, -199, -35, 21, 135, -75, -3, 9, -83, -22, 305, 99, -29, 138, -42, 136, 122, 40, 2, -242, -167, 72, -5, -195, -57, 140, 53, -118, 140, 161, -145, -85, 294, 34, -180, -163, 49, -52, -49, 219, -84, -62, -234, -78, 162, -82, -48, -70, -109, 295, -45, -53, 44, -261, -162, 81, 231, -234, 32, 60, 254, -32, 109, 158, 111, -140, -29, -4, -105, -148, -75, -157, -64, 218, -25, 158, 9, 46, 373, -8, -117, 133, -62, -5, 77, -169, 338, -102, 49, 44, -42, 87, 162, -96, 152, -71, -13, 207, -112, -73, -86]
4406h6JJ95p2Q0k61P0R2j30J17k45M68j69k21N8k9L1N3J67k06j18M47l45P2J41
4430A10j61k58J60K56j21M9L28n61J24M6R9l0Nl55J46N0M9n7K03J1K5J04k17j44
4454a39k9L98j86j97L53m12K70J25j37m3J3J9J45r0q0j11N1M1n5P4Q3J11l82J58
4478b0J18o8M2k75J71J23p8p6o5K36j76P0l0K10l47L26k65K00p8j42j02N3J38
4501c5M0k42L22j44j27J47j9J0o0K0j54K80j42L89M4k92M6L0j75n5K87k09r0K14
4525H5n4Q5q3J0j66K91L2k84q7L70k67K09j16k56N1J75L3M3K2m0j90J00J43k36
4549a30k33K87J58j3J79k58J57j82J33j68P0J10J18j56j38N7k25K61P2j31j64
4570a96J75m2J81k3J5p0j93K60k50P8l1L48l16R8j96J23j58J21NJ27j12K42j77
$$ y = [-86, -85, 110, 38, 118, -143, -73, 19, -111, 6, -239, 229, 60, -161, -103, -132, -101, -48, 119, -87, -205, 242, -103, -31, 110, -51, -309, -149, 107, -14, 35, 363, -198, -74, -28, 71, 41, 46, -309, -163, -113, -64, -121, 82, 93, 118, 222, 5, -139, -168, 230, 44, -153, 200, -212, 58, 183, 46, 3, 16, 35, 180, 90, 10, -101, -50, -9, -64, 10, 93, 204, -178, -20, 98, 30, 72, -203, -32, 91, 13, -63, -128, 108, -68, 2, -28, 182, -165, 161, -104, 96, 18, -124, -226, -173, -35, 5, -237, 85, -59, -186, -39, -58, -48, -108, -88, -242, 38, -104, 285, 329, 37, 83, 113, -62, -117, 170, -39, -129, 85, 31, 116, 33, 43, -123, 168, 200, -84, -171, 199, -68, 141, 25, -231, -180, -5, 28, 71, 93, 53, -137, -37, 106, -130, -363, -76, 82, 69, 248, -10, 147, -35, 98, -70, 0, 110, 228, 72, -66, -9, -234, 27, 99, -32, -196, -21, -63, 118, 95, 110, 40, -153, 107, -143, -65, -96, 252, -64, 34, -162, -39, -197, -76, -71, 56, -56, 186, 9]
4593IK26k51J06j79qJ49l23K17m21N62p7q9O9Q7J35j52J94n9j52P6n6k96K78j71
4617a26J8M31l52j27J29N3j29J57L5q3j23o4K17J01r8j35j9R0L6L9j58K32j87
4640f3R1Q3j69Q0K05j15l24K11Q8l8J08J41k43M8j53N9n0L9M5K45j56j25l9J61
4664A29k8k2J23j28N5r7n5J1R9o9K4o4q3O0N9J12k38J43j52k3J6j5K00op9j2j76
4691b16K62j16J22R1L6m15L87l74M79j75l62K06r4J23K2j59K71L6j68k24L01k38
4713b05J17r5J6L55o7O7j30k27L10o4k76K49J37j83Q6j06nL9j85R1K66q2l87J13
4737a66J96p5R9J2J07k33k6j10J27J71j64M6j4j05K34k10M2J59J11j04j23%J55
4760A29n9j89P0j2J13K47o81P47j07l69k9K39k37L09l41J65m8M9J00q3j15qP9
$$ y = [9, 235, -16, 90, -89, -97, 52, -271, -54, -475, 87, 10, -79, -10, 77, 212, 60, 254, 195, 43, 119, 63, -233, 45, -126, -108, 323, -29, -156, -27, 26, -103, 54, 89, 6, -117, -181, 36, 137, 39, -96, -115, -25, 11, 50, -108, 124, -63, 28, 111, -58, 22, 227, 112, -212, -1, 87, 49, 157, 298, 55, 103, -50, 9, -41, -2, 43, 288, 132, 7, -32, 129, 101, 79, 202, 74, 129, 32, -23, -12, 87, 18, 42, -22, -105, -45, 14, 126, -112, 31, -121, -144, -128, -143, 57, 51, -28, -40, -216, 46, -70, 52, 143, 179, -236, 151, -223, 256, 81, -281, -75, -169, -46, -24, -183, 88, 124, -44, -268, 33, -205, -88, -183, -167, 188, 121, 188, 58, -169, 141, 77, -199, 50, 187, 4, 90, -16, -21, 18, -167, -76, 190, 108, -279, -166, 30, -45, 54, 66, 173, -60, -86, -196, -69, 102, -62, -16, -30, -135, 99, -111, -69, 90, 201, 97, -26, -26, 129, 70, -119, -49, -61, 52, 299, -382, 365, 258, -111, -140, 99, -138, 171, -170, -5, -53, -4, 96, 13, -102, -110, -31]
4783c1M3Q7J73k40J59r5j58J3J37j46mj15L80j26l16J4j00O28l81Kj09K09nj05
4807h6K44Q0Q0l05K47r9k24R5O9j02j11L11l61K89k19J16l1K03r9j78k3J22J15
4830A33n8j68J55nk19K9K83j52mj8J99m0p0O3r3m8q1R9l0J39p4J9P0o2rj60k5
4857a27R3%K9n4M84o26l7L09k66K94k8j51mo8Q5p4m7K83k6O4q5k52K09j10m5K60
4883A10j98J81P1n0k21K12N1q0lj40R3O0o1O9j5Nj24Oj64K31j87J44K17j34j23
4908e0j3J35q8J90p2J2k38R6O1k11J21r2K07R4m35K57r1M4K07k93K12m1K76k83
4932EmR7k3l16L94k01j06M9M5o7p7Q3R8n1rj84K46J9j21J41j10j8o3L39k2P1l30
4959a15J6M3j36K21N7j28Q3l9J98k35K0J02q1J56k76K6J88k59L67M3k88J2r8L56
$$ y = [-31, 12, 99, 272, 32, 191, 96, -62, -49, 88, -58, -62, -177, 203, 77, -239, -225, -325, 303, -78, -76, -185, 24, 19, -86, 158, 238, 318, 13, 260, 161, -63, 32, 101, -1, -112, 199, -162, 127, -92, 24, -7, 196, 97, -81, -104, 18, 133, 75, -93, 62, 57, -162, -133, 150, -2, -6, -24, 175, 135, 65, 128, 35, -13, -94, 5, -25, 114, 40, 59, 129, 67, 58, -102, -127, -34, -34, -5, -59, 425, -201, -238, 71, -195, 99, 71, -80, -84, -152, -67, -141, -188, 95, 69, 133, 48, -204, 5, -105, -150, 110, -88, 93, 164, 114, -107, 105, 156, 76, 73, -67, 26, 86, 25, 94, 79, 84, -40, -34, -198, 33, -154, -10, 207, 73, -50, -63, 72, -16, 174, 102, 114, -124, -28, 33, -178, -57, -149, 58, 152, -283, -26, -117, -73, 134, -159, 53, 12, 288, 5, 1, 98, 75, -241, 153, -48, -154, -105, -60, -127, -204, -121, -23, -74, -83, -267, -21, -2, -123, 18, -92, -110, -173, 166, 144, 215, -115, -99, -56, -192, 29, 86, -42, 41, 2, 200, -35, -15, 87, 6, 162, -114, -88, 100, -159, 208, 251, -37, -25, -123, 233]
4983B33J8l91N7J64r8q7j2J27j14m6L14l32K12n2L4J74l57J58k35N40j90j77J66
5006A06q3m8J34l7jj87K00j72O2o5L17l01O4j25J50J15l23L91j92M4K2j06p1L11
5030B05l26R1pJ89j48l8J85l21M41K0m90M82k68Oq7r1M31n89K39J16K0J51m6K5
5054A90k30pJ77j12o0mJ36j33p4Q7J26q4K71o6K5k44LJ90k86j6k7K03k21R5R5
5079C4j77k2L35j40o1K00m03K66K78m24lN75n64L4q1J0J53L9p4q9N5j69K22j20
5103a26J94j35k30K78K01k83j3J11j49L07j35q1jj5L8Pk1Q6r5L8mR0jL27l84j05
5129a01R8j20j57L84j28j60K99j06J74k38q2Q8J68k12NO4k38K46N8P5k63L57k24
5152a3Mk40L37r4J30k31J83l18O2L32j15M9o9M2mk45L33J99m28J78j58N7L2P5
$$ y = [233, 251, -140, -83, 81, -17, -104, -116, 11, -103, -149, 165, -167, 45, -7, 27, 201, -156, 2, -233, 307, 117, -60, 106, 23, -25, 109, 72, 71, -116, 84, -88, -26, -91, 226, -75, -11, -136, 14, 129, -194, 197, 5, 49, 71, -35, -106, 205, -121, -30, -37, 152, 4, -34, 151, -170, 271, 291, -199, 283, 15, 21, -66, -157, 274, -315, -76, 40, 60, 211, 165, 190, -40, -47, 130, 18, -42, -46, 90, -43, -117, -30, 96, 12, 283, 217, 242, -2, 1, 191, -95, -111, -138, 65, -156, -61, 34, -143, -165, 170, 30, -31, 169, -234, 32, 310, -114, -117, 458, -106, -72, -153, -143, 10, 49, -25, -114, -59, -228, -6, -126, 68, -67, -297, -19, 182, -101, -114, -3, -152, 155, 20, -61, -62, -77, -39, -32, -53, 33, -62, -24, -28, 62, 61, 388, 4, -101, -3, -123, -280, 104, -24, -184, 115, 9, 183, -55, -137, -49, 119, -93, -88, -24, -262, -16, 42, 117, -146, 211, -13, -9, -249, 88, -6, 124, -107, 76, -242, -180, 152, 37, 86, 17, 59, 55, -190, 143, 342, -86, 92, -66, -9, 23, 98]
5176I8j96M4j26L87k34K8J25j83m8M2j31J3J13J51K20m76Q1J73k58j26L06l7j9
5199e3k43J13J95k12J75J56r8Q9n3k17J89J98j09j75K1L9k00K84j11r8J86m6L
5222C3j80J14L1k1N1k22n8L27k0m05L93O8k14J7J21L8q4k24K87N6l15L05k17J32
5246A3l3L3j70J43J23j34J5R5j59k4J08j69K64j57p0J42l54L48j3m4J81j35N4
5269E7j28LJ20j21K09j11j37J35O6k47L05p7Qq5k1L1J19M0l07l8L98j16k06j48
5293b51J27K70k02q6M7K64l17r8M34LM2j63j44K63k15Q2l6k2q0K96l09K9J9K0
5317b7N2J44J3k34J66k43K73p2m14O62m29K57n0q4K83n29K58j44k69N23k09JQ3
5340A1J01k79J63K65k68L7j27N8J93o7j31j81K96j58Q4K21k46j52P7J65K00j69
$$ y = [98, -98, -54, -180, 207, -27, 1, 126, -57, -105, -63, -194, -181, -68, 83, 303, -173, -92, 81, -177, -303, 3, -34, -53, -296, -183, 12, -200, -25, 131, 33, 122, 69, -148, 41, 239, 130, -45, -24, 15, -185, 99, -12, -110, 76, 30, 33, -147, -33, -2, -23, 28, -194, -252, 75, 55, -350, 43, 111, -103, -86, 35, 73, -11, -235, 52, 108, -207, 98, -119, 13, -20, 13, -157, -14, 109, -25, -10, 85, -74, -98, 10, -159, 105, -52, -122, 20, -334, 14, 1, -43, 138, 3, 57, -71, -68, 52, -69, 140, 29, -108, 27, 93, -154, 151, 74, 82, -3, -24, 7, 126, 166, -141, -179, 219, 103, -103, -251, -124, 146, -56, -142, -95, 169, -148, -246, 188, 191, 233, 70, -74, 189, -26, 56, 20, -2, -82, 214, -95, -66, -47, -27, 25, 169, 182, -52, 114, -129, 144, 72, -342, 320, -109, 148, 98, 14, 297, -232, 26, -118, -387, 136, -73, -72, 11, 112, -167, -4, 261, -7, 30, -97, -39, 154, 87, -44, -225, 71, -87, -3, 218, -28, -180, -103, 62, 262, 93]
5362I3k13K30O1l97K12J35j08j07L0J73j16Pk12J63q9J63O1o4k13O6K32o3Q3r5
5386C2l7K17j97KO0k53N9K28J37k21KM6K07k19q4R2j67M6nJ65j73K93j27r1J7
5411B9K6l0q2J92l18K73j52j85J82Q4j65R3m8K60rj88o8r6L20q6J08l89K97j55
5435a07o1K44j58K05j56N4J98j87q5k73K73K84j81n0k73L27l6M5R3j22K0JJ3n1
5459A7k62K92P8m7j91J93k48K08l04J06J93l2l67K62J36%L03k60KJ13k90l8J8
5482a18n0K45o4J04k74J95K02n39L08r8J53k9j41J11j65K31Q6j6q5j77K07j19
5504c3M4R9k27J51o1P6j42K16K5l77L2J81M2j73m2O6Q9KJ30mo2K0k44K51M2m13
5530c12K00J39j42R0K00k36J14J20k86O5j27J79r7l3K2K01p5K1j14J68rJ07j70
$$ y = [93, -120, 110, 171, -226, -14, 121, 13, -94, -64, 109, -7, 0, -212, -49, -138, 25, 86, 22, -191, -125, 107, 44, 127, 32, -5, 212, 15, 17, 77, -176, -117, 111, 248, 27, 29, 75, 282, 63, -21, 71, -96, -50, -55, 110, -63, 230, 103, 12, 29, 55, 25, -57, 135, -183, 90, -62, -247, -65, 19, -146, -53, -101, 159, 150, -38, -106, -202, 118, 32, 140, -249, 48, -107, -168, 76, -82, 123, -33, 21, 219, 32, -53, -326, -53, 231, 50, 0, -273, 54, 18, 63, 156, 34, 54, 55, 68, 17, -245, 47, 125, 78, -113, 80, -168, 40, -264, -158, 35, 3, -364, -102, 34, 34, 337, 77, 79, 192, -98, -136, -118, -168, 77, 13, 117, -157, 38, 240, -299, 9, -89, 64, 35, -106, 5, -160, 71, 157, 141, 56, -121, 86, -33, 11, 110, -117, 34, -27, 49, -93, 123, 148, -229, -197, -16, 26, -147, -189, -123, -34, -32, 98, 94, 32, 52, -192, 59, 101, -312, -112, 27, -115, -25, 175, -61, 53, 173, -113, -48, -175, 4, -93, -126, -104, 97, 22, 43, -71, 97, 88, 195, 25]
5553B5K02k45R6j57j4O4o3K48rk05J36j30J14K3O2j1J28q5j24P1r9k87L27P9k64
5578a18J67J76m54J38m1K14o8j13M7P2k91J52J0N6J61j11j32K30k6q9j20K07l9
5601B8J41k5qk67J19rj48m7L28j54j21L62k14%k13M83l48J69j34R3j83K48P9j44
5625C5J11j4K1p2L8m9j64L2p6K39k84J39j64O18l57jJ28l57K35j00m7M5J89k82
5649a37J06j65J33N9Q7n3N1k03K6J13j21M4L63k98j2mj16L39n23K44J70j39j36
5672a72K07j16K59p1j19J12l76M03j22J55m53J87o4O5j32L20q2J27j74J92O8l17
5694a03J66j32Q3J58k9l75Q3J11J94q5j67j33J87l03J42J94J37j34q6Q6oM9J52
5717A89j50J30k62K93k08j6K03j30o6O5N1P6j53k20L47pP7j91j08L12l31J66K7
$$ y = [25, 227, -18, 78, -79, -93, -29, -92, 156, 147, -58, 78, -52, 62, 85, 147, 136, 264, 179, 55, 126, 27, -260, 67, 146, -118, 49, 225, -229, -91, -132, 82, 14, -99, -52, 20, -271, -119, -109, -53, 108, -3, -135, 95, 69, -20, -140, 67, 28, 169, 144, 136, -131, -12, -21, -169, -216, 112, -42, -163, 199, -15, -15, -228, 255, -93, 76, -58, 35, -148, 100, 179, 35, 146, 132, 153, 81, 119, 70, -94, -62, -138, 101, -183, -44, -208, 410, 53, 52, 180, -177, 58, -42, -89, -44, 145, -137, -31, -196, -63, -4, 83, 30, 81, -122, -96, 17, -104, -60, 303, 5, -7, -11, -127, 212, -311, -67, 103, -36, -172, 35, -81, 178, 107, -12, 100, -276, 127, 5, 160, -293, -106, -170, -105, -237, 83, 1, 128, -46, 146, 214, -103, 63, -69, 14, 172, 143, -232, -149, -38, 156, 71, -96, -229, -42, -345, -203, -9, 128, -6, -92, -6, -12, 37, 189, 39, 169, -93, 200, -8, -24, 179, 49, -17, 48, 99, 175, 22, -198, 149, 142, 219, 28, -80, 232, -99, 67, 94]
5740I4l26K35j24r0L08k85j4R3RK47r5J8rl23M49k56p4L32l49J64j00o5M1J45
5764B5k30J09J94k45K78k0k3j96q9J88j79L0K72l36K68j92K18J5P7k00nmL6J8
5788Ik8J2K49k69J40j06QJ30k05L22O3m76J41k77K65j09K79l12M2J35K5%kJ0n2
5813fo7J65J2m8mj1P2Kr4k69L68j95k46K01K2J07q8R6j56J29k46K80J90j99J16
5838A31j19P6j13k9J09K62k36L0J6k18J88k97R7J32j30J26J2Nj21J67r8k6J80
5861A44K36l64K5J8j63M2O6J57q5J27m16J46J71j54K64l90L24k66J43l7K4n5j11
5884a54J58j40J68J46j03p3k2MJ17K2Lk02J31r7L30k58j10o8K44J17m31L11j06
5907a3j2J60l8j92K58j14o0j69L27Qk13K18k13K8N8p9n2j89K23k6j98K73J50m13
$$ y = [94, -232, 3, -121, -211, 97, -188, -202, -109, -100, 147, 52, 70, 61, -262, 187, -69, -143, 189, -160, 4, -96, -161, -120, 25, -205, -96, 98, -147, 131, 111, 88, -108, -197, -9, -188, -158, 114, -222, 46, -146, 72, 87, 164, -36, -41, -45, -9, 9, -19, -7, 242, -27, 113, 7, 15, 145, -60, 262, 325, -151, -10, -287, -22, -131, 148, -164, -122, 13, 38, 38, 36, 46, -6, -73, 92, 104, 56, 52, 41, 113, 115, 21, -248, 120, -75, -321, -120, -98, 9, -79, 17, -139, -10, -256, 24, 214, 15, 131, 12, 88, -25, -54, 55, 317, 81, 111, 127, -91, 97, -200, -103, 29, -101, 25, 37, 42, -79, 88, -10, -36, 144, 380, 16, 41, 59, -104, -62, 4, 161, 76, 203, -213, -67, 104, -50, 214, -176, 148, -118, 25, -12, 12, -43, -154, 4, -136, 32, 178, 75, 2, -20, -16, 101, 123, 126, -76, 55, -42, 288, 30, -80, -148, 96, 213, -218, 93, -13, -25, 135, 97, -95, 163, 49, -11, -180, 147, 155, -58, 160, -53, -25, 33, -46, -98, -287, -64, -90, -288, -15, 135, -278]
5931b78J50J90p6J8J62M2j73K41k55n6J43J67l66n4K40l8N3M5k32K65l63M5J32
5954Bk68J72J85m5L2k14J89k9J46m3K1k89l4L01k49J43O1P7k21J09O3Lj10N4O2
5979A18k8k00K21k26o9L30j09K06l63m8J23N5J55j51l02J88J65j57L00j59J18
6000A67j45n4K17J9n27K90J52k99N0J37J9l16K79j26K99L2j91j60L29k06o2L52
6022B56r7m4j47k8j3l53N52l2j67M3Q4O9j12j06J81j05j33R2L9q4L03p1qj43M6
6047B2N4rOPK0q8p2N6J2j93m8J17K75m98J69J3L2N26l26k45R9Q7P0J16j67r5J
6074e9J01k43M4K49j33PK01j52M0Ml0k33K33r5n9R7o4K64r1M8j81k6K66k52O0
6099do4K35k47M3j17L08K6k10N2k6O9k73R3L39k09P6lQ1m15L54j54N8J31j06r9
$$ y = [-278, -128, 62, -14, 4, 166, 208, 35, 276, 21, -35, 108, 275, -91, -145, 95, 57, 110, 155, -77, 188, -175, -130, 2, -266, -94, 91, 46, 78, -136, 53, 24, 170, 127, 148, -141, -175, 126, -123, 20, 81, 158, -63, 46, 109, 112, 2, 56, 118, 90, -110, 111, -115, -184, 146, 37, 243, -120, -168, -45, 10, 165, 14, -288, -100, 65, -92, 208, 49, 167, 22, -32, 185, 204, -323, -33, 119, -180, -130, 7, 26, -290, -11, -137, 162, 194, 3, -157, 172, -34, -96, 256, 159, 115, -32, -60, -73, -426, 126, 94, -73, -30, 54, 123, 11, -95, 86, -19, -152, -60, -21, -105, 198, 127, 119, -24, 22, 76, 67, 73, 80, 100, 12, -60, -4, 8, -185, -233, -116, 159, -339, -170, -157, -125, 401, 75, -170, -71, 16, 86, 202, 35, -60, -59, 42, -201, -157, 92, -41, -34, 167, 15, 55, 59, 29, -204, 29, -66, -125, -28, -92, 172, 81, 129, -52, -78, 188, -64, -4, -68, 167, -80, -37, -154, 154, 180, -30, 22, -4, 65, -208, -115, 224, 15, 91, 88, 169, -246, 108, -46, 12, 143, 37, -62]
6124f2mJ61j89J44p1m6J10J9j83J15k51L08J21o5J79l11K72k53O4r6L40j97j32
6147b7O0k35K93j03j69L31Oj68P5m8mj13L96l80J21q2pJ61j45O4jj17j2J78j54
6172h0J1K17K9k87P6j42O3J78J19l2k65J39o9kN9j05q3K59l19L76N4j81m9KQ3
6197E1M7k33J09J15j88k6J82mj95K20r1l22L69o6J78j56K63l02Lj18L18k13K32
$$ y = [-62, -66, 95, -94, 50, -21, -67, 43, 62, -121, -6, -257, 51, 172, 107, 286, -25, 247, -6, 58, -38, 302, 105, -27, 33, -202, 91, -12, -181, 150, 156, -12, 63, 15, 11, -102, 294, -86, 35, -47, -54, 107, -38, 26, 25, -92, -104, 74, -80, -69, 148, 177, -110, -34, -176, -113, 65, 184, 152, -113, 26, -43, -45, 14, -91, -174, 85, -234, 142, 196, 15, -34, -32, 51, 98, -135, -26, 89, -99, -125, 57, 53, -142, 78, -13, -335, 34, -32, 146, -10, 253, -49, -46, -164, 154, -59, 173]
$$ [...]
8191h4
##END NTUPLES=NMR FID
##END=
