##TITLE=1H_LR-0169-C1-B-IPS
 D2O
 8 sc, 
 21.2.2023
##JCAMPDX= 6.0         $$ Bruker NMR JCAMP-DX V2.0
##DATA TYPE= NMR FID
##DATA CLASS= NTUPLES
##ORIGIN= UXNMR, Bruker Analytische Messtechnik GmbH
##OWNER= root
$$ XWIN-NMR		Version 3.5
$$ Wed Feb 22 15:39:57 2023 Russian Standard Time (UT+4h)  she@DPX200
##.OBSERVE FREQUENCY= 200.13135
##.OBSERVE NUCLEUS= ^1H
##.DELAY= (6, 6)
##.ACQUISITION MODE= SIMULTANEOUS
##.ACQUISITION SCHEME= undefined
##.AVERAGES= 8
##.DIGITISER RES= 18
##SPECTROMETER/DATA SYSTEM= spect
##.PULSE SEQUENCE= zg30
##.SOLVENT NAME= DMSO
##.SHIFT REFERENCE= (INTERNAL, DMSO, 0, 15.7039)
##AUDIT TRAIL= $$ (NUMBER, WHEN, WHO, WHERE, WHAT)
$$ ##TITLE= Audit trail, XWIN-NMR		Version 3.5
$$ ##JCAMPDX= 5.01
$$ ##ORIGIN= Bruker BioSpin GmbH
$$ ##OWNER= she
$$ F:/spectra/data/she/nmr/H-F/1/audita.txt
$$ ##AUDIT TRAIL=  $$ (NUMBER, WHEN, WHO, WHERE, WHAT)
(   1,<2023-02-22 15:38:31.09 +0400>,<she>,<DPX200>,
      <created by zg, POWCHK disabled, PULCHK disabled
       configuration hash MD5:
       00 E9 B6 7A A2 85 ED C7 34 08 36 98 17 FE 4E 26
       data hash MD5: 16K
       AD C4 00 74 AE 41 02 B9 91 4C 52 93 E0 19 EF CD>)
$$ ##END=
$$ 
$$ hash MD5
$$ EF BA 85 B6 98 13 58 02 0E 32 22 5D 94 DA 2F 93
##$RELAX= 
##$RELAX= 
##$RELAX= 
##$RELAX= 
##$RELAX= 
##$RELAX= 
$$ Bruker specific parameters
$$ --------------------------
##$DU= <F:/spectra>
##$EXPNO= 1
##$NAME= <H-F>
##$PROCNO= 1
##$TYPE= <nmr>
##$USER= <she>
##$AMP= (0..31)
100 100 100 100 100 100 100 100 100 100 100 100 100 100 100 100 100 100 
100 100 100 100 100 100 100 100 100 100 100 100 100 100 
##$AQSEQ= 0
##$AQ_mod= 1
##$AUNM= <au_zg>
##$AUTOPOS= <>
##$BF1= 200.13
##$BF2= 200.13
##$BF3= 200.13
##$BF4= 200.13
##$BF5= 200.13
##$BF6= 200.13
##$BF7= 200.13
##$BF8= 200.13
##$BYTORDA= 1
##$CFDGTYP= 0
##$CFRGTYP= 5
##$CHEMSTR= <none>
##$CNST= (0..31)
1 1 145 1 1 1 1 1 1 1 1 1 1 1 1 1 1 1 1 1 1 1 1 1 1 1 1 1 1 1 1 1 
##$CPDPRG= <>
##$CPDPRG1= <>
##$CPDPRG2= <>
##$CPDPRG3= <>
##$CPDPRG4= <mlev>
##$CPDPRG5= <mlev>
##$CPDPRG6= <mlev>
##$CPDPRG7= <mlev>
##$CPDPRG8= <mlev>
##$CPDPRGB= <>
##$CPDPRGT= <>
##$D= (0..31)
0 1.2 0 0 0 0 0 0 0 0.06 0 0.03 0 0 0 0 0.0002 0 0 0 0 0 0 0 0 0 0 0 0 
0 0 0 
##$DATE= 1677065910
##$DBL= (0..7)
120 120 120 120 120 120 120 120 
##$DBP= (0..7)
150 150 150 150 150 150 150 150 
##$DBP07= 0
##$DBPNAM0= <>
##$DBPNAM1= <>
##$DBPNAM2= <>
##$DBPNAM3= <>
##$DBPNAM4= <>
##$DBPNAM5= <>
##$DBPNAM6= <>
##$DBPNAM7= <>
##$DBPOAL= (0..7)
0.5 0.5 0.5 0.5 0.5 0.5 0.5 0.5 
##$DBPOFFS= (0..7)
0 0 0 0 0 0 0 0 
##$DE= 6
##$DECBNUC= <off>
##$DECIM= 32
##$DECNUC= <off>
##$DECSTAT= 4
##$DIGMOD= 1
##$DIGTYP= 9
##$DL= (0..7)
0 120 120 120 120 120 120 120 
##$DP= (0..7)
150 150 150 150 150 150 150 150 
##$DP07= 0
##$DPNAME0= <>
##$DPNAME1= <>
##$DPNAME2= <>
##$DPNAME3= <>
##$DPNAME4= <>
##$DPNAME5= <>
##$DPNAME6= <>
##$DPNAME7= <>
##$DPOAL= (0..7)
0.5 0.5 0.5 0.5 0.5 0.5 0.5 0.5 
##$DPOFFS= (0..7)
0 0 0 0 0 0 0 0 
##$DQDMODE= 0
##$DR= 18
##$DS= 0
##$DSLIST= <SSSSSSSSSSSSSSS>
$$ [...]
##$SUBNAM2= <"">
##$SUBNAM3= <"">
##$SUBNAM4= <"">
##$SUBNAM5= <"">
##$SUBNAM6= <"">
##$SUBNAM7= <"">
##$SUBNAM8= <"">
##$SUBNAM9= <"">
##$SW= 18.05172834244
##$SWIBOX= (0..15)
0 0 2 0 0 0 0 0 0 0 0 0 0 0 0 0 
##$SW_h= 3612.71676300578
##$TD= 16384
##$TD0= 1
##$TE= 0
##$TE2= 300
##$TE3= 300
##$TEG= 300
##$TL= (0..7)
0 120 120 120 120 120 120 120 
##$TP= (0..7)
150 150 150 150 150 150 150 150 
##$TP07= 0
##$TPNAME0= <>
##$TPNAME1= <>
##$TPNAME2= <>
##$TPNAME3= <>
##$TPNAME4= <>
##$TPNAME5= <>
##$TPNAME6= <>
##$TPNAME7= <>
##$TPOAL= (0..7)
0.5 0.5 0.5 0.5 0.5 0.5 0.5 0.5 
##$TPOFFS= (0..7)
0 0 0 0 0 0 0 0 
##$TUNHIN= 0
##$TUNHOUT= 0
##$TUNXOUT= 0
##$USERA1= <user>
##$USERA2= <user>
##$USERA3= <user>
##$USERA4= <user>
##$USERA5= <user>
##$V9= 5
##$VALIST= <valist>
##$VCLIST= <CCCCCCCCCCCCCCC>
##$VD= 0
##$VDLIST= <DDDDDDDDDDDDDDD>
##$VPLIST= <PPPPPPPPPPPPPPP>
##$VTLIST= <TTTTTTTTTTTTTTT>
##$WBST= 1024
##$WBSW= 4
##$XGAIN= (0..3)
0 0 0 0 
##$XL= 0
##$YL= 0
##$YMAX_a= 317543
##$YMIN_a= -315052
##$ZGOPTNS= <>
##$ZL1= 120
##$ZL2= 120
##$ZL3= 120
##$ZL4= 120
##$ABSF1= 10
##$ABSF2= 0
##$ABSG= 5
##$ABSL= 3
##$ALPHA= 0
##$AQORDER= 0
##$ASSFAC= 0
##$ASSFACI= 0
##$ASSFACX= 0
##$ASSWID= 0
##$AUNMP= <proc_1d>
##$AZFE= 0.1
##$AZFW= 0.1
##$BCFW= 1
##$BC_mod= 2
##$BYTORDP= 1
##$COROFFS= 0
##$CY= 11.3945322036743
##$DATMOD= 1
##$DC= 2
##$DFILT= <>
##$DTYPP= 0
##$F1P= 2.36226072786647
##$F2P= -0.459571619588291
##$FCOR= 0.5
##$FTSIZE= 0
##$FT_mod= 4
##$GAMMA= 1
##$GB= 0.15
##$INTBC= 1
##$INTSCL= 1
##$ISEN= 128
##$LB= 0.24
##$LEV0= 0
##$LPBIN= 0
##$MAXI= 10000
##$MC2= 0
##$MEAN= 0
##$ME_mod= 0
##$MI= 1.114404
##$NCOEF= 0
##$NC_proc= 0
##$NLEV= 6
##$NOISF1= 3.799351
##$NOISF2= 2.8
##$NSP= 1
##$NTH_PI= 0
##$NZP= 0
##$OFFSET= 15.70392
##$PC= 1
##$PHC0= -19270.77
##$PHC1= 7.400741
##$PH_mod= 1
##$PKNL= yes
##$PPARMOD= 0
##$PSCAL= 0
##$PSIGN= 0
##$REVERSE= no
##$SF= 200.130013532006
##$SI= 16384
##$SIGF1= 3
##$SIGF2= 2
##$SINO= 400
##$SIOLD= 16384
##$SREGLST= <1H.CDCl3>
##$SSB= 0
##$STSI= 0
##$STSR= 0
##$SW_p= 3612.71676300578
##$SYMM= 0
##$S_DEV= 0
##$TDeff= 0
##$TDoff= 0
##$TI= <>
##$TILT= no
##$TM1= 0
##$TM2= 0
##$TOPLEV= 0
##$USERP1= <user>
##$USERP2= <user>
##$USERP3= <user>
##$USERP4= <user>
##$USERP5= <user>
##$WDW= 1
##$XDIM= 8192
##$YMAX_p= 0
##$YMIN_p= 0
$$ End of Bruker specific parameters
$$ ---------------------------------
##NTUPLES= NMR FID
##VAR_NAME=  TIME,          FID/REAL,        FID/IMAG
##SYMBOL=    X,             R,               I
##VAR_TYPE=  INDEPENDENT,   DEPENDENT,       DEPENDENT
##VAR_FORM=  AFFN,          ASDF,            ASDF
##VAR_DIM=   8192,          8192,            8192
##UNITS=     SECONDS,       ARBITRARY UNITS, ARBITRARY UNITS
##FACTOR=    0.0002768,     1,               1
##FIRST=     0,             0,               0
##LAST=      2.2672688,     0,               0
##MIN=       0,             -315052,         0
##MAX=       2.2672688,     317543,          0
$$ Real data points
##PAGE= N=1
##DATA TABLE= (X++(R..R)), XYDATA
0 0 0 0 0 0 0 0 0 0 0 0 0 -8 8 -8 8 -14 16 -16 24 -32 32 -40 48 -56 71 -80 88 -104 120 -144 160 -184 208
33 208 -232 264 -301 336 -376 421 -470 523 -581 645 -712 789 -871 961 -1061 1167 -1285 1420
51 1420 -1563 1723 -1901 2099 -2326 2581 -2877 3222 -3625 4112 -4710 5466 -6455 7811 -9799
66 -9799 13003 -19031 34441 -162660 -274638 7662 149867 306499 306152 147207 -91595
77 -91595 -236424 -315052 -231925 -25755 176971 273746 284541 141254 -83451 -245082 -282235
88 -282235 -220117 -28667 182625 276713 243162 126760 -72171 -241222 -274192 -186181 -25476
99 -25476 168358 271917 229687 100137 -69954 -230331 -266322 -163041 -5938 153383 256012
110 256012 218427 79180 -70681 -202861 -257182 -161985 9253 148472 232665 219306 78469
121 78469 -91770 -198106 -230456 -156664 14211 161108 214526 191917 79703 -91434 -201740
132 -201740 -206301 -137566 1394 156984 218501 171235 65101 -79415 -197991 -204970 -116754
143 -116754 9630 143043 213432 165805 48623 -77999 -183402 -203206 -110806 23458 137676
154 137676 200319 163760 39178 -88750 -171170 -187285 -107116 30849 138036 181585 152797
165 152797 41758 -92689 -168679 -170733 -102320 26739 142921 177727 136612 37885 -89975
176 -89975 -170735 -160589 -86011 25952 136678 175435 124519 27493 -82976 -164256 -158896 -74628
188 -74628 32798 128018 169967 121876 16420 -85615 -152908 -153035 -71725 40409 124976 157928
200 157928 118226 14190 -91004 -147306 -142151 -69309 43442 128358 149011 107502 12915
211 12915 -92439 -146386 -130682 -61009 41126 126815 145476 97289 9279 -88162 -144628 -126155
223 -126155 -51794 42670 122310 142683 90443 962 -86140 -138251 -122556 -45158 47401 116647
235 116647 136119 87861 -4315 -88289 -131047 -116375 -42977 51567 116065 127435 82154 -5714
247 -5714 -90248 -127384 -107250 -39154 51089 115995 122443 74365 -7122 -88351 -126218 -101671
259 -101671 -32430 50943 112582 119271 68462 -11830 -86190 -121267 -97469 -27776 52956 109264
271 109264 114271 63833 -15219 -85504 -117098 -92956 -23556 54621 105934 109312 60328 -18396
283 -18396 -85921 -112006 -87250 -20879 56141 104566 103351 55236 -19507 -85334 -109137 -81859
295 -81859 -17338 56044 102843 99583 50132 -21500 -83845 -106292 -77240 -12801 56325 99392
307 99392 95562 45987 -24319 -82338 -101937 -73520 -10100 57573 97298 91226 42213 -26474
319 -26474 -82060 -98426 -68421 -6676 57484 94464 86957 38473 -27927 -80591 -95032 -64849
331 -64849 -4117 58317 92739 83075 34423 -29863 -79584 -91737 -60690 -1260 57971 89669
343 89669 79433 31809 -30765 -78251 -88752 -57611 812 58703 87954 75698 28255 -32410
355 -32410 -77238 -85023 -53452 2566 57980 85730 72297 25515 -32570 -76170 -83244 -50118
367 -50118 5710 57926 83271 69185 21967 -34591 -74215 -79463 -47044 7427 57558 80780
379 80780 66376 19971 -35542 -73360 -76749 -44447 9507 58403 78489 62207 17148 -36282
391 -36282 -72118 -73377 -40974 10625 57763 76994 59507 14798 -36987 -71547 -71281 -37409 12716
404 12716 57176 74914 56359 11810 -37015 -69197 -68940 -35230 14452 56332 72519 54437
416 54437 9845 -38520 -67976 -66093 -32840 16255 56538 69886 51097 8010 -38919 -66480
428 -66480 -62999 -30647 16928 56503 68208 48065 6104 -39350 -66104 -60501 -27043 18222
440 18222 55500 66487 45333 3699 -39202 -64220 -58496 -24923 19557 54784 64520 43138
452 43138 1478 -39866 -62538 -56104 -22489 21312 54028 61736 40819 -47 -40285 -60819
464 -60819 -53394 -20993 22051 54061 59896 38051 -1608 -40832 -60002 -50474 -18223 22753 53417
477 53417 58049 35144 -3194 -40303 -58867 -48744 -15656 23747 52271 56515 33274 -5444
489 -5444 -40712 -56906 -46557 -13910 24997 51521 54044 31223 -6641 -41006 -55664 -44312
501 -44312 -12088 25924 51244 52191 28781 -8093 -41010 -54155 -41864 -10197 26336 50245
513 50245 50232 26884 -9118 -41027 -53000 -39672 -8512 26783 49956 48742 24365 -10399 -40404
526 -40404 -51984 -38094 -6173 27470 48227 47125 23075 -12120 -40517 -49809 -36321 -5297
538 -5297 28410 47867 44697 21131 -12677 -40530 -48602 -34079 -3935 28373 47279 43268 19177
551 19177 -13464 -40120 -47668 -32264 -1932 28674 46047 41784 17432 -14851 -39736 -45895 -30500
564 -30500 -823 29163 45257 39834 15760 -15471 -39302 -44738 -28906 772 29581 44161
576 44161 38189 14188 -16692 -39225 -42967 -26951 1736 29897 43554 36271 12569 -17191 -38942
589 -38942 -41748 -24918 2967 29680 42646 34800 10701 -17679 -38060 -40736 -23515 4544 29725
602 29725 41209 33574 9499 -18796 -37500 -39010 -22259 5515 30240 40111 31642 8363 -19204
615 -19204 -37264 -37498 -20490 6198 30086 39307 29991 7030 -19440 -36813 -36213 -18828 6930
628 6930 29798 38562 28631 5556 -19687 -36073 -35143 -17335 8107 29429 37278 27384 4329
641 4329 -20225 -35100 -33776 -16110 9060 29414 35934 25942 3385 -20737 -34437 -32098 -15068
654 -15068 9486 29401 34928 24215 2394 -20813 -34038 -30814 -13422 10071 29049 34033 22719
667 22719 1177 -20919 -33345 -29665 -11949 10779 28538 33051 21559 15 -21015 -32338
679 -32338 -28504 -10842 11665 28326 31723 20291 -870 -21398 -31545 -27041 -9774 12245 28086
692 28086 30497 18905 -1674 -21559 -30900 -25460 -8651 12421 27828 29666 17479 -2466 -21409
705 -21409 -30294 -24460 -7385 12776 27151 28724 16364 -3294 -21115 -29397 -23603 -6341 13327
718 13327 26527 27600 15476 -4181 -21365 -28251 -22291 -5790 13797 26442 26348 14306 -4511
731 -4511 -21341 -27809 -21106 -4659 13926 25902 25461 13152 -5169 -21250 -26971 -19911 -3784
744 -3784 13984 25413 24604 12106 -5743 -20921 -26313 -19011 -2864 14332 24795 23650 11175
757 11175 -6407 -20609 -25454 -18188 -2074 14570 24202 22722 10484 -6952 -20669 -24418 -17032
770 -17032 -1661 14814 23917 21509 9386 -7055 -20467 -23931 -15872 -849 14643 23327 20792
783 20792 8444 -7605 -20081 -23085 -15111 -54 14826 22706 19974 7739 -7992 -19867 -22311
796 -22311 -14289 432 14868 22207 19064 6963 -8266 -19532 -21603 -13398 1028 14805 21628
809 21628 18216 6233 -8632 -19254 -20731 -12611 1416 14865 21156 17318 5558 -8755 -18998
822 -18998 -20096 -11739 1914 14723 20512 16574 4838 -8999 -18603 -19381 -11029 2377 14653 19998
836 19998 15802 4250 -9170 -18262 -18692 -10326 2889 14675 19444 15077 3641 -9278 -17963 -18020
850 -18020 -9552 3246 14477 18937 14412 3050 -9590 -17575 -17334 -8910 3621 14399 18312 13619
864 13619 2574 -9652 -17276 -16720 -8335 3941 14337 17783 12993 2136 -9741 -16940 -16059 -7632
878 -7632 4173 14089 17356 12339 1526 -9775 -16534 -15512 -7090 4574 14012 16881 11610 1053
892 1053 -9840 -16212 -14933 -6431 4847 13719 16209 11153 733 -9927 -15768 -14286 -6029 5023
906 5023 13661 15718 10500 386 -9958 -15489 -13621 -5588 5143 13503 15283 9839 48 -9837
920 -9837 -15148 -13103 -5026 5267 13138 14876 9341 -373 -9784 -14771 -12659 -4546 5455 12888 14334
935 14334 9014 -745 -9792 -14274 -12171 -4183 5635 12627 13761 8517 -889 -9803 -13873 -11559 -3902
950 -3902 5730 12541 13208 7895 -1096 -9741 -13605 -10987 -3413 5772 12340 12857 7322 -1376 -9507 -13287
966 -13287 -10621 -2904 5844 11968 12569 6944 -1767 -9429 -12777 -10148 -2562 6032 11676 11938 6571
981 6571 -1990 -9422 -12355 -9655 -2311 6158 11516 11432 6194 -2045 -9434 -11993 -9086 -2075 6032 11344
997 11344 11041 5622 -2180 -9226 -11826 -8620 -1619 6038 11030 10726 5238 -2457 -8982 -11418 -8337
1012 -8337 -1232 6103 10664 10372 4996 -2721 -8854 -10927 -7947 -1053 6241 10419 9740 4668 -2763
1027 -2763 -8883 -10610 -7525 -913 6189 10238 9333 4311 -2911 -8808 -10286 -6972 -692 6092 10070
1042 10070 9050 3836 -3011 -8495 -10043 -6682 -300 6071 9649 8760 3518 -3169 -8296 -9690 -6375
1057 -6375 -59 6110 9345 8355 3330 -3373 -8255 -9170 -6046 93 6166 9191 7877 3036 -3359
1072 -3359 -8082 -8902 -5634 251 6133 8950 7446 2699 -3409 -7999 -8668 -5216 504 5966 8812
1087 8812 7249 2264 -3536 -7685 -8390 -4950 791 5981 8479 6953 2103 -3620 -7576 -8067 -4728
1102 -4728 907 5974 8149 6691 1937 -3711 -7437 -7692 -4428 952 5962 7989 6260 1711 -3741
1117 -3741 -7422 -7401 -4122 1082 5834 7793 5965 1446 -3674 -7134 -7248 -3815 1274 5686 7588 5793
1133 5793 1219 -3780 -6975 -6976 -3601 1416 5632 7213 5527 1150 -3819 -6756 -6715 -3420 1474 5575
1149 5575 7034 5194 1005 -3779 -6652 -6380 -3222 1482 5566 6932 4925 794 -3782 -6531 -6182
1164 -6182 -2897 1639 5418 6646 4721 615 -3758 -6352 -6007 -2752 1762 5313 6457 4548 490
1179 490 -3803 -6139 -5764 -2657 1873 5283 6229 4371 312 -3794 -6056 -5469 -2425 1839 5195 6006
1195 6006 4115 315 -3654 -5972 -5274 -2233 1832 5100 5898 3949 119 -3709 -5822 -5139 -2114 1930
1211 1930 4960 5741 3696 14 -3647 -5601 -4959 -2012 1951 4832 5453 3671 -50 -3633 -5426 -4812
1227 -4812 -1856 1946 4851 5375 3538 -69 -3603 -5355 -4596 -1752 1993 4726 5235 3291 -184 -3563
1243 -3563 -5210 -4440 -1613 1951 4659 5072 3146 -225 -3508 -5055 -4289 -1522 2082 4528 4900 3097
1259 3097 -295 -3436 -4964 -4187 -1406 2017 4445 4784 2966 -336 -3427 -4837 -4000 -1362 2030 4419
1275 4419 4668 2810 -359 -3350 -4771 -3903 -1250 1993 4305 4542 2732 -395 -3290 -4660 -3790 -1228
1291 -1228 1968 4168 4471 2670 -402 -3284 -4506 -3780 -1203 1987 4113 4335 2549 -482 -3280 -4449
1307 -4449 -3654 -1188 1965 4100 4283 2518 -471 -3193 -4377 -3536 -1081 1949 4018 4205 2475 -513
1323 -513 -3194 -4291 -3460 -1077 1947 3924 4036 2397 -516 -3106 -4298 -3436 -982 1959 3906 4055
1339 4055 2359 -512 -3111 -4158 -3347 -968 1910 3823 4004 2275 -469 -3051 -4148 -3313 -927 1917
1355 1917 3789 3925 2263 -499 -2978 -4047 -3292 -919 1860 3739 3892 2254 -508 -2988 -4065 -3227
1371 -3227 -860 1840 3730 3796 2154 -511 -2972 -4006 -3164 -842 1837 3676 3759 2182 -520 -2900
1387 -2900 -3893 -3081 -835 1851 3669 3756 2106 -507 -2911 -3858 -3074 -793 1803 3592 3688 2119 -569
1404 -569 -2864 -3828 -3073 -841 1790 3602 3653 2029 -532 -2822 -3842 -2994 -828 1815 3612 3653 2022
1421 2022 -576 -2878 -3824 -3016 -805 1767 3504 3618 1967 -549 -2836 -3800 -3028 -799 1770 3532
1437 3532 3625 1992 -544 -2809 -3730 -2929 -751 1806 3483 3562 1993 -608 -2860 -3752 -2973 -756 1793
1454 1793 3498 3591 1901 -531 -2841 -3647 -2883 -770 1836 3487 3510 1907 -582 -2875 -3691 -2910 -720
1471 -720 1830 3466 3546 1910 -630 -2823 -3696 -2860 -669 1847 3401 3469 1894 -599 -2796 -3680 -2820
1488 -2820 -660 1849 3449 3426 1849 -705 -2848 -3644 -2776 -655 1859 3417 3361 1756 -686 -2808
1504 -2808 -3657 -2758 -606 1836 3466 3448 1789 -705 -2781 -3610 -2804 -582 1892 3453 3395 1764 -757
1521 -757 -2853 -3632 -2704 -496 1922 3409 3315 1707 -702 -2843 -3593 -2664 -513 1903 3402 3340 1673
1538 1673 -808 -2899 -3516 -2632 -432 1936 3486 3292 1641 -845 -2897 -3494 -2537 -395 1951 3430
1554 3430 3243 1600 -811 -2929 -3581 -2543 -392 2031 3484 3253 1556 -933 -2880 -3522 -2536 -317
1570 -317 2087 3392 3214 1482 -972 -2907 -3549 -2459 -208 2069 3455 3156 1460 -1037 -2975 -3528
1586 -3528 -2439 -194 2105 3434 3140 1355 -1114 -2991 -3495 -2381 -162 2188 3424 3128 1372 -1077
1602 -1077 -2988 -3496 -2346 -99 2190 3454 3104 1250 -1168 -2998 -3449 -2268 -61 2229 3437 3078
1618 3078 1186 -1262 -3037 -3463 -2207 79 2388 3442 2957 1172 -1290 -3073 -3407 -2208 109 2340
1634 2340 3478 3017 1130 -1327 -3077 -3394 -2165 139 2367 3449 2951 1070 -1312 -3146 -3384 -2076
1650 -2076 203 2454 3497 2951 964 -1468 -3160 -3323 -2058 275 2427 3476 2864 943 -1434 -3162
1666 -3162 -3414 -1970 349 2455 3464 2837 837 -1569 -3192 -3365 -1953 446 2520 3510 2793 778
1682 778 -1564 -3227 -3348 -1902 487 2652 3537 2794 783 -1604 -3262 -3339 -1843 499 2612 3491 2752
1699 2752 711 -1725 -3283 -3320 -1767 614 2680 3550 2764 552 -1803 -3273 -3264 -1706 678 2712 3480
1716 3480 2660 573 -1879 -3351 -3298 -1624 737 2758 3484 2621 490 -1870 -3381 -3246 -1632 791
1732 791 2832 3500 2545 362 -1970 -3323 -3148 -1559 801 2886 3537 2498 354 -1993 -3388 -3186
1748 -3186 -1512 949 2884 3479 2499 304 -2087 -3408 -3193 -1500 925 2916 3504 2413 168 -2094
1764 -2094 -3416 -3135 -1373 1027 3003 3540 2400 163 -2147 -3479 -3114 -1333 1159 3069 3520 2353
1780 2353 74 -2217 -3466 -3104 -1212 1198 3042 3535 2280 -32 -2326 -3443 -3040 -1174 1290 3056
1796 3056 3442 2220 -112 -2354 -3488 -2972 -1080 1363 3149 3414 2114 -198 -2400 -3529 -2916 -1054
1812 -1054 1379 3179 3424 2070 -261 -2479 -3545 -2900 -926 1490 3214 3448 2023 -284 -2507 -3564
1828 -3564 -2878 -859 1544 3203 3395 1890 -439 -2610 -3540 -2856 -807 1583 3263 3406 1872 -529
1844 -529 -2680 -3559 -2787 -700 1656 3298 3319 1875 -573 -2675 -3499 -2685 -606 1727 3318 3340 1748
1861 1748 -660 -2775 -3569 -2668 -599 1836 3354 3294 1699 -696 -2803 -3567 -2633 -467 1916 3349
1877 3349 3243 1576 -817 -2856 -3580 -2553 -374 1948 3398 3223 1550 -908 -2901 -3532 -2506 -255
1893 -255 2047 3444 3202 1443 -976 -2967 -3529 -2482 -173 2116 3447 3154 1404 -1101 -3010 -3486
1909 -3486 -2384 -70 2205 3494 3114 1271 -1177 -3018 -3479 -2302 -4 2266 3541 3059 1162 -1273
1925 -1273 -3069 -3506 -2265 53 2291 3472 3014 1085 -1364 -3145 -3458 -2131 124 2429 3460 3011
1941 3011 1017 -1377 -3204 -3406 -2089 209 2502 3480 2943 923 -1443 -3244 -3443 -2026 346 2532
1957 2532 3505 2883 870 -1530 -3231 -3409 -1971 427 2574 3479 2789 776 -1636 -3232 -3387 -1878
1973 -1878 514 2625 3529 2774 661 -1692 -3299 -3353 -1827 589 2702 3485 2695 540 -1810 -3318
1989 -3318 -3305 -1669 658 2773 3556 2622 516 -1861 -3322 -3231 -1623 754 2733 3447 2515 367 -1980
2006 -1980 -3355 -3225 -1511 917 2847 3422 2452 371 -2059 -3396 -3127 -1478 994 2882 3388 2383
2022 2383 211 -2068 -3370 -3106 -1382 1020 2926 3419 2354 143 -2096 -3386 -3038 -1247 1074 2995
2038 2995 3428 2250 28 -2189 -3380 -2993 -1163 1199 2965 3386 2192 -30 -2239 -3414 -2953 -1105
2054 -1105 1272 3057 3309 2079 -128 -2323 -3407 -2878 -1016 1348 3057 3293 1996 -215 -2360 -3370
2070 -3370 -2767 -893 1436 3129 3269 1941 -353 -2409 -3428 -2719 -797 1504 3137 3252 1891 -431
2086 -431 -2500 -3358 -2647 -693 1618 3099 3213 1748 -530 -2564 -3410 -2511 -635 1688 3186 3132 1611
2103 1611 -639 -2536 -3348 -2524 -511 1720 3173 3123 1609 -675 -2671 -3301 -2506 -390 1806 3116
2119 3116 3065 1456 -859 -2670 -3282 -2435 -303 1852 3179 2988 1380 -810 -2719 -3251 -2315 -239 1940
2136 1940 3156 2933 1337 -1012 -2782 -3260 -2283 -123 2016 3214 2883 1231 -1050 -2829 -3242 -2121
2152 -2121 -82 2124 3200 2845 1151 -1133 -2837 -3214 -2038 -17 2192 3204 2793 982 -1182 -2872
2168 -2872 -3187 -2015 111 2199 3188 2682 947 -1275 -2902 -3144 -1946 223 2258 3197 2667 815
2184 815 -1379 -2925 -3115 -1832 280 2320 3214 2552 749 -1429 -2931 -3024 -1716 415 2373 3190 2565
2201 2565 702 -1478 -2947 -3007 -1656 475 2354 3165 2502 625 -1584 -2984 -2973 -1551 541 2467
2217 2467 3173 2358 524 -1639 -2972 -2907 -1475 688 2431 3090 2356 432 -1718 -2969 -2910 -1420 761
2234 761 2562 3107 2278 341 -1741 -3022 -2887 -1372 811 2602 3130 2219 231 -1873 -3008 -2746 -1250
2251 -1250 883 2575 3094 2125 185 -1861 -3016 -2742 -1157 932 2608 3045 2059 53 -1971 -3059
2267 -3059 -2663 -1050 1100 2619 3006 1965 -38 -2037 -2996 -2642 -993 1125 2662 3038 1864 -95
2283 -95 -2067 -2988 -2553 -917 1219 2783 2933 1856 -245 -2132 -3027 -2487 -825 1293 2788 2951 1733
2300 1733 -337 -2175 -3033 -2498 -715 1313 2750 2914 1653 -382 -2228 -2964 -2414 -629 1332 2828
2316 2828 2869 1593 -469 -2300 -2979 -2305 -533 1424 2754 2814 1505 -545 -2288 -2933 -2247 -449 1536
2333 1536 2811 2762 1388 -591 -2300 -2966 -2184 -434 1594 2877 2703 1342 -706 -2381 -2908 -2134 -315
2350 -315 1619 2788 2671 1242 -721 -2452 -2899 -2016 -202 1736 2783 2577 1172 -875 -2398 -2854
2366 -2854 -1943 -113 1749 2771 2577 1069 -877 -2433 -2786 -1909 -81 1801 2808 2464 969 -1001
2382 -1001 -2489 -2855 -1841 25 1863 2856 2439 886 -988 -2493 -2826 -1720 86 1874 2778 2395
2398 2395 837 -1130 -2515 -2723 -1725 208 1962 2797 2330 790 -1201 -2566 -2694 -1603 266 1986
2414 1986 2780 2267 675 -1209 -2525 -2690 -1499 291 2051 2734 2179 629 -1256 -2597 -2582 -1459 370
2431 370 2047 2729 2138 554 -1295 -2558 -2609 -1409 470 2118 2735 2055 464 -1394 -2555 -2444 -1239
2448 -1239 553 2172 2751 2033 385 -1454 -2581 -2440 -1193 633 2122 2673 1949 307 -1496 -2525
2464 -2525 -2406 -1196 633 2194 2637 1898 198 -1509 -2531 -2372 -1051 778 2196 2632 1787 99
2480 99 -1603 -2547 -2277 -977 823 2203 2583 1701 85 -1669 -2553 -2259 -916 887 2234 2544 1645
2497 1645 7 -1701 -2519 -2185 -796 953 2279 2524 1594 -64 -1725 -2578 -2134 -798 946 2301
2513 2301 2474 1570 -162 -1765 -2460 -2084 -729 1052 2261 2418 1407 -264 -1794 -2517 -2003 -613 1128
2530 1128 2296 2425 1394 -307 -1755 -2453 -1969 -521 1164 2255 2330 1288 -336 -1849 -2443 -1898 -482
2547 -482 1218 2261 2311 1219 -389 -1894 -2434 -1796 -429 1240 2251 2274 1139 -522 -1923 -2411 -1768
2564 -1768 -344 1290 2262 2192 1041 -535 -1938 -2388 -1714 -231 1340 2308 2152 980 -574 -1944 -2337
2581 -2337 -1629 -147 1373 2276 2084 951 -643 -1959 -2306 -1554 -105 1394 2278 1980 926 -728 -1975
2598 -1975 -2310 -1547 -64 1444 2299 1989 803 -766 -1992 -2238 -1448 23 1445 2272 1958 734 -802
2615 -802 -2006 -2161 -1437 49 1516 2229 1915 677 -867 -2008 -2145 -1283 149 1495 2147 1822 598
2632 598 -884 -1960 -2103 -1312 204 1550 2202 1790 500 -998 -1961 -2096 -1241 257 1616 2142 1690
2649 1690 456 -958 -1946 -2021 -1123 296 1630 2144 1687 436 -1030 -1980 -1986 -1056 387 1594 2105 1605
2667 1605 250 -1078 -1984 -1903 -1002 485 1623 2037 1556 282 -1140 -2025 -1908 -918 498 1644 2091
2684 2091 1448 211 -1210 -2001 -1894 -872 577 1690 2007 1442 118 -1199 -1967 -1821 -827 581 1649
2701 1649 1965 1424 130 -1256 -2001 -1716 -695 667 1708 1939 1317 -19 -1273 -1910 -1731 -678 690
2718 690 1719 1919 1205 -45 -1298 -1948 -1637 -603 727 1671 1887 1189 -61 -1285 -1899 -1644 -614
2735 -614 764 1669 1878 1158 -118 -1318 -1878 -1550 -545 821 1756 1791 1100 -130 -1353 -1918 -1504 -452
2753 -452 867 1706 1789 994 -171 -1401 -1840 -1463 -438 835 1711 1759 952 -274 -1397 -1810 -1385 -329
2771 -329 924 1687 1690 891 -325 -1395 -1818 -1354 -262 943 1711 1688 857 -398 -1420 -1782 -1293 -239
2789 -239 920 1663 1667 771 -381 -1399 -1758 -1280 -222 970 1681 1582 771 -497 -1424 -1743 -1215 -80 973
2808 973 1592 1511 665 -477 -1411 -1705 -1132 -108 994 1662 1470 640 -535 -1413 -1663 -1077 -46 990
2826 990 1654 1455 540 -560 -1413 -1632 -1110 -11 1103 1628 1371 513 -575 -1443 -1605 -999 86 1101
2844 1101 1583 1418 484 -605 -1416 -1565 -967 77 1104 1589 1357 445 -710 -1431 -1536 -881 160 1138
2862 1138 1582 1289 397 -686 -1418 -1487 -855 173 1135 1505 1262 335 -703 -1380 -1480 -815 264 1172 1483
2881 1483 1178 252 -718 -1378 -1418 -699 216 1163 1500 1153 289 -779 -1413 -1423 -752 283 1143 1459 1079 180
2901 180 -785 -1427 -1359 -663 273 1098 1443 1077 147 -852 -1401 -1290 -570 338 1163 1425 996 135 -719 -1376
2921 -1376 -1367 -594 391 1169 1371 966 103 -897 -1422 -1223 -546 436 1230 1374 950 53 -852 -1328 -1227 -508
2941 -508 483 1157 1308 875 47 -906 -1341 -1100 -362 516 1215 1384 818 -22 -912 -1317 -1116 -396 498 1156
2961 1156 1304 780 -72 -950 -1308 -1089 -372 586 1188 1236 751 -95 -933 -1295 -1045 -306 540 1191 1172 711
2981 711 -126 -990 -1315 -997 -291 556 1168 1233 631 -130 -937 -1246 -959 -277 610 1180 1145 633 -201 -916 -1246
3002 -1246 -919 -212 591 1173 1123 605 -228 -962 -1197 -939 -193 598 1132 1086 552 -226 -979 -1182 -913 -140
3022 -140 687 1115 1073 540 -305 -919 -1206 -876 -142 629 1103 1064 495 -337 -951 -1103 -852 -95 671 1114 1052
3043 1052 521 -270 -934 -1112 -772 -47 677 1064 976 427 -349 -954 -1034 -755 -22 675 1042 923 354 -374
3063 -374 -890 -1135 -691 18 682 1065 935 391 -410 -924 -1109 -699 35 704 1053 943 325 -471 -1030 -1051
3083 -1051 -653 3 734 1073 873 291 -392 -963 -1000 -589 19 750 1005 889 262 -428 -934 -1022 -583 77
3103 77 733 1015 808 192 -483 -909 -980 -550 94 703 964 792 234 -479 -971 -1026 -583 109 730 1043 791
3124 791 181 -469 -908 -933 -454 158 791 996 766 161 -487 -933 -944 -485 239 753 964 729 147 -414 -901
3145 -901 -844 -453 183 728 946 735 136 -544 -906 -877 -418 189 744 894 672 98 -531 -899 -866 -452 226
3166 226 743 971 702 65 -522 -903 -859 -382 206 781 885 660 91 -498 -952 -829 -402 278 743 898
3186 898 596 26 -596 -848 -818 -318 298 706 847 553 31 -593 -862 -782 -290 318 779 855 537 -19 -632
3207 -632 -868 -784 -293 320 788 826 514 -109 -551 -838 -759 -247 317 767 844 483 -58 -612 -861 -748 -233
3228 -233 336 770 810 478 -42 -638 -900 -679 -251 381 741 751 492 -114 -627 -873 -686 -164 452 786 816
3249 816 432 -141 -583 -774 -621 -173 420 760 787 414 -155 -647 -826 -632 -161 368 747 765 406 -131 -603
3270 -603 -800 -613 -139 422 721 747 434 -138 -625 -790 -555 -113 426 728 719 360 -216 -614 -782 -540 -132
3291 -132 459 793 706 347 -217 -589 -782 -553 -47 466 717 698 333 -245 -586 -786 -593 -53 431 750 679
3312 679 264 -179 -643 -729 -467 -64 424 754 568 276 -244 -660 -753 -467 -11 456 753 614 228 -255 -624
3333 -624 -745 -516 -16 462 748 713 239 -296 -617 -740 -516 3 458 644 611 165 -301 -629 -736 -467 18
3354 18 467 703 563 236 -276 -608 -722 -447 22 434 623 534 223 -297 -652 -717 -435 22 488 707 578
3375 578 212 -294 -581 -660 -419 72 488 674 573 185 -321 -651 -607 -355 88 470 703 537 134 -308 -639
3396 -639 -630 -345 104 472 646 513 78 -297 -657 -680 -357 152 502 618 538 101 -310 -544 -668 -384 134
3417 134 494 645 532 116 -340 -638 -622 -292 114 495 673 460 114 -359 -578 -592 -347 123 491 622 476
3438 476 73 -311 -597 -589 -298 90 463 648 429 65 -416 -581 -566 -296 191 517 668 445 122 -353 -593
3459 -593 -557 -282 116 473 622 456 32 -321 -558 -508 -319 143 483 569 401 83 -345 -558 -482 -283 130
3480 130 469 542 362 4 -351 -588 -516 -224 198 538 599 421 41 -390 -575 -505 -259 184 499 553 374 36
3502 36 -329 -559 -475 -218 231 518 568 366 -29 -412 -532 -441 -220 186 535 550 365 -36 -368 -567 -511 -173
3524 -173 214 510 516 308 -73 -405 -546 -489 -117 216 455 493 300 -62 -382 -503 -457 -133 237 430 469 335
3546 335 -35 -336 -487 -419 -140 254 487 510 330 -62 -398 -536 -469 -101 294 486 492 303 -114 -345 -562 -367
3568 -367 -137 232 472 485 313 -40 -453 -505 -358 -136 297 477 462 242 -56 -416 -556 -398 -104 256 461
3589 461 521 229 -118 -392 -517 -354 -163 266 506 476 276 -128 -414 -422 -333 -33 318 429 509 199 -136 -414
3611 -414 -499 -388 -93 279 474 472 224 -194 -383 -473 -354 -56 262 438 434 202 -81 -418 -501 -352 -18 258
3633 258 483 400 178 -124 -434 -466 -371 -38 311 461 455 194 -127 -429 -500 -300 -45 345 507 475 192 -191
3655 -191 -442 -477 -278 -24 286 472 424 136 -160 -402 -479 -350 -39 273 480 424 153 -160 -410 -486 -311 -32
3677 -32 325 512 446 131 -200 -435 -472 -312 2 338 457 379 95 -176 -471 -443 -320 23 296 452 363 120
3699 120 -193 -479 -496 -252 67 285 464 343 90 -218 -469 -407 -262 67 327 433 360 82 -248 -369 -402
3720 -402 -253 78 373 446 345 150 -227 -412 -489 -228 59 340 459 351 99 -180 -420 -490 -261 49 312
3741 312 475 362 106 -168 -389 -425 -273 81 356 454 375 128 -220 -381 -455 -182 131 370 447 332 57 -199
3763 -199 -456 -428 -214 58 365 479 306 85 -238 -403 -449 -218 94 368 467 322 106 -276 -501 -473 -227
3784 -227 117 331 480 393 -5 -258 -438 -418 -137 75 326 443 312 50 -301 -456 -409 -156 150 407 507
3805 507 330 55 -239 -447 -375 -207 176 359 440 298 77 -267 -421 -447 -193 128 419 437 301 16 -257
3826 -257 -396 -372 -100 87 415 444 264 26 -284 -456 -359 -178 167 424 481 288 -1 -257 -436 -356 -122 155
3848 155 433 409 214 -61 -283 -450 -395 -144 122 370 416 260 -4 -317 -478 -344 -78 154 388 381 303 -72
3870 -72 -293 -429 -402 -124 153 402 488 271 -7 -325 -456 -351 -225 217 389 444 208 -39 -351 -439 -332 -102
3892 -102 156 387 440 227 -65 -313 -437 -359 -99 225 372 403 215 -92 -341 -455 -289 -72 273 436 402
3913 402 199 -47 -307 -444 -341 -90 180 386 424 225 -73 -380 -400 -323 -41 241 416 428 225 -70 -354
3934 -354 -444 -369 -59 257 412 445 203 -61 -355 -458 -302 -116 243 432 403 192 -68 -422 -475 -318 -28 213
3956 213 392 415 172 -96 -353 -451 -244 8 251 411 384 175 -115 -345 -423 -313 0 273 376 403 112 -138
3978 -138 -314 -471 -314 25 270 426 370 152 -157 -347 -400 -285 4 302 418 371 105 -172 -376 -432 -285
3999 -285 41 233 420 395 104 -204 -442 -395 -234 -5 299 446 352 176 -136 -355 -423 -281 27 290 457
4020 457 377 102 -172 -364 -429 -278 22 349 422 342 87 -168 -372 -416 -253 44 337 465 294 106 -164 -427
4042 -427 -397 -218 52 353 468 353 99 -194 -387 -428 -200 -7 294 449 327 71 -212 -405 -425 -215 45
4063 45 395 466 245 28 -179 -373 -371 -178 60 366 398 319 44 -225 -402 -441 -218 112 345 358 319 20 -236
4086 -236 -456 -407 -168 106 387 438 315 55 -196 -394 -372 -143 172 350 476 307 -6 -183 -454 -344 -211
4107 -211 121 344 451 244 -16 -311 -362 -364 -125 169 361 390 366 -42 -269 -416 -336 -137 128 458 448 263
4129 263 -19 -304 -439 -327 -93 154 373 423 199 -29 -291 -420 -358 -116 151 357 495 241 -28 -256 -421
4150 -421 -342 -109 155 354 445 262 -64 -354 -421 -317 -90 247 391 415 192 -17 -343 -437 -296 -66 192 325
4172 325 414 185 -71 -295 -382 -315 -73 171 406 378 196 -146 -294 -368 -308 -83 274 423 401 169 -99 -342
4194 -342 -409 -313 -56 217 412 353 144 -59 -338 -450 -282 -42 188 379 361 168 -121 -405 -413 -313 -45 202
4216 202 368 341 182 -91 -331 -411 -305 -21 201 407 388 192 -104 -357 -404 -327 -7 253 383 364 164 -107
4238 -107 -319 -369 -219 -34 263 447 351 156 -148 -367 -447 -310 -51 277 377 367 120 -206 -372 -378 -237 9
4260 9 276 432 314 93 -155 -340 -407 -198 34 290 462 333 136 -148 -355 -468 -195 45 228 400 314
4281 314 71 -197 -359 -410 -267 34 290 371 299 94 -191 -378 -424 -269 80 279 426 267 119 -208 -382
4302 -382 -329 -202 79 307 401 277 55 -189 -412 -359 -204 91 351 430 271 36 -192 -374 -363 -160 41 265
4324 265 365 303 13 -222 -360 -383 -161 83 302 362 302 37 -238 -383 -375 -138 126 285 362 239 15 -265
4346 -265 -363 -382 -194 188 354 398 268 50 -193 -384 -308 -131 136 332 388 218 2 -274 -347 -372 -147 81
4368 81 329 400 212 -9 -251 -318 -303 -145 100 371 388 256 -28 -302 -418 -308 -95 204 303 383 255 -19
4390 -19 -265 -382 -304 -58 232 306 344 214 -41 -277 -316 -305 -93 172 381 358 187 -74 -284 -387 -290 -99 209
4413 209 337 330 172 -67 -291 -308 -293 -56 179 290 350 178 28 -258 -303 -278 -43 132 315 357 189 -15 -245
4436 -245 -371 -267 -111 226 322 370 149 -71 -291 -350 -258 -92 178 336 348 190 -36 -327 -306 -280 -25 172
4458 172 318 365 115 -97 -324 -377 -231 -59 231 328 384 161 -98 -318 -330 -212 -51 204 331 288 145 -66
4480 -66 -243 -329 -253 -41 229 338 260 114 -104 -332 -358 -225 -15 182 316 299 123 -133 -233 -300 -270 -33 179
4503 179 271 324 117 -182 -280 -350 -208 3 183 332 273 90 -97 -280 -342 -159 15 248 361 268 84 -112
4525 -112 -305 -368 -169 21 231 304 253 54 -157 -317 -324 -208 9 179 332 252 72 -139 -300 -276 -197 64 242
4548 242 358 285 72 -155 -336 -325 -191 95 201 355 243 120 -160 -270 -309 -92 62 243 336 293 91 -151
4570 -151 -313 -324 -160 50 261 287 191 -1 -194 -332 -319 -171 88 226 356 234 32 -214 -349 -295 -129 82
4592 82 222 336 223 9 -125 -271 -287 -142 104 312 301 235 -45 -143 -305 -300 -123 60 245 334 235 61 -196
4615 -196 -263 -250 -116 88 216 298 195 73 -182 -295 -238 -133 101 219 355 181 24 -177 -309 -211 -117 116
4637 116 245 210 145 -34 -200 -250 -272 -97 96 244 274 167 -8 -158 -301 -288 -44 114 280 294 116 -10
4659 -10 -215 -301 -240 -90 157 304 257 163 -44 -206 -288 -223 -60 95 260 317 109 -65 -209 -326 -255 -64 162
4682 162 241 303 102 -55 -215 -273 -200 -76 135 270 254 196 -46 -193 -263 -210 -46 81 205 275 102 -33 -230
4705 -230 -278 -239 -20 110 264 251 85 -52 -234 -214 -228 -55 115 231 239 145 -72 -224 -271 -205 -30 136 266
4728 266 259 151 -29 -240 -228 -242 -34 161 254 244 115 -34 -237 -237 -195 2 157 246 186 133 -106 -207 -311 -222
4752 -222 -10 199 252 200 147 -83 -213 -257 -180 -2 133 257 224 122 -81 -231 -254 -153 26 118 244 259 41
4775 41 -98 -233 -212 -181 -20 201 287 298 116 -58 -205 -235 -173 -1 163 228 220 57 -87 -199 -206 -164 1 119
4799 119 194 207 93 -142 -228 -234 -158 23 172 250 133 119 -55 -211 -226 -93 17 205 235 167 19 -163 -176 -296
4823 -296 -121 61 148 225 157 61 -62 -212 -163 -148 -30 166 248 177 63 -112 -212 -247 -87 -4 161 209 196 28
4847 28 -124 -206 -230 -90 -9 177 187 181 51 -106 -176 -181 -116 -8 141 148 189 65 -108 -194 -235 -117 31 223 231 115
4873 115 23 -77 -225 -213 -109 33 219 254 114 -14 -131 -216 -215 -118 56 132 201 124 -21 -83 -227 -193 -70 80
4897 80 156 203 141 52 -157 -183 -189 -119 49 172 120 193 -12 -88 -157 -173 -81 29 143 142 85 -16 -132 -202 -193 -80 63
4924 63 86 186 120 -59 -126 -208 -148 -92 59 149 173 121 23 -160 -206 -173 -73 106 149 207 111 6 -138 -222 -136 -55
4950 -55 68 196 215 72 -21 -156 -209 -167 -110 103 172 134 101 48 -115 -171 -154 -45 35 139 169 62 22 -122 -177
4975 -177 -172 -55 59 119 164 126 -18 -165 -183 -149 -42 64 199 191 113 13 -110 -167 -150 13 122 130 211 83 -23
5000 -23 -141 -173 -135 -35 81 200 141 173 -39 -139 -157 -121 -68 89 112 93 93 -22 -115 -201 -87 -33 165 167 155 82
5026 82 -15 -90 -139 -93 -19 76 184 185 65 -40 -175 -146 -139 -21 53 140 109 81 -76 -161 -176 -186 -9 61 191 144 70
5053 70 -10 -171 -185 -124 -10 103 144 148 55 -44 -132 -151 -124 -20 98 147 97 73 -67 -197 -160 -101 60 131 113 162 79
5080 79 -70 -139 -168 -78 35 166 160 157 75 -37 -146 -224 -91 -24 45 108 101 -35 13 -132 -105 -100 0 62 100 162 100 -16
5108 -16 -207 -148 -88 -22 109 141 142 58 -55 -62 -147 -54 24 57 106 159 -26 -11 -198 -194 -200 -14 92 202 126 48 -82 -128
5136 -128 -202 -52 4 121 143 100 25 -109 -108 -151 -67 52 110 132 103 47 -64 -91 -81 -79 55 93 155 79 14 -72 -111 -141
5164 -141 -83 -8 69 145 128 20 -76 -144 -100 -84 26 89 132 113 46 -65 -150 -146 -58 15 85 172 99 49 -60 -156 -139 -69
5192 -69 14 135 116 139 60 -26 -130 -113 -87 31 126 116 114 -4 -39 -122 -159 -118 -7 40 88 64 22 -100 -89 -158 -75 19
5220 19 102 132 59 5 -78 -144 -109 2 33 63 148 65 16 -66 -120 -85 -16 19 123 119 104 21 -36 -119 -128 -53 30 96 103 76 19
5251 19 -113 -150 -101 -45 19 63 84 82 41 -84 -185 -96 -19 18 103 77 63 -34 -67 -140 -60 -104 76 72 114 109 -12 -92 -95 -114
5281 -114 -43 71 63 126 88 32 -140 -138 -73 -47 36 46 60 44 -26 -86 -103 -162 -11 50 86 112 81 26 -81 -123 -110 -14 59
5310 59 76 128 69 16 -55 -85 -147 -90 20 85 159 63 -26 -36 -141 -109 -39 39 101 101 47 -8 -106 -121 -13 0 38 110 104 3
5340 3 -42 -69 -135 -126 -54 50 92 69 29 -21 -65 -110 -93 -82 49 85 113 84 -30 -126 -128 -74 18 60 121 127 47 -45 -51 -95 -98 -19
5372 -19 73 114 78 73 -59 -72 -107 -106 -26 42 106 111 55 -53 -63 -153 -107 -72 4 89 143 2 -8 -124 -106 -11 -35 51 96 91
5402 91 36 33 3 -88 -48 -52 59 113 121 114 34 -41 -99 -44 -29 91 114 125 62 -60 -51 -78 -83 5 42 96 108 44 -16 -22 -112 -86
5434 -86 -17 86 85 88 9 -54 -72 -82 -67 -17 24 137 107 54 -40 -72 -128 -54 40 44 112 104 44 -60 -96 -117 -97 4 100 13
5464 13 120 2 5 -36 -75 -83 -14 71 93 136 60 -25 -77 -157 -112 -1 89 150 123 58 -46 -58 -100 -58 44 120 130 96 30
5493 30 -55 -81 -158 -50 -24 96 90 114 27 -92 -27 -96 -21 -1 77 67 75 14 -48 -71 -119 -94 -40 63 76 136 2 -87 -66
5522 -66 -119 -28 13 53 95 69 23 -99 -63 -93 -67 21 110 95 112 63 9 -98 -86 -83 -23 92 153 56 -2 -113 -54 -86 -63
5551 -63 -6 66 104 60 43 -89 -64 -79 -23 57 53 100 88 70 -10 -73 -116 -44 57 89 59 69 20 -60 -72 -128 -3 13 119
5580 119 71 42 40 -75 -128 -86 -45 28 37 103 77 53 -75 -130 -94 -120 29 49 123 44 22 -87 -65 -162 -21 8 108 147
5608 147 40 29 -63 -120 -125 -48 39 83 94 12 58 -19 -112 -12 -89 8 129 92 58 56 -14 -88 -74 15 41 63 125 17 35
5637 35 -84 -74 -68 -1 42 116 75 54 1 -69 -57 -59 -8 34 122 56 64 -31 -45 -77 -97 -20 62 93 143 44 6 -76 -105 -110 48
5668 48 45 110 107 78 16 -52 -70 -79 15 25 94 44 56 -38 -55 -135 -76 25 45 104 82 58 -69 -96 -48 -64 -17 80 127 96 15
5699 15 -29 -61 -96 -75 -22 67 121 79 51 -44 -111 -105 -77 -17 63 80 26 60 13 -52 -103 -94 -56 80 46 70 50 2 -52 -84 -77
5730 -77 29 52 61 75 6 -48 -106 -107 -5 -25 23 96 91 33 -35 -93 -79 -109 -11 96 58 38 59 -24 -82 -79 -65 58 53 148 39
5761 39 -15 -21 -48 -107 -78 -10 54 51 79 10 -23 -92 -96 -3 17 74 108 99 28 -21 -85 -77 -45 20 79 87 68 30 -7 -101 -24 -1 31
5794 31 103 71 87 -23 -18 -127 -108 -65 -31 68 88 42 21 -54 -100 -33 -37 2 54 98 43 15 -27 -72 -117 -63 67 96 57 50
5824 50 34 -75 -79 -28 -101 12 120 57 103 10 -34 -63 -68 -29 -11 16 65 66 -16 -44 -100 -68 -88 58 16 64 24 12 -4 -113
5854 -113 -61 -12 37 83 52 32 54 -67 -115 -72 -22 46 102 62 -12 17 -47 -118 -45 -30 27 130 101 42 -1 -34 -32 -71 -84
5883 -84 0 62 66 106 -1 -22 -64 -127 -75 20 31 106 83 54 -77 -96 -78 -65 -15 62 87 4 41 -63 -92 -3 -19 21 82
5912 82 84 20 -14 -42 -53 -82 -42 41 89 63 27 9 -83 -85 -62 19 71 57 100 28 0 -115 -148 -90 8 49 59 54 26 22 -82
5943 -82 -114 -48 36 62 95 59 33 6 -59 -112 -80 9 107 63 96 31 -16 -71 -118 -48 -34 71 47 55 68 -53 -111 -69 -45 3
5973 3 24 83 11 44 -14 -54 -121 -70 -28 53 87 86 36 -42 -71 -68 -79 -28 38 102 70 24 -7 -85 -42 -1 -4 50 69 44 74 -76
6005 -76 -41 -20 14 35 46 56 75 58 -36 -14 -66 -44 45 30 58 54 11 -49 -85 -60 -85 39 24 29 43 -33 -58 -65 -123 1 -7
6036 -7 17 106 110 -21 -9 -50 -117 6 -31 54 66 101 6 -69 -11 -100 -28 44 33 57 -4 22 -22 -40 -83 -21 24 58 71 -3
6066 -3 2 -36 -137 -101 -20 44 50 25 106 -7 -66 -66 -52 -5 23 111 68 38 42 -41 -93 -36 -13 33 66 89 63 -45 -34 -99 -119
6097 -119 -55 -11 71 35 45 20 -62 -97 -109 -38 38 -11 77 31 46 -61 -34 -32 -18 59 106 126 37 18 -68 -79 -105 -51 40 93
6127 93 62 79 5 -17 -51 -57 -7 37 50 74 36 5 -59 -70 -72 -21 40 -4 107 20 -49 -71 -107 -87 -42 61 65 76 -4 19 -42
6158 -42 -96 -49 -32 49 43 51 51 32 -41 -49 -45 -33 28 67 101 60 -61 -15 -100 -110 12 18 25 62 20 35 -87 -74 -39 28 51 59 83
6191 83 26 12 -81 -23 -73 -8 60 79 107 32 2 -68 -73 -5 26 16 54 74 71 -45 -53 -31 -49 -54 47 118 49 -9 -19 -34 -83
6222 -83 -58 33 33 99 2 -41 -20 -111 -111 -64 -11 125 79 7 3 -60 -87 -104 -89 2 89 38 27 55 38 -46 -86 -25 27 55 82
6253 82 44 10 26 -59 -82 0 -40 80 115 88 44 -52 -72 -63 -108 8 41 58 56 13 -52 -49 -15 -12 -17 38 87 37 19 -12 -90 -89
6285 -89 -38 -41 70 69 36 8 -4 -78 -89 34 -4 70 10 45 -29 4 -56 -8 -13 26 122 59 74 -41 -42 -118 -123 -7 -4 81 67
6316 67 76 -51 -39 -92 -46 -21 10 59 46 75 -17 -72 -84 -41 -48 2 100 41 74 36 -8 -94 -52 -9 -55 80 51 60 6 -49 -59
6347 -59 -38 -32 46 64 57 -6 45 -55 -131 -43 -28 34 33 27 38 -16 -21 -75 -104 10 38 79 105 35 -3 1 -87 -83 -17 21 58 72 8
6380 8 -12 -82 -29 -65 5 36 52 15 39 -51 -92 -96 -118 11 24 67 53 7 -48 -50 -28 -109 -18 76 30 86 60 -1 -78 -70 -76 19
6412 19 25 91 73 -42 -2 -2 -56 -91 27 84 95 90 36 27 -106 -44 -30 62 32 43 80 43 -33 -28 -89 26 50 16 76 30 53
6443 53 -51 -26 -45 -22 -50 58 73 36 4 17 3 0 -39 2 58 58 51 10 -2 -51 -64 -32 24 30 21 74 40 -43 -13 -31 -15 -35
6475 -35 80 71 2 -10 8 -69 -83 7 17 28 26 28 40 -40 -52 -107 -61 -18 39 25 38 49 -31 -89 -73 -45 12 74 66 43 45 -47
6507 -47 -65 -61 -72 48 34 56 58 12 -52 -48 -90 -68 -19 74 40 68 44 -28 -68 -9 -8 0 60 86 -15 -14 -38 -48 -55 -43 -2 33 92
6540 92 17 -8 -46 1 -49 -9 -3 52 92 65 27 -46 -67 -38 -64 23 66 50 41 64 -30 -99 -26 -33 10 -10 74 58 -25 -39 -105 -79
6572 -79 -34 22 67 35 -3 47 -61 -63 -5 -81 -24 96 97 26 16 -43 -77 -48 5 13 25 84 -7 -18 -46 -48 -56 -10 12 61 58 -3
6604 -3 -44 -93 -59 -59 30 49 61 36 -9 -4 -85 -126 -35 16 39 75 104 1 56 14 -41 -10 -39 21 28 39 -6 -5 -58 -20 -32 -6
6636 -6 37 77 118 57 8 -56 -32 11 4 39 30 16 75 21 -14 -60 -10 -40 49 30 50 18 6 -17 -54 -25 5 25 5 24 44 -39
6668 -39 -19 0 -23 35 -50 96 26 19 -59 -45 -39 -42 12 -6 64 49 -21 -83 -95 -58 -59 16 17 53 57 9 19 -51 -25 -18 3 48 59
6701 59 80 1 -17 -70 -18 -17 0 77 61 49 0 2 -28 -9 8 7 42 84 69 109 -7 -35 -38 29 -15 15 28 1 9 -41 -78 -68
6733 -68 -26 37 39 67 45 40 -38 -46 -27 18 22 -16 39 17 29 -28 -12 -16 -32 45 13 28 24 4 -65 -67 16 36 -39 60 32 23 -12 2
6767 2 -74 -31 1 29 47 -5 54 -18 -112 -70 -77 -46 7 -17 46 54 -14 -2 -21 -85 -81 -39 68 46 21 4 -53 -41 -110 4 21
6798 21 40 42 38 -1 -31 -63 -31 10 15 49 52 67 -23 1 -3 8 -2 19 40 87 -1 -31 -45 -30 -61 12 82 33 47 39 5 -43 -33
6831 -33 -26 -18 -10 32 18 34 32 -45 -29 -64 -5 43 65 83 66 20 -17 -54 -65 25 29 37 -20 -1 -16 -50 -41 8 -64 -10 10 5 28 2
6865 2 -93 -76 -40 -59 -8 7 55 44 21 -15 -27 -51 63 16 40 -18 -4 -38 -50 11 -47 -17 22 73 -3 17 -21 -27 -72 -12 18
6896 18 -4 48 58 68 20 38 -40 -23 44 22 60 17 5 8 -1 -22 -51 -40 -26 31 17 -13 -22 -37 -9 -19 -48 2 30 50 30 -12
6928 -12 -42 -25 -20 32 16 25 27 -10 1 23 6 -21 12 19 2 65 -45 8 -48 -38 -21 0 5 -1 23 18 22 -20 -39 -21 -42 11 -14 79
6962 79 31 -32 -37 21 17 -1 23 58 18 16 7 -24 -51 2 -3 -2 45 17 70 -1 -30 -59 14 -41 -31 18 29 -50 13 -12 -79 11 6 -1
6996 -1 -4 28 15 -28 18 -15 -27 -2 5 53 21 -12 6 -60 -23 4 64 26 -11 35 42 -5 -30 -39 -26 -2 8 43 -17 -10 -64 -36 -92
7029 -92 -19 33 10 50 39 -1 -26 -12 -62 4 -10 28 81 35 23 19 -25 -37 -2 -4 65 19 58 32 -27 -41 -45 -16 -15 13 54 21
7061 21 -33 -32 -46 29 0 62 74 44 -8 38 -32 -69 -4 12 17 69 31 -67 -4 21 -30 28 12 7 26 2 5 -26 -7 -56 -42 28
7093 28 28 -4 24 -20 19 -23 -13 -32 -8 5 32 11 -12 -8 11 -49 7 -27 12 55 6 46 20 -16 3 -73 -31 15 29 -13 23
7124 23 -18 -8 2 -10 25 33 58 37 34 -8 28 -45 -6 -35 56 -56 3 78 34 -43 -48 -32 19 -11 3 59 -5 -64 -52 -22 -63
7155 -63 -23 34 95 54 25 -16 -33 -33 -51 -40 20 -4 33 46 -74 -23 -53 -45 -17 35 6 56 9 48 -10 -45 44 37 -29 9 11 73
7187 73 12 -62 10 3 -35 -27 22 35 35 17 -21 -82 -37 2 -8 -15 23 0 32 -20 -18 32 -60 23 64 19 18 -30 -45 12 1 17 25 68
7221 68 42 30 -24 -43 4 -35 -28 11 -14 -25 -26 -55 -51 -15 3 2 -18 42 23 7 -13 -26 -46 -65 -33 -1 -18 -28 11 -29 -77 -25
7253 -25 -24 -11 -33 24 35 -24 -61 -10 -18 -74 56 14 29 19 -6 -62 -74 -17 -45 -9 35 73 -16 36 9 -13 -10 -26 -4 -23 22
7284 22 25 -4 -68 -26 6 -36 -59 24 27 -22 7 2 -54 -13 -32 51 9 44 124 13 -62 -18 -22 17 -33 4 -15 11 18 24 -39 -9 0
7317 0 -59 0 16 27 27 -27 6 -34 -57 -17 19 22 27 -25 -4 -37 -65 -11 61 -3 9 -19 20 -30 3 -17 -70 -27 58 -9 -5 56 -13
7350 -13 -31 -21 -36 -20 10 -23 -60 -70 -12 -25 -18 -17 -24 46 72 -14 24 -51 -10 -48 -20 -2 -13 55 81 -9 -89 -28 -65 -4 -32 21
7382 21 66 7 57 -54 -42 1 29 -11 -15 25 13 -50 -31 -32 32 4 -25 -25 -44 13 2 -48 -11 -63 -14 -2 24 26 -31 -35 -51 -11
7414 -11 -26 -9 -7 45 -37 -19 33 -25 1 22 -35 -30 -28 28 6 18 4 2 37 -55 22 54 14 33 -3 -43 -28 1 -4 61 35 34 -1
7447 -1 -30 -79 -58 -60 -12 -48 -49 30 5 34 -72 -25 -59 2 27 42 35 -12 11 17 15 -34 56 -1 46 21 43 -16 -62 -32 -12 24 -8
7480 -8 0 27 30 -40 12 -46 31 -19 -51 25 -11 10 -5 -2 -17 -11 -13 57 -22 48 21 -17 -53 -72 19 -19 37 22 50 42 -59 -36 -10
7513 -10 -20 -49 28 34 -8 9 27 -47 -30 -9 -25 -2 22 -11 2 -33 -12 -32 -52 31 17 15 27 -28 -47 -73 -54 -42 2 59 9
7544 9 -39 -8 -12 -8 -6 -2 3 32 46 19 3 -4 -31 -6 21 -10 -16 67 2 2 -16 -16 -54 18 -48 -17 15 27 51 0 -16 -7 -22 23 76 128
7580 128 4 46 -21 -29 -16 -42 -14 -29 0 79 11 -17 -1 -56 -10 2 53 51 14 7 -3 14 -10 17 -44 37 41 50 3 13 -32 -14
7612 -14 -21 -11 27 6 8 11 -51 -19 -41 -28 6 59 22 15 -20 -41 -47 -26 18 10 1 56 -17 4 -10 -13 1 -17 3 -20 -5 -5 -54 -7 -25
7647 -25 -57 9 26 -17 -39 31 -19 13 -22 -11 18 20 38 62 13 12 38 21 13 -25 -15 29 -78 31 -8 -54 -49 -95 -15 25 11
7678 11 6 40 -38 7 -6 -43 3 10 27 53 1 -4 8 -45 -53 12 7 20 33 4 4 -52 -52 -30 -32 41 -38 47 19 10 -11 -2 -44 -59 27
7713 27 -51 55 47 18 -1 37 -6 -17 19 25 -36 -5 -13 2 -20 -34 -31 -29 35 32 34 -1 -37 -15 -37 -12 7 43 -34 -8 -10 2 -37 -4
7747 -4 15 34 19 42 -14 -34 -2 -6 21 3 1 -49 78 37 11 -6 -18 29 11 24 6 28 11 -16 -12 13 4 -19 15 43 -6 45
7779 45 -17 -25 32 -39 -1 4 4 19 -28 42 7 -67 29 21 18 28 53 -11 -12 -9 -60 -19 35 -13 -5 -12 6 1 -27 -61 -15 0 18 78 39
7814 39 46 -28 -9 -27 36 26 19 17 11 24 -6 -94 -28 -34 21 62 25 -2 31 -21 -54 15 -56 -14 44 30 17 -6 -11 -25 -5 25 -4
7847 -4 35 8 56 -11 17 -67 -39 -17 -17 -7 -31 47 -7 10 -33 5 -19 4 16 30 15 -34 16 -78 -15 56 3 16 60 76 -45
7878 -45 -27 -14 -27 -34 -16 46 -9 27 1 -18 -36 -48 -18 21 -4 -25 -17 -19 -10 -1 -26 -58 31 10 38 -24 6 38 -37 18 -3 -1 -34
7911 -34 51 0 15 -38 -73 11 -23 41 -7 -55 20 6 -45 -78 -19 -38 -32 -56 -3 -3 -4 -7 -21 -19 -15 -28 6 35 6 36 -6 37 12
7944 12 4 18 59 50 75 0 2 -97 -40 3 19 -25 34 62 23 -56 -12 24 -86 9 -7 29 -13 -15 8 -95 -58 37 30 22 28 -3 0
7977 0 6 -25 -13 -14 9 16 13 11 -5 -34 -4 -36 -30 -50 -14 29 -73 -23 8 -8 -5 28 32 9 32 26 32 -17 -46 -27 13 -9 35 -8 -38
8012 -38 -92 16 48 1 -18 -22 27 -1 20 -52 11 -12 -5 23 -2 -3 33 -6 15 -6 -62 25 -7 -6 -28 10 1 -60 -24 19 -30 19
8044 19 10 -54 5 -5 13 -11 -44 -63 52 18 3 -2 37 36 -25 -26 -40 21 14 19 -29 -18 -14 -42 11 4 8 -2 6 0 -19 -47 -91 -28 46
8079 46 33 -34 -13 -13 21 -31 -6 3 -3 -37 27 34 4 -11 -124 -61 -45 -32 8 37 -3 27 2 -53 18 11 17 -20 56 68 37 -9 9
8112 9 -9 -41 16 12 47 70 -23 -18 -11 -21 -15 -28 26 9 24 -33 -23 -30 -87 -82 -3 33 10 85 -43 -15 5 -16 -23 41 -71 -24 13
8145 13 -9 -10 -18 -22 -20 -31 35 38 11 59 12 -42 -39 34 -19 47 45 7 -15 37 -65 -57 -16 61 28 20 44 18 -13 -69 -69 -24 -19 30 36 -18
8181 -18 22 12 -9 9 -3 38 16 52 4 6
8191F
$$ Imaginary data points
##PAGE= N=2
##DATA TABLE= (X++(I..I)), XYDATA
0 0 0 0 0 0 0 0 0 0 0 0 0 0 0 0 0 0 0 0 0 0 0 4 0 6 -8 7 -8 8 -8 12 -12 14 -14 16 -20 20 -22 27 -28 34 -34 39 -42 46
44 46 -53 54 -62 70 -76 85 -92 100 -114 124 -139 154 -172 194 -220 254 -294 347 -418 518 -670
65 -670 919 -1371 2400 -5694 38157 258822 317543 251646 111700 -121961 -301835 -299806 -179984
78 -179984 7131 219681 314200 239331 85163 -108476 -280447 -297405 -160837 19401 199370
89 199370 305615 238199 56560 -116823 -248666 -281613 -157807 37567 193850 274744 228083
100 228083 53388 -128758 -236043 -255570 -149705 45931 198101 248628 203023 51779
110 51779 -131083 -226888 -224329 -140244 32771 198996 241400 178050 52118 -118967 -235686
121 -235686 -217013 -110431 35178 186648 241855 161239 27542 -108617 -218008 -215392 -94382
132 -94382 48396 165166 225913 166487 16750 -117901 -197847 -202154 -97261 58227 166904
143 166904 203803 155946 19254 -123764 -191688 -182111 -94473 54334 172014 194663 138310
154 138310 19185 -121423 -193658 -166661 -77062 50891 165897 189566 120876 11179 -109590
165 -109590 -187516 -163393 -63498 52792 153706 187143 118157 -1929 -109622 -175735 -159900
176 -159900 -57241 63387 146602 172442 114672 -6599 -113593 -163352 -148135 -58028 66639
187 66639 148138 159279 105743 -4657 -116179 -161442 -133554 -51559 62504 147822 153806 92889
199 92889 -6085 -110404 -160422 -126799 -40837 61327 142488 151929 83934 -15250 -106271 -153804
211 -153804 -123207 -31924 65856 134134 144615 81097 -21048 -105953 -144382 -118306 -30148 70348
223 70348 131514 135389 76934 -23397 -108650 -138105 -108399 -27795 70852 131193 126926 69016
235 69016 -22640 -107436 -136390 -99783 -21927 68246 128843 123474 60305 -26133 -103132 -132718
247 -132718 -95042 -14635 68520 122678 119618 56167 -31156 -100720 -126138 -91846 -11265 71755
259 71755 118679 112498 52918 -33282 -101102 -120311 -84914 -8881 71815 116554 106572 47626
271 47626 -34688 -99933 -116318 -79390 -5804 71844 114181 101212 42732 -35396 -98434 -113269
283 -113269 -73541 -1634 70541 110877 97379 37506 -37779 -95346 -108803 -69747 1962 70866
295 70866 106887 93110 34302 -40039 -93759 -103951 -65709 4534 71760 103573 87287 30627
307 30627 -40973 -92557 -99620 -60487 6628 70980 101405 83364 26364 -42450 -91063 -96365
319 -96365 -56134 10034 70823 97780 78849 23129 -43085 -88880 -92388 -52416 11859 70281
331 70281 95354 75259 19612 -44675 -87307 -88599 -48396 14206 69799 92025 70855 16984
343 16984 -44557 -85239 -85406 -45219 15660 69173 89952 67597 13588 -45917 -83620 -81834 -41142
356 -41142 18017 67994 86498 64431 11354 -46371 -81356 -78887 -39265 19767 68584 83896
368 83896 60455 8894 -47124 -80285 -74828 -35156 20824 67181 81284 57234 6900 -46931
380 -46931 -78817 -72490 -32309 22197 66599 79535 53833 3545 -47358 -76332 -69273 -29122
392 -29122 23819 65079 76421 51436 1626 -47901 -74730 -66836 -26737 25869 64944 73638
404 73638 48190 -350 -48474 -72539 -63114 -24740 26106 64349 71230 45304 -1438 -48340
416 -48340 -71939 -60634 -21545 27068 63568 69343 41999 -3923 -47847 -69716 -57976 -19051
428 -19051 27706 61909 67348 39919 -5999 -47977 -67771 -55890 -16706 29728 61070 64205
440 64205 37390 -7544 -48298 -65672 -52740 -15060 30137 60387 61910 34841 -8921 -48545
452 -48545 -64309 -49848 -12655 30893 59746 59487 31647 -10138 -47830 -62842 -47404 -10334
464 -10334 30923 58434 58150 29594 -12072 -47569 -61156 -45359 -7898 32149 56852 55494 27406
477 27406 -13694 -47391 -58705 -43116 -6636 33089 56188 52830 25360 -14514 -47644 -57422
489 -57422 -40076 -4689 33147 55376 50825 22693 -15710 -46887 -55914 -38085 -2803 33643
501 33643 54372 49109 20489 -17131 -46651 -54127 -35803 -847 33928 52898 46944 18715 -17917
514 -17917 -45990 -52626 -34031 755 34372 51630 45304 17032 -19468 -45746 -50462 -32149 1627
527 1627 35085 50811 42545 15271 -19495 -45634 -49254 -29508 3158 34397 50014 41222 12882
540 12882 -20543 -44505 -47767 -27991 4746 34651 48497 39629 11617 -21526 -44010 -45966 -26509
553 -26509 5863 35199 47342 37428 10200 -22004 -43737 -44405 -24196 6903 34864 46260 35716
566 35716 8423 -22641 -42886 -42786 -22740 7937 35031 45302 33788 6838 -23129 -42449
578 -42449 -41509 -20653 9335 34626 44100 32336 5122 -23859 -41483 -39882 -19147 10579 34661
591 34661 42468 30668 4065 -24488 -40752 -37964 -17837 11148 34925 41388 28645 2953 -24558
604 -24558 -40399 -36545 -15927 11846 34364 40628 27060 1326 -24632 -39369 -35363 -14327 12766
617 12766 33779 39194 25724 153 -24924 -38393 -33987 -13117 13657 33479 37733 24506 -717
630 -717 -25371 -37506 -32279 -11973 14249 33430 36340 22666 -1600 -25406 -36818 -30712 -10605
643 -10605 14661 33059 35401 21052 -2538 -25229 -36097 -29399 -9061 15005 32239 34443 19733
656 19733 -3823 -25052 -34927 -28291 -7897 15763 31702 32950 18618 -4662 -25291 -33935 -26827
669 -26827 -6896 16372 31306 31429 17273 -5272 -25391 -33047 -25164 -5807 16532 30979 30416
682 30416 15608 -6100 -25120 -32314 -23857 -4470 16824 30388 29356 14322 -7017 -24906 -31365
695 -31365 -22667 -3356 17124 29472 28242 13471 -7817 -24807 -30220 -21575 -2496 17564 28871
708 28871 26882 12328 -8178 -24747 -29237 -20239 -1926 17678 28590 25654 11065 -8492 -24491
721 -24491 -28596 -18835 -763 17472 27904 24853 9879 -9229 -23954 -27644 -18039 35 17789
734 17789 27154 23726 8999 -9765 -23808 -26706 -16868 879 17842 26372 22708 8196 -10170
747 -10170 -23501 -25700 -15916 1388 18040 25894 21542 7302 -10480 -23208 -24705 -14776 1891
760 1891 17982 25334 20473 6386 -10620 -22899 -24131 -13680 2742 17654 24690 19799 5317
773 5317 -11121 -22255 -23141 -13021 3322 17798 23751 18708 4831 -11401 -21982 -22226 -12077
786 -12077 3749 17843 23233 17698 4032 -11520 -21628 -21400 -11106 4247 17550 22593 16954
799 16954 3313 -11721 -21153 -20589 -10363 4639 17415 21930 16025 2745 -11781 -20810 -19772
812 -19772 -9477 5046 17126 21361 15284 2077 -11938 -20239 -19023 -8881 5456 17059 20573
825 20573 14371 1527 -12084 -19898 -18247 -8065 5788 16924 19992 13616 990 -12053 -19417
838 -19417 -17490 -7397 6088 16684 19385 12926 387 -12145 -18937 -16736 -6806 6376 16446
851 16446 18708 12167 7 -12171 -18583 -16087 -6106 6563 16235 18149 11431 -466 -12107 -18068
865 -18068 -15427 -5501 6797 16002 17584 10757 -943 -12109 -17647 -14793 -4980 7138 15731 16958
879 16958 10211 -1374 -12167 -17107 -14042 -4449 7250 15523 16388 9556 -1699 -12164 -16676 -13414
893 -13414 -3904 7436 15274 15760 8855 -1972 -11971 -16354 -12825 -3424 7469 14998 15322 8322 -2399
908 -2399 -11911 -15879 -12297 -2926 7617 14564 14779 7871 -2781 -11767 -15354 -11762 -2627 7786 14279
923 14279 14141 7431 -2860 -11695 -14892 -11103 -2244 7770 14079 13614 6908 -3037 -11626 -14560 -10533
938 -10533 -1860 7790 13842 13119 6276 -3248 -11342 -14193 -10099 -1378 7778 13386 12702 5876 -3573
953 -3573 -11172 -13656 -9736 -1058 7862 13022 12184 5553 -3798 -11044 -13105 -9201 -806 7927 12749
968 12749 11660 5177 -3837 -11031 -12756 -8568 -576 7884 12584 11111 4632 -3929 -10756 -12448 -8133
983 -8133 -183 7810 12314 10746 4148 -4073 -10482 -12092 -7756 140 7773 11757 10365 3904 -4327
998 -4327 -10285 -11573 -7382 362 7785 11462 9871 3645 -4449 -10189 -11115 -6961 491 7792 11194
1013 11194 9319 3315 -4376 -10093 -10784 -6446 648 7613 11016 8920 2807 -4405 -9744 -10477 -6042
1028 -6042 961 7459 10621 8619 2494 -4580 -9489 -10096 -5813 1279 7491 10164 8298 2285 -4746
1043 -4746 -9373 -9584 -5490 1375 7453 9867 7805 2052 -4717 -9199 -9196 -5076 1436 7414 9780 7260
1059 7260 1715 -4671 -9035 -8964 -4605 1632 7210 9488 7055 1330 -4708 -8736 -8661 -4279 1976 7098
1075 7098 9144 6787 1114 -4862 -8516 -8306 -4133 2119 7099 8732 6362 1050 -4974 -8381 -7828
1090 -7828 -3780 2150 7051 8507 6023 796 -4823 -8184 -7549 -3425 2220 6947 8330 5672 546
1105 546 -4814 -8027 -7302 -3101 2344 6764 8075 5525 287 -4868 -7685 -7037 -3014 2476 6601 7718
1121 7718 5211 131 -4930 -7503 -6679 -2748 2564 6546 7362 4897 137 -4815 -7357 -6390 -2511 2583
1137 2583 6509 7253 4616 -67 -4761 -7196 -6153 -2258 2629 6328 7014 4374 -285 -4662 -6989
1152 -6989 -5916 -2051 2708 6105 6715 4204 -425 -4750 -6769 -5671 -1960 2752 6039 6487 3958
1167 3958 -460 -4710 -6560 -5477 -1829 2846 5999 6240 3704 -573 -4633 -6422 -5163 -1552 2789
1182 2789 5841 6111 3447 -743 -4530 -6336 -5030 -1380 2888 5685 5963 3306 -799 -4527 -6082
1197 -6082 -4819 -1223 2873 5573 5647 3192 -953 -4467 -5862 -4591 -1196 2857 5461 5486 3010 -949
1213 -949 -4424 -5748 -4374 -1041 2827 5373 5320 2826 -979 -4273 -5590 -4243 -884 2829 5226 5181
1229 5181 2723 -1021 -4286 -5421 -4059 -843 2801 5086 5027 2596 -1077 -4212 -5281 -4014 -734
1244 -734 2877 4966 4787 2447 -1134 -4176 -5159 -3791 -675 2775 4910 4628 2271 -1145 -4079 -4989
1260 -4989 -3675 -583 2752 4822 4549 2192 -1140 -4025 -4929 -3490 -486 2702 4670 4476 2135 -1238
1276 -1238 -3920 -4782 -3449 -480 2756 4568 4247 2034 -1175 -3820 -4659 -3350 -425 2679 4504 4176
1292 4176 1956 -1229 -3785 -4506 -3240 -356 2659 4432 4096 1888 -1212 -3733 -4466 -3170 -369 2694
1308 2694 4405 4008 1844 -1248 -3683 -4414 -3065 -310 2569 4208 3966 1785 -1289 -3627 -4337 -3007
1324 -3007 -271 2664 4201 3871 1767 -1242 -3595 -4251 -2987 -248 2522 4147 3777 1665 -1217 -3566
1340 -3566 -4165 -2885 -236 2470 4082 3738 1620 -1209 -3463 -4112 -2809 -193 2482 3960 3691 1615
1356 1615 -1198 -3429 -4089 -2728 -214 2485 3960 3632 1579 -1213 -3414 -4003 -2775 -201 2424 3939
1372 3939 3573 1552 -1223 -3358 -3988 -2753 -204 2412 3882 3528 1530 -1187 -3363 -3936 -2675 -155
1388 -155 2401 3846 3488 1469 -1163 -3288 -3865 -2647 -137 2402 3798 3443 1506 -1165 -3361 -3846
1404 -3846 -2662 -142 2470 3856 3408 1531 -1203 -3251 -3789 -2606 -141 2363 3764 3418 1505 -1111
1420 -1111 -3245 -3774 -2521 -142 2376 3721 3327 1440 -1193 -3241 -3699 -2588 -141 2323 3705 3347
1436 3347 1405 -1173 -3201 -3707 -2510 -88 2364 3733 3297 1370 -1187 -3189 -3724 -2442 -90 2318
1452 2318 3650 3282 1332 -1233 -3194 -3695 -2402 -61 2371 3685 3216 1294 -1236 -3180 -3706 -2461
1468 -2461 -80 2368 3662 3252 1352 -1215 -3224 -3673 -2372 -12 2370 3645 3230 1339 -1215 -3180
1484 -3180 -3635 -2363 4 2387 3594 3176 1237 -1280 -3185 -3636 -2356 29 2394 3627 3184 1285
1500 1285 -1273 -3207 -3598 -2330 53 2395 3617 3159 1202 -1348 -3185 -3622 -2264 59 2404 3600
1516 3600 3136 1111 -1338 -3172 -3592 -2295 149 2469 3594 3138 1123 -1381 -3198 -3562 -2188 197
1532 197 2475 3571 3018 1131 -1387 -3180 -3541 -2128 193 2438 3576 3034 1044 -1369 -3226 -3508
1548 -3508 -2120 185 2473 3482 3040 968 -1423 -3185 -3493 -2087 271 2497 3532 2980 970 -1465
1564 -1465 -3230 -3401 -2043 320 2486 3521 2913 899 -1513 -3229 -3467 -2007 315 2578 3552 2867
1580 2867 938 -1526 -3228 -3407 -1921 335 2551 3462 2842 832 -1616 -3246 -3420 -1894 441 2589
1596 2589 3532 2791 750 -1651 -3231 -3364 -1883 487 2627 3536 2776 702 -1715 -3292 -3302 -1741 540
1613 540 2680 3506 2729 644 -1757 -3319 -3282 -1757 628 2749 3453 2670 593 -1799 -3294 -3297 -1711
1630 -1711 705 2733 3491 2673 530 -1851 -3344 -3234 -1691 700 2752 3442 2570 477 -1884 -3342
1646 -3342 -3223 -1596 806 2871 3482 2475 427 -2005 -3361 -3177 -1494 871 2852 3521 2492 333
1662 333 -1958 -3415 -3133 -1499 941 2904 3486 2428 298 -2027 -3443 -3158 -1384 955 2876 3458
1678 3458 2460 217 -2090 -3371 -3127 -1363 1043 2996 3525 2404 108 -2198 -3400 -3067 -1287 1103
1694 1103 2987 3504 2334 116 -2235 -3535 -3035 -1211 1163 3040 3379 2242 -31 -2266 -3469 -3072
1710 -3072 -1201 1212 3045 3486 2223 -10 -2360 -3444 -3039 -1173 1328 3084 3444 2118 -130 -2350
1726 -2350 -3478 -2905 -1027 1303 3163 3426 2161 -179 -2419 -3504 -2941 -1044 1358 3177 3443 2085
1742 2085 -194 -2428 -3486 -2864 -918 1466 3220 3397 2037 -301 -2537 -3505 -2903 -858 1516 3241
1758 3241 3366 1974 -341 -2518 -3513 -2888 -857 1575 3219 3369 1959 -456 -2569 -3520 -2712 -743
1774 -743 1690 3257 3336 1833 -542 -2628 -3510 -2758 -697 1785 3305 3303 1805 -668 -2693 -3580 -2700
1791 -2700 -552 1779 3344 3270 1707 -632 -2791 -3460 -2601 -451 1888 3377 3267 1667 -775 -2838
1807 -2838 -3508 -2567 -461 1898 3354 3202 1574 -798 -2873 -3510 -2523 -314 2078 3353 3201 1493
1823 1493 -920 -2950 -3525 -2531 -279 2113 3458 3182 1410 -1044 -2966 -3566 -2452 -209 2219 3464
1839 3464 3146 1326 -1131 -2992 -3423 -2320 -138 2237 3452 3085 1259 -1158 -3043 -3499 -2306 20
1855 20 2223 3472 3071 1203 -1254 -3117 -3495 -2230 54 2319 3517 2986 1124 -1314 -3119 -3481
1871 -3481 -2211 137 2417 3532 2997 1051 -1419 -3127 -3477 -2095 227 2455 3521 2997 987 -1527
1887 -1527 -3250 -3452 -2068 318 2525 3535 2903 843 -1525 -3233 -3379 -1972 386 2613 3548 2868
1903 2868 754 -1617 -3330 -3395 -1904 510 2637 3612 2754 715 -1749 -3297 -3344 -1830 557 2712
1919 2712 3534 2679 556 -1828 -3315 -3306 -1718 684 2760 3516 2653 467 -1894 -3344 -3264 -1638 740
1936 740 2847 3542 2592 454 -1942 -3419 -3274 -1582 804 2866 3549 2560 372 -1991 -3409 -3263 -1508
1953 -1508 940 2893 3543 2482 275 -2087 -3450 -3112 -1432 977 2959 3504 2419 161 -2115 -3411
1969 -3411 -3122 -1357 1075 2970 3542 2349 95 -2225 -3498 -3079 -1254 1205 2984 3433 2299 -44
1985 -44 -2276 -3483 -2986 -1145 1266 3072 3399 2175 -100 -2301 -3451 -2950 -1018 1341 3053 3431
2001 3431 2092 -210 -2362 -3394 -2934 -951 1411 3178 3378 1972 -262 -2467 -3477 -2862 -865 1486
2017 1486 3153 3363 1967 -366 -2551 -3446 -2788 -789 1575 3189 3338 1889 -534 -2560 -3409 -2716
2033 -2716 -758 1718 3191 3243 1807 -549 -2624 -3460 -2679 -576 1746 3230 3286 1706 -609 -2683
2049 -2683 -3400 -2596 -498 1807 3289 3183 1645 -739 -2723 -3448 -2541 -411 1872 3295 3176 1519
2065 1519 -774 -2789 -3395 -2468 -308 1942 3251 3110 1473 -869 -2757 -3380 -2374 -201 1988 3294
2081 3294 2971 1333 -959 -2833 -3376 -2242 -94 2123 3284 3000 1207 -1019 -2881 -3295 -2162 11
2097 11 2183 3305 2910 1114 -1190 -2874 -3253 -2156 69 2238 3260 2870 1084 -1229 -2897 -3270
2113 -3270 -2000 171 2271 3267 2807 958 -1319 -2971 -3182 -1975 253 2335 3282 2756 851 -1384
2129 -1384 -2932 -3196 -1873 343 2327 3251 2642 724 -1504 -3000 -3141 -1808 404 2420 3317 2591
2145 2591 679 -1529 -3032 -3067 -1786 466 2463 3306 2530 657 -1627 -3016 -3074 -1633 545 2505
2161 2505 3213 2475 525 -1700 -3073 -3027 -1478 624 2584 3241 2388 376 -1708 -3042 -2992 -1446 706
2178 706 2596 3258 2294 301 -1830 -3095 -2900 -1319 891 2677 3165 2260 253 -1893 -3083 -2814 -1261
2195 -1261 929 2713 3157 2135 167 -1969 -3131 -2826 -1158 993 2673 3088 2079 52 -2002 -3065
2211 -3065 -2774 -1065 1083 2743 3140 1976 -77 -2016 -3104 -2732 -1045 1194 2764 3097 2021 -62
2227 -62 -2135 -3100 -2727 -892 1209 2766 3038 1871 -169 -2200 -3101 -2526 -830 1302 2856 3012 1760
2244 1760 -321 -2176 -3114 -2567 -762 1329 2918 2946 1678 -308 -2288 -3102 -2487 -655 1496 2892
2260 2892 2924 1631 -456 -2303 -3089 -2406 -568 1573 2877 2951 1573 -579 -2367 -3037 -2312 -486 1588
2277 1588 2935 2867 1434 -598 -2411 -3035 -2241 -363 1679 2931 2787 1384 -745 -2390 -3025 -2166 -304
2294 -304 1713 2960 2771 1297 -769 -2533 -2963 -2101 -188 1821 2940 2724 1207 -883 -2520 -2996
2310 -2996 -2066 -127 1865 2941 2619 1118 -923 -2606 -2957 -1977 -69 1913 2905 2555 997 -1027
2326 -1027 -2577 -2939 -1917 -15 1926 2969 2531 1011 -1071 -2601 -2919 -1791 74 2007 2926 2510
2342 2510 869 -1154 -2653 -2880 -1720 219 2022 2911 2456 819 -1192 -2697 -2824 -1647 259 2113
2358 2113 2920 2355 675 -1238 -2662 -2754 -1586 349 2146 2865 2307 704 -1378 -2671 -2708 -1525 465
2375 465 2177 2897 2245 515 -1343 -2684 -2682 -1463 448 2192 2830 2218 446 -1465 -2668 -2680 -1354
2392 -1354 635 2218 2859 2130 372 -1496 -2696 -2589 -1314 664 2297 2835 2007 290 -1554 -2662
2408 -2662 -2589 -1226 713 2291 2782 1953 221 -1652 -2655 -2506 -1090 794 2314 2771 1874 150 -1645
2425 -1645 -2699 -2432 -1083 808 2371 2741 1887 81 -1677 -2662 -2407 -959 863 2339 2688 1761 -35
2442 -35 -1793 -2671 -2337 -861 961 2370 2606 1641 -73 -1805 -2661 -2230 -772 1052 2376 2633 1605
2459 1605 -154 -1849 -2668 -2232 -744 1093 2417 2600 1485 -256 -1900 -2602 -2162 -644 1214 2394
2475 2394 2496 1476 -310 -1911 -2581 -2110 -561 1194 2377 2440 1389 -385 -1927 -2568 -1994 -489 1227
2492 1227 2455 2435 1329 -458 -2059 -2548 -1936 -407 1378 2400 2394 1248 -511 -2049 -2557 -1881 -322
2509 -322 1418 2404 2325 1143 -611 -2011 -2538 -1821 -238 1437 2437 2294 1050 -661 -2058 -2517 -1762
2526 -1762 -189 1429 2435 2231 971 -685 -2088 -2431 -1657 -105 1502 2448 2153 918 -753 -2119
2542 -2119 -2387 -1647 -37 1488 2371 2112 894 -812 -2120 -2388 -1542 31 1591 2374 2076 831 -921
2559 -921 -2133 -2371 -1505 41 1634 2341 1981 697 -1001 -2118 -2305 -1366 150 1660 2346 1948 680
2576 680 -997 -2140 -2291 -1343 236 1694 2359 1849 552 -992 -2161 -2253 -1247 278 1668 2317 1841
2593 1841 507 -1088 -2124 -2187 -1138 273 1766 2246 1786 385 -1101 -2144 -2103 -1176 442 1772 2250
2610 2250 1670 365 -1183 -2147 -2089 -1052 473 1773 2267 1667 361 -1157 -2124 -2043 -993 466 1810
2627 1810 2206 1584 198 -1214 -2178 -2048 -942 593 1790 2169 1543 176 -1253 -2131 -2014 -914 571
2644 571 1789 2137 1455 109 -1333 -2060 -1875 -806 672 1870 2078 1370 85 -1395 -2078 -1888 -750
2661 -750 690 1836 2094 1347 -27 -1356 -2086 -1753 -666 739 1845 2032 1289 -102 -1414 -2027 -1748
2678 -1748 -590 861 1853 2024 1180 -131 -1475 -2061 -1667 -540 849 1886 1963 1111 -192 -1471 -2016
2695 -2016 -1619 -495 904 1827 1953 1103 -221 -1493 -2003 -1605 -390 1000 1854 1897 1043 -250 -1499
2712 -1499 -2003 -1539 -400 1005 1824 1828 997 -355 -1480 -1942 -1475 -325 985 1864 1792 900 -376 -1545
2730 -1545 -1947 -1423 -287 1013 1899 1683 871 -454 -1519 -1930 -1313 -145 1095 1836 1732 792 -531
2747 -531 -1593 -1827 -1268 -139 1145 1835 1670 735 -513 -1519 -1819 -1269 -87 1110 1767 1657 687 -542
2765 -542 -1566 -1823 -1230 -39 1156 1810 1604 592 -634 -1566 -1758 -1178 37 1149 1761 1581 583 -666
2783 -666 -1557 -1710 -1102 56 1201 1783 1549 514 -664 -1568 -1705 -1045 153 1196 1767 1504 492 -698
2801 -698 -1543 -1635 -974 183 1169 1671 1400 431 -758 -1543 -1602 -964 173 1277 1730 1313 381 -797 -1562
2820 -1562 -1612 -859 229 1252 1621 1311 342 -828 -1570 -1594 -818 246 1272 1629 1256 280 -835 -1549
2838 -1549 -1487 -765 306 1275 1586 1192 244 -823 -1522 -1481 -694 419 1333 1584 1121 170 -929 -1515 -1456
2857 -1456 -730 392 1332 1567 1089 122 -927 -1555 -1365 -598 435 1274 1545 1040 114 -947 -1514 -1350
2875 -1350 -574 503 1292 1522 1006 25 -937 -1518 -1300 -572 472 1332 1519 990 -8 -987 -1491 -1304 -490
2894 -490 549 1278 1445 888 -48 -968 -1480 -1244 -480 645 1294 1451 825 -98 -965 -1452 -1173 -333 570
2913 570 1309 1383 858 -136 -1028 -1393 -1116 -377 583 1293 1343 749 -187 -1056 -1402 -1135 -317 642 1245 1349 748
2934 748 -213 -1030 -1325 -1080 -252 651 1278 1310 693 -242 -1051 -1387 -1026 -289 735 1234 1273 614 -279 -1069
2954 -1069 -1390 -983 -155 755 1274 1243 614 -380 -1061 -1290 -921 -112 759 1235 1223 592 -294 -1050 -1280 -933
2974 -933 -143 777 1243 1185 527 -347 -1072 -1260 -841 -95 793 1237 1126 521 -440 -1065 -1226 -815 -41 779
2994 779 1221 1086 433 -362 -1051 -1181 -800 14 809 1148 1059 406 -380 -1048 -1219 -776 32 796 1246 1001
3014 1001 392 -451 -1060 -1154 -715 71 818 1166 961 387 -464 -1019 -1135 -726 56 842 1190 990 363 -504
3034 -504 -1097 -1105 -682 79 819 1232 913 335 -466 -1078 -1098 -619 167 825 1185 909 247 -522 -1041 -1064 -567
3055 -567 148 863 1144 833 219 -525 -1029 -1037 -579 148 811 1122 823 226 -508 -1093 -1015 -533 187 873 1098
3076 1098 804 95 -582 -1012 -989 -521 244 821 1038 830 99 -544 -978 -1001 -434 284 875 994 794 125
3096 125 -643 -992 -923 -423 285 886 1014 752 80 -592 -978 -990 -476 285 840 1012 733 90 -584 -1021 -880
3117 -880 -364 347 911 995 646 68 -559 -992 -863 -313 305 850 928 652 -15 -659 -993 -822 -341 395 907
3138 907 968 583 18 -632 -980 -829 -302 376 861 933 596 -71 -693 -941 -826 -295 353 878 918 577 -51
3159 -51 -677 -922 -795 -219 324 866 945 540 -80 -688 -914 -767 -216 395 819 873 555 -94 -666 -918 -752
3180 -752 -224 433 818 865 485 -115 -705 -882 -722 -170 429 802 815 467 -139 -704 -866 -645 -130 433 861
3201 861 843 455 -170 -680 -875 -643 -125 457 815 858 442 -177 -701 -841 -661 -93 492 806 855 384 -259
3222 -259 -659 -846 -660 -108 486 846 720 416 -225 -683 -858 -554 -83 438 846 794 367 -224 -701 -856
3242 -856 -558 -48 481 799 755 361 -280 -641 -788 -556 -60 516 791 739 274 -235 -667 -791 -578 7 469
3263 469 780 713 288 -258 -732 -758 -500 -41 546 779 676 195 -250 -709 -748 -497 35 530 798 683 176
3284 176 -271 -652 -726 -444 81 561 783 641 250 -320 -683 -755 -436 61 552 792 610 259 -251 -633 -743
3305 -743 -417 117 539 764 545 203 -325 -756 -730 -397 54 538 732 617 179 -322 -658 -729 -417 43 538
3326 538 741 602 147 -350 -673 -694 -349 164 571 739 548 174 -360 -659 -684 -334 141 585 720 513 112
3347 112 -337 -653 -595 -307 221 622 732 534 119 -359 -664 -628 -365 120 561 715 516 70 -391 -720 -653
3368 -653 -346 153 565 704 485 41 -344 -693 -636 -271 190 560 673 477 100 -399 -607 -619 -277 171 507
3389 507 665 394 6 -364 -609 -615 -250 178 561 677 437 11 -413 -685 -572 -220 209 558 678 453 1
3410 1 -432 -671 -576 -263 257 508 643 452 19 -373 -651 -536 -271 228 623 667 405 61 -393 -627 -505
3431 -505 -202 201 562 647 377 -10 -386 -633 -485 -208 263 489 627 405 -47 -377 -585 -507 -153 264 484
3452 484 655 370 -16 -461 -657 -539 -173 233 599 549 395 8 -406 -620 -483 -153 279 529 590 352 -12
3473 -12 -401 -590 -433 -173 298 534 553 350 -97 -446 -627 -470 -144 243 595 564 353 -113 -455 -537 -444 -119
3495 -119 283 520 484 255 -136 -436 -597 -391 -94 330 549 513 275 -121 -418 -533 -448 -96 346 546 498
3516 498 217 -130 -420 -544 -423 -107 292 538 516 266 -167 -443 -575 -409 -31 323 590 499 198 -118 -440
3537 -440 -546 -419 -57 318 510 495 221 -177 -443 -490 -392 -75 316 547 480 228 -156 -435 -531 -335 -34 336
3559 336 518 482 303 -167 -384 -475 -377 -20 302 510 472 216 -163 -414 -517 -322 22 336 437 418 225 -144
3581 -144 -400 -560 -337 -13 328 525 439 213 -128 -456 -504 -343 -7 359 490 419 161 -167 -455 -486 -362
3602 -362 16 338 546 373 142 -169 -399 -529 -291 52 337 532 408 132 -239 -495 -497 -342 32 383 480
3623 480 406 142 -201 -431 -448 -276 70 339 512 422 121 -246 -431 -470 -249 31 390 509 419 96 -225 -463
3645 -463 -482 -233 50 322 511 432 104 -263 -470 -493 -261 48 344 498 372 11 -257 -462 -458 -231 111 401
3667 401 478 387 78 -204 -454 -428 -229 57 344 503 395 110 -219 -478 -439 -255 109 387 528 348 31
3688 31 -278 -440 -436 -207 129 347 496 338 69 -279 -487 -451 -193 115 439 454 305 48 -261 -429 -451 -200
3710 -200 122 369 490 338 56 -302 -496 -384 -194 134 409 484 315 31 -273 -457 -406 -182 89 392 430
3731 430 285 -30 -349 -426 -392 -187 111 395 450 348 21 -270 -429 -394 -157 146 394 409 323 -22 -265 -429
3753 -429 -399 -176 126 354 463 308 53 -298 -475 -402 -173 171 377 453 256 -20 -301 -472 -388 -137 108
3774 108 448 402 296 -9 -306 -446 -372 -74 164 406 434 223 8 -296 -421 -395 -133 178 408 490 284 -37
3796 -37 -326 -418 -387 -67 154 411 444 267 -36 -314 -415 -326 -85 231 479 440 239 -76 -335 -460 -391 -110
3818 -110 211 445 436 193 -113 -348 -420 -332 -111 163 404 375 189 -80 -353 -472 -348 -45 222 431 429 255
3840 255 -63 -316 -484 -356 -63 206 408 393 198 -43 -308 -411 -294 -18 260 435 393 237 -102 -349 -470
3861 -470 -352 -73 214 455 435 172 -141 -371 -466 -309 -37 207 380 383 182 -81 -374 -461 -336 -11 239 404
3883 404 379 248 -102 -340 -408 -304 -13 257 392 413 217 -150 -377 -454 -328 7 307 440 380 169 -126 -385
3905 -385 -452 -299 15 209 370 375 104 -113 -381 -422 -304 39 282 454 413 95 -205 -387 -422 -253 2 298
3927 298 423 342 121 -141 -359 -436 -269 29 309 431 359 155 -208 -368 -426 -221 14 246 388 362 130 -214
3949 -214 -406 -431 -225 67 298 402 391 93 -158 -449 -378 -282 39 313 458 316 103 -187 -354 -408 -204 51
3971 51 272 417 342 101 -244 -393 -438 -240 44 337 461 310 134 -249 -402 -463 -232 76 341 425 343 68
3993 68 -234 -387 -391 -243 106 289 426 328 95 -238 -473 -396 -198 122 349 419 336 69 -267 -391 -397 -196 110
4016 110 351 405 300 76 -225 -428 -399 -169 114 316 463 342 -5 -271 -397 -442 -182 107 351 455 286
4037 286 67 -295 -408 -400 -157 137 403 423 276 12 -257 -415 -350 -141 173 352 408 278 32 -284 -431 -409
4059 -409 -179 170 365 453 267 19 -269 -461 -372 -105 154 372 380 247 -13 -342 -429 -376 -135 143 394 488
4081 488 266 3 -293 -451 -324 -99 145 433 339 218 -82 -291 -400 -354 -93 232 380 427 239 -40 -310
4102 -310 -392 -296 -134 205 426 391 181 -9 -265 -411 -336 -68 212 377 442 219 -98 -295 -425 -331 -94 164
4124 164 401 444 218 -98 -317 -410 -300 -108 238 377 411 203 -109 -328 -424 -302 -78 232 441 365 211 -87
4146 -87 -366 -424 -295 -35 238 430 380 184 -103 -344 -408 -302 -9 287 382 368 131 -89 -373 -407 -283 -27
4168 -27 244 402 384 179 -124 -337 -452 -262 -14 275 432 332 90 -117 -398 -445 -287 8 298 471 360
4189 360 133 -133 -422 -390 -304 -13 306 414 372 134 -136 -353 -430 -265 26 270 387 321 99 -176 -438 -383
4211 -383 -255 25 316 443 376 79 -221 -373 -345 -267 76 317 434 350 126 -161 -386 -401 -187 56 288 468
4233 468 337 127 -179 -349 -367 -219 57 302 400 288 126 -183 -391 -359 -177 45 328 412 324 35 -178 -373
4255 -373 -380 -207 55 337 404 280 25 -219 -401 -377 -193 73 420 476 308 55 -261 -352 -317 -158 103 369
4277 369 444 321 -23 -240 -336 -405 -161 82 349 393 308 13 -237 -403 -348 -82 187 331 388 259 6 -270
4299 -270 -379 -335 -141 129 333 387 275 19 -244 -378 -334 -159 175 388 405 304 -5 -205 -370 -329 -89 139
4321 139 367 369 253 28 -270 -401 -311 -99 139 379 371 232 -57 -290 -392 -313 -63 180 348 382 209 -4
4343 -4 -273 -433 -287 -75 161 362 364 217 -33 -253 -374 -286 -79 181 335 397 162 -33 -250 -416 -337 -105
4365 -105 196 298 331 151 -82 -226 -399 -329 -83 183 370 327 172 -65 -293 -390 -260 -7 201 342 362 223
4387 223 -156 -283 -354 -270 -35 234 411 346 196 -95 -268 -385 -258 -82 207 346 361 154 -107 -323 -341 -229
4409 -229 7 237 380 345 130 -93 -259 -322 -258 -34 258 359 330 159 -132 -321 -361 -228 -15 221 393 334
4431 334 124 -100 -311 -347 -172 -15 234 316 254 114 -126 -309 -362 -220 31 244 346 370 84 -150 -375 -376
4453 -376 -249 29 244 350 280 104 -163 -301 -383 -265 42 259 323 295 90 -170 -315 -345 -176 86 252 373
4475 373 293 103 -153 -358 -312 -178 54 262 311 224 115 -139 -320 -327 -161 36 255 360 293 45 -157 -300
4497 -300 -308 -139 98 269 280 237 62 -148 -300 -306 -181 99 293 287 291 33 -175 -315 -316 -159 107 321 387 287
4521 287 -33 -124 -336 -293 -137 106 323 370 245 27 -169 -268 -307 -163 100 246 360 213 2 -269 -283 -294
4543 -294 -151 52 220 367 212 112 -203 -350 -281 -104 72 306 314 266 0 -180 -318 -248 -85 119 263 320
4565 320 198 -17 -241 -337 -262 -88 99 287 353 195 4 -176 -312 -262 -87 149 246 364 199 -43 -203 -269
4587 -269 -271 -95 134 260 249 185 -41 -246 -268 -255 -175 150 253 296 195 40 -198 -253 -229 -43 151 288 277 157
4611 157 32 -208 -273 -275 -93 175 326 242 185 -36 -242 -275 -222 -65 169 311 259 194 -25 -198 -316 -185 -67
4634 -67 129 267 279 172 -29 -252 -333 -199 -62 204 248 281 118 -38 -261 -294 -216 -46 191 278 257 180 -26
4657 -26 -248 -300 -185 -46 119 322 203 117 -18 -278 -281 -179 -44 148 282 226 130 -29 -230 -307 -168 16 168
4680 168 317 236 92 -112 -226 -269 -213 -13 154 233 251 129 -120 -228 -248 -204 22 159 280 218 52 -117 -222
4703 -222 -334 -218 27 191 296 212 77 -79 -264 -229 -218 -21 176 310 264 94 -159 -308 -284 -204 -18 152
4725 152 236 239 68 -126 -212 -228 -132 46 206 247 255 114 -94 -200 -209 -158 12 206 275 229 29 -81 -230 -226 -109
4750 -109 35 191 201 167 50 -92 -237 -253 -120 11 207 264 167 82 -118 -226 -238 -137 62 229 245 198 48
4773 48 -126 -222 -261 -100 23 166 181 153 19 -72 -259 -267 -166 94 210 250 129 67 -146 -223 -185 -81 56 209
4797 209 199 179 39 -159 -251 -191 -138 42 189 216 234 57 -113 -261 -197 -58 111 181 229 158 54 -168 -219 -200
4821 -200 -81 79 214 243 134 33 -158 -223 -213 -79 55 202 242 155 9 -163 -296 -140 -126 69 167 188 70
4844 70 51 -105 -198 -194 -75 74 145 225 154 6 -140 -228 -209 -74 109 239 237 138 -27 -146 -192 -176 -88 104 181 250
4870 250 75 5 -151 -200 -188 -104 56 162 195 112 -43 -157 -179 -147 -13 113 214 167 132 -1 -122 -183 -150 -67
4894 -67 93 205 203 145 23 -131 -135 -175 -85 73 201 187 137 -6 -129 -252 -167 -67 88 170 180 86 -16 -179 -187
4919 -187 -131 -76 82 170 192 69 1 -181 -249 -199 -54 81 155 114 87 -9 -131 -240 -148 3 75 194 186 91 -7 -172
4945 -172 -170 -136 -79 123 187 142 52 -46 -209 -221 -122 20 63 148 185 83 -59 -134 -213 -109 -58 94 211 211 127 -71
4971 -71 -162 -166 -75 -36 99 232 178 63 -9 -203 -141 -147 -8 117 188 160 47 -79 -115 -154 -122 54 116 180 133 116 -53
4998 -53 -201 -201 -134 26 134 154 110 53 -39 -113 -211 -139 6 50 207 186 90 -11 -125 -149 -69 -28 162 130 150 69 -74
5025 -74 -152 -148 -122 17 173 146 167 68 -41 -122 -147 -107 7 76 219 122 33 -109 -112 -119 -84 68 148 176 148 19 -21 -164
5053 -164 -170 -63 34 55 146 108 -13 -90 -145 -176 -117 37 95 196 175 70 -16 -144 -135 -105 -5 65 151 115 89 -82 -108
5080 -108 -167 -116 19 98 180 78 11 -73 -209 -145 -60 39 135 145 113 23 -81 -117 -200 -122 38 127 179 114 -5 -94 -167
5107 -167 -140 -98 44 47 144 122 37 -58 -141 -98 -63 25 114 152 98 43 -53 -175 -199 -134 58 121 148 43 0 -162 -124 -83
5135 -83 -71 70 110 149 114 17 -122 -147 -112 -65 58 167 155 102 1 -10 -110 -150 0 37 135 144 82 -27 -102 -185 -143
5162 -143 -46 43 99 134 123 -15 -88 -101 -91 -51 31 124 126 91 40 -84 -168 -150 -29 81 145 115 85 -27 -76 -105 -91 -74
5190 -74 105 79 106 70 -78 -94 -104 -54 -47 101 134 63 124 58 -95 -128 -160 -28 61 110 120 91 8 -90 -147 -109 -46 136
5218 136 149 133 70 -9 -141 -119 -100 -70 67 120 113 82 19 -77 -99 -77 -15 29 111 128 102 -13 -93 -89 -61 -45 45 120 106
5247 106 51 -64 -68 -107 -94 -17 63 72 99 41 -8 -129 -108 -138 -56 29 76 77 111 -14 -101 -156 -137 -53 67 128 124 110 -31
5276 -31 -94 -120 -85 -43 37 139 112 80 -11 -103 -114 -76 -33 101 74 126 17 -70 -127 -93 -71 -25 70 140 117 94 -35 -82
5304 -82 -113 -104 -25 15 119 62 45 -28 -86 -142 -35 0 77 93 151 43 -56 -152 -103 -57 0 75 110 180 81 15 -66 -98 -104 20
5334 20 45 63 74 61 -45 -139 -144 -85 -10 47 106 132 29 -73 -45 -149 -88 -61 99 131 65 33 -29 -42 -78 -55 14 98
5362 98 93 35 65 -57 -60 -104 -62 42 75 88 104 73 -43 -19 -56 -107 0 20 104 74 8 -75 -104 -163 -29 -47 90 59
5390 59 90 45 -34 -96 -88 -88 -37 113 75 148 -32 -61 -52 -121 -66 -14 42 107 69 67 23 -107 -115 -72 25 83 87 80 22 -10 -75 -55
5422 -55 -36 -37 54 67 89 79 -62 -126 -140 -39 -10 76 106 51 21 -26 -163 -99 -32 -52 89 75 76 52 -42 -144 -131 -90 -19
5451 -19 74 149 112 30 -52 -97 -95 -21 -18 54 122 57 27 -36 -100 -132 -37 -4 119 110 66 82 -32 -86 -141 -123 -39 96 129 120 86
5482 86 -14 -61 -74 -60 51 30 159 35 31 -76 -79 -135 -60 38 33 106 68 52 -56 -81 -67 -20 69 85 61 72 76 -59 -56
5511 -56 -90 -43 31 20 27 71 68 -55 -63 -79 -24 -44 87 72 41 39 -40 -61 -138 -22 46 54 119 102 75 -82 -65 -132 -61 62
5541 62 81 105 57 -72 -96 -91 -83 -26 27 81 73 30 -34 -38 -117 -99 -47 47 75 138 40 -7 -71 -107 -56 25 66 96 102 42 -30 -79
5573 -79 -87 -59 -38 28 119 116 10 -1 -94 -114 -55 -7 41 48 76 41 -14 -90 -97 -62 -27 20 89 71 32 -8 -96 -104 -49 20 55 86
5605 86 70 71 40 -66 -127 -53 -25 43 59 71 85 -12 -58 -80 -45 -2 61 116 141 79 -38 -108 -49 -48 16 39 116 70 56 -8
5635 -8 -81 -129 -42 -39 24 73 72 8 -14 -71 -138 -70 12 49 95 51 30 -9 -64 -90 -110 -21 96 137 153 -7 -24 -79 -141 -70 9
5666 9 106 53 82 -27 -4 -39 -134 -94 21 48 95 83 14 -44 -97 -77 -71 15 54 95 60 30 -28 -33 -88 -48 -8 38 83 54 23
5697 23 1 -77 -90 -19 -43 43 123 54 35 -81 -92 -53 -24 -37 90 111 40 18 -80 -97 -37 -65 23 97 44 66 7 -24 -95
5726 -95 -45 -26 -13 60 80 64 -3 -74 -73 -72 -34 14 94 88 53 17 -36 -66 -126 -35 53 53 101 137 66 -21 -103 -57 -51 42 85 118 119
5759 119 -23 -83 -134 -124 -94 25 105 63 98 51 -29 -78 -41 -31 41 66 99 104 -5 -63 -86 -89 -21 13 105 138 4 19 -37
5788 -37 -121 -108 -14 11 59 72 0 42 -47 -54 -62 -68 31 90 55 13 -12 -52 -84 -53 -50 -1 52 36 21 -7 -48 -78 -43 -40 18 60 60
5821 60 3 -16 -51 -34 -78 8 37 85 109 100 1 -31 -82 -59 -41 29 53 113 38 -15 -21 -106 -53 -6 23 94 112 70 -13 -43 -131
5852 -131 -39 10 26 23 66 40 -26 -44 -52 -74 -66 49 123 90 68 -8 -59 -48 -71 -30 55 11 95 56 -16 -88 -94 -73 -28 42 7
5883 7 76 -2 -2 -91 -72 -99 18 32 47 48 -14 -36 -33 -75 -107 9 67 93 76 116 -43 -52 -102 -88 5 45 80 107 27 -12 -33
5914 -33 -111 28 6 18 71 105 91 -11 13 -76 -27 -11 67 107 73 52 -34 -85 -85 -68 -25 26 71 95 -13 -1 -71 -94 -28
5943 -28 0 112 94 82 23 -88 -110 -94 -46 37 85 113 73 53 11 -38 -41 -101 60 96 30 91 5 -44 -63 -88 -92 -54 43 58
5973 58 96 26 -49 -79 -47 -43 6 56 94 91 -14 -43 -90 -61 -63 59 59 88 99 6 -30 -60 -87 -46 47 66 77 83 20 -83 -103
6004 -103 -37 -55 -4 69 61 60 -11 -3 -61 -83 -25 19 92 51 115 36 -76 -86 -70 -65 1 62 51 23 53 -74 -92 -85 -19 -2 15
6035 15 77 77 -16 -39 -59 -91 -37 49 103 28 84 33 -49 -31 -31 -33 32 43 97 38 23 -65 -44 -122 -3 64 58 30 50 47 -52 -84
6067 -84 -84 -32 36 114 126 48 -1 -62 -86 -72 -54 62 114 35 24 -33 -54 -114 -107 -17 59 87 134 57 18 -73 -27 -59 -29 58 -2
6098 -2 77 18 -28 -49 -81 -47 -48 8 88 89 30 42 -53 -62 -48 37 62 5 75 38 9 -96 -19 -21 -6 33 47 68 10 -6 -100 -76
6130 -76 -59 -19 19 115 119 0 -3 -79 -102 -68 -43 37 29 79 62 -5 -75 -53 -31 -22 48 103 65 43 -65 -89 -62 -47 -21 46 40 82
6162 82 6 -18 -26 -62 -4 16 41 104 89 6 -48 -57 -54 -53 16 29 93 61 -4 -15 -70 -28 -19 24 27 122 81 -19 -27 -77 -78 -75 24 28 91
6197 91 52 -37 -16 -88 -42 -10 -3 49 93 41 7 -56 -74 -30 -9 -40 40 88 38 24 -17 -61 -87 -49 -43 33 109 65 -8 -60 -72
6228 -72 -76 -35 -10 40 83 51 5 -101 -71 -60 -59 1 67 67 65 11 -43 -86 -60 -45 -10 51 61 100 49 -4 -35 -68 6 9 56 92
6260 92 43 41 -36 -80 -61 -12 15 75 139 41 42 -50 -32 -50 -64 -23 4 12 15 -2 -35 -48 -114 -42 41 74 76 62 44 -59 -34 -13
6292 -13 -15 82 105 109 18 -70 -29 -72 -76 -12 16 39 26 60 -34 -33 -73 -26 -33 28 75 41 35 22 -50 -60 -61 -23 55 54 50 -6 2 -16 -62
6327 -62 -67 13 5 36 77 52 -10 13 -22 -76 -8 24 73 55 12 65 -62 -68 -27 -12 -20 67 66 31 -36 -25 -109 -51 35 -6 103 -6
6359 -6 31 11 -51 -51 -24 -57 39 -1 91 15 2 -49 -90 -72 3 50 53 48 -17 -70 24 -57 -40 -13 23 108 62 18 -67 -73 -31 -38 -26
6392 -26 102 74 37 14 -12 -29 -52 -102 24 21 24 5 -3 -20 -83 -94 -78 23 15 43 48 24 8 -60 -31 -5 40 67 42 98 0
6423 0 -40 -58 -40 -64 39 61 87 68 36 -62 -49 -83 -18 21 -28 69 37 -3 -97 -111 -74 -7 -22 33 70 44 38 -34 -22 -22 -41
6454 -41 -42 33 91 51 54 -25 -27 -54 -18 -13 61 58 54 -20 -49 -23 -15 -46 11 69 45 42 23 -65 -72 -110 -68 -22 21 26 -11 59 19 -53 -74
6489 -74 11 0 56 45 14 -4 -32 -90 -44 -13 19 61 12 68 -27 -87 -40 -21 -14 7 46 94 21 -10 -26 -30 -27 -34 57 39 74 46
6521 46 2 -25 -52 -33 -59 31 72 68 60 -14 -32 -100 -17 3 -2 52 47 41 53 -9 -71 -121 7 12 49 97 77 -1 -46 -36 -33 24 23 58
6555 58 63 69 -43 -29 -43 -1 -26 36 18 75 -36 16 3 -63 -68 -15 47 40 86 -20 8 -20 -113 -17 9 -39 34 64 94 45 -80
6586 -80 -103 -6 -27 10 73 52 80 4 -49 -91 -63 11 35 60 53 58 27 -57 -70 -74 -4 52 72 22 37 -28 -45 -36 -68 35 -30 104
6618 104 74 21 -24 -81 -65 -35 -9 61 66 54 30 -17 -49 -90 -35 12 45 12 0 58 -20 -24 -29 -6 30 31 51 39 -36 -22 -15 -82
6650 -82 -40 26 3 97 39 14 -60 -28 -30 -44 -23 25 74 46 16 -50 3 -31 -16 -31 5 -13 29 16 43 -70 -75 -23 27 69 25
6681 25 7 17 -41 -90 -73 -27 30 38 40 25 3 -58 -27 -21 -33 11 11 40 14 -1 -37 -45 -88 -15 8 107 64 45 31 -20 -26 -23 -13 16
6715 16 -5 90 -30 2 -49 -65 -11 9 29 25 52 11 -37 -54 -50 -46 -20 -10 23 56 19 41 -46 -66 -61 -10 -49 40 39 58 22 -63
6747 -63 -69 -33 -36 -22 6 11 22 -41 -39 -53 -6 4 9 42 16 29 -20 -36 -49 25 2 -4 99 44 3 -5 -25 -36 -79 -31 37 13 42
6780 42 46 12 0 -85 -36 -24 25 34 7 58 -17 -29 -76 -42 29 75 41 46 62 -22 -35 -48 -44 6 46 49 34 11 30 -68 -39 -43 -68
6813 -68 46 17 92 92 -34 -52 -36 -44 -40 34 2 38 42 -43 3 -27 -5 -23 17 43 31 11 38 -59 16 -34 -28 40 8 50 -12 -4
6845 -4 -21 -11 -12 -17 45 11 35 -12 -14 -75 12 -28 -44 70 59 4 -49 -15 -65 -78 -2 5 -12 18 30 38 -35 -31 6 -22 -42 24 7
6878 7 42 22 0 -65 -28 -1 3 16 33 109 11 -25 -37 -49 -26 -23 46 22 38 42 -36 -78 12 -58 -75 -26 20 25 12 -15 -47 -79 -34
6911 -34 15 -3 55 -18 -19 8 6 -40 -20 -29 19 69 42 25 8 -24 -27 -9 53 -9 112 7 -16 -8 -31 -59 -46 15 46 53 9 -43
6943 -43 17 -58 -62 -17 -15 43 42 28 -2 -50 -50 -52 -45 0 13 49 57 22 -69 -62 -33 32 -16 62 -9 46 37 20 -21 -47 -52 36 60 19 -11
6978 -11 -9 -23 -22 -39 10 -12 29 27 44 -18 -28 -24 -54 -52 3 8 22 27 -7 -6 -44 -14 21 9 25 50 47 20 -36 -50 17 -10 17 26 37
7013 37 55 67 -5 -55 -53 -40 1 36 55 28 0 -48 -36 -39 -51 -27 12 40 42 -36 -35 -5 7 -21 90 53 54 -18 25 -51 -46 -57 -6
7046 -6 1 -3 37 -7 8 13 -34 -48 36 18 26 25 30 -23 -17 -34 15 -85 -29 13 42 -8 -29 -25 -59 -5 -8 35 35 14 34 -24 -20 -11 -15 -11 -34
7083 -34 84 -8 19 -5 -23 -59 -53 -32 25 12 13 9 -27 6 -43 -4 -10 -19 60 25 35 -5 6 -20 7 48 8 47 54 -14 -32 -18 -107
7116 -107 -38 -49 19 69 48 60 7 -11 -36 -42 -12 22 29 4 -26 -2 -76 -28 -21 37 41 37 84 5 4 4 -33 6 29 49 -3 30 8
7149 8 -57 -64 -48 -57 -16 -19 98 -8 35 -14 8 -20 -19 -5 0 22 45 58 -48 -66 -41 11 48 27 22 85 0 -49 -13 -26 -29 7 19
7182 19 14 13 46 40 -7 -79 -1 -4 7 91 16 -29 40 -23 -45 -18 -7 12 70 -19 -10 23 15 -38 -36 -8 31 34 55 39 -67 -1 -51 55
7216 55 2 21 64 22 -16 -6 6 -36 23 -24 20 89 40 29 -30 -75 16 -18 36 31 -7 96 1 2 -32 -32 -47 8 10 -8 15 19
7248 19 -44 -52 3 -7 -3 46 -25 53 22 14 22 -57 8 -16 53 28 19 55 1 37 21 -2 19 58 48 -13 -46 -31 -30 -48 -3 9 42
7281 42 -13 40 -10 -4 -42 -9 4 -63 51 31 11 31 7 41 -65 -49 -1 73 -13 -16 56 1 -10 -38 -16 74 12 69 -2 26
7311 26 30 19 46 40 7 73 34 47 31 -66 1 -21 -28 -23 -17 0 -30 -40 -15 8 -1 -33 -1 36 38 -31 -1 -11 -27 -35 -9 34 30 7 -5
7346 -5 5 11 40 -11 -53 59 34 28 32 20 -11 4 8 -9 -15 1 -13 23 -11 -65 11 26 6 32 17 -35 -29 -48 1 -64 -38 1 38
7379 38 18 -10 -9 12 21 28 -11 -75 -15 -7 -1 37 22 -12 4 -31 -24 -27 7 72 -12 -26 25 -117 -57 2 -19 24 -17 35 -11 -14 -31 -57
7413 -57 -61 30 29 -10 18 35 -3 -35 -55 24 30 11 22 39 11 3 9 10 31 51 15 57 -27 -9 24 -44 -41 1 10 27 53 41 26 -49
7447 -49 -8 28 17 42 16 60 -57 -14 -48 -43 -47 26 -24 2 26 50 -41 -25 9 -72 -46 6 19 33 13 -17 -21 5 66 20 26 42
7479 42 69 60 -31 4 -12 21 47 -39 9 -27 -27 -28 -9 -25 -51 15 56 -16 -3 -39 -50 -7 -24 -36 10 33 41 6 43 -32 13 -50
7511 -50 15 17 6 49 50 27 26 -5 12 18 5 49 66 12 0 -19 -38 -40 31 -52 -6 -11 25 39 -43 -90 16 -2 -28 32 13 -7 8
7544 8 29 20 -13 17 10 -45 10 -81 -17 8 -69 -31 16 0 13 10 1 -35 -23 4 -30 22 45 17 28 39 -52 -11 -5 -48 5 3 8 -13
7578 -13 -61 25 25 -53 -35 -39 15 -13 -78 32 3 -14 -38 -39 -12 19 49 62 -4 60 76 -4 -1 -16 28 52 8 -37 -2 -28 3 6
7610 6 -47 10 -19 -23 -42 4 -54 -45 -76 7 21 29 54 31 -13 -39 -69 -39 2 -3 28 4 45 16 12 16 15 35 -7 -21 38 6 -35 30
7644 30 -21 2 44 9 24 15 29 2 -18 4 -52 12 8 30 -5 33 24 26 9 -37 -72 21 -26 -50 29 -26 -38 -21 -1 -16 3 -3 45
7677 45 25 -5 -18 -44 26 -3 35 -3 5 6 9 -46 -30 13 3 48 36 -4 32 -60 7 -25 2 0 34 17 -12 -8 24 -12 -17 0 -41
7710 -41 -13 -28 26 -17 -35 42 -25 21 41 0 57 -9 7 7 -4 0 -11 -39 27 35 37 33 12 -24 -19 24 33 82 5 24 -66 -29 -15 21
7744 21 2 36 4 -23 27 4 -44 -41 42 -5 35 7 56 46 -5 1 -13 -21 -36 20 54 -18 -41 44 3 -25 -40 -14 -11 35 46 22
7776 22 21 -22 -25 24 -40 34 -1 53 25 -2 -60 -41 -12 -12 -30 20 11 -2 -12 -46 -6 -69 3 20 26 -28 -22 -8 -6 -42 -14 1 -36 37
7810 37 7 -2 24 -27 12 36 -21 -4 -10 -14 0 -23 -17 -30 -19 -18 -14 24 -22 -36 -47 -33 -34 13 35 -3 8 -1 9 -55 -39 33 0 -11
7844 -11 52 44 44 30 20 11 -7 -38 -38 21 30 47 0 19 -20 5 -13 -20 56 -2 59 -6 11 -25 -3 -62 -4 14 1 37 1 11 -49
7877 -49 21 -57 -14 7 68 11 -11 -26 26 -24 -53 -36 -45 25 20 9 5 -27 -45 10 10 32 51 -4 22 -38 -3 -1 -20 82 -2 41
7909 41 75 -27 -15 -36 -57 -10 -28 -30 38 -1 -11 -9 -19 -28 -30 -52 -23 -23 3 81 -14 14 23 -57 8 25 11 32 14 -17 11 32 -5
7942 -5 29 18 21 43 24 12 -35 -44 -13 -41 39 -34 -5 -12 -44 -30 -23 -40 -4 2 30 -15 16 2 -35 -12 -8 47 12 14 5 37 -11 -60 -40
7977 -40 14 16 39 1 15 -6 -36 -8 -50 12 24 2 59 -18 -11 -29 -12 -15 35 32 30 61 55 28 48 48 -12 -85 -14 5 -15 21 -39 -8
8011 -8 -16 -13 34 30 34 -59 18 -32 -73 21 -29 8 -15 -15 26 -3 14 54 14 -28 -44 5 43 -24 3 48 -21 -67 -85 -32 -5 -21 -11
8044 -11 -3 32 -69 -35 -19 1 0 59 59 2 -17 -8 26 -13 23 13 -2 31 79 26 13 43 9 -4 -23 27 26 20 -9 -11 -6 6 -31 50
8078 50 73 29 35 20 15 47 -7 -5 29 18 44 12 -14 -2 52 -2 15 11 -37 -3 72 14 -13 -18 20 5 39 10 4 7 23 -33 15 44
8112 44 -36 7 -13 72 -29 -33 -13 9 59 12 27 22 -10 -13 12 66 -16 1 -9 -7 -15 7 4 -17 16 -30 -31 9 17 -18 12 30 22 -36
8146 -36 -27 -10 7 -5 3 -3 10 30 14 10 19 6 35 13 14 33 5 39 23 -8 -61 19 13 9 -46 -51 -6 -7 -29 -39 -31 1 -12 29 12 -29
8182 -29 -22 -19 5 19 -8 21 48 16 7
8191G
##END NTUPLES=NMR FID
##END=
