##TITLE=1H_LR-0169-C-C6H6-K
 CCl4
 8 sc, 
 21.2.2023
##JCAMPDX= 6.0         $$ Bruker NMR JCAMP-DX V2.0
##DATA TYPE= NMR FID
##DATA CLASS= NTUPLES
##ORIGIN= UXNMR, Bruker Analytische Messtechnik GmbH
##OWNER= root
$$ XWIN-NMR		Version 3.5
$$ Wed Feb 22 14:55:42 2023 Russian Standard Time (UT+4h)  she@DPX200
##.OBSERVE FREQUENCY= 200.1313
##.OBSERVE NUCLEUS= ^1H
##.DELAY= (6, 6)
##.ACQUISITION MODE= SIMULTANEOUS
##.ACQUISITION SCHEME= undefined
##.AVERAGES= 8
##.DIGITISER RES= 18
##SPECTROMETER/DATA SYSTEM= spect
##.PULSE SEQUENCE= zg30
##.SOLVENT NAME= DMSO
##.SHIFT REFERENCE= (INTERNAL, DMSO, 0, 15.7039)
##AUDIT TRAIL= $$ (NUMBER, WHEN, WHO, WHERE, WHAT)
$$ ##TITLE= Audit trail, XWIN-NMR		Version 3.5
$$ ##JCAMPDX= 5.01
$$ ##ORIGIN= Bruker BioSpin GmbH
$$ ##OWNER= she
$$ F:/spectra/data/she/nmr/H-F/1/audita.txt
$$ ##AUDIT TRAIL=  $$ (NUMBER, WHEN, WHO, WHERE, WHAT)
(   1,<2023-02-22 14:54:38.12 +0400>,<she>,<DPX200>,
      <created by zg, POWCHK disabled, PULCHK disabled
       configuration hash MD5:
       00 E9 B6 7A A2 85 ED C7 34 08 36 98 17 FE 4E 26
       data hash MD5: 16K
       55 A7 72 7E 49 3C C4 D9 86 C9 C0 C8 0F F7 92 2D>)
$$ ##END=
$$ 
$$ hash MD5
$$ 7D 08 14 DF 33 1A 0B E5 DA 44 71 06 BB 5F D5 9D
##$RELAX= 
##$RELAX= 
##$RELAX= 
##$RELAX= 
##$RELAX= 
##$RELAX= 
$$ Bruker specific parameters
$$ --------------------------
##$DU= <F:/spectra>
##$EXPNO= 1
##$NAME= <H-F>
##$PROCNO= 1
##$TYPE= <nmr>
##$USER= <she>
##$AMP= (0..31)
100 100 100 100 100 100 100 100 100 100 100 100 100 100 100 100 100 100 
100 100 100 100 100 100 100 100 100 100 100 100 100 100 
##$AQSEQ= 0
##$AQ_mod= 1
##$AUNM= <au_zg>
##$AUTOPOS= <>
##$BF1= 200.13
##$BF2= 200.13
##$BF3= 200.13
##$BF4= 200.13
##$BF5= 200.13
##$BF6= 200.13
##$BF7= 200.13
##$BF8= 200.13
##$BYTORDA= 1
##$CFDGTYP= 0
##$CFRGTYP= 5
##$CHEMSTR= <none>
##$CNST= (0..31)
1 1 145 1 1 1 1 1 1 1 1 1 1 1 1 1 1 1 1 1 1 1 1 1 1 1 1 1 1 1 1 1 
##$CPDPRG= <>
##$CPDPRG1= <>
##$CPDPRG2= <>
##$CPDPRG3= <>
##$CPDPRG4= <mlev>
##$CPDPRG5= <mlev>
##$CPDPRG6= <mlev>
##$CPDPRG7= <mlev>
##$CPDPRG8= <mlev>
##$CPDPRGB= <>
##$CPDPRGT= <>
##$D= (0..31)
0 1.2 0 0 0 0 0 0 0 0.06 0 0.03 0 0 0 0 0.0002 0 0 0 0 0 0 0 0 0 0 0 0 
0 0 0 
##$DATE= 1677063277
##$DBL= (0..7)
120 120 120 120 120 120 120 120 
##$DBP= (0..7)
150 150 150 150 150 150 150 150 
##$DBP07= 0
##$DBPNAM0= <>
##$DBPNAM1= <>
##$DBPNAM2= <>
##$DBPNAM3= <>
##$DBPNAM4= <>
##$DBPNAM5= <>
##$DBPNAM6= <>
##$DBPNAM7= <>
##$DBPOAL= (0..7)
0.5 0.5 0.5 0.5 0.5 0.5 0.5 0.5 
##$DBPOFFS= (0..7)
0 0 0 0 0 0 0 0 
##$DE= 6
##$DECBNUC= <off>
##$DECIM= 32
##$DECNUC= <off>
##$DECSTAT= 4
##$DIGMOD= 1
##$DIGTYP= 9
##$DL= (0..7)
0 120 120 120 120 120 120 120 
##$DP= (0..7)
150 150 150 150 150 150 150 150 
##$DP07= 0
##$DPNAME0= <>
##$DPNAME1= <>
##$DPNAME2= <>
##$DPNAME3= <>
##$DPNAME4= <>
##$DPNAME5= <>
##$DPNAME6= <>
##$DPNAME7= <>
##$DPOAL= (0..7)
0.5 0.5 0.5 0.5 0.5 0.5 0.5 0.5 
##$DPOFFS= (0..7)
0 0 0 0 0 0 0 0 
##$DQDMODE= 0
##$DR= 18
##$DS= 0
##$DSLIST= <SSSSSSSSSSSSSSS>
$$ [...]
##$SUBNAM2= <"">
##$SUBNAM3= <"">
##$SUBNAM4= <"">
##$SUBNAM5= <"">
##$SUBNAM6= <"">
##$SUBNAM7= <"">
##$SUBNAM8= <"">
##$SUBNAM9= <"">
##$SW= 18.0517328524113
##$SWIBOX= (0..15)
0 0 2 0 0 0 0 0 0 0 0 0 0 0 0 0 
##$SW_h= 3612.71676300578
##$TD= 16384
##$TD0= 1
##$TE= 0
##$TE2= 300
##$TE3= 300
##$TEG= 300
##$TL= (0..7)
0 120 120 120 120 120 120 120 
##$TP= (0..7)
150 150 150 150 150 150 150 150 
##$TP07= 0
##$TPNAME0= <>
##$TPNAME1= <>
##$TPNAME2= <>
##$TPNAME3= <>
##$TPNAME4= <>
##$TPNAME5= <>
##$TPNAME6= <>
##$TPNAME7= <>
##$TPOAL= (0..7)
0.5 0.5 0.5 0.5 0.5 0.5 0.5 0.5 
##$TPOFFS= (0..7)
0 0 0 0 0 0 0 0 
##$TUNHIN= 0
##$TUNHOUT= 0
##$TUNXOUT= 0
##$USERA1= <user>
##$USERA2= <user>
##$USERA3= <user>
##$USERA4= <user>
##$USERA5= <user>
##$V9= 5
##$VALIST= <valist>
##$VCLIST= <CCCCCCCCCCCCCCC>
##$VD= 0
##$VDLIST= <DDDDDDDDDDDDDDD>
##$VPLIST= <PPPPPPPPPPPPPPP>
##$VTLIST= <TTTTTTTTTTTTTTT>
##$WBST= 1024
##$WBSW= 4
##$XGAIN= (0..3)
0 0 0 0 
##$XL= 0
##$YL= 0
##$YMAX_a= 203733
##$YMIN_a= -286270
##$ZGOPTNS= <>
##$ZL1= 120
##$ZL2= 120
##$ZL3= 120
##$ZL4= 120
##$ABSF1= 10
##$ABSF2= 0
##$ABSG= 5
##$ABSL= 3
##$ALPHA= 0
##$AQORDER= 0
##$ASSFAC= 0
##$ASSFACI= 0
##$ASSFACX= 0
##$ASSWID= 0
##$AUNMP= <proc_1d>
##$AZFE= 0.1
##$AZFW= 0.1
##$BCFW= 1
##$BC_mod= 2
##$BYTORDP= 1
##$COROFFS= 0
##$CY= 11.3945322036743
##$DATMOD= 1
##$DC= 2
##$DFILT= <>
##$DTYPP= 0
##$F1P= 2.36226072786647
##$F2P= -0.459571619588291
##$FCOR= 0.5
##$FTSIZE= 0
##$FT_mod= 4
##$GAMMA= 1
##$GB= 0.15
##$INTBC= 1
##$INTSCL= 1
##$ISEN= 128
##$LB= 0.24
##$LEV0= 0
##$LPBIN= 0
##$MAXI= 10000
##$MC2= 0
##$MEAN= 0
##$ME_mod= 0
##$MI= 1.114404
##$NCOEF= 0
##$NC_proc= 0
##$NLEV= 6
##$NOISF1= 3.799351
##$NOISF2= 2.8
##$NSP= 1
##$NTH_PI= 0
##$NZP= 0
##$OFFSET= 15.70392
##$PC= 1
##$PHC0= -19098.28
##$PHC1= 1.400741
##$PH_mod= 1
##$PKNL= yes
##$PPARMOD= 0
##$PSCAL= 0
##$PSIGN= 0
##$REVERSE= no
##$SF= 200.130013532006
##$SI= 16384
##$SIGF1= 3
##$SIGF2= 2
##$SINO= 400
##$SIOLD= 16384
##$SREGLST= <1H.CDCl3>
##$SSB= 0
##$STSI= 0
##$STSR= 0
##$SW_p= 3612.71676300578
##$SYMM= 0
##$S_DEV= 0
##$TDeff= 0
##$TDoff= 0
##$TI= <>
##$TILT= no
##$TM1= 0
##$TM2= 0
##$TOPLEV= 0
##$USERP1= <user>
##$USERP2= <user>
##$USERP3= <user>
##$USERP4= <user>
##$USERP5= <user>
##$WDW= 1
##$XDIM= 8192
##$YMAX_p= 0
##$YMIN_p= 0
$$ End of Bruker specific parameters
$$ ---------------------------------
##NTUPLES= NMR FID
##VAR_NAME=  TIME,          FID/REAL,        FID/IMAG
##SYMBOL=    X,             R,               I
##VAR_TYPE=  INDEPENDENT,   DEPENDENT,       DEPENDENT
##VAR_FORM=  AFFN,          ASDF,            ASDF
##VAR_DIM=   8192,          8192,            8192
##UNITS=     SECONDS,       ARBITRARY UNITS, ARBITRARY UNITS
##FACTOR=    0.0002768,     1,               1
##FIRST=     0,             0,               0
##LAST=      2.2672688,     0,               0
##MIN=       0,             -286270,         0
##MAX=       2.2672688,     203733,          0
$$ Real data points
##PAGE= N=1
##DATA TABLE= (X++(R..R)), XYDATA
0@%%%%%%%%%%%Qj6J6j6K4l2M0m8N6p2Q7j03J20j36J60j88K17k52K88l29L76m28
33b28M86n50O20o97P82q76R80j092J214j348J497j657J829k020K229k459K708
50A418k981L286l622L993m409M876n400O002o697P508q471R635j1079J2925j5384
65h400J8836k4087L3166n3322J81684k6186j97669Q7085k5671n4374j12140M2058
77a39020k7384K3888J33175M3212j7276N8169J05532K3437j21828J7161k6028
88G3038j24077o0610N225K9599o4558k6972R6072M6658O8172N9338m34j147K0364
101A20668M6275q5227j41609k889R710j6051o1265k1816N6662N0159P5213K8475
113E8305r542N2631L1479r012n1586o1211j5937n1285l2483l718o277J3190R451
$$ y = [0, 0, 0, 0, 0, 0, 0, 0, 0, 0, 0, 0, 8, -8, 8, -8, 16, -16, 24, -24, 32, -40, 47, -56, 64, -72, 88, -100, 117, -135, 153, -176, 200, -228, 258, -292, 328, -369, 413, -463, 517, -575, 639, -709, 788, -869, 960, -1060, 1169, -1290, 1418, -1563, 1723, -1899, 2094, -2315, 2561, -2839, 3163, -3534, 3974, -4497, 5138, -5941, 6984, -8400, 10436, -13651, 19515, -33807, 147877, 121691, -75978, 11107, -14564, -68938, -181078, -139020, -166404, -142516, -9341, 33871, 16595, 74764, 180296, 203733, 81905, 99066, 73038, -51039, -111649, -106424, -76825, -141383, -168355, -72283, -25625, 42547, 101885, 101451, 100304, 120668, 166943, 81716, -59893, -62782, -53072, -69123, -130388, -152204, -95542, -45383, 29830, 58305, 48763, 101394, 132873, 123861, 72275, 11064, -4873, -56158, -88641, -92359, -98636, -85446, -75995]
126g5995M8410M9694M4643L3232k8932j612K3126j9137n2545q2800j7461K4860
138e4517r076p471j6344K4517O8080N0946P979j5590J8344J6904k1608l2540m3571
151a3947k6458j1153j1391L058o994J7111L3999J7588L4730L0705R5k0193q194
164C8956P277k2342m0113k6201j5103L334J2948J1306q722Q276N9972K9006j8262
177D0332q947J0634K645k4131j9366j5582l1242l844K3043M51j5733J9541L7835
190A5636K795O630K0335m176k1037q378J0906j9602l8758Q29R375p052R363J7176
204e958l772k27L6192K2021k1760j6934P901L978k1996j1485K80k1944k00K8428
218e476J243j5059J0319K8007N593p759N682m714j8070o5J0919j7412k5105J2854
$$ y = [-75995, -27585, 22109, 66752, 99984, 71052, 69440, 92566, 73429, 20884, -61916, -79377, -54517, -63593, -71064, -87408, -62891, 5189, 56135, 64114, 48524, 66868, 83772, 62164, 29624, -13947, -40405, -51558, -62949, -59891, -66885, -49774, -15775, 1813, 36543, 67248, 67343, 47150, 38956, 46233, 23891, -16222, -42423, -57526, -54192, -41244, -29938, -38660, -30384, 29588, 58594, 40332, 31385, 42019, 44664, 20533, 1167, -14415, -45657, -49501, -26458, -26007, -41740, -22199, 15636, 18431, 25061, 45396, 41220, 20183, 11805, 22711, 3109, -35649, -34820, -25445, -32497, -23134, -5958, -9730, -9957, 26235, 48256, 26496, 9562, 17463, 21441, -555, -12040, -11760, -33704, -33904, -5476, -4233, -19292, -8973, 19034, 24627, 16868, 22550, 17836, -234, -299, 10620, -6792, -31897, -19043]
232a9043J2034p517O613J1422l05q59J4988J2274k1046j2667J3066m094j5219
245a0353J557J859j4432L361K4277P46j3944M061J7122L288j0191K698o499j6360
259a2810J3177R582k1212j2758J5823J4865p375l140R016r19j845J0836J404k0197
273e553l723J6328o995j1986Q690K749q612M18J6941M246j6891J088J3040k986
287F754l489O94j0893p023J6281R451j7910j2224J4729J6465n552r997L332m39
301A79J021J0580r047j6142P010J2350m910q974M537P193n112n62R628j404q968
316b621J671L158m197M800J170j4250k001J6988P686j4313j1345J3202J1134m893
330F189m196n824m597J1546R118j4003j4353J0926J4512n957r500M829N504l888
$$ y = [-19043, -7009, -14526, -7913, 3509, 3204, 2345, 17333, 29607, 8561, -4106, 8960, 4866, -10353, -8796, -6937, -21369, -18008, 6269, 7015, -6929, -2868, 14254, 17542, 7351, 10049, 3550, -12810, 367, 9949, -11263, -24021, -8198, 6667, -708, -3848, 5168, 4249, 2404, 13240, 14644, -5553, -9276, 7052, 57, -11929, -3239, -490, -9102, -8684, 8257, 12503, -4388, -3300, 9740, 6754, 3265, 3959, -6934, -13957, 2324, 11775, -6135, -18359, -3630, 12835, 7283, -2714, 618, 179, 1200, 11780, 2733, -13409, -6399, 5951, 1041, -7933, -3396, 3797, -1315, -1877, 7751, 6347, -2621, -950, 2208, -1989, 2811, 3981, -10269, -12270, 4718, 12404, -1909, -13254, -52, 11082, 6189, 1993, -3831, -8428, 3118, 12236, -1767, -16120, -5194, 9318, 3361, -6139, -1310, 4194, 306]
344C06K112L788r244q85Q547n198n867O878M366r722n246J5152P764j4617o749
359h615J0599L475l066R89p997p137J4117J0482j3962j3682J0504J6923o788j1827
373e985N175J761j947O624j998j1820K218J2391l630r993N809Q486p737o620J1949
388D683M583j3190j844P631j004o78K565n944o439R955J2434r899j4978R320J3971
403A1166o468q193J291j416K464O741l964r783J831J2813k73j1104L035Q282o030
418C92m258Q126j386p870K430K208j135J181K083k592n642Q177J0622j0951r734
433h349Q293O736m409l730j916k970N626O798n605q603M140J2749k621j0666N453
448I26L123n145J738J756l777m154M222K594n614K900N481m506m422Q117P295
$$ y = [306, 2418, 6206, -3038, -3923, 4624, -574, -6441, 437, 4803, -4919, -10165, 4987, 12751, -1866, -8615, 1984, 5459, 2393, 3382, -4615, -11752, 2365, 12847, -1115, -14797, -4293, 12630, 5842, -5985, -810, 951, -996, 5628, 3630, -8190, -5972, 6419, 2789, -7204, -1395, 7091, -646, -7266, 4683, 9266, -3924, -5768, 1863, 859, 181, 2746, -3198, -9637, 318, 12752, 2853, -12125, -2805, 11166, 4698, -3495, -2204, -3620, -1156, 5585, 1621, -8162, -6331, 6482, 6209, -4895, -1860, 6422, 392, -3866, 4260, 2874, -4996, -2566, -358, -1493, -312, 1771, -821, -6463, 1714, 12336, 1385, -8349, -56, 6680, 2271, -1459, -3375, -6345, -719, 6079, 474, -8129, -3989, 8760, 6139, -4527, 926, 4049, -1096, 642, 2398, -1379, -5533, -1311, 1283, -4331, -1431, 4050, -456, -4878, 3239, 10534]
463A0534j1312m582P933p3j876j765k127k193J747J0754n096j1806Q834R776m677
478D071p034L815K632m643K953k84n631n16M047L731q362J489J0123o983k407
493b999P964O69n831k643N777j361m265K843k325l567L446P579l590j0909R866
508F54Q250p393j983N66J499j925J107K586r753kJ0197j780o530P11P834l097
524I41l194P181k134m724J861L135j435o794N720J336q487N652N022m974l849
539d743M179O460n150j851L443k828o3L207R29q267j635J1386l395o250L356M37
555g85P88K1K879j415o780P310M932p190l444M644K061o669K706L779p111M88
571c786M783R32l333r84P220l964l228Q340k346o869K56N799j199o871L184M63
$$ y = [10534, -778, -5360, 2573, 2500, 624, -1141, -3268, -5461, -3714, 7040, 1944, -9862, -1028, 8748, 4071, -2963, 852, 3484, -1159, 1794, 1510, -4121, -4637, -590, 3141, -5221, -3732, 6391, -592, -2999, 4965, 5634, -197, -2840, 2937, 1576, -2689, 154, -2171, -5738, -2292, 5287, 1697, -9212, 654, 8904, 1511, -472, 94, 1593, -332, 775, 3361, -6392, -6394, 3803, 2023, -4507, -3796, 4038, 941, -2253, 4928, 2794, -1930, -69, 3066, 1631, -5163, 557, 1893, -6594, -942, 4080, -894, -4743, -564, 5896, 746, -1105, 2338, -490, -553, 2654, 3583, -4684, -6319, 5067, 1672, -4578, -1222, -785, 3, 24, 2903, 1488, -5292, 2018, 6950, -240, -3684, 960, 3021, -3648, -942, 2837, -4274, -3786, 997, 1929, -1404, -2388, 4832, 868, -2360, 5980, 3634, -3235, -2979, 2820, 1621, -5250, -2066, -1603]
587a603k522M647K922l428n506Q208P568r772k073L368p66r44j238J89n058K19
603e789R011l089n274M742O229l022l127O437k132o372K416N92k518l004K002
618b898J186o032O918P426p286l187Q496N704p482m025L575k849n39J032l299
633c260n830J867J1758l416q138P847O262k847j880K609l84o304J744J448o818
648e342j686M757L82n774N710Q637n927k384P140L742m141n363J375j734k911
663c519L208l464o891M586R175j517o065N764O247j502j558m25j371l614O34Q98
679E86q066j25O154k549k032N345N965k001k218M981J790l476k561j488k974j491
695d160L456m619n972P442O619j658l151L592O471j494j530l03m999j234K176
$$ y = [-1603, -4125, 522, 3444, 16, -5490, 2718, 10286, 514, -1559, 1809, 1043, 99, -1139, -950, -6008, -5789, 3222, 133, -5141, -399, 5830, 2808, -319, 6118, 3986, -2386, 30, 622, -1896, -4900, -2898, -1712, -7744, -826, 6600, -686, -3873, 4623, 10327, 2845, -1180, 2395, -454, -993, 39, -3260, -9090, -7223, 4535, 1119, -7019, 828, 7090, 4243, 2363, 4972, 4588, -1716, 28, 1476, -5342, -7028, -2271, -1889, -7663, -1953, 6684, 757, -1627, 5513, 9255, 5114, -249, 1126, -608, -3519, -311, -3775, -10666, -6080, 3095, 1578, -4487, 1277, 7524, 6022, 4464, 4039, 2668, -946, -312, 586, -7480, -7605, -1451, -4000, -6032, -687, 5278, 3277, 1059, 6040, 7830, 4354, 1793, 305, -2669, -4160, -704, -5323, -11295, -3853, 2766, 1108, -2043, 1549, 8020, 6526, 4996, 4693, -306, -1540, 636]
710F36k925o608J467O190k005j201M845L918m5j176L370k19m539M98k709n017
726e520K006J907m436l123O451N983k094j087L641K807q19n76j722o555J222M361
742B446o413n675L958N230r89j397N117K046j850K600J479m165k454K788l456
757g35o550L747L051m772k171O953N200m101n78N320j194j221K777l876o968K057
773c061N528m853o532M412N977k123j355N462M74l328M673J275p377j033M179
788B318k792n874K487M724m116l187P474L845m968M66M916k853k374M126k352
803A840o807J326N947k893o530L799O492l009j434M582j039k674L866J696o507
818a345k596N213K45o231J063N231k828k526N382J524m015J337L052k016k538
$$ y = [636, -2289, -8897, -7430, -1240, -3245, -4446, 399, 4317, 4272, 3096, 6466, 6247, 1708, 2206, -503, -5520, -3514, -1607, -6043, -9166, -2715, 3268, 1174, 87, 3728, 6535, 5716, 5140, 3418, -3137, -1915, 2446, -3967, -9642, -5684, -454, -1443, -2840, 2277, 4323, 2473, 5073, 6552, 2387, -67, 2721, -735, -7285, -3538, -487, -5259, -7430, -477, 4723, 622, 44, 5364, 4170, 2949, 5726, 1850, -5118, -3061, 2467, -2386, -8918, -4506, 1471, -652, -2007, 3455, 3929, 601, 5274, 6549, -828, -1861, 2318, -474, -6348, -3861, 863, -3253, -6440, 1034, 4879, -89, 377, 5293, 2440, 66, 4192, 1840, -4967, -3641, 2306, -587, -7117, -3318, 3174, 165, -1269, 3313, 2274, -400, 3466, 5162, -1345, -3941, 1272, 1517, -4714, -3651, 1580, -1248, -3774, 1608, 3132, -883, 454, 3506, 1490, -1048]
833a048K081M87m888K13N594j888m906L102L411k044J08J910k280j112L277R41
849B958m314j918M071J198m354J021K474k331M69L256j602k875J607K154j498
864C16j641J872L5k609J214L057k426j817K853J65j855R16R20k240n14L023M72
881A741l489L1L531p48j468J596o04k300J563K087k393k475K430J893k284k88
897a177K472j183r21L046K54l792N47K360j252k144J141J198k717k57M432o62
913A345l301K404K403k541n44K538k098k743K358J951l164k845L959J947l264
928a595J123K869k654k44L569o62m085L27L608k382l148K537J367k327q5L885
944B103j141k750L260J607k937m67J882j074l245K132K876m269j405L855J192
$$ y = [-1048, 1033, 1520, -3368, -3155, 2439, 551, -4355, -1253, 2158, 114, 222, 2132, -148, -1260, 2017, 2958, -1356, -3274, 797, 1995, -2359, -1338, 1136, -1195, -726, 2530, 928, -1947, -340, 1814, 316, -1325, 547, 582, -2027, -813, 2244, -182, -1999, 854, 1019, -836, 80, 1000, -1240, -1754, 1269, 1741, -1748, -1717, 1814, 1066, -402, 1194, 590, -1710, -147, 1940, -453, -2928, -498, 1395, -889, -1177, 1295, 112, -809, 2237, 2491, -1301, -754, 1606, 354, -1790, -649, 549, -2168, -2425, 2007, 1345, -1956, 448, 2851, 310, -234, 2304, 206, -2537, -179, 1772, -1392, -4237, -278, 1669, -1595, -472, 2397, -257, -501, 3068, 2406, -1679, -1352, 2256, -126, -3274, -737, 630, -1697, -1782, 2103, 962, -1788, 1472, 3079, 142, -325, 1557, 483, -2762, -630, 2246, -2023, -3428, 427, 1619]
959A619k628R05K538k283k34K881j502l284M7L911j656m094L400J074k513J514
975c05K095j022j469J909J452l212k54K170j432k639J924K543l781o63M213l29
991A200j048N83J39r01k58K842k018l997K530K741k009k120K061J207j675J681
1007I58Q16k517K74J804L02l561L28L491l232j111L149K27j905N8K862p86j753
1024e96K001n15k446N23K958j706m417L406L277k883l89J152Q68m96K22J094l484
1041a431n85L637j005l480M42L682j249j788K926R3j185P36R64m85k473J801K31
1058H31l767J453K384j739j944K121L094j577n78R10k15L20J95m45l195m84M275
1075A639j904l328J932J447R74o36J067L30j564J919P83l142r33J574r6l265J515
$$ y = [1619, -1009, -104, 2434, 151, -83, 2798, 1296, -1988, -1941, 1970, 314, -3780, -380, 694, -1819, -305, 1790, 768, -701, 1208, 2660, -552, -806, 1364, -68, -2707, -783, 1760, -2021, -2684, 1529, 1200, 152, 735, 874, -27, -285, 2557, 539, -3458, -928, 1813, -196, -2316, -255, 952, -723, 958, 1774, -743, -469, 1335, 1637, -1924, -1596, 1895, -1337, -2448, 701, 928, -977, -919, 1943, 1157, -596, 1405, 890, -1556, -1033, 1925, 219, -4198, -792, 2485, -398, -787, 365, 1233, 737, 959, 2053, -1431, -2016, 1621, 616, -2864, -2422, 1260, 11, -1777, 1149, 1242, 57, 793, 1757, 1272, -1201, 600, 831, -2936, -1483, 901, -838, -2782, -661, 2433, 856, 278, 1188, 973, 1293, 1488, 1043, -2152, -2636, 1639, -265, -3593, -1661, -214, 760, 124, 1191, 1521, -43, 1876, 2659, -483, -1416, 158, 62, -3203, -1688]
1092a688K412k130L6J665J735l96r48J592j741n44K188k080l169L70L385q69k653
1109b835J603J613L86N59M26m35j610K353O48m401j2J577q88j054J94J924j065
1126a017J80K418M1n21O23L45k082m05K402k730k712J859J467o32j421J453J718
1143I86p14K043N15k882k31K465N2m226K2J925j544l79J273N81p02J81L407j258
1161A514j856K673k28k457j93J380j206l103J896K176j749l36J557J136j422J727
1177A509J582l729j53K731m31l029r06K398m34j592K026K83j564J521K794j888
1193A118k175K196O44k317k31R31r8k316J010K574k184o87K366j36p04R81Q39
1210A811j786j110K230l7k194q06K232m6j305J548m18j665K396Q82j423j173O63
$$ y = [-1688, 724, -1406, -1370, 295, 2030, 1634, 686, 2278, 537, -7, 2181, 101, -3068, -2698, 687, -182, -2835, -1232, 381, 767, 1326, 1752, 1317, -293, 2060, 2708, -1693, -1705, -128, -1016, -2070, -1876, 48, -1017, -837, 1581, 1622, 1101, 1724, 2069, -13, -418, 1984, -746, -3458, -1599, -132, -764, -2185, -732, 986, 272, 2315, 2830, -52, -283, 2182, 2234, -1992, -1970, -45, -1589, -1968, -695, -114, -816, -635, 2772, 1514, -342, 2331, 2103, -354, -547, 833, -373, -3476, -1580, 596, -1153, -1489, 68, 1204, -218, 1509, 3091, -638, -791, 1940, 1509, -1520, -2426, -28, -462, -2054, -28, 255, -1309, 212, 3006, 1118, -1057, 1139, 1783, -534, -765, 166, 68, -2248, -1238, 1336, -848, -1535, 831, 695, -9, 972, 1811, 25, -1085, 1145, 1108, -1086, -1892, 340, 294, -1011, 537, 119, -1546, 850, 1732, 309, -864, -201]
1227b01J449j312o53J162q54o83J297Q09j865J83J325n81n14Q08j6o13l12J350
1245G79J56j789Q93L16q91Q80L80j350n85J195J046j162r68Q67J062o00J59L42
1263G30j461P84J689j715r88M71P56o31m65N81L17j120J074J512j363m86J643
1280A328n81j565J484pk072k99J573P62j904k13J888l62p9J830m78k151J253J826
1298B233j932k175J272R88j274o60J560o26p41K357J086j992OJ940j000j687N79
1315f6R68j938j693K284P82k207Q19J835o48R1J927n39j980P18K043j704l321
1332b629J236J532j698m38K234q07o93K602P95j840l21K189l67k564j2J600j969
1349a150j822K499M79j853J001J953m91j1J567n6k250J1K097j599l150J208J524
$$ y = [-201, 1248, -64, -717, 445, -409, -1092, 205, 1014, -851, -668, 657, 76, -438, 370, 354, -259, -571, 779, 935, -854, 39, 355, -536, 344, 724, -626, -1211, -16, 1030, -132, -1100, -233, 829, 229, 388, 730, -731, 53, 1742, 27, -961, -490, 266, -365, -830, -249, 68, -1052, 22, 1534, 171, -315, 1328, 747, -818, 666, 659, -1413, -1712, -139, 623, -1281, -1494, 394, 32, -47, 1783, 1305, -846, 407, 2233, 301, -1874, -602, 386, -888, -1548, 12, -614, -1355, 1002, 2088, 96, 102, 2042, 1042, -645, -66, 902, -1036, -2729, -445, 337, -1870, -1051, 784, 136, 227, 2154, 1615, -365, 353, 2396, 692, -2629, -1393, 139, -1559, -1997, 237, -570, -1263, 1339, 2134, 294, -27, 2162, 1795, -769, -781, 819, -1150, -2972, -473, 6, -1847, -846, 1107, 616, 605, 2172, 2116, -134, -123, 1974, 375, -2775, -1567, -43]
1366d3j277j76J059J93K3J616J130j621j196K220K38l065l30J230j198r17J303
1383h11L58o11N74J275M92q64R06O76j957J92J121j539j526K70O95R7m89N06N72
1402f3K75Q36R82j240p91J598n13j527o4n34j67K47j57J54K59P34Q95J17l40O94
1422A395l29p67L45k71j122Ml20l52O29M06j04k2Q59J333o89j310J411K10r96
1441C10l43j0j354O5J039k2j065K35J837K76j131R92J059k008L6J357j304j298
1459a329L34J058r14q07J618K67j423J073K366j456j426J513J91j152j26L04n96
1476e05j204J412J219k333j64K762k18j542R54J055j039n75J284n88j862J59J795
1493F10q62j818K247N62j749R14J425n45j471J007J392j926m18J180o25j306J110
$$ y = [-43, -1320, -1496, -437, -244, -221, 1395, 2525, 904, -292, 1928, 2166, -899, -1229, 1, -1197, -2114, -811, -453, -1064, -490, 785, 1277, 413, 1319, 1995, 38, 230, 1351, -188, -1714, -1444, -749, -652, -1141, -635, -63, 212, 1048, 2030, 790, -1, 1597, 1084, -443, -507, -1041, -1208, -961, -1118, -964, -705, 29, 924, 1041, 701, 1395, 1066, 299, 644, 373, -749, -745, -1065, -1417, -788, -382, -486, -508, 351, 1684, 995, -315, 1096, 1306, 310, -33, -43, -1397, -1332, -293, -315, -1380, -1145, 692, 968, -163, 829, 1888, -120, -84, 1273, -31, -1329, -995, 63, -851, -1658, -40, 227, -1196, -123, 2243, 787, -639, 874, 1065, -87, -213, 91, -505, -1709, -297, 922, -1411, -1575, 1187, 969, -573, 381, 1436, 397, -178, 1106, 518, -1344, -1185, 610, -252, -2070, 177, 739, -1010, -96, 1329, 784, -687, 320, 1712, -214, -632, 548, -77, -1383, -273]
1510b73J501k458o54K545J30q45j66P51L17j398J323J43k006M73J367r30j347
1527a527J284O44r30J05J055K32j137J33J410r41r35J336r37p03Q63K31r13l58
1545a088J105Q53j064J0O83M4n09O66k05j496R39O35r00k84k33R70l53m70J062
1564C65l48p7P50o4n79K1M27n10m85L96k68j85k93N90P31n42L04L19q80J212N03
1585A387j685j39M38O37j102k23J63KL06N04o4q28N40J622j264m66O49l10l98
1604b31l60M97K34j331R20N16o63L10O79j05p43J013N07j523k38M03N03p51p31
1623a094J032l47n8J050m70n95M59J299n57j085N92J15m05l35K65R6j161J287
1641H8R08j819Q30N66n29QK48L91r53o48J179L5j082K30R58p85k26J679o08j089
$$ y = [-273, 1228, -1230, -1884, 661, 791, -54, -220, 531, 848, -550, 773, 916, -1090, -617, 750, -180, -1527, -243, 401, -529, -424, 631, 863, -274, -141, 1269, 328, -607, 729, -208, -911, -48, 183, -730, -1088, 17, 870, -194, -184, 499, 543, 34, 700, 495, -1001, -62, 573, -327, -611, -844, 126, -227, -697, 365, 17, -60, 690, 626, 47, 68, 495, -15, -500, -104, -372, -557, -850, -260, 471, -71, 233, 552, -328, 884, 1387, -298, -437, 1, 638, -464, -687, -524, -522, -216, 288, 224, -604, -64, 1558, 294, -172, 477, 167, -231, -591, -94, 140, -1191, -271, 245, -418, -108, 571, 466, -277, 736, 1243, -280, -518, -115, 388, -363, -1094, -62, -409, -467, 583, 113, -482, -23, 1276, 719, -366, 226, 341, -64, -399, -134, -38, -1199, 88, 996, -823, 7, 573, 44, 52, 300, 691, -262, -910, 269, 304, -778, -548, 410, -375, -601, 1078, 470, -619]
1661f19O30R50m3j528K33J025j317K84Q95r29o94J338Q91j292n54J257J20p86
1679a39q9Q29q55n77J317k60r39M92M35j45l85N60O53j192l40J162j28q95J18
1698c78M39l03J98N59r39J65P14M37o21r23R04K54p35J07J45n41n9P94j08o18
1718e09N64M42m59J21N6K65p89k07R96p12l25M46l09L47K23K67l59k05P88M44
1738A085j087k88L21o7l81M18m43l67R54P6k19j87L19O24n40k37M74r27q7L96
1758a63n5n43K44N85l39P4O06K30n20j93J152l58j141L83K94p23K51J43l84j83
1778f40P09P62p22n42J039K59q19M2M86r48k92Q27k39p12L40N12J35o55P36O02
1798H80j136P4J073n65q49N16J19l14j68J16n1l37P99Q51j055n54J298k20m73
$$ y = [-619, 11, 961, 918, -610, -377, 648, -669, -385, 510, -419, -1113, 225, 1116, -176, -730, 527, 647, -139, -228, 601, -254, -831, 486, 226, -713, -221, 214, 69, -316, 244, 897, -295, -635, 527, 399, -496, -378, 61, -242, -44, 515, -424, -259, 455, 892, 271, -652, 252, 506, -229, -122, 23, -518, -577, 217, 109, -509, 55, 497, 38, 159, 215, 480, -309, -516, 480, -232, -557, -111, -420, -73, 150, 417, 58, -147, 641, 1085, -2, -290, 31, -36, -417, 1, -442, -809, 145, 221, 2, -185, 134, 758, 218, -19, 455, -472, -559, -163, -218, -761, -517, 68, -271, -197, 409, 639, 119, -74, 1078, 720, -421, -38, 256, -467, -216, -73, -457, -640, 69, 831, 109, -433, 606, 865, 46, 88, 574, -374, -666, 161, -78, -790, -450, 62, 197, -458, 278, 880, -256, -182, 891, 326, -523, -7, 112, -202, -370, -254, -305, -642, 157, 1008, -47, -601, 697, 477, 4]
1817DJ14L7l95k10M21K09p67J0J016j76n83O41L12q07J75N02j61o34K2K91q1l77
1839d37M23o4o22P41O39p70p7N59J45m73P1r4k10j81P90k19j015N75M94m55j69
1860c49L17N3NJ48Q5j65j46J04L91n04k54M72o99q5R60j22o00K35N14m3r9M1J48
1883D07k62k06M96m76q32P40J51m08n0L30J79l31M07P61o94k20O93k94n50J46
1903a3Q2p24P5L99Rn91Q1R62M31n13K30K00o25L83L08r71l82N05J28m37L8K06
1925b19R3l25R29M88q97p8J004m29r26N09k68l98k14L08L16p67M40P73N2j98M40
1946F33j32l34L12M02r94m18R0K78l52l17N25J63n8P73K35n86K78K73l3p11j34
1967a07L6o15j04M91q6m94O20P99l27K12L92R3m85j21J96l92j238P08R9m90L13
$$ y = [4, 118, 155, -240, -450, -29, 180, -587, -577, 439, 263, -320, 321, 633, -174, 1, 503, 342, -292, -270, 21, -60, -437, -14, -78, -700, 41, 680, -90, -167, 392, 537, 64, 135, 41, -169, -350, 440, 221, -794, -219, 275, -180, -349, -32, 21, 26, 174, 259, 94, -52, 52, 443, -61, -315, 157, -542, -627, 333, 211, -389, -154, 360, 317, 218, 259, 407, 145, -61, 435, -41, -873, -133, 18, -390, -440, -110, 69, -262, 145, 906, 212, -8, 685, 391, -159, -13, 69, -655, -580, -181, -172, -763, -682, 280, 711, 198, 428, 628, 3, 386, 694, -277, -659, -154, -26, -463, -425, -219, -126, -451, 478, 966, 69, -9, 995, 566, -360, 149, -119, -517, -731, -423, -107, -874, -434, 339, 391, 193, 633, 501, 167, 479, 881, -113, -531, -441, -163, -515, -832, -307, -144, -202, 571, 806, 220, 498, 771, 738, 27, -107, -71, -686, -790, -299, -385, -879, -259, 540, 213, 425, 817, 910, 425, 304, 500, 108, -1130, -422, -323, -813, -500]
1988e00M03m3j52J267k89n20L23J64j56o93m0J02o99K4N99k70j38O71J64K79l5
2009D61L51j82n52K10Q2n62n61K68m6k89M64M3j8O06L84P2m78j36P82n92n05R2
2031a06k96l89J65M58l72M9P52K13j42%M70k46o46M42j7j173L26L25m85P5L04
2052b93M23j96L43O28k11n42P1O69j100j80K97m55k83K54K49k00k57J123L72n46
2072A66j0M78k41m58L70j38q84L05L60l47k29K67Q13o06k91J254m77m28O32p8
2092D58n37k11L29k40m65M88L29l36n25J002N23q41K09J72l58Q0J55q2o09N6P18
2113C15m80n11O64K28j63k22Q07n13k73P58o81j56M5K82L7q13M30P20p44n6M40
2134A14L2k64J10M28n55K74P3k16k67o2O28m08p41Q42j38P0M78m52K24m45P13
$$ y = [-500, -97, -140, -292, 975, 686, 166, 489, 653, 497, -196, -236, -134, -833, -809, -210, -480, -618, 53, 217, 496, 461, 812, 630, 78, 288, 370, -192, -753, -485, -531, -820, -356, -313, -331, 275, 659, 731, 253, 117, 899, 307, -198, -106, -402, -791, -626, -168, -540, -491, 261, 474, 332, 332, 802, 556, -90, 352, 335, -838, -512, -187, -672, -597, -293, 130, -66, 277, 905, 694, 152, 223, 892, -208, -388, -91, -546, -829, -575, -326, -526, -783, 340, 712, 166, 156, 634, 393, -65, 305, 167, -717, -412, -52, -399, -628, -361, 452, -154, -445, 809, 332, -96, 536, 458, -79, -290, 39, -201, -666, -178, 151, -185, -710, 292, 815, -26, 183, 355, -3, 77, 232, 150, -459, -403, 315, -165, -676, -12, 216, 53, -169, 638, 125, -148, 610, -71, -227, -182, 100, 137, -676, -246, 474, -270, -326, 114, 146, -118, -8, 420, -135, 139, 212, -4, -271, -333, 295, -113, -854, -12, -150, -80, 398, -54, 170, -275, 438]
2155D38J24j015L31K6K45m47NN57n97K9L30L4k0MK45k30m12O98j10p02O92p4j63
2178a2m50M06Ll23N95j97k84J33M04K87p94P9O40n73q7J63n7j82j5K63k12j22
2200c35O44k1k83l7L94j96m08O01j46k84n1l5R3k83J59O93r65K17P76r8m40J4
2222IN69o73n4L19l73J28k9J81k64k57O87j03l15N53J36l70j64L39p7n83Q6L31
2244G6j93k87L73L39p20K51P93n24m28N82P4k83j10K44k48m79N78K25n21j85Q08
2265C65k30l43L04L45n46j6L54J92p92J34N44m77j64M68j7l10J56M91k59l62L13
2286A50J02l90j6N48n38l42N16R2l59Q1M54l19p7L41nm50n0N15R1p64J95M44j40
2309G9k3J46k51j98K26K56l18k50M72K68p18J55M49m65j5M84k71l78L91k3P8k99
$$ y = [438, 562, -453, -122, -96, 149, -298, -293, 264, -333, -304, 26, 60, 40, 44, 289, 59, -353, 345, 235, -467, 225, 151, -12, -462, -56, -53, -376, 219, 22, -262, -129, 275, 562, -232, -153, 487, -86, -173, -10, -67, -249, -264, -1, -213, -335, 309, 288, 5, -32, 362, 166, -242, 359, 213, -71, -122, -157, -64, -347, -188, 505, -460, -243, 533, 435, -5, 9, 578, -95, -149, 170, -203, -75, -104, 77, -187, -444, 243, 140, -175, 378, 514, 144, -20, 319, 242, -341, -255, 76, -117, -404, -31, 308, -412, -161, 632, 108, -320, 262, 336, 53, -57, 187, -61, -540, 38, 263, -258, -443, 365, 135, -208, 96, 441, -105, -121, 233, 425, -367, -233, 311, -166, -330, 138, 121, -189, -33, 458, 199, -163, 150, 252, -138, -154, 394, -144, -486, 30, 122, -237, -156, 298, -21, -98, 243, 238, -212, -262, 253, 344, -420, -225, 219, 79, 56, 202, -49, -247, -21, 235, -83, -333, 139, 407, -311, -156, 293, -172, -187, 297, 26, -352, 39, 16, 94, -205]
2331b05L57N6k46j78N84k98k15M01K00m90j33L32j29j04R5J70k18m27O10n1k87
2352a76K54J84m19J2L46K7k76k76N11k52k34M04p4k45O7O27k11m98L65J86k49
2373G3K8L0k25n2L20J39p50J31N26j87k18M77K7k54m3L41j27o57L05M06n77J4
2395b73K19J21m14O61J51o70K70J97M5l00j46M52m36j95N01p9n50R1N08l09J5
2416a41L04J28m94J54L87j10o05N25K39n65m6K97j53m68L99L95j55l20M34J64
2436C69n81K87L89o02m3L23j54m05L82L20j86l77M06J70k66M9N33n21l71L70N8
2457A50m72J98k4L5k24N24L18p83K6N36L8m55K20K52m47J35J12j89m01M44Q9j42
2479f0k69P40j90k63K90J52l80l54L31K68o42L24K74l03j57J91L01n64K89L70
$$ y = [-205, 152, 208, -38, -216, 368, 70, -145, 256, 456, -34, -167, 165, 36, -68, 27, 197, -21, -448, 162, 111, -176, 78, 262, -157, -145, 201, 228, -48, -324, 187, -65, -299, 105, 31, -214, -147, 480, 269, -229, 136, 322, 73, 101, 131, -94, -146, 174, 313, -437, -306, 220, 33, -185, 292, 319, 65, 22, 363, 236, -421, -116, 290, -287, -273, -54, 67, -347, 314, 465, -205, 65, 262, 307, 7, -139, 313, -123, -318, 183, 104, -446, -355, 153, -156, -141, 163, 291, -203, -49, 338, 228, -377, 148, 387, -178, -224, 73, -80, -548, -149, 246, 91, -229, 205, 369, -212, 75, 464, -138, -181, 142, -12, -417, -35, 285, 99, -278, 128, 298, 32, 81, 614, 93, -278, 92, 150, -322, -124, -148, -113, -337, 187, 505, -278, -252, 284, 322, -133, 87, 339, -108, 27, 139, -50, -451, -7, 82, -60, -329, 411, 221, -42, 248, 400, 20, -334, -3, 265, -377, -53, 221, -82, -239, -48, 253, -311, -22, 348]
2499C48l6m65K79J97l60k07M79j86n49M96J63k75j08K91O9k75L23J64l72J9o4
2520f9J40m40J87M05m59J53K23k76j05K24K92k96K0K79p5l16J34P7l27k20O85
2541B36k71j50J78M6Jj23L68m2k81JK44k02k99Q2M60o11J71K32j77j56L39q5Q9
2564E0l4J43l7l58L80J02l75k0J65j03j04o8N15n72J43M90p8m72n3P37l81l36
2586b66L99j13j45p9M02k90k59L82K20n00L13K99k41j17K91r6m13J54j07Q6o5
2607a45N1K52n54J96O66m67l22L95K87k18l65L87q9l65M28k02k09j59O73R3m24
2628i1J78J88O4k35J07K47o49q5L71l22k68K41Kol9P35R5o49J88L20l34j83L21
2651A96K9o02P9L63m65J22L98J84l93j73N43k16N3m8K46n20j65L70r5l56L99L6
$$ y = [348, 312, -153, 126, 323, -37, -244, 235, 49, -500, -4, 159, -116, -224, 67, 136, -139, 184, 348, -24, -5, -69, 71, -369, -182, 223, -236, -83, 140, -136, -241, -17, 275, -21, -1, 278, 203, -113, 21, 98, -229, -449, 236, -35, -185, -7, 39, 40, -83, 285, 243, -38, -37, 207, 5, -294, -212, 248, -363, -192, 40, -137, -293, 46, -39, 50, 16, 159, 122, -236, 144, 246, -129, -149, 16, -87, -191, -259, 256, -316, -173, 317, 239, -233, -286, 451, 70, -266, 133, 20, -125, -204, 198, -92, -351, 31, 251, -249, 64, 363, 122, 5, 296, 200, -213, -59, -166, -80, -145, -94, 158, -396, -200, 466, -1, -323, 72, 359, 141, -224, 163, 74, -291, 137, -65, -274, -433, 240, 333, -91, 87, 275, 339, 104, 211, 458, -191, -276, 95, -227, -495, -254, -252, -258, -297, 438, 533, -116, 72, 392, 58, -125, 196, 225, -377, -298, 65, -400, -278, 120, 304, -89, -262, 281, 65, 118, 70, 316, -204, -369, 1, -94, -450, -51, -15]
2673a5l13J70K51J38k24J49L03l73k91O8K27k22M2O3l62J16K77j24J3J86J45L5
2695B59k44K06o9l62J15R2k47MJ08J67l30O23j60q7j7K55k27k77L93j79l14L8
2717b53J51Q2j79Q5K74j83q7M40k10j31K7L30l39l97P31m07k70J36J38m8q6L48
2739A52R1l62QO34j75l62K04J06n62l0L59l74K20J10Q9l90K9M69o3m09L00N22
2761E66n24k80L30J26n19j27L65K4l82M10K95n36L12M47m49l78L23K88l34j22
2781a65L57j31n82N78K66m39k63P51l0o83L50M37l60k04K07J6l08O7J08r5m31
2802e54N63N4q0r6M34j92j52M9K36r1k06K25k86k82K84J5o8j34L78J38l36K6L05
2825B30J37m09K27j74q8p4L10k40k1K06Jk21K06J89k28M8p4K9m1P6l4l3k79K38
$$ y = [-15, -328, -158, 93, 231, 7, 156, 459, 86, -205, -137, 90, -132, -90, -27, -389, -273, 4, -120, -107, 79, 224, 259, 15, 221, 152, -210, -95, -3, -250, -246, -138, 29, -301, 322, 162, 75, 58, 313, 86, -191, 202, 23, -291, -253, -102, -20, -199, -114, 160, -23, -110, 330, 120, -11, 16, 346, 7, -390, 341, -66, -336, -200, -62, -110, -196, 152, 243, -119, -111, 523, 348, -14, 190, 296, -266, -296, 63, -311, -91, 19, 108, -282, -253, 216, 153, -256, 44, 566, 42, -238, 92, 218, -301, -428, -63, -39, -421, -11, 284, -252, 60, 507, 58, -320, 3, 291, -43, -165, 192, 61, -521, 57, 323, -116, -379, 372, 342, -341, 9, 446, 86, -118, 89, 105, -203, -136, -28, -123, -554, 9, 63, -17, -113, 321, 129, -23, 26, 262, 171, -35, 190, -96, -378, -94, -79, -147, -281, 97, 235, -101, -75, 230, 367, -42, 185, 11, -77, -151, 159, -81, -102, 104, 105, -116, 90, 279, 51, 99, 25, 54, 13, 89, 55, 22, -257, -19]
2849a9j40R0N2P6Q1q7o2L9k8J82l4l82J92n3j2j56J09J86j64l9M09J6k31P1K10
2874C06k60r4P3j72j88L28Kl7k04J71J54k05J95J37J3k49J09K81m90j9J44L5j77
2897a47n5L71k82j03N02l13J51j62K90k84%K18l01k69K11L60j99l51K31L79l65
2918a18m3M86j4m00J34K16k84j62K61J0n73M59K57l12k37L46N4j34J14J88j52
2939I6k03J87J59m97K7N85j80p21N72K86n30J22J93J1m18K86J36p0l43N49l78
2960a31J9J1L01k9k37K6J48j26o8L50l7m20L56K6k07j18N24l14l65M71j59j11
2982i0JJ83k02qL49j62L2k53K10J02k63K33J08k84j54M30j37r8m0K14k13j89L85
3005A54R7k81O2J42j65q0p0R3k82J71K42j33o9K46J15j44j28K17k14q2J24j3m8
$$ y = [-19, -159, -69, -17, 59, 140, 53, -9, 30, 2, 184, 150, -232, -40, -93, -105, -261, -152, 34, -130, -169, 240, 256, 25, 96, 306, 46, -48, 25, -147, -335, -7, -5, -42, -246, -75, 79, -126, 69, 206, 219, -30, 79, 360, -130, -149, -5, 30, -147, -202, 169, -113, -216, 286, -27, 124, -38, 252, -32, -32, 186, -115, -384, -173, 187, -12, -363, -132, 247, -118, -161, 325, 311, -89, 45, 261, -23, -185, 76, 86, -487, -28, 229, -83, -320, 26, 80, -54, 60, 248, 96, -107, 80, 239, -258, -231, 354, 174, -547, 25, 311, -219, -97, 96, 107, -311, -25, 111, 41, -302, 247, -131, -112, -101, 200, 171, -66, -40, 108, -18, -86, 264, 227, -193, 163, 189, -18, -136, 388, 74, -291, 180, 21, -90, -89, 94, -108, -116, 233, 71, 103, -150, 60, 162, -101, 132, 240, -44, -198, 232, 95, -3, -43, 171, -42, -231, 154, 251, -30, 32, 174, 9, -71, -141, -48, -330, -159, 83, -50, -119, 127, 242, 98, -30, 187, -27, -109, 15, 2, -46]
3028d6P1J11l30k45M74j88NL03O2k02o3L62o0l97O8J74J31l86N0J92l42K4M29
3051A97k40j70K35L25k82p9Q9K6l86L17O3k58l10N94J60l63n1K64j20j69M09P4
3073C25n12J8L61l41Q1j6K04j51j48L46o0K4J7O0L4n20L67k39k57M01J73l69k15
3096d17K18L75l16K78J1k39k06N09Nn81K51L70k71k04K78l3j11j37L24q7k11L90
3118A96P7k75j9K77j64m17K99J82m34K46K8K5j45J57J02k49R0K03o3N4k38J96
3140A28o4j63J4Q9j41J08J36%O8j46J97j06K0J32l69o0J05K44l35Q8N3p6o8K80
3164A34K8k44%K37j50m9K67j30j52j64K65R6l94L35J06k81J65P9o3q9l2Q9n5j30
3188a32j28K96L7k57L82k64k35M09j8j23J0Q0R1k26QK64m12K79mj12j00L22j0
$$ y = [-46, 25, 136, -194, -439, 35, -153, -148, 155, 217, 15, -48, 314, 254, -143, -75, 99, 230, -156, -106, 86, -256, -232, 197, -43, -213, 22, 347, 65, -14, 75, 101, -285, 32, 95, -163, -473, 121, 281, -82, -133, 131, 11, -158, 251, 325, -187, -169, 192, -149, -68, -84, 120, -31, -179, 167, 107, 131, 148, 208, 242, -278, 89, -150, -407, -6, 167, -202, -417, -199, 176, -140, 138, 149, -90, -296, 213, 218, -363, -112, 258, -13, -217, 61, 28, -83, -220, 104, 17, -194, 196, 273, -2, -21, 256, 92, -325, -26, 156, -278, -32, -4, 21, -124, 33, 135, -114, -24, 179, 116, 170, -68, 128, 64, -99, -85, 4, -137, -29, 107, 107, 175, 29, 226, 120, 140, 272, -97, -157, -52, 192, -143, -55, -2, -78, -146, 134, 162, -82, -82, 155, 5, -44, 223, 93, -59, -223, 42, 138, -256, 79, 185, -96, 69, 148, 85, -4, -36, 53, -2, -132, -260, 36, 73, -184, 198, -66, -301, 108, 90, -33, -23, 57, 148, -78, -70, 194, -218, 61, 57, -55, -155, 167, 157]
3211A57m79K58P1P1k28L40k2j25j57J46k09k2j97M77l88M6M42K0m17L71R0k41
3233Djj5L8j34J61K13l81j10J89K45l22k7L27k0j62L7J13k80J1L16j7l71M55l73
3257a04P3%n7K17k46L05j57l7M0M13k99k67O5J98j98j05P1L14m02K51r4J03j87
3280a03L65j53j29O3J64k65k6N7L1n3p8K03l7k29J92J66j2l2J00k50o6m8J6J13
3304a1j8K55k00j73O9L71j70j47J26Q7m33M45J31j53l95J04Q6j25J25J87j70j21
3326a30K07r1RO0J13j4j86K65k30m5j27L17k58j00K25J26k29K3O2K47l67L47O2
3349B86l32j56K33N6m98M22J14j34o0K10j06j83J92l1Q2k33m1K75j96J8J74j54
3371f2j31K07J30k12R8p4Q5j71K57K29m07L7J60k18l09L38J42k35K3K56l13K50
$$ y = [157, -322, -64, 7, 78, -150, 190, 168, 43, -114, 32, -177, -199, -396, 81, -307, -261, 181, 201, -216, 155, 245, 4, 3, -12, 26, -108, 53, 266, -115, -225, -36, 209, -113, -140, 187, 167, 5, 42, 155, -125, -114, 202, 185, -186, 269, -104, -31, -31, -88, 129, -117, 188, 31, -6, 34, 447, 148, -119, -54, 144, -54, -159, -88, 226, -176, 75, -19, 84, -103, 262, 109, -20, 43, 207, -58, -84, -27, 4, -49, -127, 76, 39, -190, 2, 168, 156, 124, 224, -26, -92, -140, -124, -11, -29, 226, 26, -147, -78, 293, 123, -24, 102, 189, -244, 201, 332, 179, -216, -112, -26, -151, -26, 161, -9, -130, 77, -14, -5, 55, 168, 154, -32, 233, 3, -42, -169, 148, -110, -210, 15, 141, -88, -65, -3, 244, -123, 224, 286, -46, -202, 31, 87, -411, 11, 125, -9, -69, 141, 35, -148, 44, 13, 95, -138, -179, 96, -100, -82, 92, -62, -193, 14, 144, -68, 30, -44, 41, -130, 127, 356, -51, -14, 146, -72, -381, -43, 99, -136, -113, 143, -170, 80]
3393H0m8R4mj22K85k64l83K71J15j93j29L82J59l87o4K19K8j40K36K1k93L33m
3416A92l08l0K40P6l61j1M35j52j85K82J10k96K18j49l7k1j61J54J80m51L70j07
3438a2j99L47J15j66j43K87k40LJ52L4k51J19Q0J47l81j06J83n5m7L61k39j54
3460a65L49q4k53K38k20J51k60K41k2n2M0L6J73k61O6K55j73k30J72J08l06l6
3482b33K98l8j18K6K18k64j4J55J6j47J04J45j03K9J24j8k92j9K94q8j26O5J97
3505B11m37K62J30j40m6Q3K48k58j2Ml55P7K07Q2k5MJ20n5m05K70J72j71L2K34
3529B32j3m05K25l2j46j6J02Km0J58j17j01K4K53Nj97J37J25l18r9J37O5q1Q4
3553a6J40j0l03J03J47j36J29J20k51J3k4j24K04j85K49Rj23j19L25j45j31K31
$$ y = [80, 32, 126, 122, 0, 285, 21, -362, -91, 24, -169, -298, 84, 243, -144, -208, 11, 39, -101, 135, 156, -137, 196, 192, -116, -146, 94, 170, -191, -202, 233, 81, -104, 178, 288, -8, 210, 61, 24, 3, -158, -4, 176, -275, 95, -12, -211, 136, 251, 85, -58, 229, -11, -8, 144, 178, -73, 46, 126, 273, -108, -214, -31, -86, -133, 228, -11, -165, 184, 100, -153, 85, -135, 16, -244, -3, -25, -77, -37, -1, 172, -89, -23, 232, 59, -171, 1, 109, -197, -233, 65, 27, -91, -65, 153, -111, -125, 30, 46, -101, 3, 148, 45, 74, 198, 180, -112, -131, 163, 75, -51, 14, 211, -226, 36, 166, 26, -20, 63, 311, 53, 41, 45, -310, -233, -26, 56, 31, 35, 155, 100, -305, -35, 137, -34, -2, 232, 219, -186, 39, 7, -139, -155, -53, -51, -91, 67, -50, -151, -127, 126, 131, -66, 71, 196, -122, -221, -84, -19, -100, -16, 124, 114, -189, -86, 61, -75, 54, 174, -77, -64, -88, -212, -8, -193, 56, 65, -58, -177, 148, 3, -128, 103]
3575A03j09L5R5M1k42Q0m8j19O7N0J75j30j46L76l18J53L5q0R4j90L4M3j63J73
3599In3J17k35N64J4p41N07m88M17l37L39l6k3p4J93l8k54J78r7o7r7J84K60k22
3623B0l8Q9j55J96Jj52j31qK28n6k82M16j09K6k16L71k46N3M9j0n4k7N9O7l71
3648b80L83Kl03K82j35K02j45L5K00m40K38J66k11j41J21q3J21k37M30j99j35
3669a29K39o9nn8P9J07k97K58k1r2k8J31j31k68M1K66K9l18L04P0l15M71j51j11
3693Bj10L6J54l68J80p2J75p1K08P9k30j66L54%j35k67L47j31j35J83j93M7j6
3716a29K17k58jJ69J0L3j41K72J40m02J81r5j77K31J30k93j65L73j6p6L8L6L4
3739A11k28K88ol91L22J07k71j62J08P2j29P1K94j79r1J98L7j95L4K04k71q3J78
$$ y = [103, -6, 29, 124, 165, -77, 3, -45, -164, -97, -47, 128, -2, -148, 228, -90, 63, 98, 18, 112, -78, -44, -1, -164, 9, -44, 73, -162, 402, 416, -325, 182, -306, 111, -226, 113, 77, 54, -20, 173, 135, -119, 59, -38, -105, -202, -18, 242, 20, -18, 71, -84, 112, 113, -39, -170, -178, 50, -6, -288, 128, 19, 45, -171, 200, -46, 7, 56, 46, -8, -35, 24, 91, -280, 103, 105, -198, 84, -51, 151, 6, 41, 241, -199, 39, 205, -6, -147, -26, -109, 12, -225, 205, 6, -129, 110, 41, 36, -22, 57, 164, -133, 125, 104, 12, -16, 115, -16, -284, -243, 23, 52, -266, 38, 108, -207, 264, 113, 2, -108, -72, 82, -286, -106, -178, -3, -74, 134, 213, -17, -183, 171, 171, 36, -231, 116, -15, -150, 33, -160, -113, -129, 88, -170, -171, -2, 8, 41, -100, 172, 312, -90, 91, -4, -181, 50, 180, -113, -278, 95, 79, 3, 41, 77, 111, -117, 171, 165, -226, 96, 203, -68, -230, -122, -50, -179, -108, 186, 7, -84, 114, 151, -44, -10, 194, -77, -160, 18]
3762A8j39O9k35J57K34j2K1j15J7q7K83lk89l2J58J92k33J25M1k80L8O4L5j65
3786a38J99J17j08n9rMj48K60j42l1J1Q0K3k71M5J80o0jK58J1j86M8k46K78l08
3811a93J26K6j49K2m6L39l76L34O6l13J6K72k17k30J83k9J77m4p9R8j55L26O2
3834B16k22n0K62l02j16M93k82m9J01O6j79J56k95J40L1qM1j32mJ30Q6J03j35
3857E1K18Ol38j46J14K4OL5J97j49l5J90j76q2Ro7o7M4J48l0k6q8L74j66l2Q0
3883I4o5k97K11K43k98q5L28k8m1j83J67k01nK02j05K33j40R7j32k2K2J67k31
3906f9J3K42k27n3J0%n2k5K20rk32K86R1qj51K4j00j40J06J03L9j3R4l52l5R8
3932a40L24j85J7L0m7k2l7K66k71O4k0J97k12m6J64q5R3k64L38j97J93q9j13J04
$$ y = [18, -121, -52, -287, -130, 104, 92, 113, -2, 15, -72, 211, 208, -81, -113, 45, 237, 4, 129, 170, -110, -72, -8, 27, -138, 61, 178, 70, 11, 2, 6, -142, 118, -24, -55, -44, 36, 59, -212, -167, 13, -47, -48, 210, 221, 35, 83, -163, 115, -193, -67, -41, -190, -168, -214, 125, -251, 83, 149, -164, -148, 124, -93, -323, -140, -169, 8, -36, -115, -17, -172, 154, 216, -6, -56, 206, -96, -212, 281, -1, -50, 51, 117, -62, 94, -201, -61, -30, -38, 3, -129, -133, -3, 83, 186, 51, 269, 275, -63, -209, -95, -71, -65, -30, 167, 18, -17, 173, -3, -85, -76, -143, -210, -166, -18, -48, -74, -162, 212, 46, 14, 94, 29, -268, -57, 186, -112, -197, 131, 103, 62, -121, 46, -155, -160, 42, -63, 170, 30, 127, -5, -27, -5, 162, -69, -56, 186, -41, -94, -84, -84, -136, -161, 59, 50, -182, 104, 195, 187, 36, 60, -40, -180, -74, 29, 68, 55, 149, -203, -238, -140, 184, -1, 16, 46, -1, -23, -60, 206, -65, -1, -21, 176, -36, -82, 82, -3, 90, -174, 164, -33, 160, 71, -42, 62]
3956F2J05k77J91j20J48j32k09K40Q8n9L4O5j53J97j31O5o7P8j7m7j59M4K09k32
3980g7q7L45j87O5R0k8j95J1J56l62o0K97J54o6p5j04M7J03m7l0M9QJ38J14l87
4005a28J62n2k4j70K12j37J39O4qM3k74K79j1j7n8nq5k4JJ45j41j24K49J9m8J05
4031A12L1k44J93Ko1j04q6L71k33j13K88k37MR0Q9j06j85M10k92n0K54Jj30o9
4055f5J03O7k36K6P0J30j63J22O3M5j42k0m7n2K32k01n7R9q6K67j16J3m0j03j4
4080a05K69k88L3m7L33k2k63l5L11k89L4O5Q2j60J45J49k78J10J14J27m68Q9p8
4103a72L96k58j17K90j89L4K5p4L5O6J3r4K10j34j2k28K23N7r6J7k3Q9k36J85
4127GQ0r9j42J26J03j00p4J76l50L79o6j67Q4NR6l61M02M7J3m2%j05q2j57K80
$$ y = [62, 167, -110, 81, -39, 109, -23, -232, 8, 96, 37, 71, 136, -17, 180, 49, 114, 47, 125, 108, 61, -98, -54, 155, -77, -164, 181, -6, 59, 149, 121, -74, -63, 93, -269, -329, -32, 122, 56, -19, -123, -76, 27, -20, -50, -1, 7, 145, 259, -128, 34, -18, -42, -212, 0, -137, 2, 66, 58, 101, -173, 106, 95, 78, 20, 15, -70, -94, -93, 52, -89, -213, 36, 55, 7, 112, 143, -101, 92, 94, 33, -71, -157, 214, -19, -132, 156, -81, -77, 13, 102, -4, -189, 221, -71, -121, 133, 134, 4, -65, 38, 105, -131, -105, -35, 95, -68, 54, 117, 162, 20, 0, -47, -99, 133, -68, -125, -26, -112, 155, 39, 52, 12, -91, -105, 164, -124, -91, -138, 195, 173, -90, -125, 186, -103, -69, -4, 78, -82, 63, 212, -66, 44, 158, 285, -183, -94, -172, 224, -34, -151, 139, -50, -16, 9, -65, -30, 36, 49, -45, 165, 31, 19, -209, 14, 71, -25, -8, -31, 58, -178, 7, 87, -12, -154, -28, 75, -25, -99, 77, -273, 106, 40, -127, -43, -38, 58, -303, 99, 146, 159, 117, 117, 12, -70, -227, 53]
4152E3j67j31K45rml1M2j10j29L93K7o4k09J00o9k13J82O9mq2K69k67N8nP6j04
4178h4N2Q1j9k6K34k07j74J21l9R1k11Q6K43j59L4J75k21J09N6J46k49l98L20
4201c9OjO2l7p0L7j80L72k4l63K01j03J44o1J72k45k7L8j15K03K8k26K55j45J28
4226A0K92j75j76J82J01j89l8K41j52m14K91K0J11j88L25k57j33L12J8j91J4o9
4248f5J11K8k4n0j32P0K06M2k97J28j9n3K17j84N5o5J9q1O2l8K4n8N5N0L41k41
4274A01j51K07l90J75J07P8l72K20J31m6m0KM7o1m6J85j30j61J29o6K73j38P2
4297A26j77P0j34L3k4J05P4J14l72J78P3j16L14j79j0j92J29R8k61k0P6n3J15
4320c3J6J93j6k34J57J05j65j24J90J25k66P2O2j08R5J47j23R7k25Q5j23j0J03
$$ y = [53, -114, -245, 0, -9, -13, -44, -2, -112, -241, 152, 179, 115, -94, 6, -63, -276, -94, -25, -29, -111, 158, -109, -51, -56, 20, -84, -32, 49, 30, 4, 238, 31, -143, -22, -61, 30, -181, -95, 148, -11, 23, 198, -23, 86, 142, 288, 39, -359, -39, -33, -34, 28, -9, -79, -42, -222, 150, 126, -237, -36, -139, 5, -56, 116, -129, -156, -118, -233, -30, -2, -228, 27, -118, 10, 302, 127, -49, 133, 234, 45, 7, 248, 96, -318, -27, -7, 104, -84, 241, -16, -149, 163, 181, -10, 4, -65, 46, 74, 50, 0, -132, -62, 144, 186, -111, 17, -2, -55, 162, -22, 33, -32, -13, -94, -32, -70, -46, -104, -49, 1, 342, 101, -50, 157, -233, -58, 49, 127, -245, -25, 106, 60, 20, 22, 69, 8, -38, 147, 17, -144, -15, -81, 192, 54, 126, -51, 19, -115, -82, -106, -1, 73, 187, -185, -7, 66, -50, 264, 85, 75, -117, 12, 110, -151, -171, -95, -148, -33, -17, 176, 160, -74, 83, 188, 23, -101, 89, 214, -52, 20, 82, -26, 69, 216, 93, 190, -35, 50, -73, -83, 20]
4343B0K00k11L4K7p3j06J53m9K32k25R6l1k95L22j46k22K85J47p1k42L62l9k84
4366a16J04K1O4R4kk03J43l78M41j72L0J00k51r7J74K04j19j57j05J8J11O6J4
4389a6J01j47J16M2k61L1j5R1l8k0K53k08N3r0K20p0N3j59J99j50J73j32K0j52
4413a06L2M4j57l0J26L7J43n7n1%pJ6n3L8P9Rm9N6l44J08L26mr8lj3K8q6J84p1
4442I7l5k58N0J28J76l83L17nq5M8P0n2j78J42K20l77R6k7J14q0ON7j05L05k83
4467d2j7K3J9l3j0l8K14j81j4P5J8r0rR1l8j5J8N8J44k91J83J18k72n4L02j02
4493E7o4l7r7J21j4J40k36R0PJ61j22p9LJ36Q2L1j37n3k3j9R9j03Q1r0l3q0L08
4520A29J03k67K68l72J49j06K04k60P0J78p1J4pRL1m3j93J80k2NR7o6m2j53J64
$$ y = [20, 220, 9, 43, 70, -3, -109, 44, -5, 227, 2, 98, 67, -228, 94, -52, -274, 11, 158, 87, -155, 207, 168, -116, -12, 9, 73, 167, 165, -38, 105, -273, 168, -4, 26, 126, -125, -222, -48, 156, 37, -120, -225, -207, -96, -30, -16, 85, -62, 54, 96, -165, -134, -149, -58, -96, -116, 137, -71, -18, -108, 112, 42, 95, -64, 135, -15, 158, 26, 46, -106, -74, -30, -187, -217, -91, -54, 89, 32, -19, -19, -26, -10, -63, -25, 54, 63, 14, 70, -274, -166, 160, 156, 58, 55, 42, 70, -16, 168, 97, 62, -196, -146, -18, 158, -225, 92, 87, 2, 50, 120, 68, -110, 32, 252, -125, -29, -56, 58, -22, -16, 41, -64, 241, -42, -59, -36, -17, -50, -60, -98, 116, -65, -79, -4, 14, -76, -85, 6, -32, -47, -29, 29, 173, -118, 65, 183, -89, -143, 159, 57, -7, -44, -141, -20, -34, 106, -130, -40, -33, 128, 6, -73, -70, 66, 148, 179, 42, -11, -34, -53, 46, -57, 24, -66, -99, -179, 129, 232, -35, 233, -139, 10, -96, 108, -152, -82, 96, 25, 39, 32, 41, 72, 29, -164, 16, -6, -1, 96, 30, -12, -165, -1]
4545aM0l09L38n3P9j92K21r8j5q6O3L5r7J47r9RJ13j8K9L6o3n4l3j74M01l73J76
4572B2m8J19N2j56J18j14j09J40j34J50j25K38r8r6r6J93ok31J27l5Rn1M5j2L7
4597f1j5R9m1KO5r8O6K03j05l61K42P2k67K38J48q3k53K76j39Q2j83K00q4j58
4621a55K42j77K51l71K62K98l64ln3Q7M6l28J96j69N3K71k55J78o4P9p6j54P4
4644a32K01j08O8J5k44Q3J68P0j11k0L4J50k23J31l4n4j59J52j6k5KJ2J22j90
4668a08J06M9o2p0J10j66J50q0o3J53r9K29l30J04L59k39N7L4j34K25k98k6L9
4691f0j80J55K8lj45J55M7L7j25J83l6l0nK6J26k96O3L2l7K04Kj27R0j48p5J67
4717D8j30J46j9r9P7O0k05K6R7L8J30j73J03l48K46J48l2l0J1n6o1O7J80j70l9
$$ y = [-1, 39, -270, 68, 15, 94, -98, 123, 25, 10, -76, -13, 22, -75, 72, -27, -18, 95, 77, 106, 142, 79, 25, -8, -182, 219, -154, 22, -26, 93, 145, -11, 107, -7, -116, 24, -110, 40, -85, 153, 55, -41, -137, 56, 50, -181, -54, -89, -80, -131, -86, -98, -61, -76, 23, -18, -16, 49, -49, 17, 220, 115, -246, -4, 68, -199, 39, 187, 104, -149, 127, -12, 70, -113, 87, 3, -155, 87, -90, 161, -210, 52, 350, -14, -17, -70, 17, 63, -265, -69, -238, -185, 86, -169, 9, -55, 24, -52, -206, -132, 69, -39, 29, 44, -200, -117, 51, 121, 10, -10, 24, 174, -49, 82, 48, -6, -165, -13, -29, -54, -52, -40, 82, -108, -2, 47, -15, -85, 25, -141, 9, -71, -134, 19, -80, 149, -181, -77, 282, 43, 100, 134, 0, 225, -73, -99, -60, -240, -85, -57, -60, -205, -50, -3, 34, -91, 92, 56, 26, 21, 47, 173, -123, -60, -28, -65, 139, 141, 14, 104, -44, -119, 48, -82, 64, 45, -54, 23, 83, -122, -96, 1, 39, 169, -4, 99, -249, -3, 145, 113, 83, 94, 38, -23, 44, 224, 54, 15]
4742A5nrqJ17N8j6l12L52k74m5J06N6O9q2Pk48J28J21r6Mj59L01q9j6m6M1n1j9
4770a00k10J69O6L0m0M1Q5K7p3m8M5K50o7k82J42o2q4N9R0j71J23Q1r2j59K79
4795I9j89j04K74k05K46r6p3K8JO2K8j34n0j52N07k50k4K1K25p7Q6l47L61m20
4819a83J39pO3l6M8o1M0Lo4J8L9j33J17M0n2J29j60J38j90J41j06L3K0J34j21
4844a1m4J74m4L9j39m6m6m1K49k25o3K34o3k25K50L1q9j76K81Q1n5j5M4o7K4j26
4870f8Q8j07J48J90k39j60J33O1R0J1r0p8L0r1J11m6j39J62P0o7R9o2n3J62j98
4895d3P3j89O2m2J01l8O4m9KN4J00o0n5J23J08kk14J3n5oJ50m7j59o8Q6L1J35
4922G5l4j52J10J19k4l0k7N4L2j40l5Mm8q5P2J66j2l43K02J52j11Q1rR6J13l44
$$ y = [15, 10, 1, -7, 110, 168, 152, -160, 192, -82, -127, -21, 35, 104, 22, 29, -219, -91, 30, -66, -62, -221, 80, -9, -25, -71, -30, -81, -100, -310, -141, -75, -45, -85, -44, 41, 68, -5, -53, -8, 242, 175, -107, 35, -27, -111, -52, 38, -133, -10, 71, -21, -180, 99, -90, -194, 80, -125, 121, 25, -48, -20, -19, 43, 71, -63, -113, -265, 242, -8, -32, -11, 214, 137, 223, -124, 237, -183, -44, -51, 12, -24, 24, -37, 3, 6, -58, -40, -1, -134, -17, 23, -29, 100, -60, 78, -112, 29, -77, -44, -24, 110, -11, -55, 119, 75, 114, -25, -71, -117, -158, 91, -134, -197, 37, -26, -251, -1, 30, -59, -235, 46, 127, 72, 57, 101, 34, 58, -68, 20, -87, 61, 251, 12, -148, -15, 46, 136, 147, 57, -21, 9, -82, 29, -17, -156, 6, 76, 9, 108, 46, -7, 155, -43, 30, -159, -97, -139, -38, -76, -12, -61, -59, -5, 95, 35, -20, 103, 211, 209, -5, 8, -47, -53, 97, 50, -109, -177, -91, -60, 75, 41, -111, -1, 118, 94, 64, 37, 91, 123, -17, -52, -48, -96, -181, -109, 57, 45, -298, -96, 56, -55, 26, 17, 113, 226, -118]
4948a18L60j26k48Q9N9J24j20q1J53J2n4N2r9M4L2j24R1j13l2l4N3L11k38j35
4972a42R7p9J85j76K08o5n2O3J52l02N0J25k95K16r4n4N9lJ12M1Jj2j10P2k16
4997b19J73mR9K2j7L9p1J8M0j0m9K8k4P8l8Kj25j73L65j49q8l3J96J29j77j07
5023i5o2J7Q4K55r7j0k54J74J6KO6q8j29l9K31j03q4K46k04m7K21R9p2k5j97J83
5049H8j41q4K07m0J9p3mK6l3j24L7O1N6j18J25j06R6m7J3JJ22j35J03L7k10m2
5075a66J06M9k3L3j77J66R6n5J41l00J94r1l0m3K35j99O4j04L69l28j67K76j00
5098e4PJ02j65qO6q4J55l1J4j37K45k47J44O9r7pJ27k27L5l7M17l32j00O0N4J74
5124A43j17K4L3q2k7L6o3j37J90j73K41jl7J68m05K19l1lJ11j71J34j16Qk2K00
$$ y = [-118, 242, 116, -132, -43, 16, 140, 20, -61, 92, 104, 50, 102, 3, 47, 79, -45, 46, -67, -99, -133, -80, 231, -7, -142, -45, -124, 61, -115, 93, 28, -24, 39, 191, -111, -61, 64, -231, -15, -109, -163, -104, -107, 5, 46, 47, 35, -75, -3, -219, -46, -50, 49, 71, 54, 93, 22, 40, 80, 70, 21, 49, 25, 103, 65, 67, -58, -231, 134, -15, -103, -136, 60, 189, 12, -95, -157, -140, -56, 199, 102, 92, -162, 12, 28, 30, 96, 8, -121, -160, 71, -32, -116, 130, -74, -121, 100, 199, 127, 102, -95, 88, -53, -137, 70, 30, 49, -24, -28, -2, -35, -159, -122, -61, -5, -123, 2, -104, -8, -55, -42, -41, 81, -54, 49, 86, -124, -166, -60, -11, -34, -1, -178, -12, 84, 29, 170, -130, 64, -27, -57, -100, 135, -64, 0, -104, 265, -63, -230, 46, -54, -47, 55, -110, -118, -52, -136, 19, -12, 2, -135, 110, -137, 7, 76, -21, -28, 99, -128, -93, -130, 287, -45, -145, -85, -31, 143, 26, 50, 83, 1, -26, 10, -53, -190, 0, -173, 68, 67, 30, 198, -207, 12, -19, -22, 89, -82, 52, -64, -56, -78, 122]
5149A22l13K21MJ68j30j73K48k5j14JNJ65l49J70R9j25J1j46J26r2J68J47p5m4
5173F9m3j76K01j93K51n6P3k47J63k11K60j30R4P1j88O5J11k79K07n1N9pj38J2
5197h3K34l62J92j2k28L95j4p6j64L40r3j22Q8k3n1m4j49J16N1p3J85m18M24p4
5221C9l1k7K78m40L21k91J80rk08K68j97j2q0J18K20o1j38J31j33J55k07n2J00
5244g6m1o8L5n2K88O6k57J06J3J11k64K20J0j47J24P6k01l7K5J00n4MjJ67k59
5269a12L92j77j51m3R7j15KJ32p7O7k8m6o7J63J8o8O4O6q5J43j09j3J6K26m95
5294b00J36J47j69n0J44O6o5J05q9j61K30P1k8j21p6J20L8j42l55N13k89J38K62
5317B25p2k47J67K4j93J21n3J57j20M7k1j7R8o1J54k28K0J73m08K77O1j21k6K1
$$ y = [122, -191, 30, 34, 202, 72, -101, 147, 122, 8, 9, 14, 179, -170, 0, 99, -26, -15, -161, -35, -127, 41, 188, 113, 69, 26, -150, 51, -142, 109, 53, 126, -121, 42, -169, 91, -39, 55, 126, -62, 3, 114, -165, 42, -9, 50, 43, -95, -83, 151, -211, -19, -31, -259, 136, 122, 46, -118, 222, 129, 7, 95, 72, 21, -23, -172, -56, -5, -78, 107, -311, 113, 39, 8, -19, 259, -181, 140, -151, 29, 20, -188, 80, -117, -129, -209, -91, 129, 68, -70, 61, -72, 83, -124, -176, -76, -117, -185, -150, -202, 86, 152, -105, 1, 14, 125, -139, 81, 91, -56, 68, 144, -57, -94, -69, 31, -23, -19, -20, 147, -112, 280, 103, -48, -91, 6, -109, -107, 25, -52, 15, -13, -59, -126, 37, 55, -13, 51, 117, 32, 175, 66, 53, 69, 295, -200, -64, 83, -86, -136, 8, 74, 9, 114, 25, -136, 94, 165, 137, 16, -60, 60, 98, -44, -399, 114, -175, -37, 225, 153, -94, 73, 97, -96, 25, -28, 129, 9, 56, 35, 18, 116, 55, 209, -19, 1, 174, -234, 43, 104, -17, -43, -22]
5341b2J99j81l7J17j45M5M8q1O1o2P9Pl3K17k20N2K4mj93J27p9kK55l12J57j00
5367h3J30l9r9N8Nk4P7k21K47j04q1J85j30K10r7j06J4k1J11o2p8J39rk1j6j10
5393a25J35j46Q9J94j89J87l67J97J22j53J94N0j1j75k16L44l9j60J98k04Jj15
5415a89K46l1l2J7L0n8lM1J77m07J24R7L3J3j92K65o9nj08J25j43Q9K30j53M4
5440A41j06n3J0l5Q5J48l36J72Q6r4K5j38P0R1q4L1r1M4j7j19P9K10p3k06K32
5465G2J7k7J09j50Q7m4l7j5k49J21K56k03j5J57k5o5K9K41j63k20J83M0J65m02
5489a38R9Q2n7qj41R2j08J97j79K61N7j05j00R8r9J20k06J74m4N1j28m7K76j6
5513A31j47N6J7k6J09l24K8J5J91l80M68k32M0l7J55l13R2J68j77J15K5J17j80
$$ y = [-22, 177, -4, -41, 76, -69, -24, 24, -57, 4, -58, 21, 28, -5, 212, -8, 44, 68, 64, -129, -2, -81, -83, 172, -140, 17, -83, 47, 8, -91, -33, -28, -52, 25, -196, 51, -53, -134, 51, -79, 131, 34, -72, -58, -79, 32, -30, -108, 31, 22, 1, -15, -125, 10, -136, -47, 147, -42, 145, -222, -25, 97, -56, 138, 188, 177, 2, -214, 130, 91, -69, 129, -75, -74, -189, 57, 26, -6, 11, 41, -17, -20, 21, 198, -209, -85, 12, 45, 58, -134, 131, 62, 57, -51, 74, -69, 20, 250, 97, 141, 35, -18, -8, -43, 42, 190, -146, 26, 112, 18, 43, -95, -25, 66, -18, 13, -78, -34, -51, -170, -91, 119, 46, -160, 72, 89, 62, 171, 21, 108, 64, 27, 12, -237, -116, 140, -63, -78, 79, 54, -11, 18, 259, 96, -124, 59, 99, 264, -138, -39, 43, -14, -22, -163, -71, -179, 18, -161, 100, 157, 52, -48, 50, -49, 71, -135, 39, -5, 46, -82, -129, 147, 131, -16, 40, 57, 31, 140, -184, -156, -141, 50, -330, 138, -94, -54, -91, 64, -249, -157, 11, -166, -51, -26, 91, -89]
5536h9N4P4j80J82r7K2j71J10J54k79L55l24R0K10J01k58o3K99k72P0l3P7J0j95
5560a53J79l0j8M0m4R5q7r9j6J18k75J54J20k2L3p8J8K65k29M4PJ75k58J19l7
5585B1m1Q6o2k6R1K3k28J73L5q9j58L73k77RJ52j53O6J12j54M0m7j01J72M9k3
5610D3m0j32J13p4O6J20j37n4Q7o5J36p0R2k89L18j0j54O6M3P2j59M1J7j35k5
5635a30J66Kj40O4j44K73r0J13p6p3J94j00l07K97L5L8q7%j16P9J07k10K36l01
5659a70O6J50J37j46L5k64K71j58J51Q1p6q7k55L72k11L8J18k7j36Q6O8j0J47
5682A80p6j80J99j12J30j88O4j41J4K91j64MR8m0k08K01k2M9k23K01l33K23J25
5705I2l2q1Q2k12J26J99j62j29J73J80m14J35M8R2j01K1p4K70j37k19J21j04J17
$$ y = [-89, -35, 39, -141, 41, -56, -34, -205, -95, 59, -220, 135, -189, -99, 111, 212, -46, -109, 190, -82, -12, -45, 32, 42, -153, 26, -4, -22, 18, -26, 69, -18, -117, -133, -15, -290, -136, -16, -38, -5, -83, -65, 200, -29, 15, 22, 197, -61, 58, 21, -20, 66, 4, -22, 69, 92, -136, 37, 72, -17, -175, 198, -79, -70, 82, -71, -5, 107, -47, -7, -54, -155, 17, 66, 43, 3, -129, -16, -90, -24, 96, -41, -95, -8, -73, 63, -7, 85, -204, 114, 104, -50, 16, 59, 131, -28, 13, 30, -105, -130, 36, 38, -102, -38, -182, 91, 1, 114, 38, -35, 159, 59, -248, 49, 84, 122, 35, 35, -81, -2, 105, -105, 131, -170, -104, 46, 183, 37, 72, -192, 79, -79, 72, 153, 77, -10, -265, 107, -104, -66, 52, 25, -111, -25, 43, 33, 180, 104, -76, 123, 11, 141, -47, 17, -124, -110, 181, 17, 21, 119, 79, -129, 72, 50, 99, -124, 77, -256, -33, 92, 60, -21, 61, -151, -25, 174, 12, -117, 56, 236, -178, -43, 5, 97, -4, 17, -57, 213, 76, -143, -22, -126, -9]
5728il4J24l3r9jK13n7k35J09J04k73J66j9Q7o7L9M4m8l5n8J17j41R4k2J4o8p0
5755a58R4J28j05J29j72Q2J18J45p0k48M1j2J23r4q3J42m7LL5n7n3J05J49k79
5779h4q7K07l8N4j5M5j75N7o8N1jlK57j84q1J45N9L2j88J35o4j02K4j39L21k22
5805f4O4J4%J42l90K76p7K88k38l5J71l24K75k65J45l3r6L46l86J64nJ6QJ63k00
5830d1J1N2j56J00j07p0J89J13K0j26J1M1Q2l5j14J29j31K1K1l1O7o5j28O6O5
5855a6nL8p9J4O2p0J64j07j22J86k44L0K32p7j14J95k32K40j10j43J92j57L58
5878B35j44j88K33j24q4J19j25R1J71j35k02P6K15j66j5L1N3Mj16R6n9j18K19
5901F7p4K1L8o3J34j36qO8L2p9j2j16J17J77k22P8l1J06k45l4J84J76j85j46K5
$$ y = [-9, -43, 81, 48, -51, -52, 161, 104, -131, -22, 82, -191, -25, -44, 43, -24, 15, 59, 11, -24, -82, 35, -106, -12, -34, -20, -88, -158, -64, 64, -41, 88, -84, -2, 116, 261, 191, -57, -16, -28, 95, 1, -82, 60, 13, 16, 51, -6, -59, 46, 195, -84, -171, 36, -2, 52, 37, 82, -93, -36, -104, -53, -54, -57, 200, 16, -65, 80, 139, 171, -17, 118, 54, -48, -24, -163, 158, -64, 0, 14, 14, 156, -234, 42, -35, 253, 15, -20, 151, -173, 102, -163, -18, -51, -147, 199, -187, -23, -28, -12, -4, 159, -41, -30, 22, -134, -34, -141, -211, -22, 91, 111, -15, -4, 37, 119, 84, -30, 99, -32, -11, 10, -21, 46, -19, -147, -81, -16, -21, 17, -62, -48, 14, -56, 108, 1, -121, 65, -179, -149, 83, 6, -108, 87, -145, 95, -15, -158, 34, -123, 235, 91, -97, 136, 12, -72, 47, -78, 13, 184, 49, -153, -77, 138, -28, -43, -12, 41, 45, -71, 25, -34, -152, 67, -7, 14, 52, -11, 123, -13, -21, 47, 79, 0, -12, -128, -11, 166, -56, 22, -9, 97, -148, -182, 2, 178, -7, -153, -128]
5926a28Q0K42k07J49k72J62j7MK2p2N6n1j43L80j69p5J49j75J39j25J37j11L5
5949A0o1Q5L6k76K77j29J2J38qj91L9JJ87k55L3OJ22m4j44L14L4j2j14J2k08L13
5975A77r1jP2m2k85M9Q1J31J28j86j58L03l40J07J31J03l13J70j80M6P9J12k74
5998a81K16L7q0J20o1K7j19K9M6J03p2K0j15K9J41Rk25q3LL12Q1n25L50p4J53
6023A41k55L02j73j27j80K41L0K92n28K37l2KJJ26j0LQ8j18j25r0K45p9J91M3
6047B25k53j74K48j97J21q0P1n5n8J66J70j76o4m8m4J18K1J9k9l3J09j02J61l64
6071b48N10j76j00pj17J44r1R9j77K85j3M3k62K07J43k47k21J63L0j85J18N8R0
6094D6Pj60R2o6J35J94j95o8J54K8j02j04J48k45q0J60J18n7p9K41j58J6J44k14
$$ y = [-128, -48, 194, -13, 136, -136, 26, 9, 13, 35, -37, 19, -32, -175, 205, 36, -39, 110, -65, 74, -51, 86, -25, 10, -51, 34, 70, -206, 71, -58, -46, 92, 84, -107, -68, -67, 120, -135, -102, -96, 26, -18, -162, 152, 186, 174, 60, 72, -136, 177, 86, 85, 157, 115, -170, -121, -40, 91, 219, 33, -125, 178, -162, -55, 76, 179, -134, 36, -144, -98, -19, 93, -181, 35, 72, -8, 112, 51, 78, -41, -12, 34, 137, 65, 85, -30, -1, 140, 149, -76, -159, -156, 156, 237, -288, 62, -12, 141, -114, 188, 15, -112, -292, -51, -21, 271, -257, -20, -52, -50, -49, 77, 67, 70, 158, 40, -85, -175, 70, -9, 182, 225, -28, -202, 46, -151, -30, -110, -39, -94, -152, 14, 184, 8, -56, -104, -148, -30, -9, 10, -19, -52, 57, -45, 116, -248, 262, 86, -14, -21, -138, 6, -85, 14, -163, 122, 109, 152, -110, 97, 240, -7, -228, -65, -35, -220, -102, -44, 46, 53, -107, -15, -81, 54, 248, 53, -15, 139, 167, 65, -39, 109, -136, -216, -56, 62, 5, -74, 167, 9, 25, 169, -45]
6118d5K67o2j3k56j0K8p1O3j05J25Pj11K11o9n4J6K01M7k80j01J88Q8r5QN4j0
6144B1K4o7N0j01K71q1j63K23j62n5K3j39J81j45J61j5j64J50K18k28J02q8j00
6167h4J48k17J48j05J48j02K09j57J38k09J11k19K22J93k09l01M21o7lRL7k84
6189a73K39M9l66J60j16J85k20L5J65J11n2L8P9l42L3J13J7K12l69K73P9j87n
6212d2J93k51n8J45J1NK5l3j01K09o5m5L9j5Q2K8k25J25L1J9j97K47j03k11K26
6237C9K6j53J0q2J73m9K0MQ0j37Q5J02J0n2k9p1O6oM5k76K34q5J00j05k4J98k19
6264i6J91lj6k44J79J11r9O9p4J69m45M81j43j05k7nJ59n3q8J97j37j41J7J43
6288D0NQk9j3M3J5j21J11K8Lq5j35J06L35m91J36n3K0L5j73K53j48J18k6RL2Q7
$$ y = [-45, 222, 160, 147, -109, -119, -91, -162, -99, -204, -79, -72, -183, 28, -41, -95, -79, 122, 169, -111, -212, -24, 64, -31, -23, 31, 21, 45, -22, 28, -73, 198, 117, -46, 177, 15, -40, -17, -156, 25, -120, 41, 26, -138, 12, 230, 2, 104, 16, -84, 64, -153, -5, -110, 38, -64, 145, -12, 126, -83, 28, -191, 31, 224, 15, -286, 135, 68, 65, 74, 111, -173, 66, 115, -251, -91, -207, -22, -242, -207, -42, 69, 17, 55, 134, -208, -175, -62, -45, 167, -202, 71, 150, -37, -42, 151, -100, -158, -13, -2, 3, 28, -5, -106, 103, 38, -7, 32, 17, 99, 127, -98, 27, 58, 77, -120, 127, 24, -187, 39, 65, -88, -78, -160, 13, -36, -16, -12, 68, -69, 16, 118, 128, 76, 47, -24, 42, 36, 81, -195, 39, -46, 54, -51, -75, 123, -96, 95, 92, 76, -168, 11, 122, 23, 92, 18, 187, -258, 223, 80, -25, -52, -57, 102, 49, -39, 158, 21, -120, -103, 40, 45, 53, 24, 11, 54, 69, -52, 59, 87, 90, 5, -130, -24, 311, -180, -44, -97, -77, -42, -215, 38, -110, 8, -18, -9, 23, 110]
6315A10o3N1k70K49r4Q2j65r6N9R0M5k20J74L2J00K1j58N9K21k81L32k37j15J38
6339F4j07J2l7p1L19j56M7j28J29N6j61J44O1j73O2j75R2j07K55j9q8l3nk2K39
6364A98j10j11oM7p6r2K00P1nk35R2r4J61N7k37N0L7M8J78j95K4j17J92K4l3J2
6390H0j35j94J96K35j08K4o3j51L11j86O5L2k43J02lm9N8J57j18j4j46K80k30
6413a00J8Q4r4l0J37J09j97K28r3J21k4o2k3Qj65r7K0rL33qk33M5Q0j48p4K6K20
6440G2n5P8o2j20O4J44j80n7Q2j04J45n2l5J84K2j03M5j73J82Rr1Q0j79J98j17
6465b3rp3J01L4J6j26R8j51K22l4m3p4J96O3j94J82k43M7O6o6J93k34q3J35Q7
6490H7j31O1Q9j48J43l1mk07J61Q6k69K84o0l32K07oj7J16J07K9j18KK03j34q6
$$ y = [110, 47, 98, -172, 77, -17, 65, -100, -196, -137, -47, -2, -222, -48, -16, 84, 105, -53, 6, 227, -54, 278, 41, -74, 64, -43, -31, -68, -139, 180, 24, 71, -57, 72, 128, -33, 111, 172, -1, 61, -114, -22, -129, 126, 107, 19, -14, -19, -41, 198, 88, -23, -29, 18, -58, -150, 50, 121, 116, -119, -27, -121, 40, 97, -140, -90, -53, -5, 173, -22, 2, -115, 77, 101, 68, 80, -55, -249, -53, 182, 74, 98, 35, -116, 195, 9, 74, 106, -137, -35, -38, -87, -29, 128, 10, -4, -150, 130, -100, -82, 2, -92, -122, 15, 124, -73, 155, 62, 183, 159, 97, 74, 82, -83, -180, -160, -169, 164, 156, -77, -32, 48, -100, -174, -148, 72, 17, 95, 33, -87, -23, 121, -59, -116, -34, -138, 7, -45, -80, 104, 126, 23, 68, -105, 77, 86, -5, 75, -104, 94, -23, -32, -105, -4, 30, 46, -80, 18, -133, 89, 55, 12, -62, 134, 197, 3, 185, -58, -11, 55, -11, 182, -52, -135, 0, 87, -44, 17, 106, -42, 101, 70, 66, -141, 20, 106, -163, 121, 61, -271, -64, -70, -87, 29, 136, 165, 47, 49, 252, 118, 32]
6515C2L7j25K9r0P5K6l3P1J43k40P7N8N7q4J0p1P0j43J42N0k04qR8N4q9Q6K7P6
6543A31j58q5J13j00j09L16J00l01J14K82k29P7j85R2q0k50L56j95J89M2J51k84
6565a3l6J36j07p0j06J78J8n9J02n1l4O7n4j5K20m1j5l22J38n5R9R5j01M4K5K66
6591C09l52J25P7j31J4j39j1O6rm4m5J61N6J12k01J60o9M9l1p6j35J20pj04l4
6616a39nJ41j2Q8q2k73M71k32J89p6J0k00R6R5j81O7k2j0J01J8j98K23r4L7n1
6641c9Q2j06K53j71k3j59J81L2L6k82J35J50l9J13j20j11P7k9Q8q1J00o2p5J39
6665H9j56O7j21J17J3j21J64p8j16J27j71K59r2j9M5n7M1K49j45j43j56K06j44
6688a42P9J37Kjj9j16K34j37k73J75J8J3n5j29L44n7r4q9J65k84L03j89J00K50
$$ y = [32, 69, -56, -27, -117, -42, -16, -49, 22, 165, -75, 2, 60, 117, 33, 43, -28, 42, -101, 41, 91, -113, -121, -23, 31, -58, 28, 55, 131, -27, -112, 1, -99, -208, 108, 208, -93, 21, 303, 74, 151, -34, 58, -22, -272, 84, -111, 78, 120, 271, -13, -49, 87, -20, -90, -196, -18, 0, -59, 43, -8, -42, 25, -29, -44, 176, 135, 120, -202, -64, -119, -20, 75, -26, 18, 43, 309, -43, 82, 159, 28, 42, -97, -108, -42, -51, -95, -140, 21, 77, 189, -12, 148, 79, 128, 97, 21, -114, 6, -1, -105, -139, -144, -3, -15, 73, -9, -282, 189, -43, 146, 70, 80, -120, -24, 71, -110, -43, -65, -75, 26, 44, -154, 69, -25, 12, -39, 43, -63, 190, 19, -4, -163, 18, 50, 86, -196, -61, 89, 50, 163, 43, -68, 9, -20, 68, -13, 87, 25, -50, 89, -67, 0, -121, -4, 9, -112, 52, -26, -142, -15, -186, 73, -19, -38, 7, -50, -9, 240, 95, -48, -204, 2, -142, -63, 74, 76, 75, 56, -60, 174, 37, -236, -61, -43, -30, -85, -214, 130, 73, -21, -110, 55, -229, 74, -115, -15, 235]
6712B35k45j07OJ98j50J54O0n3K6j0k55K32L6k91K99k87O8J66k3q8j0J69j73J8
6736b5J02P8o8k31K14k7l4J16k7k59n6K38L0r6J02K7j64P1O0J2mL9p4L8m5P5l16
6763b24J36K2P9j19l6K86q8j0m2J00j54k41L91j29m0k2L6J01M2k6K5j40J28n6
6787A9J6o2n0Q1ko1P2kL0M7l60J13o0N33k19j90J33q8K11M4k17M3j22R6J3q5m0
6814a07J46n4L1PO5j03m6O6L8K0j7l4J60k95K19j08O6r9j23L19j01j32J66q9O
6839AJ64k74L26l02M0n5J09J91k05lj00Q6l5KJ86q5j5r6K76j89j25J05n2o8q4
6864b02M45m1j65j34L6q6K53o0j32J37j54J40l40N29k59P2p4j38J21j30J59J6
6886gj7QJ00k62J07J86j15Q6j87m5P1N3n2N9K8P4k51J93r6K2J40K7J5p3k40J41
$$ y = [235, -10, -117, -111, 87, -63, 91, 151, 98, 124, 114, -141, 91, 127, -164, 135, -152, -84, 82, 59, -29, -39, 130, -43, -25, 77, 155, 87, -144, 70, 43, 9, 125, 98, -161, -217, 21, 51, -45, 57, 84, -80, -9, 51, 63, 59, 98, 24, 62, 17, 92, -224, -88, -66, 13, -106, -142, 144, 56, 46, 4, 104, -50, -291, 100, -29, -69, -91, -55, 46, 88, 62, 87, -53, 75, 19, 35, -27, -77, 4, 2, -59, 13, 11, 41, 88, -272, -159, -219, 314, 95, -95, 38, -50, 161, 205, -12, 31, -91, 5, 18, -67, -107, 39, -15, 16, 23, 88, -15, -61, 5, 43, 63, 46, 12, 172, -123, 96, -12, 54, -45, -168, 151, 50, -82, 84, -5, 1, 165, -109, 217, -85, -45, -100, 9, 200, -5, -8, -108, -22, -57, -55, 131, 46, 31, -65, 211, 22, -103, 2, -50, -118, -202, 243, 202, 37, -97, -61, -147, 106, 46, -86, 51, -103, 37, -303, 226, -33, 39, -35, -173, -52, -182, -23, -7, -24, -16, 84, -178, -71, 115, 0, 86, -101, -146, -75, -22, -74, -15, 13, 87, -164, 29, -67, -45, 95, 122, 137, 64, -176, -35]
6912c5k6L2j08l6K82r4o2R6j36O3j06J80m6j32J46j2N2j12Q6M1j56J10o2j9J10
6937E6j57J97l17O3K54m4k55K68K6l60J14J28R8J77k26K3kj59J07Q4n4k28J62
6960d5R3P6j48R2p0J29o5j82L60m16K42o8j09p3l8K91r8j47M4K19m0l3M7J97j67
6985I1M1j93k4L6L6j09J11N2R8o9j00J2J54j48K23l01K75k12J39j30M5n9k24K62
7009FK20k64K6j17J22j85J38K86j98o0J58k96J38M9KJ21j18j78J20j31K4J39m8
7032d6R5r0oL0Q6j32K09l02K15l0n1o9M3J06j54J19lMn4k19J74o5R1j5P6K67l17
7059c8J14k37K40N0m7n5K5j86J24j51K11J9j48j00L43k43l7R7N6Pj77J16n9n0
7083a26k0J97k59J96p1Or2K24j63R1N0N4l1R6j04J39j57KR5r9j35L6K76j17j44
$$ y = [-35, -61, -29, -137, -173, 109, 15, -47, 49, -87, -24, -130, 50, 4, -128, 18, 6, 58, -54, 32, 73, -83, 27, -35, -54, 56, -101, 96, -221, -158, 96, 52, -203, 65, 91, -269, -155, -27, 71, 248, 22, 45, 43, -116, -9, 75, 21, -207, -45, 48, 124, -24, 68, -2, 127, 62, -120, 240, -176, 66, -2, -111, -184, -222, 69, -29, -176, -132, 87, 47, 14, 61, 258, 91, 132, -61, -85, -49, -13, -122, -11, 41, 139, 70, -30, -18, 136, -12, 211, -90, 185, -27, 112, -18, 27, -32, -256, 6, 226, -38, -12, -129, -7, -192, -54, 232, 34, -26, 132, -164, -26, 23, 25, 146, 28, -150, -30, -161, -137, 2, -46, 49, -41, -47, -17, 69, -63, 146, -156, 59, 29, -22, -91, -48, 58, -96, 23, 20, 24, -30, -249, -75, -140, -49, -64, 12, 279, -38, 76, -161, 79, 129, 82, 27, 52, -134, -10, -161, 50, 69, -79, -179, 164, -79, -116, -19, 37, 44, -133, -17, -76, -126, -146, 51, -208, -12, -83, -77, -169, 55, -108, -17, 33, 87, 56, 152, 48, 187, 30, 32, 127, 28, -107, -71, 205, 88, -56]
7108e6m4R2l4lo6J50j2n2p1l4K31Mk72P4K52k16j26L0K43j28k4J17M7l20K74J50
7134B06l07J04O4j44L9L8Q6r4J34l10QJ28P8Q3j78K2J27j6k07J59k4n3j26M3J49
7159IMp0K00k70K10j26J15j19K4j09%K06j11M8j21K1O3m2J23j79N5k4J60j43J83
7184A07k32J13J3j51J76l0K34r6o1Kn4j02J98o7o2J12j8q4J6J0K3K1l05K71n2
7209a8j00J66n4l50L99K2j54r5K09j92L00l93K09J20j62K01j2K70k33j17q7J63
7231I2j20J81L7j27j76K37k64J04K2J38j42K17j94k56K27M5k16J18N9m7M2J2j01
7254a12J52j62r2K73j06J22j42O8o6L23k22J41k85O3J39O4l39L7M0J77K2j35Q4
7277D4J7j31R7R3j00n5j35K86K8j38o8j5J70j7j09J69j35qK5j9j06J8J47j11l6
$$ y = [-56, -100, -8, -42, -45, -111, 39, 27, -25, -96, -130, 101, 105, -167, -93, 159, -57, -183, -153, 90, -38, -62, 55, 102, -218, 56, 206, -101, 3, 67, -77, -38, 0, 86, -8, 126, -184, -176, -48, 30, 113, -65, -43, 84, 68, -139, 20, -4, -57, -183, -140, 9, 13, -57, 143, -127, 83, -43, 72, -47, -23, -132, -132, 74, -37, 11, -110, -89, -26, -68, 55, -124, -69, -93, 67, -76, 107, -125, -12, 1, -150, 26, -4, 230, 134, 73, 75, 21, -81, 117, 50, -12, 100, 82, -2, 14, 24, 47, 68, -237, 34, -18, -118, 48, -6, -356, 43, 65, -89, -184, 25, -167, 133, -260, -51, 69, -93, 108, 96, 366, 133, 16, -71, 92, -28, 153, 190, 63, -113, 124, -140, -36, -14, 124, -18, 199, 5, -251, -24, 21, -195, -77, -18, -65, -23, -11, -112, 40, -122, -214, 59, -47, 75, -67, 1, -65, 258, 36, 177, -108, -45, 94, 158, -181, -144, -104, 73, 95, -40, 44, 61, -70, 27, 120, 20, -35, -170, 116, 144, 6, -62, -77, 93, 76, -33, 136, 1, -7, 18, -1, -107, -89, 58, -53, -89]
7302h9l9M8m2p7J63n8j05J16L03k15j23J14m6M6K04l87K13Q5l55K17j5J06l8m8
7326b2J34l56J40K37m6j45j03j14J74NL5K73m3k21n6j12K47n6n5J00n9J70k91
7349a64L87j98j52j4J85j04J54L6Kj20R6j71J25q5j9J1OJ35K7l35L01l25J93M4
7373A5J42j92q0r1L45k90J98j6J2j25J18o4j82J04j55L09j02p2J29q0J22j78P8
7396e5j0J21j6n1O7r2J31K05k31R2j23Q9j38O8m3k25M08j62j51M7l4l3l4K08j58
7421a20R5J13L8K00p5k96J90j06j59N6J49j54%J94l50J33L17k94J28op2o8K8M8
7445a1J25k47Q0Q9j05n5J48k7j18k3K68nj23m9J37r6l9O5L0J15l46L13Q7m96J74
7470a09L8K56l13J58j13k12N07j76k36K32r5M3l4j83K08J09J38p4r7o9oK2J08
$$ y = [-89, -128, -80, -122, -199, -36, -94, -199, -83, 220, 5, -118, -4, -50, -4, 200, -187, 26, 111, -244, -27, -42, 64, 26, -22, 112, -244, -104, 133, 87, -58, -161, -275, -101, -96, -61, 212, 169, -52, -108, -220, 27, -29, -84, 16, -43, 127, -164, 223, 25, -127, -141, 44, -60, 94, 130, 132, 12, 108, -63, 62, -23, -42, -31, -25, 110, 137, -198, 103, -222, -29, 15, 157, -35, -115, -206, 139, -151, 47, 31, 43, -82, 36, -28, -210, -106, -261, 48, -54, -126, 3, -77, 45, -133, -55, -65, 56, 40, -11, 56, -36, 95, 300, 69, 161, 38, 127, -11, 57, 14, -211, 197, 35, -116, -69, -103, -136, -170, 38, -120, -25, 88, 126, 326, 251, -45, 145, 39, -120, -64, 85, -69, -69, 125, -225, -92, 225, -69, 59, 53, -19, -87, -59, -11, 114, -133, -53, 36, -69, -124, 24, -3, -121, -144, 124, 119, -4, -53, 84, -12, -51, 14, 44, 159, -187, 126, 213, -283, -109, -71, 185, -128, 30, -83, -295, 212, 36, -200, 32, -63, -20, -54, -237, -29, 80, 218, 144, 47, -22, -28, -6, 102]
7493A02L4j40N4l3n2p2q2J23QJ34j26o1L03j42r9k7l8L9R3nJ74k60RK11k19R7
7519B5L1k7M9m3J73k20j96K91m2j9k0p3qM4K04l01R9P5O0k5m8K2j32L1l2K20q8
7546E0o9n9K18M2k25jO9j43J16Nn4pO3q1N6O0Pm1Q9j87no0J32j11o1O2M49j5q4
7575B15k16L31o09o2O40r2n52j66o2n2L41L32O20l5j073N62k04M34j92mm64K49
7597e9R20q62J96l20M23k03o57O81L45k63l76K37m2l5P7j22J89q5k23N1K35j4
7619I3k42K11k5l29P3J30J36kj42J82qj61MJ69n0j53J73L7j85K5K4k0J93k6k33
7644a26Q6J22kq9J9K2O7k50J12P6R2o1j13J14N3k96R8K90l45J43J81j42q8J27
7668I0K2o0j78J42N3Pn4K2m3k37J26or0K39n8K10k88Q3Q4J2mJk20J4J61j7j50
$$ y = [102, 136, -4, 50, 17, -35, -107, -189, -66, -58, 76, -50, -111, 192, 50, -49, -76, -114, -75, 18, 13, 187, -73, -64, 147, -72, 25, 56, 29, 78, 35, 208, -12, -208, 83, 41, 22, 2, -71, -79, -35, 169, -132, -33, 42, 102, 77, 29, 51, -81, -50, -82, 138, 50, -19, -78, 140, 182, -43, -44, 25, -118, -2, 3, -51, -58, 5, -76, -20, 40, 47, 6, 95, -92, -97, -157, -25, -136, -197, -135, 314, 299, 215, -1, 330, -279, -341, 299, 207, -345, -511, -573, -625, -284, 48, 668, 633, -440, 122, -82, 352, 160, 156, -308, -59, 861, -1, 195, -125, 298, 95, -562, 119, 464, 201, -175, 62, 20, -15, 62, -60, 129, 44, -179, -128, 107, 93, -149, 62, 37, -292, -219, -89, 47, 45, -97, 85, 77, -84, -80, 89, 39, -114, 59, 96, -89, -64, -40, -60, 133, 107, -126, -40, 82, 80, -9, 10, 32, 99, -151, -39, 37, 129, 68, -45, 69, 122, -174, -76, 214, -131, 12, 193, 51, -37, 90, 112, 52, -126, 16, 69, 76, 22, 44, 1, -236, -110, -116, -206, 33, -25, 185, -103, -20, 64, 76, 72, 73, -147, -133, 28, 11, -139]
7695a39J52J64k83J44J3j08M2J05j05P9j08j83K32M7j0O4j10%K2j43K59r1Q4k25
7719i8J20J13j79N5L0k3j83J8J53Lj9O2j22J60k02m6J91p3R1k4Nj34Q7j1k18L04
7745F0M8j19n3K43k49K20k83K82j05j03P4M7j26K8j1Q1K6j14L11k65N4r7J22j07
7769c6J06%lN2r3p7p6J53j07J82N6n8j42P2J5l8JjK6q2J6J24j09J3j21j25J99
7796e3R2j55J89j24k20K89K4J3j51k6N3j93J61J36j8n2n0jn0J3L02J6j26k03J96
7821F2j88J14J19k50K19j07R7n9rm4j5K60j30o8K0j09K3J24m9R0k79K33o8j9q3
7846a16K45n7k35J95r7p0J63l6m5L8Q4q3m6J52m9N1q2J19k02J83o8K3j07O8J8
7871D6k7NN1j54J26j83J35J7j65J79J42o4L7j10j99K42N2k30J10J31j03k55J37
$$ y = [-139, 13, 177, -106, 38, 51, -57, -15, 90, -15, 64, -44, -227, 5, 52, 42, 106, -4, -4, 18, -125, 134, 43, 127, -98, 22, 135, -44, 11, 41, 18, -165, -147, 6, 9, -10, 52, -70, 90, -112, -158, 33, -40, 51, 27, 32, -102, -15, -26, -244, 60, 108, -11, -64, 179, -70, 150, -133, 149, 44, -59, 15, 62, -64, -36, -47, 34, 60, -54, 257, -8, 46, -51, 71, -36, 70, 70, 67, 119, 26, -51, -127, 26, -81, 101, 157, 99, -43, 29, 44, 6, 7, 6, 32, -50, -34, 90, -19, -6, -127, -252, -53, 39, -116, 73, -51, -271, 18, 42, 55, -96, -122, -69, -262, -101, 35, 17, -35, -85, -86, -136, -123, 179, 195, 69, -134, 62, -126, -12, 107, -143, 76, -31, 66, 7, -2, -46, -61, 199, 69, 1, 21, -88, -65, 59, 10, 100, -179, 54, -14, -33, -116, 129, 72, -163, 32, -65, -135, 28, -8, -53, -15, 69, -14, -60, 92, 43, 94, 12, 131, -71, 112, 44, 67, -40, 28, 46, 19, 24, 75, -79, 47, -136, -1, 16, -149, 30, 172, 108, 145, 35, -164, 78, 130, -100, 10, 141, 38, -217, -80]
7894h0P8j10N2L0PJ35q6k7J80j28j53J29j06K06k01O1Q4l41L03J73j17J26l04
7917h9Q9J23j71R0L9q7q5O3L5q8K42j39j70L58j36QL0k36j7K45p1R7j89j7Om6
7943a16K98j27J52j13r4j5qO3k13J80j56J43N0J15k21K73k20n7J27r2J45l80L43
7966G7j51L02l59J9J52j45Q9J05j32mL1J69k9ro5j6o0J12r0J18n89K28kK50J15
7991A16k24P3M0J45k56L01k20m1r3J73l9k1J72j50k4L5J43k38N2m6K51k4j80J94
8015A39Ol51M88q5Q1J59r66P92k73J07L2J10rk61J86q9l38L27r8m4N5P4j50L0
8039g8N5L0Q2j50J04m7J3j20J20J64q1j20K09k10r2J18R9j45j05K5J75j52K21
8062A15k41J61l9J56k51LJ61p5jJ4J2Jp0j3k4K15j89J23q9q2K0K35q6j83J8O3
$$ y = [-80, -2, -112, -60, -30, -23, 112, 26, -1, 179, 51, -102, 27, -79, 127, -74, -13, 71, -270, 33, 206, 89, 215, -89, 0, 123, -48, 42, 81, -6, -91, -28, 7, -81, 161, 22, -148, 210, 74, 82, 112, -124, -141, 104, 33, 130, -59, -76, -70, -116, 182, 55, 207, 94, 0, -15, -23, 40, -173, 7, -149, -6, 44, 159, -62, 211, -9, -66, 61, -31, 114, -266, 77, -74, 228, -131, -112, 40, -105, -16, 89, -43, -47, -16, 153, 124, 115, 50, 34, -26, 86, -4, 114, -475, -247, -249, 1, 116, -108, -35, 5, 150, -106, 195, -25, -66, -159, 14, -25, -46, 126, -24, -48, -13, 130, -108, -56, -102, 149, 125, -55, 139, 145, -206, 282, 197, 278, 437, -529, 263, -10, 97, 129, 239, 230, -31, 155, 66, -272, 55, -43, -87, -32, 42, -108, -78, -23, 7, 89, -61, 43, -4, 9, -111, 9, 173, 92, -28, 181, -29, -121, -3, 96, -49, -154, -129, 46, -106, 115, -126, 35, -4, 152, -99, -96, 65, -10, -11, 3, 15, 16, -54, -67, -91, 124, -65, 58, -31, -113, -93, 142, 56, -127, -109, -46]
8088d6j0R0O3j01J66p5j40N5R5M4r5k89K98l9o2P8k20M6N2L69l46N4Q0o4M3Q3
8114A29k83L04k98J85J87k85pJ81q1kq8J59j73j7L2n1J15P7j81Q7J36r9R1j57
8138c9k4M7m8J30N9j14Q6O3k20K24j09j16J01Q6kj93N0J37j37n5k9J47m3j24O4
8163e9K03j48r0K8J3j28J57l9J86k20L09k08j51L68j16j22q3N8n7J43k4Pmj2l
8188HO1j00l8
$$ y = [-46, -56, 34, 97, -4, 162, 87, -53, 2, 97, 141, 46, -243, 55, 16, -46, 32, -188, -142, -90, 279, -67, -13, 67, 3, 46, 129, -154, 150, -148, 37, 224, -61, -68, 113, 32, 30, -58, 101, -72, -89, -57, -108, 7, 84, -97, -10, 126, 27, 118, -39, -63, -16, -64, 66, 125, 11, 97, 160, -60, 164, 55, -61, 40, 126, 124, -69, -19, 118, -19, -74, -103, 44, 1, -123, -59, 144, -4, -94, -66, -53, -181, -24, -63, 123, -97, 212, 4, -147, 221, 105, -17, -100, -42, -99, 44, 20, 27, 23, 11, 8, 69, -31, -69]
8191f9
$$ Imaginary data points
##PAGE= N=2
##DATA TABLE= (X++(I..I)), XYDATA
0@%%%%%%%%%%%%%%Qj6J6j6J6k4L2l2L8m6N2o0P2q1Q9j04J20j36J53j73J96k20
36a16K46k76L09l43L80m24M72n20N72o31O95p67Q46r32J027j130J246j374J518
55G98j684J873k091K347k648L011l464M039m798N847p393R896j4580K6186j04748
70h7409j98861J60134M2071l2682m0018Q1883Q1407K2326J19923K8016p5730R348
82A10408K8814l6649j60019m0268K6026r7857n615P3613O7136R32o196J22597
94H2922N8351k141J0495n5915m9317k1097j1944p5974j25634M2423P9248O722
106f1861o826J7097R5361O0320K5695p83n6279n33j947o2626o4008n5000P776
119a03614M474k958M7261K9342L6608L0340L5714L4859o519j4681n5745m0741
$$ y = [0, 0, 0, 0, 0, 0, 0, 0, 0, 0, 0, 0, 0, 0, 0, 8, -8, 8, -8, 8, -16, 16, -16, 22, -24, 28, -32, 40, -41, 48, -56, 64, -72, 81, -92, 104, -116, 130, -146, 163, -180, 200, -224, 248, -272, 300, -331, 364, -403, 443, -489, 538, -592, 654, -720, 798, -886, 987, -1104, 1243, -1405, 1606, -1858, 2181, -2617, 3230, -4163, 5733, -8847, 17339, -87409, -286270, -126136, -84065, -116747, -156765, -74882, 6525, 28851, 148774, 176790, 101060, 110408, 139222, 102573, -57446, -97714, -71688, -169545, -175160, -101547, -34411, -33479, -39675, 82922, 141273, 139132, 149627, 93712, 44395, 23298, 11354, -64620, -190254, -147831, -68583, -61861, -68687, -51590, 43771, 104091, 129786, 129003, 72724, 72191, 70244, 7618, -56390, -111390, -103614, -99140, -102098, -54837, -25495, 11113, 41453, 77167, 112026, 105507, 90826, 35081, -5660]
131e660Q219l4815n2077l9142J6911P1132J6633M710J5962L2148N9657J6577l2393
144G7862m6163j1603m56l9838l9313k0971j595K4356J6704K3386J9273K0365L7000
157E9007O080L137O38l0597l9283j9707O22j7125l0838j391J8974K6440K7455
170C412J5510K727M943M0170R740m8050k7786J163m747k6625j9021K623l893J3117
184c6717L7642J1775r320J6605L3033p681j9385L580j5990k9267j0564R559p902
197b4632k6641J4447L1691L131Q560J7894j686o424J9835Q144l6585k6150P909
210a0507N433j7759j0560J3543k020M991L2683N109j7792P183K2009k789k2710
223F814n111l576j6681K62J2510q043j7032J8693K4265p118J573J1299l374n649
$$ y = [-5660, 2559, -32256, -84333, -123475, -106564, -35432, -18799, -14089, 1873, 34021, 93678, 110255, 77862, 31699, 20096, 19640, -20198, -59511, -80482, -82077, -57721, -41017, -17631, 1642, 22007, 59007, 65087, 68224, 68862, 38265, -1018, -20725, -20103, -37228, -68066, -69457, -50483, -24043, 3412, 18922, 21649, 26592, 66762, 76502, 28452, 666, 1829, -2918, -29543, -48564, -45941, -49834, -36717, 925, 12700, 3380, 19985, 53018, 45337, 25952, 29532, 13542, -15725, -26289, -16730, -24632, -51273, -36826, -5135, -2004, 6556, 24450, 22764, 16340, 36175, 44319, 7734, -18416, -10507, -5074, -22833, -33393, -19850, -21870, -16879, 15804, 20913, 3121, 10304, 32313, 29524, 6814, 1703, -1873, -18554, -18292, -5782, -13825, -30857, -12164, 12101, 4983, 6556, 17855, 14481, 8832]
237H832M677L972k2092j7099J6079K442j4312M000R956m989M063K2755Q7j9131
251g60K182J4213j345j6962l518R90j1690J0120J4117j7388r393K1034J6073r905
265G768r187Q626O35o383M674m40j7353m601J9205j197j4203R689Q076p316P40
280a267J2960K326j8162k853J5359l494r585R16m211l205J4683R201j7371r863
294a4566J7451J4862r937j4105L510M924k111N462o121j4474Q967J4953n537j0034
308f756M848Q871m213l882P640j541j0422J396O317l627L30K868r777q50J6805
323H007N253j5243j0345J3938J2282j0142q589q40r28R179P012j3077j2036J3213
337b316J5627p973j2104M891Q028m451k181L768o598l170R436k307o831O533M837
$$ y = [8832, 13509, 17481, -4611, -21710, -5631, -3189, -17501, -13501, -3545, -8534, -4471, 18284, 18371, -760, 1422, 15635, 14290, -2672, -6190, -5200, -16890, -6770, 7347, -10041, -19434, 1600, 17673, 7768, -1419, 7207, 7842, 1459, 6133, 5693, -11660, -16261, 2944, 1747, -12456, -2767, 5309, -2007, -1267, 11693, 14019, -4143, -6996, 8363, 4869, -4716, -3800, -8011, -11216, 3467, 12668, -4703, -14566, 2885, 17747, 7810, -6295, -2785, 2139, 28, 5490, -631, -15105, -6138, 8815, 3278, -6756, -1908, 6963, 2750, -1132, 6508, 4967, -5455, -4059, 2258, -1369, -1039, 1829, -7948, -8798, 8007, 13260, -1983, -12328, 1610, 13892, 3750, -4839, -5679, -6607, 2572, 9584, -3493, -15529, -2316, 13311, 5338, -6766, -1875, 6153, 1702, -479, 3289, -3309, -6479, 2957, 650, -6181, 352, 5189]
352E189p754m160J2564P054j5698p775J2934M749p251j683k578m164J1753R291
366A2471j4475j1770J2277J6211q300j5442N954O726l905K489l61r945K471J3051
380G452k925j1143M788R295o354p753R792N478j3713l283J0933M22m443J923k627
395b158l861Q454R787j0592j4091R725J5248q700j2009M388L019J032M312l498
409A056p914L016J1881n94j2540J496R569m956o492P130J044q460K276N579j775
424C16J46J425j270l322M818Q279j0009j1122R425Q253o715n677J538O22M032
439G39O185o099p002N481J0056k584j2792L328O864o507k78L110k841k539L937
454i42M674m835M90O156m244m324N803N731j0524o770R956J458m780o03q38J309
$$ y = [5189, -2565, -6725, 5839, 12893, -2805, -10580, 2354, 7103, -148, -1831, -4409, -8573, 3180, 12471, -2004, -13774, -1497, 14714, 6414, -9028, -3074, 3652, -253, 2236, 1875, -8070, -5599, 7452, 4527, -6616, -1828, 7467, 1113, -6640, 3152, 8630, -5083, -8366, 2567, 2989, -1454, 469, -2158, -6019, 2435, 12222, 1630, -12461, -2736, 12512, 3812, -8197, -3809, -790, 242, 4554, 1056, -6858, -3842, 8039, 7445, -5095, -3599, 5970, 1014, -5478, 1652, 2696, -5764, -3488, 2091, 316, 462, 1887, 617, -2705, 2113, 10392, 383, -10739, -1314, 6939, 224, -5453, -3915, -3293, 739, 6924, 825, -6177, -696, 9360, 6776, -6016, -2688, 4176, -2331, -2609, 501, -2340, -4879, -942, 3732, -1103, -613, 5543, 1299, -3025, 2778, 8509, -2015, -8785, 1171, 2629, -2151, -2754, -3592, -2283]
470b283K076P028k651j2023P729J0635o996q979L350M890n312O17K423m978P27
485c747N186K978n631j840J0589m793p045Q490J7o990k071N221J154o051L077
500a456J120k963L815N393k637j0081O938J0452j0164m641L591R47r48j335K810
515H41n453j143J1247j344p596J112P371j123o720N762J49p076K421L186j144
530D90n186K712N530p876L056P285o070l382M083N673m855m997M419j015j446
545a579K978n6n533k116J0804o17r714N097K900r83O14J59j38n646M145O312q387
562a760m033N344K734n096j77O322n377j033O714j52l122j826N333j253o478P097
578C237q11q037J572N464J09o488K511M543l195L601K448l570m475N017P285j0228
$$ y = [-2283, -207, 6821, 4170, -7853, -124, 10511, 3515, -5464, -2114, 2776, -2536, -1919, 504, -4474, -3747, 1439, 4417, -1214, -3054, 7535, 2742, -4303, 4187, 4204, -2786, -4857, 364, 1518, -4533, -1456, -336, -3299, 516, 5909, 3272, -6809, 129, 10581, 417, -4224, -633, 314, -634, -1969, 841, -4612, -5755, 5492, 4148, -3448, -2336, 5035, 3912, -2808, 2954, 3103, -3973, -1552, 1634, 490, -4696, -1984, 3546, -4330, -1274, 6011, -59, -3441, 642, 6315, 1460, -3537, 882, -133, -1579, 1399, 1343, -4190, -6306, 4498, 3881, -5833, -736, 2164, 1181, 1795, 1954, 1816, -3830, 315, 6627, -1760, -5793, -449, 2285, -2811, -2988, 3334, -2043, -3076, 3638, 3486, 364, -1462, 3871, 2618, -3860, 3237, 2426, -5611, -4039, 1425, 1534, -4954, -2443, 2100, -1095, 2506, 4954, 1384, -3091, 1926, 9211, -1017]
594a017n785P005q65j524m42N73q34K33Q350j478p109M654N079l549n833M315
610A773N1q089K937K841k506r56J985L796l485L314Q049p744m966P495L495q440
626d50o513N040R9k117K296j627k003L024J0317j471j0487O661O788o390m166
641i99R23K53n814M64M097m407o65O432K486l751K885Q404o292n799O362J778
657F357o546o248J812J903k790L271J23m207N823Q895j697p553L804N992m675
672D264m896j241r88k369J29K794m324L16R132k05k792M583M457l444n134K893
688C175Q78n977l387J07m17j09M042l59l758P848P465m127m011J841M258l626
704C843n385n98l147j095L527q07l450L112Q313m61l164M423K264k204l537K66
$$ y = [-1017, -6802, 203, -662, -2186, -2628, -2055, -2889, -2656, 5694, 4216, -2893, 1761, 6840, 3291, -2542, 1773, 1824, -6265, -3328, -487, -2993, -3949, -1964, 1832, -1653, 1661, 9710, 1966, -3000, 4495, 7990, -450, -6963, -1923, -1824, -3941, -1645, -3272, -5275, -2251, 8066, 6595, -3892, 2769, 9557, 3167, -999, -76, 177, -5637, -5173, -1076, -5483, -6148, 284, 2770, -981, 1904, 10308, 4016, -1783, 4579, 6357, -189, -6437, -4625, -2722, -5512, -2241, -2118, -6325, -502, 8393, 6696, -857, 2947, 8939, 4264, -632, -1873, -2861, -5230, -5101, -2307, -6631, -6315, 2817, 2612, -180, 4403, 8860, 5416, 282, 3175, 4053, -1924, -5311, -5204, -5621, -5730, -1688, -2047, -5805, 2043, 9508, 5381, 1370, 3211, 7469, 3843, -1542, -2140, -5287, -6382, -2855, -3662, -7112, -4000, 4313, 3852, 688, 5111, 7375, 5171, 1634, 1900]
720A900p33n455l98N22l162L275M192k108j438O653O059m304l267K024J112l251
736A621l261j262l836Q23N947l430m054O380O282r97k735L201J436l860k73N85
752B567n022k994L158q69m571M220N979l579j184O569M321n349l551M614j192
767C117m393O60j953n182K709O916k958n584N897P156k470l432L704P62n277J517
783A189J709p025j858N730q59m932L223O166k498l576O414L983o305k350M331
798C342j921m438K729m71n706K389O574j909n647M042P673l449m173M016k55m051
814a255K111J480n591k405N874J440n635J149N994j251l653M275K158n279l80
829i68L372j937l145J716J313l393L03N167q12m905K775M685k740j669J753j335
$$ y = [1900, 1167, -4288, -4686, -4164, -7326, -4051, 141, -1967, -3405, 3248, 9307, 5003, 1736, 3760, 4872, 1621, -1640, -2902, -6738, -5915, 32, -3398, -7452, -1072, 5210, 4213, 1478, 4679, 6115, 2255, 1982, 2567, -2455, -5449, -2291, -3160, -7731, -3511, 2468, -1111, -2295, 4274, 8595, 3246, -305, 4309, 3117, -1276, -616, -2569, -7751, -5042, 1874, -1084, -6668, -771, 6385, 3915, 483, 4187, 4949, -328, 1189, 2898, -4127, -5985, -255, -1114, -6046, -2823, 3343, 845, -2731, 3683, 7666, 1361, -989, 3342, 1421, -3017, -288, -759, -6465, -4076, 2498, 589, -5058, -1016, 6657, 3208, -965, 3051, 2796, -1255, 856, 2336, -3255, -5660, 214, 1654, -3981, -2832, 3162, 1911, -1742, 2533, 4691, -588, -968, 2404, 467, -2678, -962, 351, -3042, -2739, 2428, 1616, -3289, -514, 4171, 1431, -238, 1515, 180]
845A80j905K520Q35l846j562M491J615m044K1L697j706r58L008j336l289J582
861f97K429j458k027J591J264k422O67K982j888k495K735Q95k575K98J463j430
877f68q74K925Q06l628k36L590m14k537J104J62j988J352J951k051k128K603K050
894B019j849j207K532m52j770K236K54m080L49L244j383k253J622J684j690o08
910a352M138k06m308J979K629k643j832K341j029k966K483K424k681k063L729
925F43K898l487p01L122j864j641K762k71m312L71L901j268l474K616K382j961
941b84n20L575n57m024K532K329l650j252K174o22k464J532L280l007j794M475
957A723J510l258l26K448j732j619K600j033l205N03L809o82m044L009K942k964
$$ y = [180, -1725, 795, 1630, -2216, -3778, 713, 2328, -1716, -1695, 2002, 296, -662, 2346, 1010, -2279, -697, 1732, 274, -1753, -162, 1102, -1320, -653, 2329, 441, -2054, 681, 1576, -999, -701, 762, -668, -1542, 1383, 2189, -1439, -1675, 1915, 1501, -1036, 68, 230, -1758, -406, 1545, -506, -2634, -31, 2019, 170, -1037, 1495, 1043, -727, 1509, 1763, -2317, -1968, 1276, -107, -2360, -738, 946, -744, -1352, 2786, 2580, -1728, 251, 2880, 237, -1595, 746, -283, -3249, -766, 1658, -1023, -3086, 643, 3541, 54, -647, 2475, 611, -1030, 1732, 1461, -2851, -2480, 1421, 153, -3321, -705, 1677, -284, -804, 2771, 2214, -1810, 722, 3051, -599, -1851, 323, -299, -2763, -1231, 2049, -958, -2752, 1723, 3233, -25, -351, 2097, 365, -1254, 1346, 313, -2892, -2389, 1420, 738, -3306, -297, 2645, -319]
973c19M48K087j267j940J122J582k791j211K694p83j793J536K916k503j985M437
989B230p7k442O50J42q23m36J588o94l605K446L624k314k223J769K339j934J61
1006D01J240k457l51J985m5k645k97L872j417k406L475O03k437k11K306k01l061
1023a646J556N42k551O41K966j060l775L019M153l486j390K052M16j005p18R23
1039F37k302j028L939l48l624J013M008n50k841K532Q15k273L58L54o21k085P73
1056a243J777l192J013L814k049j609K097K713j625k232J308m90o57L27q43j914
1072b805r1M377n92l574K538K435l26j000k16Q73k249P34Q82l093o10K110Q43
1089B36k569J093L312j544p35K158P64r48k093P85n39j759K030j174k816J735
$$ y = [-319, 129, 2216, 949, -991, 131, 1713, -1078, -2289, 405, -378, -2171, -635, 2281, -222, -2207, 2230, 2153, -289, 361, 503, -320, -756, 832, 138, -3467, -1021, 2603, 289, -1934, -165, 2174, 240, 401, 1641, -816, -1167, 818, 773, -1872, -2169, 1703, 286, -2120, 1355, 1958, -479, -690, 1616, 1415, -1646, -90, 452, -2099, -1458, 1508, 448, -3327, -308, 3845, 359, -1031, 1021, 1437, 432, -286, 637, -1665, -2693, 1246, 898, -2726, -1713, 2295, 1745, -1096, 1436, 2251, -22, 336, 690, 69, -2016, -1243, 534, -2658, -1645, 2169, 120, -1489, 608, 3321, 1696, -536, 772, 282, -375, -48, -891, -2805, -2896, 1481, 889, -2685, -147, 2288, 1962, 962, 746, 1619, -630, 104, 986, -2107, -2717, -607, 236, -2333, -1240, 2072, 528, -207, 1951, 2715, 1767, -326, 459, -80, -1839, 191, -983, -3799, -2064]
1105b064L350J83l016J627K351n93j62p83n91j182O79R88l631m89L315n72n01
1122a091P79J880k83j092K143m49j620K19j61j681o93K200j076l038K756K561
1138A354r39o85P62K229j088j51M59k773q40K421n10l242j39L706p38r55J634
1155E05R17n29l31K018n77l342K002K03k924O5K007n99k227J807L025j630r29
1172e39J783J060j539r9J313l143r86L239p31k813q8L078N85k373J763J235j832
1189h7P45J877j607k861J820J169k344l87J693j53j420Q52K822j485j687K497
1205A444qj732O44L84j547q32K229M57k734j54K321Q23j935P56P69j867J427J568
1223B013j998j077O91J525j069j211J312l7j065R61R50j467k27J604j42j360O86
$$ y = [-2064, 1286, 1469, -1547, 80, 2431, 1838, 1676, 893, 302, -880, -201, 787, -2844, -3333, -18, -590, -1091, -312, 1568, 1285, 193, 2336, 1887, 267, 486, 325, -1356, -2049, 151, -925, -3963, -1207, 1354, 415, -270, 492, 2721, 1633, 1482, 1941, -832, -1672, 749, 239, -3003, -3142, 564, -174, -1129, 505, 1422, 893, 562, 2580, 2003, -1339, 663, 866, -2058, -1993, 14, -585, -2812, -1005, 2020, 390, -539, 1244, 2304, 765, 666, 1979, -1164, -2150, 1089, 358, -2455, -2543, 535, 1120, -1253, 510, 1745, -87, 658, 2535, 928, -1933, -113, 1056, -1288, -1675, 18, -135, -1555, -703, 2119, 634, -1053, 1444, 1436, -296, 348, 732, -815, -1647, 582, 1039, -1695, -1849, 472, 1295, -640, 116, 885, -982, 445, 2013, 15, -1062, -371, 1154, 85, -1126, 186, 149, -916, 45, 995, -472, -699, 905, 763, -597, 89]
1240H9L18o86m57J420N73k241L83J261j069R0P15j116j01R91J069j615n66J293
1258C51R48q26o45P23j186J06J506j125j600J257O95k02k93L54O20j002P97J095
1276A573j236q77J204l41j809J340N15j786l47K178O86j456m13K024P3j139J235
1293A424o29j945O02K206k343j856J502J947j085q58J628M35j160J452R94k418
1309a04q62K006o55k034N45J297j323j495K546J645k233L86K478q16r77J181o84
1326I01k295O51J549j345k772J354K916j269q38K271R1r82J812N63k733o75J594
1343G93k14k614l59K460j058j373K705J320k089N51K311r86j132R18k44k122n42
1360a675K155q75k782J313K785j031o74J746L83m18P88M33j854j587J563M91k704
$$ y = [89, 407, -279, -736, 684, 1257, -984, -601, 660, -409, -319, 396, -720, -821, 170, 1239, -376, -942, 351, 1299, 473, -172, 551, -635, -529, 977, -148, -1748, -491, 204, 2, -291, 63, 683, -319, 478, 1573, 337, -540, 664, 323, -1486, -146, 369, -1417, -1764, 414, 1100, -356, -769, 1255, 1328, 189, 1424, 795, -1150, -548, 1658, -685, -2541, -1039, 908, -177, -1035, 593, 1028, -132, 1320, 2314, -104, -966, 1040, 385, -1649, -1104, 193, -1130, -2625, -79, 1566, -667, -281, 2197, 1381, 404, 1585, 901, -1394, -743, 806, -539, -3311, -1957, 959, -310, -1148, 1123, 1214, 232, 2044, 2607, -126, -801, 793, 579, -2035, -2394, 66, -992, -2365, 340, 1660, -429, 122, 2433, 1447, 315, 1233, 989, -1133, -1675, 480, -395, -3177, -1864, 921, -110, -784, 962, 1345, 927, 1715, 2148, 294, -1293, 270, 761, -1943]
1377a943l78J932l94q06J885O85m21J68R38J15j656L55M36j850o49J584r45j356
1395b300J032J717j11PN3P34J37J02R1j244j220J185k61j626J6O67K55O70J59
1414F3LP30L04O77l65q46r2m80q31K71j18q29K86O30K4R71K62p8QK99Q47q05j881
1437i50O96P63j473j25L60o66L92J301M07j135L54J765K69j748m2J115j921l22
1455i60J072q31j127R41J224k81r06J508O59j300M42J775j520k275J590O97j454
1472g46l47P63k29l20M74J963j869p32K768m0k014R0J369j303p79J223k56j463
1490a448L17K090m88j802J647J330k273N58J897j118j461L14J592j549j139J629
1506I6m2r59O06J535j612j101K754J24j648N9P02J42j129K59O47j675J02J900
$$ y = [-1943, -2321, -389, -783, -1589, 296, 981, 560, 728, 1666, 1781, 125, 480, 916, -934, -1583, 1, -944, -2300, -1268, 449, 338, 345, 398, 1132, 1269, 1371, 1462, 218, -1002, 183, -78, -1704, -1688, -1021, -766, -96, 63, 66, 796, 1100, 1777, 1412, 566, 474, -6, -837, -566, -684, -1513, -1227, -597, -573, 398, 660, 582, 590, 889, 1736, 931, -950, -254, 509, -964, -1089, -729, -1395, -1003, 298, 705, -430, -76, 1689, 1958, 210, 168, 1283, -638, -960, 112, -719, -1846, -905, 319, 38, -868, 640, 1299, -1, 441, 2216, 696, -1579, 11, 708, -746, -1093, -330, -559, -879, -405, 1558, -311, -1043, 1725, 1685, -329, -239, 1130, -173, -952, 271, 15, -1448, -1131, 959, 471, -1331, 316, 1646, -627, -69, 1828, 710, -751, -437, 1155, -394, -1533, 96, 54, -905, -299, 1236, -376, -1477, 1277, 1401, -247, -188, 514, 656, -473, -214, 433, -1242, -1140, 760]
1524G60p16j132Q18J363q42k44R94m47o87k83J075j06j790J429j34j281J168L05
1542B50n01k89P30J116j244l83R11po36PJ36j107M15J473j214n89N72Q30K51r13
1562a92P62J42p57L69O3n61m66P10m43m26O66k2k95M72k4P62l87n68Q85q16N23
1583C97J83j154r4L94O94q11m18Q75O4J40K30N7l49j86J158p09j661J294j78l90
1603d64j56L85M50j016N25J228q21l19P84Q4j076O10P03j688k07R25J59j91j111
1622a196J248N03j070J487k36j161O21P58m25j313K18Q30n50o0P9J77m18N26J240
1641A258j803J19J524p17m33M0M43p41p41J382j00p61K8J058k95p08J428k66j620
1660i05P10J105n16j404J44J492r89l87J373n98o75J201M95j043r02J538k7j123
$$ y = [760, 44, -1088, -270, 1093, 251, 7, 1001, 554, -133, -416, 659, 553, -1237, 192, 58, -1223, -55, 250, -251, -540, 190, 1306, 62, -321, 590, 583, -53, -46, 90, -1017, -602, 871, -343, -932, -360, 470, 721, -192, 570, 712, -45, 324, 387, -174, -640, 70, -373, -799, -133, -155, -450, 22, -2, 760, 373, -195, 690, -126, 397, 580, -574, -668, -274, 420, -391, -809, 66, 130, 270, 500, 557, 208, 22, 1180, 471, -1190, 104, -74, -464, -620, -235, 215, -801, -276, 952, 131, -188, 596, 680, -396, 214, 917, -771, -978, -53, 106, -85, -1196, 52, 555, -515, 972, 736, -425, 196, 954, 529, -784, -566, 264, -286, -346, -267, -90, -508, 18, 1258, -545, -426, 1098, 381, -52, -12, 431, -310, -1051, 331, 231, -530, -502, 556, 261, -447, 981, 715, -905, -195, 910, 394, -1010, -866, 626, -363, -750, 623, 25, -650, 551, 1046, 3, -899, 639, 612, -511]
1678e11J1P74j73j307J347P85j585P15O89n90l27Q1O49r20m03J161qj207J17J201
1698D99k35l68P04o10k35R86l22k83j065O66Q80j106l26R76m99K69P07l67m78
1717b07L10K94qn62J85j62l14k37J101m20p09Q08r6L93J36j69l01j71K77K84q26
1738c94l44M47L55m49K18K98m92P00L44n38J34k06L87l69n75N38l80l02P41q8
1758B5m28J10O49o3pL61k93j84n00Q51k60j338L50P21m46L7M68j28K6K47Q15p42
1780B71n74O30L43j031k04N92n06n12J206k5n53J28O40K12o46L44L23p94k19Q74
1800D99n15p13M3Q23m59K48J71m3l88N63P03o29o92P19L44j003m6L09l66L7L97
1821BQ8l92L9R59n7r18N63M41r51j04Q36n75m34P8N81j00m06J55M46o62M81P54
$$ y = [-511, -500, 274, 101, -1206, 141, 926, -659, 56, 745, 155, -172, -91, 558, -362, -765, 396, 388, -819, -702, 499, 264, -104, 600, -10, -245, 741, 419, 136, -929, -263, 617, -489, -815, 161, -338, -69, 638, 271, -207, 103, 397, 389, -173, 12, -150, -464, -701, 400, -20, -729, 79, -17, 376, 512, 343, 42, -129, 148, 432, -394, -738, -291, 64, -385, -167, 131, -361, 339, 683, 145, 279, 73, 460, 91, -484, 54, -326, -628, 113, 25, -403, -293, 356, 293, 286, 647, 354, 170, -330, 521, 261, -1077, -727, -6, -452, -415, 53, -75, -49, 198, 1013, 271, -303, 327, 670, -361, -565, 27, -479, -991, 215, 190, -363, -235, 405, 617, -29, 315, 638, -156, -375, 499, -16, -729, -686, 137, -322, -74, 97, 54, -334, 229, 932, 303, -389, 330, 674, -329, -375, -66, -432, -395, 2, 90, -302, -263, 696, 639, -279, 284, 725, -226, -330, 506, -69, -503, -425, 156, 56, -350, -195, 251, -411, 70, 824]
1843H24r11k09N67N6l29q8O4q0j27L23K20p61P0Q96k57m94K83J12r6j39L25m2
1865B07m82J04L32l77k23M65l8m52Q31K10p38J55L29L84n99J01j08j98j01K71
1885G3p2q57O23O76o36k4M13P8Q3j32L17l06p56O01J13p21J74K53k71j14O66K23
1907D04n40L7L08R2j59pL09q35J76L68o44n63P28M13j49k63M94K34j87M23J87
1928H26p00l43O15j79r45J96K69j97j04O04M43o27K82R82l66o92L99r5p42J28
1948b46L36n95o84P32L78J15k24M74L76n58O80K26r88n5M04o16m57O3K69j27j
1969d98M02K86j50L86O82o00k19K32m85l64j6J9l72m81N86Q06o20N36L83j50J77
1990E40M90l06q29o0M07l86o99J54K19m6j77J026k49k03P96K00j43n62K27k72
$$ y = [824, -87, -296, 271, 327, -2, -90, -26, -106, -233, 90, 310, -451, -381, 515, 258, -236, 47, 159, 63, -76, 249, 207, -275, -171, 161, -216, -439, 26, -12, -464, 367, 577, -161, -6, 323, 707, 108, 209, 101, -97, -198, 73, 1, -856, -233, 443, -193, -217, 196, 274, 357, 225, 542, 236, -520, 81, 194, -527, -353, -100, -371, -485, 181, 404, -136, -99, 209, 301, 142, 135, 444, -391, -215, 153, -491, -1054, -326, 87, -62, -325, 169, 403, 216, 639, 826, 126, -217, 398, 219, -726, -530, -261, -458, -562, 42, 485, -142, 140, 1122, 756, 64, 463, 368, -374, -246, 90, -505, -1189, -457, -79, 36, -188, 286, 662, 104, 784, 1010, 22, -33, 371, -245, -702, -639, -370, -497, -498, -96, 190, 40, 426, 1108, 508, 289, 521, 36, -328, -344, -325, -697, -1178, -592, 214, -406, 130, 513, 363, 540, 1030, 724, -105, -165, 242, -144, -843, -689, -470, -516, -693, 333, 84, -119, 677, 877, 734, 172, 399, 127]
2010A27l12j34j63l30q6K99O50k73M53J08m5L88J25k48n88j93M76o60o84L58K67
2031d65n8L51N00k32j03R38k97j40l21P5n0p56O5L07r25L51P66j77P7L78M70o01
2053A53R6Q11n70q30J22M74l57q62R99k22l99N77L61k38k52Q52K06j003O4J62
2073A44j76l42L0K77o56J83R66m23j51J55N32m5m45O04k74q05O04j03m62k53M23
2094b17K00n11N38O01n82j21M43M52p41l43R20r44K2J61j96j92J01P43k51m43
2114c60M90N07l56k88M38j19o35M78N9o31J72J29J49l65J14O66m73j62O57j23
2134C47k63j63K42k3l18L31l34k67K38M63l23l06L44J77lK16j50j61j59N02Kr34
2156e42M46p4N02m62J20Q4m05l0J034m57k97M00j51K95m27M37l52o64M78K39l26
$$ y = [127, -185, -319, -482, -812, -898, -599, 51, -222, 231, 339, 294, 682, 807, 559, -29, -222, 254, -406, -1090, -732, -465, -523, -172, 328, 96, -7, 931, 634, 494, 173, 248, 198, -558, -493, -186, -1111, -760, 6, -171, -94, 284, 754, 153, 249, 1060, 490, -340, -218, 256, -101, -963, 36, -186, -585, -8, 353, 115, -137, 715, 921, -82, -18, 144, -32, -374, -344, -67, -723, -540, 426, 3, -148, 7, 539, 494, 49, 653, 379, -426, 178, 75, -387, -640, -217, -17, -528, 10, 611, 29, -92, 351, 803, 62, -281, 639, -305, -283, -122, -318, -510, -409, 334, 83, -360, 130, 637, 281, -7, 431, 312, -323, 155, 214, -417, -245, -116, 33, -332, -218, 448, -25, -187, 470, 347, 84, -79, 163, 140, -178, 153, -181, -448, -210, 253, -70, -376, -32, 145, 142, 358, 208, 47, -112, 390, 392, -542, -96, -170, 332, -130, -10, 74, -331, -361, 673, 216, -81, 319, 168, 463, 36, 473, 121, -543, -65, 174, -152]
2177a52k98L10M14l17J82K45n35L88J29R6q08k12J024n60k03J65j41J15J5L58
2197B15l44k12N84J58n25J7K68Mo45M53K59q13K42M07p3p3J24L94o54j1P49l01
2219B23o25J19O07k09p95O73K6n01M97K61j24n32Q03J54r64N12K30m33k80L05
2239e3J84n07O7N64l89l8L05M12q35J95O69n40m47N65J09m11l16N23j86j90K72
2260d7M45l48l37Q30l03n02P2N63n51k14O75k05m25o0P08k81j95M30j7m70K37
2281EM78k48p27L59L97j70j88K59k64l06M30L79m49j25M77j09k20n3M27l48p9
2302g5K17k5n25K37L36l37m6K61pl04J93L05k55l58L77L64m12j59L05k75k87O86
2324B16K7o21k3O07J2m63J73K71l45j57P40k83l78K22K37l57o4M99k32l83L96
$$ y = [-152, -450, -140, 274, -43, 139, 384, -151, 237, 366, 462, -346, -558, 466, -94, -297, -132, -273, -158, -143, 215, -129, -341, 243, 401, -124, -107, 161, 165, -480, -27, 232, -581, -339, 68, -5, -78, 46, 440, -214, -225, 524, 223, -402, -283, 324, 115, -680, -7, 19, -482, 15, 276, 152, -380, 423, 577, -387, 125, 355, -78, -358, -53, 131, -376, -309, 255, -134, -172, 133, 545, -290, -95, 574, 34, -413, 152, 261, -150, -466, 57, -129, -319, -47, 398, 50, -287, 543, 240, -262, -190, 373, -178, -392, 283, 78, -347, -407, 301, 20, -175, 255, 238, -232, 5, 483, 235, -492, -133, 264, 94, -94, 165, -99, -405, 25, 404, -45, -170, 307, 198, -22, -75, 352, 4, -75, 142, 117, -408, -171, 165, -172, -218, 43, 36, -268, -75, 230, -25, -383, -6, 358, -54, -213, 92, -183, -470, 216, 243, -378, -401, 206, 218, -245, -72, 199, -146, -303, 437, 154, -224, -2, 235, -122, -186, 313, 81, -302, 94]
2345I4P9k02l14O61N6n07K18K10o25L21K47o1o15J71M45j33j05J25J87l85p1M57
2367B53m9n33N26K92p11j1K44n4j81L55J89m44j70Q80k88o92M99J13l28J82J46
2388B18m2m20L2L44k66j99M12J78l88K35M10m78l26M81m3l40R4M72n83l48O42
2409H5o2m43J68N71l6l96J67J82q2j89K73k81m89K82M18k81o1K42O0m12K46J13
2431G5j57%M34j63o37L02L35n02r9M01M1l27L00L56j13l20K48J38n98K97K40l44
2453i3l77M75K01p15Q8P24l88j13L82K42m89k17N10M9n50J85J49n39J71M67j28
2474C4l82M28L02j50m77K27K93m32J42J16r2l43M32Ol54j14O21k74j02K87K12
2495C80m43Q5L70j46m53j8K75j62J5L5pk08L12L47l31j88M23N1m03q8N15o26L9
$$ y = [94, 173, -29, -343, 318, 374, -133, 85, 295, -330, -9, 238, 177, -438, -267, 178, 45, -60, 65, 252, -133, -204, 253, 204, -329, 197, 489, -222, -233, 11, -43, -224, 131, 320, -124, -294, 586, 298, -394, 105, 218, -110, 72, 218, 176, -244, -212, 132, -134, -333, 79, 257, -131, 104, 514, 36, -290, 191, 148, -192, -98, 374, -209, -557, 85, 23, -420, -252, 319, 283, -113, 54, 236, 154, -35, 238, -43, -532, -250, 168, -113, -174, 68, 128, -284, -38, 75, -82, -82, 352, 189, -448, -146, 189, -313, -412, -11, 30, -297, 3, 359, 246, -74, 174, 312, -286, 11, 251, -93, -470, 5, 206, -509, -421, 303, -85, -198, 184, 426, -63, -280, 230, 279, -271, -86, 63, -476, -305, 162, 34, -348, 80, 382, 232, -245, -18, 275, -157, -15, 101, 9, -334, 98, 104, -250, -364, 257, -17, -119, 168, 380, -63, 22, 392, 246, -207, -225, 50, -112, -97, -62, -69, -277, 35, 382, 51, -137, 286, 337, -66, -154, 361, -265, -226]
2518b26Q3L09l38l2M40j01l19M66N1l66JJ83j34oR3M8k58J20K10l16m16N21K42
2541B55l68J71J59k51J68Q6J02m82N1K39l20Q4j51K48l21R6L47r7q6K26J53l16
2563gP6J23k49k26L50R8m29m4K73N6o8K12K47m14L1L33j42n07R5O05n39k13M39
2586A00j44j43OL78k22l49P62m7m05J83J72j41l98L00J07o02R8L68j17l71O32
2607A67J98l21k43P98l71m08L67J11l43m22L34J75o89N60J67m2P0R4K23m72j32
2628a79O57m91l5m6K47n22J77M90l09k33L34L79l76j47M66Q9n83Q8K86k54l68
2649c30l2M41n51M9Q30m31j71L61K30m86J37J93q9k64kJ19j98k34M27l4l89M45
2671B1K02j88J13J44J08l40L1O8k75J8J36L0l95J65J84j39j10M76k36l4j4J91
$$ y = [-226, -143, 166, -172, -204, 236, 135, -184, 282, 333, -33, -32, 151, 17, 11, 104, 152, -106, 14, 224, -92, -508, 13, 255, -113, 58, 217, -34, 134, 220, 322, -160, -109, 130, -190, -106, -257, -9, -330, -234, 113, 16, -70, 156, 309, -7, 69, 192, -57, -283, 67, 165, -264, -308, -35, 21, -47, 165, 412, -2, 29, 362, 220, -287, -192, 413, -126, -339, 100, -44, -187, -181, 197, -25, -374, 388, 341, -64, 119, 291, 150, -248, 52, 159, -443, -345, 23, -94, -465, 167, 365, 44, -199, 599, 228, -180, 187, 298, -45, -467, -133, 42, -647, -87, 80, 38, 108, 202, 425, -47, -179, 478, -13, -48, -94, 153, -369, -192, 298, -11, -244, 90, 469, 93, -54, 412, 501, -82, 6, 292, 38, -330, -362, 79, -472, -423, 407, -24, -195, 166, 396, -90, 47, 240, 151, -113, -115, 4, -194, -428, -1, -35, -424, 21, 223, 35, 148, 292, 400, 60, 91, 159, -116, -98, 38, 68, -327, -162, 22, -117, -227, 249, 13, -21, -35, 156]
2693A56j12j47J32n5m39L42J03j92j2J80K42k19L07j35o9N3j08J50m66J35L53
2714A99l76j52K89j21J55m9M14j09m95O19k27j78j35L53k87k88N33j60m32L82
2734f5J52j35j3L22J7n13L5P32k60n97K82J29l04o7M49k12p8J81K64k39k87N52
2756C45j17n41K32M44m54k20L33J08n34K15M52l17j61L18K08m38j47O63l26m42
2776c79K42L46k85k45L52L1l25K75J23k71j25N89J35o44J03K27j61l66K19J64
2796Ek57j20N78q5m53M64K30l65j24L94P5n73O7L48j51k90K04J34j74J16L31l62
2818hk91M48j30L1o1K50k32j42QL94m41p1L52l0k13L58j27n0J69j24qk81Q6L8
2842g5N6k02K60j44j28K67R0j85J00K83l30O6K35j95k04k7L51k32k14K31r7j7
$$ y = [156, 44, -103, 29, -26, -465, -123, -20, -212, -224, -44, 198, -21, 286, 151, 82, 135, 27, 177, -289, -154, 199, -177, -329, -40, -161, -6, -55, 359, 250, -245, 374, 147, -31, -166, 187, -100, -388, 145, -15, -447, -65, 87, -48, -61, 261, 278, -235, -200, 532, 272, -325, -43, 86, -218, -285, 164, -48, -126, 55, 319, 80, -207, 345, 228, -313, -81, 363, -91, -311, 22, 130, -404, -189, 263, -54, -215, 103, 311, -127, -274, 389, 63, -379, -137, 209, -76, -321, 31, 62, -263, 12, 135, -136, -261, 328, 463, -181, -78, 149, -12, -378, -159, 5, -252, -372, 206, 121, -332, 132, 362, -3, -127, 267, 342, -231, -164, 184, 33, -257, -53, 81, -93, 23, 354, -8, -299, 149, 19, 50, -11, 239, 7, -135, -127, 267, -174, -245, 107, 77, -136, 222, 95, 45, 214, 90, 82, -199, -113, -75, -19, -221, 39, -105, -233, 34, 124, -61, 39, 322, -8, 58, 293, 98, -106, -133, 218, -14, -228, 3, -94, -111]
2864a11J27j3M8P5m7J23J8l50J06R1n26K94K27l74J25L16j97j61L04J05J2j77
2886A5J44k56j81L49Q9n00J99K34j27k13J24L01j22j21L18L25p91j19N01m7l83
2907b61M90l01l04N1N39j99l93K78L95j28l77N75l82j80J99K39l78j35J07J53
2927a2l48J97M01k52j58M17L8l37j17K69n9k18K91K4l34j91N59j93q1J23J06k62
2949a37l3K93j29K5j63K95k90QL70Pk55k87N61k13q3O5J3j35kK22k08JP9Q9j46
2974e3q3M52r5l34Q9K21o1l65K80KK4R1k0p0m04N76j54k27P3M3j49J14M01k02
2998A49k90M5K37l0k21J57J53k31N7R8l73J28J3K91k15NR2r5M8J08j14k71K18
3021d1J01j27j79J58P7k0J31O4p7n11M79J10l19O0K08j10k48K82N8m42L54N7q8
$$ y = [-111, 16, 3, 51, 126, 79, 202, 220, -130, -24, 67, -459, -165, 62, -312, -187, 129, -68, -229, 75, 180, 192, 15, 159, -97, -278, 71, 160, -340, -141, 93, -34, -247, -123, 178, 56, -65, 253, 578, -213, -332, 169, 122, -261, 229, -72, -376, -325, 214, 15, -378, -100, 295, 167, -210, 365, -17, -197, 2, 241, -137, -272, -165, -12, -360, -163, 238, -14, -172, 245, 283, -54, -171, 98, 39, -179, 112, 136, -198, -389, 170, -23, -104, 19, 125, -137, -170, 123, -6, 19, -144, 151, -139, -131, 239, 246, -9, -296, 265, 52, -31, 34, 47, -88, -90, 132, -76, -75, 4, 93, -53, -136, 316, 221, -113, -24, 197, 136, -229, 51, 53, 77, 168, 148, 78, -326, 250, 96, -131, -58, -15, -164, -50, 351, 149, -141, -96, 141, 111, -110, 47, 200, -31, 26, 124, -249, -121, -108, 183, -32, -27, 65, -30, 18, 126, 12, -259, -41, 60, -67, -246, -88, -11, -31, 100, 164, 87, -424, 55, 165, -154, -94, 114, 4, -244, 38, 96, -346, 8, 65, -23]
3044b3k32o5M21r7j98L44m4k90L43M5j74k95K93J38m32K34R6j29j19K70J80l57
3066i1J17R6q3j2J74L0m36N7K99j10m19L88j4m5J30K38l23j05K13kj60n4J2J48
3090D8l57QL45j22p9L64k59j12K51N0j81j33K61K30o12J10K65J00m95L12J30j48
3112b4J85J69k77j66J67K24l63p9J72M8k55N5K67j29j90J93R9k30R0M02l50k51
3134b43M59l29l1O9J62j23k76L84j60l7R0L51k90mJ78k4j37j20K76l01l1j05L10
3157F8j07j33M19j32k65L15j5n9k45L72q9l00J78J28k39R8q7M6k23K67R7n1k14
3180a71K47k9k71K21J96l10J55L1k70J22j08K61M2m20M30M6k94J28R6j28j55j21
3202c02L90k61n7K75M6j37K6K42l40J57J32j29n2j20L68l35j18J69O7l15J06K52
$$ y = [-23, -255, -320, 101, 4, -194, 150, 106, -184, 159, 204, 30, -265, 28, 166, -266, -32, 64, -65, -184, 86, 266, -91, 26, 122, 39, 27, 201, 231, -205, -148, 151, 41, -378, 10, -4, -49, 81, 319, -4, -109, 104, 102, -58, -112, -100, 48, -309, -301, 44, -78, -157, 207, -52, -164, 87, 137, -44, -177, 84, 314, -298, -188, 77, 177, -318, -6, 124, -24, 161, 330, 53, -113, 54, 278, -85, -164, 8, 56, -199, -144, 123, -6, -196, -3, 96, -134, -44, 358, 8, -243, 216, -113, -144, -75, 87, -36, -312, 72, -88, -125, -35, 316, 26, 22, 200, 176, 39, -81, 195, -106, -137, -242, 68, -39, -172, 247, 115, -150, 165, 150, 91, -154, 218, 129, -171, 7, 135, -104, -6, -93, -47, -270, -3, 94, 43, -171, 76, 47, -224, -3, 193, -117, 38, 69, -201, -79, -187, 74, 116, -304, 126, 172, -122, 6, 102, -26, -181, -302, 88, -173, -230, 45, 91, -46, -20, 222, -118, 39, 171, 42, -10, -130, 238, -97, -215, -46, 21, -294, -188, 64]
3224F4k8p7L09k47l62L84J21j87n0N5R2k41j3Q8K6j51J20J27M8m8M1J59j54MJ05
3249A85k56k13L93k3m18M50P3k43k32K31R8j39J33Q6k8j76J44K7l18R9K34m48
3271c41o3M87L1j28OJ46J65m54L32J01n61J38J55j36l6K6K03k45j0K70J46k36
3293dK5J86p6l17M54j15o0j06m2O3Q6j45k6n6j09M95k07J50R0j83P8j59O1j75
3317i2j97R1J13j35J60K56j51j3J92p3j33J7J79l59p1L16k68n0R3K20j53k07L55
3340I0K3j59K41L0o6k73J28J81l96m2M11k11j13J45k0K20j72K62k08o0J36n9j04
3363a6j00M8J95n03K46K03j49j34K21K34j61n2K06k26m5K62M8k29k06K15k10p9
3385b32J35K48j99r0L46n1p5r8L69l82k19K77q4j32kJ75k0J4L41k52j55J74N0
$$ y = [64, 36, -41, 268, 21, -341, 43, 164, -23, -73, -18, 74, -167, -180, -92, -66, -217, -97, 30, 78, 30, 71, 230, 76, 80, 185, -71, -284, 109, 86, -332, 118, 191, -52, -284, -53, 45, -94, 39, 125, 97, -79, 65, 92, -226, -127, 107, -341, -404, 83, 114, -14, -8, 138, 303, -151, 181, 282, -279, -141, 14, -122, -158, -132, 71, -174, -184, 86, 232, -4, 21, 207, 131, -186, 268, 153, 93, -13, -55, 8, 94, -51, -77, -133, -242, 253, 46, 196, 286, 103, 181, 22, 83, -92, -289, -198, -85, -220, -60, 196, 45, 32, 224, 151, 18, 35, 214, -145, -216, 100, -168, -218, -125, 95, -58, -265, 90, 113, -46, 195, 225, 159, -114, 14, 195, -201, -243, 168, -43, -156, -11, -31, 189, 17, 279, 71, 11, 147, 88, -16, -116, -68, 127, -376, -130, 73, -76, -210, 11, 245, 84, 32, 238, 12, -33, 229, 277, 48, -158, 57, -153, -232, -97, 151, -48, -138, 208, 157, 82, -16, 353, -29, -248, 29, -55, -187, -189, -14, -34, -20, 321, 69, -86, 88, 138]
3408A38r6j16r8K03l71R6K56l2l29K34K95j48j78K12R0l64J56L7QJ93j6M0k55
3431d5J09n4j37J32L32l11r7J87J38l74O4J47j98n4K0K75m03J35J11J34k99J49
3453c9J83O5k62K07j18r7J50J34j17j29P9J7j92P6J03q1j80K89J05j94J23j6O6
$$ y = [138, 42, -74, -172, 31, -340, -244, 12, -20, -349, -115, 180, 32, -146, 66, 156, -208, -52, -15, -7, 186, 170, 210, -45, 64, 10, -127, 5, 337, 26, -71, 116, 254, -120, -56, 91, -107, -161, -141, 134, -269, -134, -23, 111, -188, -39, 144, 209, -53, 154, 36, -61, 89, 223, 106, -23, 56, 73, -119, -43, 60, -21, -201, 88, 193, -1, 122, 106, 172]
$$ [...]
8191i8
##END NTUPLES=NMR FID
##END=
