##TITLE=1H_LR-0155-CBz-CH2Cl2
 CD3CN
 8 sc, 
 16.2.2023
##JCAMPDX= 6.0         $$ Bruker NMR JCAMP-DX V2.0
##DATA TYPE= NMR FID
##DATA CLASS= NTUPLES
##ORIGIN= UXNMR, Bruker Analytische Messtechnik GmbH
##OWNER= root
$$ XWIN-NMR		Version 3.5
$$ Thu Feb 16 16:11:59 2023 Russian Standard Time (UT+4h)  she@DPX200
##.OBSERVE FREQUENCY= 200.1316
##.OBSERVE NUCLEUS= ^1H
##.DELAY= (6, 6)
##.ACQUISITION MODE= SIMULTANEOUS
##.ACQUISITION SCHEME= undefined
##.AVERAGES= 8
##.DIGITISER RES= 18
##SPECTROMETER/DATA SYSTEM= spect
##.PULSE SEQUENCE= zg30
##.SOLVENT NAME= DMSO
##.SHIFT REFERENCE= (INTERNAL, DMSO, 0, 15.7039)
##AUDIT TRAIL= $$ (NUMBER, WHEN, WHO, WHERE, WHAT)
$$ ##TITLE= Audit trail, XWIN-NMR		Version 3.5
$$ ##JCAMPDX= 5.01
$$ ##ORIGIN= Bruker BioSpin GmbH
$$ ##OWNER= she
$$ F:/spectra/data/she/nmr/H-F/1/audita.txt
$$ ##AUDIT TRAIL=  $$ (NUMBER, WHEN, WHO, WHERE, WHAT)
(   1,<2023-02-16 16:10:50.03 +0400>,<she>,<DPX200>,
      <created by zg, POWCHK disabled, PULCHK disabled
       configuration hash MD5:
       00 E9 B6 7A A2 85 ED C7 34 08 36 98 17 FE 4E 26
       data hash MD5: 16K
       F2 4D DE 3E 1A B3 60 AD F3 77 C7 35 66 3D 27 CD>)
$$ ##END=
$$ 
$$ hash MD5
$$ CE 1A F3 F8 B1 4A 5E FA 21 64 E1 40 C0 13 0D 2B
##$RELAX= 
##$RELAX= 
##$RELAX= 
##$RELAX= 
##$RELAX= 
##$RELAX= 
$$ Bruker specific parameters
$$ --------------------------
##$DU= <F:/spectra>
##$EXPNO= 1
##$NAME= <H-F>
##$PROCNO= 1
##$TYPE= <nmr>
##$USER= <she>
##$AMP= (0..31)
100 100 100 100 100 100 100 100 100 100 100 100 100 100 100 100 100 100 
100 100 100 100 100 100 100 100 100 100 100 100 100 100 
##$AQSEQ= 0
##$AQ_mod= 1
##$AUNM= <au_zg>
##$AUTOPOS= <>
##$BF1= 200.13
##$BF2= 200.13
##$BF3= 200.13
##$BF4= 200.13
##$BF5= 200.13
##$BF6= 200.13
##$BF7= 200.13
##$BF8= 200.13
##$BYTORDA= 1
##$CFDGTYP= 0
##$CFRGTYP= 5
##$CHEMSTR= <none>
##$CNST= (0..31)
1 1 145 1 1 1 1 1 1 1 1 1 1 1 1 1 1 1 1 1 1 1 1 1 1 1 1 1 1 1 1 1 
##$CPDPRG= <>
##$CPDPRG1= <>
##$CPDPRG2= <>
##$CPDPRG3= <>
##$CPDPRG4= <mlev>
##$CPDPRG5= <mlev>
##$CPDPRG6= <mlev>
##$CPDPRG7= <mlev>
##$CPDPRG8= <mlev>
##$CPDPRGB= <>
##$CPDPRGT= <>
##$D= (0..31)
0 1.2 0 0 0 0 0 0 0 0.06 0 0.03 0 0 0 0 0.0002 0 0 0 0 0 0 0 0 0 0 0 0 
0 0 0 
##$DATE= 1676549449
##$DBL= (0..7)
120 120 120 120 120 120 120 120 
##$DBP= (0..7)
150 150 150 150 150 150 150 150 
##$DBP07= 0
##$DBPNAM0= <>
##$DBPNAM1= <>
##$DBPNAM2= <>
##$DBPNAM3= <>
##$DBPNAM4= <>
##$DBPNAM5= <>
##$DBPNAM6= <>
##$DBPNAM7= <>
##$DBPOAL= (0..7)
0.5 0.5 0.5 0.5 0.5 0.5 0.5 0.5 
##$DBPOFFS= (0..7)
0 0 0 0 0 0 0 0 
##$DE= 6
##$DECBNUC= <off>
##$DECIM= 32
##$DECNUC= <off>
##$DECSTAT= 4
##$DIGMOD= 1
##$DIGTYP= 9
##$DL= (0..7)
0 120 120 120 120 120 120 120 
##$DP= (0..7)
150 150 150 150 150 150 150 150 
##$DP07= 0
##$DPNAME0= <>
##$DPNAME1= <>
##$DPNAME2= <>
##$DPNAME3= <>
##$DPNAME4= <>
##$DPNAME5= <>
##$DPNAME6= <>
##$DPNAME7= <>
##$DPOAL= (0..7)
0.5 0.5 0.5 0.5 0.5 0.5 0.5 0.5 
##$DPOFFS= (0..7)
0 0 0 0 0 0 0 0 
##$DQDMODE= 0
##$DR= 18
##$DS= 0
##$DSLIST= <SSSSSSSSSSSSSSS>
$$ [...]
##$SUBNAM2= <"">
##$SUBNAM3= <"">
##$SUBNAM4= <"">
##$SUBNAM5= <"">
##$SUBNAM6= <"">
##$SUBNAM7= <"">
##$SUBNAM8= <"">
##$SUBNAM9= <"">
##$SW= 18.0517057926174
##$SWIBOX= (0..15)
0 0 2 0 0 0 0 0 0 0 0 0 0 0 0 0 
##$SW_h= 3612.71676300578
##$TD= 16384
##$TD0= 1
##$TE= 0
##$TE2= 300
##$TE3= 300
##$TEG= 300
##$TL= (0..7)
0 120 120 120 120 120 120 120 
##$TP= (0..7)
150 150 150 150 150 150 150 150 
##$TP07= 0
##$TPNAME0= <>
##$TPNAME1= <>
##$TPNAME2= <>
##$TPNAME3= <>
##$TPNAME4= <>
##$TPNAME5= <>
##$TPNAME6= <>
##$TPNAME7= <>
##$TPOAL= (0..7)
0.5 0.5 0.5 0.5 0.5 0.5 0.5 0.5 
##$TPOFFS= (0..7)
0 0 0 0 0 0 0 0 
##$TUNHIN= 0
##$TUNHOUT= 0
##$TUNXOUT= 0
##$USERA1= <user>
##$USERA2= <user>
##$USERA3= <user>
##$USERA4= <user>
##$USERA5= <user>
##$V9= 5
##$VALIST= <valist>
##$VCLIST= <CCCCCCCCCCCCCCC>
##$VD= 0
##$VDLIST= <DDDDDDDDDDDDDDD>
##$VPLIST= <PPPPPPPPPPPPPPP>
##$VTLIST= <TTTTTTTTTTTTTTT>
##$WBST= 1024
##$WBSW= 4
##$XGAIN= (0..3)
0 0 0 0 
##$XL= 0
##$YL= 0
##$YMAX_a= 208982
##$YMIN_a= -372240
##$ZGOPTNS= <>
##$ZL1= 120
##$ZL2= 120
##$ZL3= 120
##$ZL4= 120
##$ABSF1= 10
##$ABSF2= 0
##$ABSG= 5
##$ABSL= 3
##$ALPHA= 0
##$AQORDER= 0
##$ASSFAC= 0
##$ASSFACI= 0
##$ASSFACX= 0
##$ASSWID= 0
##$AUNMP= <proc_1d>
##$AZFE= 0.1
##$AZFW= 0.1
##$BCFW= 1
##$BC_mod= 2
##$BYTORDP= 1
##$COROFFS= 0
##$CY= 11.3945322036743
##$DATMOD= 1
##$DC= 2
##$DFILT= <>
##$DTYPP= 0
##$F1P= 2.36226072786647
##$F2P= -0.459571619588291
##$FCOR= 0.5
##$FTSIZE= 0
##$FT_mod= 4
##$GAMMA= 1
##$GB= 0.15
##$INTBC= 1
##$INTSCL= 1
##$ISEN= 128
##$LB= 0.24
##$LEV0= 0
##$LPBIN= 0
##$MAXI= 10000
##$MC2= 0
##$MEAN= 0
##$ME_mod= 0
##$MI= 1.114404
##$NCOEF= 0
##$NC_proc= 0
##$NLEV= 6
##$NOISF1= 3.799351
##$NOISF2= 2.8
##$NSP= 1
##$NTH_PI= 0
##$NZP= 0
##$OFFSET= 15.70392
##$PC= 1
##$PHC0= -19119.54
##$PHC1= 19.40078
##$PH_mod= 1
##$PKNL= yes
##$PPARMOD= 0
##$PSCAL= 0
##$PSIGN= 0
##$REVERSE= no
##$SF= 200.130013532006
##$SI= 16384
##$SIGF1= 3
##$SIGF2= 2
##$SINO= 400
##$SIOLD= 16384
##$SREGLST= <1H.CDCl3>
##$SSB= 0
##$STSI= 0
##$STSR= 0
##$SW_p= 3612.71676300578
##$SYMM= 0
##$S_DEV= 0
##$TDeff= 0
##$TDoff= 0
##$TI= <>
##$TILT= no
##$TM1= 0
##$TM2= 0
##$TOPLEV= 0
##$USERP1= <user>
##$USERP2= <user>
##$USERP3= <user>
##$USERP4= <user>
##$USERP5= <user>
##$WDW= 1
##$XDIM= 8192
##$YMAX_p= 0
##$YMIN_p= 0
$$ End of Bruker specific parameters
$$ ---------------------------------
##NTUPLES= NMR FID
##VAR_NAME=  TIME,          FID/REAL,        FID/IMAG
##SYMBOL=    X,             R,               I
##VAR_TYPE=  INDEPENDENT,   DEPENDENT,       DEPENDENT
##VAR_FORM=  AFFN,          ASDF,            ASDF
##VAR_DIM=   8192,          8192,            8192
##UNITS=     SECONDS,       ARBITRARY UNITS, ARBITRARY UNITS
##FACTOR=    0.0002768,     1,               1
##FIRST=     0,             0,               0
##LAST=      2.2672688,     0,               0
##MIN=       0,             -372240,         0
##MAX=       2.2672688,     208982,          0
$$ Real data points
##PAGE= N=1
##DATA TABLE= (X++(R..R)), XYDATA
$$ [...]
1901g3q6R2l51L01N46o47J80K66k01Q6J95n28K10k3p9N0K80j31j24L77k56l32
1923b48N22o02P7M46n19J69R0l61J24R4p2K32M1l8P0j8k8q6K72k71M1J83o7P2
1947A23K53J09l23j47j86K14L39m88J20R0k84J78j0o3j17Q0P3l91L34J20J57q5
1969I6n7k95M56n2L8p7k64K76N7J80r2n33P5O8K56j76l4P0l50Q2L54l28R6J60
1993Fm45K83Q7k47J95M0J57M7j13q9J52J59J49l86J83J00j10l22J50J36j2q1r2
2016e3K06l08M33n29K10K3j85k18M41j86j22O33l56m03K18K11j87L68k52L5J85
2037A64J69n11L39k20K45Q6j82P9J31k19l16J44o1K05n8L65o53rJ18j58O7L38
2059F3l24J46J4q7Q6L74k66q9L07J26k95M44m20Q6r0l13L81J28k20L7k6j43J75
$$ plain form
1901 -73 -159 -67 -418 -117 429 -218 -38 228 27 113 308 -220 -10 -33 -112 -62 218 87 -37 340 84 -248
1923 -248 274 -328 -251 195 -324 -155 -65 -426 -302 -208 -280 -48 -7 -45 25 7 -21 -107 165 -106 -65 118 51 123
1947 123 376 485 162 15 -171 43 382 -106 14 104 -180 -2 -12 -75 -192 -112 -39 -430 -96 24 181 96
1969 96 39 -256 200 148 186 109 -155 121 178 358 266 -267 -192 -124 132 -44 -78 -8 -358 -276 78 -250 -154 6
1993 6 -439 -156 -69 -316 -121 -81 76 123 10 -79 73 232 381 -5 178 278 168 -154 -4 132 120 39 -53
2016 -53 153 -155 278 -251 -41 -18 -203 -421 20 -166 -288 345 -11 -414 -196 15 -172 196 -56 -21 164
2037 164 333 -178 161 -59 186 272 90 169 300 81 -235 -91 -152 53 -5 360 -293 -302 -184 -342 -275 63
2059 63 -261 -115 -101 -188 -102 272 6 -83 224 350 55 499 79 165 75 -238 143 271 51 88 62 -81 94
2082I4j75N9r1Nk82K48O1j52L56O3m32L07O9O5k23M01k98N4Q9K44k59J39j93k1
2106A28J75o25J83K37j91k92L23j48J44J43m19Q3K66J29l07P9J28k75K73j06J79
2127A07R4l20K87k5Oj04J94r2k32J93j2l04K62j98l3K99k31l61M47J64m48L28
2149B1l31L8K74l61L38j57K88m1J87R8m00K00J16j02R6l6n40N39k12p5J59j97
2171i8J39J97k53k29L6j7J54l6j01j81J74J3J84K61m81JP13k51k91J52n5j20L22
2194B33j09k15K57L2k96L78k0o3l56j77j99M69Q2j6j26k67J19K24J97j53K34j81
2216D7R3M1l46J18K24L6j99L78k50j71K24Kk96L22o1l02J38K44l19K82j18k43
2238a56K19j97l03K64K89k02K46m73k3M24J5l04M67J05m85o7L45q3K15J2l33L1
$$ plain form
2082 94 -81 -22 -113 -108 -390 -142 -81 -233 123 186 -246 61 130 195 -28 373 75 129 218 462 203 342 149 128
2106 128 303 -322 -139 98 -93 -385 -62 -210 -66 77 -342 -259 7 136 -171 -92 36 -239 34 -72 107
2127 107 201 -119 168 143 149 45 239 147 -85 108 96 -208 54 -144 -177 122 -109 -470 -23 141 -307 21
2149 21 -310 -272 2 -359 -21 -178 110 69 256 354 -46 154 270 168 264 228 -312 227 15 -60 99 -98
2171 -98 41 238 -15 -244 -208 -225 -71 -107 -208 -389 -215 -202 -18 243 -238 -237 476 225 -66 86 31 -89 233
2194 233 124 -91 166 198 -98 280 260 197 -159 -336 -535 -66 16 0 -126 -393 -274 -50 147 -6 228 47
2216 47 140 181 -165 -47 177 213 14 392 142 -29 195 197 -99 223 162 -140 -2 242 -77 205 87 -156
2238 -156 63 -134 -437 -173 116 -86 160 -313 -336 88 103 -201 266 371 -114 -181 164 81 296 308 -25 6
2260Fj99j0M45l51K1J07J60k36J0Q1l41J59J09j12oJ72k37L24J83l98J11J85l89
2283b06M93p7n18M85M9r4l42L21k70K32K9k11N6J57q8q7R4j12K75q6j57m1r3R9
2307i2L21l69J70K97j06m86m0K40j2J53j41j99L45K26k89o1J81l35K68K18m81
2328a92L95j89K39m33L09l81J64K41j85k2j14l8L7L38k61J62L32m76O3K41r0j1
2350A29o6q8j97M81k48N4j46j45L73j31M9j31L52l27j37%Q6K08k0l03J14J11N2
2373G0K1K8k53J58K51n2o6o6j19J29J61n30K81J69m11L00J30k92J11r2J12J88
2395B28j50N3l10L62j87j35K51k91J02K47P2k41l8n9j06K10R0K05n38K14r0J25
2417A4p2o1L22j32l2K02l11qJ03k81K13M0k1K4Q2k32K90r4q4l2J55j46n5K73j29
$$ plain form
2260 6 -193 -203 242 -109 -88 19 179 -57 -47 34 -307 -148 -39 -151 -157 15 -222 102 285 -113 -2 183 -206
2283 -206 287 210 -308 177 226 132 -210 111 -159 73 102 -109 -53 104 16 -71 23 -89 186 100 -57 -98 -191 -92
2307 -92 229 -140 30 327 221 -265 -305 -65 -77 76 -65 -264 81 307 18 -43 138 -197 71 289 -192
2328 -192 203 14 253 -180 129 -252 -88 153 -32 -54 -168 -206 -169 169 -92 70 402 -74 -11 230 140 129
2350 129 63 -25 -222 259 11 65 -81 -226 147 16 65 -66 286 -41 -178 -178 -92 116 96 -207 -93 18 70
2373 70 91 119 -134 24 275 223 157 91 -28 101 262 -268 13 182 -229 71 201 -91 20 -72 40 228
2395 228 78 131 -179 183 -4 -139 112 -179 -77 170 242 1 -37 -96 -202 8 98 303 -235 -21 -111 14
2417 14 -58 -119 203 71 39 241 -70 -78 25 -256 -43 -3 -24 0 82 -150 140 46 -38 -70 85 -61 -116 157 28
2442B8j47O2p6K00j32j23P4J89J03j77N7j94q1K25p0j52j2j6J48K4J68j81J78
2465I5n7P1k82L41l95L03k03N3L15j90Lj21M64m38L0K01l48K37j74o5J22L9N0
2488E1j79K56k25J30j80K06n4j1j67K50J6k67N0J61r1K52r9k71o9L89k4K9Qk49
2512h8P9M6o7K79K03l89j40J3J19K91j15m2M6j95l25J24L38l38K22j52J8o1K75
2535A41p7J54j68j15Q1l1L07l28J41N9l34K24J6l17L24j09K25l73L81k28J77k4
2557A26l23L43j60lJ19lM3K7q4n24O48l77L05n3P0k79P5Jl8lR7K17m08K32J33
2582A81K0k15J05j37Q6k61L27l08J55r8k7L9O4J73J28k46LO1m9j62N58m07J33
2605A23j98K17j57l8j8j43K22J35l98L76Kk92O0n3n3M78l36rJ97j23j27K65K53
$$ plain form
2442 28 -119 -57 -133 67 -65 -188 -114 75 178 1 58 -136 -217 8 -62 -214 -226 -242 -94 -70 98 -83 95
2465 95 38 109 -173 168 -227 76 -127 -74 241 51 54 -67 397 -41 -11 190 -158 79 -95 -160 -38 1 51
2488 51 -128 128 -97 33 -147 59 5 -6 -173 77 93 -174 -124 37 -54 198 99 -172 -241 148 124 153 161 -88
2512 -88 -9 37 -30 249 452 63 -77 -64 55 346 231 189 235 40 -285 -161 177 -161 61 -91 -73 -134 141
2535 141 64 218 50 -65 16 -15 292 -36 105 164 -170 54 70 -247 77 -32 193 -180 201 -27 150 126
2557 126 -197 146 -14 -17 102 99 142 169 85 -439 209 -168 137 84 154 -125 -50 -49 -87 -90 7 224 -184 48 181
2582 181 201 -14 91 -46 40 -221 106 -202 -47 -145 -172 -133 -69 104 232 -14 -11 50 1 -161 397 -10 123
2605 123 -75 142 -15 -53 -71 -214 8 143 -255 121 123 -169 -109 -162 -215 263 -73 -82 115 -8 -135 130 383
2628C83o72J25L24k45K7j7J73j28n9J61J00l00o0K39j98N3L71j52P6j53j21J25
2650E2R6l50P3K28k38P7P8j58N2K30J10o6J6J7m51L85j18j3J11J06k08J7J10j48
2674HL02l64p0L13j24l02L55l9j55r0L08j57Q7k36J40K00j11m2L80m16J03J51
2696B41j15k03K99p8k74J82l00L2M35l90K0M21k99m11N58k11k38K70Q0m21M64
2717F2j56J42K18l04j52L99Q5p45P32m80J22K27k31j23M17j63k17K67j16LM53
2738D40k74n21N03j79j90L75m33LL41O6k52L26j13q5M2J60l54K88j27l59N56l19
2760a06KL51l40M9R9J14j06J45j33m47O14k99k52N48l20k1J79L5m73N91j52l80
2782c02K21J79j96K34J06k92J52J37m08K25l0k84N61r7l55K87J8m16j45P10m35
$$ plain form
2628 383 -289 -164 160 -85 -58 -75 98 -30 -89 72 172 -128 -188 51 -147 -94 277 125 201 48 -73 52
2650 52 148 -202 -129 99 -139 -62 16 -142 -90 140 250 184 200 217 -234 151 33 20 131 237 29 46 156 8
2674 8 310 -54 -124 189 65 -237 118 79 -76 -166 142 -15 72 -164 -24 176 65 23 403 -13 90 241
2696 241 126 -77 222 144 -130 52 -248 -216 219 -171 -151 270 -29 -440 118 -93 -331 -61 19 -402 62
2717 62 -94 48 266 -38 -190 209 294 -451 281 -199 -77 150 -81 -204 213 50 -167 100 -16 -13 440
2738 440 166 -355 148 -31 -221 154 -279 -276 65 131 -121 205 92 7 49 209 -145 143 16 -343 213 -106
2760 -106 -104 247 -93 -44 55 169 63 208 75 -372 242 -57 -309 239 -81 -102 77 112 -361 230 78 -302
2782 -302 -81 98 -98 136 242 -50 102 239 -169 56 26 -258 303 206 -149 138 156 -260 -405 305 -130
2803a30l5K87l50L17J00r53J105j73n04L66j05j92L83M71p74L81L01o01J94K68
2823C56o88L61M02p05K71Q9k44L49o9o88O48M1n15R65n24k96J26L10l96M60j50
2844A03k44M59r1q00N78J34l63O72k77n71O68K13o04J08M25q15P19j63n70P44
2864C25k40o05P58j23n18L34N00r60M65M00p91N41k33j76M92P8o50M83L66r49
2884e03L89J85m29M49o9m20L93J45o70M87M21r44K83N71n03J95K40l78L32K74
2904D48r41O82Q6n22J43N30q04L65K57n50L13J60o58O69J94p86L35L51p02M34
2924DL39r53N70M13j006O42K35o00K98M26r14O32Q2l53K99J09l93K60K64r87M30
2945b03N30n09K30K58l38K7J51n44O98j74l75O99J22r46J00O12p38M33J99n30
$$ plain form
2803 -130 -165 122 -228 89 189 -764 341 168 -336 30 -75 -267 116 587 -187 194 495 -106 88 356
2823 356 -332 29 431 -274 -3 86 -158 191 122 -566 82 123 -392 573 49 -247 -121 189 -207 253 103
2844 103 -141 318 227 -573 5 139 -224 448 171 -400 268 481 -123 -15 410 -405 314 151 -419 325
2864 325 85 -520 238 115 -403 -69 431 -529 -64 336 -455 86 -147 -323 169 247 -403 80 446 -503
2884 -503 -114 71 -358 91 22 -398 -5 140 -530 -43 378 -566 -283 288 -215 -20 220 -158 174 448
2904 448 -493 189 275 -247 -104 426 -378 -13 244 -306 7 167 -491 178 372 -414 -79 272 -430 4
2924 4 343 -610 -40 373 -633 9 244 -356 -58 368 -546 86 168 -185 114 223 -170 90 354 -633 -203
2945 -203 327 -182 48 306 -32 -5 146 -398 300 126 -249 450 572 -374 -274 338 -400 33 232 -298
2965b98N37K62n38q4M63n82L57J17m49M5P80n84R6L86q69M26L09p67K41K33n77
2986d96M45J82n03J35P01r40N74M52q70K43K19m27J40N99q90O62K78p11K85K81
3006C59o62M36L27q20J54N91p18L81K44r15N71K79o67L61M07n16l5N71q35L18
3026a69N92p87K38K06l12K25K94l34J6M25m69M7O34q66K57N20r34M20O10o01J31
3047A43K79q74L16L40n03K46J42k52j26L32o11M19L43l54j4M89n13J56N30o51
3067a63K2L47o92O22J34o34L44L05m85K71J60p39L05L45k41m1O50p13J27L96o76
3088c56L53K3j14k2L01k01k15M19l19J45J50j16j7J2l38J75N48o91K70J65k87
3109a15jR3n2o2L98m81J25J81j7j18N35p46K01L04m67M4M02m47J98J25nj79M57
$$ plain form
2965 -298 239 501 -37 -121 342 -240 117 234 -215 -170 610 26 122 508 -361 65 374 -393 -152 81 -496
2986 -496 -51 131 -372 -237 464 -476 98 550 -320 -77 142 -285 -145 454 -436 226 504 -207 78 359
3006 359 -303 133 460 -360 -206 385 -333 48 292 -623 -52 227 -440 -79 328 -188 -223 348 -487 -169
3026 -169 423 -364 -126 80 -232 -7 287 -47 -31 394 -75 -28 606 -260 -3 517 -417 3 613 12 143
3047 143 422 -452 -136 204 -299 -53 89 -163 -289 43 -568 -149 194 -160 -174 315 -198 -42 488 -163
3067 -163 -141 206 -486 136 270 -364 -20 285 -200 71 231 -508 -203 142 -99 -140 510 -203 -76 320 -356
3088 -356 -3 20 -94 -116 185 -16 -231 188 -131 14 164 48 31 43 -295 -120 428 -263 7 172 -115
3109 -115 -116 -23 -75 -137 261 -220 -95 86 69 -49 486 -260 -59 245 -222 -178 224 -223 -25 100 95 -84 373
3132C73m78JK65m09o9N67l48J05J88m18O7M09k33k45O24n64k2L07l22j64M98j64
3154c2J9J88j61k93N19o68M19L75l39j7J39j25j10M35n39QL92l18r0L47j87j79
3176b17L12l17P9J92j73k75N62j59j28K70k97K87J75m65l9K25j26k1J50n1j06
3197a22M24n29M95Pm36pJ98j07o7K03L0k52L41m32l2J73j33J57L04k05k00J59
3219c1j68L99j02N0q6Q2m21J63L13k46KJ34k22j08M28o0l15J2J23k78N67k81k52
3242b97O50k67k09L74l76K38nrj70J21l5m1rO6J32k18Q9r5L33j81j11J16k8j03
3266c5q8O2j04L11k42J70O1K4l15M30m08O0L7Q4j25J44l32J37J47j65K06P9J01
3289B39l67L11k34KJ65N7k80K03j69j72K97K12n75K34M5K41j69j36K13k65O8K26
$$ plain form
3132 373 -105 -104 161 -248 -317 250 -98 7 195 -223 -156 253 20 -225 399 -165 -187 120 -202 -366 132 -32
3154 -32 -13 175 14 -279 240 -428 -9 366 27 10 149 24 -86 349 -190 -182 210 -108 -198 149 -38 -217
3176 -217 95 -222 -143 49 -124 -399 163 4 -124 146 -151 136 311 -154 -193 32 -94 -115 35 -16 -122
3197 -122 302 -227 268 275 -161 -168 30 -77 -144 59 89 -163 178 -254 -286 -113 -246 -89 215 10 -190 -31
3219 -31 -199 200 98 148 62 144 -277 -114 199 -47 -45 89 -133 -241 187 127 -188 -176 -53 -331 236 -45 -297
3242 -297 353 86 -123 251 -125 113 108 99 -71 50 15 -26 -35 31 163 -55 34 -61 272 91 -20 96 68 -35
3266 -35 -123 -61 -165 146 -96 74 135 159 -156 274 -134 -74 -37 47 -78 66 -266 -129 18 -147 59 138 239
3289 239 -128 183 -51 -49 116 173 -107 96 -73 -245 52 264 -311 -77 -32 209 40 -96 117 -148 -80 146
3311A46k00J5j03J95M0m03L12j9O5o3K9O8k7k30J94O3j46O8K73l54K36o0j99K7
3335g3J8J50J78l73O8j3Q8L16k61j06J25q4m7j30K27j30J12Nq6K5o5L35k43j1
3359B5m9o3N5J74j97M2L7j72J64j18J98l07J92q3%K58O8l59L46j74m7K17k04k04
3383b01J84JR2K8J32j73O1l29K59l1l62M18r7K7n7J02k8j84J7M3N4k2Q4k35J29
3408h8L94l09k49L24j71Q3j00J86j04L07l29J06J66m69L07J1j05L1J18j60J8l04
3430c37L44n0j08L69j09k23J55j71o6J25K36k52J50L5J7j79r7J00O3j73L73k29
3452b7M2K01m03J74q7J68l78L81k61K18JK7r0K83J3k3m05J86%q6M0J29j38k0p9
3477a34J53R2k37J47j8j28K70l65J98o9K33j33N8j36oJ55j72K56p3l24J94j61
$$ plain form
3311 146 -54 -39 -142 53 93 -310 2 -17 48 -15 14 82 55 -175 19 82 -64 4 277 -77 159 99 -100 -73
3335 -73 -55 95 273 -100 -32 -45 43 359 98 -8 117 33 -14 -144 83 -47 65 70 -16 9 -56 279 36 25
3359 25 -24 -87 -32 142 -55 -13 24 -148 16 -102 96 -211 -19 -102 -102 156 224 -135 211 37 -10 207 3 -201
3383 -201 -17 -16 76 104 236 63 124 -205 54 23 -339 79 -18 9 -48 54 26 -158 -141 -98 -44 -66 18 -217 -88
3408 -88 306 -3 -252 72 -99 -16 -116 70 -34 273 -56 50 216 -253 54 65 -40 -9 109 -51 -33 -337
3430 -337 7 -43 -151 218 109 -114 41 -130 -196 -71 165 -87 63 98 115 -64 -161 -61 2 -171 202 -27
3452 -27 15 216 -187 -13 -100 68 -310 71 -190 28 29 56 -34 249 262 239 -166 20 20 -66 -26 103 -35 -55 -134
3477 -134 19 111 -126 21 3 -125 145 -220 -22 -91 142 9 67 -69 -75 80 -92 164 91 -233 -39 -200
3499b00L03l1k1k74K22%K25j34R4N7l43N6k05J81Q5j6R7j50J55J63r5j61N8m6
3523B0l2J12j15R4K9%L2l47PJ76k05J38K74j23p6k53K70L62l28p2Q5N7j54QO1
3548B0J27l19j16k7L33k12K19k65J44K78q3j39m3J38j55J96j62J40L2k65K96k18
3570h1J27k53J17J63o8q9P4J94m00J07J7J54l28L52j27R2Nk28J33o5K1o9M73k74
3594D7J11K27m35N4k7K9j00N5k45L65k12J34J98l40q3L52k97L13j07Q2k64K05
3616F2l7r3L9n9K11m96K48J71j66K74l15%K2L14J7j83j94N1kL48j67j37kL2k02
3641b64J77J40K48r0j16N1l70K10J92k70J55k07K05rJ24j60K26k77J7K34l84L83
3663B15M9l74K5L44Mm79N34k19K2pr0k05NK60k83K90O6j63N1O6l9L8l4j89M8j20
$$ plain form
3499 -200 103 72 51 -223 -1 -1 224 90 184 241 -102 -46 -251 -70 15 -1 96 -54 101 264 169 8 66 20
3523 20 -12 100 -15 79 108 108 140 -207 -200 -24 -229 -91 183 60 -16 -269 1 363 35 -37 48 105 -49 -41 20
3548 20 147 -172 -288 -315 18 -194 25 -240 -96 182 99 -40 -83 55 -100 96 -66 74 106 -159 137 -81
3570 -81 46 -207 -90 73 5 -84 -10 184 -216 -109 -92 62 -266 86 -41 51 56 -172 -39 -104 -83 -152 321 47
3594 47 158 385 -50 4 -23 6 -94 -39 -284 81 -131 3 201 -139 -222 130 -167 146 39 121 -143 62
3616 62 25 -68 -29 -88 123 -373 -125 46 -120 154 -161 -161 -139 175 192 9 -185 -134 -136 212 45 -92 -94 -62 -264
3641 -264 -87 53 301 211 95 146 -224 -14 178 -92 63 -144 61 52 176 16 242 -35 -18 216 -168 215
3663 215 264 -110 -85 259 263 -216 318 99 121 114 24 -181 -176 84 -199 91 157 -6 45 111 72 110 76 -113 -65 -185
3689a85J98L6l9q8o8K04K8k55j7J7L62j81J03l41K15K63l73O0J92o8l1l17J78
3712a07M51l93O9l25K21o8p0M09j12J92M3k99N4l9j49J18j12J96L00n62K76p1
3734B2r0j49j0L35j29K2J22j32N9k77M75j49j32P3O2k24J32j32O5o5PJ48P2k5
3758H0j58o7%l2L78j47n0J00j13Q6M0m60M52l9J00j75J8R8k39R0j36L15n6J30
3782B15k53J13L3l7l07K48oNO0o7j46OL84k62m0j23N7K17j12j25mM3L32l02mN5
3808b0J02o1j55M7J39k41J04k9P1K15O9k31J10j14K34l12J40J36j04o7q4r1j86
3831c28L51j46J25j57o9K50j51K07k3l4jJ2j53L60l9l43P0Q8k08K51M3R0j30J2
3855G7j8r9J49l21K80q6K15l01l3J54P8M9o4L3j49J21l82K55r6J69q4j56J73k9
$$ plain form
3689 -185 13 49 10 -78 -146 58 86 -169 -186 -169 193 12 115 -226 -11 252 -121 -61 131 63 32 -285 -107
3712 -107 344 -49 20 -305 -84 -152 -222 187 75 267 310 11 65 26 -123 -5 -117 79 379 -183 93 22
3734 22 -68 -217 -227 108 -21 1 123 -9 50 -227 248 99 -33 40 102 -122 10 -122 -57 -122 -115 33 105 80
3758 80 -78 -145 -145 -177 201 54 4 104 -9 77 117 -343 109 70 170 -5 13 111 -128 -38 -174 141 85 215
3782 215 -38 75 108 71 -236 12 6 11 71 4 -142 -136 248 -14 -54 -177 -120 97 -15 -140 -144 -101 231 -71 -75 -20
3808 -20 82 21 -134 -87 52 -189 -85 -114 -43 172 241 10 120 6 240 -72 68 204 100 33 -51 -142 -328
3831 -328 23 -123 2 -155 -224 26 -125 82 59 25 24 36 -117 243 204 -139 -69 19 -189 62 105 195 65 77
3855 77 59 -40 109 -212 68 -18 197 -104 -137 17 95 144 80 113 -36 85 -297 -42 -138 31 -53 -209 -36 -65
3879f5J38l11O2J19r9O2n8k91M65j76K76m6q5k5K86j54j70L2K89k85k51J90k60
3902c57K87J88j26K09k30j89L49k82M00k54ok28M40j9m05Q2J47J03k38o9K95k88
3924a91R7K18l06M86j93J2m88L33Q5Nk2n6o8k08K90P1P8j69j5L1p5l7J47j40J12
3949ckj11J62K1K02k40l22K81q1Q6o7J53k38J85k4j45N7J45q9L07j57j90k1O0
3973c1j08J55J65j47m6O7J38j37k39m9J81p4J45Q7O4j60j2M6q3J82J60m41j34
3996b71K40R1k58J4k28L04Q8L4j13J51j7K79l63mJ17j54oJ30J53p5l18L0K60J87
4020B71n24J31J76P4l7M4L0j82j7J68L5Q4m5j91j05K76k01J58j01kj07J43p4l83
4044c79J30Q3K69j47J49k11N3q8k2K35l04L96k26L6J7J85l22Q5R6q0L1j7L8o8
$$ plain form
3879 -65 73 -238 -176 -57 -156 -94 -152 -443 22 -154 122 76 -9 -34 252 98 -72 -40 249 -36 -287 -97 -357
3902 -357 -70 118 -8 201 -29 -218 131 -151 249 -5 -11 -239 201 182 -223 -141 6 109 -129 -198 97 -191
3924 -191 -94 124 -182 304 111 123 -365 -32 53 58 36 -20 -88 -296 -6 65 143 -26 -41 -10 -85 -122 25 -115 -3
3949 -3 -5 -116 46 67 269 29 -293 -12 -93 -7 -74 79 -159 26 2 -143 -86 59 -30 277 120 -70 -91 -31
3973 -31 -139 16 181 34 -12 55 193 56 -183 -232 -51 -125 20 107 171 11 -1 45 -38 144 304 -137 -271
3996 -271 -31 60 -198 -184 -412 -108 -20 14 -99 52 35 314 -49 -53 64 -90 -96 34 187 112 -206 -176 84 271
4020 271 -253 -122 54 128 91 135 165 -17 -34 134 169 253 208 17 -88 188 -13 145 44 42 -65 78 4 -379
4044 -379 -249 -166 103 -44 105 -106 -53 -141 -163 72 -232 164 -62 -26 -9 176 -146 -61 35 -45 -14 -31 7 -61
4068f1K09k46OK60j59j95L31j21q9J00l57J93P5J03n7k01K65o0Nn8r8oK31q2k08
4093b20J26K86j49K9j0P4j09j35M7L1j69K21n3J47Q3k33N5L6J03l88M28j39j34
4116g3L36k26j51K42j82r7L8L24q4j69q5L24m2j70k20L62j46q8L78m6k41K3j21
4139a14J40P8j57J35k28J87k87K02k06K99j5k31L2M15j47k22o6M05m11J10J26
4160D5oK6R6k17K25m5j99n3J01k06L26j32k2n4K63l72J92Q0l74J34K88k62R0K05
4184A29KL1r2j43J22j33R3j50J52j05J11k10M96j47j08j82J1J80N0m9p6J64M1
4207A87k7k34k43L98n4j4j55n1K99R9j93P9o7l06J37K87k00P9K24k25r7L8K89
4230B50j55n7j15K70l95Q5J00J90p6Q8l6k8j68J72J40k45k04j33K62J1J63j48
$$ plain form
4068 -61 148 -98 -92 168 9 -186 145 24 -65 35 -322 -129 -54 49 -8 -209 56 -4 1 -57 -155 -161 70 -12 -220
4093 -220 -94 192 43 72 62 136 27 -108 -61 -30 -199 22 -31 116 199 -34 21 57 160 -228 200 61 -73
4116 -73 263 37 -114 128 -54 -151 -113 211 127 -42 -127 197 155 -15 -235 127 -19 -107 271 225 -16 7 -114
4139 -114 26 104 -53 82 -146 41 -246 -44 -250 49 34 -197 -165 250 103 -119 -185 220 -191 -81 45
4160 45 39 65 161 -56 169 124 -75 -128 -27 -233 93 -39 -61 -115 148 -224 -32 48 -326 -192 96 -166 -76 129
4184 129 131 162 70 -73 49 -84 9 -141 11 -94 17 -193 303 156 48 -134 -123 57 107 58 -18 146 187
4207 187 160 -74 -317 81 27 13 -142 -193 106 205 12 91 24 -282 -145 142 -58 21 245 20 -77 -39 250
4230 250 95 38 -77 193 -202 -117 -17 173 97 185 149 121 -47 125 265 20 -184 -317 -55 -44 119 -29
4252b9J91k21K75n1k19K08l7m0n7k80rL43j78k77K40N17m95J35o8j49K46j99n8
4275b12K29M9j68O3N9Oo8K10k60N2K96n12J03J16J84j09R8j30J47k3j55P1n3l7
4299d4R0J16l54K8K33J9j69K71m97L97O5j41r6L01l12j59L44l33L03K37k77j19
4321i7M8l2m9K98k39L7K54k30j25L49j86r1K32mk68K55l02q7M18k71K00j37r8
4344a25L8K58l12R4k1l1j2Q6K56l81J29r0J77J09q7J55k73O2K15j41%k68P7K14
4368A29k39J57M8j0M8p1j80L93m83J38L37k56J09j01r9J35K32l92J12k59K97j76
4390a31J29j77rL35k36N4k16K19j82K22Om17M94j1l52N46l01M7K31j66q2o0L71
4413C14n29L29r0j49L87k17p5J54n7R9n6Nj54J87j33K7k9q7n8M73k53j71n6J05
$$ plain form
4252 -29 162 -59 216 165 -54 154 117 77 20 -260 -269 74 -104 -381 -141 376 -119 16 -52 -201 45 -154 -212
4275 -212 17 66 -102 -39 20 26 -42 168 -92 -40 256 -256 -153 -37 147 38 136 6 153 130 -25 46 -7 -44
4299 -44 46 162 -192 -164 69 88 -81 190 -307 90 155 14 -82 219 -93 -252 92 -241 62 299 22 -97
4321 -97 -49 -81 -130 168 -71 -34 220 -10 -135 214 28 -63 169 165 -103 152 -150 -237 181 -90 110 -27 -125
4344 -125 -87 171 -141 -47 -68 -99 -111 -25 231 -150 -21 -111 66 175 88 243 -30 32 247 106 106 -162 -85 129
4368 129 -110 47 95 85 133 62 -118 275 -208 -70 267 11 120 19 -80 55 287 -105 7 -252 45 -131
4390 -131 -2 -179 -188 147 -89 -35 -251 -32 -214 8 14 -403 91 80 -272 274 -27 20 251 85 3 -57 314
4413 314 -215 114 24 -125 262 45 -30 124 67 166 110 115 -39 148 15 42 13 -74 -132 341 88 -83 -139 -34
4437c4K73k29k83M41k61J93J30m2q8l97K23Q7K00j45Q2l96M24l14L25J5l86J10
4459g2J34m1j9J75M8n18N11j03m08N81l76j24L06k06k28N13l05K87j81j10j58
4480b94K13J13j16Q2L13n45R3Q9k8J21p4j15K59p0L06m89J31l5j61L18j0j71J38
4503F8j68k4J43j10K73r8n1N8M7r6r1K75m54K04k5R5qk58J34M0J12m0PJ80k19
4528fK5J00l1n3qk03J47K84l83L06k68K89k03p0k2Q8l4k1Q3K22k26j92K52j99
4552a23M08n5m51L90m22J54J03j38J04L41k28P7r0J77k50j01K49J3q1r7J1J07
4574I8j27o7J42k9q5K28p3l93M95P6m53R8K83k59JK9M3k97K87n1L18l04J13j55
4598h2rJ96j02pk4m3J81k2L9l18K96r1q1j6L13l45M8O0J8q4PL0j55L77q0J6r0
$$ plain form
4437 -34 239 10 -273 168 -93 100 230 188 100 -297 -74 13 213 68 150 -246 178 -136 189 204 -182 -72
4459 -72 62 21 2 177 225 -293 218 115 -293 288 -88 -212 94 -112 -340 173 -132 155 -26 -136 -294
4480 -294 -81 32 -84 -2 311 -234 -141 -52 -80 41 -33 -148 111 41 347 -142 -11 -46 -207 111 101 -70 68
4503 68 -100 -124 19 -91 182 84 33 91 138 42 -49 226 -228 -24 -49 46 38 -220 -86 -46 66 26 33 213 -6
4528 -6 19 119 88 35 27 -176 -29 255 -128 178 -90 199 -4 -74 -96 -8 -42 -63 20 242 16 -176 76 -123
4552 -123 285 230 -221 169 -253 -99 4 -134 -30 311 83 160 70 247 -3 -104 145 158 77 -20 -9 98
4574 98 -29 -96 46 17 -68 160 87 -306 189 265 -188 -90 193 -66 -65 -36 7 -290 -3 -54 264 -40 73 -82
4598 -82 -91 105 3 -4 -28 -71 110 88 127 -191 105 14 -67 -83 230 -115 -67 -7 11 -73 -66 -36 -191 186 106 122 32
4625C2j30r8J98P5q9O8K7q6j12J82k04M22M6q8k87K73l25J45M6j18n1n1J5M78
4649C68l90O7J56j79k52J43J99j72M0j65L38l9K04m59p0L76nk73L14m15M42k72
4671d4R2o3j12q7K14rj95J68J35j76RN3k6K30m12J34J39j29J71L9J72l21o5O0
4695b3j22K83j02j3p2L10k65p7R8j70K27q9Q8k02J23q7J56jN9k64J24K97j67M1
4719A52R8j61k9K3j92M1K1P2K70o55M57j74R0p2R9M1n9J73l44K44k30J06J24M6
4743A41j51qj52J82L3k7j91L40l22L8J40Q7k71j53K42P0l9J36M5q2p0p2J29j00
4767e5r7M01l18OK31j83J40n8K4pk00N3O2M0J08l25J40jl4K52l73K35r7k04L20
4792F0J59l0k31J68o5J6l6l13J63l0K1L78k88K88k21J89n20L67m2nK9j88m1j16
$$ plain form
4625 32 -98 -196 2 77 -12 56 83 -3 -115 67 -137 285 331 243 -44 229 -96 49 95 -23 -74 -125 -110 368
4649 368 -22 45 201 22 -230 -87 112 -60 -20 -185 153 114 318 -141 -211 165 160 -113 201 -214 228 -44
4671 -44 48 -15 -127 -214 0 -9 -204 -36 99 -77 -68 -15 -41 189 -223 -89 50 -79 92 131 303 -18 -83 -23
4695 -23 -145 138 36 23 -49 261 -4 -81 17 -153 74 -15 73 -129 -6 -93 63 62 121 -143 -19 278 111 152
4719 152 250 89 60 83 -109 -68 -47 25 295 -360 97 -77 13 -59 40 81 22 195 -149 95 -135 -29 95 141
4743 141 -10 -18 -170 12 45 18 -173 167 -155 -117 23 110 -161 -314 -72 -2 -41 95 140 58 -12 -84 45 -55
4767 -55 -152 249 -69 -63 168 -15 125 67 91 84 -116 -63 -1 39 147 -178 -38 -39 -73 179 -194 41 -56 -260 60
4792 60 219 189 -42 126 61 77 41 -272 -109 -139 -118 260 -28 260 39 228 -292 75 33 28 57 -131 -172 -288
4816b88L16R8k96j58M10k10K8Rr4L26L6j47k43K86j93kK52k03J68Q2j55l19K73
4839b4J33P9k4l22K69R0m02K07N8k5k5o5m1l2K30l67M75M7l19J43j69K3j34K47
4863E2nl7N7k58K81q8j79J21K05r4q2J26j29K3J27km8k09L44k81J77P6k0j51j20
4888a14J29n0J82Q4n53K23K69k9q8j24K78j65pj40K0J24k46K14J01j95K65j32
4910D6P9k7o9Q8j20k59J45n5J25j5J12j75l2M37k73k2p5J02K64n89K92R4j24O
4934d5j2J37j59K92N3l82N2k0O2n4L1k4J7k0Q3J97k00k4n6r4J82n2k0J32m6o5
4960c5j0J17l5k07j17%O68l33k7J73j72k50K71n2NK16n40K69J05J3N7k16J84J40
4984B24l65J31J0j56J04J35j16OL06m72Q9MK74m83K34J85l19N14k74L7m70L0M85
$$ plain form
4816 -288 28 126 -170 -328 82 -128 -100 -91 -185 141 177 30 -213 73 -120 -122 130 -73 95 177 22 -297 -24
4839 -24 109 188 164 -158 111 201 -201 6 64 39 14 -51 -92 -124 106 -261 214 261 -58 85 -84 -61 -195 52
4863 52 47 10 67 -191 90 2 -177 -56 149 55 -27 99 -30 -7 120 118 70 -139 205 -76 101 177 157 6 -114
4888 -114 15 -35 147 231 -322 -99 170 141 53 -71 207 42 35 -105 -85 39 -207 7 108 -87 178 46
4910 46 125 98 29 117 -3 -262 -117 -172 -47 -62 50 -125 -157 280 7 -15 -90 12 276 -313 -21 73 -51 -45
4934 -45 -57 80 -79 213 266 -116 -64 -84 -22 -76 -45 -69 -52 -72 11 208 8 -16 -72 -166 16 -36 -56 76 30 -35
4960 -35 -45 72 37 -170 -287 -287 381 48 21 194 22 -228 43 -9 -4 212 -328 -59 46 59 116 -100 84 224
4984 224 -141 -10 0 -156 -52 83 -33 -27 279 -193 -104 -100 174 -309 -75 110 -209 305 31 68 -402 -372 113
5007A13j13K66k25k10O7J70rl91J75L50k60R7j05p3J12J41k3k40M2J79N3l98L58
5030G6j8l72J63J40J13k67N1k0N8J13R4K20m24n4J13j84J66J66j38Q3K7l08K77
5053G5K9r0j87k4j6K87n6J8J5l42L26J45k07J60q6M4J33k72K2n4J43L9l05J87
5077a6j1j48j0L32k33J07J9j28r8Rj49L04l39O42o9k00N2q0N4j08J11j81K11q3
5101a2l4J90j25k16M52k49K4K01q6ql35L40k33O9J42l9o4m2r8k4K20l0J6j50M2
5126d9j5J7j2J45r0k2R3J03Q2j81k34j4K22L06k62j27P5J47k89MK13l68L34j03
5150b5J45K22l86L96l47J9l3Q8j91O1K16m37K70J78j24rj70K7o2M12k36k19J04
5173a01Q0J48j45J38k66mQ7K73k81J27l2PJ62k5k22R5l3J01K4j55N5o6J04L2j62
$$ plain form
5007 113 0 266 41 -169 -102 68 59 -332 -157 193 -67 30 -75 -148 -36 105 82 -158 -116 63 116 -282 76
5030 76 58 -314 -151 -11 102 -165 -114 -134 -76 37 131 351 -73 -127 -14 -198 -32 134 -4 79 106 -202 75
5053 75 104 14 -173 -197 -213 74 18 36 51 -291 35 180 -27 133 47 91 224 -48 -26 -80 63 102 -203 -16
5077 -16 -27 -175 -185 147 -86 21 40 -88 -186 -177 -326 -22 -361 281 212 12 64 -16 38 -70 41 -140 71 -12
5101 -12 -46 144 19 -197 255 6 30 231 145 137 -198 142 -91 -22 120 81 17 -25 -123 -147 73 43 59 -91 -49
5126 -49 -64 -47 -59 86 -4 -26 67 170 252 71 -163 -177 45 351 89 -38 37 184 -105 -101 112 -256 78 -25
5150 -25 120 342 -44 352 5 24 -9 79 -112 -51 165 -272 -2 176 52 43 -127 -100 -162 250 14 -205 -101
5173 -101 -21 127 -18 120 -146 -150 -63 210 -71 56 24 31 193 168 -54 41 8 109 133 -22 33 -33 71 103 -59
5198e9J4J35j05j92R9J25P3j31R9j73l1n3M05l34N6k7M0j77J62J66m5j18j87K65
5222GJ08j55l9j87J65L53l14j00K05p3J88k20J31j86j07J53M2k9o3J34O2R3j30
5245C8K21p9k56K81k02k5J10Oj81K06l13M93n85K28L47k88M5n9j02K99l70K91
5267A05m6j86J21q1J18LL2R9j30J04k60%J2J33m2K49j08j99L72m5m05j29L08l56
5291c31L11j29Q2L9Q4k99L45l95J78J55k95K33J72J1N7k87L49j89j81r3K22R4
5313A33m2j74O4p5K11O5k66J87j53n5m8j2L56l39L5J19r0r7J53q1N3M15m15J43
5337H7j5l10L24j48Q9J17k24J86N7n0q4k13JL77k44j7N7j46M00l89K35k40rQ3
5361g6K5K30n04K13J57J39l70J44j37M54m46K01k8l18L67n9J67j17j26j3N1L06
$$ plain form
5198 -59 -45 90 -15 -207 -108 17 90 -41 58 -115 -146 -199 206 -128 -72 -99 -59 -236 -74 92 47 -71 -258 7
5222 7 115 -40 -79 -266 -101 252 -62 -162 43 -30 158 -62 69 -117 -224 -71 -29 -58 -121 13 75 168 38
5245 38 259 180 -76 205 3 -22 88 94 -87 119 -194 299 -286 -58 289 1 46 -13 -115 184 -186 105
5267 105 59 -127 -6 -87 31 34 66 165 35 139 -121 -121 -109 24 -18 231 123 -76 296 251 -154 -283 25 -331
5291 -331 -20 -149 -67 -28 56 -243 102 -293 -115 40 -255 -22 150 161 218 -69 280 91 -90 -183 39 133
5313 133 91 -83 -19 -94 117 182 -84 103 -50 -105 -153 -165 191 -148 -113 6 -84 -181 -28 -109 -56 359 -56 87
5337 87 72 -238 86 -62 27 144 -80 106 163 113 29 -184 -183 194 -50 -67 -10 -156 244 -145 90 -150 -159 -76
5361 -76 -51 179 -325 -112 45 184 -186 -42 -179 275 -171 30 2 -316 51 -8 159 42 -84 -97 -46 260
5383B60j90j39O8J8j37J2K3j16J53M06l65K31k0k25K96j68j76J08j34R5j60J53
5405gJ53l43K1J04L17k29J80k4m67J77k25O13m00M3j12j2J74rKO9j13J01k64M70
5429B19k44M2K9l34K49l7J6K11k2l78M48p5L0k35JL88m04Q9o9p2J43j2J85l76
5453b08L11k3J8q7L2Jk8Q5j62Q3K36m05J19m9J96j12M1j00N3L4O2l62m9L28J68
5478A82L1k02j31j4L79k90OK2M7l4m9r3M32l87K38j78J32L86m27n9K26q5j08n
5502A9j63L01q7p5J4J94m1k16M1j58K03j10O1j8o7J79J82j33j01O3j79K1R4K07
5526B31l51J77J6k62K45j75N4K51k66m6R9J28l71M81j81l2r0J82j39j23L34p2
5548I0o7j14J81k0K7J3P4k42r6J58K56l73r7J14N80l38j13k25J73r9J22j67M65
$$ plain form
5383 260 70 -69 -1 17 -120 -108 -85 -201 -48 358 -7 224 204 -21 275 107 -69 39 -95 0 -160 -7
5405 -7 146 -197 -176 -72 245 16 196 172 -295 -118 -343 270 -130 -87 -199 -211 -37 -46 -44 25 -88 13 -251 219
5429 219 -25 17 46 -288 -39 -76 -60 151 129 -249 199 124 154 -81 -80 308 -96 -7 -76 -148 -5 -17 168 -208
5453 -208 103 80 98 11 43 44 16 101 -61 22 258 -147 -28 -77 119 7 48 -52 1 35 97 -265 -314 14 182
5478 182 213 11 -120 -134 245 -45 -39 -17 30 -4 -53 -146 286 -101 137 -41 91 477 50 -9 217 132 24 19
5502 19 -144 157 70 -5 9 203 162 -54 -13 -171 32 -78 -17 -35 -102 77 259 126 25 88 -91 -70 24 231
5526 231 -120 57 73 -189 56 -119 -65 186 -80 -126 -27 101 -270 211 30 -2 -92 90 -49 -172 162 90
5548 90 23 -91 90 70 97 110 184 -58 -154 4 260 -113 -210 -96 484 146 33 -192 -19 -118 4 -163 302
5571C02l81n2J59j60J16J17j51J54m26L04r1K46Q0k32J90l74J90r0J25n2J07j92
5593a11M6k4j2N8J02qM6p7N9J90l61o9J71n8J0r7M4p5J33K36j8k74N8j24%O8L6
5620e1j7n2J01J2J59j43mj69K01m0K52k69n0qL2L3j7L3P3O3j60P9l40j07N35k45
5646i9J14P8l39K91Kk26J59m8j04k4M35k24p5O9L91l42k93M15j09j41J76j62N1
5669ej4L7k03L16K4m32O3J26n3J81k8J64J7k08l52M84m7m1J46m09J77N59n00M4
5693D6O9j38j62J97J12l78L17l3p9L7j32K26j52M05n63K84k13K20J62j18l5j05
5715c3J59j85K41j28N9j12l3OJ27lk5l7j48k4J86R0k00J39j4J12o6j60m7N9l5
5740g2j80J53m6%j14M10l7l71K48O3L9o5R2m6q0J91M1K9k38k8J9k34J51j79J24
$$ plain form
5571 302 -79 -131 28 -132 -16 101 -50 104 -322 -18 -109 137 217 -15 175 -199 -9 -99 26 -26 81 -111
5593 -111 -65 -89 -101 -43 59 51 97 20 79 269 -92 -161 10 -48 -38 -135 -91 -166 -33 203 185 -89 -31 -155 -155 -87 -51
5620 -51 -68 -120 -19 -7 152 9 5 -164 37 -3 249 -20 -70 -78 -46 -13 -30 3 76 139 -21 58 -282 -389 146 -99
5646 -99 15 93 -246 45 47 -179 -20 -68 -172 -196 239 15 -60 9 400 58 -235 180 71 -70 106 -56 -5
5669 -5 -19 18 -185 131 155 -277 -214 -88 -141 40 12 176 193 -15 -367 117 70 29 175 -234 -57 502 2 46
5693 46 115 -23 -185 12 124 -254 63 30 -49 -12 -144 82 -70 335 -228 56 -157 63 225 107 72 -33
5715 -33 126 -59 182 54 113 1 -32 -26 101 98 73 36 -112 -136 50 140 -60 79 65 177 111 -49 -96 -37 -72
5740 -72 -252 -99 -145 -145 -259 151 114 -257 -9 54 93 28 120 74 -6 185 226 255 17 -11 8 -226 -75 -254 -130
5765a30R5Q0J20k33J78k16m3J11j99J98K74k97J43p3k57L18k44J90M5L2l42nL93
5788A38K5j76p5K77k8l0l18n7J14N4L4j43K6P3k5J80j08K3k1n1J96k19Q4j80K03
5813dJ13k05L19k77j74K59K7j38N3l2K39k24K4K13p9k94K55J2K0l2J8l13J38N8
5837b4n7K91O2k57k32L15j10K95k60M1n6j6M2%l67K53K73m21J34K13k51K3J12
5860Cj26L71j82L1K1k37R3k07K49m24L93K27j32k09J88j80m2K85Q8j18q5l5K3
5883eJ2l42L13K30k2p2p2J73k29l27K55O5L89l23k54J71jJ02J6J39k47J38j62
5906e3J14l8k20J08J69k82J11Rj06k26N15j08M9J09k03k36K88l76K33K8K80k92
5928a27J42l3o8M22m23J0pJ8p6J48m3J00M4j16j32J14L1j7k4K99l42n3M1M5j70
$$ plain form
5765 -130 -35 45 165 -68 110 -106 -149 -38 -237 -39 235 -62 81 8 -249 69 -175 15 60 92 -250 -255 138
5788 138 163 -13 -88 189 161 131 -187 -244 -130 -76 -42 -185 -159 -86 -111 69 -39 -16 -37 -88 108 -111 -27 -207 -4
5813 -4 109 -96 223 -54 -228 31 58 -80 -27 -59 180 -44 -20 193 114 -180 75 87 107 75 93 -220 -82 -24
5837 -24 -81 210 272 15 -217 98 -12 283 23 64 8 -8 34 34 -333 -80 193 -228 -94 119 -132 -109 3
5860 3 -123 248 66 97 118 -119 -26 -233 16 -408 -15 212 80 -129 59 -121 -163 122 210 92 7 -28 -5
5883 -5 7 -335 -22 208 186 114 42 215 -14 -341 -86 -21 368 45 -209 -38 -39 63 79 218 -29 109 -53
5906 -53 61 23 -197 -89 80 -202 -91 -82 -188 -414 101 -7 42 151 -52 -288 0 -376 -143 -115 165 -127
5928 -127 15 -18 -86 336 -87 -77 -84 -66 -142 6 -37 63 107 -9 -141 -27 4 -13 -37 262 -80 -133 -92 -47 -217
5953b17M87j63ll96K37K84j93k17K32k07p5P8K68j12j39J98L3j07k30M80l44K29
5975A23j23K82m41K98J6k22r5Q1j17M18k12K18m30j61M30Jk0p8p6K57k28L00m2
5998A79j17n6K75k73j61L24k64K97j18j5j39O5K33k90M9K89j60L8j92j07R6L31
6020B84l69L51k28n4K87k44q8K45l21K03nk54K45k27K52k64j0Q7j90K03K9L6L4
6043Bj22P0mL09k69k78N82j50l83J4oJ32J70q1N2j10j12J58J62k70J20J93m76
6066b97J62M5L1K94n2l33N1K8J23Nk66J6J52j8K8k13L58m7k12R2M12k28K3l59
6090b05J55L26l36J93j53j04O2J27j26J74J34k91L06k44k68K30l8J73j48J21n2
6111C6O7%l0qr6j04J08j9R7r5%o6M1J09j03K72k08m9K3J03M8J29j9k45K21r0k50
$$ plain form
5953 -217 270 107 104 -292 -55 229 36 -181 51 -156 -231 -153 115 3 -136 62 95 -12 -242 238 -106 123
5975 123 0 282 -159 139 155 -67 -162 -81 -198 220 8 226 -204 -365 65 66 46 -32 -108 149 -79 221 179
5998 179 62 6 281 8 -153 171 -93 204 86 71 -68 -3 230 -60 -11 278 118 156 -36 -143 -47 284
6020 284 -85 266 38 -16 271 27 -61 184 -137 66 61 -193 52 -175 77 -187 -197 -110 -300 -97 -68 -32 2
6043 2 -120 -50 -54 255 -14 -292 290 140 -243 -229 -235 -103 67 -14 38 -72 -184 -26 136 -134 -14 179 -297
6066 -297 -135 -90 -59 235 183 -150 -99 -71 52 57 -209 -193 -41 -59 -31 -244 114 67 -145 -53 359 131 154 -205
6090 -205 -50 276 -60 133 -20 -124 -62 65 -61 113 247 -44 262 18 -250 -20 -58 115 -33 88 36
6111 36 103 103 73 65 -31 -135 -27 -46 51 -44 -44 -110 -69 40 -63 209 1 -48 -25 78 126 255 236 -9 212 122 -128
6138a28J33j37L47k25J26m58L08N7k47J36J03J22n6k66J13K5k4r9K47j96j7o0
6160a96J19j60K04j38J72J42j76l07M93j71J17O1j12j01J35Q7k19J01M3j33K4
6181a5J55j63K01o6K2p4p4O3Mj26j0J97k91KM39k14j79K4j03OK76j06n7J55o4
6206BJ51N2j49k09J85j5P4P6j3l51J60M6j07%J85J4k05K62j40J34jk45K70l14
6230a38J04rj12K68P9k44PK3j12K59k6j45M7p5J30j23J94l04J65J44k60R2k26
6253b62J69J63p1J09k33l9K42k01j10P0K93j59Q4k42K16m57K58J16j38J80l8N4
6275Dj5r9J10Jk40M07j75P6k6J60k06J43nj70QK31j59r9Q0LM8o7j21K38l9k9r1
6302c2j13K35j99n2J22NJ0J44M0j72r1o5l3L69n1j14M2J10P5r5M1k40K14m3J12
$$ plain form
6138 -128 5 -132 215 -10 116 -342 -34 23 -224 -88 15 137 81 -185 -72 -47 -71 -170 77 -119 -136 -196
6160 -196 -77 -237 -33 -171 1 143 -33 -340 153 -18 99 160 48 -53 82 169 -50 51 94 -39 -15
6181 -15 140 -23 178 112 134 60 -14 49 53 -73 -83 114 -177 -175 264 50 -129 -105 -208 -202 74 -32 -89 66 2
6206 2 153 205 56 -153 32 17 91 167 154 -197 -37 9 -98 -98 87 101 -104 158 18 152 151 -94 176 -138
6230 -138 -34 -43 -155 113 192 -52 -45 -22 -134 125 99 -46 1 -74 56 -67 127 -177 -12 132 -128 -36 -262
6253 -262 -93 70 -1 108 -125 -164 78 -123 -233 -163 130 -29 55 -187 29 -428 -170 -54 -192 -12 -50 4
6275 4 -11 -110 0 1 -239 168 -7 69 43 203 -3 140 135 -35 -27 204 45 -54 26 29 77 10 -111 127 88 59 -32
6302 -32 -145 90 -109 -161 -39 -34 -24 120 160 -12 -103 -168 -201 168 117 3 45 155 230 135 176 -64 150 107 219
6327B19k81J01K57p6l31r7M01l62O3J79j27J15J53K37o16mK51j36K28k59j41J76
6349e0p5r3L28k22J64j49K68jn43N12k02p5J15J6j54R8Q0Q9j20P3p6k79K59j14
6373a51lL38p2m68M05j40j06J47O5j24%O2J16j06Kq8L26j97p8q1j10L95M8m61
6397b81K14O4J23j61L29k86j52J89m0k35L36L7j73J8R7j46J08O5k3J93k96j46
6419a66J36J67j13j86J30R7j05J19J8m5M8j96j13J88m4Q2R6l5LN1k43K87p9j25
6443b8r6%m9Q1K19k60K63k70R9N6p3L25m95L74r5lQ5r8L8j38j11L8R7k5J46k29
6469a49R8k20K55O0j8K53l24j70K77J08k56J58lp9K36l44R7L98l98L26l64K38
6491A79P6j96l52L98K9l3m64J08K79P0j23K88m70J58Q2j27K21k50j28K40j53K95
$$ plain form
6327 219 -62 39 296 220 -111 -208 193 -169 -106 73 -54 61 214 451 -165 -169 82 -54 174 -85 -226 -50
6349 -50 -125 -218 110 -112 52 -97 171 170 -373 139 -63 -138 -23 -7 -161 -63 17 106 -14 59 -17 -296 -37 -151
6373 -151 -154 184 112 -356 49 -91 -197 -50 15 -109 -109 -47 69 -37 -35 -123 203 6 -72 -153 -263 132 180 -281
6397 -281 -67 -3 120 -41 288 2 -150 39 -1 -236 100 137 -36 -18 79 -67 41 106 83 276 -20 -166
6419 -166 -30 137 24 -162 -32 65 -40 79 97 52 100 -96 -209 -21 -65 17 113 78 81 132 -111 176 97 -28
6443 -28 -124 -124 -173 -92 127 -133 130 -140 -41 15 -58 267 -228 146 51 48 133 35 73 -65 -176 -138 -41 -66 80 -149
6469 -149 -51 -271 -16 44 26 279 -45 -215 62 170 -86 72 69 -10 226 -118 -21 377 -21 305 -59 179
6491 179 255 59 -293 105 134 101 -363 -255 24 94 -29 259 -211 -53 29 -98 123 -127 -255 -15 -168 127
6513A27j09Jj28o7r4L23N0N5J3k68L27m05J30K2j21OP5j32NL91Ll67Q4L4N9j55
6539a41pJ69r3j18P9K90P0l63M3M5J28K0j11q2J43j52k24K94l52J47J99l48o8
6562d32O02o3k23l4J67R7m19K53J22m2l2j69K60j75m0R6n2K89k81j12K26j06n
6585g3J85j16k97J46L2J55L7J35k7j47j02k2m7K70J42k85J8l7P5K5j46knp8J19
6610d5J09q4j67K89P3n0j96QK99j78R7p7k40L56m3j89J18j82K00l43J59K78j07
6633H5k97M13k04J23o9j92nJ17k45K83J4j29K84l61L03ok03K60j33j29Jj27K96
6656G9K81m99R5J42k11J3K19Q1L8j87j48j19J93J24o9k00L4K15J2q4k24K53J08
6679A46k00j95K39l24L53n2j86K32j61J89K4j86J88N0j61L14j00k88K37j35K2
$$ plain form
6513 127 18 19 -109 -176 -270 53 103 158 171 -97 230 -175 -45 -23 -144 -138 -63 -195 -190 201 204 -163 -79 -45 14 -141
6539 -141 -148 21 -72 -190 -111 179 249 -114 -71 -26 102 122 11 -71 72 -80 -304 -10 -362 -215 -16 -364 -432
6562 -432 170 107 -116 -150 17 114 -305 -52 70 28 -4 -173 87 -88 -128 -32 -84 205 -76 -188 38 -68 -73
6585 -73 112 -4 -301 -155 -123 32 69 204 177 30 -72 -94 -141 129 271 -14 4 -33 42 67 -79 -81 -86 -164 -45
6610 -45 64 -20 -187 102 175 125 -71 -63 236 58 155 78 -162 194 151 -38 80 -102 98 -245 -86 192 85
6633 85 -212 201 -3 120 51 -141 -146 -29 -274 9 23 -106 178 -183 120 114 -89 171 38 -91 -90 -217 79
6656 79 360 -139 -44 98 -113 -100 119 200 238 51 -97 -216 -23 101 32 -168 -134 81 93 9 -215 38 146
6679 146 -54 -249 -10 -334 19 -33 -219 13 -148 41 65 -121 67 117 -44 270 170 -118 119 -16 6
6700FQ6Qk52k1N6NK09M7k41J37M24m68j5J22o7j38J4K57j75n8LR7O8m4k38L34
6726A56O7l21m0K58k10L54j62J11q8J53m61N5L22o3%j53k4qL61j38j36j48L3R5
6750A3R8q1J21j68J07q4j89K23N5j93LJ39Kj43o2N7j47O1J66M5l2K59l08J08O
6775E6k53J66L3L4k67j49L85p2K16q1jj04J21j81Q9J8L8L3j67L3j55L28k41l8
6799a59J75K85m10O7K11l72J03q9K63k09j43K28n2o2K28Mo2l4j20k34L04o5M7
6822i6lK45k34K08k18R9j98k34M52J68k36J15K86k01j28n5J94l72L69o2K5k44
6844a20K06k44L31k65J36p8Q8Kp3P9p7J2J9O0j09L5j57K42k27L06k88K52j6k68
6868a54J92j15J18j66J66j59J51l6j31J82p2j3l1J56j86J66P9j00N7l64M31p5
$$ plain form
6700 6 92 100 -152 -173 -117 -112 97 144 -97 40 464 -4 -19 103 36 -102 -88 169 -6 -64 -61 36 104 60 -178 156
6726 156 223 -98 -138 120 -90 264 102 213 125 278 -183 -128 194 131 131 -22 -46 -54 307 169 33 -115 -82 13
6750 13 111 30 151 -17 90 6 -183 40 95 -98 -95 44 46 -97 -159 -102 -249 -188 -22 23 -9 250 -58 50 56
6775 56 -197 -31 2 36 -231 -380 5 -67 149 68 67 -37 84 -97 -8 10 48 81 -86 -53 -208 120 -121 -159
6799 -159 16 301 -109 -42 169 -203 -100 -189 74 -135 -278 -50 -102 -164 64 68 6 -28 -148 -382 -78 -143 -96
6822 -96 -99 146 -88 120 -98 1 -197 -431 21 189 -47 68 354 153 25 -30 164 -208 161 99 124 -120
6844 -120 86 -158 173 -92 44 -34 54 56 -17 62 -15 -3 16 76 -33 2 -155 87 -140 166 -122 130 114 -154
6868 -154 38 -77 41 -125 41 -118 33 -3 -134 48 -24 -37 -68 88 -98 68 147 47 104 -260 171 96
6890I6l23j5J44j96J45K13j5j88q9j64L23K22j35J4j1O0q8j36q9K22K92l23k11
6913b52L35k53N7J94j38Q8N5j0n8Ql8QK8Q4l5j58L11k55M0OK21l57n4J15j67K42
6939A7J77n6j07J9L7r7K4M3K22m94lJ97n9o8M50l39Q7kl8M3P2j24p3L6LK0O2k35
6967a86J22J88m0M2l03J03n6Q5K02M2j40l0N1j53l7K08k27L78j19j37o0J16p5
6990b6M5J4k5r3j21Q4j5K34j90Q5J9k0J26k17N1m1J12j10J8Q6j6J05o8n4nJ64
7016A42k66J69k48L37j00l2j8K83k19m5j39Kn9M74k82Q3q6j64KN6K54J9K1j17
7040F7J77m9k10J72l7j61Q1m8O1j80N7j19L6J14J67j48K39l43j09L56N6M8o29
7063d02K18J48j33J0R3j10J22L8j38l6J16J81J21j77j36K8r0J41J0R2j57L7M2
$$ plain form
6890 96 -227 -242 -98 -294 -149 64 49 -139 -228 -392 -69 153 18 32 21 81 -7 -143 -232 -10 282 -41 -252
6913 -252 83 -170 -113 81 -57 31 86 76 18 26 -12 -4 24 108 73 -85 226 -29 11 17 238 -119 -173 -58 -225 17
6939 17 194 138 31 50 87 -10 14 57 279 -215 -218 -21 -80 -148 302 -37 50 48 10 53 125 1 -72 -36 -33 -13 49 -186
6967 -186 -64 124 84 126 -177 -74 -130 -45 157 199 59 29 80 -73 -110 98 -129 249 130 -7 -67 49 -26
6990 -26 19 33 8 -85 -206 -122 -137 97 -93 -8 11 -9 117 -100 -49 -90 22 -88 -70 16 0 105 37 -17 -22 142
7016 142 -124 45 -203 134 34 2 -16 267 48 3 -136 -134 -193 281 -1 82 -4 -168 -166 -110 144 163 184 67
7040 67 244 195 -15 157 120 -41 40 -8 53 -127 -70 -189 -153 -39 128 -20 219 -124 -233 123 179 227 -402
7063 -402 -184 -36 -169 -159 -66 -176 -54 -16 -154 -190 -74 107 228 51 -85 -57 -147 -6 4 96 -61 -24 18
7086A8j67K03J08j95J80k22K16j35O7K7k68K86L5k80J39j62J75K6k40M5K60M9
7108A65j64J9r3J01L7k30J13L28k60k43K92k11K01l01M46k35q0M94k43j63K57
7129B30m05J65q8n2J75o6J5pP7p5K2K30j76O8j56j8N1l4j23J28k9k06K05J73O6
7154A70m5j18l68K95J09K38l25j76J24J43j82K9K56l01R6L19m93K37M11m84k0
7175h5K23j25J90j5k26P9Rp7j06L21m05oJ99j3K3m4k1J34L0k2j30MP5j55K71j33
7201eK3R3K6Qk1O0k98J29M2j29J73j51oO8K13m4l37L13j16L5J06j89k8l9K46K1
7227A93q2j52L39l59j8P9K9j74jL45k0Pn7j95J61r3j81J48j8J18o7Q8k30J38P1
7252F9j23K04k32j46L32m1m09N28k25J60k28J15j69K55j43k1L13j78K09q3J00
$$ plain form
7086 18 -149 54 162 -33 147 -75 141 6 73 100 -168 118 153 -127 12 -150 25 51 -189 -144 116 165
7108 165 1 20 -73 28 65 -165 -52 276 16 -227 65 -146 55 -246 200 -35 -115 379 136 -27 230
7129 230 -175 -10 -98 -150 25 -41 -26 -33 44 -31 -9 221 45 113 -43 -61 -10 -44 -167 -39 -68 -274 -69 104 170
7154 170 125 7 -361 -66 43 281 -44 -220 -96 47 -135 -106 150 -151 -55 264 -229 8 419 -65 -85
7175 -85 138 13 203 188 -38 41 50 -27 -133 188 -217 -223 -24 -37 -14 -58 -79 55 85 63 -67 -63 12 -143 128 -5
7201 -5 18 111 137 145 124 184 -114 15 57 -72 101 -50 -56 12 225 181 -156 157 41 76 182 -7 -35 -74 172 193
7227 193 111 -41 298 -61 -79 0 29 -145 -146 199 179 186 129 -66 95 2 -179 -31 -49 69 2 90 -140 -2 69
7252 69 -54 150 -82 -228 104 63 -346 182 -43 117 -111 4 -165 90 -53 -74 239 61 270 187 287
7273B87m54NN97m51k77J33J64lj15J11r4l1M9j9M08m21J2K75j60k5K1N6N1k41
7297a22l5J80j2J6P1J71j64j82m3J96K9l44J02L07n5L6j60r8J12P6K57m89M28
7320B77k82O8J26k83j11K08K09l35j19K12j44L81l06K41p2l3r2N1k9k19M26o1
7342A13N2l26J19k63M60j58K6L06l00O1j29K14m88L50K3M5o0k7L3j32o9K5J93
7365F8k71L02j72J04r5K99m8l27J01M52k98j72M9j66R4J74j81J37R4l71J77o0
7387a10j19K60J2l54r9L97P3j56L64j76j52N8O3m64O93m35L49k13j10K91l17R8
7409d7J12j53K06j85P1j01m4J73j45K70l85K77j09PN3j13P4k52Q3L37J2j75p0
7432a04O5J93o1N7J3j12o3J22j16L22k06j66M8J23j72j45L90l4j19m16J69j28
$$ plain form
7273 287 -167 -162 435 -16 -293 -160 4 1 -114 -3 -97 -128 -79 -98 310 -111 -99 176 16 -9 12 68 119 -122
7297 -122 -157 23 11 27 98 269 105 -77 -120 76 105 -239 -137 170 115 151 -9 -107 5 81 338 -151 277
7320 277 -5 63 189 -94 -205 3 212 -123 -242 -30 -174 207 -99 142 70 37 -55 -4 -33 -252 174 113
7342 113 165 -161 -42 -305 155 -3 23 329 29 90 -39 175 -313 37 60 105 45 18 51 -81 -150 -125 68
7365 68 -203 99 -73 31 -64 235 187 -140 -39 413 115 -57 -8 -174 -80 94 -87 50 144 -227 -50 -110
7387 -110 -229 31 43 -311 -410 -13 60 -96 268 92 -60 -2 61 -403 290 -145 204 -9 -119 172 -145 -47
7409 -47 65 -88 118 -67 4 -97 -141 32 -113 157 -228 49 -60 -53 0 -113 -39 -291 -208 129 141 -34 -104
7432 -104 -39 154 93 150 163 51 -12 110 -6 316 110 -56 -8 115 -57 -202 188 154 35 -381 -212 -340
7454c40K14R8O4K34m06L13j61o2j81J02J94k76O6J39J94j42Q6m06M58l77K68Q
7476H7q0K5l45K48L08j65l3j39OJ80l0M2p8M9j77L92m05M03j64o5j06J29j74J85
7500I3J87l28M1R9l60M99p0l40J37K81l53L02k66j47L37k06Kj5J85j2J57k55j63
7523a95O6K15K0j65K31l72R1J16M1J0J93l59L56o1j89K3J87l22J75k2j62J69R4
7546A40k38K51j35n6p0j77L10J81j49k63L10k53R5R8N7O4k08J19%j19N1J7k02
7569a77L19J16l04L07l72M8J81k77J81K1o8J15J16j02l09M9J94J26r2q8j19O9
7591f6K24j76J85k16r3K92j73P8K4n9J8O4p3J0J41j60J5l1N3J91k83k02K00K28
7615A91k15p5O7Oj93M38m65O7L94k56J35j72m8M76j03k23NP7k11K83j69N5R%M7
$$ plain form
7454 -340 -126 -28 36 270 -136 177 16 -46 -227 -125 69 -207 -141 -2 192 50 136 -270 188 -189 79 87
7476 87 7 32 -313 -65 243 78 45 -94 -88 92 62 104 26 75 -102 290 -115 288 124 59 -47 82 -92 93
7500 93 280 -48 -7 92 -268 231 161 -179 -42 239 -114 188 -78 -225 112 -94 -92 -107 78 66 223 -32 -195
7523 -195 -129 86 106 -59 172 -200 -109 7 48 58 251 -108 248 187 -2 21 208 -114 61 39 -123 46 140
7546 140 -98 153 18 -38 -108 -285 25 206 57 -206 104 -149 -54 44 101 165 -43 76 76 -43 8 25 -177
7569 -177 142 258 -46 261 -111 -63 118 -159 22 43 -25 90 206 104 -205 -156 38 164 72 -16 -135 -66
7591 -66 158 -18 167 -49 -142 150 -23 55 79 20 38 102 29 39 180 20 35 4 57 248 -35 -237 -37 191
7615 191 -24 -99 -32 -26 -219 219 -246 -179 215 -41 94 -78 -126 350 247 24 29 106 -105 178 9 64 73 73 120
7640A20K28m69M6k78K93K00p8j0j41j7N50m58J93J9j27oJ39k01j8J29k55J81j59
7663a19J35J26j23K5o5J32j81K45l8j95n9K6K14k0k21k3n4K56j0R1l26K23n8j30
7687a49O6l2K70j70R2Q2n01P37p18J82M8K30l27K72J02j17o2K8K46q6Mj00k59
7710a62K67q5r8N2J03k51J15J28j58L96l71K6r3J22j54J69Kl86M90l07K08K2N5
7733I0o1Q6k56J11pJ21K21j84n9j7j87M9K18J75k01J2j06MK42k05k03L2JK29k36
7758a31j35K11j91P5K32n9j69MqK15J54l8N0j72P8j77K19j71j7l9R4m9j17K32
7782I1p4K07j51k5J56m13M77l28l3K14r7J77k11K7n1J68k14J09L2J95l00K24m89
7805c09M07l8J10j24k45L06l94O52l62J77k82J55N6r5p4J37J3j1j56K98r9l58
$$ plain form
7640 120 348 -121 -75 -353 -60 140 62 52 -89 -106 444 -14 179 198 71 65 204 3 -15 114 -141 40 -119
7663 -119 16 142 19 44 -21 111 -70 175 137 -58 -117 -91 123 103 -118 -141 -195 61 51 142 -184 39 -19 -149
7687 -149 -83 -115 155 -15 77 159 -342 395 -323 -141 -93 137 -190 82 184 67 5 33 279 193 197 97 -162
7710 -162 105 20 -78 -26 77 -174 -59 69 -89 307 -64 -38 -131 -9 -163 6 8 -378 112 -195 13 35 90
7733 90 29 115 -141 -30 -37 84 305 121 62 45 -142 -93 125 300 99 111 5 9 251 46 -157 -125 -124 105 -131
7758 -131 -266 -55 -246 -171 61 2 -167 -163 -171 44 198 160 210 38 116 -61 158 -13 -30 -69 25 -24 -141 91
7782 91 17 224 73 48 204 -209 268 -60 -93 121 24 201 -10 17 -34 134 -80 29 61 256 -44 180 -309
7805 -309 98 60 170 46 -199 107 -287 365 3 180 -102 53 109 14 -60 77 90 79 -77 221 122 -236
7827b36K74L4R3j60rj37K43j54M6M1j26K79m25K05J8j45P8p8Q9L5J60nq7P5o8
7852D0J40k22Q1o2J43j86J24L4R8l17QK00K34k63l44J16K09J10p5p6Q6kj15K97
7876B58j69j20J30k23o6j15K03J23L1J91l95L67k25K16k81J41k2J33k11m4K67
7897A89j88P2k8J77k11k34Q3L22K8k92J61P2k43j68K20p7J19N7j88J02j21J82
7919C4l67L14J87j26l1k33L52nj20m5k68K76j80P2K44N1l40L73j32p8R7k31K56
7942A00M8l78K20J37n7k57J29j49L35j62PJ1n4m3M67l21k5j70qJ16K46j95N1l18
7966b70J75j08R1j30M5L27r3j21J41j40R8K88m48J49J48j93O7m1m1q6J58K41k07
7989E0J80l50J3P9K47k17J52n8k47K39j75N8l3n1J53K09l07O9j37Q6L97k70Kk17
$$ plain form
7827 -236 38 72 165 5 -4 -141 102 -52 -6 35 -91 188 -237 -32 -14 -159 -81 -159 -70 -35 125 120 33 108 40
7852 40 180 -42 39 -23 120 -66 58 92 190 -127 -119 81 315 52 -292 -176 33 143 68 -8 78 76 -39 258
7876 258 89 -31 99 -124 -190 -305 -102 21 52 243 -152 215 -10 206 -75 66 44 177 -34 -78 189
7897 189 1 73 45 222 11 -223 -140 182 210 -82 79 151 -92 -260 -40 -117 2 59 -129 -27 -148 34
7919 34 -333 -19 168 42 11 -222 130 125 5 -40 -308 -32 -212 -140 104 155 -185 188 56 -22 75 -156 100
7942 100 148 -230 -10 127 70 -187 -58 -207 128 -34 -27 -16 -70 -113 354 33 8 -162 -170 -54 192 -3 48 -270
7966 -270 -95 -203 -112 -242 -197 130 37 -84 57 -83 15 303 -145 4 152 -41 26 -15 -56 -142 16 257 50
7989 50 230 -120 -107 -28 219 2 154 96 -151 88 -87 -29 -62 -113 40 249 -58 11 -126 -40 357 87 89 -128
8013a28K99k99j10L68j50PP3J26l22N6L39j70j02j3L3j31r1M50n12K90P9n1Q1
8036A22j41r2O1j62L06O1l07O9M8k1j23K11J20l32J24k05J88K50j29j77K2O4Q5
8059D2j99M5L25l77rj3L63j40m4r9L37m09J73k35J42J37K9k07j71L73N0r9kN9
8083G1p6PJ24j11q1J58o6j47J24n1O7J46l01l2J49J27j08r0J07l72L09O4nJ87
8107B00j28j85J03r1l6J30k21K91j21k59j16M20j34q7N66n90K72l00L40k06l3
8128a85Q0OK32j42j4K50j12m40L41L73l79j76K19K4O7l25J25J74l29K52Q8r8J
8151C2N1j8P7j46n1J21r7K01k52r2J37r0O0l17P94l94j37K7R5K31k44l48N02k34
8175i2O9J38m52M99L7k61J02R2o2Ll10K70j88K19k69K6
$$ plain form
8013 -128 171 -128 -238 130 -20 -13 60 186 -136 -80 259 89 -13 -26 7 -124 -215 235 -277 13 92 41 122
8036 122 -19 -111 -50 -212 94 155 -152 -83 -35 -56 -179 32 152 -180 -56 -261 -73 177 48 -129 -107 -43 42
8059 42 -157 -112 213 -164 -173 -186 177 37 -7 -106 231 -178 -5 -240 -98 39 68 -139 -310 63 113 14 12 71
8083 71 -5 2 126 15 -66 92 26 -121 3 -48 19 165 -136 -168 -19 108 0 -90 17 -355 -46 18 13 200
8107 200 72 -113 -10 -101 -137 -7 -228 63 -58 -317 -433 -13 -147 -234 332 -258 14 -286 54 -152 -185
8128 -185 -105 -99 133 -9 -23 227 115 -325 16 389 10 -166 53 77 144 -181 -56 118 -211 41 129 31 32
8151 32 83 65 142 -4 -55 66 -31 170 -82 -174 -37 -127 -67 -384 410 16 -121 -94 1 232 -12 -360 142 -92
8175 -92 -23 115 -337 162 199 -62 40 132 70 73 -237 33 -155 64 -205 -179
8191a79
$$ Imaginary data points
##PAGE= N=2
##DATA TABLE= (X++(I..I)), XYDATA
0@%%%%%%%%%%%%Qj6J6j6J6k4L2l9M7n6O4p2Q8j04J20j36J57j81K06k35K67l01
34a59L40l81M26m79N35n96O62p35Q16r02R95j099J212j336J472j619J782j965
52a031K168k393K645k932L260l637M079m603N236o019P015q328J0141j2811J7118
67I908k5136M4739j73264k28487M24768j8385j84440m2432N3160J79356o7619
78b7832j88682J57017J73190m9513j37417M3239J65788J3908o3083o3345L2600
89E5870J47898j65694j50732K29821O776j91881m868K2376P7283k4709j66791
100a64651Q5573J11669j16076l6124Q4515P0519j4697p5967J0521Q5899M9148
111I0329p0480o6075J18463K7260j24790K7174N4925K638j9200j14625L9307J21138
$$ plain form
0 0 0 0 0 0 0 0 0 0 0 0 0 0 8 -8 8 -8 8 -16 16 -23 24 -32 32 -40 48 -56 64 -72 85 -96 110 -125 142 -159
34 -159 181 -200 226 -253 282 -314 348 -387 429 -473 522 -577 635 -701 771 -848 934 -1031
52 -1031 1137 -1256 1389 -1543 1717 -1920 2159 -2444 2792 -3227 3788 -4540 5601 -7210 9908
67 9908 -15228 29511 -143753 -372240 52528 34143 -150297 -192729 -139569 39787 -27832
78 -27832 -216514 -59497 113693 64180 -73237 -29998 135790 149698 86615 23270 55870
89 55870 203768 38074 -112658 117163 123939 -67942 -72810 -50434 26849 2140 -164651
100 -164651 -79078 32591 -83485 -119609 -35094 35425 20728 -55239 -44718 41181 90329
111 90329 19849 -46226 72237 99497 -25293 1881 56806 59444 40244 -74381 -35074 86064
123H6064r4780n5233O5648K082j2256k2657m714N7858N808o5487j7811P2629K1911
136C9062o1926R614K2856j8143J0968k6531O876O5105n6296m5992P2770M762k3991
149h66J7502j5709P891J9925l4624Q791N1939k7303m9522K4552J9156j8534m3
162C155j6433j1069K8491l1007k4802O0515p091m7170K2022M375M986K8832k3692
175h888k919L8860j6826j7386L9986P470k6819O275o141n334K8939k3219k7073
188a3075L4713j9659l5450L2034j242k0070Q923k0261r69L6455j3953k0016L0699
201a871J017k2412K4382J2307p971K0348j5416j8051M1501j521k9754K3101m747
214B0913k4348J6432p034r002K0066k3239k4729K6414P23k0652J3711M52j5443
$$ plain form
123 86064 -8716 -63949 1699 3781 -8475 -31132 -35846 22012 27820 -37667 -55478 17151 39062
136 39062 -22864 -13250 9606 -8537 2431 -24100 -17224 47881 -8415 -54407 18363 23125 -866
149 -866 16636 927 8818 28743 -5881 2910 54849 27546 -21976 2576 21732 3198 3155
162 3155 -13278 -24347 4144 -26863 -51665 8850 1759 -45411 -23389 -19014 -14028 14804 -8888
175 -8888 -11807 27053 10227 -7159 32827 40297 13478 19753 13612 8278 37217 13998 -13075
188 -13075 21638 1979 -33471 -1437 -2679 -22749 -13826 -34087 -35056 1399 -12554 -32570 -1871
201 -1871 -854 -23266 1116 13423 5452 25800 10384 -7667 33834 32313 2559 25660 20913
214 20913 -3435 12997 5963 -3039 17027 -6212 -30941 -4527 -3804 -24456 -10745 -10293 -25736
227b5736J3256J117o934K6516m260k6406K6504J0313j6030K0644k536j5466K0188
240B1170r727j1111K7558r704k4859J1194O6r187J0136n661j5146R779l726j6220
254b5438K1035O713k2860J0303K919j0839K4298k16j7023K0300j332j5983K0673
267A2550M964j2106P651m809q898J4025k29j4603R430j483j9353J0462Q337j5016
281i078N529n74j5172J4694M364j5519J2771K739j4876J1201N237m973J1257l087
295D513j1217J1800N462q357P447K547j1932N026L879q344P514J85j4844N590
309g31K309r319Q386j22j2045N939q51o197J1474O75j0714O633L929n448P769
324A687L532o276N828N34o573J0750L458j1158M629J585q348O030J685q688K779
$$ plain form
227 -25736 -12480 -11363 -18297 8219 3959 -22447 4057 14370 -1660 18984 16448 982 21170
240 21170 11443 332 27890 18186 -6673 4521 4587 -4600 5536 -125 -15271 -5492 -9218 -25438
254 -25438 -4403 2310 -20550 -10247 -7328 -18167 6131 5915 -11108 9192 7860 -8123 12550
267 12550 17514 5408 13059 8250 -648 13377 13148 -1455 7975 6492 -12861 -2399 5938 -9078
281 -9078 -3549 -4123 -19295 -4601 -237 -15756 -2985 -246 -15122 -3921 1316 -3657 7600 4513
295 4513 -6704 5096 10558 2201 9648 12195 263 5289 9168 824 8338 8523 -6321 -731
309 -731 1578 -7741 645 523 -11522 -5583 -6434 -12631 -1157 -482 -11196 -4563 -634 -6082 1687
324 1687 5219 -1057 4771 5305 -1268 9482 12940 1782 6411 7996 -352 5678 7363 -1325 1454
339A454j298r004O234L209q815J773J403o264M827M541m672M603J912o820O106
354h11O318l572L919J270n540L997K982l455K641O0o654L66J741l753J688n27
370F70o460J345J360o006M141K647o058K084K092j503N263R14l812M480K337k946
386E48M126K938l797J071J337l406L043J202o062O23L86n836K728K533n861r5
402d522J081l962K236L025l034J181K430k693K161L776j307J637J896l238J542
417B209M087k517o34K286k996n91J839k278p7l85l234p1J612j635n90P20j610
434c865o38K282l55Q2J675j687j68K694O31M33Q59p59K11K8Q31J254M2m91k112
453I47Q21K90m16J199k279j749R18j785L19J201j830m99q17l00J659j32j04L77
$$ plain form
339 1454 156 -8848 -2614 595 -8220 -6447 -5044 -11308 -6481 -1940 -6612 -2009 -97 -6917 -811
354 -811 5507 1935 5854 7124 1584 5581 8563 5108 7749 7809 1155 1521 3262 -491 1197 670
370 670 -5790 -4445 -3085 -9091 -4950 -2303 -8361 -6277 -4185 -5688 -425 489 -3323 1157 3494 548
386 548 4674 7612 3815 4886 6223 2817 5860 7062 1000 1623 2009 -3827 -1099 1434 -4427 -4522
402 -4522 -3441 -7403 -5167 -2142 -5176 -3995 -1565 -4258 -2097 1679 372 2009 3905 667 2209
417 2209 6296 3779 3145 5431 2435 1844 3683 1405 1328 943 -2291 -2362 -750 -2385 -2975 -2255 -3865
434 -3865 -4503 -2221 -2576 -2494 -819 -2506 -2674 20 651 1084 1943 1184 1395 1423 2254 3508 3550 3059 947
453 947 1768 2058 1642 2841 562 -1187 -269 -2054 -1735 -534 -2364 -2863 -3680 -3980 -2321 -2453 -2557 -2180
471b180Q62K91K4K607O72j509J239R41R3J589l1j808N47l48r98j76l48j606j772
490a911j000k30J57L38j691p75J453r63L92L805m60j172K256O75J137J588N1N24
508D174m65K84l61j95Q84j721j505l53j997M17j06k368O37j031j097J760N7N23
526b463r17K94J717Q27J360J80o8J413q07L89J612Q7p5j688j309J559l54j271
544D86k61l19j404q24N29N89k36l86m89Q1J0K41J674J67j040M45Q76N63M46k36
564I12m5P63J47o41L01M39k72R6q83n07R28j08j280p40P11n41m96L34m85r1r8
585a556r25J061J37k35M43l14J179p01O66J886j024M93N51j019J690k01m03R70
603B698j042p06j056P26R52k473L33M19k443O51m07k45J362r92N9M29M78R16l84
$$ plain form
471 -2180 -1318 -1027 -1003 1604 2276 767 2006 2947 3040 4629 4598 2790 3337 2989 1991 1815 1467 -139 -1911
490 -1911 -2911 -3141 -2984 -2646 -4337 -5112 -3659 -4622 -4230 -425 -885 -2057 199 874 2011 3599 3650 4174
508 4174 3709 3993 3632 3437 4321 2600 1095 742 -1255 -838 -944 -3312 -2675 -3706 -4803 -3043 -2986 -2463
526 -2463 -3380 -3086 -1369 -542 818 998 930 2343 1536 1925 3537 3624 3549 1861 552 2111 1757 486
544 486 225 -94 -1498 -2322 -1793 -1204 -1440 -1826 -2315 -2234 -2224 -1983 -309 -142 -1182 -737 139 702 1148 912
564 912 867 1630 1777 1136 1437 1876 1604 1700 817 310 1238 1130 -150 -890 -179 -720 -1216 -882 -1367 -1458 -1556
585 -1556 -2481 -1420 -1283 -1518 -1075 -1389 -210 -911 -245 1641 617 1110 1661 642 2332 2131 1728 2698
603 2698 1656 950 -106 620 1572 -901 -568 -149 -2592 -1941 -2348 -2593 -1231 -2223 -2164 -1735 -1257 -341 -725
622g25R15Q03q33J716k61l6J538r00o93J269r41m54L17r56j119l49J80l18j111
641a958k62m17k30R81k21k5Q61l43J02R10P19J349J02o23L03L12R93p4k93J011
661C197j997n18Q52j197J98J6j789K8m12m60J329r89k32j65oR60l71J142J13k38
681e39J289m06L62J163r75J57R79l99M43k38n21l64n40m32M01N9q49m34j84q85
701a913N76O41j160J77L45r33J202J109n72M50K25q24R71J313n03L78J128j979
719F31O20J167j438j2P57j577j9Q96j772l91J079k038l21J573q99m26J015q51
737b006j43J738j81k72J472n69n46K485j6j082J324o87q00J133n02oN47j401j375
756h87O61j51l19K97j238j046J193K39n50O62k68m77J292k9J54J346j61n89J257
$$ plain form
622 -725 190 993 160 1876 1615 1579 3117 2217 1524 2793 1852 1398 1715 759 -360 -709 -529 -847 -1958
641 -1958 -2220 -2637 -2867 -1886 -2107 -2132 -1271 -1614 -1512 -602 117 1466 1568 945 1248 1560 2553 2479 2186 3197
661 3197 1200 682 1534 337 535 551 -1238 -1210 -1622 -2082 -753 -1742 -1974 -2139 -2145 -1185 -1556 -414 -301 -539
681 -539 750 344 706 1869 894 1051 2030 1631 2074 1836 1315 951 411 -21 380 439 -410 -844 -1028 -1913
701 -1913 -1337 -696 -1856 -1679 -1334 -2267 -1065 44 -528 -78 147 -677 294 1607 1104 1482 2610 631
719 631 1251 2418 980 968 1725 148 129 1025 -747 -1138 -59 -2097 -2418 -845 -1744 -2170 -1155 -2006
737 -2006 -2149 -411 -592 -864 608 39 -507 1978 1962 880 2204 1517 717 1850 1348 1342 1889 488 -887
756 -887 -226 -377 -696 -399 -1637 -2683 -1490 -1251 -1801 -1139 -1407 -1884 -592 -621 -467 879 718 129 1386
775A386k20O26Q32r19j143Q11p7o2N89j257j501Q85p06n31J334r78j084N5m65
794b425L00J934o04p53Q18j98J0K237o9j157Q81j5l15J089K71q79M56l15j623
813c57J575j3j174j89n02o88J187j09q84R6n32l30J312K65m08K85l71k17J166
832A12M78N35L61p29p45J341J57K02O01j607p97N88j53J05O58j565r53Q64j150
851a697N25J124j012j038J169l10l28J484l31m12O50k13L64J886m44j001J196
868A612o48o98J859n46j300N19m87m33J544p64j383M52j096m11J321L07j303O68
886g87n77J19J074J33m71R17n03k68J297j24l36J169q73p16J207m22P4K00q88
905B25n01J222j040m54P42p95p12L98J24m40J029o94r07J513l3m79J337m88j107
$$ plain form
775 1386 1166 1792 2624 1705 562 1373 1296 1234 1823 566 -935 -50 -756 -1287 47 -931 -2015 -1960 -2425
794 -2425 -2125 -191 -795 -1548 -730 -928 -918 1319 1250 93 974 959 644 1733 2004 1125 1581 1266 -357
813 -357 1218 1205 31 -158 -660 -1348 -161 -270 -1154 -1058 -1590 -1920 -608 -343 -751 -466 -837 -1054 112
832 112 590 1125 1486 757 12 1353 1510 1712 2313 706 -91 497 344 449 1107 -458 -1411 -547 -1697
851 -1697 -1172 -48 -1060 -2098 -929 -1239 -1567 -83 -414 -826 -176 -389 -25 1861 1417 416 1612
868 1612 964 266 2125 1579 279 798 311 -122 1422 658 -725 -273 -1369 -1780 -459 -152 -1455 -787
886 -787 -1364 -1245 -171 -38 -509 408 -95 -363 934 810 474 1643 770 54 1261 839 913 1113 225
905 225 -276 946 -94 -548 194 -601 -1313 -915 -791 -1231 -202 -896 -1803 -290 -323 -802 535 47 -1060
924a060J909n6n09J248o80q17R32j30k95M83o5j118M91j9j066O93j20q67L03K06
944e37o24N15O9p63O34N55m94O71j57R2J49M47K80M2l6n0r9J5J00J70k4p78j12
967F5m50J60O97n86p21J98n53M18P8jK25q5K1j12P58R3J26J15J82k26M60j54r2
990F16K62p21o5P85o89j01j38k80j98K29J38m27K47k71p24Q84L03l59L58j69q0
1011d00M75K8J56N83l88k01k45M41K08k29K17m27j21k07N40k7n2p61J8L3j26P15
1033B30m43J36K14o13J57L94m66K01N84q45O17N83q44j2L07j77k20L88N34j143
1053d18O06k37n12Q96l90o42R72n70p1J51k0N25m74J70j27j40J032j088M16N12
1073E91j226O37O90p47N61k07m94O25l73o07Q15j78n17N33j66Kj32L01m20K9L53
$$ plain form
924 -1060 849 793 284 1532 852 35 967 837 542 1025 960 -158 333 314 -752 -59 -179 -1046 -743 -537
944 -537 -1161 -646 -577 -1340 -706 -151 -645 26 -131 -39 110 557 837 879 843 793 694 709 809 979 955 177 65
967 65 -385 -225 472 -114 -835 -637 -1190 -772 -694 -695 -470 -555 -534 -646 112 205 331 446 628 402 862 708 616
990 616 878 157 92 877 188 87 -51 -331 -529 -300 -162 -589 -342 -613 -1337 -453 -150 -509 -151 -320 -400
1011 -400 75 103 259 842 454 253 8 449 657 428 645 218 97 -110 430 403 351 -410 -392 -359 -485 230
1033 230 -213 -77 137 -476 -319 75 -391 -190 394 -451 166 749 -95 -107 200 23 -197 191 725 -418
1053 -418 188 -49 -561 335 -55 -697 275 -295 -366 -215 -235 290 -184 -14 -141 -281 751 -337 79 591
1073 591 -635 2 692 -55 506 299 -195 430 57 -550 265 87 -430 103 -63 -61 -193 108 -312 -283 70
1094G0o55n4Q11m25J60L65l93L82j7m16M47J42n80N32o6l90J48M9l24j54L75l34
1116c27N7N11j084L47Q70p44J98P09j364J179j56o32J122J68n45o5J95k87JR50
1136A103r91k93Q33j219J58J009r99m29J043j257M72N36m59J01L71j18l47P41
1154B55n31K02N77l08l48R70p40J10O44l82j72N54o26k24N62j188P81L00r25L76
1174a13L71j110K74O30r58N70N72j104K50J318j251K53J665j524N2J562j683M53
1192B27J031j465K53R63j030J83Q38j381j73J529j357j68R43j603N9J818j559
1209h92q6J383j309K18J422j210l4J535j326l69K090j044n47K033j403p51J741
1226A451j485l54K036k062k13J668j593o4J505j945j95J829j500j85J748j449
$$ plain form
1094 70 -585 -639 172 -253 -93 272 -121 261 244 -172 275 417 -163 369 303 -87 61 110 -214 -368 7 -327
1116 -327 -270 241 -843 -496 374 -370 -172 537 -827 352 196 -436 686 854 309 244 439 152 153 1103
1136 1103 112 -181 652 -567 -409 600 -399 -828 215 -1042 -570 -34 -493 -392 -21 -139 -486 255
1154 255 -276 -74 503 195 -153 817 77 187 831 449 277 831 205 -19 543 -645 136 436 -489 -113
1174 -113 258 -852 -578 52 -906 -336 236 -868 -618 700 -551 -298 1367 -157 -105 1457 -226 227
1192 227 1258 -207 46 1009 -21 162 1000 -381 -554 975 -382 -550 393 -1210 -1151 667 -892
1209 -892 -978 405 -904 -686 736 -474 -508 1027 -299 -668 1422 378 -169 1864 461 -290 1451
1226 1451 -34 -388 1648 -414 -627 1041 -552 -616 889 -1056 -1251 578 -922 -1107 641 -808
1242h08n54K411j612l84K523j888l03K262j770k21K526k061q06K486j733o18K666
1259B116k033j051K334k159n74K895k018j495K851j836j263L173j610r29K899
1274A300j705j010L155j736q49K595j440j229K976j707q65K577j516j615K515
1289A446j267j113K360j721j471L285j747j268K443j909j005K743j449j382L398
1304A343j551j605L107j397j194L368j683j445K843j154j247L020j793j624K975
1319A963j889j627L530k039j757L239k180j537L623j574k309L732j592j895L478
1334A166j132k196L878j537j784L801j434k148L476j123k238L859j862k106L626
1349B246j831k488L660j208k109L082j533k395L771j458k210L455j411j999L723
$$ plain form
1242 -808 -1362 1049 -563 -947 1576 -312 -615 1647 -123 -344 2182 121 -685 1801 68 -550 2116
1259 2116 83 -968 1366 -793 -1367 1528 -490 -1985 866 -970 -2233 940 -670 -1599 1300
1274 1300 -405 -1415 1740 4 -845 1750 310 -919 2057 350 -515 2062 546 -1069 1446
1289 1446 179 -934 1426 -295 -1766 1519 -228 -1496 947 -962 -1967 776 -673 -2055 1343
1304 1343 -208 -1813 1294 -103 -1297 2071 388 -1057 1786 632 -615 2405 612 -1012 1963
1319 1963 74 -1553 1977 -62 -1819 1420 -760 -2297 1326 -248 -2557 1175 -417 -2312 1166
1334 1166 34 -2162 1716 179 -1605 2196 762 -1386 2090 967 -1271 2588 726 -1380 2246
1349 2246 415 -2073 1587 379 -1730 1352 -181 -2576 1195 -263 -2473 982 -429 -2428 1295
1364A295j445k030L868j172k470M054j423k284L951j615k230L849j248k902L875
1379B073j440k531L866j483k670L513j474k573M089j398k884M264j385l017M376
1394A326j034k891M402j452l111M785r72k814M173j344l195M306j132l162M254
1409B139p79l672M000q73l275M210j165l587M263o58l589L907o69l475M465n04
1425G38l598M483o37l582M339p06k891M135p91l386L754k93l649M238n04l869
1441b219L889n24l994M197o50l713M319j073l302M183o50l679M472n40m060M412
1457A068J28m172M367Nl779M438j90m331M328l80l991M327r2m199L930K27m448
1474b764L753J39l857L647K07m199L607K47l751L566M11l942L572N13l827L986
$$ plain form
1364 1295 -150 -2180 1688 516 -1954 2100 677 -1607 2344 729 -1501 2348 1100 -1802 2073
1379 2073 633 -1898 1968 485 -2185 1328 -146 -2719 1370 -28 -2912 1352 -33 -3050 1326
1394 1326 292 -2599 1803 351 -2760 2025 1053 -1761 2412 1068 -2127 2179 1047 -2115 2139
1409 2139 1360 -2312 1688 815 -2460 1750 585 -3002 1261 603 -2986 921 252 -3223 1242 738
1425 738 -2860 1623 986 -2596 1743 1037 -1854 2281 1490 -1896 1858 1565 -2084 2154 1650 -2219
1441 -2219 1670 1146 -2848 1349 699 -3014 1305 232 -3070 1113 463 -3216 1256 716 -3344 1068
1457 1068 1196 -2976 1391 1396 -2383 2055 1865 -2466 1862 1482 -2509 1818 1726 -2473 1457 1684 -2764
1474 -2764 989 1128 -2729 918 1125 -3074 533 780 -2971 595 1006 -2936 636 1149 -2678 1308
1490A308M76m150L824K34l797L759J19l763L647K96m112L615l9l694L031N45m032
1507b733L453P60m613L590M95m224L856O60m204L800N18m147L940M32m082L839
1523A340K89l647L252Q76m193L140J096m392L226O70m004L241Q50m549L407M11
1539A013m138L641R01m324L362O76l641L112R32l701K991Q23l863L113J086l710
1555a727K850J042m210K851J152l955K677J124m012L007N98l738K701Q47l693
1570b486K805O37l735K973J265l998K784J540m046K522J521l904L192Q92l950
1585a988K821J225m088K676J280l772K520J448m054J976J656l924K143J984m251
1600b348K130J797m136K476J516l612J992J859m037K362J732l476J851J936l554
$$ plain form
1490 1308 1784 -2366 1458 1692 -2105 1654 1773 -1990 1657 1953 -2159 1456 1417 -2277 754 1299 -2733
1507 -2733 720 1480 -3133 457 952 -3272 584 1244 -2960 840 1358 -2789 1151 1583 -2499 1340
1523 1340 1629 -2018 1234 2110 -2083 1057 2153 -2239 987 1657 -2347 894 1744 -2805 602 1013
1539 1013 -3125 516 1417 -2907 455 1131 -2510 602 1534 -2167 824 1647 -2216 897 1983 -1727
1555 -1727 1123 2165 -2045 806 1958 -1997 680 1804 -2208 799 1397 -2341 360 1207 -2486
1570 -2486 319 956 -2779 194 1459 -2539 245 1785 -2261 261 1782 -2122 1070 1962 -1988
1585 -1988 833 2058 -2030 646 1926 -1846 674 2122 -1932 44 1700 -2224 -81 1903 -2348
1600 -2348 -218 1579 -2557 -81 1435 -2177 -185 1674 -2363 -1 1731 -1745 106 2042 -1512
1615a512J728J836l547J798J810l888J852J836l691J804J711l433J761J611l590
1630a914J668J727l393J241K288l465J309J905l253J706J934l432J735K001l635
1645a578J583K128l461J579J633l156J388J572l169J566J599k813R71J579k923
1660a502J055J841k934J181J948l428J202J840k871J429J563k760J325J374k408
1675a145Q07J849k398O60J759k227N63J848k794J005J447k734J017J728k476M78
1691f13J921k521O30J676k405Q80J920k432N80J717k223M03J816k103O77J702
1707A625k382Q33J581k532P95J641k494Q84J660k460N47J217j999O07J730k220
1723i67P12J237k131O09J644j862M20J256k044P37J511j999R56J207k090O56J287
$$ plain form
1615 -1512 216 2052 -1495 303 2113 -1775 77 1913 -1778 26 1737 -1696 65 1676 -1914
1630 -1914 -246 1481 -1912 -671 1617 -1848 -539 1366 -1887 -181 1753 -1679 56 2057 -1578
1645 -1578 5 2133 -1328 251 1884 -1272 116 1688 -1481 85 1684 -1129 -158 1421 -1502
1660 -1502 -447 1394 -1540 -359 1589 -1839 -637 1203 -1668 -239 1324 -1436 -111 1263 -1145
1675 -1145 -338 1511 -887 -227 1532 -695 -132 1716 -1078 -73 1374 -1360 -343 1385 -1091 -613
1691 -613 1308 -1213 -583 1093 -1312 -432 1488 -944 -364 1353 -870 -467 1349 -754 -77 1625
1707 1625 -757 76 1657 -875 -80 1561 -933 -49 1611 -849 -302 915 -1084 -477 1253 -967
1723 -967 -255 982 -1149 -540 1104 -758 -338 918 -1126 -389 1122 -877 79 1286 -804 -148 1139
1740A139j518K18J361j788J08J600j995M30J527j987L42J314j772M83J423j585
1756g00J74J080j087J73J206j299M3J093j006K87J158j413O8J430j577K52J071
1773I53j411K41Q96j220K94P10q71J6R55j006PJ301j210j14J390j545K39J293
1791I18j339m6J256r42l24J186r13k21J147o21n79J150p73k47J088j120o7P58
1809C11o74j70R30p03l88J116m71l5N54o25k87Q03n21r5O83o26O7O65o74J6Q99
1830G75p76k19L38j65P7K28n57J79M04n26R2N84o77MO00k87m99P54l70j81Q15
1851E93o95J1L63q16r3R63o09L18M48m34o16Q18m43j07Q36p46j80L16Lj26M22
1872B26j92l36N74n27J87K82n1j37M12o00K22L33n87L31p9k25j86L56P4n39N68
$$ plain form
1740 1139 -379 -161 1200 -588 -480 1120 -875 -445 1082 -905 -563 751 -1021 -538 885 -700
1756 -700 -526 554 -533 -360 846 -453 -410 683 -323 -36 1122 -291 -223 1207 -370 -118 953
1773 953 -458 -217 679 -541 -247 463 -408 -392 563 -443 -436 865 -345 -459 931 -614 -375 918
1791 918 -421 -467 789 -153 -477 709 -204 -425 722 101 -478 672 -101 -348 740 -380 -447 311
1809 311 -363 -533 397 -306 -694 422 -49 -84 470 -155 -442 361 -160 -255 428 -198 -131 534 -140 -124 775
1830 775 -1 -220 118 -47 30 258 -299 -120 284 -242 -150 434 -243 -239 361 74 -425 329 -41 -222 593
1851 593 -102 -91 272 -544 -637 326 -283 35 483 49 -567 251 -192 -299 537 -209 -389 -73 -70 -196 226
1872 226 34 -302 272 -255 -68 214 163 26 438 -162 60 393 -194 137 58 -167 -353 3 77 -462 106
1893A06k38k18L03j25j36K60J54n0k26R9nJ78m27K94K89n27K63K45l69l5L41m03
1915b27K22J15k84J03J38j16l85K79K19j36L06n51J57M0J71k5K40k79l38N07r9
1936E7M7j6k3J48R4P4j79k12L35m15K12j03Pm57L98o7J27l9k03M8k25J79J54j8
1960g7R3K2j63M9KM01j91n3K3l23M78k29k2K03l00K62ql85K76Q7k89K23l14J6
1984b19nJ90q3J43r6r9R7k42M61p7M7J79j46J20n1k41L55l13J47j06j6J54k09
2007a0J3K37l38Q0l1L5k14K43k50R5K06j49pj03K60k14K95K7k31M26j88l72M00
2030B10J91m19L33Nn3k02K51k29J56K3o16MK98n3q4J82l32Q1L57k15Q3l0k7l9
2054a25K35J64k06K62j17j92L02o6p9L5J9k83K82k97O8L47j18l62ok12M11k02
$$ plain form
1893 106 -132 -350 -47 -172 -308 -48 106 56 -170 -71 -76 102 -325 -31 258 -269 -6 239 -130 -165 176 -227
1915 -227 -5 110 -174 -71 67 -49 -434 -155 64 -72 234 -317 -160 -120 51 26 266 -13 -351 156 57
1936 57 104 88 65 213 307 381 202 -10 325 -90 122 19 26 -431 -33 -100 27 -12 -215 -167 -392 -213 -59 -77
1960 -77 16 38 -125 -76 -74 327 136 83 106 -217 261 32 10 213 -87 175 167 -218 58 145 -144 79 -235 -219
1984 -219 -224 -34 -117 26 -70 -169 -72 -314 147 70 117 296 150 270 219 -22 333 20 167 61 45 199 -10
2007 -10 3 240 -98 -18 -49 -14 -228 15 -235 -140 66 -83 -90 -193 67 -147 148 175 -56 370 182 -190 210
2030 210 401 -18 315 320 267 65 316 87 243 266 -350 -346 -48 -101 -185 -3 -335 -254 103 -112 -29 -59 -86 -125
2054 -125 110 274 68 330 213 21 323 257 178 213 232 -51 231 -66 2 349 231 -131 -137 -349 62 -140
2076a40J11L6K0k41k97N46l45M02k14p2J36J22j0j19J25M1k51J56M47l10P9l95
2098a73J42J41Q1m05J36P5J18p6j50o8J13k30j7L46k48J84M0j79J7M15q0k40l9
2121i7L18k28K13j11n5L4M8o3j19L08n97N36K1n13L14j66Q8J9j33J08j00L2o2
2144b05K2K48l49L94m8j45J84J33j08L07l35K84l25J88j24j6K9k7O6m17l8K37
2166d5m95K56L37k31l17M16k88K30M3j00j09L99r8k69K96J24k11K91J78l48J63
2187B22J1m82M43J19j65q1J45n63J82L74p79L56J63r2J45J55n76L08K96l33P5
2208g7L91m19J51L70l7j83j38p0lM61o30K86J61m94M1N00m22j67M72l70j65K51
2230i1k19J44M42o63K47K81m40N78j86k94L87J13m14J72pk83L19l0k57L09J47
$$ plain form
2076 -140 -29 7 27 -214 -511 35 -310 92 -122 -194 -58 64 54 -65 60 101 -150 6 453 143 222 -173
2098 -173 -31 110 191 -214 -78 -3 115 39 -111 -179 -66 -296 -313 33 -215 -31 9 -170 -153 262 182 -58 -97
2121 -97 221 -7 206 95 40 74 122 59 -60 248 -349 187 208 -305 9 -157 -69 -50 -183 -75 -175 -143 -205
2144 -205 -183 65 -284 110 62 -83 101 234 126 433 98 382 57 245 121 105 134 107 173 -244 -282 -45
2166 -45 -540 -284 53 -178 -495 -79 -367 -137 -94 -194 -303 96 -2 -271 25 149 -62 229 407 59 222
2187 222 233 -249 194 313 148 67 212 -351 -169 205 -574 -218 -55 -147 -2 153 -423 -115 181 -152 -77
2208 -77 314 -105 46 416 379 196 58 -12 -15 446 -184 102 263 -231 -190 310 -112 -279 193 -177 -342 -91
2230 -91 -310 -166 276 -387 -140 141 -299 279 93 -201 186 299 -115 57 50 -233 86 56 -201 108 255
2251B55k94p9L94n50L82M8l77k3L12k73pM41m45J70R1j82p3L39k03J26J18l21
2273a51K80j42k30N1M44m48L90Q1m28J05M26k90m6M3k89K29L00m39J5Rk85k6M81
2296H0m15J62L43l89J15K83k9l83N87m37M4J86m41K67J76M4k48R5j71L25j4k97
2318a17Q4J05j18j85O5L8m9K75k48m1L75j95k29K88l4j81N33n26J03K19rl89J01
2341a35J61k18K22J08p1k6J50q8J50o06o2K27L05k95K65k89N8K5J01m8K63j99
2363bj55L33k59q4J29J89k17K19j18K2j61p1K5K69Nm30Q9K26k17L85l08K12j03
2386b2J79l80K00K88j72P2l92K38J37j33j31K41m22J21L38j75J62p3j02o9J41
2407D6J70m40L0n8j7J40M98m42O4j91l33P05l26LO1M3p6n6l9q0L59k86J67L26
$$ plain form
2251 255 -39 -118 276 -274 108 156 -221 -244 68 -205 -212 229 -216 -46 45 -137 -210 129 -74 52 170 -151
2273 -151 129 -13 -243 -192 252 -196 194 275 -153 -48 378 88 42 85 -204 25 325 -114 -99 -90 -375 -401 80
2296 80 -335 -173 170 -219 -104 179 150 -233 354 -83 -39 147 -294 -27 149 193 -55 40 -131 194 180 -117
2318 -117 -33 72 -46 -231 -166 -128 -177 98 -150 -191 184 -11 -240 48 14 -167 366 -160 -57 162 153 -236 -135
2341 -135 26 -192 30 138 67 41 191 103 253 -353 -415 -188 117 -178 87 -202 -144 -119 -18 -66 197 -2
2363 -2 -157 176 -83 -167 -38 151 -66 153 35 57 -104 -175 -150 119 124 -306 -217 9 -208 177 -131 81 -22
2386 -22 157 -223 -23 265 93 165 -227 11 148 15 -116 125 -297 -176 162 -13 149 76 -26 -95 46
2407 46 216 -224 -194 -252 -269 -129 369 -73 -9 -200 -533 172 -154 -151 -90 -47 -123 -179 -218 -298 61 -225 -58 268
2431B68k47j52N6J79n33K31J42O5n6K65l41L28l29o6L5J61J37j54J55j85J33j61
2453f9j04J61J7mj41J86m0K2k76J81Q3R4j54J36N8rj77P2k05K7O8L9N0Kj91m1
2479b15K55j04Q1k91J30M34l58K07k14N9O6l4j31K45m8%NM9k44J00L21m10M6j6
2503f7J34j6k10L62j30K5n8j6j22L92l01J22j33l16M92O8l73j36K07J53k11j3
2525a47J98p0j9O4j80mJ66j89J18QK78k93K99k02l8J63m8m7O6j60J39j40j85j6
2549b39J41q7K71j13k04L41KP1m7k93K59j03q8J52N2j51J42J69l93M1L5J56j24
2572a0K78m65K90Q3p6n9k1kp9J61j00Q2j28l98N99m04J44L88j74r3l6jM0j84L80
2597B15k63J78j47K36l71k3K47j3j63k06N98n21L47l8j61Q5J4K20l17K73l90J67
$$ plain form
2431 268 21 -131 -75 104 -429 -198 -56 9 -47 218 -123 205 -124 -190 -155 6 143 -11 144 -41 92 -69
2453 -69 -173 -12 5 1 -140 46 6 28 -248 -67 16 110 -44 92 150 141 -36 36 -169 -142 -74 -35 15 17 -174 -215
2479 -215 40 -64 17 -274 -144 290 -68 139 -75 -16 50 16 -115 130 82 82 87 136 -108 -8 313 -97 -51 -67
2503 -67 67 51 -159 203 73 98 40 24 -98 294 -7 115 -18 -334 158 226 -147 -283 -76 77 -134 -147
2525 -147 51 -19 -38 26 -154 -158 8 -181 -63 -55 223 -70 229 27 -11 152 104 57 123 -37 102 -38 -223 -239
2549 -239 -98 -185 86 -27 -231 110 112 183 136 -157 102 -1 -89 63 115 -36 106 275 -118 -77 -42 114 -10
2572 -10 268 -197 93 176 100 41 20 18 -61 100 0 82 -46 -444 155 -249 -105 283 109 16 -20 -21 19 -165 215
2597 215 -48 130 -17 219 -152 -175 72 59 -104 -310 288 -233 114 76 -85 0 14 234 -83 190 -200 -33
2619c3J4N3K8P5j64k18M53j89R5J01j10j69K13l26K39J08r5k2k18J73j53K70J7
2642A42j74P9j47r2j4j01K92j24n6q2M65k90o9L61k81J63K74j57k21O5Lq6k2L46
2666B74j75m33L63q1P6J7P0m7k46J55J51j62j23M20k41k41J75M16m80j8J20j3
2688b3K10Q8k10J33l11K4J97Ln5l00K04n5J13Q1l46L05J19n94N42q9k03M21k13
2711D1MR7J31l13K32J79l75K57k45o4Q3J10k42K47j38k82J02J88j42L75k07k45
2733b07OM3j16L26M80o45o7K70p7L25k39j80K33k00l25M23K69l48R8K18m6j38
2755A03K10n34m8K81l20M91J43o13K61K61l77M04J02m67J4K64k71J33J65m99O56
2776C59J26o97J93K18l98M0M30n30K07L01l05J23N41j012M64j99k06L20R2m7p2
$$ plain form
2619 -33 -19 34 62 137 -27 -245 208 19 114 215 105 -64 149 -177 62 170 75 53 -165 8 -145 125 142
2642 142 -32 47 -100 -192 -206 -307 -15 -139 -195 -277 188 -102 -171 190 -91 72 346 189 -32 33 36 -50 -72 274
2666 274 99 -334 29 -52 24 41 111 64 -182 -27 124 -38 -161 259 18 -223 -48 368 -112 -130 -10 -23
2688 -23 187 275 65 198 -113 -89 108 111 56 -244 -40 -95 18 99 -247 58 177 -417 125 36 -167 254 41
2711 41 45 142 273 -40 192 371 -4 253 8 -56 27 137 -105 142 4 -278 -176 12 -130 245 38 -207
2733 -207 -201 -158 -274 52 532 -113 -180 90 13 338 99 -81 152 -48 -373 50 319 -29 69 287 241 103
2755 103 313 -221 -269 12 -308 183 326 -287 -26 235 -142 262 364 -103 -89 175 -96 37 202 -297 359
2776 359 485 -212 -19 199 -199 -159 271 -259 -52 249 -56 67 608 -404 60 -139 -345 -25 67 20 -52
2797e2J28l04J53K17m03K51K71m32J27L80n83j3M40l12J16M84q17L81J52l19L10
2818A75R8o86M47K06m80k7N57o56J48O01r12L55M91n21J64J17m27O22J6m16N5
2839g3K20l71M58J23o38K94L85o04J65K65n01J00N14q28L09L68o08J02O14q82
2859e88P19K52o94K00M61n06P5L12n10K18N05o28K91M62p37K08L40n11K3L97n67
2880b78K34K58o70L57K80k75K31J86r20N29L00o09K30M83m95J1N28n74N8K60p2
2901E2k11P32p84K33M58r94O10L79p36L84K03o40J36N09o21J29K50l77J71N73
2921D56o30P7K81m36O3M02q05M08Q05r55K99M09k36k32M33q07N53L18o09j40O87
2942C41m87J31M78p95J11P90o33j17M82n97J52K57m03J0L69k60j15N57o23L75
$$ plain form
2797 -52 76 -228 -75 142 -261 -10 261 -171 -44 336 -247 -260 180 -132 -16 468 -349 32 184 -135 175
2818 175 273 -413 34 240 -240 -267 290 -366 -218 383 -529 -174 317 -204 -40 77 -350 272 288 -128 -73
2839 -73 147 -224 234 357 -281 13 398 -206 -41 224 -277 -177 337 -491 -182 186 -422 -320 294 -588
2859 -588 131 383 -311 -111 350 -156 -81 231 -279 -61 444 -184 107 569 -168 40 380 -131 -108 289 -278
2880 -278 -44 214 -456 -99 181 -94 137 323 -597 -68 232 -377 -147 336 -159 -148 380 -194 -136 124 52
2901 52 -159 573 -211 22 480 -514 96 475 -261 123 326 -314 -178 331 -290 -161 89 -288 -117 456
2921 456 -174 -97 184 -252 -189 213 -592 -184 621 -334 -35 374 138 -94 339 -468 85 403 -206 -346 341
2942 341 -146 -15 463 -332 -221 569 -64 -181 301 -296 -144 113 -290 -280 89 -171 -286 271 -352 23
2962B3L27m10j41O24n89oN58o15J2Q04p81J9P70q49K15N66q61n4N84k80j25N03
2984B94m08j62M58m98L4O08l35j10O34m48m23R60o94l6N75q02M85l3j84N4O41
3005F10p72q4N34m82L6M67n57RN47l25k09L77m75j92R93o23oN75l40m24P67p61
3027c35K17N58o53j95P74n09J71M91o88l68P74m65k13P82m93k09P86o52r5N44
3047B22m16Q1K66j63k88M39k78J0P09m62q9O2J23m38M40k07m49R11m23j01K15
3068A64l5l32L87l04j41N33m46k89P72m28Q2M31n18o6M24j26m29O59k81l32N00
3089B25l59R5L91n43j78Q49n59k46K50l08J07K83k9l74M42m8n9L58j95j95K99
3110B06k45k52N47k87o7M85l92k34L12P7l29J52J23n41Q73l52l14N75j34m65L76
$$ plain form
2962 23 350 -60 -201 423 -166 -172 386 -229 -217 587 -194 -175 595 -254 -39 527 -334 -388 196 -84 -209 294
2984 294 -114 -276 182 -316 -282 326 -9 -119 515 67 -356 604 -90 -126 449 -353 132 99 -85 -31 610
3005 610 -162 -246 288 -194 -158 309 -248 -239 308 -17 -226 151 -324 -516 477 -146 -152 423 83 -341 426 -335
3027 -335 -118 440 -213 -408 366 -143 28 519 -169 -537 237 -228 -441 341 -152 -361 425 -227 -322 222
3047 222 -194 -113 153 -10 -298 141 -137 -127 582 120 31 93 216 -222 218 11 -438 473 50 -51 164
3068 164 129 -203 184 -120 -261 272 -174 -463 309 -119 -37 394 -124 -190 234 108 -321 338 57 -275 225
3089 225 -134 -39 352 -191 -369 480 -79 -325 -75 -383 -276 7 -22 -396 46 -2 -61 297 102 -93 206
3110 206 -39 -291 256 -31 -98 387 -5 -239 73 150 -179 -27 96 -445 428 76 -238 337 203 -262 114
3131A14n2k92L71L2j44J86ql92M67n15N9O44n35K7K82j52l84K94Jk87K67K5j16
3154a08J36L8m76Q42m35k74M09j66l11L63J24l42J98P8k62K02J31n26M63j49k3
3175h8K22J23m92J70R5j26L04j80k34M32j60k27K63J41l22M44k47l73L26j79o7
3196a75K84m65K01k5K47m35M32J33k63L9P7k74L13J23n99M76n5j56K9J29k46K88
3218G8R9k36J91J01l02J98l1l83M32j88l07M84J15k11j54J81n09O35k27p2K03
3239I7k16M1K7J00n11M96j55O6J01O5k72L2K78o68M99N4k69M75k50O6m0J11m49
3262c22K14J94k33K36K9k0%R8n8k37L06l60J84L7r7Q8l6k27L23K15o36M39p9j44
3286h6J0K53j55J91l8l30K29j8k57J97K38l75J14j08j4J38Q0k69J56n8j29L39
$$ plain form
3131 114 62 -230 141 173 29 215 207 -185 282 -233 -174 470 -65 -38 244 92 -292 2 3 -284 -17 8 -108
3154 -108 28 66 -410 432 -3 -277 132 -34 -345 18 142 -200 -2 76 -186 16 147 -379 84 -65 -88
3175 -88 134 257 -235 -65 30 -96 208 28 -206 226 66 -161 102 243 -79 365 118 -255 71 -108 -175
3196 -175 109 -356 -155 -180 67 -368 64 197 -66 -27 50 -224 89 212 -387 89 34 -122 -93 36 -210 78
3218 78 177 -59 132 233 -69 129 98 -285 147 -41 -348 136 251 40 -114 67 -442 193 -34 -106 97
3239 97 -119 -78 -51 49 -462 34 -121 -55 46 111 -161 -129 149 -519 -20 34 -235 240 -10 56 16 127 -322
3262 -322 -108 86 -147 89 118 98 98 196 138 -99 207 -153 31 68 -29 59 23 -204 119 334 -302 137 58 -86
3286 -86 -76 177 22 213 175 -155 74 56 -201 -4 234 -141 -27 -135 -149 -11 69 -200 -44 -102 -231 108
3308A08k45n8L88j78J78l3o0j91J21K18k08K82p7m01K71K6k93J56J89j08q2J48
3330A51l76L12k63j54N81l00p1J34P7m08J28L36j40M7j2O1j65p3J99J02j51jM4
3353E8M6m1JM9l56K85L1j90J31j72oM2j9M22k12N6j66J38J55k47k5l6J18j25J94
3378A31j24j17O0R5j1K0o7L7j42K86k43P8n2LM9j00j99K93O3k47L44j06r5K98
3402B54q4R5m19K65j82K2J44j58J28l28K82k21L00O3jl8j75L6J78J19l81j8K84
3425A65m38J94m6M5k5K43Rj22J84j52j25P5m4q9K22j42J58j04K5P0j14k71L95
3448A13k27K3J25L9k48R3o2L17k4j33L8j11k40K12L33l00K18j31K23j40J72k41
3470D9R2j66r6M18p7j20k63L46j45r2N8K35l25%K74j59L4J35j96j44kL47l0l3
$$ plain form
3308 108 -137 -195 193 15 193 160 100 -91 30 248 40 322 245 -156 115 141 -152 4 193 85 3 151
3330 151 -225 87 -176 -330 251 -49 -120 14 91 -317 -189 147 7 54 42 103 -62 -135 64 166 15 14 58
3353 58 104 63 64 113 -243 42 73 -117 14 -158 -164 -122 -141 281 69 125 -41 97 252 5 -20 -56 62 -63 131
3378 131 7 -110 -50 45 34 54 -13 24 -118 168 -75 3 -49 -46 3 -97 -296 -3 60 -187 157 51 -44 254
3402 254 170 265 -154 111 -71 -49 95 -63 65 -263 19 -202 98 161 160 122 -53 -17 161 280 -101 -119 165
3425 165 -273 -79 -125 -80 -105 138 147 25 209 57 -68 7 -37 -126 96 -46 112 8 33 103 -11 -282 113
3448 113 -114 -91 34 73 -175 -82 -144 173 149 16 54 -57 -297 -85 248 -52 166 35 258 118 290 49
3470 49 141 -25 -121 297 220 100 -163 183 38 -54 4 239 -86 -86 188 29 63 198 2 -142 -144 203 173 140
3494A40l25L60j97N8J67l09J21Rl8J17j75J72R1J7k54j87M79j23j21j15Q7l0J3
3517d3l4j92l2K44J91k38k39L64j09M7J17L1J9OO9j91K33rl44j2K19L5p3l1Pk09
3543a74L50ok49j53K72q0J48j36j5O8k00K60k66L17p7k26K96j44J67J56k60J49
3565A97m10K93M6j46J92j69J34m0o7j94O2P5o0K59l35k4K14Q3j21J60j51j34j36
3588b72K96k7OL1k62K51j4l0j93O0M18k40j32m8J45j57P3K54j88K14k40j32K02
3611A5q5J18M8o2j18J09o1J46K8q1M0j58K31l38L07j97K6m8P2K3k7j89K93k36
3635a44K99j02L3l9Q9l16K33k08L7J97K05j11k75P7L2mJ49k54K93k24j32J60R0
3658H5k16OO3K26k02J21Nk09M15k52j5jJ9Rj39J34j45J9J84l4O6l10R8K78l53
$$ plain form
3494 140 -185 175 -22 36 203 -106 15 24 -14 103 -72 100 191 208 -46 -233 246 123 2 -113 -26 -56 -43
3517 -43 -77 -269 -301 -57 134 -104 -343 21 -88 -41 76 107 126 132 201 10 243 234 -110 -122 97 132 59 28 35 -174
3543 -174 176 170 -79 -232 40 -40 108 -28 -43 25 -175 85 -181 136 59 -167 129 -15 152 308 48 197
3565 197 -213 80 126 -20 172 3 137 97 30 -164 -102 -27 -87 172 -163 -187 27 110 -11 149 -2 -136 -272
3588 -272 24 -3 3 34 -228 23 9 -21 -214 -154 264 24 -108 -156 -11 -168 -95 159 -29 185 -55 -187 15
3611 15 -70 48 96 34 -84 25 -36 110 138 57 97 -61 170 -168 139 -58 -32 -80 -8 15 -12 -201 92 -144
3635 -144 155 53 86 47 136 -180 53 -155 -118 79 284 173 -102 -25 7 3 152 -102 191 -33 -165 -5 85
3658 85 -131 -125 -62 164 -38 83 88 -121 294 42 27 26 45 54 -85 49 -96 -77 107 73 139 -171 -73 205 -148
3683a48o3L95j9l34p2lL40J78m30J12K47l04J73K0k08L20m04J74j09j18K63J02
3705A12j76k18M75o8J18j68r5J51J9l74R4L7J65J66j09j82j02M03k06j92K80j6
3727A14M8l81L08M0j70K72l33M9j91K03j77L6M2K11q2o8L50k00l31L40j89k29
3749c38M44k15J57m4J36k03K03n8j08K87j81j95k09K83k52M25k3O9l92K61k61
3770b14K68k04K14J1k14L76j14j92l9K26j21R1J37k71j38K46k1pr0j10L3j43J23
3793a53K30j67J75j53j33K88L3M0K0k99J64k54K97m5p4O0J07l48K6r8M98j48k6
3816D0j71Q5J7J13j81K72l13K10m52M32l19J02L51o9R2l32K01l53K30L58q8k04
3838B1K27k11r4j00K76o6m1K16j49q3K58k23%q5j35K20j13L0m8m7M2J15M3r7K50
$$ plain form
3683 -148 -211 184 165 -169 -241 -244 96 274 -156 -44 203 -101 72 92 -116 204 -200 -26 -135 -253 10 112
3705 112 -64 -282 193 125 243 75 -20 131 150 -224 -130 -93 72 238 129 -53 -155 248 42 -150 130 114
3727 114 162 -219 89 129 -41 231 -102 -53 -244 -41 -218 -182 -140 71 -11 -79 271 71 -260 80 -109 -338
3749 -338 106 -109 48 4 140 -63 140 82 -26 261 80 -115 -324 -41 -293 132 109 178 -214 47 -214
3770 -214 54 -150 64 75 -139 237 123 -69 -108 118 -3 88 225 -46 -184 62 41 34 -56 -166 -133 -276 -153
3793 -153 77 -90 85 -68 -201 87 120 160 180 -119 45 -209 88 43 -31 29 136 -212 -186 -284 214 66 40
3816 40 -131 -46 -29 84 -97 175 -138 72 -380 52 -267 -165 186 117 209 -123 78 -275 -45 313 225 21
3838 21 248 37 -57 -157 119 53 12 228 79 -4 254 31 31 -54 -189 31 -82 -52 -100 -147 -105 10 53 -44 206
3863B06k79P0M7j04j14L76l59p2L44J3k10O2j31K52l78L24L9j37k25K78j69j0
3885a77M02j66J51l61O7J16k70J92N9j6J97j86R3Oj88Q0P2r6O6k06m1L20k70L60
3909B04j94L2q9R7j50K24J13m13J21n1K59o9j51n6K29m1k51M27l39R6J6N1k0j59
3933a14J16J42j66J00q8N7n7L0J88j8j71p3j31K28j95P8K13O4k07j59J80p0J85
3956A32r7mj68R3p5K62j95m5j8oJ75kN6k94K16J9j32K88n20L30K51j74k29J47
3980A0M8Lr6N6J89k88J30p3j47J90qk73Q0K26j23J21j44J24O4l04P3o3L49k46
4004a02J97K27m30k42L62J3r8M21l99j2J39p5J59p6k84L59l16J59R8k38J13N6
4026C1P6l48J66J20K15l66K07k48K45L3j32j49M0M03l50L2J24l05M64k37r1lq4
$$ plain form
3863 206 -73 -3 44 -60 -174 202 -157 -229 115 128 -82 -20 -151 101 -277 47 86 -51 -276 2 -167 -177
3885 -177 225 59 210 -151 -84 32 -238 -46 13 -3 194 8 101 107 -81 -1 71 -25 41 -165 -206 114 -156 204
3909 204 10 42 -47 50 -100 124 237 -176 -55 -106 153 84 -67 -123 106 65 -186 241 -98 -2 14 65 45 -114
3933 -114 2 144 -22 78 -10 47 -10 20 208 190 19 -54 -185 43 -152 -74 139 203 -4 -163 17 -53 132
3956 132 35 31 -137 -44 -119 143 -52 -97 -115 -121 54 52 108 -186 30 49 -83 205 -315 15 266 92 -137 10
3980 10 58 61 -35 21 210 -78 52 -21 -168 22 14 -259 -179 47 -76 45 -99 25 89 -215 -142 -205 144 -102
4004 -102 95 322 -108 -350 12 25 -73 348 -51 -63 76 1 160 84 -200 159 -157 2 100 -138 -25 31
4026 31 107 -241 -75 45 260 -106 101 -147 98 131 -1 -150 -110 293 -57 -25 99 -206 258 21 -70 -73 -157
4049a57L9L55k35mJ6n0j22M04j68R3l10O5K25J77k58n3J24j35j62K75K63k03l92
4072b13L07Rl70L20j02p6J09L8J88j01J81l91NK3j6j53M30k0l07K18k4j03K82
4095B34j52o3n0Oj32L92k96K81m62J53J8J37O7j97j01K04Q1L3j73J37k19K24j75
4118e3M6L5k12L74j24l9L1j55n5K50j34j36L48j27q7q9K74k43J85j44K02r5N7
4141A09n4p8j9n7Q1O6nr5k57L25j92J46k2O2K02k41j24J43P3O1j52J83k48K60
4165A67j51K1J11k54K23k76K94j79J86k42j32J78J38r3K8J21l92J57o5J11R1o1
4187a9j41P9K37jj15k33O20l54n0J3q4K04l30qK42l68L26j55j18p2J86J29L8J10
4211A36L03l83o7L3n0J52k72K71n5K03k17m1r3M12l74K38m59L41k28L55n5k00
$$ plain form
4049 -157 -118 237 2 -2 14 -36 -158 246 78 171 -139 -74 151 328 70 17 141 6 -156 119 382 179 -213
4072 -213 94 103 -267 53 -49 -125 -16 22 210 109 290 -101 -96 -73 -89 -242 188 168 -139 79 55 -48 234
4095 234 82 19 -31 -25 -157 235 -61 220 -242 -89 -71 66 133 -64 -165 39 120 153 -20 117 -102 122 -53
4118 -53 -7 28 -184 190 66 27 58 -97 -152 98 -36 -172 176 49 -38 -127 147 -96 89 -55 147 52 109
4141 109 55 -23 -42 -99 -18 48 43 -52 -309 16 -176 -30 -52 10 212 -29 -153 -10 63 124 -28 155 -93 167
4165 167 16 37 148 -106 117 -159 135 -44 142 -100 -232 -54 84 -9 19 140 -252 -95 -160 -49 42 -19
4187 -19 -160 -81 156 155 40 -193 427 73 23 36 -48 156 -174 -182 60 -308 18 -137 -255 -327 -141 -12 26 136
4211 136 439 56 -11 22 -28 124 -148 123 68 271 54 13 -80 332 -42 196 -263 78 -150 205 150 -50
4233e0J87l89K22J43Qj66PK59j9k69J87l18L67l01K28k6n2p1K65q7k82K43m1R
4257E4j08Q1j66l4J68N9m1j21p3K34n4k15K21J93k74n3N6K87j78j51J38R4L6j1
4281A42k90L06LR8k53M9J2l02L14m5k12J73k11K37jJ0j15O5o3J20M9j93R7J80
4305A70l9j81k02L32l64K73J5O2J07l3j10j20Q9O0l72L15j24j08J8K26P5M4j07
4328B6j32K45J1l49L93j78k58L04K34k15mn5j87M17j09j90P0k25J08J31J46m35
4350b52J03L63k75O6k86M36m34L77k12M19k29p7k6k14J87L8J74k66O7p2J69j27
4372g1L63l97J35J11j54J51l3k42K4K54k51L08j42oj2j03p5J29J26oj41Q1J90
4395B39k21K9Kj69pm0K77k8k64K89O8j1J12k0l36J36m4l72L34L4k41K84p5j2O0
$$ plain form
4233 -50 137 -252 -30 113 121 -45 -38 221 202 -67 120 -198 169 -132 96 70 18 -53 212 125 -157 86 45 54
4257 54 -54 27 -139 -173 -5 54 13 -108 -181 53 -1 -216 5 198 -76 -129 -73 214 36 -115 23 117 153 142
4281 142 -148 158 161 259 6 55 67 -235 79 34 -178 -5 -216 21 20 30 -85 -20 -83 37 86 -107 -10 170
4305 170 131 -50 -252 80 -284 -11 4 66 173 140 30 -90 -1 59 -313 2 -122 -230 -212 14 89 133 26
4328 26 -106 139 150 -199 194 16 -242 62 296 81 77 22 -165 252 143 -47 23 -202 -94 37 183 -252
4350 -252 -149 214 -61 5 -281 155 -279 98 -114 305 76 -1 -27 -241 -54 -16 158 -108 -41 -113 56 -71
4372 -71 292 -105 30 141 -13 138 105 -137 -113 141 -110 198 56 50 38 -65 -140 -11 115 109 -32 49 239
4395 239 18 47 49 -120 -127 -167 110 82 -182 107 175 164 276 256 -80 56 12 -360 -26 8 -233 51 -24 -36 24
4420B4J20r9k63J37N4J23j26PN7j32j4L42k02j99J70K78m69K20J05l39O5J42j3
4443a2J17jk5j15J58l60K13l0O7o1J23q5j05K49j48M4k46K15O9k17m3M40j96j01
4467e0M80k78l93K25R6j75pK7l4L05k63J63k77J05r6K41j79n0O4M95k73k46L48
4490B28l84J54J38k85O9J43j30J81k16J71K11l55k8j5N1k57L65J19k99L05j73
4511gLQ7j24K64m76L91l99M13j7k16O2K91l00J39q4K8Q2m6l05M04r1l45K47R5
4535I6k68J04P4Q8j14m8O7pM9k81J04N29p03J38J28K39l06J09j83QK42R9K4j51
4559C7Oq0J08j76Q9K8q3K30j33n0K9j67J97K34n5m26p6M98k17k18L20L9o2r6R2
4584F8rj09J76j21n1J04J33j11j29J18k77L77j55j92L6K39j24k88L75P1m39J3
$$ plain form
4420 24 144 45 -218 -81 -27 96 -30 -23 34 -98 -112 230 28 -171 -1 277 -192 28 133 -206 -141 1 -12
4443 -12 105 104 79 -36 122 -238 -25 -55 12 -49 74 -11 -116 133 -15 29 -217 -2 67 -150 -193 247 51 -50
4467 -50 430 152 -241 -16 80 -95 -102 -75 -109 196 -67 96 -181 -76 -172 69 -110 -160 -96 399 126 -120 228
4490 228 -156 -2 136 -149 -80 63 -67 114 -102 69 280 -75 -103 -118 -67 -324 41 160 -139 166 -7
4511 -7 -4 83 -41 223 -253 138 -261 152 135 -81 -19 272 -28 111 27 55 137 91 -214 190 99 -246 1 96
4535 96 -172 -68 6 94 -20 -68 -1 -8 41 -240 -136 393 -310 -172 -44 195 -111 -2 -185 -177 65 164 188 37
4559 37 43 -37 71 -105 -16 12 -71 159 26 -24 5 -162 35 269 214 -212 -288 210 -7 -225 95 134 72 -24 68
4584 68 59 -50 126 5 -46 58 191 80 -49 69 -208 169 14 -178 -142 97 -27 -315 60 131 -308 -295
4606b95J83L9L0j9J29J50k05j22K66J25n02K8l1L68j19j06o6qK99q9J69j08j21
4629ej40J73j65L48k13j95J08J10n6K33l4m08J71r7J39o3L85k97K2J97m71K56
4651bj04L66j30q7J82l52K51k8J57k81j29M76l24j27o8K85j97J83K2p1K04m5r5
4674H6l2l43L08j7J92k32n8J13l6k24J91M1q0P4mkJ95j97n8J96l78L97k78j79
4698c25M69k74O5J70J56j13k24Q6m9J36k69O8K90j93j71N8K62l07J57J02NO3k15
4721e3p9o9J62K4j14K21j73Q6j46j38K15l09L62J79l02K91m96J95J46o1J31j72
4743a00k4K55K6j85J20j28J51j95K05j40jJ1J5k81L07j3p6p6P9J42J7m5k64R5
4767a05j29K64j76J97p9k49K33Q2o1j38P9K66k65j23K77m5K23m8k3k50J4j03K11
$$ plain form
4606 -295 -112 -73 -43 -62 67 217 12 -110 156 281 -221 -193 -224 144 25 -81 -147 -155 144 55 224 116 -5
4629 -5 -145 28 -137 211 -2 -197 -89 21 -35 198 164 -244 -73 -170 -31 -94 291 -6 16 213 -258 -2
4651 -2 -106 260 130 43 225 -127 124 96 253 -28 -157 319 -5 -132 -200 85 -112 71 93 22 226 181 86
4674 86 54 -289 19 2 194 -38 -96 17 -19 -243 -52 -11 -91 -17 -21 -23 172 -25 -83 113 -265 132 -146 -325
4698 -325 144 -130 -65 105 261 148 -76 10 -39 97 -172 -104 186 -7 -178 -120 142 -165 -8 94 99 162 -53
4721 -53 -132 -201 -39 -15 -129 92 -81 5 -141 -279 -64 -373 -11 168 -134 157 -339 -144 2 -59 72 -100
4743 -100 -124 131 157 -28 92 -36 115 -80 125 -15 -16 -5 10 -271 36 23 -53 -129 -50 92 109 64 -200 -105
4767 -105 -234 30 -146 51 -28 -277 -44 38 -23 -161 -82 184 -81 -204 73 28 251 203 180 -70 -56 -159 52
4790E2K51p54M10K66k40K05k36O4J05K2k76J60N6kP4M5l41J25J21k81O7K11q9
4813A5k82L78k19J25p4r6K99l40J79j0k13L20k29k6L94l71K46ql94J56J41N0Q1
4836A22k5N8j72J47k65J34K78j40q9J95l47J30J53O3j47j01jj86L24j15j99K59
4858G6j37p4J21Rk71K43%r0J08j38L19l35J83no6m9Q8j26L60j12K5j80l1J88p6
4883C0K7k29J46J9J4j26L07n87L60J06J97n02L06j04k6Q5k02P4Q4J00j25j56M24
4906B22k73P4n0J4P9J2j80J41k01K18m55N37j80n2K45l12N8J5r7J38J32J22j03
4929A04K1k45K10j21m8J64P2k51j2K0n5J07K09j77l3j55J19o8nJ77l30N11l13
4952i9O4J11M1L8m88K15k31M15K9m47N40j16j34R1r6L26j94k24J67J32l1j68K89
$$ plain form
4790 52 303 -451 -41 225 -15 190 -46 18 123 145 -131 29 85 83 157 202 -139 -14 107 -174 -107 104 15
4813 15 -267 111 -108 17 -57 -153 146 -194 -15 -25 -238 82 -147 -173 221 -150 96 88 -306 -150 -9 41 122
4836 122 97 155 -17 130 -135 -1 277 137 48 243 -104 26 179 242 95 -6 -7 -193 131 16 -183 76
4858 76 -61 -135 -14 -5 -276 -33 -33 -123 -15 -153 166 -169 14 9 -57 -106 -18 -144 216 104 129 -51 -82 106 30
4883 30 57 -172 -26 -7 7 -119 188 -399 -39 67 264 -238 68 -36 -62 23 -179 -105 -21 79 -46 -202 222
4906 222 -51 23 -27 -13 66 78 -102 39 -162 56 -399 138 -42 -94 151 -161 -103 -88 -185 -47 85 207 104
4929 104 125 -120 90 -31 -79 85 157 -94 -106 -86 -141 -34 175 -2 -35 -190 -71 -139 -144 33 -297 214 -99
4952 -99 -35 76 117 155 -333 -118 -349 66 95 -352 188 72 -62 29 -67 259 65 -159 8 140 109 -59 230
4975B30k20k78K57No3N6M9K5k3p6P9q3K13j50l6r2J12J05j63p5O7L0N5J88J9k79
5001d8K87j10r8N3k34J93J87k50J31p2j53K27r7l33K14L6R8p6j63K82k36N5N33
5024D26l98O1k66K26j19Q7j81P5J50m0n2J07k4J59k64j95L31Q2Q7n99M11l8j87
5047a61M2J51j57J11P5p0J1j24Q3J7J79j76m7K14j98k0k3K30k15J28N6k21N9M8
5071hl5J0l5lL21j53j90l4P4j40L93l33n1K26J2k34M75k11J0r0J1n1k72L22o8
5096e4J59l2N2j76j40O3K23j95J37j52J61J0m9O6N3j1l29J76N7j8M6k52K50l48
5120c03L97j51J35p1k3m9j60J66J13K24j01j53R0N8q0l8K82l4j82k68N2J71j86
5143a11L33k56L2K24j63j85J85N6K13n4l59R1J88k77n3n3K94l8K7j8j72P4K7J99
$$ plain form
4975 230 10 -268 -11 -6 -69 -13 36 61 38 -38 41 -42 171 21 -15 -107 5 110 -53 -128 -61 -31 24 212 231 -48
5001 -48 239 129 31 84 -150 43 230 -20 111 39 -114 113 16 -317 -103 -67 31 -45 -208 74 -162 -107 426
5024 426 28 89 -177 49 -70 17 -164 -89 61 21 -31 76 52 211 -53 -248 83 165 252 -347 64 26 -161
5047 -161 -119 32 -125 -14 61 -9 2 -122 -39 -22 157 -19 -66 148 -50 -70 -93 137 -78 50 106 -115 -56 -8
5071 -8 -43 -33 -68 -71 250 97 -93 -127 -53 -193 200 -133 -184 42 54 -180 295 84 94 4 15 -36 -308 14 -54
5096 -54 105 73 125 -51 -191 -128 95 -100 37 -115 46 56 7 73 126 115 -214 -38 19 1 47 -205 45 -303
5120 -303 94 -57 78 7 -16 -65 -225 -59 54 278 177 24 114 172 92 54 336 302 120 -148 -96 75 -111
5143 -111 222 -34 -2 222 59 -126 59 115 328 274 -85 6 194 -83 -136 -189 105 67 94 76 -96 -22 5 204
5167B04j13q8r8J3K67J20l78J90l07P9L1J34J52r7j16J50k99K13r7K76n46M56
5189A46j18j51L49j12k88J51j4J74%k59N9J57o5p9K09q9r6J9m1j5J25q8q8L32
5213B18j47j74R2M20l45j52J04j41J83M5l22K48O1j00Jj53J9J98q9j32n3K62L3
5236G6o4M7J46l34N7lK8J65k56J9L57k82J58j40Kp3K08m44L09j11K95k57N07l14
5260I6J66j62j00J41j19m8j96K83j18j90L37j16Q4q8K6J47j19k10L08J2k4r5o2
5283d7r4J05R8m7k21J30J17o5J48k97J40j7n6J11j62K69j56k00L15k53L48O3o8
5306A61m04L17j51J64J2k43J54J66j95J43l66J83M05m27P4M2p3R6p8J99p0l35
5328b26J77j75JN0k6J89J46l04K42J31l58J67j48N14l18m1L60j45j35%rr5P8J7
$$ plain form
5167 204 91 3 -95 -82 185 305 -73 117 -190 -111 -80 54 206 109 -7 143 -156 57 -40 236 -310 146
5189 146 28 -123 226 114 -174 -23 -37 137 137 -122 -63 94 29 -50 159 70 -26 -7 -48 -63 62 -26 -114 218
5213 218 71 -103 -11 409 64 -88 16 -125 58 103 -219 29 90 -10 -9 -162 -143 55 -34 -166 -219 43 76
5236 76 12 59 205 -129 -72 -75 -47 118 -138 -119 238 -44 114 -26 -24 -97 111 -333 -24 -135 160 -97 410 96
5260 96 262 100 0 141 22 -26 -222 61 -57 -247 90 -26 58 -30 -4 143 24 -186 122 134 110 15 -47
5283 -47 -141 -36 62 15 -206 -76 41 -24 124 -173 -33 -50 -106 5 -157 112 -44 -244 71 -182 166 229 161
5306 161 -243 74 -77 87 99 -144 10 176 -19 124 -242 -59 346 -81 -7 35 -38 58 -20 179 109 -226
5328 -226 -49 -224 -223 -173 -199 -10 136 -168 74 205 -153 14 -134 380 62 21 381 236 101 101 92 -3 75 92
5352I2j4o5O6k07J52M0l2J20k39O3L4o8k38M42l8k21K25R1j49P5J74k80l6n3J82
5377A16O6j37l4K4Q3k01K1o1n3J14q0J3K47k0q4j82L78l22J07k50L81J16l00n4
5401a12k2Q6J49Nlr5j70O0P4P5J69L1k35q5J01j29J43k70J25J57Q6j11L8r1J23
5426I9q8k32k2J24j0J2K37J1j49J05j23M8K45m11K63o4k04J29M2J36N2O9l50K29
5450A48k5l04L35k86J47K34l23p9J18j7K41l50K34r8K35r3K9r3%q0k3Q0j65K08
5474G3n4J7j03K3m76N91L0q8J3j16O4l7m5L02k79j73L10j23O4n3K07k5k43%Q1
5499d0k36M57p9m4k27J91p1Q8Q0j85j31K85j8o9K87l40J73k18J64r2K66q0k09
5522d8J21j32o1Q3r3K00qj13M3m6Q5K6q6J21l05K64r5k15K57P6k94J70M1J9k36
$$ plain form
5352 92 78 13 79 -128 24 64 32 152 -87 -24 10 -58 -296 146 108 -113 112 203 54 129 303 23 -13 -66 116
5377 116 182 45 11 35 118 -83 -62 -123 -176 -62 -142 -129 118 98 14 -168 210 -112 -5 -255 126 242 -58 -112
5401 -112 -134 -48 101 106 103 8 -162 -102 -28 47 216 247 12 -73 28 -101 42 -228 -103 54 140 29 67 -24 99
5426 99 11 -221 -243 -119 -129 -117 120 131 -18 87 -36 12 257 -154 109 45 -159 -30 12 148 200 269 -81 148
5450 148 123 -181 154 -132 15 249 -74 -153 -35 -52 189 -161 73 -25 210 117 146 53 53 -27 -50 30 -135 73
5474 73 19 36 -67 -44 -520 71 101 13 26 -90 -26 -63 -108 194 -85 -258 52 -71 -7 -60 147 122 -121 -121 -40
5499 -40 -276 181 102 58 -169 22 -49 39 119 -66 -197 88 70 1 288 -52 121 -97 67 -25 241 161 -48
5522 -48 73 -59 -120 -37 -130 70 62 -51 -8 -54 31 57 -29 92 -213 51 -44 -259 -2 74 -220 -50 -9 10 -226
5547b26R9J79j28K9J43K0k56L82r4m1j32K87l32K69k68l4J35J7R9rm00K25j0K00
5571A54j22m5q6N3L4RJ3n0J91k40j05L78j59l09P1KJ76K83k52J26M4k03k31K08
5595f0o9K99j23L7k46P9M7j72K41J6J08J82k58k6j23J2R1K46j04j47J79k61J31
5618G9Q2M2j44J01k94K02n2J0M8m3l0l52J29K99j58J67k41j88M66l7k01J78kp
5642E4J12q8j00K57j98K0r3k5J21N6j93J73l17j1PP0J03M7p3P3j94L8K73k92J41
5667c9J1J54j36j67J39j33J72m0J69k6m8R1N1k69K3K15j73oJ38j79J40O0m6k92
5691a91J42j24N3K12O3l9k33Q3L10j74l47K05K99l01n0P9j94K82L8l42K53J10
5713A34k59L45k7j38J12k65N9K10k9j77M3j02J80q7R2j57P4L2k2J28l89L79o9
$$ plain form
5547 -226 -127 52 -76 -47 96 116 -140 242 148 107 -25 262 -70 199 -69 -103 32 49 148 139 -261 -36 -46 154
5571 154 32 -13 -99 -46 -12 -3 10 -40 151 -89 -194 184 25 -284 -213 -211 -35 248 -4 122 166 -37 -268 -60
5595 -60 -129 170 47 84 -162 -83 -36 -208 33 49 157 339 81 55 -68 -56 35 281 177 30 209 -52 79
5618 79 161 203 59 160 -134 68 16 26 74 31 1 -351 -222 77 -81 86 -155 -343 123 86 -115 63 61 54
5642 54 166 78 -22 235 37 57 -36 -61 60 116 -77 96 -221 -232 -225 -155 -52 -5 -78 -5 -199 -161 112 -180 -39
5667 -39 -28 126 -10 -177 -38 -171 1 -39 130 104 56 147 198 -71 -48 167 -6 -12 126 -53 87 147 101 -191
5691 -191 -49 -173 -120 92 155 116 -117 -34 276 102 -245 -40 259 -42 -92 -13 -207 75 113 -229 24 134
5713 134 -125 220 193 55 167 -98 -39 171 142 -35 8 -94 86 -1 91 -66 8 40 18 146 -243 136 67
5736F7j11O7l38L76P7l3R2o3k4K5r6J58l64K7K04l1J49k92J37J53k39j81J9K99
5760G8p6J48j87o2J56R9j67l2J4j14J62o2J92J73m45l9M1P1K20k49O5N3L5R9j48
5785B5j77N49k87K9j36o6J38r0p4J63k4l06Q4L80j65lJ33M1m12O8J14LJ12m11
5809c12M51P8o6l95L79j19j00J08N0j69K34n24N53r1k96K19o2J38l31K92J9r8
5831d2POK7k0n9k1K66j28j89J17L8l1k12K87K66k58L70o64K07M6j41K15N4j55
5855a4J12j55k61M55k05j30J35L0K74j12j92J12o6K83n38M15K19l57j0K77k41
5876C1J80l05l2l3Rj8J22J62m58J20J97l30N10r8R6n5J09j73R5j2j11Q4l08J93
5900b5J31j04k61M14j16O0R8j73j68L42m33M5M47k47P0j55J16L8M8l74M24k36
$$ plain form
5736 67 -44 23 -315 61 138 105 197 134 110 135 39 197 -167 -140 64 33 182 -110 27 180 -59 -240 -221 78
5760 78 2 150 -37 -99 57 156 -11 -43 -29 -143 19 -43 149 322 -123 -162 -121 -50 170 -79 -14 39 74 173 25
5785 25 -152 397 110 139 3 -63 75 -15 -89 74 50 -256 -172 208 43 40 173 214 -198 -130 -16 -13 99 -312
5809 -312 139 217 151 -244 135 16 -84 24 74 -95 139 -385 168 77 -219 0 -62 76 -255 37 56 -42
5831 -42 -35 -29 -2 -22 -81 -102 164 36 -153 -36 2 -29 -241 46 312 54 424 -240 -33 13 -128 87 141 -14
5855 -14 98 -57 -318 137 -68 -198 -63 -33 241 129 -63 49 -17 266 -272 143 362 5 -5 272 31
5876 31 211 -94 -126 -159 -150 -168 -46 116 -342 -222 -25 -355 155 57 153 98 207 34 129 117 6 90 -218 -25
5900 -25 106 2 -259 155 39 99 197 24 -144 198 -235 -190 257 10 80 -75 41 79 127 -247 177 -59
5922e9J1P1J57Kk63J16M6j79J5J81k09R2K75k76K29K9l44m3j02L77n0n6j52O2
5946g0L32m31p5L11k41J66Q1l50L76L85k72k11N2k47J97J26k72Q3N6K7j88j16
$$ plain form
5922 -59 -48 23 180 182 -81 35 81 -98 -83 98 -111 -19 256 -20 209 238 -106 -149 -251 126 76 20 -132 -70
5946 -70 262 -169 -244 67 -174 -8 73 -277 99 484 212 1 53 -194 3 129 -143 -60 -4 23 -165 -281
$$ [...]
8191B29
##END NTUPLES=NMR FID
##END=
