##TITLE=1H_LR-0155-CBZ-C2-Et2O
 DMSO-d6
 8 sc, 
 11.4.2023
##JCAMPDX= 6.0         $$ Bruker NMR JCAMP-DX V2.0
##DATA TYPE= NMR FID
##DATA CLASS= NTUPLES
##ORIGIN= UXNMR, Bruker Analytische Messtechnik GmbH
##OWNER= root
$$ XWIN-NMR		Version 3.5
$$ Tue Apr 11 16:32:25 2023 Russian Standard Time (UT+4h)  she@DPX200
##.OBSERVE FREQUENCY= 200.13135
##.OBSERVE NUCLEUS= ^1H
##.DELAY= (6, 6)
##.ACQUISITION MODE= SIMULTANEOUS
##.ACQUISITION SCHEME= undefined
##.AVERAGES= 8
##.DIGITISER RES= 18
##SPECTROMETER/DATA SYSTEM= spect
##.PULSE SEQUENCE= zg30
##.SOLVENT NAME= D2O
##.SHIFT REFERENCE= (INTERNAL, D2O, 0, 15.7039)
##AUDIT TRAIL= $$ (NUMBER, WHEN, WHO, WHERE, WHAT)
$$ ##TITLE= Audit trail, XWIN-NMR		Version 3.5
$$ ##JCAMPDX= 5.01
$$ ##ORIGIN= Bruker BioSpin GmbH
$$ ##OWNER= she
$$ F:/spectra/data/she/nmr/H-F/1/audita.txt
$$ ##AUDIT TRAIL=  $$ (NUMBER, WHEN, WHO, WHERE, WHAT)
(   1,<2023-04-11 16:31:15.10 +0400>,<she>,<DPX200>,
      <created by zg, POWCHK disabled, PULCHK disabled
       configuration hash MD5:
       00 E9 B6 7A A2 85 ED C7 34 08 36 98 17 FE 4E 26
       data hash MD5: 16K
       E5 72 1F 72 06 FB 74 CE 0B 96 FC 89 A3 F7 D2 20>)
$$ ##END=
$$ 
$$ hash MD5
$$ 65 7D 5C 66 64 42 5E 5E 32 6D 96 4C F6 A5 DA DC
##$RELAX= 
##$RELAX= 
##$RELAX= 
##$RELAX= 
##$RELAX= 
##$RELAX= 
$$ Bruker specific parameters
$$ --------------------------
##$DU= <F:/spectra>
##$EXPNO= 1
##$NAME= <H-F>
##$PROCNO= 1
##$TYPE= <nmr>
##$USER= <she>
##$AMP= (0..31)
100 100 100 100 100 100 100 100 100 100 100 100 100 100 100 100 100 100 
100 100 100 100 100 100 100 100 100 100 100 100 100 100 
##$AQSEQ= 0
##$AQ_mod= 1
##$AUNM= <au_zg>
##$AUTOPOS= <>
##$BF1= 200.13
##$BF2= 200.13
##$BF3= 200.13
##$BF4= 200.13
##$BF5= 200.13
##$BF6= 200.13
##$BF7= 200.13
##$BF8= 200.13
##$BYTORDA= 1
##$CFDGTYP= 0
##$CFRGTYP= 5
##$CHEMSTR= <none>
##$CNST= (0..31)
1 1 145 1 1 1 1 1 1 1 1 1 1 1 1 1 1 1 1 1 1 1 1 1 1 1 1 1 1 1 1 1 
##$CPDPRG= <>
##$CPDPRG1= <>
##$CPDPRG2= <>
##$CPDPRG3= <>
##$CPDPRG4= <mlev>
##$CPDPRG5= <mlev>
##$CPDPRG6= <mlev>
##$CPDPRG7= <mlev>
##$CPDPRG8= <mlev>
##$CPDPRGB= <>
##$CPDPRGT= <>
##$D= (0..31)
0 1.2 0 0 0 0 0 0 0 0.06 0 0.03 0 0 0 0 0.0002 0 0 0 0 0 0 0 0 0 0 0 0 
0 0 0 
##$DATE= 1681216274
##$DBL= (0..7)
120 120 120 120 120 120 120 120 
##$DBP= (0..7)
150 150 150 150 150 150 150 150 
##$DBP07= 0
##$DBPNAM0= <>
##$DBPNAM1= <>
##$DBPNAM2= <>
##$DBPNAM3= <>
##$DBPNAM4= <>
##$DBPNAM5= <>
##$DBPNAM6= <>
##$DBPNAM7= <>
##$DBPOAL= (0..7)
0.5 0.5 0.5 0.5 0.5 0.5 0.5 0.5 
##$DBPOFFS= (0..7)
0 0 0 0 0 0 0 0 
##$DE= 6
##$DECBNUC= <off>
##$DECIM= 32
##$DECNUC= <off>
##$DECSTAT= 4
##$DIGMOD= 1
##$DIGTYP= 9
##$DL= (0..7)
0 120 120 120 120 120 120 120 
##$DP= (0..7)
150 150 150 150 150 150 150 150 
##$DP07= 0
##$DPNAME0= <>
##$DPNAME1= <>
##$DPNAME2= <>
##$DPNAME3= <>
##$DPNAME4= <>
##$DPNAME5= <>
##$DPNAME6= <>
##$DPNAME7= <>
##$DPOAL= (0..7)
0.5 0.5 0.5 0.5 0.5 0.5 0.5 0.5 
##$DPOFFS= (0..7)
0 0 0 0 0 0 0 0 
##$DQDMODE= 0
##$DR= 18
##$DS= 0
##$DSLIST= <SSSSSSSSSSSSSSS>
$$ [...]
##$SUBNAM2= <"">
##$SUBNAM3= <"">
##$SUBNAM4= <"">
##$SUBNAM5= <"">
##$SUBNAM6= <"">
##$SUBNAM7= <"">
##$SUBNAM8= <"">
##$SUBNAM9= <"">
##$SW= 18.05172834244
##$SWIBOX= (0..15)
0 0 2 0 0 0 0 0 0 0 0 0 0 0 0 0 
##$SW_h= 3612.71676300578
##$TD= 16384
##$TD0= 1
##$TE= 0
##$TE2= 300
##$TE3= 300
##$TEG= 300
##$TL= (0..7)
0 120 120 120 120 120 120 120 
##$TP= (0..7)
150 150 150 150 150 150 150 150 
##$TP07= 0
##$TPNAME0= <>
##$TPNAME1= <>
##$TPNAME2= <>
##$TPNAME3= <>
##$TPNAME4= <>
##$TPNAME5= <>
##$TPNAME6= <>
##$TPNAME7= <>
##$TPOAL= (0..7)
0.5 0.5 0.5 0.5 0.5 0.5 0.5 0.5 
##$TPOFFS= (0..7)
0 0 0 0 0 0 0 0 
##$TUNHIN= 0
##$TUNHOUT= 0
##$TUNXOUT= 0
##$USERA1= <user>
##$USERA2= <user>
##$USERA3= <user>
##$USERA4= <user>
##$USERA5= <user>
##$V9= 5
##$VALIST= <valist>
##$VCLIST= <CCCCCCCCCCCCCCC>
##$VD= 0
##$VDLIST= <DDDDDDDDDDDDDDD>
##$VPLIST= <PPPPPPPPPPPPPPP>
##$VTLIST= <TTTTTTTTTTTTTTT>
##$WBST= 1024
##$WBSW= 4
##$XGAIN= (0..3)
0 0 0 0 
##$XL= 0
##$YL= 0
##$YMAX_a= 132777
##$YMIN_a= -189983
##$ZGOPTNS= <>
##$ZL1= 120
##$ZL2= 120
##$ZL3= 120
##$ZL4= 120
##$ABSF1= 10
##$ABSF2= 0
##$ABSG= 5
##$ABSL= 3
##$ALPHA= 0
##$AQORDER= 0
##$ASSFAC= 0
##$ASSFACI= 0
##$ASSFACX= 0
##$ASSWID= 0
##$AUNMP= <proc_1d>
##$AZFE= 0.1
##$AZFW= 0.1
##$BCFW= 1
##$BC_mod= 2
##$BYTORDP= 1
##$COROFFS= 0
##$CY= 11.3945322036743
##$DATMOD= 1
##$DC= 2
##$DFILT= <>
##$DTYPP= 0
##$F1P= 2.36226072786647
##$F2P= -0.459571619588291
##$FCOR= 0.5
##$FTSIZE= 0
##$FT_mod= 4
##$GAMMA= 1
##$GB= 0.15
##$INTBC= 1
##$INTSCL= 1
##$ISEN= 128
##$LB= 0.24
##$LEV0= 0
##$LPBIN= 0
##$MAXI= 10000
##$MC2= 0
##$MEAN= 0
##$ME_mod= 0
##$MI= 1.114404
##$NCOEF= 0
##$NC_proc= 0
##$NLEV= 6
##$NOISF1= 3.799351
##$NOISF2= 2.8
##$NSP= 1
##$NTH_PI= 0
##$NZP= 0
##$OFFSET= 15.70392
##$PC= 1
##$PHC0= -19468.09
##$PHC1= 1.400804
##$PH_mod= 1
##$PKNL= yes
##$PPARMOD= 0
##$PSCAL= 0
##$PSIGN= 0
##$REVERSE= no
##$SF= 200.130013532006
##$SI= 16384
##$SIGF1= 3
##$SIGF2= 2
##$SINO= 400
##$SIOLD= 16384
##$SREGLST= <1H.CDCl3>
##$SSB= 0
##$STSI= 0
##$STSR= 0
##$SW_p= 3612.71676300578
##$SYMM= 0
##$S_DEV= 0
##$TDeff= 0
##$TDoff= 0
##$TI= <>
##$TILT= no
##$TM1= 0
##$TM2= 0
##$TOPLEV= 0
##$USERP1= <user>
##$USERP2= <user>
##$USERP3= <user>
##$USERP4= <user>
##$USERP5= <user>
##$WDW= 1
##$XDIM= 8192
##$YMAX_p= 0
##$YMIN_p= 0
$$ End of Bruker specific parameters
$$ ---------------------------------
##NTUPLES= NMR FID
##VAR_NAME=  TIME,          FID/REAL,        FID/IMAG
##SYMBOL=    X,             R,               I
##VAR_TYPE=  INDEPENDENT,   DEPENDENT,       DEPENDENT
##VAR_FORM=  AFFN,          ASDF,            ASDF
##VAR_DIM=   8192,          8192,            8192
##UNITS=     SECONDS,       ARBITRARY UNITS, ARBITRARY UNITS
##FACTOR=    0.0002768,     1,               1
##FIRST=     0,             0,               0
##LAST=      2.2672688,     0,               0
##MIN=       0,             -189983,         0
##MAX=       2.2672688,     132777,          0
$$ Real data points
##PAGE= N=1
##DATA TABLE= (X++(R..R)), XYDATA
$$ [...]
$$ plain form
1745 55 -10 210 -28 -60 -3 -32 101 65 -60 -199 -39 94 16 106 -104 63 64 101 -29 -316 -29 6 0 179 -179
1770 -179 -12 -97 -231 -13 -51 310 96 -168 159 -102 20 61 -176 21 -45 43 -71 154 108 -27 143 45
1792 45 102 -106 -206 -56 177 -7 -36 -37 84 4 -109 -94 233 208 -18 131 -196 -1 181 119 -33 -7 -91 -83
1816 -83 -108 159 118 -123 -22 2 48 27 -64 39 -194 85 -222 111 211 49 64 -178 88 122 95 -46 -94 -36
1840 -36 18 26 8 -107 48 49 -85 5 -80 178 -180 75 -75 37 31 -54 129 141 74 96 7 -92 15 100 95 -62 -69
1867 -69 -32 -177 -54 -2 -228 2 160 -112 80 28 115 103 -226 -90 -100 -64 98 -46 -90 -194 44 260 -17
1890 -17 29 63 122 131 -193 71 -53 33 -229 40 105 -16 168 -60 71 43 12 137 -115 47 -16 3 -94 -321
1914 -321 -87 -106 122 144 28 -35 222 -191 19 -65 27 67 -69 136 -200 -186 76 -177 98 134 -31 -110 -109 1
$$ packed form
1745E5o5K20k38l2N7k9J33l6j25j39J60J33p8R0k10J67JL7j30k87K87L5oJ79l58
1770a79J67q5j34K18l8L61k14k64L27k61J22M1k37J97o6Q8j14K25m6j35J70r8
1792D5N7k08j00J50K33j84k9jJ21q0j13J5L27k5k26J49l27J95J82o2j52K6q4Q
1816h3k5K67m1k41J01K4M6k1r1J03k33K79l07L33J00j62J5k42K66L4k7j41m8N8
1840c6N4Qj8j15J55Jj34R0q5K58l58K55j50J12oq5J83J2o7K2q9r9J07Q5nj57p
1867f9L7j45J23N2k26K30J58k72J92n2Q7j2l29J36j0L6J62j44m4j04K38K16k77
1890a7M6L4N9Rl24K64j24Q6k62K69O5j21J84k28J31k8l1J25k52J62o3J9r7k27
1914c21K34j9K28K2j16o3K57m13K10q4R2M0j36K05l36J4K62k53K75L6j65p9JJ10
$$ plain form
1938 1 -145 42 -318 -98 -217 -7 -73 -327 -74 -29 52 255 5 46 -26 -71 167 124 130 -56 71 -91 -48 -35
1962 -35 -8 62 -255 157 231 -9 -268 20 244 -212 -79 -105 -177 -75 -91 -43 23 15 -1 -106 -220 -253 197 169 59
1987 59 186 132 120 -78 21 -79 84 -9 196 27 -22 68 -123 29 -141 -67 -144 277 -17 -125 54 -164 -89
2010 -89 200 197 38 -140 22 -61 206 151 -75 -120 -290 -45 252 -143 275 -209 45 -128 -267 38 -147 117
2032 117 -100 -191 -39 207 122 -76 -122 77 112 -22 -152 -156 -17 -174 -26 -92 -98 -36 5 -233 13 -106 145 -5
2056 -5 -114 50 53 113 -62 -9 36 -13 29 -74 -418 89 18 120 127 -82 65 241 -38 23 -113 -362 70 90 83
2081 83 -7 60 112 146 94 -44 -114 121 -65 -322 -185 -36 97 32 80 -38 112 54 -137 95 75 -55 22 -9
2105 -9 119 92 -8 -93 -183 35 109 -74 159 70 8 -81 43 -14 29 373 -4 262 -46 -96 -53 -126 63 -236 122
$$ packed form
1938Aj46J87l60K20j19K10o6k54K53M5Q1K03k50M1p2m5K38m3Oj86J27j62M3J3
1962c5K7P0l17M12P4k40k59K88K24m56J33k6p2J02j6M8O6qj6j05j14l3M50k8j10
1987E9J27n4j2j98R9j00J63r3K05j69m9R0j91J52j70P4p7M21k94j08J79k18P5
2010h9K89lj59j78J62q3K67n5k26m5j70K45K97l95M18m84K54j73j39L05j85K64
2032A17k17r1J52K46q5j98m6J99L5j34j30mJ39j57J48o6oO2M1k38K46j19K51j50
2056ej09J64LO0j75N3M5m9M2j03l44N07p1J02Pk09J47J76k79O1j36k49M32K0p
2081H3r0O7N2L4n2j38p0K35j86k57J37J49J33o5M8j18J50n8j91K32k0j30P7l1
2105iJ28k7j00q5r0K18P4j83K33q9o2q9J24n7M3L44l77K66l08n0M3p3J89k99L58
$$ plain form
2130 122 90 146 65 58 -141 88 -93 -224 41 -183 -15 140 81 40 -348 8 -156 -250 54 -47 -202 69 109
2153 109 0 -187 -209 133 239 213 -232 44 -12 -86 -186 2 -155 98 121 -18 59 49 99 -73 -234 -48 -192
2176 -192 58 280 -15 -145 119 30 -94 -110 -122 88 -3 152 195 124 -97 -40 -14 -38 -78 -8 -54 181 89 4 -15
2201 -15 146 -172 -48 -42 -85 -25 -120 -96 -199 -200 -78 -120 82 112 -158 -157 167 -115 -155 226 -52 105 9 -228 -89
2226 -89 72 -68 -81 157 117 -25 93 -32 61 8 -201 -2 179 -193 -19 -100 -109 -160 -251 -43 -96 -146 228 103
2250 103 111 -209 25 86 -108 -108 95 -69 113 201 -116 -171 -133 -106 -85 74 -36 72 -23 -31 -23 -191 -161 -70 139 -58
2276 -58 70 -128 -43 36 -2 -115 87 -98 30 246 63 -96 -218 -4 -55 154 332 291 213 160 61 -219 65
2299 65 210 -167 9 -297 -221 53 149 363 -70 -30 -58 -6 -92 -52 230 120 -42 -125 37 -54 42 -224 -128 -3
$$ packed form
2130A22l2N6q1pj99K29j81j31K65k24J68J55n9m1l88L56j64r4L04j01j55K71M0
2153A09j09j87k2L42J06k6m45K76n6p4j00J88j57K53K3j39P7j0N0j72j61J86j44
2176a92K50K22k95j30K64q9j24j6j2K10r1J55M3p1k21N7K6k4m0P0m6K35r2q5j9
2201a5J61l18J24Om3O0r5K4j03jJ22m2K02L0k70JL24k82m0L81k78J57r6k37J39
2226h9J61j40j3K38m0j42J18j25R3n3k09J99J81l72J74q1rn1r1K08n3n0L74j25
2250A03Ql20K34O1j94%K03j64J82Q8l17n5L8K7K1J59j10J08r5qQj68L0R1K09j97
2276e8J28j98Q5P9l8j13K02j85J28K16j83j59j22K14n1K09J78m1p8n3r9k80K84
2299F5J45l77J76l06P6K74R6K14m33M0k8N2q6M0K82j10j62q3J62r1R6k66R6J25
$$ plain form
2323 -3 -199 -125 113 10 335 88 4 77 127 61 -217 -249 48 6 300 74 -33 177 42 -75 14 14 -10 188
2347 188 74 13 -246 121 -64 231 253 -12 -248 -34 -8 64 158 214 -48 -83 150 5 35 83 -63 43 83
2370 83 121 -42 -63 196 149 15 -5 -155 -41 -84 62 12 -30 -11 -98 -197 15 -172 -69 -11 137 25 45 74 -154
2395 -154 -91 128 -5 -187 -106 234 -83 -195 -169 -97 -31 -155 -285 -26 -39 153 50 66 -157 -266 125 101 -38
2418 -38 17 13 -70 5 -112 -52 -136 -127 154 22 -15 -11 4 115 -73 -29 234 -39 -102 137 189 -265 27 24 47 -11 165
2445 165 -38 -110 -65 -147 -24 -35 -166 -41 -47 49 -28 148 -12 43 254 17 363 -223 142 89 -31 -128 87 -158
2469 -158 50 -22 11 78 48 -3 108 -105 -105 -62 -156 -73 42 187 54 -151 -8 96 100 88 7 273 -143 -198 22
2494 22 188 17 -301 -214 -74 81 49 33 -191 -85 273 108 -53 100 -9 14 27 64 275 -137 71 -95
$$ packed form
2323cj96P4K38j03L25k47q4P3N0o6k78l2K97m2K94k26j07K10j35j17Q9%k4J98
2347A88j14o1k59L67j85K95K2k65k36K14K6P2R4N6k62l5K33j45L0M8j46J06M0
2370H3L8j63k1K59m7j34k0j50J14m3J46n0m2J9q7r9K12j87J03N8J48j12K0K9k28
2395a54O3K19j33j82Q1L40l17j12K6P2O6j24j30K59j3J92j03J6k23j09L91k4j39
2418c8N5mq3P5j17O0q4RK81j32l7MJ5J11j88M4K63k73o3K39N2m54K92lK3n8J76
2445A65k03p2M5q2J23j1j31J25oR6p7J76j60N5K11k37L46n86L65n3j20r7K15k45
2469a58K08p2L3O7l0n1J11k13%M3r4Q3J15J45j33k05J43J04Mj2q1K66m16n5K20
2494B2J66j71l18Q7J40J55l2j6k24J06L58j65j61J53j09K3J3L7K11m12K08j66
$$ plain form
2516 -95 31 31 135 38 -56 178 60 75 57 -141 -35 -120 165 113 -105 -166 34 -10 267 286 -104 159 184 -103
2540 -103 -14 -95 354 -12 4 -93 109 137 46 136 39 85 -22 -260 93 -181 -133 28 103 124 -43 208 42 -183
2564 -183 -51 80 72 -98 -139 242 297 -64 37 149 -39 62 -123 92 124 -1 94 -183 -98 -242 -153 144 40
2587 40 -69 -196 78 -41 -247 -162 159 -102 -13 42 -162 -19 -78 150 151 -136 53 90 52 -73 180 176 -16 35
2611 35 -6 -30 -131 -182 18 -158 300 -43 -102 83 -233 -70 -42 -42 66 214 -82 84 -71 -227 65 71 173
2634 173 -9 118 130 121 10 -62 -94 346 -190 50 -39 -152 93 -10 110 417 -98 -152 -147 -115 185 -135 -42 267
2658 267 59 -38 -96 -159 54 -106 10 47 426 -65 -119 -5 80 -58 -40 70 -206 113 -46 -62 168 -113 18
2681 18 241 236 114 168 -74 32 249 -163 -55 110 -50 -156 -72 105 -96 -91 188 202 36 -120 -4 53 53 -62
$$ packed form
2516i5J26%J04r7r4K34j18J5j8j98J06q5K85n2k18o1K00m4K77J9l90K63K5k87
2540a03Q9q1M49l66J6r7K02K8r1R0r7M6j07k38L53k74M8J61P5K1j67K51j66k25
2564a83J32J31qj70m1L81N5l61J01J12j88J01j85K15L2j25R5k77Q5j44Q9K97j04
2587D0j09j27K74j19k06Q5L21k61Q9N5k04J43n9K28Jk87J89L7l8j25K53mj92N1
2611C5m1k4j01n1K00j76M58l43n9J85l16J63K8%J08J48k96J66j55j56K92OJ02
2634A73j82J27J2rj11p2l2M40n36K40q9j13K45j03J20L07n15n4NL2L00l20R3L09
2658B67k08r7n8o3K13j60J16L7L79m91n4J14Q5j38J8J10k76L19j59j6K30k81J31
2681A8K23nj22N4k42J06K17m12J08J65j60j06Q4J77k01NK79J4j66j56J16N7%j15
$$ plain form
2705 -62 -63 20 65 -38 -40 60 28 28 -78 166 -28 -93 -131 -113 -46 -167 161 -33 182 -17 -36 -83 -12 -280 -32 -31
2731 -31 3 -27 -10 6 -13 94 1 -123 -99 -139 -49 179 -120 191 -160 4 -102 204 -55 -204 -2 -90 -75 -81 -109
2756 -109 -243 157 -6 -47 -101 -124 116 -259 -158 168 -38 -10 203 123 -153 -27 -16 -176 -89 -155 69 358 57
2779 57 -22 102 70 93 -7 94 -54 207 -8 59 -50 18 -103 11 -160 141 36 219 30 -100 8 -194
2801 -194 227 199 47 144 263 -23 209 -78 -132 312 -127 257 169 -139 -41 32 -22 126 93 -15 169 -193 -41
2824 -41 35 49 -226 24 81 -92 10 -49 -237 210 158 65 -85 127 92 -71 41 -126 -147 -174 291 124 -51
2847 -51 41 19 -153 60 -102 99 -69 109 104 137 -57 32 -23 170 11 19 -13 -22 -81 200 135 -15 -112 214 -138
2872 -138 -8 -171 -8 -78 30 -247 -94 -88 57 -111 -186 365 40 147 -187 -127 -175 -27 144 50 -120 134
$$ packed form
2705f2jQ3M5j03kJ00l2%j06K44j94o5l8J8O7j21L28j94K15j99j9m7P1k68K48J
2731c1L4l0J7J6j9J07r3j24K4m0R0K28k99L11l51J64j06L06k59j49K02q8J5ok8
2756a09j34M00j63m1n4k3K40l75J01L26k06K8K13q0k76J26J1j60Q7o6K24K89l01
2779E7p9J24l2K3j00J01j48K61k15O7j09O8j21J14j71L01j05J83j89j30J08k02
2801a94M21k8j52R7J19k86K32k87n4M44m39L84q8l08R8P3n4J48l3j08J84l62J52
2824d1P6J4k75K50N7j73J02n9j88M47n2r3j50K12l5j63J12j67k1k7M65j67j75
2847e1R2k2j72K13j62K01j68J78nL3j94Q9n5J93j59Ql2rn9K81o5j50r7L26l52
2872a38J30j63J63p0J08k77J53OJ45j68p5N51l25J07l34O0m8J48J71r4j70K54
$$ plain form
2894 134 -212 -97 -49 -239 -71 103 -422 -73 125 -228 127 97 -32 8 -11 23 -46 181 -130 -66 101 188 50
2917 50 219 -9 -146 -88 -75 -60 -70 -51 181 -147 -141 6 22 171 -218 -126 81 -178 -66 -76 -138 -100 -226 78
2941 78 30 101 -86 29 155 45 49 -3 44 -176 -28 -59 12 -2 -26 219 -8 26 161 -13 -116 178 -104 -44
2965 -44 -141 -168 -53 -126 93 -59 -90 12 -52 -1 134 -23 -24 -88 -26 -249 -187 83 -209 -111 98 -281 -108 -60 -53
2990 -53 -93 112 -36 -161 -71 -261 -288 -36 -10 19 23 -227 109 -16 216 -170 -128 26 87 -131 15 282 79
3013 79 254 -103 66 -31 50 138 84 -35 24 -299 111 88 -53 30 37 152 -183 87 192 -108 -3 58 -56 91
3037 91 66 8 -250 -26 24 32 101 62 -162 -61 -47 -3 -88 213 -119 -56 62 -146 134 90 -144 26 -47 -207 24
3062 24 111 -111 110 -80 -96 76 23 62 32 124 -29 -139 40 -13 55 54 79 -71 110 -53 -80 16 17 181 -286
$$ packed form
2894A34l46J15M8j90J68J74n25L49J98l53L55l0j29M0j9L4o9K27l11O4J67Q7j38
2917E0J69k28j37N8J3J5j0J9K32l28OJ47J6J49l89R2K07k59J12j0o2L8j26L04
2941G8m8P1j87J15J26j10Mn2M7k20J48l1P1j4k4K45k27L4J35j74j03K94k82O0
2965d4r7k7J15p3K19j52l1J02o4N1J35j57jo4O2k23O2K70k92R8K09l79J73M8P
2990e3m0K05j48j25R0j90k7K52K6K9Mk50L36j25K32l86M2J54O1k18J46K67k03
3013G9J75l57J69r7Q1Q8n4j19N9l23M10k3j41Q3PJ15l35K70J05l00J05O1j14J47
3037I1k5n8k58K24N0QO9l9k24J01J4M4q5L01l32O3J18k08K80m4k34J70p3j60K31
3062B4Q7k22K21j90j6J72n3L9l0R2j53j10J79n3O8jK5j50J81j63k7R6JJ64m67
$$ plain form
3087 -286 -128 18 74 -29 -171 -191 -7 -66 62 -122 67 94 102 77 -50 124 -23 -19 0 257 178 72 80 -94
3111 -94 -35 -133 34 -6 62 203 60 66 4 -38 174 -34 208 -116 -82 198 -108 -277 104 -57 34 93 67 -180
3135 -180 -27 280 -29 -228 -130 -43 124 108 129 -21 -76 78 47 1 -17 -44 225 48 -15 316 -68 -23 -125 -17
3159 -17 209 -267 31 -62 29 273 79 89 40 90 114 -26 -9 -235 -122 -123 -52 -202 -14 -22 -49 187 -47 -22 -184
3184 -184 -13 -183 -230 -95 80 71 76 -141 -84 61 93 -71 -49 64 157 126 -263 -24 -259 227 205 30 147 -34
3208 -34 -214 -202 229 114 -39 -81 -80 80 222 11 -100 -63 -69 -296 48 98 151 -38 12 158 -80 52 57 42 53
3233 53 -92 -40 -247 -100 291 106 89 -102 -12 -85 138 -92 -146 -146 -91 82 115 -270 -201 70 113 287 -182 23
3257 23 -61 -126 268 39 -66 -232 -101 -21 178 -173 190 -61 6 -81 -140 16 -150 -37 -176 -126 35 52 -34
$$ packed form
3087b86J58J46N6j03j42k0J84n9J28j84J89K7Qk5j27J74j47MJ9K57p9j06Qj74
3111i4N9r8J67m0O8J41j43Oo2m2K12k08K42l24L4K80l06j69L81j61R1N9k6k47
3135a80J53L07l09j99R8Q7J67j6K1j50n5J54l1m6j8k7K69j77o3L31l84M5j02J08
3159a7K26m76K98r3R1K44j94J0m9N0K4j40J7k26J13jP1j50J88qk7K36k34K5j62
3184a84J71j70m7J35J75rNk17N7J45L2j64K2J13R3l1l89K39k35M86k2j75J17j81
3208c4j80J2M31j15j53m2JJ60J42k11j11L7ok27L44N0N3j89N0J46k38J32Nj5J1
3233E3j45N2k07J47L91j85j7j91R0p3K23k30n4%N5J73L3l85O9K71M3J74m69K05
3257B3q4o5L94k29j05j66J31Q0J99l51L63k51O7q7n9J56j66J13j39N0J61J7q6
$$ plain form
3280 -34 22 71 -86 -58 106 -157 -112 -75 117 53 -63 182 74 -255 -103 2 -94 30 26 -92 44 -194 -45
3303 -45 -165 -124 -151 -87 41 -23 38 -64 -315 -103 151 -30 -25 -94 27 -185 -179 -158 -90 -32 27 122 65 38 -13 123
3329 123 -417 -131 -203 -234 -3 -126 -185 -71 -9 -256 48 165 79 -14 -63 -32 70 -235 -382 12 -51 10 -142
3352 -142 119 -145 -115 -93 -170 -41 -112 8 4 43 19 -33 -85 151 -47 3 -13 -428 -66 110 -237 186 -243 -119
3376 -119 94 13 -42 95 69 -9 23 190 81 103 44 118 -262 73 -8 -7 196 -129 5 63 157 -83 -76 -6 -51 255
3402 255 25 -33 199 -96 76 127 -1 -60 69 47 -94 73 127 -7 145 53 -142 154 -95 -66 69 88 -9
3425 -9 -112 -27 66 -49 25 -319 173 52 -140 13 33 -254 43 5 -286 -290 15 -144 128 -156 10 104 180 178
3449 178 216 -18 93 -141 -88 32 -46 77 26 79 -214 187 -214 41 -151 154 -74 -71 -163 91 7 -168 -84
$$ packed form
3280c4N6M9j57K8J64k63M5L7J92o4j16K45j08l29J52J05r6J24mj18J36k38J49
3303d5j20M1k7O4J28o4O1j02k51K12K54j81No9J21k12OK1O8N8N9R5n7k7n1J36
3329A23n40K86p2l1K31j23n9J14O2k47L04J17q6r3m9L1J02l05j47L94o3O1j52
3352a42K61k64L0K2p7J29p1J20mL9k4n2n2K36j98N0j6m15L62J76l47M23m29J24
3376a19K13q1n5J37k6p8L2J67j09K2n9P4l80L35q1JK03l25J34N8R4k40PP0m5L06
3402B55k30n8K32k95J72N1j28n9J29k2j41J67N4j34J52r2j95K96k49K9J35J9r7
3425ij03Q5R3j15P4l44M92j21j92J53K0k87K97l8k91mL05j59K72k84J66R4P6k
3449A78L8k34J11k34N3J20p8J23n1N3k93M01m01K55j92L05k28Lr2K54q4j75Q4
$$ plain form
3472 -84 -215 -100 -103 178 -75 129 31 129 119 159 -37 -13 94 58 131 -312 -128 -133 -50 -12 89 -113 -263 57 -266
3497 -266 -54 -7 112 -61 -76 -64 -135 214 206 129 -191 -56 15 -20 211 -149 -229 -214 28 167 -58 -85 -280 -14
3521 -14 73 65 -300 48 -131 -59 262 188 54 239 162 74 9 -22 61 -110 -123 10 32 94 108 76 136 -6 -144 1
3547 1 9 -49 -39 -233 125 -84 -268 87 -64 73 209 195 173 -57 53 126 228 100 -8 -217 163 85 205
3570 205 119 -21 -94 -83 52 -56 -46 -52 -87 120 71 -256 59 56 -56 -35 112 127 -5 187 -71 -157 -63 -29 58
3595 58 -7 -335 3 -184 256 -152 -1 56 67 -18 -59 62 -225 -99 -130 -3 77 121 -45 86 56 34 -132 -3
3619 -3 118 -44 59 57 -133 14 -59 21 114 32 -30 -61 87 25 91 -15 212 -127 107 6 -61 164 -115 80
3643 80 141 -135 -61 -4 -38 -66 263 157 -10 59 -62 -158 184 65 -94 165 185 330 89 30 12 197 -88 -99
$$ packed form
3472h4j31J15lK81k53K04r8R8j0M0j96K4J07l6P3m43J84nQ3L8J01k02j50L20l23
3497b66K12M7J19j73j5J2p1L49qp7l20J35P1l5K31l60q0J5K42J39k25k7j95K66
3521a4Q7ql65L48j79P2L21p4j34J85p7q8o5l1Q3j71j3J33K2O2J4l2O0j42j38J45
3547AQn8J0j94L58k09j84L55j51J37J36j4k2k30J10P3J02j28j08k09L80p8J20
3570B05q6j40p3J1J35j08J0ol5K07m9l27L15lj12K1J47J5j32J92k58q6R4L4Q7
3595E8o5l28L38j87M40m08J51N7J1q5m1J21k87J26l1J27Q0M4j66J31l0k2j66J29
3619cJ21j62J03kj90J47p3Q0R3q2o2l1J48o2O6j06K27l39K34j01o7K25k79J95
3643H0O1k76P4N7l4k8L29j06j67O9j21r6L42j19j59K59K0J45k41n9j8J85k85j1
$$ plain form
3667 -99 227 32 169 -111 -11 -155 207 -186 70 60 45 -26 131 -42 59 196 -37 -44 93 -62 129 30
3689 30 143 -24 53 100 103 -138 20 -136 108 128 -159 120 233 69 -199 -87 -16 101 -98 -71 -1 55 -137
3712 -137 44 -168 14 179 -31 46 -92 -102 -130 70 -316 0 86 -336 -28 -270 132 192 -53 -19 32 124 3
3735 3 -102 -2 53 92 82 46 47 -242 -175 -70 52 -185 30 43 -64 195 -72 54 93 -7 104 43 158 25
3759 25 -234 36 -352 -89 69 -83 -69 -60 159 11 -54 -32 15 -87 60 -56 -111 70 -85 -101 29 134 -1
3782 -1 -125 -170 -123 -282 38 -24 236 75 -77 -146 22 4 160 147 -183 72 -126 -15 66 -25 194 212 199 -120
3806 -120 226 -16 -125 -36 70 20 -63 94 95 -82 31 1 -43 46 -123 -6 -37 23 59 -42 -18 104 -257 -364
3830 -364 56 -273 109 25 -29 -81 235 -114 51 8 195 60 -48 31 -54 -87 154 151 45 -40 162 -120 -266
$$ packed form
3667i9L26j95J37k80J00j44L62l93K56j0j5p1J57j73J01J37k33pJ37j55J91r9
3689C0J13j67P7M7Lk41J58j56K44K0k87K79J13j64k68J12P1J17j99K7P0N6j92
3712a37J81k12J82J65k10P7j38j0k8K00l86L16Q6m22L08k42M02O0k45L4N1R2j21
3735Cj05J00N5L9j0l6Jk89O7J05J22k37K15J3j07K59k67J26L9j00J11o1J15j33
3759B5k59K70l88K63J58j52J4RK19j48o5K2M7j02J47j16n5J81j55j6J30J05j35
3782aj24m5M7j59L20o2K60j61j52o9J68j8J56j3l30K55j98J11Q1r1K19J8j3l19
3806a20L46k42j09Q9J06n0q3J57Jj77J13l0m4Q9j69J17l1O0L6j01K4J22l61j07
3830c64M20l29L82q4n4n2L16l49J65m3J87j35j08P9q5l3K41lj06q5K02k82j46
$$ plain form
3853 -266 -71 144 -185 -149 211 -64 -72 -154 180 -142 -106 -98 176 48 137 -13 -138 118 -9 -52 52 -8 98
3876 98 -131 229 -78 -238 -15 180 100 17 12 -10 157 -208 365 -374 -67 -184 -14 -53 -156 -59 41 1 -29
3899 -29 -64 -65 259 141 -112 132 89 -178 138 -226 57 -136 -41 -192 176 59 3 -10 -37 91 76 192 -210
3922 -210 129 -146 -98 -113 -106 -30 -123 40 164 -101 125 10 0 -212 -212 -48 168 206 25 285 81 -65 75
3945 75 -71 -100 -202 -195 -22 -159 -50 -2 -76 -116 -128 -24 156 9 -217 14 209 -221 17 -101 20 46 35
3968 35 -99 -168 49 240 80 -98 -387 111 67 24 -14 93 -57 -94 149 -109 278 -40 90 -239 -154 -86 -14
3991 -14 -28 3 134 72 -106 109 23 272 -82 -3 -109 51 -70 -26 52 -192 -37 32 -191 134 251 234 50
4014 50 98 51 -183 35 -38 76 80 63 93 19 -13 442 89 149 5 27 -88 -304 -12 47 79 115 87 55 91 4
$$ packed form
3853b66J95K15l29L6L60k75qq2L34l22L6QK74j28Q9j50j25K56j27m3J04o0J06
3876I8k29L60l07j60K23J95q0q3nk2J67l65N73p39L07j17J70l9j03R7J00m0l0
3899b9l5jL24j18k53K44m3k67L16l64K83j93R5j51L68j17n6j3k7J28j5J16m02
3922b10L39k75M8j5PP6r3J63J24k65K26j15j0k12%J64K16L8j81K60k04j46J40
3945G5j46k9j02PJ73j37J09M8p4m0j2J04J80j47k26K31J95m30K38j18J21K6j1
3968C5j34o9K17J91j60j78k89M98m4m3l8J07j50l7K43k58L87l18J30l29Q5O8P2
3991a4j4L1J31o2j78K15q6K49l54P9j06J60j21M4P8k44J55O9k23L25J17j7j84
4014E0M8m7k34K18p3J14Mj7L0p4l2M55l53O0j44K2j15k16K92N9L2L6k8l2L6q7
$$ plain form
4040 4 -172 -47 -31 27 -111 24 61 18 216 -264 160 -177 123 99 -63 -93 107 -112 19 132 29 295 58
4063 58 -26 127 3 -9 -79 41 -113 221 -6 -156 -218 154 16 -110 267 101 31 82 265 -70 -94 -103 113
4086 113 18 -3 -83 142 -65 2 -75 -42 -172 -90 -21 -200 -28 149 -196 -55 -13 -127 -46 -77 22 79 33 -227 52
4111 52 3 -56 -67 71 58 1 110 -103 -231 -11 -55 69 -132 -99 -3 89 -309 -122 170 25 178 -158 -6
4134 -6 -177 -68 -120 81 31 -40 129 -200 28 -248 171 1 -184 35 -96 15 197 -107 -222 303 53 -136
4156 -136 -114 100 -6 -288 -158 -83 125 24 -266 -95 106 108 -100 24 20 222 132 -37 34 237 -129 20 -1
4179 -1 127 -89 -3 124 -149 -84 6 149 -62 31 36 -56 90 -193 -100 -34 74 -183 -77 29 102 26 124 -107 -108
4204 -108 62 -103 236 -81 80 112 55 -70 -67 173 255 123 -156 -74 71 0 42 9 -20 188 8 44 203 -40
$$ packed form
4040Dj76J25J6N8j38J35L7m3J98m80M24l37L00k4j62l0K00k19J31J13j03K66k37
4063E8q4J53j24j2p0J20j54L34k27j50o2L72j38j26L77j66p0N1J83l35k4rK16
4086A13r5k1q0K25k07O7p7L3j30Q2O9j79J72J77l45J41M2j14Q1l1R9N7m6k60K79
4111E2m9n9j1J38j3n7J09k13j28K20m4J24k01L3R6R2l98J87K92j45J53l36J52
4134fj71J09n2K01n0p1J69l29K28k76M19j70j85K19j31J11J82l04j15N25k50j89
4156a36K2K14j06k82J30P5K08j01k90J71K01Kk08J24mK02r0j69P1K03l66J49k1
4179aJ28k16Q6J27k73O5R0J43k11R3Nr2J46k83R3O6J08k57J06J06P3p6R8k31j
4204a08J70j65L39l17J61L2n7j25LK40Q2j32k79Q2J45p1M2l3k9K08j80L6J59k43
$$ plain form
4228 -40 -27 70 -63 34 38 -108 -21 -227 83 -112 152 118 -133 -208 0 202 -88 71 94 -19 -104 -51 -227 104
4252 104 167 1 85 -138 6 53 -40 -23 152 -179 29 55 173 102 -20 -25 -99 44 -10 51 119 134 102 44 170
4277 170 -66 -23 111 -44 -158 -55 -161 73 35 80 -3 -185 134 49 -175 65 -168 29 19 120 225 265
4299 265 38 157 153 -64 120 -62 -107 -54 376 234 -53 10 -111 51 126 -62 -320 59 99 -89 7 210 -249
4322 -249 -56 5 -128 -76 -228 46 44 -132 161 -57 135 -91 124 -35 -9 166 -44 56 -58 99 -263 -26
4344 -26 -57 12 -176 -53 -186 132 -66 -207 25 -370 3 90 -75 -120 14 102 -55 -109 -98 242 64 -33 -21
4367 -21 144 -61 -136 62 97 -72 12 -1 88 -54 -112 18 23 -103 63 59 255 -114 132 -12 -44 -64 -178 97
4391 97 -72 1 -29 -44 -177 177 -3 -13 39 -114 37 5 -54 -26 82 24 -62 106 -74 301 -167 77 -56 -96
$$ packed form
4228d0J3R7j33R7Mj46Q7k06L10j95K64l4k51p5K08K02k90J59K3j13q5N3j76L31
4252A04O3j66Q4k23J44M7r3J7J75l31K08K6J18p1j22np4J43n4O1O8J5l2n8J26
4277A70k36M3J34j55j14J03j06K34l8M5q3j82L19q5k24K40k33J97j0J01J05M0
4299B65k27J19mk17J84j82m5N3M30j42k87O3j21J62P5j88k58L79M0j88R6K03m59
4322b49J93O1j33N2j52K74kj76K93k18J92k26K15j59K6J75k10J00j14J57l62K37
4344b6l1O9j88J23j33L18j98j41K32l95L73Q7j65m5J34Q8j57n4J1L40j78r7J2
4367b1J65k05p5J98L5j69Q4j3Q9j42n8J30Nj26J66mJ96l69K46j44l2k0j14K75
4391I7j69P3l0j5j33L54j80j0N2j53J51l2n9K8J08n8q6J68j80L75m68K44j33m0
$$ plain form
4415 -96 327 194 85 -50 -110 116 20 -18 75 -31 -16 -184 -145 -104 49 98 191 -198 189 -127 3 150 244 -179
4439 -179 30 178 -40 -93 -19 46 -17 74 -136 32 159 -41 -156 -140 -319 174 5 -31 94 305 -18 169
4461 169 -176 -102 -156 156 252 -132 -42 50 30 -87 34 26 7 165 -139 62 -121 -163 25 -54 148 118 55 -32 130
4486 130 -37 -5 209 109 87 -129 5 64 -9 5 17 -29 -67 -131 -173 67 -157 -11 -161 -20 36 -16 18 -30 -42
4511 -42 45 -101 187 243 20 -142 0 115 218 -134 -15 -179 -21 -204 -279 31 55 162 202 61 70 38 -39
4534 -39 54 -58 -223 -37 8 -20 -346 93 52 29 95 224 -136 -70 51 108 235 47 -107 51 117 195 147 130
4558 130 2 123 -173 101 -178 135 178 192 48 -42 76 199 42 -96 41 -96 174 -102 -92 26 -30 66
4580 66 22 31 -21 92 -19 -137 -8 84 50 75 19 -128 -39 63 -172 -275 200 -73 -197 202 102 211 -199
$$ packed form
4415i6M23j33j09j35o0K26r6l8R3j06J5j68L9M1J53M9R3l89L87l16J30J47R4m23
4439a79K09J48k18n3P4O5o3R1k10J68J27k00j15J6j79M93j69l6J25K11l23J87
4461A69l45P4n4L12R6l84R0R2k0j17J21qj9J58l04K01j83m2J88p9K02l0o3q7J62
4486A30j67L2K14j00k2k16J34N9p3J4J2m6l8o4m2K40k24J46j50J41N6n2L4m8j2
4511d2Q7j46K88N6k23j62J42J15J03l52J19j64J58j83p5L10K4J07M0j41Rl2p7
4534c9R3j12j65J86M5k8l26M39m1k3O6J29l60O6J21N7J27j88j54J58O6P8m8j7
4558A30j28J21k96K74k79L13M3J4j44r0J18J23j57j38J37j37K70k76J0J18n6R6
4580F6m4Rn2J13j11j18J29R2l4K5n6j47Q9J02k35j03M75k73j24L99j00J09m10
$$ plain form
4603 -199 256 -60 168 52 -240 -312 -24 -15 21 128 176 13 -35 259 -122 -18 64 110 -3 64 -95 163 252
4626 252 -163 -228 -364 29 -97 18 -112 16 -8 -19 253 -39 62 140 72 -5 91 -99 155 32 297 -119
4648 -119 -43 73 54 -81 310 -79 -209 352 111 124 258 48 -167 106 45 -216 32 -104 42 -118 12
4669 12 5 93 58 -28 165 121 -134 0 58 -26 -27 15 -109 110 30 -242 192 53 303 127 105 -61 -63 -6 177 -255
4695 -255 -86 128 22 6 -185 -131 -36 -52 -4 259 173 78 125 212 -225 159 144 105 -117 169 85 -153 -76 142
4719 142 -193 14 194 23 189 -66 -75 211 -114 -68 -53 -78 -143 -58 -88 -56 -50 -59 4 107 147 93 10 39 2 -91 102
4746 102 -184 -88 229 -138 -154 -54 71 40 -2 89 -11 -232 -55 -119 50 -63 138 44 112 5 248 31 102
4769 102 -109 175 46 97 28 -357 -92 -148 -14 209 -75 -61 198 -123 169 104 -212 161 -109 -33 -251 266
$$ packed form
4603a99M55l16K28j16k92p2K88RL6J07M8j63m8K94l81J04Q2M6j13O7j59K58Q9
4626B52m15o5j36L93j26J15j30J28k4j1K72k92J01P8o8p7R6j90K54j23K65m16
4648a19P6J16j9j35L91l89j30N61k41J3J34k10k15K73o1k61K48j36J46j60J30
4669A2pQ8l5q6J93m4k55J34N8q4jM2j24K19q0k72M34j39K50j76k2j66kN7J83m32
4695b55J69K14j06j6j91N4R5j6M8K63q6r5M7Q7m37L84j5l9k22K86q4k38P7K18
4719A42l35K07J80j71J66k55rK86l25M6J5k5o5Q5l0L2OrO3J03M0n4q3K9l7r3J93
4746A02k86R6L17l67j6J00J25l1m2R1j00k21J77o4J69j13K01r4O8j07K43k17P1
4769A02k11K84j29N1o9l85K65n6J34K23k84J4K59l21K92o5l16L73k70P6k18N17
$$ plain form
4791 266 54 -173 -2 -90 -12 38 35 -71 -169 -18 2 -153 0 -51 28 178 73 -99 157 24 -85 -10 -219
4814 -219 -179 71 -111 -53 142 171 167 8 -33 6 106 60 39 260 197 192 -32 -60 -28 -10 213 -122 205 70 -180
4839 -180 -219 -84 205 179 58 83 41 -12 -81 154 -199 132 -148 214 -45 -94 -74 78 38 105 -73 102 -35
4862 -35 -126 26 177 -82 48 169 -17 -2 124 14 -199 -69 7 152 124 -128 -11 12 -159 -239 29 -273
4884 -273 84 204 -256 -95 191 98 113 31 42 -1 -14 166 -28 125 79 76 -283 -60 41 80 84 -131 41 -95
4908 -95 62 -157 -60 227 59 -261 14 -128 172 114 -268 17 -19 -146 -11 151 -75 73 217 -151 -18
4929 -18 -209 -92 -35 -397 -97 85 -197 115 51 181 346 -61 -70 -96 77 117 -95 -198 -60 286 64 -51
4951 -51 -44 -15 113 -62 135 92 212 249 -82 -136 105 -30 -105 -111 63 -181 -16 67 293 13 7 -224 -166 33 -178
$$ packed form
4791B66k12k27J71q8P8N0lj06r8J51K0j55J53n1P9J50j05j72K56j33j09P5k09
4814b19M0K50j82N8J95K9mj59m1L9J00m6k1K21o3nk24k8L2J8K23l35L27j35k50
4839a80l9J35K89k6j21K5m2n3o9K35l53L31k80L62k59m9K0J52m0O7j78J75j37
4862c5r1J52J51k59J30J21j86J5J26j10k13J30P6J45k8k52J17K3j71q0K68l02
4884b73L57J20m60J61K86r3J5q2J1m3j3J80j94J53m6ll59K23J01L9Mk15J72j36
4908i5J57k19R7K87j68l20K75j42L00n8l82K85l6j27J35J62k26J48J44l68J33
4929a8j91J17N7l62L00J82k82L12o4J30J65m07rk6J73M0k12j03J38L46k22j15
4951e1PK9J28j75J97m3J20L7l31n4K41j35p5oJ74k44J65Q3K26k80ok31N8J99k11
$$ plain form
4976 -178 -6 154 -43 -191 6 -23 4 252 -2 172 182 137 202 -62 92 11 -162 -147 52 32 -15 -26 71 -5
5000 -5 -6 -72 -70 -6 197 82 19 -58 29 -222 256 -136 -49 134 -107 -233 54 136 -230 -149 79 -86 -32 -11 -67 -26
5026 -26 53 89 -80 -85 91 168 223 -118 116 -91 11 93 -107 145 30 -14 106 121 -3 100 -38 -125 -120 -313
5050 -313 116 -16 148 61 234 176 -193 60 63 78 17 108 224 83 -67 -4 50 -34 -236 9 100 243 65 23
5074 23 -18 -65 58 153 -223 -182 -234 -172 -4 64 54 -267 -30 -41 -63 -15 28 5 -139 -72 113 204 -81 -126 71 91
5100 91 -25 256 100 -48 58 -28 -109 339 -242 136 -108 116 114 -97 45 -260 36 -179 195 -132 41 93
5122 93 -168 20 156 174 -43 -267 107 16 -146 -122 72 37 -55 66 -54 -81 60 -63 215 9 -33 34 -315
5145 -315 -228 -22 300 -64 -57 16 2 103 79 -24 117 95 -63 -8 62 182 81 -347 115 -51 -226 34 -20
$$ packed form
4976a78J72J60j97j48J97k9K7K48k54J74J0m5O5k64J54q1j73J5J99k0m7j1R7p6
5000ejo6KO4K03j15o3p7Q7k51M78l92Q7J83k41j26K87Q2l66Q1K28j65N4K1n6M1
5026b6P9L6j69nJ76P7N5l41K34k07J02Q2k00K52j15m4J20J5j24J03j38q7Nj93
5050c13M29j32J64q7J73n8l69K53LJ5o1R1J16j41j50O3N4q4k02K45R1J43j78m2
5074B3m1m7J23R5l76M1n2O2J68O8j0l21K37j1k2M8M3k3j44O7J85R1k85m5J97K0
5100I1j16K81j56j48J06q6q1M48n81L78k44K24kk11J42l05K96k15L74l27J73N2
5122I3k61J88J36J8k17k24L74r1j62K4J94l5r2J21j20k7J41j23K78k06m2O7l49
5145c15Q7K06L22l64PP3j4J01k4j03J41k2j58N5P0J20j01m28M62j66j75K60n4
$$ plain form
5168 -20 -66 161 -29 143 -55 74 -51 -150 -78 -150 127 0 62 107 -169 -136 14 -121 -156 -23 -44 150 45
5191 45 -35 164 83 74 -322 -309 -84 130 21 -66 56 0 238 130 3 -86 -298 165 -117 -33 212 -52 -33 10
5215 10 -119 88 -38 -39 -86 -29 -2 -60 68 70 68 102 2 242 -29 -134 -90 46 151 -40 -9 -155 -158 -171 -18 -146
5241 -146 151 -178 53 -185 168 142 -22 -108 -29 203 -86 53 351 -56 -134 42 -53 29 197 -119 52 252
5263 252 -233 63 -184 -16 -118 -12 -104 -108 -57 -107 92 339 -24 75 77 -211 -189 -32 220 25 205 -36 124
5286 124 -1 -302 44 55 -224 -100 -26 -395 115 354 -7 41 71 50 69 296 105 77 69 -179 -28 44 -37 -171
5310 -171 -177 -127 -119 129 -86 81 -180 -235 135 86 -59 -296 134 116 -135 46 -140 -78 -201 190 203 -142 -96 -26
5334 -26 -100 -115 36 14 -213 -78 191 281 -171 70 -129 93 38 5 -92 -58 -169 33 76 174 105 336 64 -165
$$ packed form
5168b0m6K27j90J72j98J29j25r9P2p2K77j27O2M5k76L3J50j35l5J33k1J94j05
5191D5q0J99q1rl96J3K25K14j09q7J22n6K38j08j27q9k12M63k82Q4K45k64J9M3
5215A0j29K07j26jm7N7K7n8J28KkL4j00K40k71j05M4J36J05j91L1j46lj3J53j28
5241a46K97l29K31k38L53k6j64q6P9K32k89J39K98m07p8J76r5Q2J68l16J71K00
5263B52m85K96k47J68j02J06r2mN1n0J99K47l63R9Kk88K2J57K52j95J80k41J60
5286A24j25l01L46J1k79J24P4l69N10K39l61M8L0k1J9K27j91k8qk48J51P2q1j34
5310a71oN0QK48k15J67k61n5L70m9j45k37M30j8k51J81j86O2j23L91J3l45M6P0
5334b6p4j5J51k2k27J35K69R0m52K41j99K22n5l3r7L4j11K02M3R8o9K31k72k29
$$ plain form
5358 -165 -153 -42 -78 -39 34 -91 -171 -13 -90 -120 -47 -151 -55 -127 155 -267 81 227 -29 153 69 37 -28 -14 73
5383 73 9 -97 92 -228 -15 -236 -33 23 14 108 331 -189 -100 -64 136 45 36 -123 120 -81 -43 -54 -326 61
5407 61 -98 -14 -77 -62 17 92 -88 259 -173 92 -139 145 74 -115 162 58 -228 231 -49 185 156 88 -29
5430 -29 4 189 118 87 164 5 257 53 -48 -185 -176 -21 -102 29 -109 152 65 128 -32 -158 -231 -339 -46 -35
5454 -35 112 -232 14 -76 225 -2 -141 -123 35 5 -76 -145 35 0 300 -267 -11 139 -149 -51 84 -60 -69
5477 -69 -6 -18 -22 -252 -12 -140 306 -88 -115 -15 142 -2 -60 -177 -362 -219 -69 239 -24 183 151 -145 -236
5500 -236 101 56 2 18 -26 144 -116 -32 84 -102 29 84 293 -6 177 -161 -136 137 146 -49 5 -21 70 75 85
5525 85 -89 -98 -115 -96 -55 46 -28 -85 -168 131 287 -84 158 -21 219 50 -210 19 9 91 -30 -65 -221 253
$$ packed form
5358a65J2J11l6L9P3j25q0J58p7l0P3j04R6p2K82m22L48J46k56J82q4l2o5J4Q7
5383G3o4j06J89l20K13k21K03N6rR4K23n20Q9L6K00r1rj59K43k01L8j1k72L87
5407F1j59Q4o3J5P9P5j80L47m32K65k31K84p1j89K77j04k86M59k80K34k9o8j17
5430b9L3J85p1l1P7j59K52k04j01j37RJ55q1J31j38K61q7O3j60j26p3j08K93J1
5454c5J47l44K46r0L01k27j39J8J58l0q1o9J80l5L00n67K56J50k88R8J35j44r
5477f9O3j2mk30K40j28M46l94k7J00J57j44n8j17j85J43J50L08k63K07l2k96r1
5500b36L37m5n4J6m4J70k60Q4J16j86J31N5K09k99J83l38K5K73Rj95N4k6R1NJ0
5525H5j74rj7J9M1J01p4n7q3K99J56l71K42j79K40j69k60K29j0Q2j21l5j56M74
$$ plain form
5549 253 161 -184 48 -136 21 91 118 -53 305 -7 179 106 -165 122 5 24 147 44 214 124 -223 -108
5571 -108 -3 -39 113 76 -121 -322 -32 -60 87 128 -18 -12 -61 31 90 -147 22 118 -229 -145 -29 -96 -142 151
5595 151 59 160 -10 46 243 -110 -19 4 136 -240 -142 -10 28 -64 -259 -163 -79 303 -149 -109 -66 -98 -30 52 -67
5620 -67 -121 121 -147 38 390 83 15 -138 124 -122 -18 19 -137 3 -78 10 78 -140 70 87 125 -87 -5
5643 -5 -67 83 88 -4 8 -159 89 -192 119 187 -87 22 8 -153 -170 -145 169 4 29 -21 -10 -60 -62 52 -30 -83
5669 -83 142 -33 -58 -83 64 72 79 -88 -115 51 197 101 -105 171 58 -79 -197 83 -214 190 103 27 107 22
5693 22 -174 -169 49 86 -281 -226 111 146 -140 -124 102 -97 126 222 111 115 -128 -139 175 -274 62 -204 -27 -26
5717 -26 -54 -65 180 -50 -257 -48 -198 -39 85 -120 82 -189 -102 -322 -50 -162 70 -13 29 -21 -83 24 -35
$$ packed form
5549B53r2l45K32j84J57P0K7j71L58l12J86p3k71K87j17J9J23j03J70r0l47J15
5571a08J05l6J52l7j97k01K90k8J47M1j46Om9R2N9k37J69R6l47Q4J16o7m6K93
5595A51r2J01j70N6J97l53R1K3J32l76R8J32L8r2j95R6Q4L82m52M0M3l2O8Q2j19
5620f7n4K42k68J85L52l07o8j53K62k46J04L7j56J40q1Q8O8k18K10J7L8k12Q2
5643eo2J50Nr2J2j67K48k81L11O8k74J09j4j61j7K5L14j65K5n0J1n0kJ14q2n3
5669h3K25j75k5k5J47QPj67k7J66J46r6k06K76j13j37j18K80k97M04q7p6Q0q5
5693B2j96NK18L7l67N5L37L5k86J6K26j99K23R6j11Mk43j1L14m49L36k66J77J
5717b6k8j1K45k30k07K09j50J59J24k05K02k71Q7k20K72j12K32q3M2n0o2J07n9
$$ plain form
5740 -35 -117 50 34 -194 330 63 195 83 48 9 -215 25 148 -99 40 -261 70 -32 144 -78 -24 13
5762 13 -163 -229 -47 166 40 118 7 113 88 -210 92 -158 -62 -122 258 -349 -58 115 128 37 82 -140 16
5785 16 202 -55 18 -103 84 151 -237 -266 -12 116 24 164 98 120 -88 16 -7 192 70 258 -87 227 69
5808 69 -54 -13 36 158 -116 -251 20 209 41 -20 136 -93 -133 182 29 -111 -13 271 27 -218 -27 0
5830 0 -8 136 64 -128 65 229 -87 55 -17 5 -120 10 10 -91 -47 61 -104 -192 176 112 52 -20 301 187 -101
5855 -101 -514 87 6 -72 -263 44 -41 -65 56 50 86 -108 236 -18 36 36 45 -90 -216 -29 -295 -38 150 -22
5879 -22 -43 10 -39 -237 -161 93 259 -119 -177 73 -97 -161 -221 26 -111 -138 -38 53 161 -126 -22 -126 118
5902 118 136 210 63 -57 -114 -90 213 -75 206 -163 81 14 20 281 95 154 -50 123 145 -171 111 73 101 -18
$$ packed form
5740c5q2J67j6k28N24k67J32j12l5l9k24K40J23k47J39l01L31j02J76k22N4L7
5762A3j76o6J82K13j26P8j11J06k5k98L02k50R6o0L80o07K91J73J3r1M5k22J56
5785A6J86k57P3j21J87O7l88k9K54J28r2J40o6K2k08J04k3J99j22J88l45L14j58
5808F9j23M1M9J22k74j35K71J89j68o1J56k29m0L15j53j40R8K84k44k45J91K7
5830@qJ44p2j92J93J64l16J42p2K2j25J30%j01M4J08j65q8L68o4o0p2L21j14k88
5855a01m13O01q1p8j91L07q5k4J21oL6j94L44k54N4%Rj35j26J87k66K57J88j72
5879b2k1N3m9j98P6K54J66l78n8K50j70o4o0K47j37k7J00R1J08k87J04j04K44
5902A18J8P4j47j20n7K4L03k88K81l69K44o7OK61j86N9k04J73K2l16K82l8K8j19
$$ plain form
5926 -18 131 -62 -54 -48 -231 125 -79 109 -7 65 -25 191 -151 -303 -162 -74 -59 -59 -65 -20 -131 -4 -210 72 210
5951 210 183 80 -120 -77 68 -15 61 137 -247 129 -63 -74 -95 32 -64 14 168 75 78 15 -176 -48 258 -188
5975 -188 -67 69 -64 -109 -18 -118 174 23 375 171 -195 277 -20 0 161 7 22 262 77 -125 82
5996 82 -106 90 -55 -57 -96 -69 91 71 -38 -182 12 192 -83 -89 -118 29 -119 80 26 185 -29 -9 -236 -258
6020 -258 42 -62 -11 -78 121 -102 68 -53 -113 88 -301 58 97 -150 -118 -167 -113 84 -116 121 13 -153
6042 -153 -10 -8 48 -12 44 -54 -116 229 145 -227 -24 25 -73 -205 -22 140 197 73 -54 106 -18 -165 -71 78
6066 78 160 -10 135 59 135 -71 -15 66 5 -51 -127 196 -5 89 98 269 29 56 118 41 -233 -273 -164 136 -102
6091 -102 -203 65 -164 -62 -163 -100 74 -3 -32 102 -49 201 -121 175 53 -109 3 83 20 -104 143 30
$$ packed form
5926a8J49j93QOj83L56k04J88j16P2r0K16l42j52J41Q8J5%oM5j11J27k06K82J38
5951B10k7j03k00M3J45q3P6P6l84L76j92j1k1J27r6P8J54r3Lo3j91J28L06m46
5975a88J21J36j33m5R1j00K92j51L52k04l66M72k97K0J61j54J5K40j85k02K07
5996H2j88J96j45kl9K7J60k0j09j44J94J80k75ok9J47j48J99n4J59k14K0k27k2
6020b58L00j04N1o7J99k23J70j21o0K01l89L59L9k47L2m9N4J97k00K37j08j66
6042a53J43KN6o0N6r8o2L45q4l72K03M9r8j32J83J62N7j24j27J60j24j47R4J49
6066G8Q2j70J45p6P6k06N6Q1o1n6p6L23k01R4RJ71k40K7O2p7k74m0J09L00k38
6091a02j01K68k29J02j01O3J74p7k9J34j51K50l22K96j22j62J12Q0o3j24K47j13
$$ plain form
6113 30 324 -118 -165 -102 -191 158 203 286 32 -34 219 40 99 38 -2 251 133 -14 -127 -13 -51 210 318 -72
6137 -72 -135 -71 -66 83 -7 -24 102 -211 -65 -47 -78 -28 -84 -13 -91 137 -147 215 -106 -51 11 -163 25 -68 -126 -44
6163 -44 -225 21 -7 117 83 305 -104 -97 73 158 64 -98 71 70 102 246 188 94 206 174 -8 -32 26 -14 -253
6188 -253 314 119 -66 -117 -127 99 -97 91 -110 64 -209 5 166 63 -257 -102 67 46 -25 80 -72
6209 -72 115 -57 98 -20 -91 35 -95 57 16 148 -83 48 -44 143 -92 15 -52 48 -52 225 -128 -91
6231 -91 -96 20 53 -111 -2 -42 -58 -168 61 -212 -129 -5 -150 212 59 34 -254 68 190 340 47 -190 268
6254 268 63 41 -19 268 -57 45 -304 106 -17 -122 45 30 135 86 -156 101 -64 -107 -30 226 131 -56
6276 -56 356 58 -166 -197 1 -14 75 -62 44 -160 94 57 167 -209 -72 216 -111 169 -120 4 -93 175
$$ packed form
6113C0K94m42m7O3q9L49M5Q3k54o6K53j79N9o1m0K53j18j47j13J14l8K61J08l90
6137g2o3O4NJ49r0j7J26l13J46J8l1N0n6P1p8K28k84L62l21N5O2j74J88r3n8Q2
6163d4j81K46k8J24l4K22m09PJ70Q5r4j62J69jL2J44n8r4J12l2j82k4N8m0k39
6188b53N67j95j85n1j0K26j96J88k01J74k73K14J61j03l20J55J69k1p1J05j52
6209g2J87j72J55j18p1J26j30J52m1J32k31J31r2J87k35J07o7J00j00K77l53L7
6231i1nJ16L3j64J09m0j6j10K29k73Q3J24j45L62j53k5k88L22J22J50k93k37M58
6254B68k05k2o0K87l25J02l49M10j23j05J67j5J05m9k42K57j65m3P7K56r5j87
6276e6M12k98k24l1J98j5Q9j37J06k04K54l7J10l76J37K88l27K80k89J24r7K68
$$ plain form
6298 175 -117 -45 -118 -52 82 74 -113 118 37 -37 -42 -239 41 8 -198 44 89 124 -252 97 -2 -160 -250 -10 230
6323 230 72 -120 168 -146 -141 3 -25 -123 66 -39 -103 -55 -64 -316 172 127 86 105 -78 -31 -198 125 -240 4
6347 4 103 -78 -204 -95 -39 90 -157 -191 -210 210 -37 75 -165 18 3 16 -86 227 55 -40 -122 -275 199
6370 199 115 -52 -31 -211 69 212 135 14 293 117 103 10 -15 65 20 -28 219 -184 -242 277 -40 -165 -127 121
6394 121 77 -77 273 -152 136 125 71 -210 -13 30 -249 -188 -65 -57 1 134 36 139 -195 -45 55 -22 -67 -149
6418 -149 -45 -266 73 -24 6 -94 -195 40 -50 -93 326 -143 141 -397 159 67 201 180 -218 -19 133 8
6440 8 90 153 -8 82 116 35 -40 -193 -81 33 78 -17 -334 -11 -58 -46 100 -124 73 -14 -339 -19 -72 363 -227
6465 -227 15 169 90 -166 -208 280 92 -58 -123 114 86 110 -52 -13 129 -2 39 -97 -284 -206 162 -88 -21
$$ packed form
6298A75k92P2p3O6J34qj87K31q1p4nj97K80l3k06K42M5L5l76L49r9j58r0K40K40
6323B30j58j92K88l14NJ44k8r8J89j05o4M8rk52M88m5m1J9j83M7j67L23l65K44
6347DR9j81j26J09N6J29k47l4j9M20k47J12k40J83j5J3j02L13j72r5q2j53M74
6370A99q4j67K1j80K80J43p7j21K79j76j4r3k5Q0m5m8K47m03n8N19l17j25L8K48
6394A21m4j54L50m25K88j1n4k81J97M3k79O1J23QN8J33r8J03l34J50J00p7m5q2
6418a49J04k21L39r7L0j00j01K35r0m3M19m69K84n38N56r2J34k1l98J99J52j25
6440HQ2O3j61R0L4q1p5j53J12J14M5r5l17L23m7J2J46k24J97q7l25L20n3M35n90
6465b27K42J54p9k56m2M88j88j50o5K37k8K4j62L9J42j31M1j36j87P8L68k50O7
$$ plain form
6488 -21 26 134 139 -6 84 8 124 27 -71 58 127 47 139 82 -88 138 -232 99 -124 -44 116 44 -24 -53 -14 -94
6514 -94 225 105 173 88 -43 -132 -222 178 261 -296 -13 -235 -42 169 -47 -90 198 -117 0 228 -41 53 -106
6537 -106 72 73 85 177 177 -39 -268 65 -2 38 5 216 -136 -172 -184 -93 -35 -24 -67 43 12 -100 -185 -276 -218 -152 115
6564 115 -143 -87 -186 -118 113 -87 199 43 -107 18 69 121 -185 8 32 8 -117 40 -18 322 58 -4 28
6587 28 115 -106 21 63 -109 29 -156 -9 104 197 94 -5 75 128 22 -161 97 -202 -132 31 56 164 31
6610 31 96 -89 63 180 98 24 -13 -22 -277 -32 30 -84 72 -21 -73 -43 195 251 -138 398 154 -50 -108 -245
6634 -245 44 -203 -32 -183 -192 12 143 66 -4 48 -129 5 -38 -99 -116 112 70 -185 49 -118 -20 62 70 41 179
6659 179 -64 -11 -61 169 -221 -66 46 -41 -55 -47 27 -33 41 243 -246 -144 -24 -100 169 108 -46 113 100 -439
$$ packed form
6488b1M7J08Nj45R0p6J16r7r8J29O9q0R2n7j70K26l70L31k23Q0J60p2o8k9L9q0
6514i4L19j20O8q5j31q9r0M00Q3n57K83k22J93K11k16m3K88l15J17K28k69R4j59
6537a06J78JJ2R2%k16k29L33o7M0l3K11l52l6j2R1N8J1m3J10l1j12q5r1N8O6K67
6564A15k58N6r9O8K31k00K86j56j50J25N1N2l06J93K4k4j25J57n8L40k64o2L2
6587B8Q7k21J27M2j72J38j85J47J13R3j03r9Q0N3j06j83K58k99P0J63K5J08j33
6610C1O5j85J52J17q2p4l7rk55K45O2j14J56r3n2L0K38N6l89N36k44k04n8j37
6634b45K89k47J71j51rK04J31p7p0N2j77J34m3o1j7K28m2k55K34j67R8Q2Qk9J38
6659A79k43N3n0K30l90J55J12q7j4QP4o0P4K02m89J02J20p6K69o1j54J59j3n39
$$ plain form
6683 -439 110 -180 85 -1 -225 -19 160 -186 -129 -147 -166 -23 328 -320 149 205 89 68 187 -162 210 168
6705 168 -43 -218 83 -21 -265 123 3 -178 -252 -24 -33 -98 50 -166 183 133 -68 77 117 328 81 -65
6727 -65 -216 32 82 -262 -294 -61 36 -86 220 204 5 -131 84 -34 -66 65 -51 -109 45 -49 98 7 -32
6750 -32 -55 95 117 -203 -53 -5 -160 178 -73 42 -28 -143 -58 60 -27 109 201 244 -56 -200 33 -7 -121
6773 -121 161 -166 240 -73 -204 -62 -94 -23 -39 182 -22 -135 -54 228 54 -72 207 76 142 -85 17 -185
6795 -185 37 144 90 -108 -396 -106 -193 -114 184 59 -27 97 217 -54 47 49 183 20 -6 133 -49 108
6817 108 36 -39 -72 10 -11 -86 -93 50 -21 300 -92 140 -42 299 114 -19 -197 -134 -33 -58 182 95 -174 70
6841 70 -251 -457 153 -161 152 -38 -65 154 256 -100 47 -375 -56 174 -75 154 82 -19 43 -252 -1
$$ packed form
6683d39N49k90K65q6k24K06J79l46N7j8j9J43L51o48M69N6j16k1J19l49L72m2
6705A68k11j75L01j04k44L88j20j81p4K28ro5J48k16L49n0k01J45M0K11k47j46
6727f5j51K48N0l44l2K33R7j22L06j6j99j36K15j18l2J31j16n8J54r4J47r1l9
6750c2k3J50K2l20J50M8j55L38k51J15p0j15Q5J18q7J36R2M3l00j44K33m0j14
6773a21K82l27M06l13j31J42l2P1j6K21k04j13Q1K82j74j26K79j31O6k27J02k02
6795a85K22J07n4j98k88K90q7P9K98j25q6J24J20k71J01KJ34j63k6J39j82J57
6817A08p2p5l3Q2k1p5pJ43p1L21l92K32j82L41j85j33j78O3J01k5K40q7k69K44
6841G0l21k06O10l14L13j90k7K19J02l56J47m22L19K30k49K29p2j01O2k95K51
$$ plain form
6862 -1 92 49 -60 -175 -11 -106 12 -215 95 182 196 -153 83 6 -58 -61 -48 128 -22 51 -40 -147 -150 39 169
6887 169 -169 -42 -73 150 326 63 132 -132 72 19 88 -39 60 -296 -102 -3 28 -144 -20 -9 99 20 -18
6910 -18 -73 88 146 40 84 -105 64 13 -101 155 -9 -224 11 87 58 26 -116 136 194 -177 -175 -186 360 48
6934 48 -49 -144 -87 -120 -220 -49 4 -10 -79 -23 -53 66 152 33 -281 18 -185 3 -126 -48 -201 89 -6 -33 192
6959 192 -118 -69 -134 103 65 -167 -45 -346 63 -10 -88 14 -246 -162 29 116 -68 -105 24 29 75 167 -100 89
6983 89 6 69 -29 -103 -262 19 -31 -192 -77 -368 -56 -277 -363 26 -111 -79 -25 -40 -81 11 112 -54 -26 -109 39
7008 39 57 32 -190 -72 143 158 -110 -128 -120 -180 -116 152 -65 82 -141 -183 -152 -110 78 97 116 71 -126 102 -165
7033 -165 69 -66 87 46 45 -145 48 114 -67 -355 47 -193 21 -86 -88 86 164 -106 188 138 -85 -234 -202
$$ packed form
6862aR3m3j09j15J64r5J18k27L10Q7J4l49K36p7o4lJ3J76j50P3r1j07lJ89J30
6887A69l38J27l1K23J76k63O9k64K04n3O9j27R9l56J94R9L1j72J24J1J08p9l8
6910a8n5J61N8j06M4j89J69n1j14K56j64k15K35P6k9l2j42K52N8l71Kj1N46l12
6934D8r7r5N7l3j00J71N3j4o9N6l0J19Q6j19l14K99k03J88j29P8j53K90r5k7K25
6959A92l10M9o5K37l8k32J22l01M09p3p8J02k60Q4J91Q7j84l7J29NM6R2k67J89
6983H9q3O3r8p4j59K81n0j61J15k91L12k21q6L89j37L2N4j5m1R2J01j66K8q3J48
7008C9J8k5k22J18K15J5k68j8Qo0O4K68k17J47k23m2L1M2J88J9J9m5j97K28k67
7033a65K34j35J53m1jj90J93O6j81k88M02k40K14j07kJ74P8k70K94n0k23j49L2
$$ plain form
7056 -202 53 46 -91 -189 -26 87 -26 98 -67 -45 157 17 49 266 113 41 -1 -50 0 274 117 167 72 -137
7080 -137 -182 60 4 89 56 -79 49 205 -48 120 94 95 -117 22 1 -78 -23 33 -56 189 109 86 -75 159 -202
7105 -202 37 15 183 176 -137 -145 98 -202 50 183 -106 302 17 147 163 43 -4 -230 18 138 307 -1
7127 -1 143 222 130 -187 -160 -11 40 18 70 -68 -251 147 -24 -37 -32 -44 -152 -30 129 120 -2 -9 148 -435 7
7152 7 -28 280 -195 -68 -60 -230 49 4 -51 -202 -8 272 -144 -51 134 -78 197 -13 92 -32 -28 127 -43
7175 -43 66 42 -52 170 -332 26 -175 -115 33 -185 143 -144 -278 -76 -45 -56 -58 129 -71 -1 252 -138 60
7198 60 10 -109 -243 -208 17 -63 238 96 323 148 24 -249 -155 257 -91 23 39 219 113 -166 8 -28
7220 -28 -201 -270 193 -43 129 24 42 131 -54 14 -241 -216 18 -59 -169 1 260 -20 76 149 -146 128 42
$$ packed form
7056b02K55pj37r8J63J13j13J24j65K2K02j40L2K17j53p2m2m9N0K74j57N0r5k09
7080a37m5K42n6Q5l3j35J28J56k53J68k6Jk12J39k1p9N5N6q9K45q0k3j61K34l61
7105b02K39k2J68pl13qK43l00K52J33k89M08k85J30J6j20m7k26K48J20J69l08
7127aJ44P9r2l17K7J49N1k2N2j38j83L98j71j3Nj2j08J22J59rj22pJ57n83M42
7152Gl5L08m75J27Qj70K79m5n5j51J94K80m16R3J85k12K75k10J05j24MJ55j70
7175d3J09k4r4K22n02L58k01O0J48k18L28k87j34K02L1j1kJ87k00P0K53l90J98
7198F0n0j19j34L5K25q0L01j42K27j75j24k73R4M12l48J14J6J80j06k79J74l6
7220b8j73o9M63k36J72j05J8Q9j85O8k55K5K34p7j10J70K59k80R6P3k95K74q6
$$ plain form
7243 42 -290 109 94 162 -45 226 130 123 169 -54 137 40 -86 -149 -54 -72 40 -40 -128 -164 171 -78 -42 -68 -159 84
7269 84 61 99 5 -85 -77 72 12 -38 178 21 -82 -52 113 -123 -143 7 71 135 -4 -95 -71 -37 -125 -71 -69 -32 -14
7296 -14 -129 33 64 -33 -19 -73 -116 -139 15 -84 30 63 -103 14 93 -19 -148 174 152 164 203 -86 77 -2 101
7321 101 -85 88 15 -57 -211 -36 67 -80 -211 -79 34 43 36 -225 12 -23 -90 -177 107 -5 -85 -190 113
7344 113 -84 208 -133 69 -69 -75 -16 30 -133 -20 -215 -90 10 214 145 -41 4 263 -140 -125 47 -213
7366 -213 -82 -90 -142 29 -252 7 -194 -125 22 -136 -125 20 -129 62 251 46 -58 -187 149 -155 130 -47
7388 -47 38 -23 -134 -68 62 -15 53 -34 175 57 1 -185 -123 -23 -79 231 -97 120 -7 -2 -259 21 -62 -81 169
7413 169 -76 185 40 12 191 64 11 73 -49 -169 -127 74 119 -29 -48 94 -60 46 152 -195 -169 172
$$ packed form
7243D2l32L99j5O8k07K71r6pM6k23J91r7j26o3R5j8J12q0q8l6L35k49L6k6r1K43
7269H4k3L8r4r0QJ49o0n0K16j57j03L0J65k36k0J50O4O4j39r1K4L4q8N4KL7J8
7296a4j15J62L1r7J4n4m3k3J54r9J14L3j66J17P9j12j29L22k2J2L9k89J63p9J03
7321A01j86J73p3p2j54J75J03j47j31J32J13Rpk61K37l5o7q7K84j12q0j05L03
7344A13j97K92l41K02j38oN9M6j63J13j95J25J00K04o9j86M5K59m03J5J72k60
7366b13J31qn2J71k81K59k01O9J47j58J1J45j49J91J89k05j04j29L36l04K85j77
7388d7Q5o1j11O6J30p7O8q7K09j18n6j86O2J00n6L10l28K17j27Nk57K80q3j9K50
7413A69k45K61j45k8J79j27n3O2j22j20M2K01M5j48j9J42j54J06J06l47K6L41
$$ plain form
7435 172 76 223 163 44 -202 130 116 -1 -28 -23 -134 18 58 -40 -129 -124 -151 342 37 105 167 -67 132 -106 -351
7460 -351 -9 -32 -55 -69 -25 -268 42 -133 78 -75 -170 -126 246 -50 -12 7 -89 -10 83 -17 36 -28 -22 -51 -66 56
7486 56 67 -234 103 4 80 222 58 41 -41 -15 -33 188 61 30 168 -220 24 -39 150 36 180 1 47 102
7510 102 -65 282 126 -280 42 34 -71 125 -29 -21 60 -192 125 -149 155 81 57 -85 -66 82 -68 178 -135
7533 -135 131 -296 89 0 -179 -168 -157 -257 -215 81 -246 -83 -59 -4 -220 -178 34 -213 -182 -166 216 147 -80
7556 -80 1 -215 115 55 -126 112 14 103 92 112 -47 -130 -190 -72 164 -110 -16 48 -184 59 -6 8 -139 6
7580 6 -302 131 41 80 324 -3 -197 19 119 21 2 132 106 -91 33 -63 76 65 135 32 -226 -61 1 19
7604 19 -21 120 39 178 32 -29 65 -178 89 105 -116 -139 -30 -2 25 -130 -90 -75 71 -245 108 186 166 79 57
$$ packed form
7435A72r6J47o0j19k46L32j4j17k7Nj11J52M0r8q9Nk7M93l05O8O2k34J99k38k45
7460c51L42k3k3j4M4k43L10j75K11j53r5M4L72k96L8J9r6P9R3j00N3o4Ok9j5J22
7486E6J1l01L37r9P6J42j64j7q2K6j8K21j27l1J38l88K44o3J89j14J44j79M6N5
7510A02j67L47j56m06L22qj05J96j54QQ1k52L17k74L04p4k4j42J9J48j50K46l13
7533a35K66m27L85q9j79J1J1j00M2K96l27J63K4N5k16M2K12k47L1J6L82o9k27
7556h0Q1k16L30o0j81K38r8Q9j1K0j59q3o0J18K36k74R4O4k32K43o5J4j47J45
7580Fl08M33r0L9K44l27j94K16J00r8j9J30k6j97J24r6J39j1P0j03k58J65O2J8
7604A9m0J41q1J39j46o1R4k43K67J6k21k3J09K8K7j55M0J5J46l16L53P8k0q7k2
$$ plain form
7629 57 174 -22 -86 -87 -127 -239 25 -289 114 86 -57 234 113 -198 -227 -139 71 -173 -58 283 15 -26 48
7652 48 -8 67 -123 -123 -70 -109 159 -102 -250 -91 -67 12 -144 -75 -88 51 132 -224 8 142 40 66 176 84 -16
7677 -16 -109 117 177 -119 167 -88 35 -56 175 8 -2 -298 98 154 166 -102 -30 -103 -10 279 214 52 254 -69
7701 -69 -83 243 77 -24 -39 -36 -131 110 24 73 -80 164 -140 219 -175 17 141 27 22 -25 61 -102 72 51
7725 51 -216 -11 40 162 82 -82 109 91 -121 -98 -17 58 -40 -115 78 126 16 -98 -189 -61 210 19 -54 -120
7749 -120 -37 -41 85 -33 5 85 -71 217 56 -106 -78 77 -306 -12 11 -104 67 -97 -48 -34 -202 12 -29
7772 -29 -73 -20 123 -149 -49 -83 -102 162 32 -78 -17 1 -51 -246 100 191 -260 209 -156 85 242 -306 121
7795 121 -26 -27 109 120 195 189 -46 158 80 -127 -30 25 60 93 -112 20 140 14 331 -35 34 145 -9 101
$$ packed form
7629E7J17j96o4jm0j12K64l14M03k8j43K91j21l11k9Q8K10k44J15L41k68m1P4
7652D8n6P5j90%N3l9K68k61j48J59K4P9j56O9j3J39Q1l56K32J34j02K6J10r2j00
7677a6r3K26O0k96K86k55J23r1K31j67j0k96L96N6J2k68P2p3R3K89o5j62K02l23
7701f9j4L26j66j01j5Lr5K41q6M9j53K44l04L59l94J92J24j14nm7Q6j63J74k1
7725E1k67K05N1J22q0j64J91j8k12K3Q1P5r8p5J93M8j10j14r1J28K71j91p3o6
7749a20Q3mJ26j18L8Q0j56K88j61j62K8J55l83K94K3j15J71j64M9J4j68K14m1
7772b9m4N3J43k72J00l4j9K64j30j10O1J8n2j95L46R1m51M69l65K41J57n48M27
7795A21j47jJ36J1P5ok35K04p8k07R7N5L5L3k05J32J20j26L17l66O9J11j54J10
$$ plain form
7819 101 -163 -103 181 198 -147 -76 104 -139 64 45 -73 118 41 -78 -111 -152 -4 104 109 -8 -78 -8 23 -18
7843 -18 -140 -45 105 -18 -61 -14 97 25 -37 312 -204 9 -171 183 147 29 93 34 -128 128 24 -148 -185
7866 -185 7 -108 76 45 -96 261 10 -90 4 65 66 86 -69 -17 51 68 77 -74 281 -19 -23 9 118 -36 102
7891 102 -181 38 -133 221 -165 -7 62 142 -75 -26 -15 9 77 19 165 169 -84 -102 63 -147 -24 -109 -94 259
7915 259 42 -83 66 -105 -56 53 -35 88 -181 -103 -9 -175 -55 2 131 -165 101 -77 -19 -16 -108 9 -363
7938 -363 -245 -14 56 -58 -20 51 119 0 -385 -230 11 219 19 -100 -15 -1 109 129 -74 -72 73 -167 48
7961 48 145 -27 57 127 73 -211 -18 65 10 -179 -119 -328 -62 91 -177 -196 113 -158 0 104 -147 -30 -31 -56
7985 -56 48 9 -37 23 -77 -144 -57 -116 60 -256 -136 35 -163 -255 -29 213 11 11 9 178 67 107 30 -72 -74
$$ packed form
7819A01k64O0K84J7l45P1J80k43K03j9j18J91p7j19l3m1J48J08Nj17p0P0L1m1
7843a8j22R5J50j23m3M7J11p2o2L49n16K13j80L54l6j18O4n9j62K56j04j72l7
7866a85J92j15J84l1j41L57k51j00R4O1JK0j55N2O8J7Rj51L55l00mL2J09j54J38
7891A02k83K19j71L54l86J58O9Q0k17M9J1K4O8n8J46Mk53j8J65k10J23q5J5L53
7915B59k17j25J49j71M9J09q8J23k69P8R4j66J20N7J29k96K66j78N8Lr2J17l72
7938c63J18K31P0j14L8P1O8j19l85J55K41K08k00j19Q5J4J10K0k03KJ45k40K15
7961D8R7j72Q4P0n4k84J93Q3n5j89O0k09K66J53k68j9L09k71J58J04k51J17jk5
7985e6J04l9m6O0j00o7Q7n9J76l16J20J71j98r2K26K42k02%kJ69j11M0p7j02k
$$ plain form
8010 -74 100 -10 -201 52 -47 -126 27 -64 40 -81 20 -259 -114 6 -101 25 -141 -101 -445 15 199 -255
8032 -255 -157 268 67 -65 -8 -62 -83 19 204 -78 -87 -49 -189 -10 176 13 -85 88 6 114 -136 96 -13
8055 -13 122 -72 -15 -51 -94 -176 -54 202 168 93 60 48 -156 61 -323 -28 171 48 76 4 149 -65 -245 -175
8079 -175 210 -17 21 -5 -34 111 73 221 94 -171 200 15 -164 1 -160 -83 -179 28 95 -83 -140 -201 62
8102 62 163 -49 -67 -144 99 149 -143 -167 66 96 -163 43 51 -18 123 200 -84 157 99 0 80 169 -128 75 -307
8127 -307 109 -18 -310 5 51 145 -54 -58 300 157 115 -37 -55 -183 58 184 77 265 80 4 -59 -100 169
8150 169 244 -6 -186 -48 1 -59 138 68 -39 -115 -33 -23 -5 -35 117 32 -111 -133 3 -119 -50 249 149 165
8174 165 -112 11 145 -69 8 -223 4 -145 -127 28 -3 96 -132 17 7 -270 -124
$$ packed form
8010g4J74j10j91K53r9p9J53r1J04j21J01k79J45J20j07J26j66M0l44M60J84m54
8032b55R8M25k01j32N7n4k1J02J85k82rL8j40J79J86j63r8J73q2J08k50K32j09
8055a3J35j94N7l6m3q2J22K56l4p5l3j2k04K17l84K95J99j23K8p2J45k14j80P0
8079a75L85k27L8k6k9J45l8J48j27k65L71j85j79J65j61P7r6K07O7j78n7o1K63
8102F2J01k12j8p7K43N0k92k4K33L0k59K06Qo9J41P7k84K41n8r9Q0Q9k97K03l82
8127c07M16j27k92L15M6R4j99mL58j43m2j52j8j28K41J26j07J88j85p6o3m1K69
8150A69P5k50j80J38M9o0J97p0j07p6Q2J0J8l0J52q5j43k2J36j22O9K99j00J6
8174A65k77J23J34k14P7k31K27j49J8J55l1R9k28J49j0k77J46
8191a24
$$ Imaginary data points
##PAGE= N=2
##DATA TABLE= (X++(I..I)), XYDATA
$$ plain form
0 0 0 0 0 0 0 0 0 0 0 0 0 0 0 0 6 -8 8 -8 8 -14 16 -16 22 -24 30 -32 40 -45 49 -56 65 -76 86 -95 110 -123
36 -123 137 -154 172 -191 213 -236 262 -290 321 -355 391 -432 474 -522 576 -634 699 -773 853
55 853 -947 1053 -1173 1317 -1486 1692 -1944 2269 -2697 3297 -4188 5661 -8522 16136 -79544
70 -79544 -189983 3359 65249 7042 17141 75431 78609 111104 110096 56662 63486 110463
82 110463 62711 14254 40107 56976 39836 32777 -5633 -36919 -15040 -21292 -71892 -61973 -38135
95 -38135 -68508 -60610 -6282 -24931 -62809 -26740 -1078 -31888 -33780 -10198 -274 21302 30687
108 30687 2574 15901 65818 44703 -12897 75 35611 26575 8816 5794 7464 23682 26616
121 26616 -8286 -21494 4566 1585 -31650 -29660 -2104 6423 -626 -9517 -8959 7279 10554 -11573
$$ packed form
0@%%%%%%%%%%%%%%Oj4J6j6J6k2L0l2L8m6N4o2P2q5R4j05J21j41J62j81K05k33
36a23K60k91L26l63M04m49M98n52O11o76P46q23R06r96J098j210J333j472J626
55H53j800K000k226K490k803L178l636M213m966N994p485R849j4183K4658r5680
70g9544j10439J93342O1890n8207J0099N8290L178L2495j008n3434O824M6977
82A10463m7752m8457K5853J6869j7140p059l8410l1286K1879o252n0600R919K3838
95c8135l0373P898N4328j8649l7878L6069K5662l0810j892K3582R924K1576R385
108C0687k8113J3327M9917k1115n7600J2972L5536r036j7759l022J670J6218K934
121B6616l4902j3208K6060k981l3235J990K7556Q527p049q891N58J6238L275k2127
$$ plain form
135 -11573 -15440 5346 5444 -7708 4643 18355 6842 -2814 705 -1841 -9149 -12655 -15878 -11457
149 -11457 -987 -4357 -13286 -2835 11179 2018 -13383 -7748 7364 11315 4451 3603 16628 28171
163 28171 19137 4701 8841 17524 7524 -8453 -5915 5315 5346 -5850 -11447 -6579 -2705 -11401
177 -11401 -22009 -18871 -9386 -9544 -14160 -7767 3415 4435 -1409 -750 5902 7427 2647 1292 8454
192 8454 14381 11719 6667 9716 13698 7131 -2905 -3601 1282 -579 -6800 -6996 -1091 866 -5185
207 -5185 -10323 -6501 -2631 -6741 -12335 -7231 2183 3244 -1307 1069 7589 8620 2543 -652 3173
222 3173 7276 4645 472 3429 8782 6189 -1408 -2483 722 -1714 -7642 -9023 -4671 -1532 -3707
237 -3707 -5804 -3027 814 -1258 -5874 -3353 1550 1331 -181 2416 7048 7970 5415 3223 4485 5428
$$ packed form
135a1573l867K0786R8j3152J2351J3712j1513r656L519k546p308l506l223M421
149a1457J0470l370q929J0451J4014r161j5401N635J5112L951o864q48J3025J1543
163B8171r034j4436M140Q683j0000j5977K538J1230L1j1196n597M868L874q696
177a1401j0608L138R485j58m616O393J1182J020n844O59O652J525m780j355P162
192H454N927k662n052L049L982o567j0036o96M883j861o221j96N905J957o051
207e185n138L822L870m110n594N104R414J061m551K376O520J031o077l195L825
222C173M103k631m173K957N353k593p597j075L205k436n928j381M352L139k175
237c707k097K777L841k072m616K521M903k19j512K597M632R22k555k192J262R43
$$ plain form
253 5428 2125 -2049 36 3455 1832 -2596 -1556 894 -1137 -5581 -7347 -4655 -3034 -5027 -6115
268 -6115 -1699 2220 678 -1754 80 2588 1507 -505 297 3554 5769 4015 2254 4150 5967
283 5967 2102 -1823 -759 847 -1012 -3375 -2348 -107 205 -2631 -4033 -2455 -1618 -3730 -4481 -1768
299 -1768 220 505 111 1780 3349 2922 1243 527 2222 2264 983 461 2440 3356 1421 -800 17
316 17 464 -1721 -3852 -3303 -943 -912 -2376 -2049 -75 860 -1096 -2217 -871 1031 506 -330 1247 3152
334 3152 3071 1462 1044 1693 1734 -49 -974 -10 673 81 -1164 -128 379 -761 -2159 -2090 -1627 -1322 -1890
353 -1890 -1610 -76 762 342 -377 832 1639 258 -455 623 1853 1580 1097 1353 2202 1778 361 -820
371 -820 -225 426 -1043 -1851 -797 332 -492 -1386 -1710 -923 -1040 -1803 -1979 -546 368 69 11 955 1570
$$ packed form
253E428l303m174K085L419j623m428J040K450k031m444j766K692J621j993j088
268f115M416L919j542k432J834K508j081k012Q02L257K215j754j761J896J817
283E967l865l925J064J606j859k363J027K241L12k836j402J578Q37k112p51K713
299a768J988K85l94J669J569m27j679p16J695M2j281n22J979R16j935k221Q17
316A7M47k185k131N49K360L1j464L27J974R35j956j121J346J902n25q36J577J905
334C152q1j609m18O49M1j783r25R64O83n92j245J036N07j140j398O9M63L05n68
353a890K80J534Q38m20p19J209Q07j381p13J078J230k73m83K56Q49m24j417j181
371h20N95O51j469q08J054J129q24q94l24P87j17p63j76J433R14k99n8R44O15
$$ plain form
390 1570 1132 487 884 1351 1169 671 683 1272 1649 413 -40 409 13 -1166 -1594 -843 -622 -873 -1067 -753
410 -753 -551 -147 -954 -724 -186 -42 -383 -183 578 1160 1033 426 597 785 612 -129 -178 444 456 -132 -179
431 -179 377 167 -143 -1015 -341 -164 -188 -702 -443 228 163 -313 115 647 373 -35 -436 118 375 418 -145
452 -145 308 719 577 -10 -201 -164 -343 -446 -410 -205 123 -152 -282 -333 -20 -400 -406 -366 213 497 -12 200
474 200 628 828 427 131 759 638 178 109 229 360 -25 -20 -355 -212 -401 -676 -1052 -547 -247 -598 -532 -598
496 -598 -250 31 -405 -287 -267 314 83 -29 613 589 518 418 596 758 140 200 175 338 292 -10 -133 157
518 157 -49 -326 -590 -270 -438 -433 -219 -388 -91 37 -298 -44 59 12 -261 -220 188 190 166 216 153 412 48
541 48 90 -45 48 -115 64 -39 48 213 -65 -311 101 -185 -291 -269 -210 16 -45 206 -137 -162 -39 209 47
$$ packed form
390A570m38o45L97M67j82m98J2N89L77j236m53M49l96j179m28P51K21k51j94L14
410g53K02M04q07K30N38J44l41K00P61N82j27o07J71J88j73p41m9O22J2n88m7
431a79N56k10l10q72O74J77k4n14K59O71o5m76M28N32k74m08m01N54K57M3n63
452a45M53M11j42n87j91L7j79j03L6K05L28k75j30n1L13l80oM0N79K84n09K12
474B00M28K00m01k96O28j21m60o9J20J31l85Nl35J43j89k75l76N05L00l51O6o6
496e98L48K81m36J18K0N81k31j12O42k4p1j00J78J62o18O0k5J63m6l02j23K90
518A57k06k77k64L20j68NK14j69K97J28l35K54J03m7k73M1M08Kk4N0o3K59l64
541D8M2j35R3j63J79j03Q7J65k78k46M12k86j06K2N9K26o1K51l43k5J23K48j62
$$ plain form
564 47 5 40 -66 66 90 340 30 102 65 50 -134 -226 -416 -148 -118 -268 -119 81 -51 -258 144 -81 32
587 32 184 -122 31 254 234 210 30 372 168 22 -172 6 -161 33 45 -163 -266 -215 -270 -153 -202 -71 -226
610 -226 -77 -67 -153 -59 -86 -152 -27 292 88 -40 193 130 229 159 -9 190 32 157 48 -19 -82 -127 -221 -64
634 -64 -111 -39 -255 8 -137 0 -125 -111 14 7 273 66 104 -99 143 137 196 157 117 -4 -127 -68 16 266 -297
659 -297 102 -78 -73 -29 -193 -199 311 -82 -128 124 -91 -178 101 -141 -15 -115 96 31 -114 -12 111 47 190
682 190 -160 -143 13 -53 118 -106 -102 27 -189 -62 -320 -142 -89 57 -4 -44 -4 -48 55 -42 101 2 -59 -121 128
707 128 59 149 126 132 -53 -8 116 -3 56 61 -17 -45 -136 158 -65 174 -188 -285 -125 25 -169 54 -6 -46 -106 -4
733 -4 13 -1 325 176 156 59 -82 24 -45 -160 198 100 -61 -119 -78 91 4 -119 -66 59 -320 -282 177 77 -154
$$ packed form
564D7m2L5j06J32K4K50l10P2l7j5j84r2j90K68L0j50J49K00j32k07M02k25J13
587C2J52l06J53K23k0k4j80L42k04j46j94J78j67J94J2k08j03N1n5J17m9J31j55
610b26J49J0q6R4k7o6J25L19k04j28K33o3R9p0j68J99j58J25j09o7o3m5r4J57
634f4m7P2k16K63j45J37j25J4J25pK66k07L8k03K42oN9l9m0j21j23N9Q4K50n63
659b97L99j80NM4j64oN10l93m6K52k15q7K79k42J26j00K11o5j45J02J23o4J43
682A90l50J7J56o6J71k24MJ29k16J27k58J78N3J46o1m0M0m4J03r7J43r9o1o2K49
707A28o9R0k3Oj85M5J24j19N9Np8k8r1K94k23K39l62r7J60J50j94K23o0m0o0J02
733dJ7j4L26j49k0r7j41J06o9j15L58r8j61n8M1J69q7j23N3J25l79L8M59j00k31
$$ plain form
758 -154 143 154 125 -62 242 189 187 68 92 94 -51 -91 22 249 26 -20 -140 -277 131 -51 -28 -74 -149 -46 261
783 261 -34 -39 118 335 -81 7 193 -37 270 34 45 108 14 -151 -100 150 -93 -166 118 -212 60 -107 -122
806 -122 -104 -11 -91 -21 29 -12 -79 106 197 -38 -245 -213 75 39 118 -5 17 124 -56 -5 -252 -197 -132 -59 -96 -117
832 -117 177 5 -111 -131 -179 117 -44 22 14 -20 30 -120 39 174 31 39 190 21 -75 100 43 -57 18 135
856 135 13 -108 202 -345 -118 29 -8 -157 -72 11 258 -83 248 -2 -94 148 -18 2 57 5 79 -164 -37
879 -37 245 -56 -112 -172 56 113 -110 318 -34 54 -129 -120 0 -33 -163 199 -68 -205 -37 -71 -62 -71 168 17 234
904 234 -257 -209 46 -48 56 -94 -31 189 97 -13 128 156 -170 56 -103 -32 220 -102 120 84 82 65 229 125
928 125 59 102 186 -5 -207 110 -99 -199 -162 -188 43 -235 71 109 -223 -38 -92 50 42 3 162 -187 -241 -92
$$ packed form
758a54K97J1k9j87L04n3kj19K4Kj45m0J13K27k23m6j20j37M08j82K3m6p5J03L07
783B61k95nJ57K17m16Q8J86k30L07k36J1O3r4j65N1K50k43p3K84l30K72j67j5
806a22J8R3q0P0N0m1o7J85R1k35k07L2K88l6P9j23K2J07j80N1k47N5O5P3l7k1
832a17K94j72j16k0m8K96j61O6ql4N0j50J59J35j43QJ51j69r6J75n7j00P5J17
856A35j22j21L10n47K27J47l7j49Q5Q3K47l41L31k50r2K42j66K0N5n2P4k43J27
879c7K82l01n6o0K28N7k23M28l52Q8j83RJ20l3j30L62k67j37J68l4RrK39j51K17
904B34m91M8K55r4J04j50O3K20r2j10J41K8l26K26j59P1K52l22K22l6kj7J64j04
928A25o6M3Q4j91k02L17k09j00L7k6K31k78L06L8l32J85n4J42ql9J59l49n4J49
$$ plain form
952 -92 58 -91 40 -33 224 275 200 169 -32 77 82 91 56 145 40 -10 -27 -34 -53 -110 91 -74 -80 187 -7 29 -178
979 -178 26 -91 -366 139 -87 -52 61 -38 9 -159 130 266 1 167 33 111 152 112 -74 -97 195 -83 -241
1002 -241 -64 -52 -98 -91 -225 -9 -46 32 224 95 -28 -58 -19 3 -47 -170 273 100 -14 246 -64 149 53 16
1026 16 30 65 -47 78 12 -185 63 47 166 63 67 -56 13 77 -98 262 -43 60 -91 -111 198 9 -127
1049 -127 -13 142 -8 -21 8 -173 -35 112 86 -21 64 264 -271 -52 197 -56 -39 -347 129 -52 171 -89
1071 -89 24 55 23 271 -137 191 201 146 73 104 149 169 -17 -28 55 59 -185 8 -266 -224 148 -30 74 193 25
1096 25 -45 26 182 -346 46 80 -75 -122 228 -141 83 364 -43 41 -26 188 -143 -64 -93 80 -150 -103 -137 43
1120 43 243 93 226 -64 -65 -43 15 -48 -31 -3 216 38 -157 -38 -54 137 39 -46 -33 211 -133 27 118 -50
$$ packed form
952i2J50j49J31p3K57N1p5l1k01J09NRl5Q9j05n0j7pj9n7K01j65oK67j94L6k07
979a78K04j17k75N05k26L5J13r9M7j68K89J36k65J66j34P8M1m0j86k3K92k78j58
1002b41J77J2m6Pj34K16l7P8J92j29j23l0L9K2n0j23M43j73j14K60l10K13r6l7
1026A6J4L5j12J25o6j97K48j6J19j03Mj23O9O4j75L60l05J03j51k0L09j89j36
1049a27J14J55j50j3K9j81J38J47k6j07Q5K00n35K19K49k53J7l08M76j81K23k60
1071h9J13L1l2K48m08L28J0n5p3L1M5K0j86j1Q3Mk44J93k74M2L72j78J04J19j68
1096B5p0P1J56n28L92L4j55m7L50l69K24K81m07Q4o7K14l31P9k9J73k30M7l4J80
1120D3K00j50J33k90jK2N8o3J7K8K19j78j95J19j6J91r8q5J3K44l44J60R1j68
$$ plain form
1144 -50 36 55 -25 -29 37 9 91 129 -262 0 97 34 59 -156 -163 1 -71 269 191 -42 72 -273 -133 135 -210 50
1170 50 -132 -74 173 -100 -189 -98 163 80 -50 409 64 -160 65 88 -234 -84 69 34 286 -157 -173 166 184
1193 184 -21 -12 105 -180 -207 -32 99 -173 -384 -42 -50 -58 -67 -2 -4 139 218 -258 -191 -13 -33 236 199 46 -47 -44
1219 -44 58 1 36 66 327 -99 60 -272 -80 158 -18 89 69 115 -172 -94 91 30 -24 -38 74 -47 63
1242 63 -24 75 16 -395 97 33 -81 -81 -101 -196 -55 22 166 36 -17 -186 29 -120 -219 161 -132 -1 189 68
1266 68 -80 146 149 -48 36 -92 -112 48 -75 53 29 -16 11 -74 57 -33 -50 218 -279 11 -149 -116 -42 -158
1290 -158 -104 -38 -61 -68 93 9 17 249 -171 -155 170 -12 346 -228 27 -156 -189 3 34 79 82 157 -78 -133 -99 -150
1316 -150 -213 -37 149 -312 170 78 -192 -29 116 -41 194 -5 227 132 267 83 -13 -123 76 -23 -133 177
$$ packed form
1144e0Q6J9q0mO6k8Q2L8l91K62R7o3K5k15pJ64p2L40p8k33J14l45J40K68l45K60
1170E0j82N8K47k73q9R1K61q3j30M59l45k24K25K3l22J50J53l5K52m43j6L39J8
1193A84k05RJ17k85k7J75J31k72k11L42qqrO5kJ43P9m76O7J78k0K69l7j53r3L
1219d4J02n7L5L0K61m26J59l32J92K38j76J07k0M6k87P8J85o1n4j4J12j21J10
1242F3q7R9n9m11M92o4j14%k0r5J41P7J44j30n3j69K15j49r9L80k93J31J90j21
1266F8j48K26Lj97Q4j28k0J60j23J28k4m5K7q5J31r0j7K68m97K90j60L3P4j16
1290a58N4O6k3pJ61q4QK32m20J6L25j82L58n74K55j83l3J92L1M5LP5k35n5L4n1
1316a50o3J76J86m61M82r2k70J63J45j57K35j99K32r5J35j84r6j10J99r9j10L10
$$ plain form
1338 177 -76 159 111 71 61 -130 -17 115 -163 -70 147 -111 -228 179 91 -25 27 76 -89 -103 -13 -183 -235
1361 -235 -30 241 71 -46 -16 8 -304 338 -89 -129 -105 68 -151 172 78 -72 -187 -228 -133 -45 64 -93 59
1384 59 145 86 -154 213 291 138 -27 -15 40 -27 52 11 269 -31 56 -69 19 -72 38 -70 -158 -16 -91 105 -104
1409 -104 -30 -194 -43 -71 20 -158 -50 -3 -157 61 41 -93 -46 -253 -46 -138 -263 101 -9 277 -95 106
1431 106 119 65 -14 65 256 142 259 -140 -152 178 142 -105 -137 227 121 76 60 -59 -118 -188 97 211 -20 67
1455 67 47 112 -81 18 -74 -117 -94 -108 -40 122 153 17 163 166 -45 87 -67 -81 88 -87 -311 -122 20 -127
1479 -127 259 154 -135 -177 18 -138 57 -158 -188 50 -237 3 -5 254 138 64 33 -272 -149 -103 23 87 10
1502 10 -72 -289 -30 -181 -15 -83 4 208 -32 -66 -128 179 -25 120 -105 -54 -187 -232 -292 -205 -130 169 -40 -49
$$ packed form
1338A77k53K35m8m0j0j91J13J32k78R3K17k58j17M07q8j16N2M9j65j4R0j70n2
1361b35K05K71j70j17L0K4l12O42m27m0K4J73k19L23r4j50j15m1R5Q8J09j57J52
1384E9Q6n9k40L67P8j53j65J2N5o7P9m1K58l00Q7j25Q8r1J10j08q8J42p5J96k09
1409a04P4j64J51k8R1j78J08M7j54K18k0j34M7k07K07r2j25L64j10K86l72K01
1431A06J3n4p9P9J91j14J17l99j2L30l6k47l2L64j06m5j6j19n9p0K85J14k31Q7
1455F7k0O5j93R9r2m3K3j4O8J62L1j36J46Lk11J32j54j4J69j75k24J89J42j47
1479a27L86j05k89m2J95j56J95k15l0K38k87K40qK59j16p4l1l05J23M6J26O4p7
1502A0q2k17K59j51J66o8Q7K04k40l4o2L07k04J45k25N1j33m5o0Q7P5K99k09r
$$ plain form
1526 -49 29 95 110 -160 -114 -164 9 44 -155 159 -108 203 -168 63 166 -84 -51 17 184 40 -101 -94 -8 15
1550 15 -75 -81 216 128 175 44 -198 -125 -78 28 18 51 -115 252 206 -60 47 154 40 53 31 107 5 35 18
1575 18 16 -86 -187 24 -29 55 169 -27 -10 95 4 -50 -188 -5 -144 -58 93 -178 286 59 55 -10 38 -108
1599 -108 -25 62 6 37 193 -89 -141 65 46 -281 -28 -104 -124 83 -156 38 -104 -407 153 -201 -155 -81 14 -49
1623 -49 29 36 -167 75 158 -71 -6 -164 -193 -58 -17 73 -23 21 57 -72 234 256 -273 -92 91 -82 68 216
1647 216 -112 14 -252 121 -96 -123 104 93 153 -227 -169 137 -14 -28 -167 -15 26 -136 55 -124 -31 13 0
1670 0 10 19 -183 -133 -42 6 231 174 165 -56 -257 -132 -103 -92 57 -35 232 -81 27 39 -86 -87 -253 -180 245 124
1696 124 -285 239 -41 -145 -114 195 39 -154 16 204 -296 107 -40 113 78 -43 -14 94 -8 62 23 -229
$$ packed form
1526d9P8O6J5k70M6n0J73L5j99L14k67L11l71K31J03k50L3O8J67j44j41PQ6K3
1550A5r0oK97q8M7j31k42P3M7J06j0L3j66L67m6k66J07J07j14J3k2P6j02L0j7
1575A8kj02j01K11n3Q4J14j96J7J05r1n4j38J83j39Q6J51k71M64k27mo5M8j46
1599a08Q3Q7n6L1J56k82n2K06j9l27K53p6k0K07k39J94j42l03N60l54M6P4R5o3
1623d9P8Pk03K42Q3k29O5j58k9J35M1R0r6M4L6j29L06K2n29J81J83j73J50J48
1647B16l28J26k66L73k17k7K27j1O0l80N8L06j51j4j39J52M1j62J91j79R3M4j3
1670@J0Rk02N0R1M8K25n7rk21k01J25K9J1J49r2K67l13J08J2j25jj66P3M25j21
1696A24m09N24k80j04L1L09j56j93J70J88n00M03j47J53l5j21K9J08j02P0l9k52
$$ plain form
1718 -229 179 -2 -32 3 21 -160 -354 -11 -118 -35 -81 -110 26 123 168 -254 -108 -159 252 21 -70 154 -118
1741 -118 -95 -258 -260 -185 246 -28 -25 -59 10 76 2 219 99 -44 34 -94 -52 2 -65 7 -27 124 -261 -42 40 282
1767 282 -80 -162 -64 102 -120 132 21 -174 85 71 135 53 33 -174 136 -173 81 98 -73 -23 39 160 80
1790 80 -160 -70 48 -63 71 -234 -48 178 8 -113 -79 -174 -101 191 380 -66 -165 -194 184 -73 -145 -23 150
1813 150 38 -79 -60 -26 -164 208 -30 90 -35 153 72 -164 55 269 -11 22 179 -89 -36 -52 -12 28 53
1836 53 17 -188 -394 -83 -229 119 301 26 -31 189 -213 -222 11 -83 118 -110 15 -81 -189 -6 6 16 -39
1859 -39 255 -24 -391 182 31 -86 -211 -411 168 -38 31 7 -37 -165 -106 -127 9 140 156 9 -13 -87 -15
1882 -15 99 -35 -122 197 -17 -166 -143 38 -109 -301 269 83 241 235 -177 37 193 -17 52 -125 -137 100
$$ packed form
1718b29M08j81l0L5J8j81j94L43j07Q3m6k9J36R7M5m22J46n1M11k31r1K24k72
1741a18K3j63kP5M31k74Ll4O9O6p4K17j20j43P8j28M2N4o7P2l4J51l85K19Q2K42
1767B82l62q2R8J66k22K52j11j95K59j4O4q2k0k07L10l09K54J7j71N0O2J21q0
1790H0k40R0J18j11J34l05J86K26j70j21L4r5P3K92J89m46r9k9L78k57p2J22J73
1813A50j12j17J9L4j38L72k38J20j25J88q1k36K19K14k80L3J57k68N3j6M0M0K5
1836E3l6k05k06L11j46L48J82k75n7K20m02rK33r4K01k28J25r6j08J83J2J0n5
1859c9K94k79l67N73j51j17j25k00N79k06O9k4m4j28N9k1J36J31J6j47k2p4P2
1882a5J14j34q7L19k14j49K3J81j47j92N70j86J58om12K14J56k10O9j77j2K37
$$ plain form
1904 100 95 -61 -25 86 193 -6 -58 -124 28 -77 -57 201 25 -43 29 -297 22 191 137 25 106 -25 -15 -17
1928 -17 -150 68 93 272 -50 -29 110 -23 232 90 -10 34 67 137 240 76 248 -201 -19 179 12 -60
1950 -60 96 -16 94 71 -11 149 290 255 -68 337 -96 178 97 323 -90 -3 -2 -137 -180 134 44 188 153 -167
1974 -167 -1 70 78 51 109 58 81 156 -51 -125 -86 -244 54 30 -233 -19 119 -179 -18 163 118 70 188 -56
1998 -56 -8 -143 35 -1 -98 156 154 -195 65 136 -104 -3 75 -153 196 8 -96 -290 -13 164 -11 175 -35
2021 -35 -84 47 218 47 164 221 174 36 51 149 155 -142 187 -127 17 -177 -19 -47 57 -176 8 -268 50
2044 50 -128 141 79 90 19 -35 -70 -212 -174 33 9 104 3 -104 -67 90 -80 -228 23 4 94 25 57 6 -54
2069 -54 -32 6 -189 92 -67 -100 305 -75 -112 107 -214 54 -193 -188 -29 -126 -139 -94 -110 112 96 22 207 -57
$$ packed form
1904A00nj56L6J11J07j99n2o6J52j05K0K58j76o8P2l26L19J69n4j12Q1j31J0k
1928a7j33K18K5J79l22K1J39j33K55j42j00M4L3P0J03j64J72m49J82J98j67p2
1950f0J56j12J10k3q2J60J41l5l23M05m33K74q1K26m13Q7Jj35m3L14r0J44l5l20
1974a67J66P1Qk7N8n1K3P5k07p4L9j58K98k4k63K14J38k98J61J81m5m8J18k44
1998e6M8j35J78l6r7K54kl49K60P1k40J01P8k28L49j88j04j94K77J77j75J86k10
2021c5m9J31J71j71J17N7m7j38J5R8Ok97L29l14J44j94J58k8J04k33J84k76L18
2044E0j78K69o2J1p1n4l5j42L8K07k4R5j01j07L7J57j70j48K51j9R0o9L2n1o0
2069e4K2L8j95K81j59l3M05l80l7K19l21K68k47NJ59r7j3M5j6K22j6p4J85k64
$$ plain form
2093 -57 -50 -8 -99 -5 -82 -62 66 -16 -41 -118 30 -78 36 126 43 94 -166 -82 -95 -106 120 129 -137 -14 -261 185
2119 185 199 -83 63 -140 -162 337 -34 -49 142 272 175 107 236 -155 -7 -139 73 206 -8 26 -66 136
2141 136 176 48 169 -69 34 174 73 -98 85 -68 -251 60 -18 160 72 -134 -42 -81 129 79 -118 26
2163 26 80 138 -123 193 -169 -166 11 -96 102 -63 24 -99 83 186 85 138 -128 104 63 85 -126 -172 -233 54
2187 54 -33 -34 -151 254 207 -92 -51 -64 -4 -32 9 -86 51 153 153 -271 72 129 -46 135 29 -151 51 -116 15
2212 15 166 -184 -28 63 85 39 -331 1 -160 -27 138 -191 45 -250 -36 -12 115 -221 127 56 107 407
2234 407 -9 -48 -131 -20 48 -52 -30 181 46 -82 -205 49 -78 -235 62 230 176 -64 -163 28 -9 -117
2256 -117 -11 -36 28 100 240 -14 -86 -172 150 81 31 271 3 -55 -45 -82 -132 -175 244 -72 -121 151 -153 -25
$$ packed form
2093e7PM2r1R4p7K0J28q2k5p7J48j08J14R0q3N1k60Q4j3j1K26Rk66J23k47M46
2119A85J4k82J46k03k2M99l71j5J91J30r7o8J29l91J48j32K12J33k14L4r2K02
2141A36M0j28J21k38J03J40j01j71J83j53j83L11p8J78q8k06R2l9K10n0j97J44
2163B6N4N8k61L16l62LJ77j07J98j65Q7j23J82J03j01N3k66K32m1K2k11m6o1K87
2187E4q7jj17M05m7k99M1j3O0k8M1r5J37J02%m24L43N7j75J81j06j80K02j67J31
2212A5J51l50J56R1K2m6l70L32j61J33J65l29K36k95K14K4J27l36L48p1N1L00
2234D07m16l9q3J11O8j00K2K11j35j28j23K54j27j57K97J68n4k40r9J91l7j08
2256a17J06k5O4P2J40k54p2q6L22o9n0K40k68n8J0l7n0m3M19l16m9K72l04J28
$$ plain form
2280 -25 19 70 76 99 -46 -95 71 62 31 -87 -99 -21 -2 357 58 -40 -34 -94 271 -208 153 -24 74 140 -64 36
2306 36 164 230 -60 -38 -68 -180 142 24 -199 256 116 92 -14 -210 44 -21 -188 300 -7 -17 -203 213
2328 213 -81 24 42 -180 26 95 28 77 -23 -112 53 88 -182 -183 84 27 -74 -14 -200 225 270 196 1 18
2352 18 76 72 220 132 127 -20 14 -274 -129 8 -305 23 80 210 190 12 -137 -115 142 -72 107 -6 -82 21
2376 21 58 117 -214 -105 48 41 -54 376 6 267 -118 67 3 -65 293 45 23 -52 -41 -93 -29 217 84 16 -209
2401 -209 54 55 -178 166 167 256 106 146 -55 184 -25 -93 -138 -3 -24 -14 -160 74 -221 52 193 -30 -153
2424 -153 -330 13 257 109 -190 115 -60 -133 65 -128 -31 66 -79 -38 5 14 -179 -13 -114 -201 -27 -157 -32
2447 -32 99 -147 38 67 -184 -48 48 93 -102 -73 61 -189 -49 -40 -136 47 53 -157 148 -54 102 130 99 -44
$$ packed form
2280b5M4N1OK3j45m9J66rl1j18j2P8J9L59k99r8Oo0L65m79L61j77R8O6k04J00
2306C6J28O6k90K2l0j12L22j18k23M55j40k4j06j96K54o5j67M88l07j0j86M16
2328B13k94J05J8k22K06O9o7M9j00q9J65L5k70jK67n7j01O0j86M25M5p4j95J7
2352A8N8mJ48q8nj47L4k88J45J37l13L28N7J30k0j78j49K2K57k14J79j13p6J03
2376B1L7N9l31J09J53pr5M30l70K61l85J85o4o8L58k48k2p5J1n2O4K46j33o8k25
2401b09K63Jk33L44JQ9j50M0k01K39k09o8m5J35k1J0j46K34k95K73J41k23j23
2424a53j77L43K44j48k99L05j75p3J98j93R7R7j45M1M3Rj93J66j01q7J74j30J25
2447c2J31k46J85K9k51J36R6M5j95K9J34k50J40Rr6J83Ok10L05k02J56K8l1j43
$$ plain form
2471 -44 240 -119 -51 -2 21 163 -64 219 144 50 173 65 -165 34 -100 -24 18 -152 -12 -196 -54 193 -146
2494 -146 108 -100 -208 -121 207 -67 123 -21 -11 8 -277 36 131 13 296 199 -11 151 52 -52 -8 148
2516 148 -54 -143 -106 -59 -32 -63 106 279 84 -194 134 -4 -176 138 -63 -216 110 64 -151 122 176 94 -180
2539 -180 258 14 135 -98 -247 -94 -163 2 -152 51 78 198 8 -6 -2 149 32 -74 121 104 -285 88
2561 88 -9 318 135 91 190 142 91 -33 77 134 123 -33 -41 -41 60 14 -156 -89 118 52 203 -7 85 -181 104
2586 104 -113 -253 17 -26 -98 126 -46 86 209 74 11 48 -118 0 8 -166 91 172 237 4 -54 16 -129
2609 -129 -164 -96 -170 152 21 -152 134 30 16 12 208 117 -116 22 -214 121 -69 -67 -10 -55 -42 -41 -26 -35 189 44
2635 44 225 288 22 -195 -63 114 238 127 -172 -249 -77 -178 -57 -118 -275 -55 60 -23 -15 56 114 58 4 -178
$$ packed form
2471d4K84l59O8M9K3J42k27K83p5r4J23j08k30J99j34P6M2j70J40j84J42K47l39
2494a46K54k08j08Q7L28k74J90j44J0J9k85L13R5j18K83r7k10J62r9j04M4J56
2516A48k02q9L7M7K7l1J69J73j95k78L28j38j72L14k01j53L26m6k15K73N4q2k74
2539a80M38k44J21k33j49J53o9J65j54K03K7J20j90j4MJ51j17j06J95j7l89L73
2561H8r7L27j83m4R9m8n1j24J10N7j1j56q%J01m6j70O7K07o6J51k10R2k66K85
2586A04k17j40K70m3p2K24j72J32J23j35o3L7j66J18Qj74K57Q1O5k33n8P0j45
2609a29l5O8p4L22j31j73K86j04j4mJ96r1k33J38k36L35j90KN7m5J3JJ5rK24j45
2635D4J81O3k66k17J32J77J24j11k99p7J72j01J21o1j57K20J15q3QP1N8n6n4j82
$$ plain form
2659 -178 42 -181 74 153 70 27 224 -22 -164 256 -21 112 224 -59 26 -66 -58 163 48 32 -67 42 304
2682 304 -71 -299 79 -100 -136 -18 120 56 -117 -82 99 -94 27 -306 161 56 -86 -102 -37 -3 56 165
2704 165 27 -65 -175 -45 296 -66 -76 92 -90 195 140 258 43 -70 36 -128 109 -42 -141 118 102 5
2726 5 40 155 212 176 80 -6 207 328 25 -23 161 -26 126 183 29 -12 -45 -45 35 149 146 -43 227 180 -63 58
2752 58 89 63 48 105 -250 226 -215 19 82 -66 -80 -56 -191 52 100 -118 -37 29 -2 48 48 151 -118 61 34
2777 34 -27 13 -78 -19 296 -124 -85 143 4 84 45 5 285 147 63 -272 -94 20 -54 102 -169 85 160 -120
2801 -120 23 -236 -254 3 -25 24 -151 -61 -25 253 -104 -52 -80 -242 93 -84 -30 -241 -61 39 -87 50 254
2824 254 -66 -7 118 -55 -191 -95 38 72 -87 4 -8 89 -64 -17 52 156 -69 20 174 5 185 -175 -35
$$ packed form
2659a78K20k23K55P9q3m3J97k46j42M20k77J33J12k83Q5r2QK21j15j6r9J09K62
2682C04l75k28L78j79l6J18J38o4j73L5J81j93J21l33M67j05j42j6O5L4N9J09
2704A65j38r2j10J30L41l62j0J68j82K85n5J18k15j13J06j64K37j51r9K59j6r7
2726EL5J15N7l6r6q6K13J21l03m8J84j87J52N7j54m1l3%Q0J14lj89K70m7k43J21
2752E8L1k6j5N7l55M76m41K34O3j48j4K4j35K43M8k18Q1O6l1N0%J03k69J79k7
2777C4o1M0r1N9L15m20L9K28j39Q0l9m0K80j38q4l35J78J14p4J56k71K54P5k80
2801a20J43k59j8K57k8M9j75R0L6K78l57N2k8j62L35j77N4k11J80J00j26J37K04
2824B54l20N9J25j73j36R6J33L4j59R1j2R7j53M7O9J04k25Q9J54j69J80l60J40
$$ plain form
2847 -35 -311 -104 -373 -17 -22 217 152 78 -101 -177 137 202 -62 -25 6 109 -57 -136 32 -20 -205 -45 63 -11
2871 -11 46 -93 1 -124 -66 -79 149 -113 -51 -16 -188 -108 -1 -191 -130 -45 -250 -44 -205 227 38 191 -108
2894 -108 -120 -93 29 38 137 60 112 258 261 160 49 -99 41 97 6 153 -172 9 -167 180 91 16 51 -138 -50
2919 -50 58 -154 -100 -241 112 -47 16 8 97 121 -5 -32 20 -103 -158 -108 -59 -64 29 -26 -33 25 -105 131 -252 52
2945 52 163 -3 139 99 45 -121 -218 22 108 -22 -39 -193 34 -11 80 -42 -29 -42 -47 24 -106 155 49 17 100
2970 100 -354 49 -132 -142 -12 -148 33 19 -99 202 -117 -38 233 -39 115 117 -64 -46 29 98 -290 -2 237
2993 237 86 -3 148 136 -171 93 52 -170 -83 79 -123 0 6 -128 34 41 -53 -120 34 139 84 86 143 117 273
3018 273 -166 83 167 153 -79 -330 -54 -107 -139 256 294 -87 -156 174 -94 -74 126 -88 -7 -136 -212 -124 -30 35
$$ packed form
2847c5k76K07k69L56nK39o5p4j79p6L14O5k64L7L1J03j66p9J68n2j85J60J08p4
2871a1N7j39R4j25N8j3K28k62O2L5j72Q0J07j90O1Q5k05K06j61M32j89J53k99
2894a08j2K7J22RR9p7N2J46Lj01j11j48J40N6r1J47l25J81j76L47q9p5L5j89Q8
2919e0J08k12N4j41L53j59O3qQ9K4j26k7N2j23n5N0M9nR3n5pN8j30K36l83L04
2945E2J11j66J42m0n4j66r7K40Q6j30j7j54K27m5R1j22J3j3nP1j30K61j06l2Q3
2970A00m54M03j81j0J30j36J81j4j18L01l19P9K71k72J54Kj81J8P5O9l88K88K39
2993B37j51q9J51j2l07K64m1k22Q7J62k02J23Oj34J62Pr4o7J54J05n5KN7k6J56
3018B73m39K49Q4j4k32k51K76n3l2L95L8l81o9L30k68K0K00k14Q1j29p6Q8R4O5
$$ plain form
3042 35 -258 -166 286 -42 -63 -45 21 137 -48 -36 -21 -37 146 282 -75 -80 161 -160 97 117 221 83 -59 98
3066 98 -2 73 57 -31 -3 -321 -77 74 29 -60 133 -21 -8 -14 64 74 25 137 150 173 -130 33 -31 -97 -19 -227
3092 -227 -331 221 11 -70 -167 138 109 -116 -173 13 164 -41 86 -12 -51 76 1 144 116 -190 221 27 113
3115 113 -210 53 -153 145 81 137 90 -77 -88 -26 -217 145 -153 75 150 -96 215 64 71 99 -35 -12 -78 -167
3139 -167 -63 -66 -191 -77 100 -61 -215 118 48 -25 90 71 73 158 176 161 15 -35 -43 -1 113 -146 78 15 -280
3164 -280 -107 -91 -104 18 146 106 -80 -44 -91 -67 -98 -20 -107 -82 265 -195 92 -15 39 16 341 -76 56 24
3188 24 -98 -13 -110 120 -2 -37 20 -149 -72 109 61 -85 147 -86 -35 159 -270 43 92 -49 -146 146 151 -223
3212 -223 14 84 -50 -72 -22 100 125 31 -67 -130 80 -7 -187 248 -186 -103 56 119 187 -163 -30 -84 -66 244
$$ packed form
3042C5k93R2M52l28k1J8O6J16j85J2J5j6J83J36l57nK41l21K57K0J04j38j42J57
3066I8j00P5j6q8K8l18K44J51m5q9J93j54J3oP8J0m9J12J3K3l03J63o4o6P8k08
3092b27j04N52k10q1r7L05k9k25n7J86J51k05J27r8l9J27p5J43k8l06M11j94Q6
3115A13l23K63k06K98o4N6m7j67j1O2j91L62k98K28P5k46L11j51PK8j34K3o6q9
3139a67J04lj25J14J77j61j54L33p0p3J15j9KQ5J8j5j46n0qM2J14k59K24o3k95
3164b80J73J6j3J22J28m0j86L6m7K4l1P8q7K5L47m60K87j07N4k3L25m17J32l2
3188B4j22Q5r7K30j22l5N7j69P7J81m8j46K32k33N1J94m29L13M9j41r7K92Nl74
3212b23K37P0j34k2N0J22K5r4r8o3K10q7j80M35m34Q3J59O3O8l50J33n4J8L10
$$ plain form
3236 244 -273 106 277 13 -252 -61 -26 -190 -215 44 4 -131 -13 -95 71 -33 7 -222 189 -75 -98 127
3258 127 -86 201 32 139 -79 28 -84 140 -91 -135 77 216 37 180 22 -26 47 217 -162 -45 107
3279 107 -7 -58 -219 -107 -1 -240 -10 265 -78 -19 50 150 -110 -10 -103 9 228 50 -29 14 -4 -246
3301 -246 -139 55 189 63 -117 -115 33 -124 158 -58 116 -32 -45 13 -98 91 -168 127 132 143 -179 -79
3323 -79 39 135 -189 -153 113 26 -131 117 -97 -10 105 54 -208 -73 -41 -68 -76 101 -120 108 84 -51 70 -17
3347 -17 -37 -72 -58 61 301 -239 -148 73 -3 -21 -298 -93 -145 218 24 47 -187 204 -313 -53 50 -123 184
3370 184 -220 -17 170 227 -44 138 205 -94 -151 -39 -253 -175 16 -101 -36 66 -2 102 -11 -272 16 -75
3392 -75 146 54 109 -78 -329 61 -60 -67 32 62 -131 137 168 -69 34 -112 -192 -26 116 -72 -66 -229 -79 108
$$ packed form
3236B44n17L79J71k64k65J91L5j64k5K59m0j35J18q2J66j04M0k29M11k64k3K25
3258A27k13K87j69J07k18J07j12K24k31m4K12J39j79J43j58m8P3J70l79J17J52
3279A07j14n1j61J12J06k39K30K75l43N9O9J00k60J00r3J12K19j78p9M3j8k42
3301b46J07J94J34j26j80KJ48j57K82k16J74j48j3N8j11J89k59K95NJ1l22J00
3323g9J18R6l24L6K66q7j57K48k14Q7J15n1k62J35L2k7qJ77k21K28k4j35J21q7
3347a7k0l5J4J19K40n40R1K21p6j8k77K05n2L63j94K3k34L91n17K60J03j73L07
3370A84m04K03J87N7k71J82O7k99n7J12k14P8J91j17O5J02o8J04j13k61K88r1
3392g5K21r2N5j87k51L90j21pR9L0j93K68L1k37J03j46q0J66J42j88Oj63J50J87
$$ plain form
3416 108 -250 37 -30 -38 28 -222 29 -26 -124 146 -158 56 88 206 -18 69 43 -26 25 -141 13 64 -54 184
3440 184 113 -8 36 -55 315 56 -136 33 -14 -368 -16 -111 36 -148 -38 141 87 -82 -155 -45 27 132 86
3463 86 -3 -249 -90 89 101 -372 -254 -183 174 -237 83 16 -273 -50 49 62 88 -205 -131 33 -40 61 53 -99
3487 -99 -78 -92 93 16 -392 83 97 260 -51 50 244 -405 -148 53 10 42 57 182 90 154 -107 34 82 77
3511 77 221 105 -47 81 -97 179 187 -74 -133 144 211 9 20 -191 -168 -59 -11 14 -137 -214 -49 156 -108
3534 -108 -204 -198 137 155 54 -153 -2 316 47 -2 -116 13 -198 -57 18 -11 108 142 -67 66 37 -7 154
3557 154 -9 61 36 58 88 -102 83 -91 -129 91 88 212 64 91 -36 10 130 -6 38 -249 -92 106 36 -30
3581 -30 -112 -242 -136 -47 31 -69 -30 75 -59 31 -89 -236 -227 -100 250 64 -23 -115 67 -120 -61 -83 -116 -11
$$ packed form
3416A08l58K87o7qO6k50K51n5r8K70l04K14L2J18k24Q7k6o9N1j66J54N1j18K38
3440A84p1j21M4r1L70k59j92J69m7l54L52r5J47j84J10J79n4j69p3J10P2J05m6
3463H6q9k46J59J79J2m73J18P1L57m11L20o7k89K23R9J3K6k93P4J64p3J01qj52
3487i9K1j4J85p7m08M75J4J63l11J01J94o49K57K01m3L2J5J25r2O4k61J41M8n
3511G7J44j16j52J28j78K76Qk61n9K77O7k02J1k11K3J09M8K5j51p7J65K05k64
3534a08r6OL35J8j01k07J51L18k69m9j14J29k11J41P5k9J19L4k09J33k9m4J61
3557A54j63P0k5K2L0j90J85j74l8K20lJ24j48K7j27M6J20j36M4k87J57J98p0o6
3581c0q2j30J06Q9P8j00L9J05j34R0j20j47RJ27L50j86q7r2J82j87N9k2l3J05
$$ plain form
3605 -11 167 123 -171 -37 -34 -23 298 -65 -277 -49 55 -192 24 148 62 189 -93 -11 49 -59 89 -113 -136
3628 -136 15 -166 -145 -113 -52 38 93 -172 -185 31 149 -13 211 1 -142 -109 -6 61 93 -5 -37 -91 132 18
3652 18 145 -62 2 106 -256 -106 -161 47 -147 -70 161 47 99 -116 -167 -70 -105 119 201 -123 113 171 295
3675 295 315 -65 66 30 11 4 -81 133 -81 70 156 -63 -176 8 -73 80 234 -16 156 245 59 -150 -206
3698 -206 8 50 4 9 -73 290 37 176 -71 200 -39 32 154 170 -41 -62 114 170 -2 -250 42 -107 -176
3721 -176 113 25 46 150 74 99 38 277 25 -121 13 15 -239 -81 66 103 -136 95 335 -93 -170 -135 6
3744 6 -1 -71 -8 -307 -105 -12 72 32 -87 24 208 124 144 57 -24 56 -305 120 -23 31 35 63 60 -45 -226 -213 -65
3771 -65 -68 290 75 64 -19 -33 100 124 137 -96 269 -27 57 -67 -74 -25 178 26 -1 134 -22 134 -42 -16 -276
$$ packed form
3605a1J78m4k94J34LJ1L21l63k12K28J04k47K16J24q6J27k82Q2O0j08J48k02k3
3628a36J51j81K1L2O1R0N5k65j3K16J18j62K24k10j43L3J03O7L2r8l2n4K23j14
3652A8J27k07O4J04l62J50n5K08j94P7K31j14N2k15n1R7l5K24Q2l24K36N8J24
3675B95K0l80J31l6j9pq5K14k14J51Q6k19j13J84q1J53J54k50J72Q9j86k09n6
3698b06K14M2m6Nq2L63k53J39k47K71k39P1J22J6k11k1J76N6j72k48K92j49o9
3721a76K89q8K1J04p6K5o1K39k52j46J34Kk54J58J47L7k39K31K40m28p7L5J41
3744Fpp0O3k99K02R3Q4m0j19J11J84q4K0q7q1Q0l61M25j43N4MK8lj05j81J3J48
3771f5lL58k15j1q3j4J33K4J3k33L65k96Q4j24pM9K03j52k7J35j56J56j76K6k60
$$ plain form
3796 -276 186 -147 136 -185 -15 -23 -6 189 187 481 126 -10 164 205 -185 187 -178 -92 36 171 -19 -98 -137
3819 -137 65 -4 9 -131 106 322 205 138 -119 -113 -224 -93 -41 -241 -39 -52 71 -102 9 -19 4 -121 112
3842 112 79 -114 141 20 101 249 -21 -71 -6 -110 61 -83 -126 -60 126 109 53 319 -105 134 -2 160 -62
3865 -62 -10 113 89 86 -200 -13 -107 37 -69 -333 58 -61 -171 138 57 117 153 192 -139 101 -68 -194 -193 -1
3889 -1 4 17 59 336 294 -136 -200 -99 -112 -10 -290 -217 38 -53 105 -53 -44 90 26 171 -120 -191 8 -88 -82 269
3915 269 -71 -232 219 47 73 104 -97 89 355 -50 182 -166 282 -52 -111 78 170 -26 85 210 -28
3936 -28 -89 -25 -21 -41 -66 73 226 -32 93 97 -85 31 29 1 445 22 77 -149 83 129 -32 183 21 117 70
3961 70 64 -115 -177 -67 240 -239 -118 35 -77 -106 -2 35 -209 180 103 -284 -228 192 1 -79 193 140 86 281
$$ packed form
3796b76M62l33K83l21J70qJ7J95kK94l55j36J74M1l90L72l65Q6J28J35j90p9l9
3819a37K02o9J3j40K37K16j17o7k57Oj11J31N2k00K02j3J23j73J11k8K3j25K33
3842A12l3j93K55j21Q1J48k70n0O5j04J71j44m3O6J86j7n6K66m24K39j36J62k22
3865f2N2J23k4lk86J87r4J44j06k64L91j19j10L09q1O0L6L9l31K40j69j26JJ92
3889aNJ3M2K77m2m30o4J01j3J02k80P3K55r1J58j58RJ34o4J45k91p1J99r6OL51
3915B69l40j61M51j72K6L1k01J86K66m05K32l48M48l34n9J89R2j96J11J25k38
3936b8o1O4Mk0k5J39J53k58J25Mj82J16kk8M44m23N5k26K32M6j61K15j62R6m7
3961G0oj79o2J10L07m79J21J53j12k9J04L7k44L89p7l87N6M20j91q0K72n3n4J95
$$ plain form
3985 281 96 202 81 194 16 -56 -148 -84 -9 -214 -16 -62 -1 228 137 2 -48 69 -129 -97 -16 28 157 73
4009 73 39 -167 36 -6 78 -12 -277 -115 -108 -13 73 41 47 5 32 -153 -22 -171 10 -97 -229 290 230 -28 41
4034 41 -75 62 -26 143 3 -175 206 -104 185 -87 53 -12 -28 108 -57 88 -169 -211 171 14 -206 73
4056 73 27 -85 -24 119 29 -73 78 128 -107 124 -113 83 223 208 -6 -53 50 -48 -34 -56 -25 -126 123 -309
4080 -309 -50 -174 -97 -110 -5 89 -93 -109 -36 150 41 186 -34 210 108 -122 143 -78 -189 9 72 -20
4102 -20 -136 -35 -37 79 15 -23 -65 -8 -149 173 39 -229 -3 -42 -70 -130 -54 93 238 -66 22 37 -7 -83 22
4127 22 55 55 -89 -223 102 -13 23 1 -281 93 40 -96 114 -19 -41 16 9 -45 26 -154 111 -243 123 -35
4151 -35 -97 147 -78 197 61 164 34 -207 105 42 -15 -56 234 141 -7 -142 -123 213 -68 202 155 -119 -72
$$ packed form
3985B81j85J06j21J13j78p2r2O4P5k05J98m6O1K29r1j35n0J17j98L2Q1M4J29q4
4009G3l4k06K03m2Q4r0k65J62PR5Q6l2Om2K7j85J31j49J81j07j32N19o0k58O9
4034D1j16J37q8J69j40j78L81l10K89k72J40o5j6J36j65J45k57m2L82j57k20K79
4056G3m6j12O1J43r0j02J51N0k35K31k37J96J40j5k14m7J03r8J4k2L1j01K49m32
4080c09K59j24P7j3J05R4j82j6P3J86j09J45k20K44j02k30K65k21j11J98O3r2
4102b0j16J01kJ16o4l8m2N7j41L22j34k68K26l9k8o0P6J47J45l04Q8J5m4p6J05
4127B2L3%j44j34L25j15L6k2k82L74n3j36K10j33k2N7pn4P1j80K65l54L66j58
4151c5o2K44k25K75j36J03j30k41L12o3n7m1K90r3j48j35J9L36k81K70m7k74M7
$$ plain form
4174 -72 -49 -190 195 158 102 -125 -89 -237 199 163 137 -124 46 -36 -53 190 -170 71 -107 -68 116 -19 241
4197 241 100 -59 -89 -68 41 18 -117 40 -21 -214 -30 168 78 -248 126 293 -169 -85 91 -5 -139 139
4219 139 -33 164 -69 -7 -58 -63 -121 54 -116 -18 -42 -87 -245 -230 99 0 64 -141 266 239 163 -12 -74 -111 -102 -253
4245 -253 31 -74 -64 -71 -66 -150 -155 -158 172 153 -110 56 71 142 68 -111 -88 95 45 -2 -153 -108 148 -10 -217 -39
4271 -39 -69 105 -292 334 122 -54 128 -243 35 -67 88 -120 -137 3 62 -87 -53 65 5 151 77 -104
4293 -104 427 65 234 214 79 83 147 -30 286 -35 -241 17 -5 -1 19 67 -33 -57 79 81 -110 123 -21 -105
4317 -105 181 -71 -215 -68 0 124 190 178 131 152 239 -71 -91 214 92 -512 -287 13 62 95 -243 -77 -312
4340 -312 94 -203 -101 -186 1 36 -74 135 -8 -10 -213 128 -34 -80 101 25 -220 31 -49 137 3 -169
$$ packed form
4174g2K3j41L85l7n6k27L6j48M36l6k6k61J70q2j7K43l60K41j78L9J84j35K60
4197B41j41j59l0K1J09k3j35J57o1j93J84J98r0l26L74J67m62Q4J76r6j34K78
4219A39j72J97k33O2n1nn8J75j70R8k4m5j58J5L29r9O4k05M07k7p6j75o2l7Rj51
4245b53K84j05J0pNq4nlL30j9k63J66J5P1p4j79K3J83n0m7j51M5K56j58k07J78
4271c9l0J74l97O26k12j76J82l71K78j02J55k08j7J40N9j49L4J18o0J46p4j81
4293a04N31l62J69k0j35MO4j77L16l21k06K58k2MK0M8j00k4J36Kj91K33j44q4
4317a05K86k52j44J47O8J24O6j2m7K1Q7l10k0L05j22o04K25L00M9L3l38J66k35
4340c12M06k97J02q5J87L5j10K09j43kk03L41j62m6J81p6k45K51q0J86j34j72
$$ plain form
4362 -169 -197 236 -37 -96 -54 72 207 -75 -69 270 -122 -116 256 -121 -177 85 267 -82 179 54 217 -213 50
4385 50 101 -250 -3 93 -97 -41 52 -80 61 67 -142 43 0 38 99 -338 82 -84 -230 40 40 -28 -180 -115 126
4410 126 62 -163 215 62 -221 -134 76 -198 31 -162 -41 -152 125 -31 75 -36 8 113 190 -23 -66 -31
4432 -31 -29 90 53 -174 150 65 83 156 -42 19 45 -39 53 -75 -8 133 32 49 148 22 -1 -36 -124 69 -63 158
4458 158 -184 -69 -71 -274 183 191 26 -204 -67 209 -154 237 -4 67 -107 -126 -2 -21 -200 -44 241 212 82
4481 82 111 83 111 -26 176 73 -107 13 -217 -6 84 -79 20 13 86 -16 -68 -80 66 113 320 52 283 150
4505 150 208 -94 -133 -76 115 21 -94 -140 -80 -157 -78 -72 -16 172 -195 -32 -96 134 -7 17 -21 84 161 -38 21
4530 21 -44 -63 -13 193 -1 8 186 241 6 151 -178 -179 -252 -46 120 -193 62 -53 199 271 -25 -70 7 104 -23
$$ packed form
4362a69k8M33k73n9M2J26J35k82OL39l92OL72l77n6K62J82l49K61j25J63m30K63
4385E0N1l51K47R6j90N6R3j32J41Ok09J85m3L8O1m37M20j66j46K70%o8j52O5K41
4410A26o4k25L78j53k83Q7K10k74K29j93J21j11K77j56J06j11M4J05P7k13m3L5
4432c1KJ19l7k27L24q5J8P3j98O1K6q4R2j28O7J41j01J7R9j26k3l5q8J93j32K21
4458A58l42J15kk03M57Qj65k30J37K76l63L91k41P1j74j9J24j9j79J56K85k9j30
4481H2K9k8K8j37K02j03j80J20k30K11R0j63R9pP3j02n2j2J46M7K07k68K31j33
4505A50N8l02l9N7J91r4j15m6O0p7P9ON6J88l67J63o4K30j41K4l8J05P7j99N9
4530B1o5j9N0K06j94RJ78N5k35J45l29jp3K06J66l13K55j15K52P2k96m5P7R7j27
$$ plain form
4555 -23 111 -50 146 116 -88 74 -46 -197 -78 -146 19 50 26 -31 -279 -68 100 -125 81 -84 210 46
4577 46 158 -1 35 -27 -236 -317 -137 10 -251 -17 137 -185 10 -13 -263 -39 -121 117 -129 -70 -134 50 160
4600 160 236 119 167 -109 6 -70 152 135 142 71 79 334 -189 -45 -163 118 -106 -20 -85 37 -80 -40 -136 171
4624 171 105 -5 74 87 -19 175 -70 -217 93 226 98 16 181 -85 -49 11 128 71 -21 18 86 336 -57
4647 -57 -35 51 -102 -81 -229 11 58 178 -14 53 0 -96 -47 243 10 -32 -59 -52 -49 8 29 -147 49 -21 -148 -66
4673 -66 -47 -155 264 -54 -194 -10 86 41 55 88 -23 -16 76 -173 55 -252 79 -101 -39 63 8 -36 105 -110
4697 -110 -3 -81 91 134 161 153 89 -87 198 -160 149 99 -259 -2 -226 0 29 -118 96 243 -163 116 148
4720 148 -90 216 -93 -119 128 232 -54 -23 67 -144 -200 -26 -68 -65 27 -94 26 217 28 -47 -85 -75 -154 5
$$ packed form
4555b3J34j61J96l0k04J62j20j51J19o8J65L1k4n7k48K11J68k25K06j65K94j64
4577D6J12j59L6o2k09q1J80J47k61K34J54l22J95k3k50K24q2K38k46N9o4J84J10
4600A60P6j17M8k76J15p6K22j7Pp1QK55n23J44j18K81k24Q6o5J22j17M0r6L07
4624A71o6j10P9J3j06J94k45j47L10J33j28q2J65k66L6O0J17n7r2L9O8K50l93
4647e7K2Q6j53K1j48K40M7J20j92O7n3r6M9K90k33m2k7PLN7K1j76J96p0j27Q2
4673f6J9j08M19l18j40J84R6m5J4L3j11PR2k49K28l07L31j80O2J02n5m4J41k15
4697a10J07p8J72M3K7qo4j76K85l58L09n0l58K57k24K26K9j47K14J47m06K79L2
4720A48k38L06l09k6K47J04k86L1R0k11n6J74m2LR2j21J20J91j89p5l8J0p9J59
$$ plain form
4744 5 3 103 33 53 46 -115 -90 69 -98 -52 -240 -224 -63 -4 42 60 -28 39 -249 45 -158 142 89 -17 54 -74
4770 -74 -158 -75 -104 -61 220 -12 179 -4 -240 12 42 44 -99 -57 -90 -190 2 -156 -63 -277 243 -58 -67 -64 106
4795 106 -44 103 -14 -119 99 -190 118 -166 287 104 203 -4 -148 178 55 65 -62 225 -103 281 12
4816 12 -57 29 -173 127 39 88 113 43 -37 175 54 -35 -7 -89 -35 123 317 107 -35 116 -21 -13 84 164 19
4841 19 -151 26 -274 -6 171 -30 245 214 -78 -177 -70 -23 -167 -141 -224 115 143 -36 -418 34 -28 -172 -134
4864 -134 77 -59 -133 126 104 119 61 -205 300 -114 -78 63 -34 22 162 -61 -168 63 -3 -163 1 151 -121
4887 -121 43 -55 139 11 111 124 -21 108 50 109 183 97 80 55 -94 -31 -44 -202 40 31 -177 -295 -122 -46
4911 -46 -35 58 165 -135 223 138 25 -212 -70 48 -90 72 112 118 -131 372 141 94 -158 118 -91 154 163
$$ packed form
4744EkJ00p0K0pj61K5J59j67M6j88J6J61N9M6J8q8O7k88K94k03L00n3j06P1j28
4770g4q4Q3k9M3K81k32J91j83k36K52L0Kj43M2l3j00J92j58R3k14N20l01rLJ70
4795A06j50J47j17j05K18k89L08k84M53j83R9k07j44L26j23J0j27K87l28L84k69
4816A2o9Q6k02L00q8M9K5p0q0K12j21q9K8q2N4J58J94k10j42J51j37QR7Q0j45
4841A9j70J77l00K68J77k01K75l1k92r9J07M7j44K6q3L39K8j79l82M52o2j44L8
4864a34K11j36p4K59k2J5n8k66N05m14L6J41r7N6J40k23j07K31o6j60J64J50k72
4887a21J64r8J94j28J00J3j45J29n8N9P4q6j7k5j49O3j3j58K42rk08j18J73P6
4911d6J1R3J07l00L58q5j13k37J42J18j38J62M0Ok49N03k31m7k52K76k09K45R
$$ plain form
4934 163 -183 43 62 -337 231 -110 72 -73 83 103 -317 21 17 186 -69 57 28 -35 237 -159 13 -121
4956 -121 -153 19 -71 -117 218 139 70 160 232 -137 38 95 62 110 29 141 81 -90 -22 135 162 -246 -29 41 157
4981 157 -47 -101 42 -43 -240 -63 250 -251 168 183 -65 -164 114 -277 277 -6 -56 70 -26 -27 39 10 -308
5004 -308 172 -5 -163 -49 -3 -25 59 73 71 114 60 40 332 107 9 -197 201 11 256 -120 -94 -27 -158 182
5028 182 -46 92 -147 137 -98 101 29 237 -139 -138 84 74 38 82 -43 131 75 86 67 92 -208 130 -18
5051 -18 -25 -69 6 87 29 -98 -58 -176 205 56 -103 -138 -53 -141 -110 37 38 -33 -64 -66 195 -48 6 22 -192 -185 -46
5078 -46 244 -163 -366 108 -137 56 -126 83 9 -206 -36 26 -80 155 250 -29 117 -48 109 -167 -3
5099 -3 59 174 -42 106 -23 -41 -100 -96 158 -99 220 147 202 -101 70 204 86 -161 -62 149 -33 -270 -24
$$ packed form
4934A63l46K26J9l99N68l41J82j45J56K0m20L38mJ69k55J26k9o3K72l96J72j34
4956a21l2J72r0m6L35p9o9R0P2l69J75N7l3M8q1J12o0j71O8J57K7m08K17P0J16
4981A57k04n4J43q5j97J77L13n01M19J5k48r9K78l91N54k83n0J26r6jO6k9l18
5004c08M80j77j58J14M6k2Q4J4kM3n4k0K92k25r8k06L98j90K45l76K6O7j31L40
5028A82k28J38k39K84k35J99p2K08l76JK22j0l6M4j25J74n6J1j9K5l00L38j48
5051a8pm4P5Q1n8j27M0j18L81j49j59l5Q5q8L1J47Jp1l1kK61k43N4J6k14PJ39
5078d6K90m07k03M74k45J93j82K09p4k15J70O2j06K35R5k79J46j65J57k76J64
5099cO2J15k16J48j29j8n9MK54k57L19p3N5l03J71J34j18k47R9K11j82k37K46
$$ plain form
5122 -24 -113 150 -141 103 3 391 177 -156 -37 42 192 -140 -178 -120 42 38 -43 -79 24 32 -20 -165 -111 -32 -215
5147 -215 26 -43 85 7 -15 -45 -9 -110 -67 -60 -13 158 123 -9 34 -266 -150 -5 -193 58 -3 -107 -19 163
5171 163 -46 -226 14 169 -41 104 -57 159 -67 61 -50 39 -71 358 95 -118 -185 -173 337 -50 -93
5192 -93 -206 94 -1 -62 89 -288 125 16 157 -85 165 -73 330 58 -250 97 192 55 -72 4 -42 79
5214 79 14 15 158 73 -14 -245 -68 311 -97 -107 24 -16 165 69 57 -66 -81 35 109 102 34 -59 -44 61 -151 -71
5240 -71 -50 -253 -19 142 -40 167 62 -36 83 155 126 -100 33 13 86 -54 65 -193 175 -109 112 81 -10
5263 -10 10 -21 -74 142 -90 112 -71 78 -87 -165 -218 8 -28 -123 -77 33 250 -106 5 11 17 -73 165 118 144
5288 144 -96 -117 -111 43 -245 -87 -41 -16 161 -203 57 148 -13 27 193 237 60 134 -34 37 -82 -180 32 -195
$$ packed form
5122b4q9K63k91K44j00L88k14l33J19P9J50l32l8N8J62mq1l6J03Qn2j45N4P9j83
5147b15K41o9J28p8k2l0L6j01M3PM7J71l5j32M3l00J16J45j88K51o1j04Q8J82
5171A63k09j80K40J55k10J45j61K16k26J28j11Q9j10M29k63k13o7J2N10l87m3
5192i3j13L00r5o1J51l77M13j09J41k42K50k38M03k72l08L47R5j37j27P6m6J21
5214G9o5JJ43q5q7k31J77L79m08j0J31m0J81r6j2j23j5J16P4po8r3J5J05k12Q0
5240g1K1k03K34J61j82K07j05r8J19P2k9k26J33k0P3j40J19k58L68k84K21l1r1
5263a0K0l1n3K16k32K02j83J49j65p8n3K26l6r5M6J10K17l56J11OOr0K38m7K6
5288A44k40k1OJ54k88J58M6K5J77l64K60R1j61M0J66M4j77P4j68P1j19r8K12k27
$$ plain form
5312 -195 -239 -150 -28 87 157 -185 -19 66 -3 -16 -32 -31 233 41 -16 -33 -112 123 33 63 207 -173 -31 -61 -101
5337 -101 97 129 -114 -68 -34 174 1 120 24 92 13 -72 -18 -86 -68 -12 -32 30 -28 -159 96 -23 -167 8 340
5362 340 177 32 5 4 106 -92 53 70 -217 -76 -7 61 -154 -269 -80 4 80 60 -163 62 -53 150 90
5385 90 58 -103 124 106 -12 146 43 56 0 -24 120 -384 -135 9 43 -9 59 -183 19 -24 50 -215 -180 -58
5409 -58 -143 -18 36 34 -313 126 -254 110 42 62 -87 -124 -124 -157 -65 94 -86 109 -82 -5 20 5 121 145 89 104
5435 104 60 80 -212 109 130 -86 88 -138 118 -90 30 208 62 24 61 -117 46 -63 -52 -24 145 -4
5457 -4 68 -46 387 12 84 322 109 26 83 160 -221 23 -207 -62 105 163 -41 112 -164 171 -130 -126 34
5480 34 -100 238 -31 -85 -67 37 -6 -3 -70 25 -50 -163 -37 -53 102 32 40 180 -120 -185 11 186 24 94 77
$$ packed form
5312a95m4Q9J22J15P0l42J66Q5o9j3j6JK64j92n7j7p9K35r0L0J44l80J42l0m0
5337a01J98L2k43M6L4K08j73J19r6O8p9q5N4o8J8N6k0O2n8j31K55j19j44J75L32
5362C40j63j45k7jJ02j98J45J7k87J41O9O8k15j15J89Q4P6k0k23K25j15K03o0
5385I0l2j61K27j8j18J58j03J3n6k4J44n04K49J44L4n2O8k42K02m3P4k65L5J22
5409e8q5J25N4kl47M39l80L64o8K0j49l7%l3R2J59j80J95j91P7K5j5J16K4n6J5
5435A04m4K0k92L21K1k16J74k26K56k08J20J78j46l8L7j78J63j09J1K8J69j49
5457dP2j14M33l75P2K38k13q3N7P7l81K44k30J45J67N8k04J53k76L35l01MJ60
5480C4j34L38k69n4J8J04m3Lo7R5p5j13J26j6J55p0QJ40l00o5J96J75j62P0j7
$$ plain form
5505 77 -184 -187 -148 -46 -152 -217 24 -75 -65 196 -111 100 -175 -114 -182 -122 15 13 23 134 -127 69 84 -121 -70
5530 -70 -162 -109 -131 -61 82 108 -36 -117 279 -95 -87 -273 -73 97 25 147 -209 -178 -44 -122 -250 -183 143 -200
5554 -200 -191 70 137 258 -222 123 16 38 43 176 -44 -29 -247 46 -77 9 -11 127 -58 -42 -29 -155 308 -67
5578 -67 42 202 -41 -142 -101 226 -142 14 271 -79 -44 -56 48 -50 -146 39 48 99 169 79 -40 -208 100 18
5602 18 114 -152 56 -14 126 103 -23 202 -65 -122 117 47 -123 -280 40 289 -17 7 202 25 -135 -40 59
5625 59 -237 -52 -204 58 -49 124 10 99 44 67 -190 -219 -187 51 -19 317 164 -2 143 -31 86 -74
5647 -74 -129 -75 -134 -171 169 81 37 -83 -137 -62 76 81 -77 131 89 111 111 -195 272 -123 25 -32 -94 41 58 -89
5673 -89 -137 -179 49 37 171 -19 51 179 39 183 17 -124 -95 -144 43 82 -241 44 -71 -14 157 -136 -68
$$ packed form
5505G7k61lL9J02j06o5K41r9J0K61l07K11k75O1o8O0J37kJ0J11k61J96J5k05N1
5530g0r2N3k2P0J43K6j44q1L96l74Qj86K00J70p2J22l56L1J34p8j28O7L26l43
5554b00RK61O7J21m80L45j07K2NJ33k20J5k18K93j23Q6k0J38j85J6J3j26M63l75
5578f7J09J60k43j01M1L27l68J56K57l50L5j2J04r8r6J85RN1P0r0j19j68L08q2
5602A8R6k66K08p0J40k3j26K25k67n7K39p0j70j57L20K49l06K4J95j77j60R5R9
5625E9k96J85j52K62j07J73j14Q9n5K3k57k9L2K38p0L36j53j66J45j74J17j60
5647g4n5N4n9l7L40q8m4j20n4P5J38Nj58K08m2K2%l06M67l95J48n7o2J35J7j47
5673h9m8m2K28j2J34j90P0J28j40J44j66j41K9m9J87L9l23K85j15N7J71k93O8
$$ plain form
5696 -68 -4 -53 149 -66 83 149 46 -91 -28 -50 -58 103 146 137 -249 -69 -127 8 -240 -292 21 -5 -26 133 -189
5721 -189 -78 89 -36 54 54 86 -4 174 -49 45 -274 -98 34 99 111 -61 159 2 35 83 -248 -26 -148
5744 -148 136 -97 -65 60 -91 -131 290 -103 -102 90 -57 32 -111 43 -100 -181 -304 -285 -30 -60 142 87 53
5767 53 34 -39 -133 -151 228 99 -160 -35 -85 140 -83 86 -132 -35 173 -300 232 -7 143 224 98 -155 -99
5790 -99 -73 38 -44 -129 -165 1 -152 2 80 -128 148 -210 347 -127 -102 147 117 81 203 -47 193 241 18
5813 18 110 -78 -8 -126 -21 -223 -29 158 -70 255 130 -61 -350 -51 -46 4 -7 -41 5 227 -69 -56 -27 -79
5837 -79 106 -22 -288 7 193 171 -74 -5 -88 98 -308 226 -156 -79 -149 -1 66 -61 36 -161 26 41 218
5860 218 -14 182 66 82 -89 -5 30 25 238 -120 149 40 79 40 -69 143 -254 -55 123 -41 156 -11
$$ packed form
5696f8O4m9K02k15J49O6j03j37O3k2qJ61M3rl86J80n8J35k48n2L13k6k1J59l22
5721a89J11J67j25R0%L2r0J78k23R4l19J76J32O5J2j72K20j57L3M8l31K22j22
5744a48K84k33L2J25j51m0M21l93JJ92j47Q9j43J54j43q1j23J9K55l0K02n5l4
5767E3j9p3r4j8L79j29k59J25n0K25k23J69k18R7K08m73N32k39J50Q1j26k53N6
5790i9K6J11q2q5l6J66j53J54P8k08K76l58N57m74K5K49l0l6J22k50K40M8k23
5813A8R2j88P0j18J05k02J94J87k28L25j25j91k89K99NN0j1l4M6K22k96J3K9n2
5837g9J85j28k66K95J86k2k45O9q3J86m06N34l82P7p0J48O7j27R7j97J87J5J77
5860B18k32J96j16J6j71Q4L5nK13l58K69j09L9l9j09K12l97J99J78j64J97j67
$$ plain form
5882 -11 21 -181 -80 201 -1 20 -76 10 102 -168 44 -35 -227 96 166 143 11 219 -77 -70 135 18 61 -88
5906 -88 -189 -255 68 207 -73 -63 -192 67 71 -33 -48 -23 -40 -104 -44 -60 46 -6 103 -149 -90 61 -153 -23
5930 -23 -156 -96 -57 262 80 33 149 -10 23 -12 -127 -34 4 73 -119 -31 20 -123 170 -119 233 -83 35 -25
5954 -25 62 -113 52 334 22 95 38 -116 46 29 -1 -286 -42 58 22 -42 224 22 4 64 -82 -264 -23
5977 -23 -15 123 -110 259 29 -64 196 -145 -26 -63 -312 -133 -1 38 -10 -19 20 37 -71 51 220 -30 16 10 -113
6002 -113 -46 -114 -25 68 35 137 -118 14 90 -7 121 144 21 138 -127 -239 -149 37 38 85 -6 28 1 -19 -73 -187
6028 -187 -164 250 -69 -10 143 124 113 60 165 -93 -87 78 -209 -103 338 -152 95 -156 -56 32 -24 -150 41
6051 41 -25 -257 10 88 -41 197 92 125 -115 -32 33 38 23 74 43 26 228 -33 -70 48 -69 57 -91 -39 -90
$$ packed form
5882a1L2k02J01K81k02K1r6Q6R2k70K12p9j92L23P0k3j32K08k96PK05j17M3j49
5906h8j01o6L23J39k80J0j29K59Mj04j5K5j7o4O0j6J06n2J09k52N9J51k14J30
5930b3j33O0L9L19j82m7J16j59L3l5j15R3L8O9j92Q8N1j43K93k89L52l16J18o0
5954b5Q7j75J65K82l12P3n7j54J62j7l0k85K44J00l6o4K66k02j8O0j46j82K41
5977b3QJ38k33L69k30r3K60l41J19l7k49J79J32L9m8rL9J7j08J22J69k50M6oj23
6002a13O7o8Q9R3l3J02k55J32P6r7J28K3j23J17k65j12R0J86JM7r1L4k7k0n4j14
6028a87K3M14l19N9J53j9j1n3J05k58OJ65k87J06M41m90K47k51J00Q8n6j26J91
6051D1o6k32K67P8j29K38j05L3k40Q3O5Nj5N1l1j7K02k61l7J18j17J26j48N2n1
$$ plain form
6076 -90 48 108 -108 117 113 -90 175 47 105 42 204 -82 40 -107 -155 51 -95 302 -146 -213 187 18 24
6099 24 271 43 40 -122 120 -31 -86 44 78 19 276 96 -86 79 114 -49 23 -209 1 -5 -176 -21 140
6122 140 -25 -70 -185 56 -153 187 -112 -247 -11 13 -168 11 -76 89 -11 -28 121 -151 -227 -100 270 -7
6144 -7 230 110 -22 -259 108 69 -43 -344 -379 -227 -65 30 132 -61 17 -55 255 -152 54 155 -84 16
6166 16 63 -83 1 191 -142 116 -18 18 -17 21 98 -217 -171 10 389 161 -140 -21 141 110 6 -241 -70
6189 -70 -189 53 197 -116 57 196 52 -131 -98 81 -202 57 47 -124 -12 65 115 -178 0 22 36 -222
6211 -222 290 -181 -173 -167 115 -29 53 132 -63 113 -205 -72 -78 -34 -163 -189 -42 27 93 -207 85 -110 -122 -54 -197
6236 -197 74 19 -254 102 -315 176 183 -123 313 -19 -50 -111 53 103 32 72 150 -96 254 -40 -111 -49 212 59
$$ packed form
6076i0J38O0k16K25mk03K65j28N8o3J62k86J22j47m8K06j46L97m48o7M00j69O
6099B4K47k28lj62K42j51n5J30L4n9K57j80j82J65L5j63P2k32K10oj71J55J61
6122A40j65m5j15K41k09L40k99j35K36K4j81J79q7J65j00j7J49k72p6J27L70k77
6144gK37j20j32k37L67l9j12l01l5J52J62R5J02j93P8p2L10m07K06J01k39J00
6166A6M7j46Q4J90l33K58j34L6l5L8P7l15M6J81L79k28l01J19J62l1j04k47J71
6189g0j19K42J44l13J73J39j44j83L3J79k83K59j0j71J12P7N0k93J78K2J4k58
6211b22N12m71QOK82j44Q2P9j95J76l18J33oM4j29k6J47O9O6l00K92j95j2O8j43
6236a97K71n5k73L56m17M91Pl06M36l32l1o1J64N0p1M0P8k46L50k94p1O2K61j53
$$ plain form
6260 59 172 -109 -3 257 -164 73 -93 1 71 -41 -78 165 171 108 -151 62 58 119 -2 98 -83 235 57
6283 57 -20 181 53 136 -46 -4 -96 246 61 -42 66 -36 -120 -141 -14 -203 101 -17 -187 97 48 38 -215
6306 -215 219 -83 -3 87 -199 -61 -28 -15 -12 -177 57 -25 -6 167 -27 -229 80 80 -278 -92 182 -102 -121 125
6330 125 -158 -47 3 65 99 -14 105 20 21 114 -115 -50 165 -49 -80 -61 -8 -55 -62 89 8 -62 -2 -76 165 109
6356 109 1 101 -107 61 -264 122 -155 -32 102 245 126 77 87 59 106 67 152 112 151 -79 31 151 -67
6379 -67 0 115 -221 101 20 126 14 -144 -92 171 -190 178 87 66 106 -95 174 -119 39 -37 150 -141 32
6402 32 115 143 40 -69 -39 -45 4 109 -16 86 -38 76 167 64 -154 -129 -92 -12 -35 -43 93 80 61 164 -28
6427 -28 -98 223 19 21 -170 -214 19 -48 9 -35 -148 10 47 -141 77 -342 -196 -92 -101 89 -132 12 65 -108
$$ packed form
6260E9J13k81J06K60m21K37j66R4P0j12l7K43Oo3k59K13mO1j21J00j81L18j78
6283E7p7K01j28Q3j82M2r2L42j85j03J08j02q4k1J27j89L04j18j70K84m9j0k53
6306b15M34l02Q0R0k86J38L3J3Lj65K34q2J9J73j94k02L09%l58J86K74k84j9K46
6330A25k83J11N0O2L4j13J19q5JR3k29O5K15k14l1J9N3m7pJ51q1p0O0p4K41n6
6356A09j08J00k08J68l25L86k77J23J34J43j19m9J0k8M7l9Q5m0L9k30J10J20k18
6379f7O7J15l36L22q1J06j12j58N2K63l61L68r1k1M0k01K69k93J58p6J87k91J73
6402C2Q3K8j03j09L0oM9J05j25J02j24J14R1j03k18K5L7Q0k3qJ36j3j9J03j92
6427b8p0L21k04Kj91m4K33o7N7m4j13J58L7j88K18m19J46J04rJ90k21J44N3j73
$$ plain form
6451 -108 -196 116 -28 3 190 -93 60 199 21 141 68 -90 83 23 45 0 -14 -40 19 -88 -124 -78 167 204
6475 204 -154 -20 11 104 8 -83 180 -23 -63 227 62 -65 293 -54 305 -53 17 181 22 337 5 95
6497 95 -85 43 117 83 -148 -129 -63 72 79 -14 -187 123 -129 -25 135 7 43 27 -131 -36 73 -8 97 -46
6521 -46 136 -63 196 50 44 -54 192 23 -177 -60 115 41 -41 182 78 148 81 -233 0 -29 112 73 46 -62
6545 -62 90 -83 -330 167 -192 54 -18 117 56 -145 -140 -243 83 207 78 204 -128 127 400 41 -95 32
$$ packed form
6451a08q8L12j44L1J87k83J53J39j78J20p3j58J73o0K2m5j4k6N9j07l6M6K45L7
6475B04l58J34L1R3r6r1K63k03m0K90j65j27L58l47L59l58P0J64j59L15l32R0
6497I5j80J28P4l4k31J9O6J35Pr3j73L10k52J04J60j28L6j6j58R5J09q1J05j43
6521d6J82j99K59j46or8K46j69k00J17J75p4q2K23j04P0o7l14K33k9J41l9k7j08
6545f2J52j73k47M97l59K46p2J35o1k01Nj03L26J24j29J26l32K55K73l59j36J27
$$ [...]
8191h4
##END NTUPLES=NMR FID
##END=
