##TITLE=1H_LR-0154-OMe-EtOAc
 CD3CN
 8 sc, 
 15.2.2023
##JCAMPDX= 6.0         $$ Bruker NMR JCAMP-DX V2.0
##DATA TYPE= NMR FID
##DATA CLASS= NTUPLES
##ORIGIN= UXNMR, Bruker Analytische Messtechnik GmbH
##OWNER= root
$$ XWIN-NMR		Version 3.5
$$ Wed Feb 15 14:21:14 2023 Russian Standard Time (UT+4h)  she@DPX200
##.OBSERVE FREQUENCY= 200.13135
##.OBSERVE NUCLEUS= ^1H
##.DELAY= (6, 6)
##.ACQUISITION MODE= SIMULTANEOUS
##.ACQUISITION SCHEME= undefined
##.AVERAGES= 8
##.DIGITISER RES= 18
##SPECTROMETER/DATA SYSTEM= spect
##.PULSE SEQUENCE= zg30
##.SOLVENT NAME= CD3CN
##.SHIFT REFERENCE= (INTERNAL, CD3CN, 0, 15.7039)
##AUDIT TRAIL= $$ (NUMBER, WHEN, WHO, WHERE, WHAT)
$$ ##TITLE= Audit trail, XWIN-NMR		Version 3.5
$$ ##JCAMPDX= 5.01
$$ ##ORIGIN= Bruker BioSpin GmbH
$$ ##OWNER= she
$$ F:/spectra/data/she/nmr/H-F/1/audita.txt
$$ ##AUDIT TRAIL=  $$ (NUMBER, WHEN, WHO, WHERE, WHAT)
(   1,<2023-02-15 14:19:41.70 +0400>,<she>,<DPX200>,
      <created by zg, POWCHK disabled, PULCHK disabled
       configuration hash MD5:
       00 E9 B6 7A A2 85 ED C7 34 08 36 98 17 FE 4E 26
       data hash MD5: 16K
       04 9D 6B A5 6E 64 F4 8F 7C 5C D7 71 7B AB 4F 3E>)
$$ ##END=
$$ 
$$ hash MD5
$$ A3 1E B1 F2 1F 6A 21 5E CD C5 B2 81 9A 07 68 5B
##$RELAX= 
##$RELAX= 
##$RELAX= 
##$RELAX= 
##$RELAX= 
##$RELAX= 
$$ Bruker specific parameters
$$ --------------------------
##$DU= <F:/spectra>
##$EXPNO= 1
##$NAME= <H-F>
##$PROCNO= 1
##$TYPE= <nmr>
##$USER= <she>
##$AMP= (0..31)
100 100 100 100 100 100 100 100 100 100 100 100 100 100 100 100 100 100 
100 100 100 100 100 100 100 100 100 100 100 100 100 100 
##$AQSEQ= 0
##$AQ_mod= 1
##$AUNM= <au_zg>
##$AUTOPOS= <>
##$BF1= 200.13
##$BF2= 200.13
##$BF3= 200.13
##$BF4= 200.13
##$BF5= 200.13
##$BF6= 200.13
##$BF7= 200.13
##$BF8= 200.13
##$BYTORDA= 1
##$CFDGTYP= 0
##$CFRGTYP= 5
##$CHEMSTR= <none>
##$CNST= (0..31)
1 1 145 1 1 1 1 1 1 1 1 1 1 1 1 1 1 1 1 1 1 1 1 1 1 1 1 1 1 1 1 1 
##$CPDPRG= <>
##$CPDPRG1= <>
##$CPDPRG2= <>
##$CPDPRG3= <>
##$CPDPRG4= <mlev>
##$CPDPRG5= <mlev>
##$CPDPRG6= <mlev>
##$CPDPRG7= <mlev>
##$CPDPRG8= <mlev>
##$CPDPRGB= <>
##$CPDPRGT= <>
##$D= (0..31)
0 1.2 0 0 0 0 0 0 0 0.06 0 0.03 0 0 0 0 0.0002 0 0 0 0 0 0 0 0 0 0 0 0 
0 0 0 
##$DATE= 1676456381
##$DBL= (0..7)
120 120 120 120 120 120 120 120 
##$DBP= (0..7)
150 150 150 150 150 150 150 150 
##$DBP07= 0
##$DBPNAM0= <>
##$DBPNAM1= <>
##$DBPNAM2= <>
##$DBPNAM3= <>
##$DBPNAM4= <>
##$DBPNAM5= <>
##$DBPNAM6= <>
##$DBPNAM7= <>
##$DBPOAL= (0..7)
0.5 0.5 0.5 0.5 0.5 0.5 0.5 0.5 
##$DBPOFFS= (0..7)
0 0 0 0 0 0 0 0 
##$DE= 6
##$DECBNUC= <off>
##$DECIM= 32
##$DECNUC= <off>
##$DECSTAT= 4
##$DIGMOD= 1
##$DIGTYP= 9
##$DL= (0..7)
0 120 120 120 120 120 120 120 
##$DP= (0..7)
150 150 150 150 150 150 150 150 
##$DP07= 0
##$DPNAME0= <>
##$DPNAME1= <>
##$DPNAME2= <>
##$DPNAME3= <>
##$DPNAME4= <>
##$DPNAME5= <>
##$DPNAME6= <>
##$DPNAME7= <>
##$DPOAL= (0..7)
0.5 0.5 0.5 0.5 0.5 0.5 0.5 0.5 
##$DPOFFS= (0..7)
0 0 0 0 0 0 0 0 
##$DQDMODE= 0
##$DR= 18
##$DS= 0
##$DSLIST= <SSSSSSSSSSSSSSS>
$$ [...]
##$SUBNAM2= <"">
##$SUBNAM3= <"">
##$SUBNAM4= <"">
##$SUBNAM5= <"">
##$SUBNAM6= <"">
##$SUBNAM7= <"">
##$SUBNAM8= <"">
##$SUBNAM9= <"">
##$SW= 18.05172834244
##$SWIBOX= (0..15)
0 0 2 0 0 0 0 0 0 0 0 0 0 0 0 0 
##$SW_h= 3612.71676300578
##$TD= 16384
##$TD0= 1
##$TE= 0
##$TE2= 300
##$TE3= 300
##$TEG= 300
##$TL= (0..7)
0 120 120 120 120 120 120 120 
##$TP= (0..7)
150 150 150 150 150 150 150 150 
##$TP07= 0
##$TPNAME0= <>
##$TPNAME1= <>
##$TPNAME2= <>
##$TPNAME3= <>
##$TPNAME4= <>
##$TPNAME5= <>
##$TPNAME6= <>
##$TPNAME7= <>
##$TPOAL= (0..7)
0.5 0.5 0.5 0.5 0.5 0.5 0.5 0.5 
##$TPOFFS= (0..7)
0 0 0 0 0 0 0 0 
##$TUNHIN= 0
##$TUNHOUT= 0
##$TUNXOUT= 0
##$USERA1= <user>
##$USERA2= <user>
##$USERA3= <user>
##$USERA4= <user>
##$USERA5= <user>
##$V9= 5
##$VALIST= <valist>
##$VCLIST= <CCCCCCCCCCCCCCC>
##$VD= 0
##$VDLIST= <DDDDDDDDDDDDDDD>
##$VPLIST= <PPPPPPPPPPPPPPP>
##$VTLIST= <TTTTTTTTTTTTTTT>
##$WBST= 1024
##$WBSW= 4
##$XGAIN= (0..3)
0 0 0 0 
##$XL= 0
##$YL= 0
##$YMAX_a= 217258
##$YMIN_a= -310689
##$ZGOPTNS= <>
##$ZL1= 120
##$ZL2= 120
##$ZL3= 120
##$ZL4= 120
##$ABSF1= 10
##$ABSF2= 0
##$ABSG= 5
##$ABSL= 3
##$ALPHA= 0
##$AQORDER= 0
##$ASSFAC= 0
##$ASSFACI= 0
##$ASSFACX= 0
##$ASSWID= 0
##$AUNMP= <proc_1d>
##$AZFE= 0.1
##$AZFW= 0.1
##$BCFW= 1
##$BC_mod= 2
##$BYTORDP= 1
##$COROFFS= 0
##$CY= 11.3945322036743
##$DATMOD= 1
##$DC= 2
##$DFILT= <>
##$DTYPP= 0
##$F1P= 2.36226072786647
##$F2P= -0.459571619588291
##$FCOR= 0.5
##$FTSIZE= 0
##$FT_mod= 4
##$GAMMA= 1
##$GB= 0.15
##$INTBC= 1
##$INTSCL= 1
##$ISEN= 128
##$LB= 0.24
##$LEV0= 0
##$LPBIN= 0
##$MAXI= 10000
##$MC2= 0
##$MEAN= 0
##$ME_mod= 0
##$MI= 1.114404
##$NCOEF= 0
##$NC_proc= 0
##$NLEV= 6
##$NOISF1= 3.799351
##$NOISF2= 2.8
##$NSP= 1
##$NTH_PI= 0
##$NZP= 0
##$OFFSET= 15.70392
##$PC= 1
##$PHC0= -19113.43
##$PHC1= 9.60078
##$PH_mod= 1
##$PKNL= yes
##$PPARMOD= 0
##$PSCAL= 0
##$PSIGN= 0
##$REVERSE= no
##$SF= 200.130013532006
##$SI= 16384
##$SIGF1= 3
##$SIGF2= 2
##$SINO= 400
##$SIOLD= 16384
##$SREGLST= <1H.CDCl3>
##$SSB= 0
##$STSI= 0
##$STSR= 0
##$SW_p= 3612.71676300578
##$SYMM= 0
##$S_DEV= 0
##$TDeff= 0
##$TDoff= 0
##$TI= <>
##$TILT= no
##$TM1= 0
##$TM2= 0
##$TOPLEV= 0
##$USERP1= <user>
##$USERP2= <user>
##$USERP3= <user>
##$USERP4= <user>
##$USERP5= <user>
##$WDW= 1
##$XDIM= 8192
##$YMAX_p= 0
##$YMIN_p= 0
$$ End of Bruker specific parameters
$$ ---------------------------------
##NTUPLES= NMR FID
##VAR_NAME=  TIME,          FID/REAL,        FID/IMAG
##SYMBOL=    X,             R,               I
##VAR_TYPE=  INDEPENDENT,   DEPENDENT,       DEPENDENT
##VAR_FORM=  AFFN,          ASDF,            ASDF
##VAR_DIM=   8192,          8192,            8192
##UNITS=     SECONDS,       ARBITRARY UNITS, ARBITRARY UNITS
##FACTOR=    0.0002768,     1,               1
##FIRST=     0,             0,               0
##LAST=      2.2672688,     0,               0
##MIN=       0,             -310689,         0
##MAX=       2.2672688,     217258,          0
$$ Real data points
##PAGE= N=1
##DATA TABLE= (X++(R..R)), XYDATA
0@%%%%%%%%%%qJ6j6J6j6K4l2L7m5N6o5P3q8J05j28J51j75K05k37K72l11L53m02
33b15M56n13N80o53P32q20R16j022J136j261J400j548J711j892K084k295K531
50A327k789L074l388L735m124M563n057N621o275P039p948R051j0421J2176j4519
65g935J7830k2898L1707n1362J78627p1972k72366J91084J69261K7772j13538
76G6210j27649q0167J27533J43023m2247j99762q6175J09397J64573l6640j78065
87a29969n2473J34571Q8732j7080m5468n2887j7040J21698J13858q9750j48837
98i4645M8711J44755K8437p6830p0204k1239N9959Q7784j6916j26558p2974P0998
110c8722J22944Q206j39099j02839Q1131J33143P061q4217p4158j6298R3227J28719
$$ y = [0, 0, 0, 0, 0, 0, 0, 0, 0, 0, 0, -8, 8, -8, 8, -8, 16, -16, 21, -24, 32, -33, 40, -48, 57, -71, 80, -95, 110, -127, 145, -166, 187, -215, 241, -272, 308, -345, 387, -433, 483, -539, 597, -664, 736, -812, 899, -993, 1091, -1204, 1327, -1462, 1612, -1776, 1959, -2165, 2398, -2659, 2962, -3313, 3726, -4222, 4829, -5592, 6584, -7935, 9895, -13003, 18704, -32658, 145969, 73997, -198369, -7285, 161976, 189748, 76210, -51439, -131606, -4073, 138950, 96703, -103059, -189234, -79837, 84736, 48096, -129969, -182442, -47871, 40861, 23781, -21687, -74574, -91614, 30084, 143942, 54192, -94645, -45934, 98821, 127258, 50428, -19776, -41015, 18944, 106728, 89812, -36746, -109720, -38722, 84222, 92428, -46671, -149510, -68379, 64764, 71825, -12392, -86550, -102848, -9621, 119098]
122A19098l6395j71219l7770J44798J00629n3322j00466l8521M6561Q3573K6397
133H3363p1175q9911O073J03135O3051p6764j08961K2585J08338L1539n9532m9284
145c7543k516L3376O1308J8206p9129p0378N7160R8954j2528r3594l9025M6244
157a9465N6782M739m7895n5856k916O2721N7777l4171r3341j6396R3123O7577
169G2679m2518p0457q544M4957N6107K0682n2669p0075K0578R3219K9134p8113
181A4980p1324K4082O5178J7545l6981n1129k6030L1401O4425N527p8752n0479
193i1557N5741P5790r191n9831j8265L3255L7773J7343j2491m0097j6665N0198
205B2003N5383l0295p5628m454O3196K5215l9918m0321o827J4541K6858J2771
$$ y = [119098, 82703, -88516, -126286, 18512, 119141, 65819, -34647, -73168, -26607, 56966, 83363, 12188, -77723, -71650, 31485, 94536, 17772, -91189, -68604, 39734, 71273, 11741, -37543, -40059, -6683, 54625, 72831, -6298, -76676, -19516, 79438, 66910, -26684, -65709, -19465, 37317, 42056, -5839, -61695, -64611, -1890, 55887, 21716, -71625, -88021, 5102, 72679, 30161, -40296, -48840, -3883, 52224, 72906, 20237, -49838, -29260, 63959, 93093, 14980, -56344, -32262, 32916, 50461, 13480, -37649, -63679, -32278, 32147, 37674, -41078, -91557, -35816, 39974, 30783, -29048, -47313, -14058, 23715, 41058, 28567, -11530, -28195, 22003, 77386, 47091, -28537, -32991, 30205, 55420, 15502, -24819, -31646, -17105, 9753, 22524]
217B2524l7888m9924J7056O8037J6991n6930m1542L1545N5406J4299k7874l1213
229a9513n145L3083M7716j127o1294l5511M5732N3923j7317n3478k1655J5533
241a9053K8785J6850k2510m7111q472M6330L5162k6148m4388J932M0999K3667
253B6043j3246k0768n521J2584K8446J5265l0382l8190J8961M8861j839m7119
265f905k1908J9260K2248L850j4809k9196j3398K6631L6944q920m7000j6158M1354
278h007M1421j2022l5831q217K0434K5071J4402j3692l6084p717L7658K7542k5712
291A9246l9028j972K6213J3865j2522k4115j1398J2691K1412K778k3046j8388
303c4264J6377L2814M857k5743j4109J6018K3913R007j2575k2885m296K6881K2720
$$ y = [22524, -15364, -65288, -48232, 19805, 36796, -20134, -61676, -30131, 25275, 39574, 11700, -19513, -24658, 8425, 56141, 55014, -6280, -41791, 3941, 57864, 40547, -12931, -34586, -19053, 9732, 26582, 4072, -43039, -51511, -5181, 29981, 3833, -40555, -38623, 2376, 26043, 12797, -7971, -13492, -908, 27538, 42803, 12421, -25769, -6808, 42053, 40214, -6905, -28813, -9553, 12695, 16545, 1736, -27460, -40858, -14227, 22717, 13797, -33203, -49361, -8007, 33414, 21392, -14439, -22656, -2222, 22849, 37251, 23559, -12525, -20242, 17416, 44958, 19246, -19782, -21754, 4459, 18324, 5802, -18313, -29711, -17020, 4392, 7170, -15876, -34264, -17887, 14927, 19784, -5959, -20068, -4050, 19863, 28870, 16295, -6590, -10886, 15995, 38715]
316C8715j8076l5558o180K4681J8011j0788k6293j5752Q609K4629J2541j9359
328d820k9785K771L5772J9953j9661k2805O067K1197J2748r33j2298j4039O206
341C73K3480N702k5246k0573J1261K1067l693k2014j1483P829J0840K466p649
354g640j3305k794J8728J9041r141k2952O32K5999J6669q719j7705n904J2397
367E306J8584L249j9736j9683M388K0820P261j9004k2071p99J6610J1985p016
380a06j8272r638J4204K2166J516j8583r150J3473J8198L090r125q102J871J1066
394A2608J0108p088j8084m718J4813R104j2289j8385j357J1254N650n896j0004
407a4284m687M285J2601O471r501j1480Q021K0488N205j3564r141Q447J3755L829
$$ y = [38715, 20639, -14919, -21099, 3582, 21593, 10805, -15488, -31240, -22631, 1998, 14539, -4820, -34605, -31834, 3938, 23891, 4230, -18575, -12508, 8689, 21437, 20504, 8206, -5833, 373, 23853, 29555, 4309, -16264, -5003, 16064, 12371, -9643, -21126, -13297, -2457, 9, -7640, -20945, -23739, -5011, 14030, 4889, -18063, -17431, 8568, 25237, 16518, -1187, -7091, 5306, 23890, 27139, 7403, -12280, -7892, 12928, 20189, 1185, -20886, -21685, -5075, 6910, -106, -18378, -28016, -13812, 8354, 9870, -8713, -17863, -4390, 13808, 16898, 7773, -329, 1542, 12608, 22716, 15628, -2456, -7174, 7639, 16743, 4454, -13931, -15288, -4034, 1616, -4280, -14284, -18971, -14686, -2085, 4386, -5115, -16595, -8574, 11914, 17119, 3555, -5586, 2861, 16616, 20445]
421B0445p779j1016m181Q519J0620m893j7794j0360Q396J4238k445j7426j0282
434b3958Q923J4673K969q460r890J845J4509J2940l156j3475l110J1698J3199
447A8707k32j1807r027M602J0216k96r550q324k44M240L124m177q344j960O344
462f728N081l080n464L62Q052P109k292o917K190J0146N035m422o762k911M928
477D327Q466R8j1952j0538K695J0938M692j0279j4298j251J2780R178m750j0132
491a0026l203O523J1606N673o282r854K151J2511P435n239j0386k586P146N323
505A0792l868p584l444M28J110J2l012m816J19N579J491n329j407O190O555N4
521B870l859j624N808Q386J063n610m317J428N257M722m703j1720m836P296O794
$$ y = [20445, 12666, 1650, -2531, 5988, 16608, 11715, -6079, -16439, -8043, 6195, 3750, -13676, -23958, -15035, -362, 2607, -5853, -15743, -13898, 611, 13551, 10395, -3080, -6190, 5508, 18707, 18475, 6668, -2359, 2243, 12459, 12163, 2613, -5711, -5955, -1715, 1409, -2768, -11112, -13072, -6728, -1647, -4727, -10191, -9829, -1777, 5332, 3040, -3877, -1687, 8459, 13494, 9072, 2310, -601, 4327, 12793, 12891, 939, -9599, -6904, 4034, 8726, -1553, -15851, -17102, -4322, 4856, 106, -10026, -13229, -6706, 4900, 10573, 4291, -5563, -3412, 9099, 16534, 11295, 909, -1677, 5469, 10792, 6924, -660, -4104, -3676, -2566, -2554, -5566, -10382, -10263, -4684, -3193, -8522, -9929, -3739, 2816, 2870, -989, -2613, 3195, 11581, 12644, 7034, 2717, 4145, 9402, 14124, 9421, -2299, -7135, 161, 6955]
536F955n358j0825n909L523Q724J993p183n690J903Q059O278N87n626k215P825
551C041Q858r53o377j257M609M037j867n036l428N6J455p03l435n579k608L746
567e441L327m443o546J912P914K716l515k119K534M822N008J065l232k761K558
582C799O401J999n196o778P63N340j95o644l899L75J225L77k354l044j057L007
598e881M581o51l777m48N088N369J122l876k248M480N105l3m103l289k40K594
614C793K698l246o676k800K288L450K80m943n376K402O633J546l257j148J564
629b792L212L560J112k015j308K707L104n25l170k433J690K142l012m983p51K566
645h96q80l388j275m36O23K797J376k311k587K711O449L163k670l569K236N668
$$ y = [6955, 1597, -9228, -15137, -11614, -2890, -897, -8080, -13770, -11867, -3808, 2470, 3057, -2569, -4784, 3041, 11899, 10946, 4569, 3312, 7921, 11958, 10091, 5055, 1627, 1683, 3138, 2435, -1000, -6579, -9187, -5441, -2114, -6557, -13103, -11191, -3277, -561, -4076, -6195, -3661, 1161, 6169, 7234, 4002, 1241, 3799, 10200, 12199, 7003, 225, 988, 6328, 6133, -511, -4410, -4035, -2810, -2433, -4787, -7831, -8888, -5881, -1300, -1951, -5728, -6176, -1088, 4281, 5403, 1527, -721, 3759, 8864, 8831, 4728, 1439, 1199, 3793, 6491, 3245, -3431, -6231, -3943, -493, -213, -5156, -10532, -8130, -1497, 49, -3208, -4356, -2792, 420, 3980, 5092, 3077, 1769, 4476, 7580, 7055, 3885, 1452, 3142, 5284, 2272, -2711, -3462, -896, -1776, -5164, -6439, -6875, -6252, -3455, -2079, -4390, -6977, -4266, 2183, 5346, 2676, -893, 1343, 7011]
661G011K111k544k014j431k77J734J536m008o189KL506O80m484m220Q97L312R94
678c384j152r67R53J337L481K669p65k103K584M636l7l041j072J818J929j513
694E373l469k082n55K58K91j938l349j773J241K663n66j546k50K299K650J204
710D51q69M05K939K017p8m02m11J178K51k8j738k611j182O10Q81l015l899o58
728f159K939J541k698k318J013K394K219J314k71k152J087M670M048j789l791
743B047j54L081J715j876k240j787j694L52J358j360l674k357J294K071j08j653
759d985L78J214Q28N27K292K082j4l87O72Q94J234J244k51k068j902n70J591P72
777C551k273m732j899J996K425j264l248j812J327K743K359J75j681j080K421
$$ y = [7011, 9122, 6578, 4564, 3133, 2856, 4590, 6126, 2118, -4071, -4069, -563, 117, -4367, -8587, -7690, -4378, -3384, -4536, -5503, -4550, -3213, 268, 2937, 2172, 69, 2653, 7289, 7252, 4211, 3139, 4957, 6886, 5373, 1904, -178, -733, -475, -184, -2122, -5471, -7244, -6003, -3340, -3906, -5452, -5702, -3403, -753, 451, -418, -13, 2926, 4943, 4865, 4463, 4052, 5230, 5481, 5453, 3715, 1104, -78, 532, 1413, -1602, -5501, -6159, -3220, -1679, -4377, -6695, -5682, -3288, -1069, 245, -26, -2178, -1091, 3579, 7627, 5838, 2047, 1893, 4974, 6689, 4813, 2573, 786, -908, -556, 802, -558, -4232, -6589, -5295, -3224, -3332, -4985, -4607, -3393, -2565, -2038, 254, 2336, 2322, 1935, 2607, 3501, 4735, 5979, 5728, 3660, 1758, 1188, 2779, 3551, 1278, -3454, -5353, -3357, -932, -2196, -5444, -7256, -5929, -3186, -827, -652, -2333, -3413, -992]
792i92N385J885l033k436J992K898O22j522j109k019j743J135J565k414m029p38
808d553J447k10j305n9J513n2j462J646K499R40l16J327J129j67Q54K240J46k388
826C229j613J411J424j499k706k140j13K51P12j175k157j456Q66K761K42r73o40
843c576J795K097J719K55n75j22K388J792j378j443m19K41j45p30r86k177j382
860b646P23N47j598k256M69J932Q9j132Q02J810P69K65J667J288o88J23K142R33
878E239j877j004P74N51k088j457K31K7j602j978O7k85n87P9J061l36j503J344
896c344L023J128j072J9J777J687J021k26n80n32M85Q12m82j496k143j236R85
913a74O28j656k458j006P23Q12J49M4n20M29R47J518J555M20o40J119J169Q99
$$ y = [-992, 4393, 6278, 3245, 809, 2801, 5699, 6321, 4799, 3690, 1671, -72, 1063, 2628, 214, -3815, -4553, -3106, -3316, -4621, -4680, -3167, -3219, -4681, -3035, -536, 404, 88, 1415, 2544, 2377, 3231, 5471, 5617, 3229, 1616, 3027, 4451, 2952, 246, -1894, -2007, -1756, -1044, -2219, -4376, -5832, -4966, -2205, -1963, -2936, -3576, -1781, 316, 2035, 2290, 1715, 1593, 3981, 5773, 4395, 2952, 2533, 2774, 2629, 1899, 913, -1264, -2646, -1923, -1376, -2974, -5230, -4761, -2829, -2740, -3872, -3070, -1260, -491, -226, 1441, 2729, 2041, 2164, 4306, 5239, 3362, 2358, 3132, 3683, 1595, 138, 369, 396, -1206, -3184, -3117, -3402, -3989, -3910, -2849, -3185, -4688, -3344, -321, 807, -265, -246, 1531, 3218, 4239, 4013, 3433, 2901, 3386, 4198, 3716, 2220, 77, -1159, -174, 454, -1202, -3660, -4666, -3943, -3131, -2982, -2938, -3458, -3029, -2082, -564, 991, 1411, 771, 1890, 3059, 3958]
931C958p60M29M80j100j410l4N23j270j533j049k62l87m49O9l42j240k36K227
949b386J865m33r57P48J888J367O99P05p58m32M17J287J46k081j287j3Mr71q57
968a049j070q20k91M75l52L65n3j55J113O53Q81L29Q46J062L38P3r9J082P71j070
988C029j786j87J049q89j078l29j404j635K93J313k12j839j13J269J364M7m12
1005a520J103J185K34J68J980K75j290j51J404k90j166l73J75j509j562L66K67
1022g04l47j873j345Q17R55K01J33L47j77RJ864K553j07j651M19J135J382K83
1040C894l23j592o36L25j95K7j338k092o95Q56K77j072j095K73Q8P65J242Q54
1058d37k86j89O86J550J491K38q72M2N46J13j6l8p58j837r26P44L25j457j297
$$ y = [3958, 3198, 3627, 4107, 3007, 1597, 1563, 2086, 816, -717, -1766, -2028, -2415, -2864, -2795, -3137, -4377, -4613, -2386, -521, -954, -1911, -1163, 725, 2092, 2791, 3496, 2738, 2306, 2723, 4010, 4156, 2075, 788, 775, 779, -192, -1049, -2119, -2939, -3230, -2755, -3107, -2742, -2795, -2950, -1837, -1184, -303, 26, 872, 1934, 2272, 2345, 2246, 3328, 4099, 3029, 1243, 1056, 2105, 1216, 138, -191, -1595, -3230, -2937, -1624, -1836, -3675, -3788, -2519, -1155, -1108, -1520, -417, 768, 1002, 1170, 3150, 3425, 2135, 1984, 3388, 3098, 1932, 1559, 1734, 225, -1337, -971, -704, -1051, -2924, -4269, -3452, -2497, -2296, -2163, -1816, -1993, -1984, -120, 2433, 2326, 675, 1094, 2229, 3611, 3894, 3571, 1979, 1343, 1668, 1473, 1500, 162, -1930, -2625, -1769, -1492, -2564, -3659, -3386, -3298, -2533, -1291, -437, -723, -912, -226, 1324, 2815, 3053, 2181, 2223, 2769, 2882, 2866, 2828, 2070, 233, -693, 51, 376, -1081, -2378]
1077b378o94O4N19L11K03l46l44L67K085J955j217p13J453J033O69J35l50p63
1095A989m86L46O42r28j407j379L10L57q58p35o53K50lK53R44k55j90R38J054
1114A89Q91O9L30N1P81L68j61k81L34q08j036o04O47o11j461p46J98q3k34n22
1134b689M56J17r0R68P80K89p28J061K081N34j208J51P09J72l61L66n67j577j090
1153f26R45P79j529j864n54P74l5l57M14K1n39O10K158R45j353l83J587J072L32
1172B397J59lq77k79L14Q57m55j656q68n89r4K81m71q13j264J20J403M99l0n7
1192a426k75O67J409J546p8j361K99J274R98j88j049m39j054QJ202J07k197k375
1210b932Q56J036j79p79k1m97k44Q67K237K02j258m84K063J168m43K09P06q18
$$ y = [-2378, -3072, -3008, -2489, -2178, -1975, -2321, -2665, -2298, -213, 1742, 525, -188, 1265, 2298, 2967, 3102, 2752, 1989, 1503, 1849, 2491, 1563, 156, -1223, -913, -556, -1414, -2149, -2802, -2552, -2555, -2302, -1358, -1613, -1803, -865, 189, 1080, 1149, 1479, 1530, 2311, 2679, 2518, 2237, 2571, 1763, 727, 123, 770, 159, -1302, -2048, -1850, -1933, -2167, -2689, -2233, -2116, -2206, -1238, -458, -169, -897, 164, 2245, 2779, 1571, 1722, 2431, 2603, 2242, 2608, 2041, 464, -626, 319, 1098, -431, -2295, -2849, -2075, -2110, -2467, -2053, -2032, -2571, -1961, 197, 1142, -211, -594, 993, 2065, 2397, 2556, 2553, 1676, 1397, 1711, 2568, 2113, 457, -411, -1000, -1094, -813, -1284, -2097, -3361, -3241, -1838, -1339, -1369, -1426, -1701, -1034, 375, 1921, 1843, 482, 781, 2055, 3053, 2865, 1816, 1377, 323, 331, 1533, 1640, -557, -2932, -2076, -1040, -1219, -1998, -2019, -2516, -2760, -1893, 344, 546, -712, -1196, 867, 2035, 1592, 1801, 2507, 1689]
1228A689o49J072Q24j188j890q8L52m76o91J22o29j292O8J406N43q13m48Q26P22
1247e40O20P29O35q69l13J643Q36n05o37O2j55o35N08l69j492j438P41N98q95
1266a476o79K52K28p93M16J879K8j523P54K286K3r31O68J564p96j186J307R32
1284B953j612j313Q96J57j584j065J075J31k005l07J408R6j436M78J705K6q53
1301a250R34J512n76k54J159J126j086m97J094K38j748k20R81p03j511J14N88
1318i9j199j264M59J461p02j290J279J192r23K55J864j10j364Q32K069j59j374
1335I27N05R19q21j159R69K54k027j245J697N43k177r21J545j95j336M85J820
1352b17J0k322J586K360j83j280Q14J565j238j045K184R31k231j347J547J39j741
$$ y = [1689, 1040, 2112, 2936, 1748, -142, -230, 122, -354, -1045, -923, -1552, -2844, -2776, -1370, -827, -1640, -2088, -1262, -540, 80, 809, 1444, 575, 262, 1905, 2741, 2236, 1599, 1661, 1506, 871, 1379, 1010, -482, -1920, -1179, -581, -1476, -2155, -1903, -1675, -2468, -2052, -173, -145, -1668, -914, 1372, 1395, 464, 1132, 2696, 1900, 714, 2021, 2953, 1341, 28, 924, 1081, -503, -1568, -493, -362, -2367, -2674, -1266, -1170, -2606, -2128, -423, -397, -1250, -316, 1196, 620, 366, 1525, 2651, 1565, 1068, 2162, 2400, 652, 432, 1413, 710, -801, -687, -99, -1298, -2562, -2103, -642, -1344, -2634, -1355, -163, -1086, -831, 1033, 923, -441, 391, 2460, 2301, 927, 1432, 2351, 1530, 371, 1340, 1594, -433, -1678, 19, 562, -1615, -2536, -991, -1186, -2522, -2037, -217, -207, -2529, -943, 1417, 1234, -46, 768, 2333, 1095, 50, 2234, 3165, 934, -413, 1134, 1273, -468]
1369d68m01R71r11j730Q01J521q95j773Q96J756n37l79J302R20j298O7J987L84
1387B213j288R3J137j67j258L93P07j458j321M20Q61j818o61J395P8j790O7K177
1405b20k82j470J119J811m39j067J528J555j321j150J793J150j993r93J764k5
1421A760k292l75J748l95k665j68K379q95j567R21J532j096r09J863J288j005
1437A24r94J753J216j222n9J513p1k128L90J615p04k198P1J038j150q71J176J63
1455c38j756l46J677Q77j444j54J838l07q88J537J629j420j510J661J639j169
1471A526j327R50L68j861m07J844k89k622l80K096m56j512N97J761j490j452K365
1488b89J981j700j364J920J659j633j10J833k37k152N2K167l81k664Q1J569j020
$$ y = [-468, -869, 102, -809, -2539, -1738, -217, -1112, -2885, -1989, -233, -770, -1149, 153, 1073, -225, -158, 1829, 2213, 925, 1018, 2155, 1988, 730, 1123, 1830, 372, -949, -529, 332, -1486, -2147, -752, -674, -2464, -2397, -220, -502, -1972, -853, 958, 519, -548, 980, 2535, 1214, 64, 1857, 3007, 1014, 21, 1785, 1760, -532, -907, 841, 446, -2219, -2387, -8, -903, -2470, -1549, -17, -1113, -2022, -159, 1129, 124, -870, 883, 2099, 877, 818, 2331, 2260, 132, 522, 2137, 1433, -765, -694, 344, -806, -1677, -501, -338, -2094, -2440, -763, 114, -1330, -1484, 354, 47, -841, 696, 2325, 905, -605, 1056, 2695, 1526, 199, 1149, 1517, -344, -751, 1093, 804, -1818, -2198, -102, -558, -2070, -1473, 288, -1202, -2654, -289, 1692, -8, -1372, 548, 2207, 574, 464, 2297, 2060, -92, -40, 2127, 1746, -918, -837, 732, -288]
1505b88j304P82Q40j574j025J731J284j556p18J630O46p77K25J933n80j400Q25
1522F74J816q38j312O18N26j272o59J419l8j983k88J013j44j300q3J346n22r69
1540a996J239J530j206p83J816J177j347m62J709L99j995J99J555k60k112J06
1556d31J585r39j894Q30P80r51j324J598P54j499l55J666Q61j229k49J748L55
1573A306j064L95J272n77j284N15J128r61j167P07L27r08o12N50q2j243J11J244
1591c43m3j039J75J402l69o40J019R21p68o06J343R76j389j74J103j65j619M42
1609B26Q94q67j599M67O09K9j300Q58L76r71o49K240O47j797n03J884Q71j237
1627A78j6J291m07j096J055J150q33k101P11J033p03r88M36J52j086m22J195O39
$$ y = [-288, -1592, -810, 30, -1544, -2569, -838, 446, -1110, -1828, -198, 448, -329, -104, 1829, 1249, -151, 674, 2490, 1652, 340, 958, 1484, 212, -447, 972, 934, -1049, -1337, -324, -468, -1768, -1851, -505, -1027, -1996, -757, 773, -433, -1216, 600, 1777, 430, -32, 1677, 2076, 81, 280, 1835, 1575, -537, -431, 1154, 215, -1679, -849, -69, -1020, -2344, -746, 8, -1491, -1846, -180, 681, -548, -797, 951, 1306, 242, 637, 1909, 1332, 48, 563, 1691, 730, -437, 270, 597, -311, -923, -373, -455, -1698, -1587, -343, -386, -1425, -1250, 152, -217, -857, 162, 1083, 315, -291, 1052, 2028, 639, 465, 1568, 1403, -216, 226, 1120, 253, -1346, -879, -270, -241, -1541, -683, -307, -1278, -1927, 313, 960, -837, -1340, 544, 1415, 178, 162, 1453, 1046, -50, 1005, 2155, 1322, -779, -68, 965, 262, -726, -290, -138, -1224, -1646, -451, 188]
1645A88j471l63J503n5l54K92R67n30o11J206J054q78m42K32P17r65l2N06o44
1664C20j145J75P39k85j000k3N96o24J07O26N88r56k06J369N19o68j37J013j20
1683H88o91M70Q54m26j239J58J115q37q87M2N01q79l67M14O91r16k25Q63M55m00
1703d16j29P59J5j95L23O54P5m08Q6K61n12o24O33L62r44k87L65m83m03P8L79
1724d11l23k70l8P28o1j0K56L03l99K58N69K61l43j12O49k05l28J32J72o61m18
1745b51M24J51j162m07M89K62l74KM09R2p62O01R70K29q13L35M81M3n70R95J09
1766A253q05m55N01L21n78l55j46J82o82o1N91k15m39K7N09J95m74J93J79M10
1786A51k54P27Q6j97k36O55k08K9k52j03q3m07K80j69k76l66J93j92j8k79M43
$$ y = [188, -1283, -1646, -143, -198, -552, -260, 707, 177, -434, 772, 1826, 948, 506, 738, 1455, 490, 458, 964, 320, -825, -650, 89, -196, -1196, -1219, -623, -1247, -1140, -514, 74, -882, -1088, 281, 800, 132, -5, 1008, 888, 197, 667, 1521, 1095, -144, 14, 1129, 292, -595, -553, -52, -931, -1298, -884, -193, -1109, -1334, -471, -16, -416, -545, 214, 229, 34, 357, 1011, 1086, 678, 764, 1025, 513, -111, 522, 884, -60, -347, 18, -465, -868, -790, -411, -734, -1004, -1042, -314, -375, -385, -129, 174, -225, 33, 602, 863, 520, 408, 1057, 852, 524, 656, 828, 167, -251, 173, 324, -838, -1245, -756, -494, -868, -866, -457, -365, -1127, -526, 444, 673, -140, 195, 676, 719, 149, 1144, 1253, 448, -7, 494, 815, 237, -118, -264, -82, -764, -825, -234, -449, -888, -861, -352, -157, -631, -438, -259, 151, -103, 624, 710, 513, 277, 932, 724, 753, 501, 398, 315, -92, 188, 19, -257, -623, -430, -622, -640, -919, -476]
1807d76k13j29N04K46K41k66K66K35L26l77L04K22n00N6L14O0n07j59R1k6r21
1828g09J27L60j5o86n0O65k57j70J80L88K31l2J27L05J90O0k62M78k97j17q0J20
1850E56m24N1k66j33J08j27j97j65k27P3J95K86n9j57J89J15K42M58N3n62O83
1871F92J01k01j1J95l22l05O1J59j66o01l68M88j36j31R6l22J52j66M58M33q5
1892B1j25j01Q51j27K6K10k15k45J75K55j07l77l31l1J77j75p6N5n22k70L07K21
1914d04P3k15l5K41L93k2K43J40m34L40L71J78l37o1j46J08j00K05l49k23j53
1935a87j73p7J25j89j79n4K92K74k2J09l41K76L71J6k9L75J86m51J40K79k20j85
1957C36l65L78k36j58k0M5n63P1l8P6K28l96j8L88J86k9K34K97l93L58lJ98k6
$$ y = [-476, -689, -818, -314, -68, 173, -93, 173, 408, 734, 357, 661, 883, 383, 439, 753, 813, 306, 147, 238, 212, -709, -582, -222, -237, -923, -973, -308, -565, -735, -555, -167, 64, 32, 159, 464, 654, 714, 452, 930, 633, 516, 436, 556, 132, 183, -83, -216, -108, -235, -432, -597, -824, -751, -556, -270, -329, -486, -297, -182, 60, 518, 571, 9, 692, 793, 592, 581, 776, 454, 149, 210, 369, 203, -398, -766, -278, -414, -545, -449, -771, -619, -785, -327, 106, 21, -104, -205, 646, 519, 545, 755, 540, 295, 470, 725, 618, 241, -90, -121, 56, -119, -195, -140, -662, -932, -625, -404, -331, -546, -581, -340, 53, 31, 274, 414, -20, 320, 691, 869, 532, 471, 325, 433, 333, 538, 189, -34, -187, -360, -437, -312, -501, -680, -734, -442, -168, -190, -81, -422, -146, 225, 241, 212, 587, 773, 322, 462, 741, 521, 336, -29, 349, 113, -45, -65, -20, -583, -512, -550, -474, -246, -642, -660, -272, -86, -115, 119, 416, 23, 381, 378, 576, 550]
1980E50k4n3J9n9q5n1J2l96L9l32R2j39pq7J9j70R3J38K73K24k0q4L02K44j51
2005C47L69n33K73o3p7L24k92l08J64k64n9l79L04j63l08J63R7J61l17J2J25L72
2027e2L1M87j77j64K19J66J24r2k25j35j50J11J01l48O7l65J60k54j18J19J15
2048c80m82K52J76N32n8k23j67L96L82J49N3k39o0p3J42M63m50l58k01K03J08
2069A65p3k76n7l75J05K32j42K47o54M29M74K80k07K44k18J05O9M66j76r0l00
2090B48r6M86n25o6K7l47p5L14q5oj63n45K12k2M64j04L63p7M10l45L68j73o6
2113A97K06K51k14q3r2N0l04N6k78M37l97J5l36K70m34L00j74Q6r2K59L30p2K45
2136B26q5L64l48K58j28M51k35k9q5J77m34K14k94k42k76O6j53K12q1M9K19p3
$$ y = [550, 526, 473, 492, 433, 348, 297, 309, -87, -48, -380, -288, -427, -434, -521, -502, -672, -579, -441, -168, 56, 36, -48, 254, 498, 347, 716, 183, 456, 393, 316, 640, 348, 40, 204, -60, -119, -498, -194, -357, -665, -502, -405, -244, -561, -549, -424, -52, -21, 466, 289, 125, 344, 510, 634, 542, 317, 182, 32, 143, 244, -104, -37, -402, -242, -496, -614, -495, -380, -862, -610, -434, 98, 40, -183, -350, 46, 428, 577, 630, 391, 331, 258, 400, 863, 413, 55, -146, 57, 165, 92, -184, -241, -616, -511, -279, -421, -174, -828, -399, 75, 355, 148, 392, 174, 279, 348, 814, 638, 548, 248, 152, 638, 113, 47, 74, -273, -348, -34, -119, -125, -288, -833, -621, -643, -179, -283, 80, 3, 413, 68, 436, 263, 197, 403, 654, 440, 357, 265, 315, 11, 67, -211, 226, -171, -156, -492, -222, -656, -356, -530, -444, -536, -277, 53, -19, 226, 141, 505, 157, 415, 287, 738, 503, 474, 389, 566, 132, 346, 52, -190, -466, -400, -553, -341, -422, -373, -154, -227]
2158b27k82L75L79m70J17K12N23k29k66J68n4j24Q8K31Q7n35j16j14K7l40L82
2179a68l41k7P6qM47k36l10O7L65J85L0O4J70l21M23k2L03M4n97k05N02l00q9
2202E2j12k28l38K94R8m9Q3j74m45O76J12p3k27J11M39k64J85O41j96l13L65k04
2224D33j8j27j93m38J67q4K26j57j74m56M98J06j5l59P3N6L86o3K32j15K13k58
2246f7M61m1K50k04j90K92j60j26L8m57Q6j76K4L0k43J70k20J43J4K63m0j62K48
2269f7O1J74K78k12J23j92J37j42J21L12l58r2K5k69r6K11m50K04j79J04j24J57
2291b74J44J68n1o4NK71pK29j75N15l95l4M16k52j83q2k60L02l40j17o3J29l21
2314d39K15l0P3p8l70M38J12M9J09k39L30Q9K24j34K55l54m3J52J66k28j85k3
$$ y = [-227, -509, -134, 245, -225, -108, 104, 627, 398, 132, 300, 246, 122, 210, 441, 528, -7, -123, -237, -210, -550, -168, -509, -536, -460, -468, -21, -257, -567, -500, -135, 50, 80, 144, 314, -7, 416, 394, 697, 741, 144, -61, 441, 141, 52, -60, -288, -626, -332, -234, -283, -200, -374, -819, -143, -31, -104, -331, -220, 219, -45, 140, 781, 585, 272, 637, 433, 415, 288, 95, -343, -176, -260, -34, -191, -365, -821, -323, -217, -232, -591, -518, -462, -76, -139, 93, -22, 191, -67, 394, 353, 603, 399, 209, 501, 341, 215, 253, -204, -118, -294, -270, -240, -483, -313, -533, -390, -376, -113, -153, -315, -67, -6, 168, 446, 234, 357, 165, 302, 160, 281, 593, 235, 143, 168, -101, -197, 14, -436, -232, -411, -307, -431, -274, -130, 38, -13, -77, -72, 199, 192, 421, 246, 761, 366, 332, 748, 496, 313, 231, -29, 273, -67, -184, -247, -118, -439, -224, -254, -181, -259, -629, -191, -79, -30, 79, -160, 170, 259, 483, 349, 604, 250, 207, 359, 525, 297, 112, 89]
2336H9m16J14j8J32J6j18k57n6L11%o4N0J50K57K06p2L58l90K48j69M16n31J92
2359D48k54m4J97k02k13k2k08j09l7L57l32j98J93PL70n2K2L6K56r6J89K38m7
2382D99l03q2q0N11n82Pj95K88k20J54j60k16N5k51L39k79K16K1P3K95k6k58N66
2405C72j13N6N3p3j21KM0j1J46j30j60k31O2q6n0m3k81J28n1P0J36J23o0j6L63
2430A25l64K02J55J11Q5qq6K57j54j96K65q5k65j06OPOl52J0J24k08L63j00K16
2454HOk19J80M0J0L93J3j09Mr2J51j2J1j37j81K12r8m73N8K02l92j64M7P9J7N3
2480c93J51J25K23K94l40k8J70K54k36L27j01k65K98k84J13j16K11o64J94k71
2500c38J57l71L81k63l6J34J11mJ33p5K3J31J28J66J28j06j09K09J01j30k70k67
$$ y = [89, -327, -213, -231, -99, -83, -201, -458, -514, -203, -203, -267, -217, -67, 190, 396, 324, 682, 292, 540, 371, 787, 256, 448, 194, 150, 347, 145, -68, -90, -298, -407, -444, -87, -419, -617, -424, -417, -47, -99, -77, -41, 215, 119, 308, 546, 499, 196, 114, 34, 545, -37, -30, -225, 63, -157, -3, -163, -379, -324, -575, -236, -515, -299, -278, -205, 90, 64, -194, 372, 259, 315, 368, 295, 174, 176, 216, 205, 351, 221, 61, -170, -108, -194, -244, -287, -568, -440, -491, -421, -285, -162, -222, -238, 125, -239, -37, 118, 229, 314, 306, 220, 477, 323, 127, 392, 307, 42, -64, -58, -51, -45, -397, -387, -263, -471, -108, -208, 8, 14, -205, -25, 15, 25, 418, 431, 322, 326, 234, 385, 373, 384, 247, 66, 278, 180, -293, -235, -33, -425, -589, -542, -463, -446, -393, -242, -117, 106, 400, 60, 32, 202, 456, 220, 547, 446, 181, 479, 195, 308, 192, 403, -261, -67, -338, -181, -552, -171, -434, -470, -336, -225, -229, -96, -171, -148, -17, 111, 277, 405, 299, 190, 399, 500, 370, 100, -167]
2522a67K34J35k33o9P0k42QL75o06M9k23M92NK41j21K65j14j83L17m1m9J43j4
2545B72K22j24k30J90j95q0n9m39J90J79p7n55K79R7q8K68k32K41L04j67j01K77
2567A72J81l1J63q0j40P1k3m2j1m20J51q2k50L31q1l22K45m1P4j60L6O3j22L72
2591E4L7M3Q3j12K14l31M46J27m51N5n1N2n3m05j04K90k86N0J26L5m73K68l7M81
2615E8p2k60K03K32j1K7K22J56j20j16J20j32K17n03j06NR2q3M6L4l18j09J35
2638b83L74n99K04o8K39J68r0Q4J57j77K30O1L8j47k90O37m08q0J09k38k5k39
2660c43J00J39j58J5j47R9Q9LJ96m8J76q4RN01j31l61J96J08N5l51K35k95K42
2683B45k2L5n07K09k10k69j77L18K21k79J32L7K91l2q2L11J20m30K80L19J08n76
$$ y = [-167, 67, 202, -31, -100, -30, -272, -264, 111, -495, -446, -669, -177, -172, 69, -52, 213, 99, -84, 233, 192, 143, 286, 272, 494, 370, 140, 330, 135, 55, -4, -443, -253, -74, -151, -706, -427, -330, -418, -150, -382, -141, 163, -4, -105, 172, 353, 322, 485, 405, 265, 336, 313, 271, 260, -160, -9, -91, -341, -10, -91, -413, -168, -209, -135, -295, -259, -196, -318, 54, 91, 134, 217, 105, 319, -12, 434, 561, 110, 165, 114, 166, 113, -292, -396, -106, -392, -342, -216, -181, -654, -386, -423, 58, -14, -274, -71, 161, 150, 177, 399, 555, 435, 319, 439, 307, 524, 21, -85, -80, 12, -71, -25, 9, -309, -418, -283, 91, -508, -304, -372, -133, 35, -55, 29, 186, 9, 239, 300, 338, 191, -99, 538, 130, 50, 159, -79, -104, -343, -243, -104, -262, -247, -394, -295, -206, -203, -7, -55, 121, 37, 46, 547, 416, 55, 251, 359, 414, 63, 298, 3, 245, 223, 258, -249, -40, -250, -519, -696, -378, -157, -436, -304, -267, 24, -8, -90, 221, 341, -89, 191, 510, 618, 42]
2705D2K55n5K15m23l3K21k79k57J79l3m06K94o4K19k40j75M76m5J02rM4K38j64
2728A02K04n6J94m61m2L58k00N6R7m22K35j86N2k93K9O2q2R9j30L49L03m44mJ92
2752A2M01j56k69K71N1L01l60L30m56k71J49K48K40n62K73l36n3m2P3l8j29q7
2774d10J49J86j55K84J37L8n9j24J35J07l79J54O08n48J57l44K20k41k79N73l16
2795a07k59J36K7l11J66J51M74l82m35Q40j4m17M6K03J68j27j75L42K3l11J63
2816B01j09O0j50k65O20n95m16N78J34n43j75N40R1j71K2K68J86k74K17J30J9
2837C68l05J98L50k72k64Q5K81n65r2L70J37o66k8J41O1o24O46R8j6l33M36m2
2859c6n0q8N11j68q6j59K43J03k15k9k18N53o18L56J29j14o08N10J27o94R5M57
$$ y = [42, 297, 242, 457, 34, 1, 222, -57, -314, -135, -168, -574, -280, -344, -125, -365, -540, -64, -109, -7, -16, 28, 266, 102, 306, 250, 444, -17, -59, 299, 99, 155, 252, -170, 65, -121, -69, -362, -333, -271, -353, -254, -384, -35, 268, -176, -180, 12, 413, 257, -12, 259, 310, 611, 251, 581, 125, -146, 3, 251, 491, -71, 202, -134, -187, -229, -156, -194, -323, -410, -261, -75, -230, 54, 191, 229, 170, 46, 181, 288, -91, 63, 671, 123, 280, -64, 156, -85, -364, 209, -107, -366, -230, -203, -514, -348, -197, 277, -105, -540, 300, 286, -131, -85, 118, 286, 159, -16, 326, 349, 38, 201, 92, 152, 2, -263, 357, -238, -654, -76, 58, -485, -660, -120, -29, -200, -178, 90, 276, 2, 219, 349, 368, 63, 261, 611, 339, 75, 160, 441, -124, -216, 154, 291, -375, -403, -262, -201, -825, -179, -81, -97, -430, 6, -36, -86, -174, 337, 169, 83, -76, 167, 270, 55, 26, -192, 361, -257, 99, 228, 114, -494, 16, 143, -551, -456, 1]
2881AJ3k04J45J09M01m47M9J76J59l18O1L80l81J16OJ74l36o53L42J92l36L6M99
2904A84l80j05m7N12k07l5p0N59m62J31J86K09q6l72L64K81k97l25K29P6k33o1
2926E1Q6k56m25J04K58J91n54M14r1nl56P15j0k66J8K85K47n73K81L77j59k63
2948F9K91L18n14o01O36J16l55l77L58l69L0K1K48J08m72L82L90j86l8K54K1J04
2970D34m17k8M84k30l20K02K92l22l07K75q4l42J84K07j58k75J64R2Ql83K11N34
2992B21k83k30N94J48m39n3L58Q2m12o5P44l17l7j45J54m86l61J81N07l48n52
3013g39O03J5k01O8M56k67k87K03N80qk18K1K42k40n50K60N10m38j75K67J42l65
3035a21k7K30l08k84K64L91m06l31k1R78l6m65R1K22j84j50O25o5l57j34M82q3
$$ y = [1, 14, -190, -45, 64, 465, 18, 67, 243, 402, 84, 145, 525, 144, 260, 266, 440, 104, -549, -207, -15, -351, -315, 184, -196, -301, -348, 164, -43, -78, -148, 411, -51, 80, 266, 475, 389, 17, 381, 662, 365, 40, 269, 345, 112, 51, 137, -119, -544, -440, -182, 9, -545, -131, -222, -227, -583, 132, 122, -144, -126, 159, 406, -167, 114, 491, 332, 69, 360, 678, 164, -437, 199, 315, -40, -417, -59, -428, -398, -377, -129, -21, -493, -111, 279, 93, 55, 309, 330, 434, 17, -11, 473, 243, -77, 125, 417, 95, -212, 63, -21, -363, -179, 28, -130, -405, -241, -149, -141, -524, -313, 221, -62, -292, 302, 450, 11, -42, 316, 398, -14, -79, 665, 348, 311, 166, 320, -166, -527, -346, 161, -187, -739, -136, -121, -322, -254, 202, -65, -352, -149, 431, 423, 205, 226, 468, 228, -322, -62, 448, 10, -165, 102, 244, -121, -148, 82, -226, -510, -246, 145, -261, -592, -613, 365, 329, -136, -45, 177, -7, -157, 468, 403, 46, -88, 394, 311]
3057C11m04L29Q4k48k32j01O26m32o60K83M28m08J00L97j55k35L20K25P9k21m3
3078D3K52j77k32M90K92o66j61K95J34o50K20J85k9k19J19J18J72q74L68M0L57
3099G7m67L62J87N5l30M90K67m34Q8K54l42k05j00K63j05l56M85l52j28r7L19
3120f9q2j12M8J26Q2k40m5L83J16j24Mm7J92KJ46o3j17j93o3K71l91P5J96k88
3144a93j08j00L5M26l55O0K99k55l6K70N37l92o8j33M37l02m7M52q5n03k51P28
3166D16l21l53j09M92l32j76J15K75l95q5M22qq3J1J78O2k40N2L80j09k56K58
3188A94J7O1J02k34M9k67R2j45J11l22K9pJ90j76J96n9O1n32O36L31l0k01j05
3211iK05k38J92j41L67l31J26J70O2m76K30j86J85l17j01J48j28o4L65K09n68
$$ y = [311, -93, 236, 320, 72, -160, -261, 365, -67, -727, -444, -16, -424, -324, 73, -82, -317, 3, 228, 307, 86, 43, 295, 118, -114, 376, 668, 2, -159, 136, 270, -380, -160, 25, -4, -223, -104, 14, 186, -688, -320, -280, 77, -390, -28, 159, 214, -116, 374, 641, 207, 295, 549, 207, 2, -98, 165, 60, -296, 189, -163, -291, -388, -69, -151, -263, -215, -89, -7, -247, -292, 91, 207, 83, 87, 40, 232, 234, 380, 317, 200, 7, -56, 215, -176, -101, 95, -193, -301, -401, -366, 60, -295, -235, 64, -191, -227, 43, 580, 188, 120, -13, 424, 122, 75, 527, 442, -61, -312, 416, 95, -258, -367, 125, -207, -383, -268, 7, -388, -473, -51, -59, -142, -131, 47, 109, -131, -79, 301, 192, -64, 194, 211, 272, 374, 140, 189, -78, 14, -131, -20, -342, -313, -320, -130, -306, -110, -169, -108, -640, -4, 327, 297, 96, -9, 196, -42, 150, 9, 376, 45, 171, 341, 403, -73, 157, -29, 156, -161, -262, -114, -242, -306, 59, 268, -300]
3232c00j19N16m7L1k61N94j07k34LJ10j52M07m27L7qk18K09K30l16j06K3r9J04
3255a30n2j23J56J1n2k0N01l2j24L12k98J9K68l78J12QJ9K25m16p0M73l09m42
3278c42L80l11J85j12J39l35J04J19N32o40M2L51j87L74o5J62l73J29L2OJ64k76
3300G8j50J08r9O2k93K48l87J03l7K25J14n5N3l7P1l5K34K16l47J05J9J70l06
3323F0K77j7k09K2j28Q3N1l38J92k61K03nk24J14j47O0K21j4K55k49l5N2Q5J45
3347A93j30K10k08n1J25J21j44q0L4k56R5m6q9oR6Oj11n8Q3K35j30J02L5J0N2
3372H8j39N5K04K26k55j77K53j52J3n3Q0k03q2j40J97q9j1j05L57n3k13K40r9
3395e8p9J8R4J34j77J33J32k4J09N1j55M3k6m70K48m9m73N35q6J60m15K03R8j40
$$ y = [-300, -419, 97, 50, 81, -180, 414, 307, 73, 76, 186, 34, 441, 14, 51, 43, -175, 34, 264, -52, -158, -135, -234, -130, -182, -305, -149, -138, -190, -210, 291, 259, 135, 447, 149, 168, 436, 58, 170, 178, 197, 422, 6, -64, 409, 100, -342, 38, -273, -88, -200, -61, -396, -292, -173, 359, -281, -239, 112, -75, 299, 234, 396, 23, 152, 184, 190, 354, 78, -72, 36, -63, -1, -294, -46, -433, -330, -367, -142, -28, -83, -30, -67, 4, -31, 203, 419, 72, 177, 196, 366, 60, 337, 320, 111, 133, 5, 88, 139, -199, -7, -268, -65, -70, -294, -180, -327, -267, -46, -60, 195, -54, -89, -37, 48, 193, 63, 273, 65, 14, 139, 260, 116, 36, 70, -186, -91, -137, -226, -232, -136, -130, -241, -299, -216, 19, -111, -9, 26, 36, 88, -51, 4, 208, 434, 179, 2, 255, 103, 116, 63, 143, -60, -142, -282, -85, -174, -185, -290, 67, 14, -199, 41, -58, -137, -119, -25, 109, -68, 65, 197, 173, 282, 333, 178, 221, 195, -275, -27, -76, -549, -14, -100, 60, -355, -152, -54, -194]
3419a94J42j8O4j68L2K23j49Q3J22M0N5l26M56k73j00J58j84k8L62k98k12N3n9
3442b19J44k02OJ43NJ06j32K65j88k6L74l53K0L02k01L44K60n82J80l12p3jQ3
3465e7R6r9l34P8L87j20k67j93M18j86L52p5J8J08J50j27j49R2M5k53J39J23k13
3488f7J90Oj1m6j86L9J77j99l36J77N3n2M3J01j85J43J42L66j25K29l24j06K15
3511B44O1m07L20o1rk79p1L50j56j12j21m0N0J16Ko8R5M6O6K93l28K19p1j09K14
3536B44j93k54P35m06n7J28j97q3R6k1%j21m8J61j46J51j72K58J84n44K34J77
3558A26l43j6M01K4j18K04j38j42L85k56J5l06O0K93j81j58K44p1p6j40K71m27
3580c49K60j1j7J29K04j62r1J79j79J74o5N9J14j17l35M83l87J74J11j37l94K5
$$ y = [-194, -52, -70, -6, -174, -142, 81, -68, 15, 137, 177, 232, -94, 362, 89, -11, 147, -37, -65, 297, -1, -213, -160, -219, -75, -277, -271, -128, -123, -17, -149, 116, -72, -98, 276, -77, -57, 245, 44, 388, 648, 66, 246, -66, -139, -140, -57, 39, -60, -394, -316, 71, -49, -316, -509, -91, -277, 75, 0, 18, 126, 276, 149, 0, 92, 137, -116, 23, 146, -67, 123, 129, 118, 72, -114, -75, 102, -97, -433, -256, -203, -255, -212, -111, -296, -153, -11, 355, 230, 459, 135, 29, 244, 305, -102, 218, 157, 148, -131, -202, 148, -8, -120, -241, -281, -231, -115, -113, -181, -86, -40, 26, 319, -9, 210, 139, 30, 244, 51, -203, 532, 126, 69, 197, 0, -83, 13, -8, -8, -129, -177, -16, -162, -11, -183, 75, 259, -285, -51, 126, -217, -233, 168, 192, 74, 278, 140, -2, 383, 127, 142, -164, -104, 189, 8, -150, 94, 23, -53, -193, 78, -349, -89, -100, -117, 12, 216, 54, -37, 142, -37, 137, 72, 131, 245, 128, -207, 276, -111, 63, 174, 37, -357, -332]
3602c32M48j94O1q4J1J0oq1J80J23J00N2m85M55j9k80J50pQ8m6M3K8K8Mm79J63
3628f9R9l97J32Q4Nk7K20Mk01M12k34m0r0M24j01k79M56j95j91O5P9k41Q2p6N5
3653b4Jk99K72l40K28q7K70r8j64p3M11j16l45M52j94L76j87K01k29p1K01J6J7
3676B18J20m16j05R0M4R8j84J2P3m0j28K2L60k76j28j57M90q3k0J93J60m2j51
3699A50P0q1l3j06J03q7j73P2N6k16P0J3p3K35k11J05j12J72o7j19J59J29k74
3722b18L20QK18l11K4o8k5q1K30o6M3l20Q0np3n6J27K55pr2l4J13m55L73k6L57
3748C11K3k23L35k5m17KJ33M5j22J15k03m5Q0Lj27j91K23k70J13L45m0j86J23
3771Bj0j66J37L9RK21o7q4o1J82oj87jJ08p6J42k98J6K48k72k23K19o0m8J33Q7
$$ y = [-332, 116, -78, -17, -101, -90, -80, -86, -167, 13, 136, 236, 288, -197, 258, 239, -41, 109, 102, 190, 144, 187, 215, 243, 247, -232, -69, 30, -367, -235, -151, -146, -173, 47, 51, -150, 262, 28, -12, -102, 322, 221, -58, 398, 203, 12, 77, 156, -85, -3, -79, -24, -23, -322, -50, -390, -162, -249, 21, -77, -241, -314, 97, -19, -364, 88, -106, 270, 83, 284, 55, -16, 185, 201, 218, 338, -78, -183, -93, -49, 49, -135, -123, -50, -90, -218, -196, 164, -112, -240, -397, 93, 10, -10, 183, 343, 301, 150, 220, 139, 106, 0, 103, 16, -157, -85, -29, -245, -175, -162, -235, 0, -211, -106, -218, -46, -113, -232, -73, 56, -218, 102, 110, 328, 17, 41, -27, -52, -133, 97, 31, 74, -246, -166, -171, -244, -300, -173, 82, 75, -17, -51, 62, -393, -20, -46, 311, 334, 111, 446, 421, 4, 6, 139, 184, 62, 177, -26, -71, 9, 12, -115, -306, -83, -353, -240, 105, 65, -121, 2, -8, -174, -37, 2, 11, 232, 165, 81, 20, 202, 196, 9, 8, 116, 40, 182, -116, -100, 148, -124, -347, -128, -188, -236, -103, -16]
3797a6Q5p8j15l2J06j23M60Rj62K5l1k27r1L66l00J21O9j65L6K61k66mJ41k66
3821a97l9K52J5k25K38k51J87J8K36j32o2o4n5J00mj48K07j19k02N28m97M11m82
3844b85L24j27J27m00K2M68k66O4M7M2j41K03j64L0L4L99k41j9lj42M5k18L52
3867A51k93J32k5M4l17J42L23l07j74L44j26J42j65j78L28j96R3K46j21l5n1N8
3889A5J86Q3Jk92j82J62k35J70L2k05K56k65K88M4l02J53j1j83K82oR0M7j33O0
3913E5N7J4k07Q5K82j69j9j84Q3j2j28K5J21l6k00J31n9Q6J62j14J66Q6l35K85
3937A75L3k0k66K4K41O2j28k13M43k97L6k43K43N4m94K69j6L0j16J9r8L48r7K3
3961A2K93o0j82P9J08k05K22q0k17q9J47n8K60l73J18J57p8J01j44P2mj34J54
$$ y = [-16, 69, -9, -124, -156, -50, -173, 287, 296, 134, 159, 128, -99, -190, 176, -124, -3, 66, -99, -63, 198, -68, -72, 69, -197, -236, 16, 31, -194, 44, -207, -20, -2, 234, 102, 40, -24, -79, 21, 17, -131, 76, -43, -245, 283, -214, 197, -285, 39, -88, 39, -361, -339, 129, -137, -73, -26, 16, -125, 78, -86, -56, -22, 377, 136, 117, 114, -28, 17, -201, 151, -142, -10, -35, 9, -308, -166, 157, -150, -324, 20, -106, 36, -129, -307, 21, -175, -82, 164, 43, 8, -43, 15, 201, 284, 285, -7, -189, -27, -262, -92, -60, -265, -9, -274, 14, 58, -244, -91, -102, -285, -3, -9, 81, 128, -5, 55, 112, 126, -81, 4, 286, 117, 98, -86, -3, -15, -143, -118, 3, -33, -233, -102, -161, -75, 87, -27, 139, 225, -110, 175, 208, 188, -78, -54, 187, 249, 121, -92, 351, 54, 90, -153, 90, 144, -350, -81, -97, -67, -183, -164, -262, 86, -11, 12, 305, 245, 63, 142, 250, 45, 267, 187, -30, -119, 28, -30, 230, -143, -25, 132, 54, 155, 11, 83, 79, -55, 99]
3984I9M2k16l8K54n6j49J35JQ0j15j32J90k21K99P8k75j25Q0k92J97K9K03k13
4007a45K14l15J36O4j42J90R9j45J84q7K32l05n3M13o51K78J11J31q7q5J48k23
4029c8J46j71J07j5k1m8k58M1P4J14L7pR5p1q0K77j76l9N7O7L81n81K2J82j41
4054d6J0k8K19r2j72K66j87j51K77k10j28J1J33L0jJ91O8j42N1k00J2J31J51n39
4078c46L08K17M6j03O5p2j53j70J21l7K07k67lK81P8l19J49j4M8K08r2m7k21J78
4102F2J62k09R7k1k39K94r2J22pm62J14j0L92m80PL60k1j30K7M6Q3K1r8L14k23
4127A09J57j94K1R8k59K87k79R0J92m16M6M2o1P2M4r6K52n26M78J47k57l0K99
4150B16J06k99q1K09l53K65J26m60K72o0J27l49K81j42j9j75M37l04J49j53L8
$$ y = [99, 141, -75, -113, 141, 85, -64, 71, 72, 152, 37, -95, 95, -126, 173, 251, -24, -149, -69, -361, -164, -135, 68, -145, 69, -246, -110, -46, -188, 2, 101, -44, 140, 53, 285, -20, -73, 340, -311, -33, 78, 209, 122, 37, 185, -38, 108, -63, 44, 29, 8, -40, -298, -257, -183, -69, -32, -39, 56, -15, -95, 182, 6, -33, 24, 91, 472, -109, -87, 95, -46, -36, -64, 155, 63, -109, 157, -30, -181, 96, -114, -242, -231, -98, -68, -69, 122, 190, 48, 99, -101, -89, 42, 193, -346, -38, 179, 225, 122, 187, 115, -38, -208, -87, -124, 83, -184, -187, 94, 172, -147, 2, -12, 36, 244, 152, 105, -116, 62, 224, 15, 112, 91, -148, 146, 54, 176, 169, -293, -179, -189, 203, -277, -270, 90, 69, -61, -34, 12, 95, 116, 18, 332, 109, 266, 72, 93, 191, -68, 219, -60, 30, 222, -194, -148, -106, -167, -95, -51, -147, 105, -421, 57, 204, -53, -83, 216, 322, 23, -58, 151, -202, 63, 189, -271, 1, -59, 68, -281, 0, -142, -161, -336, 101, -203, -54, -207, -169]
4171a69J19J77k26o2K55j15K50k69J49j50K14k08N15n66R4J58kl25J46O7P8l57
4193b27K14P4m5j03l1j19L65k62J08Pj19K84k50M14j94j74K90P7l93K75j76L9
4215E4j75k5oj92L66R3l16K57p5K62k37P9O4n3p3N2j16o5Q0P3J54k28J54J9j21
4240B5O7j40m3O8Kk47J85K26k16J14k32L42M8r2j56J34j0p6j77L20m13L01o2J99
4264A67n5J96n04L37j36J90k0j95k90L25j02k78M47k73M59l43K2J44k25J33P9
4285G8O3l47jL79j67k35k9L77j4q4J20l65K83j6m3k23L91l52R6Q2k85L91j03k0
4309b4j24J41n8J62mj79P2L11m37N1J62J12k43L29l74k72M48J30m79J72L11m82
4331b75P8N9K60j15R9l57J34K35j47j94L20n8k44J86K50k99J34Jj02j51j44J50
$$ y = [-169, -50, 127, -99, -161, 94, -21, 229, -40, 109, -41, 173, -35, 480, -86, 8, 166, 164, -161, -15, 52, 130, -227, -13, 61, 16, -87, -118, -237, 128, -134, -26, -19, -138, 146, -104, 310, 116, -58, 232, 309, -84, 191, 15, 54, -121, -146, -152, -344, 22, 115, -201, 56, -19, 243, 6, 85, 149, 96, 23, 75, -41, -106, -26, 47, 201, -27, 127, 146, 25, 92, -48, -91, -23, -21, -268, -83, 143, -73, 41, -191, 151, 199, 107, -49, 85, 75, -1, -178, 142, -271, 30, -32, 167, 112, 308, -196, 141, 5, 195, 175, -20, -310, 15, -87, -365, 82, -191, 268, -75, -53, 91, -134, -1, 78, 141, -206, -207, 172, 5, -230, -259, 118, 104, 20, 140, -225, 58, 42, -1, -224, 167, -185, -89, -7, -292, 99, -4, -24, -148, -7, -65, 97, 93, -86, -14, 297, -140, -89, 73, 185, -58, 271, -103, -375, 73, 203, -276, -104, 207, -275, -197, -138, 122, 7, 106, -251, -117, 118, -29, -223, 97, 39, -205, -19, 231, -68, 66, 67, -35, -186, -330, -180]
4353a80K1K55k75L36j76K06k36r9O0J90r3qJ28j49p3K63q8r7J81j81p0k2J02O4
4377E9r9J5J2j8n2j24K97j99j66J47Q9%J37j4J12l40Q6J29j88O4J20J55j33O2
4401A51j09l3J95o0k91J20L29m11J95j24J72j37Jj06j96L18j21M6j07L86k22p6
4423h0L3K86j43j39k38L22r2N2n2j63k5J39J83J46k49l8p0J63m6k40M11l1j55
4446b6n4J02J03K30m05K23k6N1k39J56m94M07j73L50k81J50N3k08Q1J52q7m4J3
4469C4k14L30p4J06kk71J8Q4j60M04k92J0K25p1j75J17k34L28k11kj48J63j2j
4493d8J69j16J39O2j89n0M47k93r5J33l08J41L2m0r6p7k10M03j04J81P4l65K83
4516G3j62J88N7m11K10OQ9j00j39K33n2k63M20j5k23K02j05k51J93p4MK43m0l
$$ y = [-180, -159, 96, -179, 157, -19, 187, -49, -148, -88, 102, 9, 1, 129, -20, -93, 170, 82, -15, 166, -15, -85, -107, -5, 59, -40, -25, -13, -31, -83, -207, 90, -109, -275, -128, -39, -39, 98, 84, 196, -144, -58, 71, -117, -53, 67, 222, 89, 151, 42, 9, 204, 144, -147, -27, 302, -109, 86, -38, 134, -3, -2, -108, -304, 14, -107, -61, -168, 218, -4, -80, -47, 239, 96, -43, -281, 41, -51, 1, -51, -214, -239, -100, 83, 229, -20, -58, -128, 35, -11, -251, 160, 129, -26, -80, 22, 125, 355, -50, 173, 147, 198, -41, 115, -379, 28, -145, 205, -76, 74, 127, -81, 0, 152, 65, 21, 34, -180, 150, 76, 182, 180, -91, -73, 11, -149, 255, -37, -27, 198, 127, -48, 69, -165, 163, -48, -50, -198, -35, -47, -48, 121, 5, 144, 206, 17, -33, 414, 121, 26, 159, -149, -8, 24, -16, -112, -189, -399, 4, -100, 81, 155, -210, 73, -89, 99, 156, -255, -45, -39, 50, -50, -189, 44, -8, -271, 149, 134, -89, 113, 8, -243, -50, -124, -120, 123, 83, 80]
4540H0j28rK62k00J7n4p1r5J66k12M56k97P4Q4l9Jj56K49k37p9M0k3Q9K94Jk51
4566c8jL3l2P0Rj02j29p1K52o1N9k7K5r4K32M2j25M8R2l0j80j18K10q7R1j78m5
4593a55K15n2k79K08P4J32q2k5j72l74N27K6j4J19k06j76L23j9K8l18Q8M9J28
4616D5j11j1K71k26p4L26k83K09j46k91K94J00j96L0J97Q9k77K09j10k8k31J74
4638d0J7j05k13N69q8l82N09k84Q3k91J48j58K69J8M7j40K3J66q9o9J52l12J44
4661b6R6L49m11j42J58Q4j16J62k09O3j08j55J13J53J58r4j29P6j8M1j38J12m0
4684b1J08j37K36n0j03J18j22j05M08j40m25L10j89Q1j27J88J42k73j92R3J1J45
4706d4k23M12j61j9n2J72k30J98J40k18j9j56N05l92L33m61J71K38j33J26j05
$$ y = [80, -48, -57, 205, 5, 22, -32, -103, -198, -32, -244, 212, -85, -11, 73, 34, 35, -121, 128, -109, -188, -148, -171, -82, 212, 213, -38, -39, -6, -38, 32, 41, -61, -190, -261, -9, -70, -11, -38, -13, -107, 125, 167, 42, 90, 182, 152, -28, -146, 64, -23, 68, -110, -155, 60, 8, -271, -63, 11, 143, 61, 36, -136, -510, 17, 43, 29, 148, -58, -234, 89, 70, 98, -220, -132, -83, 45, -66, -77, 194, -32, -106, 220, -63, 146, 0, -291, 3, 103, -93, -63, 134, 223, -54, 155, 45, 17, -214, -40, -23, -128, -341, 228, 140, -242, 267, -17, 66, -225, -77, -235, 34, 52, 99, -41, -18, 148, 59, -10, 142, -170, -26, 70, 419, 8, -134, 24, 108, -8, 154, -55, 8, -100, -255, -142, 11, 169, 75, -54, 22, 4, 45, -93, 19, -21, 87, -50, 186, 136, 33, 151, 29, -76, 332, 192, -233, 77, -112, -31, -158, 30, 172, -101, -293, -200, -189, -44, -267, 145, -16, -35, -87, 85, -145, 53, 193, -25, -44, -200, 305, -87, 246, -215, -44, 194, 61, 187, 82]
4727H2J17o5k22J27j89N8q9oJ04M0j54L56l15J10N4K45m30r8K90j08J27N1L8j59
4751c6J27j28K36m10jJ64k2%j57L86k29k1K9J9K3P9L2j20J75o3n4J87k34k3L8
4776ck34J83Q0K15j50r8j50J95j18K59k41PJ18J77l43J95J25k80qM48m24K10k05
4799d2J4J68P1l05J25p5lR5k88N7L45j38o5m1J2P5j46l25O45j30N9p9j88J62l07
4824c04J00K67k2K55k92j06K77O5j02l22L94p9n9j5l32K08O2j39K69J00j59j10
4846d4J44r5P6l23J97J57r3J17M7j89j82J9K18k07K11qj83J79Q1Pm9k08J42l4
4870b0q2K35k55J6L34m6l15K70%o4KJ7M2n71L97j2J24k20J16J15j18J69P1j83
4894B2j99m0N83l4n13J81j50J52j4K05J0m75L55q9K79k74K01l67L98j49j39j4
$$ y = [82, 199, 134, -88, 39, -150, -92, -181, -187, -83, -43, -197, 159, -156, -46, 8, 253, -177, -275, 15, -93, 34, 85, 123, -36, 91, -37, 199, -211, -212, -48, -70, -70, -227, 159, -70, -91, -62, -43, -20, 59, 91, -29, 146, 83, 29, 216, -18, -41, -3, -237, -54, 26, 241, 91, -7, -157, 38, -80, 179, -62, -55, 63, 240, -103, 92, 217, -63, -71, 377, -47, 163, -42, -28, 140, 211, -94, 31, -44, -47, 48, -240, -183, 162, 24, -41, -82, -70, 5, -141, -466, 179, 49, 108, 29, -159, 3, -304, -204, 63, 41, 296, 4, -102, 175, 240, 138, -184, 210, 131, 72, 57, -275, -67, -5, -144, 125, 225, 66, -44, 100, 5, 81, -242, -45, 112, 19, 136, 183, -6, -188, -169, 49, -158, 53, 45, -138, 41, 122, 129, 80, -128, 14, -20, -102, 133, -122, -106, 228, 182, -133, 137, 137, 73, 75, 92, 134, -437, -40, -52, 72, -148, -32, 83, -35, 134, 205, 22, -177, -217, 366, 332, -181, 0, -150, 2, -12, 193, 203, -272, 83, -6, 273, -1, 200, -167, 231, 82, -57, -71]
4916g1l02M79j21n5j95K25Q1j06J29J65m37J45K35k84o4KL22O3j60j90j03N43
4938C01k96p1M5m3J19m0j61N9K63j63O8j0J7l60K55mM6j22K69Q9n8k62N0K90k19
4963F2P4j24J35r0k49K02n4J45K1k43K73j64J6q8j10J17N9J34j24n6J93k69K11
4986G1J75q5j25Q7k0K9j90q3J65o7J88kl20L32n49j44O19m4n1J51N3j10k34J92
5010C8l45N74k55J5L78o32J65J57K7k40K35j4l58K19J76N8k01qj16L4RJ87l8j4
5034E1O9n9Kn9m4R8l5o8J4j61J66q1Q2N9J04l17J48J19m79L29p7J3Q8K03l58m5
5060b38L79k17M20j31p5j03O6r7q4J2k77K63K5j40J84j63J50j06j5J35j30J36
5082fl0J05k00L06l17L57j67k64J98K20k69J89q1m40N13J16k22l6M8l67M98j20
$$ y = [-71, -373, 106, -15, -70, -265, -40, 41, -65, 64, 229, -208, -63, 172, -112, -176, -174, 148, 211, 51, -139, -242, 301, 5, -66, -21, -64, 55, 15, -146, -87, 176, 13, 81, 71, 88, -272, -17, -21, 25, -97, 172, 261, 203, -59, -9, 281, 62, 136, 12, 147, 57, -192, 10, -44, 101, 122, -121, 152, -12, 4, -84, -194, -77, -18, 116, -8, -64, 129, -140, 71, 246, 161, 36, 123, 103, 132, -58, -141, 24, -43, 145, 143, -177, 155, -394, -538, 81, 37, -14, 137, 190, 80, -154, 38, -307, 267, 12, 27, 405, -227, -62, 95, 122, -118, 117, 103, -255, -36, 140, 198, -3, -11, -127, -93, -84, 103, 65, 51, 120, 61, 63, 4, -40, 58, 23, -45, -31, -192, -26, -107, -25, 34, 138, -179, -31, 88, -391, -62, -139, -126, -38, 165, -193, -238, 141, -76, 344, 213, 138, 35, 101, 4, -80, -68, -345, -82, -57, -197, -13, -176, -26, -132, -147, -12, -142, -6, -36, 69, -131, 175, -142, 215, 48, -216, -18, 202, -67, 122, 41, -399, 114, 230, 8, -28, 20, -347, 151, 31]
5104C1l41K52N5L9M5k00L10qJ69l95p2J47J87j88K3j85Q6K3r0K76j95K52l93J09
5128f3J08l73L07N3k34l4J99qJ0J07l76L38K60l29J59J08l81k39M37PK36k78J80
5151A94j18j43J82j84j1l6K93r3k04Lp6K97k97L02j54K40q7Rj91P3J64j68j63
5174a68K39k85M9J23L8J14j37L9Q7o6n2n3j01J37J10j39J1j41J43n6J1m3J07L3
5198@J33j33J16J3jJ12k84l5J01K41l00j37n9L32r0l73J40Q8K16k6m5r1k7R3k9
5223d5K35j89P0p6K26l61J21J15j66J02k05M00k51%n8J00m30J72K01k64L36j03
5245g0j76J75j51K75j7j55L86m74L81l18j34L94J9j53J22P8ol26J50k8J25k62
5267a65l1K27L8k61Q4q6Q4K31k61J59N2q7L4K75ok57J59k34lj55L65K8j34q3J32
$$ y = [31, -310, -58, -3, 36, 81, -119, 191, 183, 352, -43, -115, 32, 219, 31, 54, -131, -45, -22, -112, 164, -31, 221, -172, -63, 45, -328, -21, 32, -202, -236, -37, -45, -35, 72, -304, 34, 294, -35, 124, 232, -149, -388, 49, 56, 292, 14, 194, 76, -67, 115, -69, -80, -116, 177, 84, -120, -117, -193, 104, -193, 109, -45, 195, 108, 117, -74, -1, 163, -5, -168, 71, -214, -165, -42, -4, 110, -27, 12, 99, 33, -19, -72, -173, -36, 74, -65, -54, -195, -52, -108, -97, -140, -33, 0, 133, 0, 116, 129, 128, 240, -44, -79, 22, 263, -37, -174, -233, 99, 9, -364, -224, -136, 80, 54, 9, -82, -109, -16, -45, 190, 1, 71, -5, 221, -140, -19, 96, -70, 32, -173, 227, -24, -24, -82, 18, -412, -240, -39, -303, 33, -70, -246, -71, -222, 53, 36, -119, 267, -207, 174, -144, -278, 116, 135, -18, 104, 182, 176, -150, 0, -28, 97, -165, -196, 31, 69, -192, -108, -194, -110, 121, -140, 19, 71, -16, 18, 293, 287, 30, 189, -45, -48, -203, 162, 190, 56, -27, 105]
5292A05j19Q3r1J70l67J93K11j81JQ4J15k00L25m87N91n68K67j33J88m3j0k19
5314h5K07J9k13L34k50R1k0k77m5N7J24n8L53k84k46M43k71J43J10m8j97K45q0
5337E2O3l8Q6k06K11k05m80N66O8q9Qk22N4J08K47m58M95k29J23k92L43j08O7
5360A64q6j70J82J82l72J03n4J18K38l56K36l3j34j44K3Q9P0j47l8J50j07J45
5382E9J02O0l44J16n7J27J69k05J36j60K99l77K85l88K82j35j66l6K34j19J54
5403C6j33K17k57R5k48K86O1J17k76%K72j54P8j87P5j00J44NK28m7Jk80l7J13
5427Ij34K92k23J65l7k28L74l72J75j11J20J27N9j73j10J27J47k91J06o1L42k67
5449C6j03J62k92N18m08l2L1Q4K30l78J15koJ5j84P5L6K26J05k39l02M58j66o9
$$ y = [105, -14, 69, -22, 148, -219, -26, 185, 4, 5, 89, 204, 4, 329, -158, 433, -135, 132, -1, 187, 144, 134, -85, 122, 141, -72, 262, 12, 103, 83, -194, -239, -182, -58, -116, 237, -47, -293, 150, -121, 22, 132, 84, -113, 132, 52, 115, 77, 163, -43, 168, -37, -517, 49, 117, 28, 36, -186, -132, -24, 223, -235, 260, 31, 154, -138, 205, 97, 164, 78, -92, 90, 272, -100, 3, -51, 67, 305, -51, 185, 152, 18, -126, -103, -14, 56, -91, -129, 21, -86, 59, 161, 221, -123, -7, -64, 63, 232, 27, 163, 3, 302, -75, 210, -178, 104, -31, -197, -233, 1, -118, 36, -97, 120, -137, -42, -290, -4, 57, 174, -102, -102, 170, 16, 94, -93, -18, -118, 26, 31, 259, 212, 213, -67, -104, 9, -125, 167, -56, 109, 72, -156, 218, -154, 21, -90, 30, 157, 216, 43, -67, 60, 207, -84, 22, -39, 303, 36, -67, 95, -197, 321, -87, -119, -88, -4, 226, -152, -37, -39, -45, -30, -214, -139, -103, 123, 228, -11, -313, 145, -21, -90]
5473i0K80m4k84K97N6m74O5L8K24p5n9J71k81J7J25L5J02o7j58J7K27m7k46J96
5497B5J54m9P3k12J9j36R2j32K27M5j90J72l5j73o5J34K75l11l1l5OM53k59j17
5521g0pN2L36m54J61p2j29M63l23QR3l15J89K69k43K8mP8k62J62o9N5K71k56R6
5546E7nnl25L85k9L40k47k74L47j6j06J5k74N3k38K51j43K94O0j26j75M5J38M2
5570F4o4M7k9p7M21l38k02J84k00K23L3L4p5q3j28K81J9n3l99K99k09K5L92j27
5594C8o4k01M34k93Q5J99k2j47P7o3Mj83K06J68m0l25M1k9j2N0K11m35K06J3P6
5619fJ48j60o7O6K64n33L03k9PJ55j7l5k01K05j26M6Q4J74p6l41J14J25L8l68
5643b30QJ46k4M9N8o4J55J6k34N8l2L28l95M06m22M7K1J59m8Q3k67O9J3m2J7K66
$$ y = [-90, 190, 146, -138, 159, 215, -259, -194, -156, 68, -7, -66, 105, -176, -159, -34, 1, 103, 36, -122, -105, 122, 75, -171, 25, 179, 130, 203, -9, 10, -126, -34, -166, 61, 106, -84, 88, 53, -120, -185, -51, 224, -87, -118, -153, -147, 306, 47, -70, -77, -25, 311, -143, 18, -54, -183, 280, -43, -35, 58, -257, -68, 201, -42, -14, -18, 60, -202, -40, -109, -54, 217, -39, 57, 52, 47, -278, 107, 78, 418, 171, -103, 244, 228, 122, 137, -137, -84, -322, -71, -214, 80, 140, 14, -161, -116, 22, 64, 0, 47, 18, -59, 362, 24, -178, 6, -194, 29, 62, 96, 21, -62, -190, 91, 110, 57, -342, -43, -252, -227, 165, 38, -26, -227, 207, -86, -1, 198, 176, 29, 106, 43, 47, -136, 70, 238, 198, -127, -86, -115, -127, -77, 134, -301, -95, -82, -6, 142, -18, -85, -19, 245, -288, 15, -14, -7, 148, 131, 96, -105, 100, -26, 20, 104, 278, 202, -139, -25, 100, 138, -230, -222, -76, -100, -51, 7, -57, 98, 114, -120, -62, -94, 234, -161, 245, -177, -130, -109, 50, 2, 85, -182, -113, -100, -142, -125, 141]
5669A41k37J32m7m6k8O7L3k56o0L10r7J3L76n60K19K79J00n15P9kK65j67O4o3
5693@J3K3p8J83j5o6rR9k42O9K08J0l15R6Q9K0k70rN0P6N4q5K00k60J77J68j81
5720Eo2J35l86K88j80K76j88K25j92j18J63mJ49j50J25j54J88Q3oK4j09qK20j17
5744B07o6j61K48Q7o44L95m6j09j78O0m4O29n46J39K04k55K23j79n0j1K36l12
5766a73K21o6P5k0m9j23k7J82J55l80L79l91K73j45j9O2M7OJ47j35k28j58M97
5789A30j75J08j22K09j85J74m4j49J61j60K24m47M89l61K3L7J08J67j97n8k19
5810b87L53J06l69N00j64j05o8ll4N5m9L04k90Q1J59j14p5L1O5j43l3J51k12j81
5834c22J91K93j51P3j71JJ17J19r0J00l31J81j59K86l6O5q2J20k70j53M89m08
$$ y = [141, -96, 36, -11, -57, -85, -18, 15, -241, -301, 9, -88, -75, 301, -259, -40, 239, 339, -176, -97, -99, 166, -1, 63, 0, 13, 36, -42, 141, 126, 60, 51, 150, -92, -23, 185, 195, -120, -24, 65, 85, -185, -194, -144, -68, -14, -99, 101, -159, 18, 186, 5, -57, 78, -308, -20, -200, 76, -112, 113, -79, -197, -34, -38, 111, -39, 86, -68, 120, 203, 197, 221, 112, 104, 324, 207, 141, -20, 228, 315, -329, 66, 20, -89, -267, -207, -251, 378, -168, -29, 175, -80, 143, -36, -86, -97, 139, -173, 48, -18, 57, 37, -12, -135, -162, 20, 175, -205, 174, -217, 56, -89, -108, -46, 1, 7, 154, 19, -209, -367, 130, -45, 63, -59, 150, -35, 139, 95, -54, 107, -53, 171, -276, 213, -148, -125, -88, 20, 187, -10, -68, -287, 66, 172, -197, 303, 139, 34, -34, -37, -71, -16, -65, 239, -51, 30, 189, 75, 0, 31, 96, -47, -80, 71, -141, -322, -131, 162, 11, 84, -87, -86, 31, 150, 60, 160, -171, 10, -149, 137, 101, 166, 84, 204, -66, -219, 270, -138]
5856a38L14j56j39j61L17P7j75j22M05l87L68k27J48l50J99j1m4Jp5J55L33l49
5878a7p6o9K17J62k63n8J51Q0j66J07j83l4p2L59k68J00N3M9l5j99K20p6q5J23
5902B0N8j75J63j27K9N1j30m8L09j83L4j28m3L22m04K44j4j48K57j92Q4q9J03
5925gQ2J15m2j28l01K97j41L58j11k60L88l52r0K53k76L31k76q0K51K4R1j14O3
5948G5m24K21J05M4m4O1k27K44Q9k80R9n5J6J16j05m6K21l36K21J00Q7Jr3r6r3
5973i9K28j47J18j36J89pm3p3j73J42j5k7J32r3J42k10J61l04L38Kq3r3J27l64
5997b88K03J2q9J08J29o0o3J6o2J73j70L95n13M77k74P7j44Q8J5qQK4l8J23n4
6022H5J0J21j60k51J75oj1r6L6R8Op7J47J39j83J11j08k34L56l94J07K42j82J49
$$ y = [-138, 176, 20, -119, -280, 37, 114, -61, -183, 222, -165, 203, -24, 124, -226, -27, -38, -82, -81, -156, -1, 332, -17, -93, -162, 55, 217, -46, -104, 47, 127, -39, 68, -115, -149, -221, 138, -130, -30, 23, 72, 37, -162, 58, -18, -103, 20, 78, -97, 66, -61, -32, 19, -111, -159, 150, -33, 1, -127, -170, 152, -252, -8, -22, -170, 87, -105, -21, -110, -7, 75, 190, 148, 20, -281, 16, -125, 233, 122, -138, 250, -102, -192, 61, -215, 116, -160, -240, 11, 35, 126, 12, 75, -349, -128, -23, 21, -23, 38, -189, 55, 144, -136, -37, -92, -76, 40, -65, -111, 110, -226, -5, 95, 182, 183, 90, -6, -99, 129, -18, 100, -36, 153, 146, 103, 30, -143, -1, -16, -43, 89, -4, 138, -72, 89, -215, 123, 125, 42, -51, 76, -288, -85, -73, -162, -54, 75, 15, -48, -32, -94, 79, -91, 304, -209, 268, -6, 71, -73, 15, 30, 22, 30, 54, 16, 139, 85, 95, 216, 56, -195, -20, -26, -37, -133, -97, 1, 7, -70, 77, 216, 33, 144, 36, -198, 158, -236, -129, 113, -69, 80]
6046H0L3k19q6N1R2l0K25J24k46n1j64K43l53M26j33J79j11K4j24k7k0R9K48l26
6070f6P3j20J06p5k2J40k03J33r0LM04k36K3r3n7r9M04k14k2k6p8K84k37L7j70
6095b01Q7M0J49K21k55k69R6J25j68K56n4j70P4Q7J28l7l97J05M28k03j80O2J68
6118I2k52J89N6n4k83R1R7O7K44m18Q5K11O2l96J90j71n4J26o5M28j48j84P1O0
6142D4l5k21M6K80o2n1N2o3%n3R9L4j83J68j41k4k7OJ77P1J92l10O9j78l3M8J29
6169C4P0k14J19nkK4MJ1J47k22J9K30l73K38J80l61k19M84m11J64oJ90j0j34m8
6194i1J75p4j66J73L81k48j76K15k28L07k09l9j72K36l0l53L95j10n5o4J70Lk12
6217a72M4K70k59K29j80J52k32J09k7K9J79k48K18m4M1j70J37p8J30j44M8j4r0
$$ y = [80, 113, -106, -192, -141, -49, -79, 146, 270, 24, -27, -191, 52, -301, 125, -8, 171, 60, 84, -40, -67, -87, 12, 260, -66, 7, -113, -7, -82, -104, 36, -167, -34, -124, -121, 283, 47, 70, -23, -80, -179, 225, 11, -11, -37, -115, 169, -68, -31, -201, -114, -74, 75, 296, 41, -228, -132, -7, -175, 81, 27, -143, -69, 18, 146, 109, -288, -183, 245, 42, -138, -76, 92, -160, 29, 85, 31, -252, -161, -64, 3, 247, -171, -86, 125, 187, -209, -19, -190, -244, -118, -183, 245, 97, -87, -16, 44, 9, -212, -166, 114, 52, 1, 53, -10, -10, -63, 36, 70, -113, 55, -86, -110, -137, -131, 46, 117, 309, -1, 68, -110, -143, -95, 34, 104, -110, 9, 4, 2, 26, 30, 41, 188, -34, -15, 215, -158, 80, 260, -101, -320, 164, -247, -83, -89, 101, 91, -43, -91, 84, 10, -156, 17, 398, 150, -26, 189, -39, 268, 59, 20, -152, 84, 54, -299, 96, -14, -69, -133, 37, 40, -172, -128, 142, -117, 112, -68, 84, -148, -39, -66, -37, 142, -106, 112, 68, 109, -61, 76, -2, 128, -16, 32, 18, -72]
6240g2K18j43J13j02O6n0Qr4J46j9q5J6r1jL2J11l1M3j90K53m2N2N0k49Qj86L72
6267A33l3j5l62K77l6K17j56L4j38P3J41J05j68l4J56j4P0j78m6ql2q5L75k48
6291B8k58M93k64Lj65K12j55k8K01j74J69o1q3K41m3k83J98j41K44l47N39m01
6313g5J31l9r7M8J54J7k76K9k3J64Q1q4m1j70M8KJ99l44J84J92J93l40j53J80
6337b0J19o9Mk57K77q1k62J67p0J52j58K25j15K10j98K52l40J97k45K42Qj01q8
6360a51K52j97k2M1K1J94K6j29J40l20K15J21o5N3j83L7O6j25K55k51q1K52j17
6383C2J2K3j58P7j1J57P4l2m43L52j46J48m9o9R1p1j1J58L6k80j00K16Ko7J86
6408A27R7n3j43J03j09K02j92q7P7j11Q1oK76l47J68k48K34l35J43j23L96k84
$$ y = [-72, 146, 3, 116, 14, 80, 30, 38, -56, 90, 71, -14, 2, -89, -90, -58, 53, 22, 65, -125, 128, 86, 138, 188, -61, -53, -239, 133, 100, 85, -277, 0, -36, 181, 25, 59, -79, -6, 135, 240, 72, 38, 194, 180, 250, 72, 26, 18, -14, -99, 276, 28, -230, 263, -1, 2, -163, 49, -106, -134, 67, -107, 62, 1, -82, 159, 116, -167, 31, -110, 134, -213, 326, -75, 56, 17, -80, -32, 122, 139, -137, -108, -131, 33, 114, 30, -11, -181, -133, -131, 68, -276, -92, 100, 293, -47, -200, -20, 99, 30, 34, -223, 54, -27, -289, -122, -192, -40, -198, 27, -88, 122, -76, 176, -164, 33, -212, 30, 38, -63, -151, 101, -96, -118, -77, -56, 138, 164, 35, 175, -145, 70, 191, 126, 179, -4, 33, 99, -26, 229, -22, -103, 149, 32, 44, 67, -91, -14, -25, 132, 206, 174, -269, 83, -63, 85, 36, -33, 58, -13, -24, 134, 170, -110, -210, 6, 8, -59, 127, 224, 171, 28, 131, 22, 224, 32, -55, 22, -89, -8, -14, 262, -85, 83, -165, 69, -266, -123, -246, 150, -134]
6430a34J43O1k3p6J30j55J87j70j54L92m31K53j47K17q6Mj8K36n01M20p6P4j76
6453c0PJ52J18k25j80J9J68M4r6J35k33M3r0J58P6n9K71k44R4k05Q1J27k05P4
6477@j09J34J09j39q3j95N16k92L28m9l20K53l43Q2K3J45j9J02k25M8L17l06j22
6500a45J70N5n3j19L01j93L0j71K96k37J09r7j15K44j13J05p2L66k08Q0j68j70
6522a05Q3j60J30J75r0m2J45r8J58Q7m21R5J82M1O7J2k12j96J30J37p3k6K26j36
6546A09r0J22l69j19N21m20M25k58n1o9rK39j10L88l41k5j13J96k64L26o9ok1
6569hK22k71r6J25mK27j47j00j12M11l68L22o1p6m3N2k87M34m37J71K36j90L6
6592C6j86K20j02j68J27K95k98K93j78K9j69L8p3J59j35J53N1J32j95k10K37P1
$$ y = [-134, 9, 70, 47, -29, 101, -54, 133, -37, -191, 201, -230, 23, -124, 93, 7, 11, -7, 229, -272, 148, 72, 146, -30, -23, 129, 247, 22, -158, -139, 29, 73, -23, 112, -121, -78, -168, -10, 66, 7, 278, 34, 128, -77, 4, 131, -74, 0, -109, 25, 134, -5, -88, -283, 233, -59, 269, 220, -100, 153, -190, -108, -85, 60, 41, 143, -82, -34, 283, -23, -145, 25, 80, 27, -92, 209, 16, 46, -125, 171, -66, 43, -54, -169, 75, -38, 67, -5, 361, 153, 233, 65, -105, -22, -182, -52, 123, 33, -9, 136, 38, 196, 283, -138, -43, 139, 180, 247, 259, 47, -149, -19, 118, 45, 19, 245, 109, 19, 141, -228, -347, 174, -246, 179, -79, -130, -199, -208, 31, -79, 309, -32, -57, -170, 26, -238, 88, 19, 13, -8, 214, -57, -153, -28, -32, 195, 48, -52, -164, 247, -121, 201, 140, 64, 21, 73, -214, 220, -217, -46, 190, 0, 36, -150, 70, -32, -200, -73, 222, -76, 217, 39, 68, -101, -63, -136, 23, -112, 41, 92, 224, 29, -181, 56, 127]
6614A27m7k37L94l40J08Q9k23J18J81k43J13o9K24j42l7o8R3J66j10l66L42l1
6636D2O2j00K04j33l01J72J67k33jk2K11j06j42N9j05L94k15O3k88O12l64K39
6658B15j67K00k23JJ54K47l55j93j06J9J35j0R8P9k13J86Q6j00k82L45m3K64m77
6681a40j2j2M23j86j51Q0n8J1j8J14o7J01k54J96j82QJ65l63L01K35l00J25j09
6704i3J57r7k0M8R7L5p9L6q6j32k5J17K1J66r4PL7j8j12J53j9K8M2p1k62J4O7
6731h3K9R1j47K05n1K40l86RJ22N0L1r3n0J04O5k1j08J34j3k2m7l47L14om8K25
6757A97l52J20J08m21L60p5M9l8J29n4J22j74J28K6N8N74q99j34J31J68j01k96
6779c74M52j03l9M5k00K79k22j46M61m4o8o4K89m31K43l08J92Q6J89l25R5K66
$$ y = [127, 80, -157, 237, -103, 5, 94, -129, -11, 170, -73, 40, -29, 195, 53, 16, -52, 41, 207, 97, -269, 73, 42, 104, 4, 208, 75, -226, -54, 113, -120, -121, -143, 68, -38, -180, -121, -226, 168, -47, 16, -272, 340, -24, 215, 48, 248, 25, 26, 180, 427, 72, -121, -227, -208, -73, -83, 15, 94, -119, 67, 153, 53, -229, 116, 73, 337, -140, -152, -164, 259, 73, -78, 2, -56, -45, -63, 51, -16, 85, -169, 27, -155, -147, 18, -345, -44, 191, -109, 16, -93, 64, -33, -53, -5, 92, 127, 48, 84, -2, -134, -159, -42, -21, 145, 51, 58, 95, 77, -35, 118, 99, 127, 169, 98, -164, -150, -83, -54, 37, -110, 95, 44, 284, -102, -93, 29, 79, 110, 17, -33, 71, 136, 115, 7, 141, 128, 106, 59, -288, 26, 20, -28, 197, -155, -35, 73, -348, 12, -63, -14, -52, 77, 23, 145, -29, 99, 125, 183, 757, -142, -276, -145, 23, -78, -374, 78, -25, -64, -19, -219, 60, -162, -308, 153, 109, 41, -23, 266, -165, 78, -230, -38, 48, 237, -88, 7, 273]
6801B73n4k23Mr9J09J5j97J87k87L06j48k97L47J15j44K9J71j43P3j21J9J32k46
6824a79L41k68N78m26J15k8k10p7J76R6m20J84Q7J6r6J78Q4j2l2J17j05j75L14
6847B58Jq5m07J87KP6n3O5j93J79K1k19J5J08J80j78L0k44M36j43j04K38q3p0
6871A7K9nk43K92j15o2J75J36j42J37j91J61j53J84k85J70L5j96R0j52K73m14
6893b59K85j39k7Qr5J59O8q9J18Mj17Q2j19M57j70J8mk38J8J60l60O8J43m1k91
6918c61N56n15L62n3j74K58L6kj93L90j06p5k63K44m4r8J97l92K05K24k34o0q1
6941a79K1J70K71m91O7R1K7K86k92Q4k23K75k61J07Q3kn0J08j28J41J27l4k25
6964b7k96M90j70k0k8K63k22M1J58k57P4p4k61M35k85L38J4k5j21j84L48j36J43
$$ y = [273, 219, -4, 0, -99, 10, 25, -172, 15, -272, 34, -114, -411, -64, 51, -93, -64, 107, -36, 37, -84, -65, 67, -179, 162, -106, 472, 46, 161, 133, -77, -154, 22, 118, -302, -118, -31, -15, -111, 67, 151, 139, 107, 224, 119, -56, 258, 259, 174, -233, -46, -44, 32, -21, 44, -149, 30, 51, -168, -153, -45, 135, -43, -13, -257, 179, 36, -68, 170, 87, 17, 46, 41, -202, 90, -25, -87, 88, 224, 82, 219, 28, 189, 36, 220, -65, 105, 140, -56, 34, -118, 155, -259, 26, -113, -140, -132, -227, -68, 0, -89, 29, 33, -84, -2, -121, 336, 166, 184, 180, -58, -40, 120, -240, -172, -29, -70, -361, 195, -320, 42, -11, -185, 73, 109, 107, -86, 304, 198, 123, -140, 104, 60, -38, 159, -233, -28, 196, -38, -98, -179, -158, 12, 283, -208, -141, -50, -23, 263, -29, 55, -168, 107, -154, -47, 36, 34, -16, 92, -36, 105, 232, 198, -27, -323, 167, -3, -23, -51, 212, -10, 31, 189, -68, 6, -68, -329, 106, -179, 159, 173, 148, 27, -157, 191, 55, 198]
6987A98j61K05k10J1Nj10J76j81J09n2k5N7n3L48j24m63K17J2j22J34Q3j3K4n8
7011GJ39l35J9J23J37J36m44J25J93o9q1k4J23k17K26j90n2J80j03j42L81k37
7033a05J32j44J4M03m44R4L8K33R6l24q9j41J61o9K54p3J07k83J42j52R4K3J16
7056H3J8R3k23J19M0J6K08n18L07j97Q9k04K10o6j5o1J12k42L02j21K13p4k75
7079a86J21q2K5Q7J4l64N06k59J34J82n3m09L99j75M7P2J36l13K09k1l1M6q4l9
7103c8K15k46j32J79J51l37r4K35j46K72n3M1q8j01L81n8m24K26J69k83k7m1J50
7126d9R7J33k62L20k14j51J05k16J7J28J59n0j51O9j70J84K45j11J04j57r4j62
7148b26M11m92J64K26k54Q7l6kJ41k4Q5n3K7q9k89J84o7K39r4j00J09j13J1J54
$$ y = [198, 37, 242, 32, 43, 48, -62, 114, -67, 42, -10, -35, 22, -31, 317, 193, -270, -53, -41, -163, -29, 54, 41, 65, 7, 146, -189, -170, -47, 90, 226, -218, -93, 100, 31, -50, -74, 49, -168, 58, -132, -184, -4, -107, -249, 132, -105, 27, -117, -103, 300, -144, -50, -12, 221, 317, -7, -96, -237, -76, -145, 109, 36, 143, -140, 2, -150, -56, -33, 83, 101, 194, -29, 90, 130, 146, 354, -164, 143, -54, 35, -169, 41, -25, -40, -101, 11, -231, 71, -50, 163, 89, -186, -65, -147, -122, -35, -21, -385, 121, -138, -4, 178, 125, -284, 115, -60, -13, 59, 195, -118, 91, 70, 39, 85, 1, -38, 177, -69, -201, -22, 129, -208, -302, -67, -213, 59, 6, 47, -41, -142, 239, 181, -243, -17, 152, -131, -158, -199, -49, 48, 181, -81, 239, 25, -126, -21, -237, -220, -92, 67, 17, -134, -65, -235, -51, 194, 83, 187, 30, -64, -226, 185, -307, -143, 83, -171, -84, -120, -122, 19, -5, 80, 27, 54, -35, -324, -140, -207, 32, -62, -162, -53, -166, -155, -1]
7172aj53L38k35L70k31K14k73k64K33l7o6J41r1J20j98K66k0k06K87j23p9L2J24
7195A48k6k38K4k41J12J48O2N9N2M0l22K3J98l0K6j9k33M74j16l57J60P9j23M4
7219e6M08m42P7r3j15N91j88k9j39j81K84r9O1J9j97J78O7k45l1J30K7k31J95
7242im9JR2k47L76l28K30j34p5K52q1k47J61J67J05j24k15J12k9K48l8k27K12
7265A53Mk96J62K19k66j4J35j98k82N11m5k5j68M56k07l44K83k19J23J78j07k07
7287a54M22l02j33r9J83J93k23R7P2K08l91K25k53J38j79o8L67k79j49L60n3j01
7309a19J38J6j57L1J17K87k15J44j07o5j29j47o5J3M38k61k38J69j15O7L31j73
7331d0P0J13k78J10j22q2K09rK3K09j13P1j21k61M54o0l60K07K03j65J9L5J57
$$ y = [-1, -154, 184, -51, 319, 88, 302, 29, -235, -2, -39, -105, 36, -55, 65, -133, 133, 113, -93, 194, 71, -8, 24, 148, 122, -116, -92, -333, -221, -73, -11, 48, 100, 140, -182, -159, 39, 9, 35, 16, -217, 257, 141, -216, -56, 23, -100, -56, 352, -90, -13, -106, -221, 370, 182, 153, 14, -167, 117, 18, 79, 98, -99, 79, 146, -99, -130, 0, 27, -204, -9, -58, -57, 35, -212, 164, -164, 66, -68, -143, 109, 28, -219, -58, 109, 214, 90, -125, -13, -42, 206, 168, -59, 153, 157, -139, 23, 242, -24, -38, 97, -101, -383, 128, 83, 58, -110, 346, 139, -205, 78, -141, -18, 160, 53, -154, 268, -34, -167, -266, -83, 110, -113, -16, 56, 264, -127, 98, -155, -17, -196, -264, 103, -176, -325, 35, -18, -119, 19, 35, -122, -91, 26, 313, 98, 242, 135, 70, -59, -206, -271, -258, 180, -81, -319, -150, -265, -198, 133, -40, 30, 143, -135, -25, -147, -229, -20, -29, -6, 203, 90, 161, 40, -221, 233, 173, -187, 20, 223, 58, 77, 112, 269]
7354B69l50N1j2j6j4L71j65o0N8n9N4j30J45k84K02M7J28m88J94J32O6J23j30
7377A32o7m13L16j80J39N7J24k09L01j75mj59J74p1k32L63k76K17N1j14J85j40
7399A9j76J16q3O9N6j3K1Lk78L06l5nk54K99J23lm8j03J60j90J11q7L2ln8J4l21
7426c28J82J44j56q1N4L8K60j22j9K28p0k01l3K42j11J08k7j3k65K04M9M6m1r1
7450cJ57J58m03J17l65L39L4m2K40J4k45J44k8k14J13N3j71J38qk27L86j69j63
7473a45K01L9j83P2P3K71l37Q5J0j34o1j05K23P6J01J1l55J46K10m25L01r4K05
7496A85l99K15J12M8k3j41m6k1k6P9l7M9J05J3J32l44J09J4J02k84M14k90l9L16
7520B43l80J0J77J60l62K95l8j15N0k7j12L68r6j65J65j92J7K5PJ06j58K3J21
$$ y = [269, -81, -30, -42, -58, -72, 299, 134, 74, 132, 73, 127, -3, 142, -142, 60, 107, 235, -253, -59, 73, 139, 262, 132, 65, -348, -32, -212, -73, -16, 108, -101, 200, 25, 21, -138, 36, -35, -267, 96, -180, 37, 88, -26, 159, 19, -157, -41, -124, -55, 1, -12, 9, 12, -266, 40, 5, 0, -254, 45, 168, 165, 117, 14, 174, -16, 95, 8, 40, 37, -21, -7, -328, -146, -2, -158, -239, -185, -147, 113, -9, -28, 200, 130, -71, -104, 138, 27, 135, 108, 95, -170, 34, 83, 129, 88, -3, 154, 312, -91, 26, -339, 0, 34, -8, 232, 246, 1, 145, 117, -97, 16, 69, -102, 36, 28, -199, 187, 18, -145, 56, 95, -88, -16, 57, 328, -9, 76, 86, -48, -109, -214, 9, 85, 186, 197, -158, -12, 198, -227, 74, -20, 185, -214, 1, 113, 161, 138, -3, -49, -70, -96, -17, -54, -5, 100, 113, 245, -99, 10, 24, 126, -158, 256, -34, -73, 243, -137, -127, 50, 210, -152, 143, 105, -10, 40, 13, -99, 269, 173, 8, 173, -19, -2, 23, 30, 136, -22, 1, 122]
7543A22j56l2j29K27qJ33j74j88K63j48Q3j56L13k22J43j49k8J68j11j87J21J4
7565a01Q5m6J57j00j4O8J1O5j06l9P0m5J13oO4l93M55k69J21O9J8k89j3J99J64
7590B38j85m0j10J80j36J78J18k04lJ32l24J29M2J63q8k31RQ5J65J28j19j60J28
7613I5k16J50L0J5p2j1J33k17k27L64l01K50J20pL4k98P7N2J5R0J04m9M5n2M5
7638A69Ok31j08L05j65o7J12J79j27j7r4L28j91J1M5j71k24K88nR3k73M2J28p5
7662d2n5k5L42j68J30j52R5j48J58r5r4Q0l6M2J43k33N1J01l34L31m26K46J70
7685H1k15J20o2K43K1j81J38j48j94p7K01J39j73o3K81p7n3K24j98k05J55k77
7707c20K68k90J64L67l83P0P9j03L58o6K6j22J2l44J96J58k44J40J29k4r3n7K49
$$ y = [122, -34, -66, -195, 32, 24, 157, -17, -205, 58, -90, -7, -163, 150, -72, 71, -78, -106, 62, -49, -236, -115, -101, -16, -62, 95, -5, -19, 49, 60, 125, 19, -20, 50, 5, 118, 112, 176, -217, 238, -31, 90, 159, 177, -112, -125, 74, 238, 53, 13, -97, 83, -53, 125, 243, 39, 36, 168, -156, -27, 15, 178, 90, -141, -132, -47, 118, 246, 127, -33, 95, -121, 29, 59, 74, 2, -9, 124, -93, -320, 44, -257, -7, 113, 106, 140, -158, -81, -29, -14, 76, 180, 131, 176, 124, 169, 175, -56, -164, 141, -24, -91, 21, 200, 73, 56, -38, 290, 99, 110, 155, -16, -240, 48, 43, 136, -137, -95, 33, -42, -97, -122, 220, 52, 182, 30, 125, -23, 135, 40, -54, 26, -10, 32, 175, -58, -7, 94, -240, 91, -335, -89, 81, -134, -14, -76, 167, 188, 7, 145, -3, -197, -274, -73, 66, -107, -170, 111, 34, -19, 205, 7, -198, -43, -320, -52, -342, -178, 189, -194, -124, -45, -148, 210, 144, 170, 48, 60, -284, -88, 70, -174, -34, 95, 71, -22, -79, 170]
7730A70j43k98Q7L09j93K29J36j73k26j01K14J42k31P4l43L46J22K7J02k37k03
7751a90R6R8K25r3j81j83O2K29J32r5k15L6L58k46k3j72P2K56N2k08k24L21k46
7774a39O1j7n2J55J44PJ37m68K05j32J38j8n3O3j17J40L8k11l3P5R0j69K07k63
7798b12P8L11l31J63j21J31k03m5K84j16R0j9r7q2j85J90n3K84o1R4k45r9J65
7821g9J7Q5J49k89M5J42p4j74J00Q7J3J14k69k1J50r0P1P4n8O7j09K4L9k77K54
7846io1J42K9j47P7m0Q9j7K04r5k38qJ73k4k7k89K19o7J5j28n0K61O0l03L52m1
7872G7j39m7K15J1k34J8J11r8j09M98l17j14k13M05m2N3j14rJ6J35K7k79N6J0
7896h3j09mJ62M5j83j58L73m0N2J43j41p0K26k6l5j51Q4j88K39k01j1k8J27K5
$$ y = [170, 27, -271, -184, 125, -68, 161, 297, 124, -102, -203, 11, 153, -78, -4, -347, -1, 121, 148, 250, 13, -190, -94, 4, 229, 136, -45, -228, -166, 63, 195, 100, -115, -79, 279, 33, 10, -162, -90, 166, 218, 10, -214, 107, -139, -78, -95, -147, 8, 152, 159, 296, -172, 33, -99, 39, 21, -32, 31, -86, 54, 92, -119, -152, -77, 13, -156, 51, -212, -134, 177, -154, 9, -112, 19, -184, -229, 55, -61, 29, 10, -87, -169, -354, -164, -217, 67, 6, 100, -145, -244, -79, -62, 23, 172, -117, -72, 70, -4, -178, -78, 9, 22, 136, -133, -154, -4, -94, -23, 51, -7, 60, -49, -25, 14, -263, -9, -70, 72, 101, -46, 31, -9, 80, 63, 267, 172, -66, -74, 99, 75, 48, -241, -22, -89, -74, -202, -252, 9, 69, -234, 118, 77, -62, -109, 106, 117, -117, -99, 12, -86, -195, 303, -14, -128, -341, 64, 22, 75, -39, -48, -32, 103, 130, -149, -93, -83, -192, -196, -34, 11, -172, -330, 43, 3, 55, 198, 57, -13, 213, 187, 152, 1, 85, -103, 136, -65, -76, -104, 23, 48]
7920D8j7l27N37K1k36J62kj05j23J91j0l13J04P1P0K81l05q2J00j21N6k29J76
7943e3J57j02mJ14j44J98k27q1L60m82J28J64j03R7J45j55p4J97o5qj67m0L4J95
7967H4k18K33N3j4j84J28j04K57k40j21m7J23k08L48p9k05L49q3J45l27K46l84
7989b48K71R9j34M4L9j06k39J4M64k17k24L08j81R0k39NM13P9l09QR6J04j32j71
8013a66K12m00R1J19J04p7j08K89k10j9K64m48M12l70K53j8J00r2M1j64J55r9
8035a31O3N7k26J85O0k50L8L10J08q7k45rK67m54M63m33L87m3o2k4L8r9L35j53
8059I5j04k1J28j29K39k04l34L20J27K96q74M31K92k79p2K21J82j93k21K32q7
8080D5m7k7K65q6j1j55J91k03J70k90J91L6j32O9l2J47kk33n1L45k84J84j73j00
$$ y = [48, 31, -296, 241, 262, 26, 188, 186, 81, -42, 149, 139, -174, -70, 1, 71, 352, 47, -35, 65, -56, 0, -229, -53, 104, 2, -2, 112, -32, 166, -61, -142, 218, -264, -136, 28, -75, 22, 167, 12, -62, 135, 70, 62, -105, -145, -111, 84, -134, 99, 152, 138, -46, 82, -22, 235, -5, -126, -173, -50, -258, 90, 11, -194, 155, 72, 217, -110, 136, -248, 23, 122, -12, 32, 71, -35, -274, -260, 204, -13, -237, 71, -110, -20, -259, -254, 159, 238, -71, -63, 33, 137, 5, -166, 46, -354, -263, -144, -40, -117, -225, 64, -146, -165, 99, -349, 63, -307, -54, -72, 28, -64, -23, -187, -32, -131, -68, -11, -237, -52, 8, -242, -204, 106, 214, 127, -118, -127, 140, -314, 149, -284, 103, 60, -2, -26, 12, -87, 248, 95, -9, -30, 98, -31, 208, 4, -330, -10, 117, 413, -461, -30, 262, -17, -89, 132, 314, 121, -100, 132, 45, -2, -29, 236, 150, 139, -16, 175, -28, 142, -148, 43, 79, -53, 16, -16, 131, 129, -104, -155, 190, -94, 90, -83, -183]
8104a83J33j36K78j52J75l23R7r5J95o9PMK17n33K57K10K07k7k91P2j52N0K57
8127A98j51j03l2K6J26k92L05l98J73J64j35L5MK58j21J39j55r3q8nL25q9j76
8150h5J47j40J03k37N5J99K0l21M25l55K62j55K23j55p0L89k84n25M10L3l5l4
8172a30j89M76k68K33Q8j91K3j40K12L1J48m41L5J76n9J21k06N5P1
$$ y = [-183, -50, -186, 92, -60, 115, -208, -111, -206, -11, -80, -73, -69, 148, -385, -128, 82, 289, 262, -29, 43, -109, -59, 198, 47, -56, -88, -62, 64, -228, 77, -321, -148, 16, -119, -84, -80, 178, 57, 196, 41, -52, -140, -145, 180, 91, -85, 62, -78, 25, -212, -157, 42, 62, -259, 166, -189, 73, -82, 141, -14, -84, 305, 21, -504, -94, -61, -96, -130, -319, 157, -111, 122, 210, 19, 42, -98, 114, 145, 293, -148, -113, 63, 4, 125, -81, -26, 45]
8191D5
$$ Imaginary data points
##PAGE= N=2
##DATA TABLE= (X++(I..I)), XYDATA
0@%%%%%%%%%%%%%qJ6j6J6j6J7k5L2l6M4n2O0p2Q4r3J07j25J43j62J86k10K35k66
36a41K99l34L73m16M62n13N69o29O98p75Q53r37J032j138J254j382J525j683J859
55I76k059K285k545K852l214L648m184M861n747O968q755J1631j7007L0373j24661
70a04578k06111K76946K25462m7044j48353p0415J7664J53869J19818q8095j88884
81e9721k5155J50641J23764q9785j92224k7942J52864O5570q6989q4939k8159
92a02075J1324R1994O5661j10153j33838Q0200J62984J671j05314m2710L8399
103d1857Q0330O5981l7604j11506k3840J08072J01998l7260j43116o4471J10465
114G192J20756m5182j25398n1470L3646Q8525P3875p2661j61007N08J69040P6826
$$ y = [0, 0, 0, 0, 0, 0, 0, 0, 0, 0, 0, 0, 0, 0, -8, 8, -8, 8, -8, 9, -16, 16, -20, 24, -28, 32, -40, 44, -49, 58, -67, 76, -86, 100, -110, 125, -141, 158, -176, 197, -219, 243, -270, 299, -330, 368, -407, 446, -491, 541, -597, 657, -725, 800, -883, 976, -1083, 1202, -1343, 1509, -1705, 1943, -2241, 2620, -3127, 3841, -4914, 6717, -10290, 20083, -104578, -310689, -33743, 191719, 144675, -3678, -74093, -56429, 97440, 217258, 129163, -59721, -84876, 65765, 189529, 99744, -92480, -120422, 32442, 98012, 11023, -73916, -102075, -90751, 1243, 66904, -43249, -177087, -96887, 66097, 67768, -37546, -80256, -41857, 38473, 104454, 66850, -44656, -68496, 39576, 141574, 104314, -38802, -103273, 7192, 127948, 82766, -42632, -94102, -60456, 28069, 101944, 29283, -131724, -131216, 37824, 114650]
126A14650r9689j04997Q213Q2667P2207p132q2973o1219M2098J02099K8518r6601
138b159r2390M8901J12082M262r0030m6926K8357M6171L5485q286p3385m2829
150h0747P6249R1721l3655r8685j2786P4982N2728k0852n7245l5036K3216O1414
162D1304K7640n6823q4413N608R4868M1199p3862p6781J5490O2821L7399j1104
174B3346n6265m3259M4984R1806R431q5458m8971N7093P6499j30n4399l9251M634
187a9940M3477M4634j9561q1569l5039O5254O2176l8135p6119r581M6709L0999
199A3305p470k6549k8506K879N3145M2756l7432o2756J8473P7315K0459n0813
211A4806l4205J6941K9181J7197m956l9197l6766K4905N7119n393p0971l4710
$$ y = [114650, 14961, -90036, -81823, 844, 73051, 65919, -17054, -78273, -36175, 65924, 94442, -2159, -94549, -45648, 66434, 70696, -19334, -66260, -37903, 8268, 43753, 35467, -37918, -80747, -4498, 87223, 53568, -45117, -57903, 17079, 69807, 48955, -8290, -43326, -20110, 41304, 68944, 12121, -72292, -66684, 28184, 69383, -4479, -81260, -65770, -2949, 34450, 23346, -32919, -76178, -31194, 60612, 70043, -15415, -64386, -7293, 69206, 69076, 14677, -24574, -19940, 23537, 68171, 48610, -32959, -67998, -2744, 59432, 21297, -54822, -64403, -17694, 13305, 5835, -20714, -49220, -46341, 6804, 49560, 12128, -50628, -32155, 45160, 65619, 14806, -19399, -2458, 26723, 43920, 38964, -233, -36999, -12094, 45025, 39632, -31339, -66049]
223f6049M3195M9955r577m5525k4441J4514L9128L1522j5622n3749j3290O1508
235A1569N1823k9457n4546k188L7232K8395l08l1073l7442M581M5895J8421m2506
248C96m5285J0221M2439J1055k9252k4082M166K0471K0862L322k8311k3280L0152
261g126M8724p681m7643r060L6177K4701q127k1737k0872p02K7180K2585k3482
274A2937m7763o644M3950K8608k8999m2430J467L1069K1029p96j8849k4045O968
287b3498M3539K1577l0407l3232J3763L5086Q841k0698k2386j433J6967J4205
299B2324q855k6875j4077J8011K4619p988l2232j0637K2595K2052j631j7726j3916
312b4336Q155L0046J7213k1088k7984P767L3289J3996j9365k5265m514J6887J9967
$$ y = [-66049, -22854, 27101, 17524, -28001, -52442, -37928, 1200, 32722, 17100, -36649, -49939, 11569, 63392, 33935, -20611, -22799, 14433, 42828, 42520, 11447, -25995, -21414, 24481, 42902, 396, -44889, -34668, 7771, 18826, -10426, -34508, -30342, -9871, 10991, 14313, -13998, -37278, -7126, 41598, 33917, -13726, -22786, 13391, 38092, 29965, 8228, -12644, -13346, 13834, 36419, 12937, -34826, -41470, 2480, 31088, 2089, -40341, -38874, -7805, 13224, 12428, -6421, -30466, -23498, 20041, 41618, 11211, -22021, -8258, 26828, 35669, 14971, -7415, -8848, 8119, 22324, 13469, -13406, -27483, -9472, 15147, 7159, -25073, -35710, -13115, 8937, 7306, -10420, -24336, -16181, 13865, 31078, 9990, -17994, -10227, 23062, 37058, 17693, -7572, -12086, 4801, 24768]
325B4768j648k7273k5477R056L1998P115l0744k3983J2910K4564N543r565j1759
338a4495m374J3978K2985K164k3023j1266K0857K3153p766k2526n038J3873R655
351A8177n374j2886j1591K58J4005Q574j6933k3866M461K6337R240j7084j6726
364b3408L512J9492J6629k425j7708r604J5188K3619K277k1385j6172Q806J9408
377A8229N025j5224j9608m489J4703J4443q770k3599p436J5966J5102m287j3350
390a3295m347P775J3610P128o724j1926L504J9361R128j3413j4735N266J4748
403A6080K483j1255j1353k744N688O329k274j3431j1268Q426J6004j308j7137
416a5760o767J3654J4875K11r038n104M595J3559R707n690j4744k673J4118J2272
$$ y = [24768, 23120, -4153, -29630, -20574, 11424, 18539, -12205, -36188, -23278, 1286, 6829, -2736, -14495, -18869, -4891, 18094, 20258, -2765, -14031, 6826, 29979, 22213, -313, -5351, 8522, 18177, 12803, -83, -11674, -11416, 2589, 11163, -5770, -29636, -25175, 1162, 10402, -6682, -23408, -19896, -404, 16225, 13800, -3908, -13512, 1676, 25295, 27572, 6187, -9985, -1179, 18229, 23254, 8030, -11578, -16067, -1364, 13079, 4309, -19290, -26726, -10760, 4342, 55, -13295, -17642, -9867, 3743, 10871, 4147, -7779, -4275, 15086, 24214, 10801, -3934, 1332, 16080, 18563, 7308, -4045, -6789, -1101, 5228, 2954, -10477, -21745, -13319, 2685, 1377, -15760, -22527, -8873, 6002, 6213, -2825, -7929, -3334, 10225, 19932, 14242, -502, -3175, 10943, 23215]
430B3215p496j8875o409J1198J0639n846j5171r183M026J1769N945r984j3875
443b0047J414J5290J0773l963j1071k877J1171J2839m86r027l660N368O403J364
457A3491n418q064j013N782J298p032p766k51O042K468o034p343L091R660K766
472A677n803m758L119Q687P619q87r675m528Q907J1874J42j2316j1490K997J2892
487H457L976j1566j2457r33P498P412j018j0279p909N687J3004M719p517p454
501h380L040J1136O566m271n619L90M488K362r11l744l969n29L382k022p387l137
517h605M158K950m378o101r16O296O015j044n405q06N904P652M200l624p302J506
533E00J1267O480p075j0845j719O723N821l341j0714o601K444N455Q86n117p352
$$ y = [23215, 15719, -3156, -9565, 1633, 12272, 6426, -8745, -17928, -13902, -2133, 3812, -6172, -20047, -18633, -3343, 7430, 3467, -7604, -10481, 690, 13529, 13043, 4016, 356, 5724, 12127, 13491, 8073, 9, -1004, 4778, 6076, -956, -8722, -8973, -2931, -463, -6497, -13840, -10749, -1089, 1677, -4126, -8884, -5765, 2922, 10541, 9654, -21, -4549, 4358, 16232, 16374, 4058, -7432, -4435, 8457, 12433, 867, -11590, -12523, -5025, 2387, 1369, -8910, -16819, -11132, 1872, 6591, -926, -8380, -5340, 5796, 12362, 8091, 2472, 2862, 7350, 9712, 8801, 5057, 1088, 559, 3941, 1919, -5468, -8605, -4447, -1497, -5875, -11976, -12892, -6596, -581, -1625, -7030, -7836, -1932, 5720, 9920, 6296, -1006, 500, 11767, 18247, 11172, 327, -1392, 5331, 11152, 7811, -2903, -9504, -7060, -1605, -719, -5836, -13188]
548a3188j437P593O458k993o355J683Q138N092j139k535Q89M321L754O6k710l044
564D593q0L421J005n797p330J053N125j224p524l972K145L198J289j008l359r02
580i367M607O879J724m143k742M594P994M15n541k037L408K573j094l722l147
595D01j574J891J252l823n457j067L534L236j997m750p94N364N667p40l294nL373
612A217M601K600k690m242k17M938K658k332o170m516K518N135j929o663k608
627g700J769J887Q17m26k489j28L768L575j58j502P75L369L799j391l564J328
643C729L662q05l517j523l9n41M31j425m254l644K215L920l83m533l328L356O276
660d03J575l053r34K715K589L045J950k590l281K316M917m51n060m029J635K225
$$ y = [-13188, -14625, -7032, -574, -3567, -9922, -8239, -101, 4991, 3852, 1317, 2206, 6527, 10281, 10347, 7637, 4593, 4513, 7934, 8939, 3142, -4188, -3135, 1990, 766, -6758, -10730, -8585, -5387, -4098, -5106, -8465, -9367, -4760, 2119, 3843, -300, -3042, 1552, 9546, 9961, 4420, 2383, 5791, 8364, 7270, 3548, 401, -1173, 718, 1970, -1853, -7310, -8377, -4843, -1607, -3604, -8354, -9148, -3784, 1883, 1143, -2151, -2156, 1217, 5818, 8418, 5728, 1486, 1269, 6207, 8865, 6533, 363, -4153, -1635, 3500, 1571, -5092, -7700, -5931, -4044, -3227, -3653, -6142, -6270, -2502, 1073, 915, -587, 188, 3557, 7356, 5965, 2401, 3729, 7391, 6586, 3069, 1546, 1507, 966, 1397, -28, -4282, -7926, -5711, -1791, -2174, -6707, -10035, -6679, -403, 1172, -1881, -2815, -100, 2489, 5534, 7484, 4894, 1613, 3929, 8846, 8395, 3335, -694, 941, 3166]
676C166j234m230k559J02k33R58K54k298k189K604M797n69k239J107M074K714
692D225L02j786K27J973J595M55j876k576j138J287N84k487l561j363P86M46q40
709c747k429k83J911J563m08j09R80K535J924P72j29j9J021K464J118k500k851
726A813M33K641k2m598l385M29J344r3j550k340j801L24M360K316k846k928K172
743c731N273K541j372j204O28J229J892J242m50l653j238J351J523k498k942j112
759b521q6p02q39L35M4q87q75J011J747J648J266K07j86L30J843L140R38j687
777D726k963L70L163J257k605m440j423Q91J355n25k450l271j536K683L422r5
793a441l638j803M042M149O02q65J85O41O72K469J788j736k555j73J836k89k832
$$ y = [3166, 1932, -2298, -4857, -4755, -4988, -4030, -3776, -6074, -8263, -5659, -862, -1431, -3670, -2563, 1511, 4225, 4527, 2741, 2968, 4941, 6536, 6991, 5115, 2539, 1401, 2688, 3272, 785, -2776, -4139, -3353, -2907, -3747, -6176, -6459, -4548, -2985, -3393, -3502, -2522, 13, 1937, 2709, 2580, 2561, 3582, 6046, 7164, 4664, 1813, 2246, 4887, 4865, 267, -3118, -2689, -1345, -1438, -2988, -5328, -7129, -6805, -2445, -129, -2975, -5903, -3731, 1542, 4083, 2711, 1507, 2135, 3364, 5256, 6498, 6048, 2395, 1157, 2508, 4031, 1533, -1409, -2521, -2607, -3309, -4148, -3813, -3769, -4656, -5531, -4520, -2773, -1125, 141, 348, 162, 492, 2335, 5475, 6413, 4726, 1763, 2133, 5296, 6553, 3948, -492, -1915, -1024, 331, -194, -2644, -5915, -7451, -4768, -1346, -1441, -5079, -6882, -2840, 1309, 1911, 1046, 1231, 1872, 2544, 5013, 6801, 5065, 2510, 2337, 4173, 3884, 1052]
810A052q77J03j283k628q1J497j058j750K69J243j50O76K136Q04j489P51L165
827B380K186o39j584m7J622J244l21j370k439j253N85R95j286l269j288P35J100
844b649J83r58j286L92K739J621p77l77J500J906P81K43N11p86k9J189L97k051
862B549k511L60R59j023k724j047J041n07j193N37O03q40K66K085J547j220K78
879h40K713J289p28k69J399J067p75j228L2J53j084p98l45j379k011k74J388o73
897b363k384q36J861J343L61l67qJ221J461K086N16o27n28J039J776J060j717
914C894k062m75P10J37j399j239j706o88j04P1l9q70q62O59J784P42j95O93J769
933H20L43n3J408J489k38r52j0P64j92o53r72p08j855n84Q94p8j892j964Q0J684
$$ y = [1052, 175, 278, -1005, -3633, -3714, -2217, -3275, -5025, -4756, -3513, -3663, -2987, -851, -47, -1536, -785, 2380, 4566, 3927, 2343, 2296, 3918, 5162, 4841, 3471, 1032, -221, 364, 1359, 73, -3196, -4484, -3749, -2649, -2466, -3424, -4710, -4318, -1579, 42, -735, -1112, 388, 2294, 3075, 3318, 3829, 3043, 3014, 4203, 4600, 2549, 38, 398, 1357, 334, -2390, -3437, -2396, -2903, -4096, -3559, -2956, -3796, -3530, -1445, 102, -1118, -840, 1873, 3162, 2434, 2165, 3564, 4631, 3856, 2628, 2660, 2813, 1729, 931, 586, -793, -2804, -3078, -1690, -2363, -4747, -5583, -3722, -2379, -2018, -2385, -2393, -1172, 289, 2375, 2891, 2264, 1736, 2775, 4551, 5611, 3894, 1832, 1357, 2067, 2204, 805, -434, -2140, -2828, -2932, -2861, -2900, -3770, -4632, -3973, -2189, -1447, -1642, -949, 820, 1163, 1110, 2518, 4007, 3769, 2817, 2807, 3571, 3379, 2726, 1754, 1046, -809, -1393, -499, -577, -2469, -4433, -4353, -2669]
953b669M11l27L26j67J17J891J806L76p15r3J579J462k73p16m03o69Q4l37m90
972A193j144q34p88p33R2m45k32J84k14L71l1R25J103J059K01o18J102K024N4
991C269q27M43j15n80J87O85j169k631n49O39L62j685j229j31L42R0o1J476j61
1010a645n41O88K213R57q54Q17J312l47o12Q27J099j038j398j020L04N08j157
1027A13j049r05j307l44J010J190j073j783N42K211J332Q4l12L26R31J168J349
1044C483J27p38j132J47J613j06j777j716j49m58J04l92q04j351o01L13J013P49
1062a675n72j97O13J452J018K78R95K80o22M77J369O39j050j370m9j59L78r38
1080H67j108j105j114J22P31J89j740r94R02J881N80m99M95K49N63J775J088k56
$$ y = [-2669, -2258, -2585, -2259, -2426, -2309, -418, 1388, 1764, 1049, 956, 2535, 3997, 3724, 3008, 2605, 1936, 2020, 1683, 1193, 49, -785, -1573, -2306, -2214, -2659, -2891, -2707, -2921, -2550, -2581, -1656, -553, 506, 707, 89, 1191, 3215, 3269, 2442, 2885, 2770, 2190, 2377, 3062, 1893, -738, -1287, -648, -286, -1971, -3200, -3331, -2989, -2899, -2960, -1484, -1645, -2186, -1498, 715, 1672, 818, 1635, 2947, 2600, 1988, 2815, 3914, 2876, 1478, 458, 762, 1270, 113, -936, -1841, -3148, -3492, -2482, -1292, -2365, -4148, -3606, -1395, -63, 21, -291, 35, 966, 2134, 3483, 3610, 2872, 1740, 1887, 3500, 3394, 1617, -99, -248, -706, -602, -994, -1798, -3149, -3750, -3437, -2424, -1675, -2247, -2444, -1831, -379, 639, 917, 1912, 2192, 1570, 2047, 3416, 4055, 3005, 1635, 1586, 1427, 1805, 867, -241, -1346, -2460, -2338, -1607, -1418, -3158, -4152, -3250, -1369, -789, -1288, -793, -544, 19, 1794, 2882, 2626]
1098B626q42Q8N53R69o02j408n11j58j40q68k39p45j409r8P05K89o69j48L40J058
1118a209N61N54K27O23P00l16O69J112L6r66m9L08j77j249m51k98p33p90l65L84
1138a429n54j321K14J468L61j334L96J756N37L58O59O66n38j1J638J135j359j827
1156H15J23J263o21j107n03q13j025l56J135q2j636j007J332J450p8o4P6L91N41
1175a66J212J648m89p81jR19M30j72j87j295p60j41L06p6j586j024m85K54N11
1194a883Q59o90j516L44K087J245k87j59L40L91N89J463P67j714j733J588J499
1211C190q82j723l73r23p66N72O64n37k418l48J672J242r01k58R32J85MJ302J561
1230B195q14q44O72J418K8n25m51kr91n47J130k50k400p27L99L78j72k61J13j048
$$ y = [2626, 1784, 1872, 2425, 3394, 2792, 1384, 873, 715, 575, -293, -532, -1277, -2686, -2784, -2079, -1790, -2459, -2607, -2267, -1209, -648, -94, 133, 756, 1456, 1140, 1809, 2921, 2957, 1991, 1942, 2250, 2073, 824, 373, 75, -658, -1448, -1813, -1429, -1983, -3304, -3090, -1622, -1261, -2595, -2199, -443, 94, 452, 1111, 1777, 1239, 1228, 2866, 4001, 2642, 815, 938, 2201, 1580, 473, -30, -843, -1868, -2224, -1089, -1171, -2807, -3814, -2482, -1032, -1110, -1174, -1098, -707, -166, 1046, 2694, 2205, 1424, 1423, 2342, 2772, 2600, 2413, 1118, 358, 217, 523, 447, -1139, -2163, -2648, -2394, -1883, -1024, -1714, -3230, -2886, -799, 446, 159, 0, 340, 731, 1320, 2783, 3550, 1836, 103, 1691, 3190, 2308, 585, 212, -711, -1477, -905, -241, -778, -3196, -3544, -1872, -630, -1531, -1789, -857, -672, -668, 634, 2195, 1381, 537, 1209, 2627, 2655, 2130, 1679, 1677, 686, 139, 1269, 1019, -1381, -2108, -1709, -1331, -1503, -1764, -1651, -2699]
1250b699L22J459Q79l87l29R84P16M12Q24K48p68n27Q12Q03j021j115nk06p85
1269c83o44Q59r29j912M42J616k58j121N27J544m86o83J510J369p27n41J617J140
1287B940j433o39J257L55j525r14J367k95k348j93J215q08j710M98R02K8j604
1304b907J335J102l78k80J513R15q96l7J510L21j008J33P02q08q39M43P30j381
1322A70j256J82O73j186p38Q08j6j597Q56K150m20j202M33K073m44j66R52J350
1340B622j704n35K064N85k205j053J424j98j839J6J130o21k292L93K245j017j728
1357b713J106J600q31q47J862J730j929n64K023J277j211o57J047J13j700M12
1373G18J317j214k394M28J315j046r11J57J029j571m1J495P06j268J75J427N30
$$ y = [-2699, -2377, -918, -39, -426, -755, 229, 945, 1357, 2181, 2429, 1661, 1134, 1946, 2749, 1728, 613, 608, 402, -383, -1027, -168, -1097, -3009, -2567, -951, -1209, -2330, -1803, -259, -745, -1428, 82, 1451, 724, 183, 1800, 2940, 1507, 868, 2125, 2480, 955, 41, 1408, 1113, -1235, -1428, -213, -1021, -2731, -2233, -1331, -1303, -2907, -1572, -470, -848, -1128, 385, 1300, 404, 367, 1877, 2198, 1190, 1323, 2025, 1217, 378, 821, 1551, 170, -1086, -904, -231, -1417, -2155, -1347, -1363, -2960, -2104, 46, -374, -1576, -1143, 930, 486, 320, 1272, 2622, 918, 383, 2447, 3032, 827, -226, 1198, 1000, -839, -823, 307, -314, -2606, -2213, 32, -985, -2713, -1607, -7, -838, -1685, 177, 1907, -22, -586, 1437, 2714, 1503, 846, 1893, 2006, 306, 718, 2035, 821, -1573, -1145, 170, -876, -1787, -1630, -601, -2172, -2213, -718, -12, -1280, -1105, 322, 852]
1390H52q28J031J179o75r22R02R17j247j054R30L28j992l93J369n26k030j35J753
1408e41m88j514Q52J502j130q98J996J617j410p08J938R91j410m34K266k4k409
1425A96j14J946p43k011K81J004j360j427R87J275j838j226J653J349j142j33
1441a303J722J25j548Q55K292m66j720P96J347p51j035R93L86k023r34J894L1
1458F61k058m92J041K14j285N95J642j399j278J746K071j186j221J650J053j302
1474D52l7J873J66k490k47J969N2k181k43J337j134j721J453J415k173j551J785
1491a275J417j147m17J287Q36j783N87K401l4j862N3K352p98j180M01R60j327
1508D71j430J252R07j809j506J265P38j430l47J279q5j183Q77J942q46j111J204
$$ y = [852, 24, 1055, 2234, 1559, 637, 1539, 2456, 1209, 155, 1085, 1413, -579, -972, 397, -129, -2159, -2294, -541, -1029, -2543, -1691, -189, -1319, -2217, -221, 1396, -14, -722, 1216, 2207, 797, 363, 2629, 2605, 196, 82, 2028, 1285, -726, -445, 559, -801, -2228, -1241, 34, -1804, -3030, -1377, -28, -1170, -1303, 419, 544, -1004, -149, 2143, 1677, -43, 753, 2100, 1349, 314, 1307, 1693, -330, -1264, 630, 661, -1397, -1889, -848, -634, -1919, -1324, 318, -1081, -2359, -613, 1458, 272, -949, 701, 1754, 452, 415, 2288, 2454, -36, -283, 1686, 1738, -443, -686, 651, -483, -2204, -751, 664, -1509, -3060, -1275, 142, -1005, -1422, -135, 701, -1082, -495, 1906, 1872, 10, 63, 2415, 1617, 437, 838, 1798, 471, -959, 293, 1200, -609, -2115, -850, -112, -1542, -1889, -610, -695, -1878, -1001, 941, 95, -1016, 188]
1525A88J196m22m14J134J84j687j53J446K66j886n0J020r16j375O35J236j618
1542a216q71J219J045j174j154J917O68j209J64J758L54j862O19J890l89j615
1558A44M39J356q54j518O59P88j826j112J649L14j384r79J640L42j137J06J710
1575C37l64j147J214J355o39r73Q28J210p46o35P70J85j644K50J054n29j467l39
1593a280J416q33q50N54Q31r11p48J656M67q32j81J264K37o11J66J539p39j398
1611b53Q82J476p47j532N91M69j612m30J135O78k280o91J792P92j499k72J228
1628b73N2p44R34J232n19r79N73J524l98j234P06N10j160k64Q33J54j502o83J218
1647b0j63r21qO34n60n40J026Q79o53n76N45J140p12J53J109j51q65R3J290o86
$$ y = [188, 1384, 962, 548, 1682, 1866, 179, 26, 1472, 1738, -148, -198, 822, -94, -1469, -834, 402, -1216, -2087, -868, 177, -997, -2151, -234, 434, -775, -611, 1147, 1501, -361, 258, 2148, 1759, 144, 583, 1939, 1085, -433, 226, 1014, -812, -1924, -275, 39, -1345, -2324, -684, -342, -1479, -1373, 337, -27, -1174, 40, 1395, 756, -217, 611, 1821, 1075, 440, 1210, 1395, -249, 1, 1055, 526, -941, -1280, 136, -697, -1547, -993, -162, -1073, -1821, -165, 302, -530, -711, 553, 790, 179, 345, 1884, 1145, -253, 629, 2105, 1358, -174, 417, 886, -726, -1156, -21, 657, -1623, -2314, -522, 270, -1229, -1501, -273, -221, -965, -31, 1201, 682, -297, 276, 1800, 1402, 168, 874, 1384, 224, -40, 793, 947, -555, -1238, -20, -183, -1104, -1112, -478, -1038, -1578, -552, 327, -326, -902, -357, 783, 71, 224, 1333, 1182, 317, 410, 1700, 1014]
1667A014r73N4N49o15q40Q84l60j178j30R95N47j126n9Q44N9n06L74J166j44q82
1687c27O66J272o51l52J97N18p50p00Q45Rp24q77P67J07r34m06Q93j4r94M53J039
1708C7n67k48R22K39K3k82M93M87m98j28P65j65n33j74M21o77o13K88L53j68q75
1729i00L53J20n09P0L83J70p07P2J187j3q0K84O69n96j34M3Q86n46n30M83J79
1750H84p35k08P9k98p35Q2R60l48r10o3R20p4k18M04K54p0n04R17P15n55j59K80
1772F18M20l45k17L26l76q70L6N73n9q47j79M60Ll35L64K32n86J46L40M95k7j07
1794F5K59J26nL60J57k83m40L78Kj69j61k26j4m78r6J86l04m02L16J68O1l77L70
1817e07M10k44J08P03J12l40j21K95M43m01J8J31r6p68L39Q0k21k03j32O4j10
$$ y = [1014, 41, 95, 644, 29, -811, 73, -287, -1465, -1595, -600, -53, -1179, -1238, -394, -335, -841, -467, 699, 555, -327, 339, 1611, 960, 608, 805, 1323, 573, -127, 718, 727, 3, -874, -107, 0, -934, -1340, -447, -461, -1455, -1002, 37, -530, -778, 144, 383, 406, 124, 617, 1104, 606, 478, 1243, 1078, 545, 371, 792, 115, -498, -210, 143, -25, -900, -547, -427, -936, -866, -483, -313, -1020, -948, 239, 226, 146, 430, 1099, 503, 369, 412, 1298, 752, 222, 705, 884, 149, -59, 20, -278, -1013, -931, 29, -319, -1229, -1292, -372, -446, -664, -260, -6, -76, -580, 337, 1052, 497, 338, 618, 1038, 693, 476, 802, 426, -444, -408, 165, 106, -741, -920, -460, -457, -792, -428, -196, -782, -636, -296, 199, 172, 65, 324, 450, 445, 805, 962, 679, 239, 617, 619, 450, 289, 63, 49, -429, -525, -339, -643, -1045, -729, -561, -500, -877, -507, -97, -341, -233, 470, 582, 242, 121, 416, 859, 458, 476, 607, 511, -257, 82, 162, -59, -262, -394, -330, -440]
1838d40m09K13R0J80r0K7K53L47kJ31J75J97j52J85J9k96J85L0l42r3j28j0k53
1861a83m3j62j24K1j4k56K84k40L72M42j20K7K61o4k63N93L32jq40L64J37J11
1883F34l01J3n10J93n89M75k84n4p8k41L37LN0p8n7M1M13M21O3j79qL92K85k91
1907F50j52j3l12J01%L2k05n55j34J58J45n3k95j2j5J23N17J6R3J77m5l35Q39
1930G25n3m19K01P1O0m1K8l00k57l84J68K52Q1q66PJ10K18j24N4J79J91l53M65
1953A3K96l1m18L21L16j75N6J57R5k58m2l20L77l32m24j43K35l5k01k0P4m2M7
1976d54k06O43L4j77L07K36L9q2R1L10k28j21lK50k58p8l32J5k56L9l1k60J60
1999c62o1l57J67L28j15N5M97Q5o9L8N34m38o8K82p4J31j82L9k1k7k58j92Q8N4
$$ y = [-440, -849, -636, -546, -366, -456, -429, -176, 171, 169, 300, 475, 672, 520, 705, 724, 428, 613, 643, 301, 208, 80, 70, -183, -226, -388, -512, -491, -505, -761, -477, -717, -345, 97, -23, 4, 265, 201, -62, 531, 863, 862, 22, 386, 523, 634, 333, 346, -164, 29, -560, -85, -369, -423, -501, -742, -405, -402, -352, -430, -487, -446, -33, 388, 451, 272, 264, 656, 941, 650, 498, 485, 173, 274, 274, 306, 101, -454, -588, -430, -285, -338, -633, -645, -660, -537, -20, -4, 89, 266, 221, -114, 725, 672, 253, 454, 525, 585, 544, 572, 272, 15, -369, -201, 51, 132, -734, -727, -617, -399, -523, -469, -290, -99, -452, 13, 309, 278, -140, 181, 497, 322, 378, 535, 630, 372, 330, 10, 387, 55, -369, -512, -277, -312, -513, -533, -459, -501, -454, -660, -17, 17, -160, 147, 383, 422, 340, 431, 741, 513, 392, 389, 639, 381, 303, -29, -14, -270, -231, -262, -522, -362, -423, -780, -613, -285, -400, -345, 152, 237, 168, 206, 740, 302, 234, 516, 442, 573, 391, 430, 409, 382, 124, -68, 20, 74]
2023G4q55N0L10k1Q0p2O9m5K32j9K21L44n10Q4N92P0o3o3j58J55M1m6k42l35K8
2048g9j83J56J3l30k76J42K49j60J26p5J48m8Q7M96K80j74k28J08p0J81N8n1m4
2071C26Ql35K39j72l02q6j80R1O2k41l0K21R5M0R2J06K14r5L05q6K92l13K33J61
2095F45r1j80L4l56N7k54K31k18o4j99p4J28j68k53M7N92j4k98L69Q8M0J25L73
2118E60j73mj67O32j00n36J04k54J66k28j7m6k18k83J48j11j47K75j72K6L12j26
2140c59K65M25m4o1M4L1L15j01j32o7m3J67k7l55L24m89m1j99L07k82j75j63O07
2163e3l5l01J74J07K54m82Q02l0O6n54M09L87j18qm52J28r2k53J68rm47q9P2P
2187c49r1J10k77K11L30k36J26L43j33j29J55J89J65j59J79k41R5J15R7j76n04
$$ y = [74, -781, -731, -421, -442, -362, -434, -365, -410, -178, -197, 24, 368, -142, -58, 534, 604, 541, 478, 320, 475, 516, 470, 228, -107, -79, -262, -106, -93, -423, -699, -557, -308, -468, -342, -417, -269, -317, -230, 266, 546, 372, 144, 252, 182, 363, 421, 370, 326, 334, -1, 238, 66, -236, -322, -502, -411, -349, -590, -620, -399, -304, -264, -172, -66, 148, 53, 358, 272, 564, 251, 484, 645, 554, 374, 408, 52, 109, -145, 86, -132, -196, -395, -469, -341, -509, -762, -715, -123, -137, -435, -66, 22, 62, 187, 560, 387, 383, 216, 848, 748, 212, 316, 62, 228, 0, -17, -63, -281, -564, -416, -527, -674, -399, -571, -545, -233, -359, -94, 331, 287, 226, 270, 301, 616, 515, 383, 316, 273, 440, 413, 58, 382, -107, -148, -347, -40, -322, -497, -660, -53, -88, -389, -215, -108, 146, -336, 466, 436, 502, -52, 357, 744, 626, 618, 166, 294, 202, -51, 117, 108, -339, -428, -356, -349, -440, -330, -607, -396, -66, -302, -176, 167, 34, -95, 60, 249, 414, 255, 434, 193, 288, 403, 500, 324, -180]
2208a80J44j29n9O9k37p5Q2q9J90M5n0L8J29n0N21m0P2l3p3N22k59l4Oj16l14
2233H0j75J49L4j84j84l1j22qL4n7J97j10J64J05J85o4K71L9J28j49K35k09n0
2256B78j17J58J36m27j34L41k60j05o7j37J25k00l24L87l15N26l9k02N91j84j2
2277A9L23q8n6J62j52J50o8K28j82m48L16r9l27R2M2j0l42l51P07j18j39r0K58
2300a73l47O11j13N16k20o2PN5L75m50J58j8n1j39p4J96m72j79O3J80j02n22M71
2323b90m8J22Q1J19r3j07kL91L13k34pk51L30N3J11J62n05j65J65j99J73l15k10
2346d06j85M88j59k8j17K1j00N23k92M60J11l31L9L52N62n43j39q6L09n76M20
2367C23J10j58m49n6J70k14p2j19J54Ll7J72J56L1k14M1P7L08k2K2M4J9l6J35
$$ y = [-180, -36, -165, -224, -155, -392, -467, -385, -474, -284, -239, -289, -251, -122, -172, 349, 309, 381, 348, 275, 797, 538, 504, 510, 394, 80, -95, 54, 88, -96, -280, -311, -433, -441, -407, -464, -267, -377, -213, -108, 77, 13, 284, 323, 451, 302, 537, 328, 278, 161, 319, 455, 28, -106, 235, -25, -130, -197, -334, -209, -409, -733, -346, -661, -135, -174, -376, 215, 31, 19, 342, 254, 198, 360, 208, 358, 290, 518, 336, -112, 204, 105, -222, -130, -88, -98, -440, -791, -84, -202, -341, -431, -173, -520, 91, -22, 494, 274, 212, 219, 274, 649, 199, 357, 339, 288, 149, 75, 271, -201, -380, -317, -137, -239, -761, -290, -338, -216, -135, -16, -109, -216, -218, 173, 486, 252, 245, -6, 324, 377, 488, 650, 145, -20, 145, -54, 119, -196, -406, -591, -103, -262, -290, -407, -386, -486, 37, -255, 205, 316, -15, 24, 376, 938, 395, 256, 170, 479, -97, 323, 433, 275, -174, -230, -60, -274, -346, -465, -311, -308, -345, -173, -17, 14, -200, -159, -82, 226, 204, 226, 270, 289, 253, 388]
2391C88P8j89l07O1Q7J83l88n9j11k1j92k55M98J92l49J78j3lJ09Q1J81P6L8l3
2415B30L22k99K24l22L77m24K24n65R2j1J80o16K97p7J15n2k92N95m80J41Q1N67
2437C07k87L19j25L43r5j94j6P1r3K69l84J13m28K74j79j87K91m75n1K37O0M3
2459a87l6l9P2k22N50K78n04L94M1p2Q9k56J14p8j39J06L92n98R3m18L98N1l19
2482b90P7j20k35rK88K92j86K19j84K39j45K55J35K04j90op5K90m93J07k72J84
2504H5k71J25j21k9j41L82l54o4J16j43J94J58J27n2o4J85m1L08P8l22J62K36
2526E54l49n3O9j83Pk6p3q3j07L6j5m5m1L3J07k37J73J76q5N54k46K05m9N0Nk18
2552A59R7O5l03O4j27r9l5J4l01M5J67R7p8R0J39r5K3oM6L12L8L26m56n1P1J13
$$ y = [388, 466, 277, -30, 31, 118, 301, -87, -146, -257, -278, -470, -725, -227, -35, -384, -206, -219, -222, -113, -32, 149, 225, 263, 230, 552, 253, 477, 155, 532, 108, 332, -233, -141, -152, 28, -588, -291, -368, -253, -305, -597, -2, -482, -341, -260, 307, 20, 339, 214, 557, 462, 268, 252, 323, 230, 499, 115, 228, -200, 74, -105, -292, -1, -476, -527, -290, -230, -187, -223, -262, -190, -412, 138, 416, -88, 306, 347, 275, 364, 108, 222, 144, 5, 111, 503, -95, -2, -420, -22, 29, -290, -213, -333, -568, -577, -289, 3, -183, 36, -148, 91, -54, 201, 336, 540, 350, 344, 269, 559, 66, 173, -99, 85, -186, -61, -182, -211, -352, 30, -324, -388, -272, -415, -221, -63, 64, 12, -52, 133, 92, 400, 478, 156, 318, 554, 205, 152, 221, 38, 45, 19, -54, -137, -244, -208, -223, -268, -309, -276, -169, -406, -233, -57, -142, 412, 166, 371, 322, 372, 377, 159, 256, 321, 18, 82, -45, -144, -179, -165, -466, -421, -254, -157, -235, -145, -6, -101, -78, -84, -38, 274, 312, 638, 182, 131, 202, 315]
2578C15K35k62j96J2j92k5K69l34o7n9J24J1j58j25Q2N5N0K49r7K00r8j24N16
2601C81M9J63r2j17k04K35l06L04m56k24J50J07k62M2j93J3J78q2M6O9N7j04K13
2624c3J33L85l20J46o2n2k5J14kj08j57o4J72q0N0l24j84M38k64m5L1l61K17k65
2648f60N00K72j9j10O1J44m1J40K03k95J97m6p4J8m08L38j63j6k46j28j06L06
2670a33%K3j26J17j67j32M02P4J36n2N0J93J60m35K54j37Q7p7o4K10j92j97l95
2693d01L67r8j82r2L04l34P9l8K99K60o56L27l7J00OR0O21k35j53p4R7j4j66l4
2717C6K73m83j56KL8j84Q9Q4R2p8P2J09L0K48m32M36K09j82J18P1l24K23J90j91
2741B90k23P8N0p7l74R2K5l43J62j47N21n37J37J63J74j84K29K29k28j20K88L91
$$ y = [315, 550, 288, 92, 104, -88, -113, 156, -178, -245, -304, -180, -169, -327, -452, -370, -315, -265, -16, -113, 87, -11, -135, 381, 430, 593, 501, 384, 180, 415, 109, 413, -43, -267, -117, -10, -272, -230, -423, -410, -232, -314, -268, -199, -142, -246, -33, 100, 485, 165, 311, 249, 197, 172, 286, 284, 176, 19, -45, 127, 47, 97, -227, -411, 27, -237, -282, -251, -612, -395, -660, -160, 112, 93, -17, 44, 188, 147, 287, 490, 195, 392, 346, 272, 290, -118, 220, 57, 41, -205, -333, -439, -133, -133, -110, -236, -119, -286, -418, -16, 58, 194, 142, 192, 385, 545, 110, 364, 227, 314, 237, 173, 383, 191, -6, -401, -34, -132, -314, -406, -102, -436, -357, -395, -96, 164, -492, -165, -202, -102, -96, -6, 615, 380, 227, 153, 250, 236, 70, 36, 309, -174, -330, -328, -290, -474, -385, -301, -209, -287, -215, -106, -76, 172, -260, 176, 385, 203, 321, 392, 68, 291, 481, 290, 67, 145, 195, 118, -256, -164, -139, -482, -320, -467, 54, -483, -346, -183, -9, -193, 36, 265, 37, -83, 205, 596]
2763E96k99q0o9K59J60m51L50m51m9k74L71o5m27j20J27L26k9j7q9K24l96L65
2785c8J85K89l17N6J21K2j16J58R0j94j33K05k30j67J0n0k48L1L3N3o3L6J60j
2809a08N1l5J82ok20K79k7K55j84j3L58l8n76J24J56j36k48L6M0m24J52K99n3
2832a36n43L61O0K90m40O27j46k3j93L59M40n15J61K5L34m54m8J65k17k89O1J6
2854a05k9n86N70J37k61r5K03k5m1K5K56Q7l81J28M01K67l55J34J0L2l29J11M29
2877E83p07l7R3n9j37j9R8J29l06k54Q77k36n93M23K64q1r4P0N16j33o03M14K45
2900D53r8m20M05j29j93p2J06j15l54K82J79j61j04j45M91k99k68M97L87m41j74
2921a73K55M77o44L91J84k2m81N7M62n17J48l54L95n08k5K60K36l98j74K85P4
$$ y = [596, 297, 217, 148, 407, 567, 116, 466, 15, -34, -308, 63, -2, -429, -549, -422, -96, -125, -142, -231, -7, -403, -38, 147, 436, 119, 175, 296, 318, 202, 360, 450, 256, 123, 328, 98, -69, -59, -109, -357, -326, -293, -240, -303, -267, -107, -108, -57, -92, 90, 84, -136, 143, 116, 371, 187, 174, 532, 494, -82, 42, 198, 62, -186, -150, -110, -534, -382, -83, -136, -679, -318, -258, 32, -408, 219, 73, 50, -143, 216, 656, 141, 302, 327, 661, 207, 159, 324, 107, -182, -121, -105, -134, -720, -150, -13, -274, -369, -166, -191, -232, -207, 49, 136, -245, -117, 284, 551, 196, 330, 340, 372, 43, 154, 583, -124, -161, -68, -127, -264, -283, -185, -56, -362, -616, 261, 25, -568, -145, 119, 38, -56, 14, 530, 397, -206, 208, 453, 355, -65, 340, 211, 18, -54, 52, -63, -417, -135, 44, -117, -221, -366, 125, -174, -442, 55, 442, 1, -173, 82, 559, -85, 306, 490, 468, -13, 44, 506, -11, 137, -217, 178, -330, -355, -95, 141, -257, -431, -146, -72]
2942g2l95J58J0J98MK15M21k56l99N03J85k27r4j25L94n09j88K43k21k10j39L62
2964a42N7l93M40n0k64J89J53K59k65k78N02Jl01NM79K17n91L6J69J73m43o4L07
2987A96j92l23J85L21n15j43L11J07m25R2O29l8n20L81L07n2l13K29K66l12j70
3008B1M7L25l89P0J11Nm90k24O52k66k10L07K47p1p90K91O19k13l25J77K76M8
3030B18l37M71L2k64L9L69m42o4r5N09m53m95L21L13l83j14K75K5l85n2N15P5
3052G8j67l08L67L37l5j81L81o7k16k68N68k36k29l3N6m6k50J8K03n30J64L18
3074g6j13l56KL10Q1R8K01K57m55j21O41J62n98j36M97m68J20P7J23l91pJ60K65
3097B73o9p93N88J13l81j35n6J72M8PO16J12m72k85L54K60j63J40J86l04k41K89
$$ y = [-72, -467, -309, -299, -101, -97, 118, 539, 283, -116, 387, 572, 345, 251, 126, 520, 11, -177, 66, -155, -365, -504, -142, -85, -478, -38, -88, -352, -163, -10, 249, -16, -294, 208, 209, -92, -87, 392, 609, 18, 54, 223, 396, -47, -111, 196, 4, -319, -134, 187, -328, -471, -160, -53, -478, -386, 243, 205, -315, 66, 373, 321, 8, 237, 503, 191, 21, 68, 393, 4, 74, 185, 190, -300, -524, 128, -138, -348, -41, 206, 135, -655, -364, 255, 42, -283, -106, 170, 218, -119, 352, 384, 120, 159, 528, 86, 22, -73, 436, -17, -512, -191, 122, -261, -375, -100, -75, -460, -512, 3, 78, -89, -397, -30, 307, 272, 91, 472, 405, 189, -79, 489, 253, 24, -9, 47, 1, -249, -231, -28, -558, -394, -76, -189, -545, -543, -233, -152, -54, 147, 404, -51, -172, 469, 631, 33, -103, 394, -74, 46, 123, 246, -145, -152, 8, 273, 204, -589, -1, 112, -269, -404, -460, -288, -240, -233, 383, 495, 23, -262, 92, 352, 189, 329, 515, 211, -30, 259]
3119B59R9l92j1j17O9n4J3j20J17j78p4M06K3l26K1K12K40k84L14j5O0q5J57J02
3143D36k90j54J99p2j68OJ10l59M6N9k3O9k22p3M74J53m62M73j90k04K42L98k1
3166D27j26j8j20K97o52K58J05l2l70J56P8j85l59K44J63l70L78L25j3l73K66
$$ y = [259, 358, -34, -45, -162, -93, -147, -134, -254, -137, -315, -389, 17, 40, -286, -265, -53, 187, -97, 217, 202, 262, 177, 334, 436, 146, -8, 191, 119, -49, -43, 67, -292, -246, -187, -210, -141, -363, -436, 38, 191, -271, 202, 12, -192, 50, 448, 427, 301, 283, 163, 460, -192, 66, 171, 139, -231, -75, 3, -182, -541, -297, -134, -504, -126, 199, 186, -187, 79]
$$ [...]
8191A08
##END NTUPLES=NMR FID
##END=
