##TITLE=1H_LR-0154-OMe-CH2Cl2
 CD3CN
 8 sc, 
 15.2.2023
##JCAMPDX= 6.0         $$ Bruker NMR JCAMP-DX V2.0
##DATA TYPE= NMR FID
##DATA CLASS= NTUPLES
##ORIGIN= UXNMR, Bruker Analytische Messtechnik GmbH
##OWNER= root
$$ XWIN-NMR		Version 3.5
$$ Wed Feb 15 14:30:59 2023 Russian Standard Time (UT+4h)  she@DPX200
##.OBSERVE FREQUENCY= 200.13135
##.OBSERVE NUCLEUS= ^1H
##.DELAY= (6, 6)
##.ACQUISITION MODE= SIMULTANEOUS
##.ACQUISITION SCHEME= undefined
##.AVERAGES= 8
##.DIGITISER RES= 18
##SPECTROMETER/DATA SYSTEM= spect
##.PULSE SEQUENCE= zg30
##.SOLVENT NAME= CD3CN
##.SHIFT REFERENCE= (INTERNAL, CD3CN, 0, 15.7039)
##AUDIT TRAIL= $$ (NUMBER, WHEN, WHO, WHERE, WHAT)
$$ ##TITLE= Audit trail, XWIN-NMR		Version 3.5
$$ ##JCAMPDX= 5.01
$$ ##ORIGIN= Bruker BioSpin GmbH
$$ ##OWNER= she
$$ F:/spectra/data/she/nmr/H-F/1/audita.txt
$$ ##AUDIT TRAIL=  $$ (NUMBER, WHEN, WHO, WHERE, WHAT)
(   1,<2023-02-15 14:29:34.98 +0400>,<she>,<DPX200>,
      <created by zg, POWCHK disabled, PULCHK disabled
       configuration hash MD5:
       00 E9 B6 7A A2 85 ED C7 34 08 36 98 17 FE 4E 26
       data hash MD5: 16K
       5E 71 61 DD C0 1F A1 10 22 B0 6F 59 32 65 E5 7A>)
$$ ##END=
$$ 
$$ hash MD5
$$ EF 3F 2F 78 F7 B4 E2 A6 B9 27 AD EC 55 32 BC 4E
##$RELAX= 
##$RELAX= 
##$RELAX= 
##$RELAX= 
##$RELAX= 
##$RELAX= 
$$ Bruker specific parameters
$$ --------------------------
##$DU= <F:/spectra>
##$EXPNO= 1
##$NAME= <H-F>
##$PROCNO= 1
##$TYPE= <nmr>
##$USER= <she>
##$AMP= (0..31)
100 100 100 100 100 100 100 100 100 100 100 100 100 100 100 100 100 100 
100 100 100 100 100 100 100 100 100 100 100 100 100 100 
##$AQSEQ= 0
##$AQ_mod= 1
##$AUNM= <au_zg>
##$AUTOPOS= <>
##$BF1= 200.13
##$BF2= 200.13
##$BF3= 200.13
##$BF4= 200.13
##$BF5= 200.13
##$BF6= 200.13
##$BF7= 200.13
##$BF8= 200.13
##$BYTORDA= 1
##$CFDGTYP= 0
##$CFRGTYP= 5
##$CHEMSTR= <none>
##$CNST= (0..31)
1 1 145 1 1 1 1 1 1 1 1 1 1 1 1 1 1 1 1 1 1 1 1 1 1 1 1 1 1 1 1 1 
##$CPDPRG= <>
##$CPDPRG1= <>
##$CPDPRG2= <>
##$CPDPRG3= <>
##$CPDPRG4= <mlev>
##$CPDPRG5= <mlev>
##$CPDPRG6= <mlev>
##$CPDPRG7= <mlev>
##$CPDPRG8= <mlev>
##$CPDPRGB= <>
##$CPDPRGT= <>
##$D= (0..31)
0 1.2 0 0 0 0 0 0 0 0.06 0 0.03 0 0 0 0 0.0002 0 0 0 0 0 0 0 0 0 0 0 0 
0 0 0 
##$DATE= 1676456974
##$DBL= (0..7)
120 120 120 120 120 120 120 120 
##$DBP= (0..7)
150 150 150 150 150 150 150 150 
##$DBP07= 0
##$DBPNAM0= <>
##$DBPNAM1= <>
##$DBPNAM2= <>
##$DBPNAM3= <>
##$DBPNAM4= <>
##$DBPNAM5= <>
##$DBPNAM6= <>
##$DBPNAM7= <>
##$DBPOAL= (0..7)
0.5 0.5 0.5 0.5 0.5 0.5 0.5 0.5 
##$DBPOFFS= (0..7)
0 0 0 0 0 0 0 0 
##$DE= 6
##$DECBNUC= <off>
##$DECIM= 32
##$DECNUC= <off>
##$DECSTAT= 4
##$DIGMOD= 1
##$DIGTYP= 9
##$DL= (0..7)
0 120 120 120 120 120 120 120 
##$DP= (0..7)
150 150 150 150 150 150 150 150 
##$DP07= 0
##$DPNAME0= <>
##$DPNAME1= <>
##$DPNAME2= <>
##$DPNAME3= <>
##$DPNAME4= <>
##$DPNAME5= <>
##$DPNAME6= <>
##$DPNAME7= <>
##$DPOAL= (0..7)
0.5 0.5 0.5 0.5 0.5 0.5 0.5 0.5 
##$DPOFFS= (0..7)
0 0 0 0 0 0 0 0 
##$DQDMODE= 0
##$DR= 18
##$DS= 0
$$ [...]
##$SUBNAM2= <"">
##$SUBNAM3= <"">
##$SUBNAM4= <"">
##$SUBNAM5= <"">
##$SUBNAM6= <"">
##$SUBNAM7= <"">
##$SUBNAM8= <"">
##$SUBNAM9= <"">
##$SW= 18.05172834244
##$SWIBOX= (0..15)
0 0 2 0 0 0 0 0 0 0 0 0 0 0 0 0 
##$SW_h= 3612.71676300578
##$TD= 16384
##$TD0= 1
##$TE= 0
##$TE2= 300
##$TE3= 300
##$TEG= 300
##$TL= (0..7)
0 120 120 120 120 120 120 120 
##$TP= (0..7)
150 150 150 150 150 150 150 150 
##$TP07= 0
##$TPNAME0= <>
##$TPNAME1= <>
##$TPNAME2= <>
##$TPNAME3= <>
##$TPNAME4= <>
##$TPNAME5= <>
##$TPNAME6= <>
##$TPNAME7= <>
##$TPOAL= (0..7)
0.5 0.5 0.5 0.5 0.5 0.5 0.5 0.5 
##$TPOFFS= (0..7)
0 0 0 0 0 0 0 0 
##$TUNHIN= 0
##$TUNHOUT= 0
##$TUNXOUT= 0
##$USERA1= <user>
##$USERA2= <user>
##$USERA3= <user>
##$USERA4= <user>
##$USERA5= <user>
##$V9= 5
##$VALIST= <valist>
##$VCLIST= <CCCCCCCCCCCCCCC>
##$VD= 0
##$VDLIST= <DDDDDDDDDDDDDDD>
##$VPLIST= <PPPPPPPPPPPPPPP>
##$VTLIST= <TTTTTTTTTTTTTTT>
##$WBST= 1024
##$WBSW= 4
##$XGAIN= (0..3)
0 0 0 0 
##$XL= 0
##$YL= 0
##$YMAX_a= 187404
##$YMIN_a= -253968
##$ZGOPTNS= <>
##$ZL1= 120
##$ZL2= 120
##$ZL3= 120
##$ZL4= 120
##$ABSF1= 10
##$ABSF2= 0
##$ABSG= 5
##$ABSL= 3
##$ALPHA= 0
##$AQORDER= 0
##$ASSFAC= 0
##$ASSFACI= 0
##$ASSFACX= 0
##$ASSWID= 0
##$AUNMP= <proc_1d>
##$AZFE= 0.1
##$AZFW= 0.1
##$BCFW= 1
##$BC_mod= 2
##$BYTORDP= 1
##$COROFFS= 0
##$CY= 11.3945322036743
##$DATMOD= 1
##$DC= 2
##$DFILT= <>
##$DTYPP= 0
##$F1P= 2.36226072786647
##$F2P= -0.459571619588291
##$FCOR= 0.5
##$FTSIZE= 0
##$FT_mod= 4
##$GAMMA= 1
##$GB= 0.15
##$INTBC= 1
##$INTSCL= 1
##$ISEN= 128
##$LB= 0.24
##$LEV0= 0
##$LPBIN= 0
##$MAXI= 10000
##$MC2= 0
##$MEAN= 0
##$ME_mod= 0
##$MI= 1.114404
##$NCOEF= 0
##$NC_proc= 0
##$NLEV= 6
##$NOISF1= 3.799351
##$NOISF2= 2.8
##$NSP= 1
##$NTH_PI= 0
##$NZP= 0
##$OFFSET= 15.70392
##$PC= 1
##$PHC0= -19115.66
##$PHC1= 12.40078
##$PH_mod= 1
##$PKNL= yes
##$PPARMOD= 0
##$PSCAL= 0
##$PSIGN= 0
##$REVERSE= no
##$SF= 200.130013532006
##$SI= 16384
##$SIGF1= 3
##$SIGF2= 2
##$SINO= 400
##$SIOLD= 16384
##$SREGLST= <1H.CDCl3>
##$SSB= 0
##$STSI= 0
##$STSR= 0
##$SW_p= 3612.71676300578
##$SYMM= 0
##$S_DEV= 0
##$TDeff= 0
##$TDoff= 0
##$TI= <>
##$TILT= no
##$TM1= 0
##$TM2= 0
##$TOPLEV= 0
##$USERP1= <user>
##$USERP2= <user>
##$USERP3= <user>
##$USERP4= <user>
##$USERP5= <user>
##$WDW= 1
##$XDIM= 8192
##$YMAX_p= 0
##$YMIN_p= 0
$$ End of Bruker specific parameters
$$ ---------------------------------
##NTUPLES= NMR FID
##VAR_NAME=  TIME,          FID/REAL,        FID/IMAG
##SYMBOL=    X,             R,               I
##VAR_TYPE=  INDEPENDENT,   DEPENDENT,       DEPENDENT
##VAR_FORM=  AFFN,          ASDF,            ASDF
##VAR_DIM=   8192,          8192,            8192
##UNITS=     SECONDS,       ARBITRARY UNITS, ARBITRARY UNITS
##FACTOR=    0.0002768,     1,               1
##FIRST=     0,             0,               0
##LAST=      2.2672688,     0,               0
##MIN=       0,             -253968,         0
##MAX=       2.2672688,     187404,          0
$$ Real data points
##PAGE= N=1
##DATA TABLE= (X++(R..R)), XYDATA
0 0 0 0 0 0 0 0 0 0 0 0 0 1 -8 8 -8 8 -16 16 -17 24 -30 32 -40 48 -56 64 -73 88 -101 114 -132 153 -170 194
34 194 -219 248 -277 310 -349 389 -432 480 -533 591 -655 721 -797 878 -968 1067 -1174 1295
52 1295 -1427 1573 -1739 1924 -2137 2380 -2659 2990 -3389 3875 -4485 5277 -6356 7912 -10367
67 -10367 14850 -25681 111765 18968 -199490 15471 174308 112529 -52011 -75359 4968
78 4968 100059 48381 -73578 -98841 16880 78580 -612 -128946 -105545 48069 94890 -66011
90 -66011 -149173 -8251 106189 12689 -83520 -36082 39803 44088 22309 -8374 -24762 17631
102 17631 68607 34165 -27341 -9810 46153 35079 -21577 -26306 28938 38748 -25490 -52108
114 -52108 9124 35689 -18156 -36889 712 -3317 -26664 474 14471 -19880 -23840 8826
126 8826 5251 -15358 2335 21769 -2579 -26384 -234 37449 18947 -28880 -18004 32631
138 32631 27216 -18075 -12255 20458 10077 -9107 7385 15357 -7279 -6812 15329 3563 -18647
151 -18647 1848 23520 -6993 -34981 -2820 29480 1849 -33556 -16833 13106 2309 -17955
163 -17955 -5592 6925 -9758 -14782 10430 13267 -9582 -3861 16192 3564 -9428 14184 25497
176 25497 -3400 -15928 14608 29162 -568 -19332 2964 17636 -4495 -15931 2810 4075
188 4075 -17950 -14145 6068 -2641 -16845 -3626 4130 -14122 -13998 14819 18161 -13569 -19029 14846
202 14846 27576 497 -10752 10618 17316 -1158 -1004 14764 6546 -9880 -817 9970 -5097
215 -5097 -13924 2964 4798 -18311 -17360 9181 8220 -18380 -18447 6765 10599 -7241 -7209 7787 5575
230 5575 -4787 4773 17133 4613 -8233 4953 14598 -179 -4548 9577 3917 -14767 -5711
243 -5711 13585 3385 -16612 -10383 5581 647 -10259 -3618 5657 -3424 -10928 2154 12383
256 12383 980 -5915 5914 7822 -2768 2628 13740 2959 -12567 -486 14626 2304 -12616
269 -12616 -3314 6356 -2669 -9890 -218 3701 -7653 -10808 2295 6852 -3084 -4579 4753 2823
283 2823 -3750 4703 13651 1346 -10190 1937 12846 2983 -5339 1905 4347 -5359 -5717 3623
297 3623 2135 -9180 -9474 -247 583 -5529 -3071 2711 -2032 -5970 4117 9550 -537 -4581 5248
312 5248 8945 1030 613 7618 4438 -4367 -1120 7400 3266 -7176 -5871 307 -1971 -5552 -1615
327 -1615 -463 -7924 -7743 2538 4162 -4756 -5160 3937 4137 -1844 2410 9483 3715 -3179 2468 9273
343 9273 4774 -1943 341 2926 -1278 -2459 1636 65 -7208 -6757 517 102 -6811 -5053 723 -1033
359 -1033 -4651 123 5261 820 -3353 1651 6492 3861 1066 3014 3509 925 1894 4743 1746 -4223
375 -4223 -2552 1851 -852 -4771 -2450 -540 -4303 -5488 -86 1736 -2864 -4386 138 2765 1141
390 1141 1145 3259 2295 657 3645 5749 2047 -1761 1194 3172 -223 -2425 -54 308 -3980 -4670 -579
407 -579 -130 -4490 -5428 -1834 -397 -1011 -226 859 -35 -258 3104 5310 3002 448 2439 4213 2509
424 2509 1238 3032 1736 -1888 -2065 589 -318 -3267 -4531 -3221 -2081 -1831 -2203 -2527 -3021 -2996 -38
441 -38 1602 301 -729 1199 2375 2765 3805 4471 2490 869 1502 2516 2709 950 -849 -1423 -1425 -1027
459 -1027 -437 -1941 -4095 -4039 -1687 -1685 -2013 -1521 -1456 -1141 201 2091 2997 1423 -466 1432 3505 2864
477 2864 1784 1279 51 72 1100 1448 -135 -1833 -3172 -2422 -1337 -1359 -2066 -2106 -2023 -2147 155 1801
495 1801 533 -379 354 1836 3033 3044 1692 1404 1270 1538 1890 1659 -9 -1381 -1533 -1731 -1022 -1192
513 -1192 -2692 -4181 -2459 -1326 -1127 -868 -1117 -1557 58 1518 2086 2067 1651 1826 2628 3716 3047 2645
531 2645 2196 691 322 1236 416 -982 -2233 -3028 -2669 -1750 -2382 -3510 -2897 -2727 -2202 -724 -546 -909
549 -909 -144 1336 1953 2506 2314 2329 2932 3211 2473 2902 2469 459 154 886 282 -1239 -2093 -2872 -2471 -2404
569 -2404 -2660 -2661 -1926 -2511 -2631 -1111 78 -10 245 1162 1574 1536 2512 2338 2489 2218 2027 1727 1628 711 158
590 158 -54 -154 -749 -1919 -2700 -1577 -1566 -2029 -1911 -1388 -1869 -1300 41 444 605 698 585 1302 2549 2005
610 2005 983 1955 1853 784 1232 1276 -420 -988 -592 -1110 -1308 -1136 -1986 -2112 -1208 -1228 -1338 -426 -691 -910
630 -910 630 1603 939 1419 1469 1361 2015 2470 1989 934 930 46 82 52 -109 -1620 -1998 -2279 -2064 -1620 -1768
651 -1768 -2043 -2015 -1507 -836 -41 583 850 760 1017 2351 2583 1774 1774 2518 1613 959 1565 1148 -329 -626 -304
672 -304 -785 -1619 -2389 -2539 -1726 -2008 -2577 -1450 -939 -1783 -1463 848 1106 353 1058 2080 2113 1667 2005 2902
692 2902 2381 940 808 1528 923 -872 -555 -492 -2071 -2445 -1716 -1936 -2585 -2168 -1580 -1138 -1502 -654 308
711 308 696 403 1286 1904 1674 1699 2809 2360 1301 1374 1416 1335 -20 -514 -332 -1286 -2230 -1742 -963 -1814 -2649
732 -2649 -1642 -706 -1631 -1423 451 426 -368 457 2109 2122 822 1380 2792 2126 891 1287 1672 133
750 133 -748 103 333 -997 -2514 -1822 -1025 -2100 -1932 -1293 -1048 -2216 -1344 971 900 156 476 1659 1709
769 1709 1496 2095 2424 1262 574 1394 1583 361 -289 -146 -651 -1443 -1598 -775 -1540 -2515 -1754 -850 -1183
788 -1183 -1467 -972 -388 -641 320 1915 1554 879 1108 2432 2160 1138 1631 1522 73 -20 564 653 -945
807 -945 -2119 -1442 -1079 -1802 -1740 -969 -1581 -2343 -1330 460 60 -639 61 1267 962 953 2082 2446 1311
826 1311 742 1750 1944 930 -85 124 23 -1033 -1346 -714 -1468 -2380 -2049 -814 -912 -1934 -1071 20
844 20 -406 -8 1069 1411 863 1044 1820 2032 1463 1325 1661 1262 32 236 581 -215 -1202 -1053 -952 -1662
864 -1662 -1919 -997 -1492 -1989 -1695 -298 -201 -831 190 965 990 663 1675 2186 1442 995 2187 1817 1039
883 1039 364 565 449 -680 -1376 -735 -800 -2007 -1677 -1129 -1205 -2188 -1476 -236 -556 -739 384 1083 774
902 774 689 1587 2004 1341 1592 1700 1211 759 443 636 383 -648 -640 -990 -1166 -1726 -1390 -1132 -1629 -1491 -616
923 -616 -851 -1125 -66 422 608 545 872 1378 1374 1367 1530 1483 1166 846 657 444 -327 -381 -733 -897 -1461 -1498 -1122
946 -1122 -1469 -1508 -1390 -573 -807 -760 104 333 272 807 1787 1472 1102 1287 1453 1427 1040 1017 472 237 -516 -329
968 -329 -193 -1020 -1488 -1525 -1203 -1176 -992 -913 -1066 -791 -306 -8 625 943 438 922 1349 1621 1657 1419 554 894
990 894 892 760 -87 -204 -713 -1087 -1046 -597 -823 -1662 -1769 -1143 -676 -682 -430 -381 207 -138 649 1508 1259 1004
1012 1004 1198 1576 1325 1529 1086 631 456 -364 -193 -178 -942 -1660 -1442 -1008 -1035 -1210 -902 -1107 -1033 -793 -70
1033 -70 557 176 76 750 1444 1671 1581 1557 846 947 1045 1000 601 -14 -636 -525 -722 -621 -1454 -1256 -1677 -1604
1055 -1604 -888 -703 -712 -678 -515 -216 557 936 946 985 1148 1184 1701 1580 1272 1309 431 233 732 89 -569 -1092
1077 -1092 -776 -1134 -1293 -1222 -1203 -1197 -1008 -926 -155 173 -353 -209 829 1363 972 1336 1089 735 908 1127 889
1098 889 570 -59 -279 65 -237 -1111 -1116 -1152 -996 -1172 -1128 -1091 -782 -1071 -501 144 174 168 486 831 599 1311 1503
1121 1503 896 865 1212 704 419 546 -32 -617 -620 -776 -897 -1099 -1692 -1181 -855 -777 -847 -324 -258 -431 -84 1037
1143 1037 1275 300 647 1493 1431 770 995 941 594 -255 547 577 -372 -1432 -942 -336 -1202 -1570 -848 -896 -1498
1164 -1498 -1051 130 235 -643 -690 712 1201 635 1280 1884 643 350 1235 1736 488 -174 -166 234 -429
1183 -429 -708 -290 -926 -1856 -1753 -159 -255 -1623 -1110 -398 -532 -403 1091 869 236 -27 1735 2222 649
1202 649 100 1341 881 -92 609 870 -251 -1604 -855 209 -867 -1510 -781 -327 -1732 -1774 -247 511
1220 511 -1165 -1234 982 1207 -14 613 2029 943 137 1128 2297 611 -920 383 1420 -287 -1240
1237 -1240 71 48 -1883 -1649 51 -62 -2077 -1476 510 -129 -1004 126 1205 74 -565 1413 2138
1254 2138 491 194 1471 1735 -111 -177 1065 438 -1387 -613 841 -452 -2042 -1025 41 -1331
1270 -1331 -2111 8 603 -1247 -1019 1125 1180 -788 -68 2084 1199 -418 1035 2420 755 -921 662
1287 662 1970 -688 -1544 157 745 -1656 -2160 279 236 -2418 -1887 634 -111 -2093 -625 1692 293
1304 293 -1225 745 2368 460 -793 1721 2530 -342 -655 1782 1366 -1448 -866 1441 -150 -2715
1320 -2715 -1013 985 -1052 -2795 -443 1080 -1197 -2004 1062 1811 -1134 -829 2344 1934 -930 420
1336 420 2995 1351 -1049 856 2667 -259 -2197 785 1584 -1345 -2450 528 580 -2652 -2051 1221
1352 1221 466 -2804 -1265 1977 826 -2004 651 2835 133 -1352 1902 3192 -144 -1497 2146
1367 2146 2056 -1543 -1216 2001 494 -3009 -1434 1816 -757 -3266 -586 1439 -1014 -2987 698 1886
1383 1886 -1120 -1813 1844 2297 -1028 -492 2715 1908 -1115 361 3160 578 -2391 419 2108 -1035
1399 -1035 -2462 436 889 -2313 -2740 1129 815 -2765 -1595 2119 671 -2483 -9 3357 614 -2080
1415 -2080 1276 3513 44 -1688 1696 2664 -1105 -1723 2207 1266 -2624 -1797 1978 317 -3287 -1468
1431 -1468 1599 -653 -3203 234 2612 -1113 -2487 1521 2583 -1102 -1263 2869 2162 -1595 -306
1446 -306 3366 958 -2369 142 2720 -271 -2928 20 1746 -1807 -3079 750 1406 -2416 -2560 1724
1462 1724 1139 -2513 -900 2950 790 -1893 485 3430 487 -1920 1439 2893 -389 -2327 1588
1477 1588 1866 -2362 -2057 1909 840 -2938 -1680 1845 -165 -3341 -501 2165 -541 -2846 1105
1492 1105 2718 -1024 -1417 2557 2630 -1550 -826 3289 1623 -2147 -348 2942 274 -3095 -233 2145
1508 2145 -1201 -3481 121 1832 -2477 -2956 1390 1417 -2342 -1451 2206 1183 -2027 -166 3230 905
1524 905 -1906 880 3204 -159 -2013 1398 2335 -1416 -2267 1289 1113 -2746 -1750 1617 -5 -3064
1540 -3064 -966 1853 -422 -2628 456 2418 -757 -1889 1890 2609 -1099 -1163 2659 2131 -1754 -735
1556 -735 2538 815 -2731 -871 2320 -487 -3224 -313 1728 -1810 -2760 986 1488 -2286 -1828 1978
1572 1978 1594 -1949 -594 2591 907 -1577 541 3455 485 -1999 601 2345 -543 -1777 1087
1587 1087 942 -1845 -1676 1196 759 -2840 -1619 1689 529 -2425 -514 2143 -346 -1678 1481 2351
1603 2351 -556 -1197 1676 2200 -699 -693 2092 1142 -2230 -559 2142 233 -2929 -520 1586 -1193
1619 -1193 -2246 341 989 -1338 -1996 1097 1590 -1670 -1048 2170 1520 -1481 -86 2850 557 -1375
1635 -1375 567 2448 77 -2087 402 1364 -1286 -1723 767 671 -2237 -2018 1198 388 -2033 -840
1651 -840 1677 124 -1676 357 1821 -93 -1288 1350 2227 -181 -665 1712 1432 -1272 -812 1638
1667 1638 303 -1865 -514 1214 -569 -2289 -359 1092 -984 -1523 410 1169 -807 -996 1523 1416
1683 1416 -616 -326 2051 1131 -934 435 1874 118 -1370 394 1384 -760 -1585 117 890 -1455
1699 -1455 -1629 462 159 -1788 -800 1135 471 -1300 -113 1667 71 -1077 980 1804 -185 -559
1715 -559 1127 1782 -345 -550 807 676 -1223 -728 552 -312 -1928 -293 934 -499 -1359 -290 971
1732 971 -790 -914 1020 1175 -718 -278 1330 1307 -244 395 1546 757 -673 275 1014 -453 -1292 -20
1750 -20 348 -743 -1232 121 61 -1310 -814 516 119 -1021 -410 985 455 -268 472 1453 506 -275 884
1769 884 1187 -99 -517 631 614 -655 -576 635 -342 -1261 -662 61 -613 -1178 -330 581 -571 -711 548
1788 548 680 -231 -278 940 789 222 57 890 677 -209 183 863 -110 -557 15 345 -681 -1074 -307 -94
1808 -94 -977 -764 -99 72 -843 -346 694 311 -14 302 783 263 -108 539 1044 144 -359 784 612 -231
1828 -231 -393 317 48 -666 -532 31 -438 -1126 -501 234 -337 -603 109 625 262 -33 452 493 261 253 1005
1849 1005 744 132 294 506 166 -415 90 237 -577 -781 -233 -315 -715 -886 -371 -48 -425 -617 134 311
1869 311 -244 193 701 584 231 184 692 464 181 222 286 -86 -284 82 69 -477 -484 -325 -449 -489 -261 -342 -257
1892 -257 -639 0 197 228 173 472 621 491 395 782 236 83 452 342 132 62 -121 -152 -333 -376 -343 -382 -381
1915 -381 -723 -766 -175 -418 -252 76 88 -34 85 337 316 508 320 465 689 396 313 -20 145 -229 76
1936 76 -71 -245 -325 -551 -303 -367 -388 -332 -387 -191 -318 -276 -57 -43 202 134 189 271 423 355 255 285 496 319
1960 319 265 53 108 -107 -327 -376 -439 -543 -201 -558 -415 -90 -420 -84 -301 -115 85 -71 194 290 476 439
1982 439 442 412 224 35 27 -32 123 69 -255 -326 -190 -441 -273 -448 -201 -364 -99 -239 -194 -32 132 220 374
2005 374 53 359 376 542 456 287 55 283 391 214 -54 -43 128 -314 -439 -68 -431 -447 -465 -531 -306 -112
2027 -112 -76 -175 14 304 -35 267 382 427 317 384 400 313 302 -36 315 34 -238 -113 -373 -371 -193 -482 -387
2050 -387 -152 -384 -323 98 -377 -159 151 174 396 326 386 586 502 550 156 9 204 15 174 26 -20 -218
2072 -218 -296 -173 -152 -441 -620 -453 -233 -333 -486 -191 -147 -106 -312 343 598 222 208 283 558 404 167 58
2094 58 125 124 -177 48 -168 -243 -473 -361 -181 -369 -299 -282 -66 -59 98 -140 13 145 24 325 387 23 153
2117 153 431 665 351 50 446 351 1 -163 -483 -307 -170 -354 -175 -390 -271 -327 -360 -264 -247 30 167 194
2139 194 46 322 476 469 481 349 175 49 136 177 237 -19 13 -86 -430 -159 -446 -222 -335 -385 -288 -319 -563 -115
2163 -115 230 81 -88 207 113 381 203 569 671 306 -228 147 279 135 40 -159 -34 -410 -432 30 -318
2184 -318 -273 -219 -236 -50 -18 -67 -48 114 -175 439 598 314 -44 293 435 203 218 307 94 -286 -13 91 -76
2207 -76 -543 -459 -98 -326 -265 -194 -97 -173 -191 110 488 -160 -124 212 279 526 571 526 458 322 367 248 -149 1
2231 1 -10 -71 -363 -354 -170 -288 -253 -494 -206 -352 -202 82 296 12 8 122 281 90 194 439 404 261 59
2254 59 98 183 -53 -29 94 -419 -515 -415 -141 -271 -306 -509 -292 -163 -277 -41 -182 16 192 359 402 168
2276 168 180 608 368 245 -220 376 27 132 33 -189 33 -432 -192 -130 -287 -191 -415 -320 -170 -21 239 110
2298 110 -205 -4 6 49 338 210 484 -133 160 179 323 -252 -132 8 17 -226 -275 -43 -366 -581 -407 -184
2320 -184 -194 -269 -94 92 -41 -174 469 261 561 128 391 616 217 506 194 382 -54 39 95 3 -299 -261
2342 -261 -60 -43 -372 -162 -84 -272 -197 -29 -191 -2 -53 36 255 14 410 302 312 183 245 127 78 34 85
2365 85 288 -274 -309 17 -359 -355 -397 -386 -340 -142 -132 -362 248 -16 243 213 107 70 128 458 387 459 463 364 26
2390 26 0 166 -183 -199 -172 -77 -213 -333 -335 -98 -237 -155 -178 -113 -34 9 89 259 263 165 266 373 152 161 180 291
2416 291 86 21 -13 -64 -23 -521 -239 -210 -320 -228 -42 -152 33 -102 -137 -301 36 28 -49 292 228 -75 315 -11
2440 -11 130 320 40 -203 -77 303 173 -70 -307 -199 -299 12 -30 -278 -469 -269 -270 -284 18 96 109 43 -134
2463 -134 396 341 238 420 -75 142 329 104 265 -95 -202 -314 -330 -272 -467 -223 -226 -410 -272 -173 49 -20
2485 -20 11 -24 -95 81 156 -131 141 213 212 92 -53 29 105 74 49 -21 -120 112 -188 -149 -162 -290 -221 162 -155 17
2511 17 -134 97 -212 230 165 392 27 199 215 122 450 117 47 -19 -183 -160 -94 -339 -274 -66 -310 -15 -216
2534 -216 150 -141 -233 -332 -230 222 121 19 227 204 25 191 22 107 176 113 109 -26 178 -40 52 -323 -362
2557 -362 -363 -16 11 -127 101 -232 -139 -68 293 -153 -66 339 119 80 -3 398 76 89 267 199 314 189 -127
2580 -127 -83 -71 75 -69 -69 -22 -38 -204 41 -110 -89 -355 108 -1 44 98 238 305 18 165 276 20 64 117
2604 117 -144 14 14 91 57 -13 111 -98 -62 -121 165 139 -89 -7 33 279 -28 8 51 210 245 132 382 3
2628 3 166 -59 184 -130 217 -144 310 -121 -525 -330 -176 -305 -277 -172 -215 -211 -222 -206 -141 100 -392 34 -7
2651 -7 0 48 211 90 165 299 93 -138 59 54 144 -145 -145 144 33 -224 -195 60 -215 29 -47 234 -322 -159
2675 -159 69 124 115 -200 127 282 277 271 418 139 -68 -90 89 -26 -57 -18 78 -142 -159 -341 -111 -391 37 15
2699 15 33 76 -20 291 146 -194 197 395 207 -5 -2 178 -11 -140 -60 198 158 -47 16 -55 -309 -204 -131 -25
2723 -25 -197 -85 45 -129 65 190 235 -44 -16 330 357 -128 83 99 61 -48 149 170 198 -62 -232 126 -328
2746 -328 -508 -278 -187 -229 -14 -33 20 -106 -156 363 272 -114 -126 393 296 -70 96 101 214 -192 75 -35 -308
2769 -308 16 -170 -11 -476 -397 -149 -15 -188 -253 220 -17 -207 -109 231 255 -257 136 415 -245 126 458
2790 458 184 114 96 128 389 -93 -278 2 -130 -398 -217 159 -177 -554 98 295 -432 -262 145 438 -234
2811 -234 -75 241 225 -67 -71 225 273 -78 83 312 -82 -312 73 228 -250 -609 -38 140 -365 -254 334
2832 334 -45 -392 -263 423 -76 -307 34 474 -219 -243 58 161 -238 -30 547 304 -256 -176 224 -70 -463
2853 -463 59 338 -196 -481 124 103 -187 -514 -175 89 -92 -106 321 267 -20 -2 504 503 -189 -92 531 80
2875 80 -553 23 321 81 -240 129 98 -409 -277 114 3 -382 -358 582 80 -295 -163 349 162 -34 285
2896 285 362 77 -145 334 578 33 2 241 193 -232 -277 126 -232 -386 -173 187 -408 -511 204 278 -103 -320
2918 -320 166 518 -54 -98 266 768 -247 -289 194 140 -224 -59 420 99 -412 78 172 -387 -343 62 98 -550
2940 -550 -341 150 364 85 -274 533 155 -377 123 507 -196 6 12 511 -108 -227 363 79 -283 -362 133
2961 133 326 -312 -257 302 -234 -672 -39 337 -236 -474 -159 663 353 -306 664 213 -144 -65 421 107 -100
2982 -100 42 88 1 -204 -54 204 -417 -461 237 23 -503 -251 112 52 -371 -354 231 343 25 -98 399 171
3004 171 60 161 497 11 -338 328 235 -497 -372 38 580 -97 -114 274 -83 -478 -310 386 100 -323 94
3025 94 363 -36 63 700 360 -527 -28 425 466 -484 -273 210 41 -316 -108 509 -210 -522 -50 185 -336
3046 -336 -435 23 36 -330 -435 399 191 -232 -43 559 189 -303 134 354 -47 -325 330 420 55 -355 34
3067 34 91 -5 -291 162 114 -262 -355 279 318 -347 -86 245 -42 -287 196 250 17 -208 124 154 -102 3 465
3090 465 194 -308 -17 76 -66 -186 -159 378 -341 -408 -133 -27 -3 -110 222 178 113 -269 145 410 -84 93
3112 93 316 -20 -359 131 315 14 -127 -101 197 -217 -302 -76 188 -179 -150 -274 191 -105 -159 247 -69 115
3134 115 97 266 54 -244 133 294 74 -160 127 -55 -178 -42 123 -2 -162 -21 153 -215 -489 -236
3154 -236 211 -105 -380 7 -122 81 -90 104 457 112 252 264 10 39 -18 364 120 -215 -321 -121 -303
3175 -303 82 35 180 -128 -107 77 17 23 -372 116 240 -267 -17 335 -32 -140 232 177 -4 -73 294 377 -74
3198 -74 -160 237 138 -230 -83 -12 -262 -186 -66 32 48 -379 127 162 132 -218 68 -68 -170 -173 312 517 -170 367
3222 367 267 189 -140 -18 102 -15 -230 -124 388 -162 -302 -68 138 -329 190 96 -63 -5 155 -56 112
3243 112 -14 160 67 -78 21 73 463 -306 -180 -118 -91 -103 -54 -180 -21 -515 -127 -142 184 -167 -52 356 261
3266 261 -5 86 294 -42 -10 70 265 102 192 144 186 -42 -52 83 -60 -58 -174 72 311 -102 108 2 30
3289 30 20 47 -92 -194 171 32 63 136 312 216 -17 32 -142 87 -69 -307 33 -103 -47 84 -101 130 -54
3312 -54 -98 90 69 -156 -130 37 182 -11 0 87 -193 -159 99 99 117 203 157 160 -32 -261 -92 56 -66 235 -204
3337 -204 -172 -181 274 7 -35 -156 -111 -151 -191 -176 -80 16 191 158 182 135 170 148 225 160 53 3 -19 4 71 -122 -153
3364 -153 16 -114 -208 -208 -254 -72 -62 10 -206 168 143 89 -241 240 119 -52 157 176 47 154 -67 260 198
3387 198 88 -63 28 249 -106 160 51 -267 56 48 -159 114 154 -63 -58 109 -30 203 222 72 -41 129
3409 129 -44 81 229 447 60 -111 -64 117 -151 -113 -188 -358 -255 -75 -149 44 -49 -3 -77 20 185 -77 -20
3432 -20 229 147 -94 153 -28 -71 109 -11 -132 89 -177 -161 -93 -3 -160 -161 -122 -122 -130 -96 -3 26 5 -320 -85 157
3458 157 60 173 8 86 6 38 -80 179 -56 220 173 -4 -186 183 -50 -101 -116 -80 -117 135 -44 -75 -102 207
3482 207 106 -52 -26 340 1 95 82 200 101 57 14 -183 80 27 -61 -54 -302 -261 66 -179 -42 -77 -140 13
3506 13 76 53 100 159 173 82 -158 172 439 124 139 0 97 -153 158 94 137 -123 -228 -10 -2 9 111 -42 -17
3531 -17 21 -342 167 111 -108 -80 -165 151 58 51 235 266 -92 -24 -50 -12 -49 28 -58 -111 -66 -182 32 -4 -148 -254
3557 -254 202 -170 3 -137 -100 153 176 189 186 249 -231 145 229 -105 -50 -299 -52 -85 -93 -49 -118 -48 -207 -40 -136
3582 -136 -266 -175 -41 19 102 199 -59 -268 -117 164 78 100 248 -105 -94 -97 67 104 -156 -79 1 -19 56 119 0
3607 0 -117 55 -19 -258 64 -58 193 -242 69 -196 176 1 -390 8 61 -16 278 238 131 114 -27 115
3629 115 -104 237 -163 73 -102 -120 -134 -100 -307 -209 -178 56 -162 -64 48 -130 61 -158 92 147 44 175
3651 175 -73 102 -111 0 11 -20 157 95 -61 -113 111 -19 -74 221 -328 -26 231 -6 -86 23 116 135 13
3674 13 411 197 -20 -48 143 -54 24 -313 -95 -236 90 -43 -10 -30 -310 -69 80 -272 -282 -78 203 -149
3696 -149 47 225 -127 -52 -199 28 -234 47 178 72 -40 -169 -48 185 -13 12 -271 -148 -214 -134 -90 55
3718 55 105 -341 -7 -86 -146 -73 -220 -62 -11 206 66 67 36 359 458 288 -63 84 26 24 -353 10 40 -154 -301
3743 -301 -11 -37 -123 -95 82 -69 -40 -127 103 41 219 3 206 -116 27 55 -187 -46 -96 -50 63 -162 142
3766 142 -190 -278 35 13 150 13 42 -104 200 -6 -64 -132 158 95 53 276 -89 113 11 0 -157 179 -26
3789 -26 14 -49 111 -5 138 78 20 -152 18 -300 96 79 37 -23 -96 -97 -96 -112 131 208 -151 322 235 184 116 58
3815 58 199 -80 213 244 72 54 -84 107 -103 64 -14 210 -201 33 -171 -21 -19 -49 81 -201 91 -26
3837 -26 48 309 -260 31 261 -149 41 -32 -176 -19 32 47 66 -213 -80 -161 -133 -70 -257 -37 -65 -153 7 344
3861 344 180 99 84 124 111 -5 149 41 -66 -181 110 -68 -23 -24 -196 -213 184 69 113 -36 20 -68 -212 61
3885 61 166 -183 -32 -112 -18 96 79 -196 26 55 -15 97 -45 -86 187 -298 -78 -115 -120 -34 -264 206 -104 121
3909 121 -76 50 70 124 -58 120 113 131 197 220 -194 80 225 281 -70 -197 -98 -143 -59 -9 -113 -362 58 -181
3933 -181 -145 143 -160 100 166 148 78 -121 35 157 -381 -165 117 -271 -135 -31 138 17 201 297 64 -90
3955 -90 -198 -183 -103 -111 -208 -224 -284 -170 -231 -165 -193 -14 34 57 141 71 40 129 -15 -3 108 328 339 -77 -135 -176 -108
3982 -108 -289 -195 23 170 -45 -9 -163 -345 193 59 -82 -50 205 53 69 -112 212 108 68 205 -28 -5
4004 -5 73 -232 -155 -158 104 -132 -53 -333 -17 99 32 85 -141 8 73 205 27 -15 53 -99 -68 202 170 397 93
4029 93 -97 133 242 122 338 -43 18 -180 175 -22 -64 3 -127 82 41 447 -143 4 57 49 115 72 148 301
4053 301 -172 7 9 43 -23 12 60 46 97 230 -83 -12 -60 -253 138 -18 50 262 -80 -182 -57 -153 9 90
4077 90 -84 123 -29 -114 -157 75 197 41 70 57 -167 -152 -38 24 102 22 -9 39 -180 -155 -94 -7 46 83 -1 -166
4103 -166 -78 326 151 13 140 61 0 -152 112 -94 21 -5 -40 256 -82 -73 8 93 -10 -95 68 108 -272 -260
4127 -260 89 25 -30 9 -90 42 148 61 307 -76 142 35 231 39 2 -133 16 -112 -56 -357 27 -153
4149 -153 -73 -49 -46 152 -110 11 -98 -71 221 -146 177 66 -148 109 212 -82 38 7 460 259 61 -48
4171 -48 62 129 64 12 -48 65 -175 209 -30 106 -116 81 -74 -292 165 17 85 107 256 39 120 107 -120
4194 -120 349 52 46 -113 38 -433 -6 123 -253 135 -237 58 68 -166 147 -270 -228 -28 181 -13 67 51
4216 51 51 237 205 310 200 257 -174 15 185 -251 -187 221 42 -145 148 49 -227 -140 -182 234 141 123 -11 -89
4240 -89 145 -251 -67 -141 -20 101 104 82 -229 -13 213 -273 -86 60 -45 -112 95 10 -145 -101 -85 -80 241 -110
4264 -110 -19 229 2 -38 205 246 183 -55 -200 264 101 -189 138 -152 -105 -264 -13 -55 -292 131 197 -14
4286 -14 -171 285 35 116 -43 201 -62 -22 84 9 53 -158 112 101 -36 146 -71 150 159 24 -59 266 -302
4309 -302 50 -294 138 -25 -209 107 22 -7 186 -131 147 205 2 109 148 -195 -151 178 35 -84 143 63
4331 63 20 -33 202 137 -291 -198 30 -248 -199 97 179 70 -222 51 29 -51 3 118 195 64 165 -83 194 55
4355 55 166 10 -240 -159 40 -70 10 -140 -169 31 -107 4 23 215 403 -151 107 208 -296 -408 148 77
4377 77 -72 87 -65 -25 -268 -76 231 7 -251 49 180 128 -37 -82 71 16 -165 51 289 0 -271 88
4399 88 -182 -98 272 62 140 -176 152 45 -52 -29 156 83 -24 -66 -36 102 -126 -14 120 -49 -58 -25 -157 -175
4423 -175 -136 173 13 247 -117 -67 -44 135 223 47 -87 0 -34 121 68 -373 -250 -48 146 -276 -178 -180 52
4446 52 -61 -168 154 -75 -65 300 232 -228 271 96 40 -3 -40 356 -138 -60 43 293 147 69 -40 -7 -130
4469 -130 -200 -46 -6 -251 -354 21 33 -126 -106 9 137 -256 -79 189 -28 -137 62 -187 -60 -96 146 -60
4491 -60 -99 -72 51 337 -309 69 125 -392 -154 50 264 -188 -97 -73 62 -29 -268 396 -63 10 129 8 21
4514 21 171 63 -17 171 -181 -137 271 -79 7 -187 266 -321 -417 428 -212 105 -73 148 39 64 110 316
4536 316 39 -212 301 350 -110 -56 56 195 52 204 -11 42 -66 -29 96 -119 -133 13 164 13 31 153
4558 153 22 -218 85 232 -8 8 -134 153 185 -49 5 126 110 -392 -20 306 -73 -134 150 -9 -54 260
4580 260 18 -16 -253 -106 -30 201 -219 127 44 -96 -125 237 395 29 -25 29 204 -4 134 -1 -110 82
4602 82 -38 -34 -151 -142 -16 -120 12 -103 15 38 81 -91 218 39 -93 1 112 43 -81 -154 -2 -101 73 3
4626 3 164 63 55 21 -136 -74 45 -104 -28 -214 -90 113 214 16 -7 9 -131 110 -17 332 124 2 122
4649 122 -30 30 198 -77 48 -195 -376 133 -56 223 39 73 -52 233 28 252 220 95 58 235 -147
4670 -147 -257 235 193 -93 34 605 4 78 17 124 108 -50 -146 202 -65 -48 77 -167 -228 59 65 78 0 -225
4694 -225 -87 83 -28 -43 -36 98 -151 -16 132 -3 -227 162 2 73 117 8 -55 -347 -4 68 -363 -321 -121
4717 -121 -23 196 -58 -91 -91 -176 20 122 190 -207 38 -27 116 -52 -40 157 115 -117 3 66 -172 -127 -155 -77
4741 -77 -15 -269 85 0 -85 -112 42 -165 122 -110 136 124 213 197 115 164 21 -42 -129 -249 109 24 -119 -51 86
4766 86 -11 -277 -74 -46 61 -45 -357 -160 47 31 -324 -44 64 69 50 -57 200 84 234 220 -27 122 -58
4789 -58 -163 13 -307 -36 -85 -90 7 85 -184 153 -118 108 118 -2 179 -53 -2 33 247 76 31 54 -27 -160
4813 -160 21 153 -137 103 -159 -134 -144 -220 102 -37 36 -64 -225 -26 -84 -16 73 -46 121 269 230 99 -62
4836 -62 -69 40 48 -61 150 -2 -137 -7 184 7 -18 46 -153 371 -184 65 158 3 11 131 -84 -136 -179 -132
4860 -132 293 52 178 71 266 -57 -4 -46 109 -117 235 108 -43 168 142 -277 -105 -31 -27 -42 -27 -93 -125
4883 -125 221 77 -144 -160 153 -17 112 107 -100 149 79 -78 24 -183 -38 -17 -202 92 -227 20 109 -68
4905 -68 72 207 92 -160 17 -142 118 248 64 -42 72 -193 -45 176 172 -273 -10 171 43 64 31 36
4927 36 7 32 44 116 21 -60 121 190 -139 -106 -90 -159 -117 305 17 61 -66 179 20 -1 78 -52 -173 -156 80
4952 80 120 -64 -140 -192 -5 31 -168 43 104 229 -108 54 44 186 -9 122 22 26 135 -216 95 148 -65
4975 -65 10 -45 15 -85 110 -81 22 -154 -166 -156 -16 26 1 48 163 -58 303 -113 -233 -127 -7 -87 -43 131
4999 131 117 -151 -5 -196 272 -177 -84 10 -50 -45 -21 -120 -128 84 67 -65 149 -52 -69 -69 175 -63 -352 192 -260
5024 -260 59 264 42 41 108 84 -106 53 -236 132 -142 -25 -29 -15 -160 -188 -181 -15 -24 243 -77 95 161 112 -30
5049 -30 21 111 194 -64 116 26 -5 71 -112 42 -177 -80 -437 -48 -121 230 85 143 -56 -295 -41 59 -70
5072 -70 -229 -50 242 70 -217 287 5 -73 -140 -263 75 -235 -47 -29 -223 -299 46 5 3 -90 1 83 -101 -157
5096 -157 -48 21 -24 -82 81 38 152 -125 335 403 110 127 119 24 193 -83 13 40 58 59 100 -118 -33 -67 -169 -32
5122 -32 -33 -192 2 21 -77 -13 296 26 23 157 -102 277 -235 86 402 -33 32 53 -141 1 62 -251 -261 -38
5146 -38 246 79 -226 68 -68 175 41 322 -6 -139 -2 112 148 248 -20 308 -33 75 -134 -164 -195
5167 -195 196 59 -55 -264 -98 53 -175 -175 173 31 -70 317 197 7 178 -117 -144 -153 84 285 -186 -58
5189 -58 52 116 18 -175 -79 -185 83 9 -224 -63 -64 69 -168 188 -154 -197 -202 -28 -66 11 167 32 120 17
5213 17 -27 62 -230 -71 -93 91 261 -237 -80 264 -7 -55 147 -220 38 25 -55 31 -2 -165 214 -110 -101 -81
5237 -81 65 94 -51 47 40 -139 -321 61 170 253 -179 157 123 -304 -55 -70 -105 -274 214 -117 56 -77 -8
5260 -8 -11 -223 -153 36 5 116 -112 -116 -170 195 187 -181 97 -33 -120 45 -4 -191 23 -15 -61 -247 82 -82 -184
5285 -184 41 -112 144 16 249 -66 -10 185 38 -89 -245 -85 175 -214 -134 150 64 -188 176 -254 -82
5306 -82 35 36 -3 -113 32 121 118 -39 102 -91 254 -179 8 209 -212 -212 153 5 254 -204 103 80 83 -17
5330 -17 -206 -43 11 -56 -352 -84 28 230 43 -162 -109 -177 -136 101 -81 -19 135 70 121 281 117 -220 -90
5353 -90 -97 -197 86 -253 70 24 -71 87 121 -62 -45 102 186 165 -28 -212 173 -77 143 161 -99 103 -193
5376 -193 -9 159 47 -66 242 -275 165 102 -163 208 41 18 -121 -99 -355 -183 44 12 30 64 103 37 55
5399 55 106 20 87 -131 -109 252 -102 122 -13 -68 4 15 -6 32 -219 -324 232 -40 -38 56 -259 42 59 211 -62
5424 -62 23 -138 153 53 -118 132 158 -69 71 -7 -177 34 96 -52 -293 67 -202 -477 -62 -114 -363 84
5446 84 111 39 53 -158 213 56 76 100 292 70 72 -87 -202 118 121 -204 86 187 175 16 -102 -96 -162 -58 -293
5471 -293 -164 49 -250 188 81 21 0 -26 334 -23 339 281 -84 -46 -23 237 144 50 263 -314 -95 196 103
5494 103 150 -128 -55 -56 -150 -85 37 124 -103 3 -35 48 46 -108 81 75 69 -20 47 -28 -34 -321 -13 22 78 154 -52 -71
5522 -71 177 159 -3 131 80 -119 -71 115 201 56 -109 -39 109 -5 76 -8 144 -61 -129 -206 272 -63 -59 155
5546 155 -272 -59 170 38 92 75 64 157 -14 62 -85 33 -93 57 182 -26 -122 41 25 9 184 43 -124
5569 -124 280 42 93 -70 142 82 89 -18 109 127 -76 322 -19 24 58 53 35 185 -85 71 -8 -149 -99 100
5593 100 -23 -67 53 253 37 -43 -24 226 -17 -90 -172 65 -62 64 25 127 91 -110 -49 -41 157 -234 178
5616 178 -61 80 52 -247 43 93 -156 -75 96 111 -88 54 -38 -325 -39 189 4 -50 -164 -194 27 -214
5638 -214 -214 31 -166 142 37 10 129 235 -7 -109 -40 -93 21 1 -57 160 278 -86 58 65 -133 148 -225
5661 -225 -69 -19 57 144 369 -74 45 -66 14 -166 -45 1 -71 157 67 20 267 -5 -87 -259 -117 -366 -9
5684 -9 -55 -189 -78 -24 92 149 -9 250 113 192 -79 -100 -52 101 -355 165 34 -109 232 229 -54 -144 -167 72
5708 72 -146 -39 297 -63 -151 -256 145 230 -296 -169 501 141 131 0 113 214 139 -158 80 -31 48 144
5730 144 -329 -8 -62 127 35 -73 -242 142 -93 41 210 -3 -108 179 -75 135 -222 -143 -9 22 -67 -217
5752 -217 348 193 -212 -185 425 334 -137 93 42 85 -60 -147 139 -135 -251 -48 -276 -112 -124 -3 285 -150
5774 -150 -124 -42 144 21 183 226 33 13 47 12 93 8 367 400 -209 195 104 174 -401 -129 252 104 -71 4
5798 4 140 85 -39 -42 468 -108 -58 -26 255 -72 -218 -68 -199 -253 88 10 138 -220 111 291 226 -228 195
5821 195 252 -179 -71 107 187 -53 -161 252 116 -285 -179 295 -217 319 352 263 50 -28 101 205 -69 -398
5843 -398 -63 87 -240 -28 70 -64 96 64 145 -63 86 -61 -135 451 -180 45 167 -62 -294 131 62 81
5865 81 -25 92 318 1 -140 63 285 -20 69 31 -41 -157 -56 -62 -232 -34 -205 171 -116 157 190 16
5887 16 -169 100 122 -220 -134 122 88 -34 264 162 8 -162 44 -82 80 65 47 -72 -53 -63 -201 -159 -176
5910 -176 -315 166 -58 -126 65 165 197 261 -35 63 53 -184 -53 181 -38 -101 21 154 -15 -53 -108 377 -322
5933 -322 -130 -32 172 14 -14 42 327 -132 34 119 -21 42 -118 220 18 -72 -159 4 -25 70 -235 20 -55
5956 -55 123 117 94 -153 35 258 130 54 136 91 -65 -158 -135 190 -190 143 70 241 -174 -41 -111 -94 309 -2
5980 -2 141 -289 -53 -158 55 98 -138 247 -14 -359 -298 24 2 -37 59 197 74 -116 165 101 -120 271 5
6003 5 -131 -94 -15 -73 94 -33 -135 -48 154 -135 -293 169 -15 -85 -90 168 -28 -230 -9 -79 30 -74 112
6026 112 299 35 21 -111 5 -43 -15 -130 -13 226 10 107 217 -90 233 80 -148 39 140 145 -114 57
6048 57 145 162 -115 156 -73 49 -11 65 86 -146 -12 98 0 -7 -117 -6 -159 -24 -80 -297 236 99 -181
6071 -181 -34 49 140 -314 101 -27 47 -19 99 -27 -13 232 140 -112 -59 -35 -50 -415 46 -160 126 -82 -173
6094 -173 112 -320 6 137 -162 -40 20 118 112 228 -37 376 25 218 2 181 67 -98 358 18 -62 -214
6116 -214 -9 62 -350 -219 45 -244 -206 -108 -41 1 171 -219 -63 -47 90 26 183 78 -15 137 51 -77 -7
6139 -7 -7 -82 31 57 -18 -93 -173 -38 -173 -57 -367 -153 42 -34 -24 -10 -80 -279 -109 225 232 -109 -11 12 228 174
6165 174 5 74 -178 -61 184 38 -75 -20 -55 112 -143 -225 121 205 -188 162 108 215 195 -48 88 -51
6187 -51 233 -203 -8 -213 141 -102 223 -5 -298 -152 -301 218 24 -151 191 -127 -98 22 -234 -50 -155
6208 -155 -84 -71 122 -42 67 -100 -147 83 -16 -141 -200 -259 -35 -186 22 -30 30 118 23 161 38 56 -78 106
6232 106 -81 -72 120 -200 -242 88 -59 -50 128 193 -186 -96 -19 125 -298 -89 -93 -160 -140 113 232 -189 -53 -166
6256 -166 -23 119 187 92 -6 123 316 64 2 218 -105 -184 -168 -200 84 -97 -37 -18 240 20 -223 -10 53
6279 53 0 -20 -155 -4 -271 -16 -126 95 136 -194 -63 119 233 6 -31 126 -160 197 113 -28 -167 70
6301 70 -82 -96 -39 22 194 78 -66 197 -34 -71 16 221 -1 221 -153 -51 -34 3 301 28 -323 236 -16
6324 -16 155 -220 26 60 182 -290 173 -45 146 452 14 -60 184 16 87 -42 75 -118 39 -47 170 -37
6346 -37 -11 -92 -124 164 -12 72 26 59 -70 87 152 171 44 -82 -200 133 -76 191 -125 247 324 282 128 142
6370 142 201 -53 96 1 -249 -115 327 -60 121 -232 -129 -23 -11 185 -264 32 -117 25 -166 109 -25
6391 -25 -180 -199 220 65 -67 70 315 -59 -79 33 90 97 -15 -100 -98 16 -407 155 -72 63 10 -70 80 -329
6415 -329 -78 148 -253 123 -383 -33 186 119 53 -164 -23 -11 157 -60 206 -31 303 -23 -16 112 -73 73
6437 73 136 113 -273 -77 310 273 333 74 -26 51 209 246 21 -42 -25 -126 205 186 16 -144 -161 -139 96 -63
6461 -63 161 -191 181 -53 -170 171 -212 -95 -136 -30 -140 19 -122 189 89 -121 66 18 80 -187 -149 9
6483 9 -190 172 276 200 -11 88 -40 -230 161 -120 111 -177 53 -22 -5 -178 -123 83 198 11 -150 251
6505 251 -152 115 68 86 147 -43 120 145 -240 -18 -84 -42 -129 -52 72 112 -33 86 41 -309 18 50 238 -8
6529 -8 33 -203 10 63 132 137 175 31 -146 181 -88 -97 133 -171 15 97 139 -259 -73 -29 -172 -64 221 27
6553 27 0 160 -427 229 129 -3 217 -198 220 10 -181 142 89 34 143 40 79 -102 258 1 19 64
6575 64 235 51 9 -79 -17 -148 -90 89 136 74 -53 -11 -94 -19 -37 169 108 28 60 -26 74 -104 -23 35 -267 -84
6601 -84 -289 55 -1 -223 -12 325 69 -99 37 -1 94 78 -91 40 201 -92 -147 235 53 54 -52 95 -2
6624 -2 -28 45 -216 -243 209 -29 -181 69 32 105 16 -195 -94 -26 155 29 154 18 25 -114 82 -200 -64 -110
6648 -110 -152 -93 -163 4 -39 127 46 35 17 -90 111 198 3 127 79 -113 23 -98 60 78 72 61 135 207 151
6673 151 -209 83 -170 -88 -11 196 -144 -81 -149 -162 35 -281 -102 177 44 -52 -104 105 -39 37 33 -62 -35 73
6697 73 44 156 -96 215 -23 -191 134 -105 116 118 17 -18 182 -217 91 133 -192 61 38 145 65 -237 155
6720 155 113 -115 213 -76 -145 -107 -135 -80 -20 82 57 14 -19 29 -150 160 202 -253 -186 -109 -201 -118 -210 -110 -72 -166
6746 -166 135 189 39 -221 -192 188 -23 27 -3 97 -209 -33 399 13 218 -222 303 -36 72 -124 -18
6767 -18 381 -24 -59 192 188 130 -191 -150 -64 -107 8 -34 25 -91 268 -117 110 -173 -207 -73 -153 -223 80 -52
6791 -52 18 -87 -147 -91 7 -118 35 -123 -43 5 171 254 -81 -272 154 193 -53 -133 175 -124 -125 -267 192 -13
6815 -13 -180 83 -37 -113 234 24 -99 142 107 -113 21 -100 -3 39 155 9 166 -75 231 -74 -202 147
6837 147 75 6 -53 34 35 13 -92 -211 -102 -181 61 -12 -7 259 -40 31 227 39 -365 -158 139 208 -127 -95 -102
6862 -102 57 1 59 -35 152 -4 -213 50 -19 -223 205 240 -142 -135 -115 173 161 -182 -166 -230 312 -78 -55 -257
6886 -257 -184 -39 -49 -241 290 80 232 -102 -86 45 -27 40 130 107 59 55 -17 -13 -119 -13 -28 190 44 -89 73
6911 73 226 -300 116 -12 -73 -76 189 306 -321 -14 -164 299 17 124 -79 169 237 37 47 -249 75 -16
6933 -16 230 61 27 -110 182 -28 -62 -290 133 81 -180 7 -71 -7 96 30 -72 161 -56 -50 -135 301 -227
6956 -227 -135 3 -27 81 -108 -4 90 -31 23 159 187 -14 -130 -93 -29 -287 -51 -25 207 -185 -45 -30 -162
6979 -162 172 155 -18 53 -13 -244 -30 -16 99 24 -180 108 -139 -178 21 9 -51 39 129 -147 -44 -159 -194 -31
7003 -31 84 -74 -112 -211 -218 -302 -87 34 163 197 20 15 176 101 -170 98 41 -73 -80 171 -53 126 -16 -98 139
7028 139 -275 39 -156 76 -285 -213 -207 -278 -178 169 -49 -106 158 282 83 81 16 22 -15 97 168 30 -131 14
7052 14 -97 124 -101 -41 265 -50 52 6 -110 16 -4 -100 -322 -163 31 134 34 -66 112 -166 -329 387
7074 387 -48 50 9 14 77 -149 189 -123 -68 -321 62 187 11 -243 84 229 -14 207 47 -135 63 149
7096 149 -138 -467 9 -149 -64 125 147 522 45 38 -78 14 -161 62 -145 71 -146 166 -86 59 86 -88
7118 -88 -125 18 158 42 140 145 33 -59 48 99 -12 94 -136 -261 147 -68 -96 -592 -99 80 4 -92 -11 -101
7142 -101 148 -247 114 -86 133 -174 4 -130 121 -271 165 156 204 103 -130 -94 -286 161 -66 -161 -19 63
7164 63 -105 -38 41 -3 184 -101 -19 19 19 74 -85 20 -42 -152 128 108 49 -236 -52 -221 -32 169 19 22 -21
7189 -21 -156 -106 46 -48 -30 -17 377 45 -138 131 -56 -207 286 124 12 -108 34 164 18 -56 -13 -16 -190
7212 -190 -128 -102 265 174 -108 -46 -168 -262 -47 -132 -39 -67 -200 16 35 215 -112 68 197 36 -68 46 -260
7235 -260 -76 31 182 -58 137 -25 10 56 72 -31 5 -42 57 -25 -88 -12 326 37 -122 5 66 -26 -130 191
7259 191 141 17 -176 104 -48 -36 -289 -270 -103 7 -130 154 -208 -71 -460 -44 37 -107 -282 100 218
7280 218 -113 289 7 -91 -140 -148 279 71 -92 251 166 250 -87 71 -141 -267 109 131 0 -32 278 -144 144
7303 144 167 297 51 24 -256 194 -50 -21 -30 73 -71 170 13 303 -121 11 -80 -61 -139 -282 -99 32 -206
7326 -206 100 159 121 -69 -49 118 -25 -15 -7 115 73 -150 -209 239 96 -16 -65 21 -109 313 113 138 72 -9
7350 -9 -87 -72 -2 128 74 -41 -253 -206 -95 39 -3 329 -87 -23 166 51 140 225 -175 22 96 247 -293 -173
7374 -173 89 -72 64 -213 -87 -150 -24 327 -50 -315 172 264 334 282 -90 -148 334 52 -35 1 259 -112
7396 -112 175 -321 -226 -186 -84 -148 225 -246 -69 28 -98 55 -180 59 65 283 33 -90 -122 -14 -158 -192 111
7419 111 15 -3 -128 -6 172 33 -199 -45 53 -137 -194 254 58 -82 -167 -95 -179 120 63 184 -173 -4 -96
7442 -96 -35 45 30 181 43 88 7 169 117 -67 139 266 -99 191 -127 0 -277 -253 205 -13 -23 -9 -105 -171
7466 -171 -79 -57 127 64 -338 -124 19 71 -142 26 -177 152 127 245 -127 -28 168 237 211 -286 98 -9 -67
7489 -67 168 23 -165 -54 -293 -230 -60 227 39 73 86 -77 -35 199 68 -129 -163 1 -93 -216 97 -141
7511 -141 -94 -273 -97 -61 -120 131 296 94 -177 -47 -195 -311 -80 39 81 -99 112 -113 -74 -8 -257 171
7533 171 -2 -380 33 168 40 -34 -269 -284 -51 32 224 -2 -86 121 351 37 -209 -305 152 81 95 125 66
7556 66 -128 277 33 41 145 -69 133 -198 -165 181 306 274 -40 44 -81 42 -322 -56 73 -45 127 -1
7578 -1 83 277 -205 283 31 -56 -6 63 135 -220 67 123 341 20 -193 -100 -195 -8 -23 -205 -6 26 -16 173
7602 173 67 298 197 -122 211 -242 80 -54 -22 -15 12 66 180 117 41 88 -261 36 94 -276 5 -15 -240
7625 -240 172 -50 -209 -69 -104 -202 6 358 -238 -129 112 -169 -46 40 69 151 -278 -233 72 -135 -280 12
7647 12 -106 136 -49 -190 386 -21 -221 -136 -93 -101 -78 81 132 -218 28 108 -78 105 -5 116 -151 116 -12
7670 -12 -60 27 -66 -217 -15 -82 -157 23 -221 -6 -350 81 -141 21 -94 -37 279 33 29 188 23 1 58 62
7694 62 50 -233 181 60 -113 -318 84 -144 -113 54 123 1 121 -121 -43 -72 -191 13 -58 -63 -139 -60 -12 1
7718 1 178 8 81 -67 266 13 -78 8 170 154 -254 -109 -49 -311 264 277 -40 -202 -169 -49 20 -164 93
7741 93 300 -137 147 141 154 294 -237 -46 -225 9 74 47 -154 -148 -119 49 -26 138 164 141 66 -104 113 1
7765 1 -10 95 -202 178 -107 79 89 -96 86 18 -133 78 -6 -1 208 -120 -95 -286 5 -216 52 145 120 227
7789 227 19 -36 193 82 -82 -210 66 203 67 -207 -97 127 70 -79 151 34 67 178 11 187 115
7810 115 252 290 45 -111 -42 188 124 73 -8 161 -85 75 -33 -237 10 192 17 55 217 184 67 99 -205
7833 -205 138 247 -125 33 -86 -224 79 -287 -228 -136 242 -53 -127 223 70 136 75 123 146 126 153 -34 -149
7856 -149 -287 324 141 63 9 -156 -121 83 -29 138 81 -56 -75 -263 165 38 130 79 157 48 218 237 -235
7879 -235 263 223 -208 11 76 104 225 143 125 -185 -160 -143 -73 256 115 1 107 73 174 -236 -165 36 103 -41
7903 -41 -191 158 329 49 -19 -87 274 -111 63 -350 14 207 82 47 80 180 -173 44 -134 -142 -97 -33 141
7926 141 142 30 78 139 -150 -125 -85 43 -122 144 8 -226 -132 35 194 -215 73 -167 208 88 20 -105 -98
7949 -98 100 -129 53 -44 -40 200 -143 -108 293 67 89 46 -58 -173 140 44 28 -50 -21 -117 -13 -118 84 6
7973 6 -30 64 21 -177 4 128 114 -7 66 -106 91 343 51 131 -168 -192 -45 -192 65 167 -45 150 -143
7996 -143 20 144 -22 -286 -43 -133 262 51 9 60 -148 397 77 -209 61 290 300 -271 -113 44 -143
8017 -143 -35 74 -58 -65 19 60 -152 86 -117 42 -218 -103 231 10 -11 -8 318 71 46 102 26 215 98
8040 98 -138 -114 153 11 84 -124 -149 -53 -113 -56 143 -106 -88 -19 -21 209 -42 39 -153 -71 30 151 -394 95
8064 95 82 -57 99 359 -103 60 71 -32 295 -156 137 -4 -2 73 269 58 125 -3 -158 128 -9 156
8086 156 30 158 -123 -160 95 393 -113 67 36 184 178 -32 -51 -120 20 362 -357 -197 168 56 -113 145
8108 145 153 104 70 143 -24 11 -262 423 43 -104 -124 45 92 118 -121 -31 -20 -74 -105 -227 49 -92 176 81 12
8133 12 -183 64 -210 48 -1 69 168 127 -29 56 -21 34 -251 121 267 45 -264 81 141 96 177 -35 10 -267
8157 -267 66 -274 252 -212 -77 -22 -291 -122 -92 -116 -275 159 -63 129 259 -25 -76 15 214 -18 -21 72 -74
8180 -74 -114 -147 37 136 -113 8 26 -206 82 -71 -283
8191b83
$$ Imaginary data points
##PAGE= N=2
##DATA TABLE= (X++(I..I)), XYDATA
0 0 0 0 0 0 0 0 0 0 0 0 0 0 0 0 3 -8 8 -8 8 -9 16 -16 16 -24 24 -32 36 -40 48 -55 63 -71 79 -90 102 -115
36 -115 128 -143 159 -178 197 -220 244 -269 297 -329 362 -398 438 -484 533 -586 650 -716 792
55 792 -878 978 -1093 1226 -1385 1580 -1822 2133 -2548 3133 -4017 5502 -8459 16570 -85608
70 -85608 -253968 5873 187404 68514 -99522 -70772 52283 124930 57690 -50782 -41048
81 -41048 82714 120706 17075 -86039 -37068 99213 107162 -61188 -133908 13544 111797
92 111797 -11903 -122783 -54569 34416 14244 -33088 -50940 -44821 -1507 40044 4487 -49302
104 -49302 -19312 44245 34038 -18097 -12862 43801 51473 -8702 -28532 34100 59701 -1824
116 -1824 -29470 13735 18786 -14023 -36 16126 -18398 -29054 4860 4835 -21807 -10182 9258
129 9258 -11883 -31020 -3415 28179 6261 -36308 -20720 30295 23590 -24437 -18936 21015 13823
142 13823 -12029 1921 15070 -4934 -8197 14942 9185 -12442 3892 25619 -550 -24611
154 -24611 7411 36850 6181 -29567 -8441 24407 10297 -15847 -6359 8235 -7214 -16304
166 -16304 4010 7254 -17554 -16827 5709 -2710 -17965 1450 14860 -10757 -20305 11912 26546
179 26546 -2566 -18359 8399 26273 4916 -8496 10953 17018 -4893 -4821 15338 7044 -12724
192 -12724 -3025 6268 -10700 -15452 7375 7742 -23311 -27041 6877 17540 -12067 -23344 2256
205 2256 13853 -3820 -5195 13162 9948 -5691 3962 17869 5812 -4425 10462 14289 -6715
218 -6715 -8196 15228 11829 -16741 -17552 7743 8742 -13550 -15902 422 441 -11285 -4319 8229
232 8229 -2108 -13970 976 14023 895 -5247 9692 9182 -6780 956 19595 8894 -12603
245 -12603 -5283 11679 5326 -9378 -4542 4472 -4278 -12670 -1674 7679 -4856 -13070 -678 4530
259 4530 -5114 -2555 9472 1881 -10495 2152 18105 5683 -9512 790 12557 3024 -6239
272 -6239 2140 6410 -4786 -9256 2715 6011 -5837 -10002 -46 36 -7163 -1495 6715 -3099 -12515
287 -12515 1108 13853 3284 -5782 3066 8783 628 -1190 7842 6531 -4777 -5085 4580 4860
301 4860 -4051 -4158 1129 -3407 -8232 -735 3306 -5995 -10724 97 5410 -2598 -3687 4573 4049
316 4049 -2807 1271 9957 5957 -3582 -670 7422 5474 -403 1553 2621 -3826 -5520 2941 2906 -7944
332 -7944 -9162 52 202 -6462 -3958 2649 -1256 -7286 -836 7495 3307 -3148 704 6264 3632
347 3632 1602 5757 4741 -1733 -1168 5873 4101 -4175 -3938 1582 -852 -6342 -2951 864 -4029 -8196
363 -8196 -2977 2259 -722 -3830 -896 1857 668 1536 4909 3351 -1132 1292 7016 4521 -435
378 -435 1561 3461 -471 -2494 1273 1683 -4167 -6184 -2002 115 -3189 -3917 -1601 -1659 -2617 76 2819
395 2819 315 -2121 1999 5315 2705 684 3670 4630 1148 -74 3219 2853 -2149 -3530 -385 319
411 319 -2279 -3278 -2774 -3359 -4193 -1337 317 -1876 -4067 -669 2752 1225 795 2927 3467 964 1707
428 1707 5297 4165 852 331 1347 2497 1306 -740 -1762 -2608 -3269 -1671 -1169 -3492 -4838 -2816
444 -2816 -1640 -1533 -923 -48 -988 -1007 685 3201 3690 2342 1252 2112 3015 3511 3224 1029 -971 -318
462 -318 1068 509 -1683 -2463 -2489 -2635 -2048 -1241 -1448 -3181 -3790 -1503 1178 1190 -45 279 1203 1536 3203
481 3203 3686 2419 409 391 1387 2158 1645 -342 -1251 -1352 -1548 -817 -629 -2216 -3585 -2802 -1050 84
499 84 -147 -1309 -880 1003 2003 2462 2501 1562 1013 2013 2762 2634 2255 424 -970 463 858 -640
517 -640 -1769 -2411 -3360 -2614 -1463 -2058 -2700 -2228 -1939 -602 691 478 520 1268 1359 2016 3800 3656 2226
536 2226 1711 2150 2323 2452 1209 -365 -697 -662 -1645 -1623 -2070 -3599 -3447 -2414 -2358 -2638 -1878 -1819 -747 226
556 226 262 1056 1988 1610 1699 3399 3324 2407 1780 1840 2043 1630 937 -210 -476 -975 -2240 -1703 -1261 -2697
576 -2697 -3196 -2509 -2300 -1924 -1455 -947 -319 -39 542 1247 1827 1894 2085 2769 2621 2267 1459 767 1281 1434
596 1434 337 -870 -743 -1489 -1680 -1344 -1678 -2134 -2178 -2240 -1650 -110 -390 -1306 298 1390 555 1294 2332
615 2332 1551 1076 2190 1814 1651 1198 119 -366 405 -237 -1514 -1311 -1833 -2641 -1909 -1171 -1668 -2196 -1167
634 -1167 -781 -353 699 1009 833 1144 1442 2064 2465 2094 1399 930 981 1355 821 191 -1061 -1680 -1720 -1356
654 -1356 -1443 -2216 -2119 -2196 -2297 -1102 -895 -1110 -479 814 851 639 2101 2426 1556 1590 2601 2214 1443 1037
674 1037 685 772 142 -1151 -866 -747 -2151 -2601 -1129 -1356 -2706 -2095 -995 -878 -1219 -210 590 595 435
693 435 1246 2409 2212 1430 2014 2403 1246 648 1554 838 174 -569 -290 -1077 -1923 -1903 -1577 -1664 -2312 -2250 -1223
714 -1223 -1327 -1083 38 393 55 542 1732 2058 1348 1369 2281 1692 1205 1365 1560 164 -619 -331 117
733 117 -1130 -1883 -1432 -1108 -2354 -2447 -951 -1015 -2392 -1285 358 345 -74 612 1826 1316 1051 2280 2813
752 2813 1175 386 1572 1863 616 -126 66 -498 -2023 -1443 -460 -875 -2416 -2677 -1206 -856 -1397 -269
770 -269 116 -502 -313 924 2006 1585 1048 1894 1818 1596 1829 2008 851 -494 -149 268 -724 -1871 -1670
789 -1670 -1516 -1855 -1519 -1133 -1470 -2152 -1605 286 100 176 284 1336 838 1120 2379 2881 1318 434 1501
808 1501 1620 588 228 786 -311 -2031 -1480 -227 -1103 -2855 -1989 -1016 -1379 -1530 -354 -12 -540 -772
826 -772 996 1667 1020 964 1795 2052 1218 1125 1412 955 -233 6 979 32 -1201 -1495 -1049 -1441 -1871 -1234
846 -1234 -1040 -2046 -1759 -558 27 -547 171 1271 599 829 1654 2075 1744 973 1666 1734 1142 538 581 305
866 305 -1056 -1127 -369 -919 -2218 -2022 -831 -1424 -2239 -821 -450 -624 -618 252 1249 582 594 1757 2064 1561
886 1561 886 1764 1831 216 126 892 291 -766 -862 -659 -1242 -1864 -1324 -1014 -1383 -1891 -877 -476 -687 -283
906 -283 359 880 628 1003 1733 1747 1523 1267 1573 1083 731 445 756 -17 -219 -682 -1112 -1269 -1219 -961 -1602
927 -1602 -1686 -1238 -829 -810 -494 110 44 303 788 1544 1639 1193 1068 1556 1121 870 723 556 -148 -552 -344
948 -344 -515 -820 -1581 -1387 -1278 -1649 -1095 -858 -717 -996 -712 383 551 582 835 1222 1177 1243 1645 1956 1116
969 1116 345 718 596 292 -409 -524 -1109 -1375 -841 -1207 -1476 -1463 -1782 -1110 -486 -394 -138 103 128 470 1310
990 1310 1506 987 1198 1058 830 1218 1479 904 71 -630 -213 5 -364 -1144 -1232 -1564 -1687 -1235 -551 -1073
1010 -1073 -1229 -736 52 468 595 398 1025 1265 1163 1380 1977 1062 509 532 728 481 123 -359 -1072 -1055
1030 -1055 -932 -976 -1090 -1687 -1867 -1255 -754 -601 -312 131 -477 277 1211 1288 1113 1141 1131 1366 1536 1027 775
1051 775 510 124 -89 -66 -612 -1087 -1288 -1430 -1288 -867 -1092 -1296 -1273 -823 -428 64 439 30 841 757 983
1072 983 1513 1747 1059 638 996 1059 656 542 127 -384 -742 -743 -783 -727 -1523 -1821 -498 -617 -1232 -888 -341
1093 -341 -195 71 923 923 757 665 912 1286 1372 824 555 686 610 363 69 -274 -850 -841 -960 -669 -999 -1019 -1201
1116 -1201 -969 -800 -272 -82 -229 -33 796 850 814 1120 1171 812 1035 1464 1346 452 -151 -26 97 -173 -1144
1137 -1144 -912 -1246 -1510 -1366 -325 -653 -1815 -960 -188 112 -92 100 431 825 641 936 1686 1153 439
1156 439 1166 1375 640 -235 64 -6 -920 -655 91 -541 -1610 -1704 -695 -449 -1032 -662 -162 -414 -342 637
1176 637 1579 484 49 993 1534 1321 791 1427 871 -127 210 881 455 -1111 -1248 -261 -806 -1362 -883
1195 -883 -957 -1641 -1491 -1 369 -688 -583 457 1073 252 742 2260 926 -46 952 2257 840 -215
1213 -215 201 556 -544 -1160 -57 -199 -1485 -2366 -150 -150 -1578 -1395 246 -211 -1186 169 1446 254
1231 254 -536 1145 1914 1098 41 1549 1619 -283 -118 1191 720 -1345 -1033 310 -186 -1759 -784 -255
1249 -255 -1457 -2094 -412 668 -701 -1190 783 1414 -273 -217 1637 1363 -311 526 2395 1331 -640
1266 -640 215 1327 -306 -1645 322 721 -1395 -2103 193 207 -2047 -1615 679 233 -1686 -451 1748
1283 1748 300 -1148 805 2521 705 -483 1737 2635 -87 -760 1605 1345 -1354 -1172 1334 -101
1299 -101 -2445 -1549 670 -754 -2486 -731 1104 -1182 -2206 1068 1621 -791 -919 1922 2183 -643
1315 -643 141 2620 1564 -1016 405 2146 231 -1909 -113 1259 -1022 -2363 182 695 -2245 -2563
1331 -2563 656 737 -2101 -1051 1812 931 -1691 312 2914 528 -1385 1505 2989 -218 -1041 1892
1347 1892 2219 -1302 -1353 1523 639 -2543 -1785 1277 -115 -3119 -1110 1514 -853 -2773 524 2098
1363 2098 -879 -1660 1770 2372 -688 -721 2426 2275 -1528 -177 2955 1008 -2412 -466 2198 -801
1379 -801 -2781 -111 1263 -1848 -3058 633 1184 -2118 -1981 1456 1237 -2113 -195 2977 920 -2040
1395 -2040 887 3312 433 -1446 1575 2616 -1053 -1287 1477 1723 -2467 -1905 1624 368 -3203 -1521
1411 -1521 1699 -674 -3083 102 2364 -818 -2353 1190 2793 -788 -948 2591 2672 -1403 -816 3086
1427 3086 1878 -2505 -666 2562 175 -3001 -487 1943 -1404 -3342 461 1643 -2017 -2414 1301
1442 1301 1580 -2043 -1059 2630 1282 -2247 113 3694 1152 -1704 862 2785 -548 -1955 1511
1457 1511 2380 -2167 -2365 1664 895 -3161 -1966 1481 111 -3260 -893 2386 -237 -2870 888 2604
1473 2604 -403 -1527 2048 2942 -1101 -1021 2816 2047 -2102 -705 2776 241 -2892 -592 2163 -1110
1489 -1110 -3403 260 1848 -1756 -3060 1012 1932 -2181 -1527 2611 1557 -2183 -453 3301 1270
1504 1270 -2005 585 3383 19 -2359 1114 2807 -1089 -2470 1282 1704 -2427 -2437 1406 339 -3047
1520 -3047 -1492 1929 -135 -2691 -69 2819 -66 -2054 1566 2983 -587 -1300 2467 2564 -1379 -883
1536 -883 2531 951 -2277 -716 2107 -488 -3226 -479 1759 -1399 -3245 695 1902 -2090 -1956
1551 -1956 1952 1715 -1779 -824 2589 1545 -1998 221 3484 732 -1924 483 2896 -418 -2061
1566 -2061 768 1887 -2312 -2335 1259 898 -2520 -2014 1588 242 -2657 -520 2465 -182 -2128 972
1582 972 2959 -141 -1520 1682 2599 -734 -896 1941 1705 -1662 -1239 1910 857 -2697 -727 1478
1598 1478 -756 -2642 -183 1463 -1645 -2228 992 1943 -1154 -984 2086 1638 -1480 101 2865 1208
1614 1208 -1754 145 2355 160 -1871 855 1730 -1722 -2135 749 1112 -2034 -2062 1114 644 -2003
1630 -2003 -1083 1869 207 -2075 229 2482 177 -1332 1323 2437 -245 -1117 1635 1535 -1434 -1065
1646 -1065 1504 1078 -2093 -1026 1137 -300 -2228 -634 1278 -641 -2243 412 1458 -747 -1426
1661 -1426 1322 1914 -977 -349 2185 1325 -1074 -8 2227 356 -1340 241 1448 -716 -1739 189
1677 189 690 -1339 -1851 643 363 -1911 -1520 1095 539 -1470 -210 1710 353 -1052 821 2083
1693 2083 222 -724 1156 1599 -544 -1029 1197 1033 -1249 -985 833 -158 -1776 -763 984 -533
1709 -533 -1955 -178 1100 -458 -1129 892 1406 -401 -688 1565 1525 -433 -421 1545 609 -1093 107
1726 107 1614 198 -1406 -246 599 -1012 -1329 19 238 -1362 -1142 675 238 -1073 -502 1184 456
1743 456 -576 578 1575 424 -365 850 1513 -159 -637 721 730 -711 -772 708 14 -1415 -848 615
1761 615 176 -1409 -359 492 -552 -973 308 1071 -99 -623 893 1032 40 -169 1208 566 -340 38
1779 38 1292 263 -864 -377 209 -280 -1199 -177 87 -632 -1132 40 219 -573 -269 565 221 -505 -65
1798 -65 814 423 -81 665 999 427 -218 418 333 -198 -381 358 -143 -1044 -742 249 -251 -889 -721 355
1818 355 -200 -555 145 500 32 -243 500 949 377 478 866 705 -17 -88 444 176 -462 -409 502 -111 -799
1839 -799 -341 -368 -606 -747 -161 96 -574 -321 228 339 -65 9 695 419 180 574 737 289 83 409 418
1860 418 101 -342 -295 148 -425 -553 -428 -317 -686 -520 -167 -392 -309 -337 327 431 250 361 386 328 247 808
1882 808 493 296 159 432 190 116 -106 -32 -232 -591 -208 -316 -609 -629 -399 -433 4 -348 109 272 -167
1903 -167 278 379 541 136 283 459 391 353 172 266 217 -419 178 88 -435 -331 -412 -244 -498 -528 -240 -463
1925 -463 -32 -398 -141 67 151 161 230 398 397 562 505 625 430 154 436 52 -46 40 -457 -827 -703 -183 -387
1948 -387 -357 -289 -202 -683 -334 111 -21 -131 61 389 61 292 538 283 557 291 338 343 128 116 101 -115 -155
1971 -155 -578 -295 -320 -302 -272 -425 -348 -347 -334 -177 -107 -139 181 132 349 322 422 588 327 600 485 182 8 -89
1995 -89 -60 177 -158 -455 -474 -130 -351 -406 -214 -371 -174 -193 -65 46 -72 57 27 692 520 360 381 480 469
2018 469 243 39 173 207 -85 -177 -118 -259 -297 -141 -202 -233 -363 -362 -36 -107 -138 -168 85 363 392 -27 267 676
2042 676 356 285 226 318 80 -188 74 123 -133 -233 -373 -240 -419 -98 -335 -348 -217 -334 -70 118 104 43
2064 43 257 303 222 374 341 286 163 311 116 241 281 -235 -15 -239 -7 -362 -171 -459 -554 -326 -90 -156 -186
2087 -186 -326 -78 26 374 313 388 367 355 361 212 167 223 157 133 81 -97 -106 -199 52 -236 -212 -420 -438 -291 -276 -196
2113 -196 -12 -41 -119 118 284 254 313 224 325 293 68 375 324 252 15 279 227 -130 -343 -260 -84 -228 -229 -652
2137 -652 -298 -258 -253 -196 -297 -446 -141 -88 461 317 472 38 344 229 307 225 235 64 108 150 -281 -51 -188
2160 -188 -573 -343 -131 -227 -454 -333 -305 -247 -338 -171 100 -112 -74 328 826 251 51 357 363 96 -186 362
2182 362 -33 -214 -114 -81 -313 -362 -399 -442 -47 -464 -301 -54 -117 -331 54 172 5 481 312 355 219 90
2204 90 211 241 231 -6 57 -63 -3 -278 -43 -396 -288 66 -263 -541 -325 -171 -469 19 -283 206 342 103
2226 103 203 83 73 248 382 333 303 50 191 61 -69 -216 251 -82 -255 -293 -207 -350 -451 -353 -92 -159
2248 -159 -204 -106 30 223 86 427 342 323 309 91 419 403 194 260 -59 -22 -43 -75 -276 -266 -256 -131 -205 -221 -259
2273 -259 -29 -163 -542 126 348 -111 157 234 274 306 169 304 447 167 443 255 -21 -243 -57 -80 -77 -129
2295 -129 -38 -128 -330 -441 -18 6 -191 -70 376 79 -307 59 441 197 373 388 406 258 22 387 6 -319
2317 -319 -59 55 35 -383 -303 -61 -63 -404 -461 -24 -66 -316 70 150 156 -30 298 213 85 269 380 286 156 347
2341 347 268 195 -37 33 -89 49 -184 -152 -139 -329 -330 -235 -103 -239 -21 -182 153 -127 72 139 167 190 364 507
2365 507 -14 79 352 90 -18 62 74 -9 -23 -134 91 -112 -408 -45 -149 -502 -194 -101 -183 -289 -56 342
2387 342 192 260 276 390 444 156 153 10 73 50 166 -147 -119 -214 -144 11 -296 -219 -470 20 -184 -201 -102 -165 -165
2412 -165 83 565 252 22 318 145 -34 117 127 356 -19 -54 69 -192 -4 -98 -183 -166 -221 -425 -217 -301
2434 -301 -277 -155 -125 101 -170 284 231 174 88 144 339 301 122 148 204 148 186 -10 -66 -80 2 -390 -17 -103 -493
2459 -493 -396 -228 -334 92 -71 97 -155 56 153 -43 22 183 371 67 338 233 63 165 292 -42 99
2480 99 212 134 -345 -47 -195 -131 -79 -65 -53 -86 -163 124 -58 269 258 178 102 -13 265 466 87 168 -163 301
2504 301 -94 -276 -50 -61 -258 -307 -357 -404 -218 -512 -100 -171 -185 72 -115 -26 232 283 258 159 135 270 245 141
2528 141 207 245 132 344 33 -17 37 -113 -350 -324 -1 -392 -282 -134 -166 -238 118 -148 -238 365 -119 225 110
2551 110 -35 290 214 151 221 176 52 -78 29 121 58 -20 -178 -53 -203 -217 -137 -170 -111 -28 79 15 101 -277 -19
2576 -19 559 184 206 144 -38 119 85 -38 -168 -171 113 -43 73 -258 -195 -191 -107 -298 -132 -77 59 -353 -82 14
2600 14 -52 159 73 274 94 233 574 452 86 -123 201 77 30 -12 -142 -82 -379 -185 -412 -180 -404 -242
2622 -242 -70 52 -13 -125 57 -12 -126 339 143 284 -26 155 -67 51 -1 114 113 201 55 -39 -242 -370
2644 -370 -7 -44 -316 -458 -269 -233 -155 -12 379 92 -116 -8 287 82 -68 164 486 -35 377 191 116
2665 116 -109 38 75 57 -254 -163 -18 -49 -121 -157 7 125 -238 26 295 -516 -215 304 403 -76 64 323
2687 323 50 239 268 516 189 -67 194 177 -14 -233 14 -14 -324 -457 -40 -71 -353 -428 186 -157 199 373
2709 373 450 92 32 176 212 50 26 580 323 -64 62 248 -112 -277 -340 34 -236 67 -18 14 19 -490 -118
2732 -118 186 -175 -200 175 180 35 -119 241 -59 115 -127 380 404 -245 85 147 -199 -147 -5 203 -276 -337
2754 -337 -17 304 -185 -312 120 -172 -356 3 93 -62 -130 131 202 100 -58 323 425 130 -67 93 325
2775 325 -54 -336 192 209 -389 -92 -28 -195 -308 -242 86 -277 -202 269 192 -96 -69 378 336 -377 -102 404
2797 404 155 -200 8 230 335 -506 -62 381 -254 -377 -129 131 -321 -389 91 -138 -200 -118 374 196 -285
2818 -285 5 466 113 -14 156 564 22 -266 190 436 -57 -333 142 6 -567 -102 108 170 -555 -185
2838 -185 359 -292 -354 299 146 -154 -284 542 127 -255 -280 339 426 -41 171 422 201 -472 34 235 -122
2859 -122 -436 59 31 -435 -266 198 195 -529 -653 317 57 -251 1 415 201 -106 94 479 112 73 89 432
2881 432 -413 -266 40 192 -447 -418 154 54 -234 -51 411 -133 -368 -31 429 42 -341 401 508 -134
2901 -134 -61 564 411 -354 -112 454 263 -327 64 350 -114 -134 -171 339 -84 -591 19 221 -224 -313 192
2922 192 174 -425 167 230 205 -463 100 411 152 -352 150 455 -432 21 154 373 -141 -515 154 137 -405
2943 -405 -466 212 54 -519 -143 210 -95 -437 145 462 -32 -299 -23 23 -279 -108 193 137 -288 177 534
2964 534 192 -242 -206 224 -34 -432 -35 348 -141 -121 162 356 -70 -208 699 180 -236 -251 315 115 -212
2985 -212 -15 368 -6 -260 -6 414 -421 -262 241 394 -184 -141 265 -65 -552 -7 175 -56 -273 87
3005 87 226 -101 -482 393 612 105 -296 -114 310 -97 -78 364 139 -411 -253 151 -129 -312 -204 279 -402
3026 -402 -286 -10 83 -179 -99 395 217 -32 -293 462 286 -241 207 377 152 26 318 250 -77 -261 346
3047 346 400 -255 -234 4 95 -521 197 219 150 -455 129 242 193 -94 200 362 205 -318 326 153 -89 -242
3069 -242 138 154 -2 47 217 25 -334 -163 350 121 -542 -339 295 -66 -197 164 337 93 -219 602 115
3090 115 22 162 617 -54 -123 -14 223 -233 -180 -85 -56 -321 -344 112 343 -367 -118 -109 242 -374 196 412 200
3113 200 -287 83 335 372 152 267 354 135 -303 386 42 58 -312 161 252 -262 -241 170 -160 -346 -20 440
3135 440 -8 -230 239 81 -155 -222 96 254 -20 -74 86 387 128 -94 265 -161 -264 64 332 74 -72
3156 -72 -1 73 113 -458 211 23 -216 168 321 -61 14 47 420 411 -68 332 228 54 -101 129 50 -475 -414
3179 -414 -25 85 -322 -316 -182 64 -135 -195 204 -218 -316 -104 148 36 85 149 193 47 125 280 274 -16 100
3202 100 313 217 -176 39 -65 16 -94 81 158 -200 -295 67 261 -146 -84 -213 213 172 -9 -59 236 -87
3224 -87 -3 249 41 -219 -204 212 -106 -286 132 -95 97 -294 83 -253 -413 -72 -100 -9 -82 151 350 158
3246 158 185 -108 92 -155 -58 292 162 88 -63 20 -49 35 179 153 -47 -97 112 45 91 -294 -409 -57 -160
3269 -160 22 55 232 -220 -153 254 86 226 132 40 130 137 -33 182 32 262 -61 -176 -355 -202 11 -110
3291 -110 35 -41 -363 -92 -49 91 29 31 -65 2 146 40 334 326 5 59 -2 -272 -63 -188 236 334 288 -79
3315 -79 134 226 -77 56 -9 -17 -404 -24 393 178 -67 -163 198 287 -24 104 222 245 165 68 273 35 -99
3338 -99 -93 158 -81 -90 18 -191 12 -47 59 202 -270 -174 -15 81 205 191 2 -37 -8 -86 78 304 69 44
3362 44 12 172 33 144 36 1 79 -305 -171 -171 105 -348 -272 -92 -128 155 41 29 -38 388 25 -7 85 95
3386 95 10 70 -95 140 51 142 36 -62 -153 36 -17 -191 58 -103 -40 -150 -69 -179 65 -82 -205 1 198
3409 198 -170 34 -241 -46 67 154 -4 -34 32 88 -18 149 103 326 -12 -328 -174 -172 -392 -10 123 99 -190
3432 -190 66 -32 71 82 -15 27 -63 69 15 27 154 -12 63 178 -165 65 43 186 23 -235 -126 -42 17 33
3456 33 -209 371 77 25 -28 -45 50 -6 -245 208 -81 39 118 44 -60 51 266 -7 6 254 -23 -19 195 150
3480 150 -1 -78 -136 11 -4 14 137 -40 -278 226 245 31 168 11 -10 45 -134 164 334 19 -61 -155 -17
3503 -17 -97 -168 -243 -32 -31 17 -144 -320 -74 50 -49 62 147 -64 299 -318 2 72 124 299 -31 48 11 -47 -46
3528 -46 -14 206 -75 -217 -152 86 -59 -45 3 52 -88 -81 346 -6 -156 -155 75 -45 82 -39 118 132 -90 -53
3552 -53 9 210 -33 63 49 -113 -4 4 127 -203 -278 -31 -146 -24 -183 25 -193 -52 112 167 315 26 194
3575 194 69 233 289 -24 -127 384 -85 58 -169 49 -282 -20 -98 -108 -113 290 298 -29 -69 46 32 -120 -9
3598 -9 53 -186 31 48 130 38 -156 220 -187 192 49 -197 -101 50 -128 -13 -207 -320 -102 18 116 -36 -196
3621 -196 -30 -146 -5 42 198 87 -123 86 136 -18 204 -17 -108 -138 30 20 50 180 -145 1 -13 66 66
3644 66 133 -112 -136 -120 -45 52 -93 167 57 -66 42 40 157 172 97 -111 102 169 163 72 134 188 -176 -34 15 -224
3670 -224 -252 -238 -29 -29 -200 -139 -33 -114 -138 -53 116 390 -76 -86 -76 -121 235 207 -79 1 -17 -60 -20 -41 -383 34
3696 34 -317 -106 -146 -116 -239 -68 -161 -98 60 -19 39 217 139 -1 106 253 -70 -133 -221 -172 -14 -407 5 -184
3720 -184 97 -160 -138 64 182 -158 -131 -12 -68 21 -250 -146 170 41 119 44 88 -26 -19 21 21 86 -168 -90 50
3745 50 -189 -12 -12 -159 105 136 -99 -101 -186 92 276 -160 76 -137 23 230 -38 110 32 102 -117 12 101
3768 101 -57 -41 30 -21 80 83 146 -245 -166 -230 -170 36 -168 -77 -62 201 -180 -76 -42 33 29 100 300 -50 28 171
3794 171 -59 -37 -42 83 -183 -151 99 -6 -102 -131 -139 116 -88 24 -304 -171 -109 -189 -81 72 144 247 23 315
3818 315 -36 70 -83 143 -109 10 0 -109 -132 -157 1 -2 11 -227 -51 3 239 44 114 -12 -59 222 53
3841 53 -78 99 66 0 -91 -51 63 -150 -73 157 -29 -136 89 33 -30 61 -91 -97 -87 80 -51 -45 55 31 -150
3866 -150 -189 -53 122 153 -31 -95 51 -153 -42 193 147 257 -118 -13 90 -209 143 5 -118 -166 -27 42
3888 42 -107 71 105 39 -187 -352 167 35 108 203 375 -152 58 53 -67 247 -180 111 -99 -147 128 1 -62
3911 -62 53 20 -126 46 -36 79 -4 -114 -84 73 -33 54 135 -73 48 15 101 27 -23 -21 137 39 53 145 164 -183
3937 -183 -120 -209 -26 40 -202 -207 241 -166 -199 208 254 124 214 154 145 32 42 120 -27 71 28 70 68 60 -61 -37 -37 -207
3965 -207 -122 -154 19 -178 100 137 31 -104 -383 -25 312 -167 -40 -158 -66 -88 -243 87 155 -188 175 -71
3987 -71 -118 61 32 -278 -21 96 -230 17 40 -93 -62 93 100 -65 94 262 188 303 26 215 167 -15 -257
4010 -257 -193 -8 28 50 94 -99 -119 -286 5 -43 36 -35 127 -31 207 -147 -83 92 -84 -71 19 125 -18 33
4034 33 6 386 26 196 202 -46 139 -103 -27 251 -113 143 -17 -44 193 91 -384 -153 125 -163 -39 33
4056 33 -17 206 0 -2 -20 -23 115 -67 235 311 31 -44 -106 269 -45 -21 -59 15 -144 73 -133 -256 -166 213 -74
4081 -74 12 -18 31 161 183 9 -172 171 86 184 179 225 138 3 6 -194 211 -288 -33 87 -155 -44 -229 48
4105 48 -143 -5 358 73 449 -90 -51 50 239 215 85 116 -62 12 -80 132 153 -64 -21 -89 -64 -190 -159 -471
4129 -471 -177 106 62 62 338 -90 -245 176 -13 4 20 24 82 5 318 -5 49 169 31 153 11 54 296 91
4153 91 -172 22 161 -120 34 -39 113 75 145 30 44 -139 48 340 -34 -22 -109 -108 114 -174 72 -6 -247
4176 -247 18 12 -29 -60 101 106 -74 -114 83 -52 54 -112 -249 150 -184 72 100 19 81 10 16 -100 224 41
4200 41 -176 -126 -29 -175 12 -271 -199 38 46 -325 165 -96 70 -224 186 153 -205 90 68 236 -62 -17 9
4223 9 64 -40 300 -87 208 81 -157 -71 -181 99 -4 -180 57 -405 4 20 12 -66 -209 326 24 -34 -21
4246 -21 -126 -97 -122 49 51 38 -71 234 -11 -23 8 -122 78 -484 191 -264 -9 75 -31 -127 -173 96 -108 -52
4270 -52 -149 92 76 252 -21 25 162 -9 -39 82 50 -154 -221 131 106 -220 -19 134 -29 -221 49 283 -39
4293 -39 -214 50 113 -146 -45 101 49 -130 33 80 131 103 57 -1 -41 -180 26 -103 -126 -22 11 294 -129 -253
4317 -253 -100 58 -83 -51 73 -54 75 13 -43 -75 15 80 180 483 -14 33 187 76 9 196 103 -176 26
4340 26 125 206 -19 -483 -65 20 -178 -102 48 -130 9 250 -28 81 -110 19 25 115 -30 432 -93 -21 88
4363 88 115 -128 -179 10 -136 -68 -262 -75 77 -258 104 351 278 98 24 -14 129 -93 125 70 79 78 9 170
4387 170 -151 -300 183 313 -56 160 -46 -84 -57 -86 -263 -148 -273 -507 136 -85 -161 -103 190 39 -16 115
4409 115 197 -313 -95 85 414 162 151 211 -13 0 -150 91 -118 -112 0 -43 -65 -260 -186 33 -153 -40 465
4432 465 53 -3 -267 197 214 123 104 141 -55 -141 149 165 -157 -271 2 103 -100 46 89 -65 -264 -125 -66
4455 -66 -73 -308 -303 -10 85 -90 -162 99 9 52 12 278 -132 -278 253 -73 -235 -193 80 55 -133 -37 105 -28
4479 -28 -190 210 -15 79 -189 54 65 103 -34 67 30 41 163 83 19 -83 178 -13 -52 -191 -236 -83 -147 -226
4503 -226 93 128 -219 -192 -24 -203 -191 -70 87 -267 -191 134 -9 26 -172 94 58 201 19 -41 231 37
4525 37 42 7 -165 -176 -311 -224 -141 -106 -72 38 -385 -186 -8 -112 23 -84 -143 263 -147 -94 126 236 -252 -129
4549 -129 115 -47 -41 177 67 -141 -41 54 -170 -261 -15 150 -97 -245 137 -27 -69 -204 77 -83 -166 15
4571 15 1 236 7 -141 -53 69 -22 -30 131 114 -240 -120 -195 123 -111 16 -193 -97 -593 182 191 -261 2 43
4595 43 -18 -93 251 30 274 -5 61 200 56 -30 -4 -100 -181 -27 -36 -155 -235 -270 -19 -197 7 -280 -155 61
4619 61 -125 -20 92 194 -241 246 228 -286 -171 130 -101 53 -262 127 -105 -193 341 -102 -1 -94 -212
4640 -212 -73 -19 134 21 367 -30 -155 173 -264 -75 235 235 -31 360 52 -77 -141 -82 344 189 41 -231
4662 -231 57 135 83 128 -165 -45 -342 -48 34 -88 125 292 15 -325 171 89 274 180 -95 -2 34 175 129
4685 129 -36 12 -289 49 133 -164 -106 -196 28 -45 101 -140 -93 -90 -218 110 -35 19 122 -193 257 78 -117
4708 -117 84 -235 261 18 -68 -33 83 51 8 -76 -176 148 -231 -212 -72 -229 -21 -95 -160 305 62 -164 321
4731 321 204 -27 -25 139 104 -82 -99 243 255 -222 -35 142 11 164 5 38 -46 -119 -2 -137 -90 -132 -306
4754 -306 2 -217 -209 13 -53 -89 -217 277 -76 -39 169 49 -120 -64 -142 242 -102 7 -69 21 -21 -125 -82 -91
4778 -91 32 -145 -200 157 -67 -97 58 91 267 -98 -33 186 -79 124 86 249 -113 325 118 -89 -81 -102 -57
4801 -57 -190 76 113 69 19 9 8 -47 -85 -49 122 165 -29 170 246 226 161 205 2 128 -146 77 -134 -193 -329
4826 -329 55 -272 210 99 -76 102 252 2 17 -144 -102 59 -130 -135 14 206 205 19 48 -44 -4 -156 -20
4849 -20 -202 112 -274 166 -56 174 -259 -343 64 -375 74 39 62 -294 32 17 -33 280 111 163 271 25
4871 25 78 60 172 12 -134 -60 -35 -75 -32 56 -171 35 -189 -71 -122 -155 -69 -315 -97 -86 180 13 156 -88
4895 -88 170 479 182 60 91 232 -4 -67 85 100 -94 -107 -225 -171 24 -102 -64 16 -107 -35 -84 174 1
4918 1 -85 -26 -13 -59 -90 -161 14 123 -252 137 211 -15 206 68 -149 34 18 -159 6 -192 88 0 -143 -285
4942 -285 66 31 206 -120 25 9 -58 44 -184 -201 -63 25 0 170 -158 -151 -57 -307 -65 -85 -174 186 -172 -80
4966 -80 153 260 -7 -188 -125 -165 67 263 9 203 186 -242 -67 210 -65 60 -119 48 -91 130 -11
4987 -11 -8 54 -81 -227 -26 151 -159 25 -327 196 24 -19 -161 108 149 59 22 -131 170 140 75 58 -104 31
5011 31 17 -184 -21 35 -17 -40 -66 -90 -133 -60 -179 -269 -179 76 31 -72 -229 190 158 -256 201 32 46 22 -41
5036 -41 -70 -172 -58 -64 103 -228 -132 -296 -269 16 -83 -223 -222 59 -251 -192 68 -37 39 -33 -31 272 8 -157 -62
5061 -62 -31 -88 -85 -2 235 5 -89 121 33 -32 148 64 -147 -231 8 -159 159 84 118 -100 66 8 -21 50 -81
5086 -81 -112 -29 147 24 6 308 -11 -455 171 102 69 -88 -90 57 47 -20 169 19 34 -158 -68 164 -48 -70
5110 -70 -23 -14 -191 217 36 -223 -55 -47 212 128 139 -95 79 -99 -127 105 62 87 -404 62 54 -73 -196 -72
5134 -72 47 112 -230 67 -25 48 171 163 -159 -11 -15 7 -56 -76 9 -15 -30 -158 43 -311 102 -18 -173 209 -122
5159 -122 -28 101 41 117 -374 -106 67 103 -142 120 63 -285 6 322 278 110 127 -149 24 3 -222 -40 6
5182 6 25 17 -236 84 42 -202 20 55 15 -115 -36 77 -19 63 -154 4 89 107 51 -106 -262 -68 268 -97 -255
5207 -255 -290 -255 28 71 -14 115 -104 -44 40 8 -24 188 53 43 114 166 190 175 203 -182 -118 -102 88 80 -238 -210
5233 -210 -129 208 -135 -126 49 -46 -82 95 113 172 77 127 209 -4 7 -124 -11 -40 -301 108 -52 18 175 22
5257 22 -168 -75 61 -83 -123 -115 153 168 -38 -24 361 41 -152 -53 -147 -200 -199 14 40 50 -112 -278 -241 -241 30 129
5283 129 136 -285 -184 -131 129 -188 -175 32 159 -22 208 74 53 -22 98 160 -34 -8 -184 31 166 24 -180
5306 -180 52 84 -5 -20 -93 140 7 -188 -72 -80 163 -31 53 53 -171 -141 -64 230 198 -47 -215 229 38 119
5330 119 -149 -189 -19 22 99 37 71 117 371 -34 70 2 -48 -69 -251 -46 -229 -103 -45 39 75 77 40 62 -148
5355 -148 -109 274 -106 57 56 -206 13 179 -114 22 -411 -193 98 143 245 -53 -133 247 401 -111 180 268
5377 268 102 23 330 92 166 -3 -108 -35 -111 129 -164 -28 40 9 -267 -18 7 -35 13 -120 -70 -132 -200 -54
5401 -54 -195 -100 -183 -61 26 -88 105 29 -104 64 143 69 -186 -149 -88 -53 53 -113 131 213 -129 72 121 -158
5425 -158 -9 -72 86 -158 -54 23 163 109 -5 45 45 14 106 -24 119 -71 40 -28 -38 -96 -100 -176 21 76 58
5450 58 -200 -36 18 82 66 -11 114 -142 -68 267 -281 90 -176 -142 -123 67 -103 44 127 93 26 -15 -91 -184 198
5475 198 221 -47 43 20 -56 281 -65 79 -203 -152 64 -220 -20 174 219 309 240 -189 191 10 163 -37 -360
5498 -360 115 -101 -72 -254 -210 -6 -334 -111 59 -84 -97 -40 -22 143 141 -155 130 31 -123 138 227 38 148
5521 148 -43 46 -12 31 -421 7 -218 -45 89 -160 320 164 -184 177 103 216 205 24 -166 -9 -25 31
5543 31 316 105 131 83 47 133 -76 -102 28 188 -94 -3 -45 61 -44 324 50 63 -23 117 9 -145 -78 156
5567 156 -22 53 205 104 -78 270 94 141 -172 -190 162 -231 68 -115 -74 -50 43 217 -48 -52 -20 -186 -159
5590 -159 -192 87 -128 82 216 123 166 227 35 -73 190 -19 77 38 328 -142 -156 155 -135 59 -165 9
5612 9 -266 41 55 254 -5 -6 -4 50 -92 44 319 -252 28 63 265 186 -38 -177 69 -73 -137 -67 -139 55
5636 55 -186 7 -4 113 71 174 205 207 -201 189 96 268 87 240 35 8 33 -15 -15 -52 -107 60 -15 9 0 -30
5662 -30 26 136 18 178 0 53 -117 121 -33 29 209 -48 23 -423 193 -180 84 -27 -119 -78 32 271
5684 271 86 -191 -6 187 -244 -57 127 -64 -164 -158 -207 160 -22 35 39 -118 101 0 162 218 -3 -54 21
5707 21 -30 -296 33 -75 24 -2 138 22 -31 -43 120 65 -151 -30 -36 -114 122 -168 50 3 -181 83 161 144
5731 144 68 210 177 89 -80 108 277 -161 -74 60 -43 -175 382 77 136 -202 -13 141 -293 -201 14 211
5753 211 -102 -115 258 195 -24 121 322 183 -126 -64 300 -147 -204 -91 119 -113 74 201 76 -62 41
5774 41 -181 25 -1 168 13 -98 -177 -197 81 -28 12 -145 -99 99 -133 135 -62 147 26 -243 171 -15
5796 -15 6 -55 161 -151 -64 -46 -83 -252 132 8 7 -133 -80 280 250 -65 -47 157 6 -117 113 59 -162 -151
5820 -151 -60 -120 129 -218 130 111 -66 -55 218 49 -79 -124 -77 -228 -219 143 -55 -222 204 187 -85 -52 -189
5843 -189 120 65 75 6 -71 -254 330 19 41 -211 -36 218 49 -214 158 -84 -157 153 31 -148 -320 -24
5865 -24 19 -39 -205 -119 -23 127 -98 -100 -19 -32 -96 -179 -83 6 -61 -156 40 -224 -16 -96 174 -160 -497 93 138 -267
5891 -267 -175 27 121 -45 62 42 111 240 63 130 191 200 123 24 -135 -235 66 -117 -139 -116 -32 349 -287 -77
5915 -77 115 144 -7 -11 308 -125 58 105 -19 344 199 50 62 -135 92 48 -9 -22 145 201 -190 42 -254
5938 -254 39 -92 -28 376 -186 -41 146 143 -28 -115 100 39 -55 -59 138 244 -86 -3 187 199 -115 -3 -5 89
5962 89 -191 -108 100 117 -229 -180 198 -91 -371 -110 -34 66 288 37 82 -42 34 59 -55 -34 -122 207 -197
5985 -197 -144 -76 3 -71 -45 200 -30 -179 -152 -125 106 -35 107 57 4 -20 38 64 -24 -85 -113 113 -77 -42 -195
6010 -195 -105 -37 -106 79 48 -432 153 -256 197 -106 39 49 -389 42 63 32 10 -111 -43 -137 -126 -76 -98 167
6034 167 -256 -24 -123 -31 297 183 126 47 -59 -143 15 -51 -92 115 225 -93 -258 203 -73 -39 -10 126 36
6057 36 -237 97 167 222 -119 -152 4 70 -18 -20 147 -92 71 169 -17 -147 -264 139 147 44 33 54 -29 -89 126
6082 126 114 42 25 -13 409 -116 118 147 24 -59 -182 -113 -293 -124 58 -261 -370 228 19 -53 -311 -98 118
6105 118 -181 41 -62 194 -88 -45 -45 -131 18 83 79 224 49 -40 -89 -136 234 113 -169 104 41 43 103 55 -46
6130 -46 -163 0 -37 16 -44 -28 -45 -65 -28 -82 -173 89 61 -92 63 53 392 -120 40 -127 105 242 -135 -23
6154 -23 8 -66 -68 243 119 -240 67 225 -21 174 40 -37 58 63 253 177 112 -36 -118 -41 68 30 -122 114 -65
6179 -65 -301 -71 112 -75 -54 5 -6 -103 -15 -93 -263 101 326 -111 35 168 -25 -92 57 50 -81 -36 -16 80
6203 80 -219 88 86 132 -41 -46 -20 -75 197 -134 -29 -16 -63 59 146 -3 -92 -38 82 105 110 -70 -28 -194 -116 -198
6229 -198 38 -151 -240 -183 -313 211 -83 111 105 -21 37 -46 -111 7 -32 -31 7 255 -188 256 -138 -183 -47 -56 192
6254 192 -93 -180 -41 262 135 -115 -26 -109 165 -163 -214 -215 167 -162 -2 205 52 -45 145 149 -11 82 49 -46
6278 -46 -62 6 -102 -70 17 24 -341 -42 -73 -18 2 -49 76 230 234 45 -43 -46 275 -104 53 -82 11 462 -211 17
6304 17 108 -94 -40 27 -343 120 55 -240 12 53 -180 144 -84 -128 -117 65 -204 48 -153 274 170 110 -198
6327 -198 -138 -105 -47 -37 227 57 118 -30 27 -141 18 -147 -147 58 -158 3 125 132 -140 -147 23 51 -5 121 -91
6352 -91 50 248 247 -86 -26 159 -432 -223 -90 53 -151 -172 -389 -226 -124 -307 -118 -346 -283 157 -63 24
6374 24 161 61 -184 216 -100 72 137 43 75 241 302 -43 -66 366 -86 -182 -208 -164 250 -64 213 -70 -23
6397 -23 -54 -102 -33 -10 13 -212 87 -6 -336 94 81 -36 188 191 -53 -219 101 -130 -174 -170 -8 19 57 -13 154
6422 154 -84 -126 272 95 61 -225 -23 -30 45 -193 -141 -23 210 -80 -215 -119 -167 -25 -5 -96 -341 -28 -412
6445 -412 16 199 123 57 -132 83 19 -24 68 124 285 74 -135 75 7 160 -13 -54 177 -19 95 194 32
6468 32 31 180 106 27 163 -118 -44 55 314 152 -56 38 294 -51 -100 61 -131 -78 188 -260 158 -57 -138 -76
6492 -76 16 -170 -41 -221 -136 217 -263 119 -209 -117 -3 100 137 -7 -56 -229 125 -107 -18 55 165 264 -48
6515 -48 -82 -169 87 118 211 35 73 25 -81 -243 -139 138 14 68 -75 -350 -185 -77 162 84 -78 -229 -116
6538 -116 -91 -75 366 -153 37 25 42 15 -103 90 114 10 50 29 -47 83 -228 49 -215 58 262 187 -101
6561 -101 2 -105 -4 -42 153 30 -126 37 -8 203 54 -65 -133 16 -123 112 -61 -195 15 157 -12
6582 -12 -308 140 75 36 155 48 48 179 52 -52 125 -102 31 97 -68 -109 -302 -106 -318 -117 -92 58 -168
6605 -168 -61 227 36 -232 173 105 -1 114 -83 4 55 38 80 432 7 72 58 -108 211 313 -180 -146 110
6628 110 -246 71 25 23 222 -65 -130 -105 -48 -292 -365 -49 -39 374 -286 -34 314 -52 46 159 -146 26 28 -22
6652 -22 243 215 -99 146 26 35 141 88 60 38 -44 75 132 -91 -16 -98 188 -256 -300 -248 38 78 141 102 72 -203
6678 -203 43 38 -287 69 -62 -160 68 -221 225 18 244 -37 -247 -207 -5 -80 -190 265 -18 195 95 170
6700 170 227 258 106 -48 -212 151 -96 67 190 -136 -219 -56 -101 100 -44 30 -115 11 -191 -25 -64 -114
6722 -114 33 -6 96 5 -73 310 -142 -110 -28 247 -217 95 117 63 -129 96 -47 -37 -18 -72 11 44 -51 -123 -7
6747 -7 -65 111 98 -84 127 -69 1 -123 123 40 -107 -127 -95 161 -165 -148 165 129 -116 129 79 -228 325 8
6771 8 342 -50 -24 -164 -49 -174 12 147 250 106 -57 -67 -50 256 -106 -310 -12 104 -30 -117 -216 -55
6793 -55 -64 -54 29 -101 -141 37 -27 -70 -248 -75 96 243 0 207 -70 227 210 -120 -96 244 79 -137 -173 130
6817 130 64 -75 -7 -91 -116 -246 -138 -31 -368 113 40 -94 -159 155 29 -138 131 49 129 35 -72 -150 -157 153
6841 153 78 32 -244 -50 -22 -67 -200 79 -99 82 -34 -277 -75 -124 -1 8 44 54 198 -139 131 -61 5
6864 5 270 133 -105 177 -80 -21 -216 -191 -114 18 -50 12 -98 -39 -76 -21 216 89 -95 131 393 9 177
6887 177 56 428 57 -1 134 26 37 216 172 64 -15 -71 77 -83 132 -259 -139 91 -33 -92 174 -68
6909 -68 -72 -45 10 30 -7 -43 -171 -335 89 199 108 172 -19 383 49 72 -4 -155 -22 -286 207 2 -195 189
6933 189 -234 115 111 178 174 158 177 -38 200 -81 -123 -123 108 26 187 -112 74 -100 193 -61 -131 98 -163 16
6957 16 -68 294 -10 -161 -77 93 36 82 -179 84 -118 -124 41 24 119 -52 -22 147 -69 -67 -20 -150 -85 261 -97
6982 -97 -152 -112 -93 163 86 -2 -86 145 35 35 -75 61 -78 -36 -12 -243 -12 -42 92 64 30 -53 -12 138 30
7007 30 217 53 -174 -103 -234 -73 -106 -119 317 -186 108 35 -88 63 -47 -20 -13 20 44 204 -74 249 -13
7030 -13 -174 92 239 -42 -81 -121 -49 -322 49 93 -104 89 -61 156 -104 57 114 95 0 -107 9 82 157
7053 157 -149 -47 -32 -337 -22 -79 160 49 -166 77 141 89 -24 -41 -132 -108 123 95 178 397 203 -66 231
7076 231 162 341 -122 74 26 -173 221 98 76 17 138 112 67 162 32 20 69 -390 100 -85 -251 -107 200
7099 200 -132 -227 104 -149 -188 -153 -242 194 24 -115 283 123 30 -14 25 138 -1 -157 -190 -36 -51 -3 8 52
7123 52 -230 35 -26 5 40 -98 -69 -168 311 -27 247 52 -179 157 -43 -91 102 -82 -34 -83 -94 -204 -1
7146 -1 -104 -45 163 16 -109 -181 189 158 -23 -58 280 -47 -24 240 -174 -87 167 17 -87 -180 51 -81 -176
7169 -176 -135 -167 6 128 -60 8 310 56 -138 22 226 -111 -26 -108 19 118 -62 71 83 32 108 67 -18 -126
7193 -126 -333 121 -242 215 111 41 -72 184 -26 -112 -106 -115 -53 -67 -52 183 339 165 -250 33 133 -40 210
7216 210 -146 281 -172 -25 48 -243 -118 -38 83 385 113 45 120 -29 -62 159 -44 -149 152 53 -14 312
7238 312 143 -50 -57 -117 -169 88 -253 -175 -4 51 1 3 133 -158 -110 39 283 289 -77 94 -308 237 -22 42
7262 42 -157 160 126 -215 84 78 -14 -199 -137 105 -88 -39 341 -103 -49 190 71 -17 -193 156 -71 48 50 5
7286 5 234 -38 -10 253 22 24 308 39 -7 -92 237 142 170 -20 -22 326 -212 100 75 -230 -111 -10 -29 -225
7310 -225 -37 -120 126 73 332 96 37 -134 93 -133 134 -40 -36 -56 200 -60 112 -140 -160 84 249 -21
7332 -21 47 123 -79 39 -219 12 -300 39 -110 96 -76 -105 -3 73 25 -114 71 268 156 -5 -82 49
7354 49 11 -36 17 -57 -32 -288 103 -74 -72 -49 -51 156 -98 -149 -43 -47 130 -132 85 183 -43 74 71 129 -246 -8
7380 -8 19 -80 3 -30 50 71 -209 -113 4 -50 -23 8 -205 -223 124 26 -190 162 -9 320 -38 269 101 0 -66
7405 -66 131 -27 198 74 28 173 70 -25 -107 -155 -139 94 24 191 -105 167 147 112 -155 14 14 124 -63 102
7429 102 61 -12 -256 -155 66 -141 -217 146 34 -91 -303 244 17 -25 -5 83 -19 -31 106 -53 -33 2 -5 -75
7453 -75 -116 -1 59 91 -64 77 115 -236 -18 53 47 52 -85 -181 -139 35 150 -84 40 -133 -31 121 -142 -24
7477 -24 -79 305 -29 -122 -80 -1 -43 -10 -65 21 154 -127 -270 125 28 -201 -142 184 258 -138 -38 -182 -103 -126 98
7502 98 34 342 215 184 52 -38 279 240 -104 -116 11 14 -10 20 45 -43 117 -84 -110 -180 146 89 -170 48 -85
7527 -85 -45 8 -16 70 -73 38 -103 182 8 7 305 97 40 144 -100 -58 -115 -10 68 -160 154 38 -179 27
7551 27 61 93 288 -33 18 99 -63 261 176 -413 -100 -118 49 -14 10 49 -245 -15 85 -278 269 -275 -154
7574 -154 195 -107 263 -165 31 64 -100 -94 269 -132 -7 13 -154 241 -179 -158 295 -1 105 -27 -1 -94
7596 -94 -19 -105 95 8 -130 61 -264 5 88 23 -98 80 -57 -65 141 -39 -75 46 -224 139 22 185 160
7619 160 46 77 196 45 -24 348 -146 -52 103 34 -85 90 24 -76 -49 -63 -39 -57 -97 -176 -71 274 70 -42
7643 -42 -440 12 92 -175 45 -106 -94 -47 30 -46 101 138 150 -23 209 265 -47 -28 -183 -27 136 -200 -94
7666 -94 155 60 -107 205 82 -107 -37 -28 -113 -55 55 -88 -152 128 37 73 -12 48 -103 114 -5 11 -136 -5
7690 -5 37 175 -237 32 194 95 28 -66 180 107 -133 -230 -110 27 -40 -87 -104 -4 -12 158 -118 -123 59 -130 -81
7715 -81 -29 161 30 81 -115 -142 215 275 -76 32 302 18 -27 -83 192 -135 -139 39 -4 -230 -124 56 107 -282
7739 -282 215 -11 300 -29 236 -31 -250 256 77 125 115 -68 253 194 159 266 43 -91 -53 273 77 -100
7761 -100 -134 148 -7 -48 -58 146 16 90 61 83 227 6 -131 -243 -37 -100 18 82 -110 101 -166 -36 160
7784 160 -237 -134 -96 102 -66 -246 19 12 181 44 103 29 -9 -73 103 -53 64 -114 -223 -48 -234 -48
7806 -48 -65 198 -458 -145 -179 -20 50 -167 74 126 14 -111 40 49 135 -276 -152 68 173 -4 -40 -5 84 114
7830 114 110 40 -26 78 29 118 -68 10 -135 -33 41 -330 -142 147 -164 -98 -302 -22 125 -126 271 -9 160
7853 160 38 -1 -158 19 -41 78 109 -52 162 -68 353 -153 -178 7 -153 180 64 -325 -27 -110 -83 -100
7875 -100 97 -96 37 121 30 42 83 -202 -77 -16 30 -138 -127 -255 -52 131 141 -69 48 91 -35 -134 -235
7898 -235 -31 -80 34 126 -138 -101 147 -40 67 -111 134 -211 -118 -109 -145 47 281 149 38 40 186 141 72 -68
7922 -68 21 -46 -133 126 73 62 132 325 14 15 74 86 160 71 308 147 306 272 -277 184 39 -10 -104 -176 -123 206
7948 206 98 101 -88 4 125 -31 -90 194 -118 -134 -81 175 90 -187 216 12 378 -97 -57 -17 21 -40 27 67
7972 67 303 -90 -26 241 81 -168 -130 -209 -109 -15 42 23 -13 145 98 -60 -120 162 290 198 184 -107 18 47
7996 47 -8 -232 94 -3 82 -207 -116 68 -175 32 -7 31 -257 -209 -78 -190 -134 -85 16 -161 80 183 28
8019 28 -100 208 -122 -99 61 -26 8 -72 180 37 -95 21 126 91 166 151 237 -87 -148 53 -12 23 50 -185
8043 -185 7 40 -64 30 -33 -59 154 -37 -90 -45 91 48 -171 90 -212 134 65 73 -360 -23 -1 37 -58 -102 -23
8068 -23 71 -265 18 244 -27 106 -136 176 -219 -83 49 -293 -224 -31 -33 -157 -155 119 -237 114 0 42 337
8091 337 -58 -181 47 -38 -123 -50 -103 -132 -71 -94 142 42 194 20 -100 -138 141 0 238 -53 214 171 93
8114 93 -39 85 135 -160 74 120 -42 150 331 237 -82 271 19 -70 7 -242 71 -54 -3 124 -198 -158 -245
8137 -245 -34 66 -24 93 156 65 -89 -148 -30 132 -81 52 -205 -50 72 -76 127 26 205 -28 351
8158 351 -112 -12 -127 72 -266 205 348 94 243 -257 -102 215 -8 21 -10 -76 245 -44 134 -96 -33
8179 -33 -53 56 182 14 210 -47 -167 -367 104 -357 -169 159
8191A59
##END NTUPLES=NMR FID
##END=
