##TITLE=1H_LR-0154-OMe-CH2Cl2-TFA
 CD3CN+TFA
 8 sc, 
 22.2.2023
##JCAMPDX= 6.0         $$ Bruker NMR JCAMP-DX V2.0
##DATA TYPE= NMR FID
##DATA CLASS= NTUPLES
##ORIGIN= UXNMR, Bruker Analytische Messtechnik GmbH
##OWNER= root
$$ XWIN-NMR		Version 3.5
$$ Wed Feb 22 15:52:36 2023 Russian Standard Time (UT+4h)  she@DPX200
##.OBSERVE FREQUENCY= 200.13135
##.OBSERVE NUCLEUS= ^1H
##.DELAY= (6, 6)
##.ACQUISITION MODE= SIMULTANEOUS
##.ACQUISITION SCHEME= undefined
##.AVERAGES= 8
##.DIGITISER RES= 18
##SPECTROMETER/DATA SYSTEM= spect
##.PULSE SEQUENCE= zg30
##.SOLVENT NAME= DMSO
##.SHIFT REFERENCE= (INTERNAL, DMSO, 0, 15.7039)
##AUDIT TRAIL= $$ (NUMBER, WHEN, WHO, WHERE, WHAT)
$$ ##TITLE= Audit trail, XWIN-NMR		Version 3.5
$$ ##JCAMPDX= 5.01
$$ ##ORIGIN= Bruker BioSpin GmbH
$$ ##OWNER= she
$$ F:/spectra/data/she/nmr/H-F/1/audita.txt
$$ ##AUDIT TRAIL=  $$ (NUMBER, WHEN, WHO, WHERE, WHAT)
(   1,<2023-02-22 15:50:55.71 +0400>,<she>,<DPX200>,
      <created by zg, POWCHK disabled, PULCHK disabled
       configuration hash MD5:
       00 E9 B6 7A A2 85 ED C7 34 08 36 98 17 FE 4E 26
       data hash MD5: 16K
       84 C7 D4 D0 1E 89 BC CF E6 2B 00 7A 28 09 D1 B9>)
$$ ##END=
$$ 
$$ hash MD5
$$ 56 89 A8 FD 7A 24 9C AC 48 27 3A D3 98 05 B9 48
##$RELAX= 
##$RELAX= 
##$RELAX= 
##$RELAX= 
##$RELAX= 
##$RELAX= 
$$ Bruker specific parameters
$$ --------------------------
##$DU= <F:/spectra>
##$EXPNO= 1
##$NAME= <H-F>
##$PROCNO= 1
##$TYPE= <nmr>
##$USER= <she>
##$AMP= (0..31)
100 100 100 100 100 100 100 100 100 100 100 100 100 100 100 100 100 100 
100 100 100 100 100 100 100 100 100 100 100 100 100 100 
##$AQSEQ= 0
##$AQ_mod= 1
##$AUNM= <au_zg>
##$AUTOPOS= <>
##$BF1= 200.13
##$BF2= 200.13
##$BF3= 200.13
##$BF4= 200.13
##$BF5= 200.13
##$BF6= 200.13
##$BF7= 200.13
##$BF8= 200.13
##$BYTORDA= 1
##$CFDGTYP= 0
##$CFRGTYP= 5
##$CHEMSTR= <none>
##$CNST= (0..31)
1 1 145 1 1 1 1 1 1 1 1 1 1 1 1 1 1 1 1 1 1 1 1 1 1 1 1 1 1 1 1 1 
##$CPDPRG= <>
##$CPDPRG1= <>
##$CPDPRG2= <>
##$CPDPRG3= <>
##$CPDPRG4= <mlev>
##$CPDPRG5= <mlev>
##$CPDPRG6= <mlev>
##$CPDPRG7= <mlev>
##$CPDPRG8= <mlev>
##$CPDPRGB= <>
##$CPDPRGT= <>
##$D= (0..31)
0 1.2 0 0 0 0 0 0 0 0.06 0 0.03 0 0 0 0 0.0002 0 0 0 0 0 0 0 0 0 0 0 0 
0 0 0 
##$DATE= 1677066655
##$DBL= (0..7)
120 120 120 120 120 120 120 120 
##$DBP= (0..7)
150 150 150 150 150 150 150 150 
##$DBP07= 0
##$DBPNAM0= <>
##$DBPNAM1= <>
##$DBPNAM2= <>
##$DBPNAM3= <>
##$DBPNAM4= <>
##$DBPNAM5= <>
##$DBPNAM6= <>
##$DBPNAM7= <>
##$DBPOAL= (0..7)
0.5 0.5 0.5 0.5 0.5 0.5 0.5 0.5 
##$DBPOFFS= (0..7)
0 0 0 0 0 0 0 0 
##$DE= 6
##$DECBNUC= <off>
##$DECIM= 32
##$DECNUC= <off>
##$DECSTAT= 4
##$DIGMOD= 1
##$DIGTYP= 9
##$DL= (0..7)
0 120 120 120 120 120 120 120 
##$DP= (0..7)
150 150 150 150 150 150 150 150 
##$DP07= 0
##$DPNAME0= <>
##$DPNAME1= <>
##$DPNAME2= <>
##$DPNAME3= <>
##$DPNAME4= <>
##$DPNAME5= <>
##$DPNAME6= <>
##$DPNAME7= <>
##$DPOAL= (0..7)
0.5 0.5 0.5 0.5 0.5 0.5 0.5 0.5 
##$DPOFFS= (0..7)
0 0 0 0 0 0 0 0 
##$DQDMODE= 0
##$DR= 18
##$DS= 0
$$ [...]
##$SUBNAM2= <"">
##$SUBNAM3= <"">
##$SUBNAM4= <"">
##$SUBNAM5= <"">
##$SUBNAM6= <"">
##$SUBNAM7= <"">
##$SUBNAM8= <"">
##$SUBNAM9= <"">
##$SW= 18.05172834244
##$SWIBOX= (0..15)
0 0 2 0 0 0 0 0 0 0 0 0 0 0 0 0 
##$SW_h= 3612.71676300578
##$TD= 16384
##$TD0= 1
##$TE= 0
##$TE2= 300
##$TE3= 300
##$TEG= 300
##$TL= (0..7)
0 120 120 120 120 120 120 120 
##$TP= (0..7)
150 150 150 150 150 150 150 150 
##$TP07= 0
##$TPNAME0= <>
##$TPNAME1= <>
##$TPNAME2= <>
##$TPNAME3= <>
##$TPNAME4= <>
##$TPNAME5= <>
##$TPNAME6= <>
##$TPNAME7= <>
##$TPOAL= (0..7)
0.5 0.5 0.5 0.5 0.5 0.5 0.5 0.5 
##$TPOFFS= (0..7)
0 0 0 0 0 0 0 0 
##$TUNHIN= 0
##$TUNHOUT= 0
##$TUNXOUT= 0
##$USERA1= <user>
##$USERA2= <user>
##$USERA3= <user>
##$USERA4= <user>
##$USERA5= <user>
##$V9= 5
##$VALIST= <valist>
##$VCLIST= <CCCCCCCCCCCCCCC>
##$VD= 0
##$VDLIST= <DDDDDDDDDDDDDDD>
##$VPLIST= <PPPPPPPPPPPPPPP>
##$VTLIST= <TTTTTTTTTTTTTTT>
##$WBST= 1024
##$WBSW= 4
##$XGAIN= (0..3)
0 0 0 0 
##$XL= 0
##$YL= 0
##$YMAX_a= 45297
##$YMIN_a= -56157
##$ZGOPTNS= <>
##$ZL1= 120
##$ZL2= 120
##$ZL3= 120
##$ZL4= 120
##$ABSF1= 10
##$ABSF2= 0
##$ABSG= 5
##$ABSL= 3
##$ALPHA= 0
##$AQORDER= 0
##$ASSFAC= 0
##$ASSFACI= 0
##$ASSFACX= 0
##$ASSWID= 0
##$AUNMP= <proc_1d>
##$AZFE= 0.1
##$AZFW= 0.1
##$BCFW= 1
##$BC_mod= 2
##$BYTORDP= 1
##$COROFFS= 0
##$CY= 11.3945322036743
##$DATMOD= 1
##$DC= 2
##$DFILT= <>
##$DTYPP= 0
##$F1P= 2.36226072786647
##$F2P= -0.459571619588291
##$FCOR= 0.5
##$FTSIZE= 0
##$FT_mod= 4
##$GAMMA= 1
##$GB= 0.15
##$INTBC= 1
##$INTSCL= 1
##$ISEN= 128
##$LB= 0.24
##$LEV0= 0
##$LPBIN= 0
##$MAXI= 10000
##$MC2= 0
##$MEAN= 0
##$ME_mod= 0
##$MI= 1.114404
##$NCOEF= 0
##$NC_proc= 0
##$NLEV= 6
##$NOISF1= 3.799351
##$NOISF2= 2.8
##$NSP= 1
##$NTH_PI= 0
##$NZP= 0
##$OFFSET= 15.70392
##$PC= 1
##$PHC0= -19277.35
##$PHC1= 17.40074
##$PH_mod= 1
##$PKNL= yes
##$PPARMOD= 0
##$PSCAL= 0
##$PSIGN= 0
##$REVERSE= no
##$SF= 200.130013532006
##$SI= 16384
##$SIGF1= 3
##$SIGF2= 2
##$SINO= 400
##$SIOLD= 16384
##$SREGLST= <1H.CDCl3>
##$SSB= 0
##$STSI= 0
##$STSR= 0
##$SW_p= 3612.71676300578
##$SYMM= 0
##$S_DEV= 0
##$TDeff= 0
##$TDoff= 0
##$TI= <>
##$TILT= no
##$TM1= 0
##$TM2= 0
##$TOPLEV= 0
##$USERP1= <user>
##$USERP2= <user>
##$USERP3= <user>
##$USERP4= <user>
##$USERP5= <user>
##$WDW= 1
##$XDIM= 8192
##$YMAX_p= 0
##$YMIN_p= 0
$$ End of Bruker specific parameters
$$ ---------------------------------
##NTUPLES= NMR FID
##VAR_NAME=  TIME,          FID/REAL,        FID/IMAG
##SYMBOL=    X,             R,               I
##VAR_TYPE=  INDEPENDENT,   DEPENDENT,       DEPENDENT
##VAR_FORM=  AFFN,          ASDF,            ASDF
##VAR_DIM=   8192,          8192,            8192
##UNITS=     SECONDS,       ARBITRARY UNITS, ARBITRARY UNITS
##FACTOR=    0.0002768,     1,               1
##FIRST=     0,             0,               0
##LAST=      2.2672688,     0,               0
##MIN=       0,             -56157,          0
##MAX=       2.2672688,     45297,           0
$$ Real data points
##PAGE= N=1
##DATA TABLE= (X++(R..R)), XYDATA
0 0 0 0 0 0 0 0 0 0 0 0 0 0 0 0 0 0 0 0 8 -8 8 -8 8 -8 16 -16 16 -24 24 -25 32 -35 40 -48 52 -56 64 -72 80
39 80 -91 103 -112 127 -139 153 -169 188 -207 228 -252 276 -305 337 -371 410 -453 503 -561 628
59 628 -707 802 -919 1066 -1258 1523 -1909 2531 -3702 6693 -32492 -56157 -25392 -41736
73 -41736 -40915 -28169 -18542 -21594 -7153 6095 10960 10471 19706 29240 34516 31994 36757 45297 42670
88 42670 30444 34019 41788 31217 15858 18802 20058 6917 -1480 420 -8421 -20978 -18463 -13534
102 -13534 -24502 -34987 -31209 -25813 -28772 -30122 -25014 -21327 -23495 -22361 -12210 -3439 -5215 -5616
116 -5616 4082 9403 6607 13205 24406 20187 12495 20877 29687 23242 16972 21076 21770 14360 11382
131 11382 14074 10663 1160 -2247 852 -2152 -11230 -13369 -10180 -14552 -21216 -17895 -13025 -18450 -23904
146 -23904 -17680 -10792 -13411 -14496 -7624 -4308 -6906 -2497 7144 7815 3098 6864 14934 15069 12235
161 12235 15511 18583 14334 11004 15079 16882 10119 5030 7241 6474 204 -1640 180 -4146 -10791
176 -10791 -9721 -6163 -9937 -15422 -13734 -10059 -12093 -13851 -9507 -6754 -10215 -9646 -2022 596 -2996
191 -2996 -1298 4668 4918 3141 7280 11743 8826 5566 9204 13000 10084 6763 8439 8878 4707 3250
207 3250 6011 4507 -1712 -2900 386 -1265 -6376 -6339 -4006 -6776 -10066 -7133 -4715 -8466 -10590 -6498
223 -6498 -4013 -6290 -5943 -2277 -1821 -3593 -857 3984 3718 1032 2878 7091 6968 5265 7361 9086
239 9086 6166 4804 8036 8537 4260 2378 4276 3176 -515 -792 367 -2548 -6241 -5074 -3176 -5671
255 -5671 -8491 -7090 -5595 -7156 -7305 -4471 -3819 -5849 -4667 -335 900 -880 237 3395 3639 2788
271 2788 5111 7361 5349 3484 5763 7589 5313 3683 4586 3979 1264 990 2549 920 -2766 -3055
287 -3055 -1320 -2236 -4285 -4001 -3420 -4855 -5559 -3479 -2500 -4214 -4718 -2530 -1145 -1925 -1435 501 437 -616
305 -616 873 3238 2631 1042 2197 3669 2947 2659 3954 3769 1821 1538 3452 3431 1302 498 1087 599
323 599 -578 -187 275 -1575 -3250 -2287 -1223 -2498 -3789 -3005 -2723 -3737 -3417 -1617 -1598 -2957 -2316 -234
341 -234 159 -512 355 1624 1412 1359 2937 3833 2706 2037 3147 3805 2937 2264 2545 1949 575 640 1361
360 1361 504 -1358 -1814 -1383 -1859 -2484 -2171 -2189 -3207 -3424 -2120 -1498 -2200 -2296 -1342 -878 -800 -48 830 534
380 534 247 1282 2188 2011 1366 1727 2060 1657 1540 2009 1753 622 338 1178 1020 64 -115 -6 -508 -997
400 -997 -448 -99 -831 -1554 -1177 -644 -924 -1249 -982 -1021 -1511 -1165 -451 -521 -1127 -972 -323 -79 -116 85 413
421 413 317 391 1020 1564 1251 1011 1369 1681 1478 1544 1569 1222 770 723 909 499 -64 -453 -538 -900 -1109 -1174 -1513
444 -1513 -1911 -1845 -1488 -1581 -1632 -1511 -1339 -1145 -689 -317 33 97 282 843 1420 1470 1416 1660 1628 1474 1640 1802
466 1802 1320 891 780 754 392 0 -322 -541 -892 -1035 -952 -979 -1312 -1451 -1162 -973 -957 -853 -766 -762 -496 -308
488 -308 -42 223 142 184 447 659 673 705 560 359 548 796 539 518 484 341 372 523 454 204 42 28 119 159
512 159 -36 -217 -227 -308 -430 -297 -333 -639 -787 -769 -607 -545 -686 -589 -587 -570 -346 80 -50 -189 141 422 529
535 529 688 775 607 824 1002 945 982 1005 529 360 588 377 -32 -9 -311 -732 -644 -556 -764 -974 -1026 -1053 -820
558 -820 -635 -565 -583 -389 -284 -67 289 406 426 431 660 802 894 799 586 488 536 517 429 198 41 -182 -322 -82
582 -82 -130 -460 -447 -418 -441 -292 -112 -199 -211 -119 -190 13 372 187 -113 91 258 -30 145 261 -74 -214 21
605 21 -64 -126 -88 -328 -305 37 -26 -132 36 133 -9 192 559 367 266 416 409 403 574 404 201 68 40 6 -34
630 -34 -135 -372 -495 -478 -576 -529 -537 -552 -631 -494 -223 -189 -168 101 219 133 419 601 539 493 645 685 542 496 453 358
656 358 289 -14 -60 -26 -304 -585 -427 -243 -637 -688 -282 -333 -558 -293 -16 -147 -209 33 278 313 208 269 415
679 415 403 153 365 534 148 -81 266 194 -209 -219 19 -111 -368 -217 -149 -203 -292 -108 32 36 -148 32 248
702 248 213 169 314 363 44 45 292 230 -126 -102 -59 -296 -389 -172 -164 -423 -411 -228 -179 -220 -124 44 133 67 242 463
728 463 472 200 338 653 503 182 346 327 -59 -110 143 -5 -455 -527 -311 -405 -528 -470 -247 -380 -485 -301 92
751 92 102 -59 49 341 313 265 490 504 223 247 482 421 82 -41 139 13 -113 -101 -88 -349 -470 -308 -121
774 -121 -280 -330 -184 -158 -172 -18 251 143 -31 62 365 390 202 233 269 86 21 218 152 -199 -286 -68 -73 -315
798 -315 -334 -95 -248 -432 -207 139 -7 -198 56 295 142 111 403 458 176 125 447 422 2 -59 154 70 -291
821 -291 -251 -90 -285 -546 -343 -75 -264 -450 -266 16 -158 -83 276 254 58 175 480 450 248 315 429 361
843 361 153 162 211 -6 -148 -64 -47 -261 -441 -290 -277 -362 -300 -145 -196 -304 -163 111 121 9 203 290 229 226 411
868 411 452 129 97 325 275 -5 -68 21 -136 -179 -149 -48 -309 -427 -297 -117 -94 -287 -107 19 42 75 221 306
892 306 112 77 296 366 170 125 147 27 -72 15 36 -200 -326 -307 -135 -176 -194 -198 -149 -165 -25 119 153 36 75 238
918 238 245 271 331 228 56 120 299 240 17 -92 -129 -129 -177 -117 -200 -299 -391 -263 -34 -26 -210 -144 -39 60 147 235 220
945 220 62 164 392 449 299 72 191 130 43 129 100 -171 -339 -222 -143 -187 -212 -258 -304 -220 -110 11 40 -27 -29
970 -29 131 330 336 199 229 247 208 295 286 185 -39 -43 -85 -1 -73 -188 -350 -396 -241 -151 -219 -156 -208 -218 18 166 207
997 207 79 183 110 251 445 266 187 200 177 47 129 109 -134 -219 -125 -63 -140 -199 -358 -352 -187 -120 -115 -11 -91 -196
1023 -196 43 260 271 190 90 243 254 213 229 208 96 -28 57 64 -46 -177 -295 -202 -154 -178 -201 -209 -264 -241 4 18
1049 18 -64 -68 38 99 227 262 220 173 137 122 221 239 52 -56 7 -56 -103 -97 -232 -296 -199 -179 -116 -62 -171 -168 -9 61
1077 61 61 180 202 122 124 315 238 176 185 61 56 110 59 -113 -162 -166 -149 -153 -165 -204 -298 -191 -94 -18 -30 -24 -40 68 186 185 157
1108 157 158 139 153 273 328 105 11 -75 -46 59 0 -158 -274 -243 -134 -222 -139 -105 -266 -268 -66 99 11 27 59 143
1134 143 265 337 249 273 120 31 173 297 67 -129 -29 -113 -117 -125 -83 -275 -400 -249 -96 -67 -122 -125 -3 20 103
1159 103 187 226 95 56 208 363 219 119 105 27 -45 51 94 -103 -256 -212 -129 -83 -192 -123 -224 -255 -132 57
1183 57 109 -71 -40 84 192 163 204 293 102 -29 243 341 94 -96 17 3 -76 2 -59 -207 -412 -278 14 5
1207 5 -217 -178 -14 -18 -137 168 378 5 -102 294 396 204 108 266 247 -46 7 268 44 -351 -208 15 -49
1230 -49 -321 -131 -86 -280 -308 17 176 -230 -183 179 211 36 180 336 191 -118 227 418 179 -160 82 161
1252 161 -105 -117 105 43 -435 -353 141 0 -380 -235 87 -52 -230 59 326 11 -181 170 438 42 -72
1273 -72 234 326 -83 -90 400 177 -413 -185 276 6 -428 -198 37 -277 -450 14 211 -164 -368 159 329
1294 329 -137 -97 349 313 -116 121 513 187 -212 11 379 -43 -334 73 151 -360 -455 93 146 -406 -364 84
1316 84 -19 -365 -34 395 15 -290 174 552 35 -120 350 470 -78 -138 407 210 -380 -190 361 131 -456
1337 -456 -268 185 -195 -566 -38 311 -317 -508 171 419 -143 -181 401 381 -175 -37 539 299 -311 21 535
1358 535 116 -382 97 335 -256 -463 119 192 -461 -539 178 137 -463 -281 345 123 -376 67 611 161 -325
1379 -325 166 544 13 -249 410 417 -300 -302 375 211 -490 -339 266 -43 -585 -92 310 -239 -636 130 548
1400 548 -222 -389 340 474 -191 -61 590 373 -356 -101 627 269 -422 -19 421 -202 -585 155 412 -413
1420 -413 -626 120 351 -400 -378 281 240 -469 -129 687 221 -470 16 680 129 -282 347 516 -219 -411 373
1441 373 459 -367 -446 313 155 -600 -252 348 -145 -716 -85 546 -86 -572 139 478 -129 -263 507 526 -333
1462 -333 -226 681 421 -422 -82 491 12 -577 57 503 -252 -654 -8 387 -290 -438 204 205 -436 -317 585
1483 585 299 -477 -77 598 185 -335 216 586 -109 -409 278 453 -356 -475 246 271 -485 -299 321 8
1503 8 -672 -205 481 47 -507 -21 545 -67 -359 413 547 -222 -265 511 439 -328 -145 406 100 -460 -46
1524 -46 384 -72 -663 -61 384 -270 -562 124 238 -375 -292 476 291 -414 -144 619 304 -269 123 610 35
1545 35 -423 227 531 -177 -493 244 302 -461 -471 325 131 -627 -230 394 78 -519 -55 488 1 -365 297
1566 297 540 -121 -253 410 550 -244 -227 366 241 -325 -153 361 -16 -657 -136 353 -184 -568 -10 266
1586 266 -334 -303 299 348 -310 -229 441 333 -223 -30 547 152 -290 223 551 -154 -458 215 362 -263 -420
1607 -420 176 203 -447 -279 204 58 -478 -213 347 10 -347 59 463 -16 -300 363 517 -158 -246 343 322
1628 322 -269 -166 349 65 -441 -145 354 -121 -564 -136 249 -131 -341 103 301 -230 -291 299 340 -189 -136
1649 -136 414 224 -207 61 379 -30 -361 55 288 -77 -364 87 215 -301 -304 193 67 -394 -198 262 62
1670 62 -356 13 349 -5 -196 199 435 -72 -173 307 321 -88 -249 221 161 -291 -184 275 -32 -407 -203
1691 -203 157 -93 -352 -29 176 -153 -177 238 322 -120 -188 292 265 -100 119 359 93 -208 61 302 10
1712 10 -309 -7 155 -165 -235 74 71 -326 -275 223 70 -254 -9 241 94 -109 84 364 -3 -163 179 272
1734 272 -37 -177 110 147 -141 -88 126 -37 -295 -158 153 -107 -206 -76 104 -127 -99 130 215 -37 -141 197
1756 197 244 -60 -22 223 96 -87 14 236 45 -182 -46 111 -116 -212 -26 -16 -155 -251 64 40 -167 -135
1778 -135 114 57 -61 46 200 115 -54 100 239 66 -66 114 76 -43 -71 79 -67 -176 -138 6 -72 -172
1800 -172 -133 51 -55 -104 46 114 -17 -26 177 146 -5 36 132 117 60 77 124 80 -90 -89 -2 -90 -101 -45 -23 -169 -185
1827 -185 2 36 -173 -74 66 93 -57 -38 139 94 -14 72 163 63 9 103 143 16 -95 87 91 -83 -79 -19 -67
1852 -67 -94 -94 -63 -32 -103 -72 21 -80 -23 95 83 45 19 95 155 54 29 100 75 -13 5 0 -23 -137 -26 -20 -79 -92 -103
1881 -103 12 -135 -91 -8 10 -45 -10 131 77 22 72 162 60 57 156 87 45 -35 6 -4 -22 -42 -21 -67 -102 -60 -62 -21 -127
1910 -127 -71 -13 9 42 58 110 75 30 79 147 108 28 105 86 79 51 60 25 -117 -3 -46 -45 -66 -94 -109 -63 -71 25 -54 -52 -42
1941 -42 42 43 28 62 98 75 69 105 73 39 47 28 70 -21 -39 -40 -80 -39 -124 -52 -103 -86 -29 -74 37 -28 -24 47 80 93 56 104
1973 104 82 110 129 50 33 8 9 -2 -36 -54 -54 -129 -48 -79 -76 -13 -55 -58 -12 -29 28 -19 16 44 9 62 80 100 60 69 35 25
2005 25 2 36 -12 22 57 -69 -25 -95 -78 -94 -11 -61 -22 3 -65 -16 27 11 6 32 49 76 14 70 120 54 44 -7 3 -30
2035 -30 11 -28 -41 -129 -85 -37 -82 -7 -40 -64 -35 -23 -13 -1 76 61 90 67 68 87 16 106 6 30 56 1 -47 -9 -42 6
2065 6 26 -48 -82 -82 -59 -14 -20 -59 -48 25 31 7 78 -7 72 1 48 69 108 -11 73 21 61 20 2 9 -42 -18 5 -60 -60 -36 17
2098 17 -26 -2 20 61 -64 7 -13 82 39 37 82 68 69 53 56 37 7 -81 -12 -24 -62 -21 -50 -41 -131 -15 -47 -105 -37 -22 -42
2129 -42 -9 56 42 21 46 57 35 114 4 69 58 23 43 7 84 -30 -41 -70 -10 -98 -95 -27 -28 -63 -4 6 -56 1 18 16 75
2160 75 78 37 35 45 15 53 79 12 1 6 -23 -38 -16 -16 -56 -85 -60 4 -42 -56 11 -52 -21 -3 37 74 34 78 21 57 64 61 67 72
2194 72 -27 57 25 18 -36 -21 -54 -61 -86 -110 -60 -42 16 -23 9 -24 0 66 93 30 102 33 40 25 77 58 -11 47 48 16 -100 4
2226 4 -23 -43 -111 -43 -32 -27 -8 -33 38 -63 -23 20 1 -50 12 16 91 57 116 11 50 29 41 17 -59 19 -60 45 -90 -46
2256 -46 -35 -13 -55 -40 -7 -18 -32 -21 -51 27 43 85 73 32 26 67 89 38 31 89 13 -4 -26 -61 -37 -90 -69 -32 -75 -127 -44
2287 -44 -5 -70 1 -56 28 7 10 106 58 48 -4 116 77 22 50 22 48 -4 -15 -5 -48 -48 -58 -90 -60 -46 -63 -24 -41 -2 -4
2318 -4 17 -4 32 51 30 67 67 37 83 44 38 41 10 -30 -7 42 -36 -78 -19 -21 -56 -33 -8 -15 -41 4 -56 60 54 88 40 1 68
2351 68 63 71 34 40 42 18 -32 -2 50 -57 -82 -8 30 -55 -3 -51 -30 -51 8 26 6 -37 -86 10 53 52 84 16 39 45 60 73 8
2384 8 -5 24 -41 -24 32 -28 -72 -92 -2 -36 -56 -20 -66 -19 7 -5 9 1 59 67 76 63 47 36 -32 -5 -7 -40 10 16 -60 -55 3 -49
2418 -49 -26 5 -51 -87 -32 -10 22 -60 -1 47 47 126 101 62 68 36 31 -5 -7 44 -9 -2 -28 -6 -55 -13 -55 -50 -23 -38 -23 -86 -40
2451 -40 17 -2 -25 4 -12 39 39 56 60 54 8 22 7 56 54 1 -16 4 -14 -50 -6 -51 -18 -82 10 -8 -8 -20 -25 56 14 27 64
2484 64 36 19 19 45 26 40 23 -21 14 -2 2 20 3 -44 -44 -47 -2 -41 -38 13 17 -12 -6 48 -11 -15 66 29 59 45 -18 55 53 63 9
2519 9 -67 -7 13 -15 24 -37 -27 -28 27 -44 53 -25 -48 -25 69 42 2 49 87 -12 69 34 -33 -14 53 69 50 34 -26 -31 9 12
2551 12 -9 -33 -71 -46 5 -31 20 7 -9 27 0 32 48 33 14 25 55 24 46 -3 4 47 48 82 5 -21 -57 -75 -20 -50 -35
2582 -35 -54 -41 -18 -19 18 -26 24 -11 27 55 62 -27 61 -9 31 21 -3 56 29 -29 -33 -18 34 87 -14 -35 -60 0 -62 -19 -28 -4
2614 -4 3 -36 4 39 47 16 71 69 28 21 8 75 -43 -3 30 -1 -43 -78 -25 -35 -71 -42 -52 -44 -19 -29 19 4 -22 -21 34 22 56
2647 56 44 -18 30 13 66 19 -21 -27 14 -39 2 16 -38 -51 -84 21 14 -68 5 -16 -33 11 -12 26 71 -46 50 120 -41 9
2677 9 8 38 13 -2 68 -22 -32 -10 49 9 3 -24 -3 -91 -9 24 28 -53 -76 36 77 -20 32 79 59 8 -7 75 13 -27 -17 -4
2709 -4 -45 5 5 24 -22 -73 -26 -45 -32 3 51 22 -14 -24 30 22 19 -19 34 44 -21 88 106 5 -1 125 33 -20 23 28 34 -67
2741 -67 -23 -5 -25 -65 -28 23 -52 -32 12 45 -31 -33 72 31 15 -12 84 30 -52 25 106 29 -62 18 7 -70 -38 -10 22 -76
2771 -76 -61 9 -7 -91 -18 65 7 -39 12 106 52 -47 -10 99 39 -15 60 110 -23 -24 20 5 -118 -78 -8 -16 -62 -71 101 -53
2801 -53 -100 55 46 -12 -51 68 154 -6 -11 122 37 -3 8 70 20 -69 -29 14 -56 -85 15 62 -67 -66 -2 41 -34 -11 37
2830 37 27 -99 11 109 20 -63 33 83 49 -10 25 58 12 -70 28 16 -43 -45 57 8 -84 -30 51 -45 -97 -17 55 16 -45
2859 -45 28 105 -59 43 123 52 -7 0 139 75 -47 -57 61 -56 -87 -56 13 -67 -77 30 54 -113 -88 25 68 -86
2885 -86 -3 96 30 -82 -12 66 -23 -84 -6 176 39 -57 18 75 -10 -58 41 16 -103 -83 64 14 -114 -59 109 -23
2911 -23 -92 28 168 -29 -44 13 107 -22 -22 71 85 -28 -47 44 33 -51 7 77 50 -162 25 47 -80 -129 -5 -9 -67
2938 -67 -33 49 90 -24 29 101 61 -41 -4 85 17 -38 23 123 -10 -80 17 8 -85 -47 -33 -6 -83 -9 63 -45 -62 -6
2966 -6 59 11 -96 2 97 -47 -50 63 75 -31 -62 109 30 -6 -55 74 -17 -74 23 58 -17 -77 -16 113 -51 -102 69
2993 69 43 -62 -38 99 49 -40 10 126 49 -49 9 92 -97 -71 -1 29 -50 -48 0 -11 -107 -47 84 7 -88 -3 120 -17
3021 -17 -81 21 68 64 -38 52 101 -13 -79 50 27 -107 -54 65 -14 -109 -14 53 -40 -83 24 76 -20 -46 36 86 -29
3048 -29 -96 48 102 -23 -38 41 59 -72 5 47 -8 -58 63 79 -76 -44 28 38 -41 -78 71 17 -41 -74 62 51 -61
3075 -61 10 78 -53 -83 104 105 10 -23 101 78 -50 -25 32 8 -49 9 24 -51 -129 -38 29 3 -56 -1 14 -49 -18 114
3103 114 76 13 25 25 90 1 -19 38 6 -74 -14 45 -74 -29 -7 88 -38 -43 17 61 -37 -54 31 -41 -63 -4 53 23 -36 9
3133 9 89 20 -33 -3 103 5 8 -21 120 -27 -32 51 21 -59 -52 84 -7 -77 -11 20 19 -67 25 66 -15 -25 93 65 -11 30
3163 30 40 40 13 -53 69 28 -102 -3 28 -18 -86 2 1 -58 -27 21 52 -16 -17 10 40 -76 18 61 -35 14 70 52 32 -27
3193 -27 56 58 -49 -36 -13 39 -75 11 -19 19 -56 -34 25 -19 -16 -9 17 14 -53 2 68 -13 -48 -4 36 3 -43 60 -25 -82 -42
3224 -42 45 -16 -42 0 41 -8 -23 41 -2 -3 -33 53 5 -29 -16 70 39 -45 25 76 40 -47 28 86 -8 -23 10 56 -82 -42
3254 -42 -10 -18 -65 -79 36 83 -19 -27 6 2 -30 58 112 -20 -28 61 64 -18 -39 6 40 -16 -12 -6 15 37 -20 -50 16 -39 -13 16
3286 16 -30 -5 40 4 -35 -6 5 26 -1 64 45 -1 -40 29 -14 -10 -18 -23 10 -29 15 2 -57 -15 -53 31 -25 -35 -28 -29 -29 4 -3 25
3320 25 8 -2 19 47 -57 25 -1 11 47 -9 20 40 -22 -6 3 -31 27 -9 -65 1 28 35 34 -31 -26 16 68 -24 29 49 40 -4
3352 -4 58 46 -20 -22 37 12 12 -3 5 19 10 -23 -3 -40 11 23 60 1 25 -67 26 76 1 6 -12 7 -11 0 9 73 20 -13 -5 -19
3386 -19 -27 19 -26 -47 -56 -8 -52 26 -27 -21 34 -29 -19 21 14 -5 10 -22 17 36 -9 49 100 9 -15 17 -19 -19 19 -52 0 19 -65
3419 -65 -2 -32 -6 -13 -47 -17 8 -7 1 5 45 6 64 -18 26 51 -15 -19 0 -11 -42 -35 -2 -43 -10 -7 44 16 -23 -13 -3 12 -12
3452 -12 17 -17 23 -12 28 -17 22 -57 16 4 62 -24 -73 -51 -52 -5 36 24 -3 -72 -69 8 10 52 -41 2 23 -6 -13 42 15 -30
3484 -30 -9 0 -3 40 33 52 8 18 -86 -5 14 -45 21 -11 8 -5 10 -41 16 -1 -2 9 -7 58 -1 34 32 17 -21 22 -20 -8
3516 -8 -12 4 40 -5 -40 -39 -41 -21 -41 -54 8 -19 -62 40 -22 10 23 34 -17 25 17 -21 16 -14 26 36 9 -17 5 -46 -13 -66
3548 -66 -20 -3 -38 -56 3 -42 -14 18 -38 48 -6 22 -16 -10 37 22 6 31 95 9 22 51 15 14 -24 -34 -53 -45 47 -20 -15 13
3580 13 3 13 -8 31 -26 11 11 23 -16 14 25 3 -2 8 23 20 -13 -40 -33 8 -13 -31 1 10 -30 31 -32 -19 25 -67 60 28
3612 28 -22 19 45 -13 -6 38 -58 35 16 5 28 55 -53 -25 -6 -40 19 -60 -3 -43 -52 -20 -51 0 -13 1 16 -34 12 14 -4
3643 -4 -45 -41 -10 51 15 47 20 -27 17 1 25 -11 2 -31 -22 -13 0 -30 -3 -14 -25 -9 -19 26 34 -26 -56 10 17 -45 4 -48 30
3676 30 30 -55 -20 0 17 14 6 -41 -6 0 -9 -16 -12 -4 12 -46 25 -49 23 20 15 -12 58 -2 35 -9 -5 53 -43 21 3 -9 74 -3 0 3 -43
3713 -43 51 0 -35 -70 1 -19 -20 -50 -28 -42 -1 18 -17 -3 14 21 35 51 -31 20 18 26 38 -19 13 21 -2 46 -33 -33 34 2 20
3746 20 26 -13 3 94 -26 57 29 42 -2 46 -8 56 50 30 -2 -38 9 5 -2 -10 -2 42 -47 28 -51 6 -27 -42 51 16 18 1 75
3779 75 34 -26 21 24 -28 -28 58 66 46 1 -8 49 -27 5 0 -5 -55 8 -13 7 12 32 28 53 55 -26 1 5 8 38 -6 15 30 0 35 -91
3815 -91 -32 -12 29 -11 82 34 44 -28 4 -57 -29 70 48 35 11 17 46 -16 -34 -49 36 -2 -8 32 -7 13 -32 -18 -3 -30 22
3846 22 8 -35 -9 -66 -16 -40 -11 -21 2 -2 -73 -3 35 39 -4 5 -13 42 14 -29 83 33 33 -12 23 -14 -41 -12 20 40 -23 35
3878 35 -4 -2 -14 -6 10 -10 1 41 -27 28 0 3 -12 -73 52 10 29 -31 -6 10 -42 38 -20 -44 28 52 -5 -25 -2 5 -55 22
3910 22 18 -18 12 18 -9 7 -14 -3 45 -48 -5 22 16 -27 -3 17 -16 47 7 -39 -9 28 -60 -8 -42 -39 38 6 -12 14 10 -42 1
3943 1 20 -8 12 47 35 1 13 5 -14 -27 13 2 51 -19 7 -8 -49 -4 -58 -9 -21 -10 27 -4 18 2 -18 -19 -4 16 -9 16
3975 16 -2 -14 17 12 57 -38 -35 -17 -26 11 -14 -50 -19 2 -16 22 -10 33 55 4 7 27 11 50 18 -14 48 50 51 -13 9 27 -39
4008 -39 17 4 29 -34 -66 -46 -12 8 10 -25 -9 19 56 0 -19 18 19 42 -27 67 -11 -16 -10 -34 33 -11 -17 -7 7 20 23 0 -5 60
4042 60 14 -33 -22 57 -17 16 6 24 34 37 5 -29 -50 -33 9 -14 59 -17 -36 -35 48 2 -32 4 -4 4 -47 27 -32 -1 14 38
4074 38 40 55 29 9 3 6 -12 34 6 25 23 56 -1 -8 13 15 -23 2 2 -40 -21 -19 20 -60 -17 24 -4 -10 53 -23 33 -15 36 18 73
4109 73 27 14 53 -25 -20 27 22 32 -2 18 -41 -9 49 -15 16 30 13 73 34 -44 4 34 15 -49 20 29 -2 42 10 -9 39 3
4141 3 -49 -15 -12 -55 -34 16 47 -23 -30 -52 -9 38 -30 45 6 22 31 6 47 3 45 -13 -45 41 9 -3 49 24 26 19 -30 41 5
4174 5 -34 4 -38 11 -63 12 -81 -20 -13 7 58 0 -24 -31 56 39 37 86 20 36 -2 61 -10 -14 7 3 -40 7 -14 -40 -8 10 -11
4207 -11 64 65 45 36 -33 -19 -15 27 37 -15 4 51 -19 -54 14 -18 -52 -10 -52 8 -37 -36 8 -42 16 5 83 -7 -53 -3 67 -21
4239 -21 -31 47 -24 -31 -57 42 46 9 -5 47 57 8 -46 -23 2 -33 12 -24 -1 -56 10 48 -22 -13 -27 28 -11 -11 71 -9 8 27
4271 27 45 -23 -37 -42 38 -42 -19 -33 72 -16 -25 40 -7 13 39 -6 21 -28 -24 20 26 7 -9 106 4 -13 22 -7 -45 -49 13
4302 13 -1 -11 -35 -53 5 11 -17 -37 -8 -24 -7 58 -14 -6 39 42 -44 -52 0 20 -8 -35 8 117 -37 -41 52 -4 -41 19 64 56
4334 56 -10 12 45 -7 6 60 66 32 -21 22 19 73 6 70 14 -12 23 -15 16 -22 16 4 13 -42 1 7 -13 -3 65 14 -28 -2
4366 -2 27 -10 -71 4 47 -13 11 40 8 46 -12 50 57 -11 -14 13 -1 -50 -4 7 1 -54 18 17 -6 -24 12 12 -9 -29 59 -48 -31
4399 -31 -9 41 62 -49 30 32 -10 -35 71 -14 -37 -32 73 17 -26 24 33 22 -57 24 37 9 -18 12 21 -35 -6 18 73 -28
4429 -28 8 12 11 -69 58 4 -25 -22 0 47 25 -40 35 34 -20 -46 -13 62 12 -3 80 -24 9 10 -14 26 -20 54 42 36 20 35
4461 35 47 -14 17 -7 46 -20 -38 22 8 14 -63 35 -38 -66 -48 51 -14 -37 9 -4 5 -74 -21 54 -59 -71 29 55 -13 30
4491 30 20 -5 12 11 29 74 -24 18 40 -44 15 43 58 -1 33 24 -7 0 15 21 39 6 -6 4 11 -9 -24 15 -58 11 51 21 -25
4524 -25 -37 89 20 -38 -61 82 -34 -35 15 52 -39 -32 56 32 -15 -4 38 13 -2 -38 62 33 -16 -22 77 -13 31 -13 9 -58
4554 -58 0 30 1 -59 5 2 -20 -4 -31 -16 -25 -5 5 76 43 -43 -13 14 -11 28 5 85 -37 21 14 28 6 8 7 11 -89 -27
4586 -27 17 -16 9 -6 25 -3 2 52 16 -44 -12 -49 3 11 16 52 5 -14 16 49 -16 -35 -27 -22 -46 -7 -6 24 0 5 70 65 11 24
4620 24 24 23 -50 -6 49 29 24 -19 -13 -42 5 -1 17 -19 -27 23 -9 11 -2 45 47 -7 1 42 31 -41 -11 4 39 -39 -10 30 21 -64 6
4655 6 35 -9 -4 -5 4 -6 -40 10 -36 -51 35 14 -14 14 71 -9 -29 21 43 -25 -1 12 -7 -12 -27 48 18 -38 -13 1 31 -24 0
4688 0 -36 -20 23 -27 55 26 -27 22 -22 -4 -22 -15 7 -12 -46 -1 -16 -48 -8 90 43 -39 9 14 -35 -9 55 10 22 -20 -7 -8
4720 -8 10 -10 34 12 -5 -40 -59 19 -21 -5 -14 -46 -46 9 13 -21 -4 -39 37 -26 -29 -35 0 -46 -37 41 31 50 -14 -44 4 -17 -1 55
4754 55 6 -76 -6 19 23 -32 -7 -22 10 -21 59 20 24 -7 -18 7 -38 18 -26 32 -37 44 -1 21 -18 36 19 5 -51 -7 -18
4785 -18 -30 25 28 41 -17 32 25 -23 18 11 56 4 16 12 33 51 29 11 -11 35 35 -19 6 16 28 10 32 -17 -49 39 13 21 13 -54
4819 -54 -7 -20 -6 -59 -15 28 7 -12 -6 26 21 -14 -37 49 -1 -9 37 8 -11 13 -7 24 -18 1 -10 51 -17 0 -32 -7 15 10
4851 10 -18 -12 -39 -34 -22 -1 -14 24 32 6 34 -52 3 -53 -13 21 5 -29 30 7 31 -3 -16 -24 -16 18 21 16 32 46 16 -55 -18 -17
4885 -17 -38 56 51 17 59 11 6 -12 -1 -32 37 -10 -23 -21 -3 43 -18 16 21 25 -29 -9 -32 2 12 13 5 -43 23 14 37 22 63 -4
4919 -4 10 -4 2 -3 3 1 6 36 50 25 24 -14 -34 -32 5 -4 -38 -43 -8 -2 -35 16 -48 -22 -17 14 41 32 -12 -4 26 9 20 -28 10 3 28 50
4957 50 11 -22 -16 -10 30 -8 28 23 3 -21 34 -20 7 104 27 -19 -13 -17 46 15 0 9 12 8 -17 -2 -8 -11 -30 51 -16 -41 30 16 -4
4992 -4 17 25 32 5 73 5 2 -11 55 -24 -11 6 -3 -9 49 30 -8 16 -27 -39 52 63 7 30 -63 12 -16 -10 15 -3 -50 -31 53 20
5026 20 16 -15 3 11 2 31 12 -18 -52 -10 -16 -97 -1 -33 34 9 -27 -9 -23 6 7 -4 -6 59 -19 26 9 47 6 -24 20 6 -30
5059 -30 27 39 49 -11 14 0 24 -50 28 -53 -9 -58 -42 9 5 -17 -3 -22 11 20 59 0 15 49 27 -30 -5 35 -10 2 -21
5090 -21 -45 17 3 -35 -15 -7 47 0 49 -9 39 20 -6 -8 -74 12 9 38 10 22 -6 -80 -40 31 -6 -31 -11 3 -2 1 -5 27 -21
5123 -21 21 3 -4 -64 -8 24 7 20 -3 16 51 35 -2 27 27 80 33 26 -15 -37 37 -9 76 -7 6 -3 38 -61 -48 74 -6 -9
5155 -9 -9 30 27 20 -48 -13 -12 -7 44 8 21 -9 -33 -44 -17 52 -25 -22 -38 54 -10 35 -42 0 3 39 -37 -45 55 34 38 -6 10 -43 -3
5190 -3 6 -6 59 -49 -43 -17 12 -18 18 -11 1 -2 -10 22 -21 50 -4 -42 12 6 -4 2 -31 3 53 32 2 28 75 44 27 35 -2 42
5224 42 29 30 -2 41 19 16 -8 -39 20 35 38 8 65 32 31 50 -5 25 -7 27 48 -16 26 22 -7 24 -15 45 -13 13 7 -31 -20
5257 -20 -25 6 -20 12 72 -33 21 44 -5 19 16 25 -30 -23 -31 -21 28 -7 -21 1 19 -20 5 -4 16 -32 -50 -34 -33 -36 30 42 -10 -10
5291 -10 8 66 -15 39 -26 -15 43 88 16 -10 28 8 64 -17 -2 -8 12 -51 11 -18 -29 38 -24 -7 -35 -6 45 -42 -10 -63 41
5322 41 9 44 -17 20 21 -19 -28 -21 -9 1 -14 35 -22 -6 25 7 -8 -25 3 52 25 48 30 10 22 35 6 11 47 4 23 27 9
5355 9 9 14 45 -28 8 -41 -18 -40 -17 -49 -10 -66 -4 -25 23 47 9 -31 -64 -54 19 38 24 -27 -27 49 -34 -25 1 -3 -28 -16 -43
5388 -43 -15 -45 -17 33 37 20 -16 12 8 -28 -37 -25 5 7 76 -30 -10 -14 9 -10 -35 -11 14 4 -2 -6 -56 3 10 -14 7 -17 -28 -9
5422 -9 -25 52 -52 29 21 22 33 -2 10 -4 -19 -8 -35 23 26 -3 31 -14 5 -30 -11 4 0 -32 -40 -57 -2 -20 -50 -9 -18 35 -14
5455 -14 -38 -25 26 14 -2 47 71 -35 19 -19 -46 7 -21 -26 -27 23 -27 -40 -29 12 36 14 6 33 12 9 17 29 -6 4 -13 27
5487 27 -14 0 -23 -9 -7 -46 4 42 -90 5 10 12 -42 -17 -47 -7 -49 6 -18 30 0 -37 -8 -21 -51 52 -24 7 4 24 82
5518 82 -13 -11 -29 21 -20 12 -23 13 39 -12 2 28 -46 17 -19 12 4 15 16 0 5 39 6 36 29 -31 -67 6 46 -4 -53 33 -1
5551 -1 -79 -35 25 49 17 -17 -7 17 5 35 36 11 -3 -2 24 65 17 27 -25 -25 -22 -39 -23 24 20 -74 -44 -26 -24 17 -16 -8 -17 8 11
5586 11 3 -18 32 13 -46 -25 -6 53 -24 -23 26 -5 33 -40 -32 -23 40 0 -33 36 1 12 -13 15 -19 -59 37 -30 -14 8 -57 35
5618 35 21 34 14 41 -8 16 -10 3 -10 -24 -36 39 -7 -24 -40 18 -33 28 -11 10 14 -5 11 -20 -6 -56 31 2 38 0 -24
5649 -24 98 12 0 -3 20 -3 -17 -35 -28 -33 32 14 -45 -34 10 45 -9 -16 -36 -36 27 -24 -48 -28 58 0 -22 -28 20 33 33 -20 13
5682 13 20 8 35 1 -10 -4 29 23 -42 -13 6 -6 11 29 28 22 -6 1 -29 -1 -37 21 14 -11 13 -25 23 11 41 -10 12 9 5 -15 -1
5717 -1 1 79 -35 42 -33 -9 77 4 -18 -31 9 41 25 -50 -5 -22 63 1 -39 88 -18 -19 -54 -17 21 26 -7 12 -12 -36 36
5748 36 -34 -40 -68 9 -46 16 33 2 2 17 -23 -21 -10 -4 31 20 -25 -8 11 0 -14 -22 34 58 22 -12 23 81 -9 20 35 -18 73
5781 73 22 5 -35 -14 47 15 -30 -4 25 23 -31 5 -67 13 -74 10 -2 1 -5 59 32 -52 7 69 -16 47 -16 -3 -20 11 -6 -26
5813 -26 -8 1 1 -43 -15 11 82 -9 -11 -114 -24 -10 26 20 -25 -40 11 39 20 5 0 6 -37 32 -19 23 -18 -44 -58 55 -12 -31
5845 -31 8 2 19 -17 -16 -5 14 6 25 11 -5 -19 76 38 -14 8 84 -11 -53 4 24 -37 79 26 5 -9 -8 -35 -14 -64 4 7
5877 7 -9 3 3 -7 -78 -28 -16 28 -44 -25 31 38 24 -11 -31 -20 -8 62 36 -24 -8 -1 -10 -50 -2 -64 -44 -25 -16 10 14 -15 -4 23
5911 23 -12 -47 -21 47 -5 17 -42 55 -8 42 -10 -9 33 -41 -5 9 1 12 -52 46 -20 -22 37 18 -28 30 -46 -33 -17 15 1 -29
5943 -29 -18 -3 -7 -18 22 3 46 -31 -15 6 14 -31 32 -7 29 -59 22 -40 -34 -20 -21 34 -27 -13 -48 41 1 31 -12 18 16 24 26 36
5977 36 0 -19 -11 -18 -1 30 -7 -57 35 -17 5 -18 44 -34 44 48 27 -33 -11 45 9 16 24 1 -19 -12 37 -17 10 -46 -35 37 7
6010 7 -29 -61 49 -46 -32 -21 -19 -24 25 48 90 -41 -40 30 -18 -35 -17 -21 -7 5 3 38 5 -58 17 -57 -73 15 -8 49 -30 -7
6042 -7 47 -23 -77 -21 4 37 12 -28 -10 69 -10 -11 7 48 11 -8 38 16 -18 -38 32 25 -11 -14 46 -4 46 38 -18 -10 3 -18 88
6075 88 8 15 21 18 -18 -8 5 -35 38 18 -23 -21 -39 29 -32 -29 20 58 -30 3 32 -6 54 -12 25 1 5 -18 12 -3 -21 -11 75
6108 75 -17 -3 -5 21 23 31 -17 25 10 -18 82 23 0 -60 -26 -16 -36 -22 -4 -23 12 -3 -21 22 -27 51 63 59 18 -10 6 6
6140 6 -22 -16 27 -7 -27 -12 -8 -44 -14 -37 -13 -16 19 -17 -28 56 29 34 46 -34 -57 5 -18 -28 -10 -27 -10 -2 21 -19 -22 10 -80 -14
6174 -14 16 -31 12 -10 7 33 63 7 -15 -5 29 -27 55 11 35 -9 24 3 -4 37 -22 10 1 -4 -22 19 -12 46 17 -62 -41 6
6206 6 -50 19 -37 -21 37 -14 -41 -65 -18 24 -26 -11 15 -20 14 -22 8 2 8 -5 22 -20 50 6 9 26 -40 -10 24 -37 18 -2
6238 -2 -4 3 -31 6 11 6 21 19 -4 2 -4 28 37 30 -3 -48 -15 -21 -34 -6 -11 5 -1 15 8 11 30 19 27 -45 -32 5 25 12 2 10 -26 -23 3
6277 3 -28 -8 -21 40 27 -16 -30 1 6 21 -29 -36 -4 -54 -20 13 -12 30 -12 -16 11 -14 64 12 51 9 -42 13 6 53 54 -67 4
6310 4 -34 24 57 22 58 -19 -7 35 -4 2 16 61 6 -8 31 31 -4 -16 10 -38 -26 11 -21 9 -35 29 -10 10 -27 8 -21 26
6342 26 -24 35 -41 30 42 31 -18 1 -15 -34 -5 13 -13 -18 -26 -1 23 22 5 18 -14 1 27 -42 20 5 9 -36 46 -24 -13 -31
6374 -31 -5 -21 21 -1 -11 -16 -1 -15 -40 43 6 -4 4 16 -13 12 -4 23 10 -24 -17 13 -3 64 55 -36 -38 3 10 -29 18 -3 -25
6407 -25 20 8 -6 20 -16 -31 24 -14 -6 -39 46 -21 5 -39 -18 13 -59 17 -2 1 0 7 -38 -4 55 53 -2 -34 -17 -26 23 2 -20
6440 -20 25 -36 -43 12 -35 9 -67 61 -9 -24 16 -81 -16 12 39 -22 -39 5 18 39 15 13 -54 8 6 40 -24 29 -35 -1 2 -35
6472 -35 18 -29 36 -25 62 40 4 32 8 2 -26 -5 14 -20 30 -10 3 -22 -49 -20 -6 17 -4 -32 -42 -42 -25 -21 41 29 -36 -41
6504 -41 -39 3 -37 -11 2 41 -33 -6 -3 -41 39 13 52 -1 9 25 41 -20 8 18 46 -16 -4 10 -10 47 7 -18 -17 -2 31 41
6536 41 33 -5 -9 12 -8 68 62 -33 -3 -13 29 2 14 8 -7 -18 -13 23 -9 18 -2 35 27 7 -19 2 19 12 -53 38 5 -3 16 34
6570 34 -44 9 68 -53 28 -54 -5 33 45 -18 26 -11 15 -9 17 -19 10 1 14 20 -32 -20 3 53 16 18 33 5 25 18 16 12 33
6603 33 -8 48 -15 19 8 -41 2 8 -36 5 33 55 -20 -17 -17 41 41 13 -14 18 75 22 6 -38 15 2 -50 10 32 -22 -18 5 -5
6636 -5 -52 1 14 21 47 18 -24 10 32 9 36 -14 -14 -63 -1 11 -4 15 -11 -51 -26 55 -10 -19 27 11 -10 18 -18 -4 25 22 25
6669 25 -7 -19 18 37 -2 -19 34 55 20 24 22 38 11 -14 18 -1 -51 -1 30 -47 8 -45 -36 1 26 1 21 -11 66 48 43 38 14
6702 14 9 58 0 -36 -13 -15 30 -19 -57 -77 -37 -37 12 -51 -5 10 -31 9 27 -25 0 14 11 -41 -15 -17 -68 -32 15 -44 1 32 33
6735 33 -26 36 -41 40 -52 3 3 -29 28 10 0 5 37 -17 6 17 -32 1 4 -14 -56 16 6 -23 23 23 14 -32 57 -38 32 -14 34
6768 34 37 -42 -20 -16 -13 -37 -21 -9 -14 -1 23 -2 -45 16 -6 -33 12 -9 27 -9 -9 11 -8 13 12 37 16 -27 -24 0 -13 2 12 -47
6802 -47 69 7 -1 2 -47 41 7 -20 22 -49 40 -2 43 5 -24 -12 80 3 -3 -41 40 -40 11 -29 -25 5 -35 46 37 -32 -23 9 15
6835 15 2 -17 50 -23 0 30 -13 27 -3 -14 20 -9 7 20 -25 7 -2 -4 -28 5 88 73 -4 -12 -16 12 17 20 -31 0 14 -49 17
6868 17 21 -41 -14 3 13 17 39 -38 10 4 -31 -8 6 49 12 -22 41 -1 -28 49 22 7 17 56 -2 4 22 37 -6 -36 1 1 -7
6901 -7 -26 12 -22 65 14 -22 18 19 -33 13 -10 30 32 39 -3 17 33 66 -6 10 -17 52 -57 -7 -45 -10 48 16 -28 58 40 -39
6933 -39 1 -15 69 46 12 -13 81 -33 46 54 63 18 2 10 -3 70 9 -16 57 13 29 -24 3 59 -4 -37 11 -32 6 -2 -13 34
6965 34 -1 39 13 14 -1 8 0 5 6 -6 -5 -1 -29 -52 -17 -14 41 -31 18 4 13 -15 8 59 61 -16 19 24 7 6 -42 16 -11 11 43 6
7001 6 2 23 46 -50 -16 10 35 12 1 -18 -93 9 -55 40 -92 22 -11 -23 12 43 -27 -44 31 11 58 -30 -5 -14 46 48 15
7032 15 -26 1 -4 -18 11 33 16 18 -23 42 -6 -34 -1 42 14 31 20 -8 37 6 67 10 13 9 -24 -11 -20 -4 -10 17 -54 -10 1
7065 1 -26 -66 21 -70 -45 27 9 1 11 60 -27 -4 4 25 21 8 -13 30 -2 -9 6 -54 76 -41 -36 10 22 0 -13 -15 1 18 10
7098 10 6 26 11 -32 6 16 58 34 -23 6 25 -32 -20 61 53 44 1 -25 21 33 -40 38 15 9 -18 15 -20 -4 20 34 6 -8
7130 -8 -32 9 10 2 -1 -51 11 -14 5 18 9 -21 21 -8 -10 -27 -13 -37 15 -57 52 16 -33 32 39 -51 -22 -6 -18 35 47 -10 17
7163 17 -22 -26 40 -17 -28 -31 -20 -5 30 -54 -5 -62 -71 16 37 12 -63 -14 -17 41 28 40 42 -1 -7 -13 -14 50 3 40 -3 4 12 20 44 -39
7199 -39 6 10 19 -34 3 75 51 -8 3 61 4 -12 -1 -45 25 -2 51 -28 -46 54 -11 10 2 -4 -9 -41 -48 5 27 -14 -23 10 -24
7232 -24 -16 -7 40 14 4 -2 -15 22 45 14 18 12 2 12 29 -24 -52 22 20 1 35 61 14 -31 -66 5 -21 -18 47 26 -39 -7 16 26
7266 26 31 5 19 2 -37 -10 29 71 -12 -2 1 -17 9 6 18 18 1 -32 36 -26 26 -19 106 -11 33 50 6 -33 36 6 4 16
7298 16 10 49 18 -4 -13 -22 -78 -39 25 -55 -6 2 10 -9 -47 3 -31 16 -28 42 53 -7 27 -1 0 36 4 25 -17 14 -5 49 -1
7331 -1 -7 9 -12 12 -50 6 4 17 0 48 37 18 44 10 8 -14 -15 -22 16 -10 6 50 -11 7 50 -57 -29 -12 56 14 -7 18 -38
7364 -38 18 -21 16 0 37 -9 -26 17 -9 1 -17 -13 -6 -64 8 -7 10 -5 -2 4 -67 -27 29 -12 -93 -4 -4 21 5 29 -1 -25 -3
7397 -3 12 -4 -23 30 29 2 -32 6 -2 35 -51 -50 28 -45 28 -8 23 21 -29 20 -28 -66 -5 47 -13 -14 31 2 8 12 11 49 16 -39 10
7432 10 -5 12 -43 -15 21 -37 -18 30 49 28 -13 46 -27 -43 48 -3 -17 2 31 20 60 -1 66 77 11 66 30 -46 -20 61
7462 61 24 3 -4 0 34 -10 15 -47 3 -47 4 33 -11 41 25 11 -8 -15 -27 13 4 -47 43 22 18 23 25 -10 -18 -27 -5 -34 -35 -40 13 -57
7498 -57 11 32 5 11 -17 11 12 8 -20 6 22 -19 2 9 9 79 28 48 -3 21 -6 41 -8 48 -36 -10 -25 -10 44 21 40 -37 -11
7531 -11 -24 5 23 55 55 20 63 17 42 29 -10 18 28 -85 -25 22 -30 -19 24 -47 -15 17 56 50 -43 22 1 7 6 -10 28 -11
7563 -11 -9 -2 50 3 0 -25 18 -37 -3 0 -2 -4 12 15 10 32 53 -5 11 -26 10 32 -37 -3 3 37 15 -9 43 15 -5 -15 78 -14 18
7598 18 50 -55 9 -10 -6 32 -42 -19 -28 -35 -40 -7 59 -10 -19 45 11 -35 -17 81 9 13 30 41 11 23 38 -15 -9 -53 34 -1 -42
7631 -42 -2 25 39 26 -10 25 0 -6 33 -18 6 -4 23 -22 -10 0 -28 6 8 12 -13 -18 -2 -7 -14 33 -21 -24 -19 -30 18 -6 20 14 -6
7666 -6 19 -24 33 22 -19 80 2 9 18 39 5 10 27 54 34 -29 65 17 -25 0 28 -27 9 34 -69 -18 -27 36 -12 14 -22 31
7698 31 9 48 95 43 72 52 32 30 38 15 8 5 42 28 20 1 -1 19 -2 64 19 -46 8 0 -18 33 -6 11 6 -37 62 13 23 1
7732 1 -25 32 9 -6 1 0 17 29 -19 -21 22 6 -62 6 -3 -41 10 3 -18 -10 -20 36 -7 0 -10 5 -3 -14 17 -29 30 26 10 37 -103
7767 -103 27 45 -7 9 12 -46 34 22 -17 -21 44 12 -37 -38 -2 74 34 7 -50 17 -16 30 59 -56 4 -31 -23 20 -44 -18 -29
7798 -29 -22 -42 43 17 49 20 -55 53 28 -10 22 -19 -19 -5 26 -20 -54 -15 -7 -8 -20 -31 -27 12 -23 6 -28 14 20 -45 -34 14 44
7831 44 58 39 14 -20 32 -43 -32 -37 68 31 -3 27 -30 11 -72 -30 0 17 -25 10 30 8 8 9 57 47 50 14 -10 68 4 28
7863 28 -9 58 39 -6 24 13 -57 -66 -1 -10 38 3 49 -15 30 34 -10 20 1 -5 46 15 36 51 21 58 11 36 21 7 28 -14
7895 -14 -6 1 28 18 -8 -26 -44 57 -7 27 -1 -19 -22 39 19 18 6 6 -9 17 -50 -4 5 35 -7 44 -6 50 14 13 29 -15 -19 14
7929 14 18 39 15 -18 -15 -33 21 24 -7 3 -13 -54 20 25 6 24 -16 21 -13 9 29 -26 -1 21 21 -35 3 -48 -6 56 0 2 -8
7962 -8 -19 -2 8 -12 22 18 -28 29 75 39 24 16 27 6 -8 4 -59 44 -27 -36 -3 -51 24 -22 -26 -44 -43 40 30 42 -17 52 -13
7995 -13 -15 2 29 69 -44 -3 17 11 20 -31 -51 -19 14 16 -42 34 -15 25 49 -59 6 2 -6 34 -58 -25 33 3 19 -2 -25 -11
8027 -11 -32 36 -63 6 -23 -11 -6 4 -15 20 -2 -2 -61 -15 19 -6 -6 -1 4 -21 13 28 34 68 -9 -24 -10 -12 12 18 -21 31 14 -40
8061 -40 15 12 3 -27 4 -28 -20 9 9 40 38 -46 22 -21 -26 5 10 64 24 -1 -11 -52 -9 7 3 -17 -55 23 -11 -36 3 -2 26 45 -21
8096 -21 22 -56 -3 9 2 -1 35 10 -18 2 21 -12 -68 -29 6 7 -14 32 35 10 -29 21 30 17 8 15 41 -8 29 -13 -7 -32 -17 -35
8130 -35 23 62 33 -20 20 30 -12 8 0 -37 3 19 8 -44 33 25 -2 -92 -49 -27 -6 -14 -27 -18 -10 -9 -34 -55 18 -58 -1 -6 -36 -26
8164 -26 -9 -29 -32 46 37 42 -42 -16 -46 38 -12 -32 -14 52 -44 -7 51 -64 29 5 32 1 49 28 25 -7 4
8191D
$$ Imaginary data points
##PAGE= N=2
##DATA TABLE= (X++(I..I)), XYDATA
0 0 0 0 0 0 0 0 0 0 0 0 0 0 0 0 0 0 0 0 0 0 0 0 0 0 0 0 0 0 0 0 0 0 0 0 0 2 -4 6 -6 6 -6 6 -7 7 -7 8 -10 13 -14 14 -14
51 -14 15 -19 21 -22 24 -28 30 -35 40 -47 56 -65 81 -104 141 -211 359 -817 4467 26780 15471 6509
73 6509 22756 30479 24438 29613 38406 33666 26235 27919 31225 27743 19654 16472 18570 11574 -2648
88 -2648 -3252 3131 -7467 -22699 -18898 -13218 -23614 -30540 -24398 -25594 -32902 -26650 -16924 -22663 -28573
103 -28573 -18479 -7277 -7220 -7203 44 5715 5618 7917 17382 24116 20265 17037 24082 27979 22036 22154
119 22154 27997 20680 8851 12957 18584 7926 -2981 -1175 -990 -9750 -14262 -11912 -14451 -22213
133 -22213 -23449 -17729 -17509 -23344 -22092 -14593 -13924 -16626 -10382 -2212 -4058 -6517 2115 11025 8880
148 8880 6753 13197 16764 13199 14680 21111 18894 10866 11664 17140 13970 6921 6534 7419 1764 -3393
164 -3393 -1129 -395 -7664 -12915 -9799 -8622 -13633 -14704 -11036 -12467 -16368 -12956 -6975 -8406 -11684
179 -11684 -7498 -1291 -1330 -2319 2574 6436 4100 4537 11465 13603 8755 8684 13770 13010 8988 10462 12577
196 12577 7826 2713 4651 6724 1843 -3506 -2921 -2547 -6894 -9037 -6517 -7521 -12717 -12822 -7975 -7900
212 -7900 -11664 -10111 -5317 -5561 -7014 -2757 1526 -383 -1221 4126 7648 5522 5223 8845 9300 6780
228 6780 7907 10973 8935 4316 4471 7110 5138 1147 1121 1629 -1982 -4342 -2111 -1911 -6252 -7942
244 -7942 -5081 -4850 -7538 -6948 -4291 -5223 -7114 -4524 -1108 -2362 -4172 -1450 1457 628 422 3230
260 3230 3991 2037 2717 6226 6439 3490 3418 5784 5241 3157 3972 5128 2491 -51 1678 3007 129
277 129 -2289 -1384 -1420 -3746 -3971 -2282 -3443 -6276 -5811 -3154 -3354 -5126 -4404 -2724 -3173 -3312 -837 657
295 657 -594 -704 2041 3702 2860 2990 4651 4679 3423 4267 5929 4612 2453 2856 3894 2452 992
312 992 1216 469 -1929 -2571 -1170 -1587 -4082 -4803 -3650 -3464 -4174 -3570 -2717 -3456 -4084 -2204 -220 -831
330 -831 -1462 68 1330 952 1373 3100 3074 1669 2008 3769 3581 2109 2083 2824 2139 1156 1829 1973 219
349 219 -954 -20 470 -757 -1661 -1271 -1414 -2277 -2005 -1049 -1494 -2880 -2606 -1385 -1338 -1762 -1219 -878 -1381
368 -1381 -1260 170 831 -8 -236 862 1488 1238 1659 2226 1869 1393 2167 2800 2174 1251 1398 1727 1129
387 1129 660 779 375 -840 -1241 -602 -857 -2053 -2400 -2064 -2344 -2653 -2027 -1564 -1995 -2285 -1413 -430 -454 -433
407 -433 228 721 755 1313 2163 2117 1541 1703 2331 2301 1720 1422 1349 941 487 602 576 -352 -955 -826 -760 -1180
429 -1180 -1359 -1270 -1523 -1706 -1341 -896 -929 -1056 -887 -445 -225 -106 93 143 127 355 812 766 510 495 536 574 676
452 676 693 513 297 189 397 527 361 60 147 172 19 204 409 1 -271 -60 70 -114 -339 -478 -563 -610
474 -610 -729 -537 -527 -865 -947 -620 -465 -550 -427 -370 -279 -16 281 496 637 538 629 983 1110 988 988 839 602
497 602 773 839 426 111 29 -120 -314 -383 -534 -869 -932 -967 -807 -732 -865 -916 -678 -563 -398 -43 73 -64 -31
520 -31 271 485 723 532 496 597 563 592 687 436 56 162 303 129 -16 -86 -242 -170 -77 -95 -265 -196 -299 -309
544 -309 68 124 -233 -111 -65 -298 -76 231 -35 -350 -302 -310 -285 -113 -246 -431 -375 -279 -183 44 114 -10 82 321
568 321 500 528 586 450 504 658 749 621 364 327 109 79 192 -8 -455 -687 -571 -658 -702 -570 -789 -935 -695
591 -695 -617 -468 -86 -129 -338 53 404 368 520 782 641 487 878 875 610 666 460 263 438 234 -191 -184 -166
614 -166 -501 -515 -353 -613 -833 -548 -486 -533 -334 -253 -348 -186 80 210 257 324 242 411 406 399 355 366 181 30 79
639 79 124 -51 -136 -77 -164 -319 -237 -54 -145 -220 3 155 0 61 178 236 264 164 157 290 143 -77 59 181 -273
664 -273 -414 -94 -236 -559 -325 -147 -378 -565 -232 -112 -61 -120 -7 248 302 190 335 617 428 226 553
685 553 592 218 164 372 204 -154 -183 -91 -282 -453 -424 -360 -472 -638 -458 -377 -298 -309 -120 17 -133 -52 382 451
709 451 248 247 494 425 264 472 492 195 66 223 108 -81 -187 -130 -276 -399 -334 -205 -201 -438 -310 58 74
732 74 -209 -26 237 57 30 463 368 43 3 327 316 14 -17 81 -121 -276 -172 23 -162 -436 -300 -62 -105
755 -105 -152 8 42 -22 -2 317 416 143 107 357 397 177 232 258 18 -122 61 35 -205 -340 -317 -334 -375 -346 -185
780 -185 -296 -486 -344 107 94 -84 -5 187 126 251 466 516 261 253 465 448 161 58 162 39 -277 -185 -14
803 -14 -297 -588 -416 -166 -306 -456 -268 -50 -240 -175 173 272 40 80 471 453 189 246 447 244 -8 174
825 174 326 53 -248 -234 -48 -252 -346 -210 -228 -449 -385 -39 -6 -192 -188 98 183 77 168 314 201 162 317 345
849 345 100 1 182 203 -45 -100 -67 -137 -327 -228 -40 -206 -427 -273 -93 -162 -155 49 155 16 -27 294 337 135
873 135 204 325 278 182 166 239 37 -162 -137 50 -96 -351 -326 -247 -319 -329 -141 -184 -288 -209 50 189 57 93 116
898 116 252 234 339 367 235 42 203 210 110 25 -97 -129 -183 -190 -169 -215 -357 -348 -162 -96 -128 -109 -36 -101 63 287
924 287 286 116 99 217 252 253 239 117 -59 -94 51 109 -37 -243 -257 -272 -207 -97 -166 -191 -265 -194 26 145 57 -93
950 -93 69 187 190 296 322 173 18 244 252 128 11 -165 -151 -126 -134 -157 -273 -385 -382 -232 -128 -140 -181 -153 -25 117
976 117 177 255 200 145 311 388 384 293 197 42 61 161 110 -56 -214 -282 -330 -214 -115 -360 -404 -268 -260 -126 -10 -7 -141
1003 -141 43 180 175 324 315 177 112 269 311 226 86 2 -74 19 -13 -101 -177 -218 -326 -269 -49 -100 -290 -247 -49 -14
1029 -14 20 133 138 -18 119 295 305 222 112 102 184 224 47 -24 -21 -139 -178 -107 -108 -280 -290 -259 -160 -119 -46 -118 -76 -34
1057 -34 83 242 249 113 71 239 283 202 191 83 -18 13 57 -44 -101 -218 -232 -164 -128 -244 -211 -181 -250 -42 65
1082 65 18 -3 -12 14 121 290 230 85 119 200 170 211 125 -6 -111 -61 -79 -43 -123 -277 -293 -143 -88 -147 -224 -181 -136
1109 -136 -11 134 126 56 27 186 199 272 242 227 -1 103 161 70 -21 13 -146 -271 -128 -54 -236 -302 -272 -220 -84
1134 -84 -33 -120 -32 -97 -29 180 345 153 19 172 247 189 237 162 23 -128 -61 25 -35 -198 -279 -211 -161 -205 -170 -127
1160 -127 -249 -227 1 123 50 -64 91 169 116 251 255 165 -23 62 220 159 9 -28 -104 -189 -160 -28 -49 -374 -348
1185 -348 -162 -130 -150 -146 -11 -58 -127 225 291 92 -6 228 260 146 210 223 113 -35 -15 208 98 -297 -235 -90
1209 -90 -160 -345 -121 24 -323 -334 -38 172 -49 -88 114 152 49 135 416 217 -46 113 363 216 -114 32
1231 32 96 -68 -193 10 10 -368 -435 -75 -18 -217 -190 43 -116 -244 63 335 94 -144 200 382 162 52
1253 52 249 221 -108 -77 321 219 -293 -219 97 -81 -332 -100 99 -259 -440 20 180 -121 -315 90 231
1274 231 -78 -48 379 334 -153 -27 490 226 -205 13 272 -59 -338 87 256 -300 -523 -23 85 -356 -343
1295 -343 75 32 -331 -186 344 147 -227 83 451 206 -86 234 471 -22 -176 375 326 -221 -278 119 73
1316 73 -339 -250 113 -149 -503 -186 282 -147 -415 60 344 -112 -165 367 340 -175 -105 510 314 -230 -66 457
1338 457 48 -375 68 386 -187 -636 33 304 -361 -518 80 168 -376 -254 320 149 -429 -29 520 233
1358 233 -226 125 519 13 -271 281 478 -228 -350 263 314 -415 -344 207 -42 -593 -250 356 -80 -583 -77
1379 -77 384 -127 -361 266 424 -189 -200 516 462 -288 -106 461 240 -392 -57 441 -118 -638 -9 381 -303
1400 -303 -623 20 257 -398 -353 400 178 -503 -185 597 300 -353 1 647 109 -308 270 583 -175 -500
1420 -500 266 415 -353 -445 229 74 -602 -344 396 -18 -696 -247 477 29 -497 91 495 -121 -363 488
1440 488 580 -219 -298 462 423 -355 -163 443 30 -599 -68 452 -188 -709 -117 347 -303 -527 252 352 -496
1461 -496 -378 566 433 -385 -157 606 219 -315 187 671 17 -494 205 592 -196 -525 160 248 -511 -419 354
1482 354 170 -625 -308 490 125 -509 -6 464 -113 -393 369 637 -257 -365 447 476 -236 -243 458 147 -546
1503 -546 -158 497 22 -675 -164 443 -211 -595 176 356 -366 -430 394 408 -359 -190 484 308 -311 80 492
1524 492 102 -448 81 606 -138 -523 138 287 -461 -466 302 145 -608 -387 385 197 -471 -99 472 14 -399
1545 -399 228 618 -98 -384 369 508 -174 -299 407 264 -459 -230 467 99 -617 -239 327 -75 -570 -17
1565 -17 312 -280 -455 250 439 -282 -333 362 451 -222 -53 512 171 -376 57 580 -21 -455 104 347 -258
1586 -258 -489 97 178 -468 -455 290 160 -402 -289 291 34 -426 116 529 -46 -379 288 569 -102 -275 434
1607 434 423 -251 -236 316 159 -462 -253 360 -1 -545 -159 306 -189 -421 138 340 -239 -286 328 380 -182
1628 -182 -185 373 276 -241 13 476 73 -382 -12 328 -47 -415 -11 165 -313 -403 149 147 -383 -296 310 182
1650 182 -258 -55 356 67 -250 226 416 32 -283 179 298 -166 -174 256 119 -345 -313 252 20 -410 -173
1671 -173 244 -130 -359 -8 267 -184 -310 207 353 -107 -109 336 274 -90 -40 361 150 -240 -48 265 -3
1692 -3 -313 -15 161 -220 -354 86 148 -308 -306 182 97 -216 -85 269 85 -145 85 394 119 -214 120 284
1714 284 -43 -225 133 198 -315 -216 130 29 -340 -238 36 -21 -277 -80 122 -103 -300 49 252 -47 -83
1735 -83 223 269 -104 -5 270 119 -247 -66 255 -3 -197 -2 145 -124 -267 10 131 -166 -289 -13 115
1756 115 -158 -138 107 54 -105 36 304 91 -66 114 254 138 -77 165 175 -87 -135 53 91 -178 -155 6
1778 6 -32 -207 -123 44 -28 -212 -18 119 -6 -107 90 191 72 30 167 166 -28 -45 203 71 -147 -60 90
1801 90 -31 -275 -69 -69 -198 -171 -77 -17 -156 -104 91 78 -73 18 223 90 7 90 228 48 -35 66 185 0
1825 0 -24 47 11 -133 -93 16 -14 -188 -170 -11 -53 -123 20 70 -46 -84 69 131 65 30 149 136 -4 36 68 72 -16
1852 -16 -19 9 -12 -131 -89 -27 -36 -155 -46 -40 -139 -157 23 3 -96 68 68 100 24 49 138 74 -38 67 107 13 -41 -11 -30
1881 -30 -52 -66 -65 -75 -169 -148 -60 -26 -147 -121 0 -19 -67 64 101 20 46 79 114 117 29 82 43 -37 26 39 -49 -126 -113 -56
1911 -56 -84 -84 -116 -136 -59 -51 -18 8 -72 22 7 55 57 104 88 90 98 85 120 -3 21 2 -9 -78 -51 19 -21 -80 -91 -69 -15 -62
1943 -62 -41 3 2 -50 3 46 44 64 77 127 76 89 71 115 62 56 44 8 13 -20 -48 -86 -49 -91 -65 -83 -118 -112 -36 -65 -67 -27 13
1976 13 9 46 63 73 91 67 103 14 76 69 8 -11 -11 9 -47 -53 -16 -68 -67 -39 -70 -26 -60 -9 3 15 7 31 28 80 33 -8 75 57
2010 57 28 78 42 -7 40 20 -4 -31 -94 -35 -79 -55 -82 -67 -18 -18 -40 19 84 12 -29 101 47 78 67 87 6 -3 54 -14 -52
2041 -52 41 8 -26 -11 -96 -92 7 -26 -33 -92 -62 0 -3 26 17 23 14 90 40 104 68 80 30 38 101 -33 13 -42 53 23 -33 -86 -32
2074 -32 -92 3 -91 -61 -96 -30 -30 22 36 36 11 53 52 69 26 0 53 16 1 49 1 5 -81 -72 -78 -123 -14 -98 -129 -14 0 -52
2106 -52 -38 10 26 -7 57 64 38 37 66 30 57 58 83 36 89 0 5 -1 -107 -117 -84 -34 -69 -57 -50 -45 -99 -13 -31 -27 -27 36 -4 71
2140 71 52 52 89 87 21 76 20 45 10 59 -76 -29 -43 2 -50 -91 -1 -23 -43 -79 -75 -23 -34 9 43 44 31 15 88 47 35 9
2172 9 59 31 -68 24 23 -41 -5 -33 -105 -61 -132 -40 -42 -73 -87 3 -45 -66 -6 72 3 17 94 70 57 43 98 76 -16 -14 31 21
2204 21 -5 -54 1 -28 -55 -85 -19 -94 -103 -45 -3 -62 -56 41 11 34 14 20 77 39 80 68 14 -4 27 40 -5 -29 -33 13 -65 -66 -48
2237 -48 10 -41 -85 -53 -10 -63 19 35 2 -1 -13 82 95 56 73 41 61 27 16 11 10 -19 5 -47 -56 -92 6 -138 -69 -97 -30 -26
2269 -26 -56 -31 7 -23 -26 66 53 51 43 73 33 38 38 -10 -27 -13 2 4 -66 -68 -40 -53 -69 -95 4 47 -34 -32 25 12 19 9 51 49 12
2304 12 47 63 6 2 52 54 -29 -10 35 -34 -93 -94 -16 -51 -69 -92 13 -34 -41 -32 50 -2 35 49 81 44 47 62 81 30 -16 90
2336 90 24 -71 -43 33 -40 -43 -33 -45 -65 -32 -7 -107 -64 -13 -24 -32 -23 -12 38 2 45 44 43 25 18 90 3 -55 -12 -8 -9 -4 -30 1
2370 1 -67 -34 -77 -34 -55 -28 -60 -36 1 3 84 76 57 -8 89 40 51 31 75 3 56 51 31 -22 -22 -61 -90 -54 -58 -98 -41 -35 -69 -29
2404 -29 -27 -2 -66 -5 15 55 46 100 66 -13 36 -13 5 61 34 7 -40 -2 -1 -57 -17 -56 -50 -27 -43 -13 -60 -64 -57 -37 -7 9 -5
2437 -5 5 -14 29 38 21 23 7 4 71 10 -31 -6 -27 -19 -107 -36 -15 -23 -52 -57 50 2 -6 10 1 56 46 44 -11 -25 72 43 7 3 -8
2472 -8 -12 -57 -10 -47 -82 -4 3 -79 -81 -19 -48 1 -24 -34 -26 -14 5 -34 13 42 3 -22 45 69 26 27 34 16 3 -20 -2 22 -52 -68
2506 -68 -40 16 -48 31 -25 -8 32 -9 41 -9 49 -36 35 93 46 41 -2 49 21 -8 58 -10 -6 -6 -4 0 15 -50 -81 -54 -15 -72 -64
2539 -64 3 -18 -41 -11 57 91 69 40 38 70 36 58 21 6 -5 -4 -45 -17 -66 -89 -127 -54 13 11 -39 -85 -43 -3 42 6 1 -3 61
2572 61 21 88 66 23 -17 31 41 31 1 -74 -9 -35 -56 -26 -32 -22 -8 -34 -20 44 -39 -38 -28 -3 -15 45 61 15 69 22 36
2603 36 35 32 -51 -53 -19 6 -34 -25 -67 -93 -56 -60 -11 -30 -52 -47 -5 31 -58 -14 8 24 44 18 19 24 -25 19 63 26 -6 -3 -10 -16 -75 46
2639 46 -34 -68 -73 -16 -9 -25 -13 -38 22 -53 -18 76 35 16 -8 45 32 35 70 61 -12 -34 89 -28 -27 0 -22 -4 -40 -58 -34 -63
2671 -63 -74 1 20 -15 -55 65 87 4 -3 25 59 18 -4 27 33 31 18 -31 -16 -56 7 9 -63 -106 -10 2 -69 -55 13 -8 -62 -17
2703 -17 42 -32 -13 21 61 6 9 42 40 35 -2 0 27 -81 -53 -31 31 -126 -54 -29 -28 -70 -13 -24 -63 -41 7 46 -43 -52 41 61
2735 61 -47 1 34 56 -13 6 46 19 -8 -21 59 -58 -122 -19 34 -49 -48 21 10 -8 -28 73 43 -42 37 96 -9 -14 15
2764 15 67 -23 -25 11 84 -4 -31 26 -39 -127 -67 3 -1 -86 -53 18 -57 -122 -3 107 6 -74 38 65 13 -48 103 65 6
2793 6 38 56 25 -86 -90 4 8 -84 -19 -10 -51 -98 -9 18 -97 -77 66 33 -79 -9 52 29 -58 6 81 -30 -70 9 84 -5
2823 -5 -55 -7 18 -40 -48 -3 28 -76 44 56 -3 -93 -31 29 -51 -21 -21 58 3 -42 63 -10 -67 -23 38 6 -90 -13 94 17
2853 17 -90 -23 58 -27 -49 -35 7 -1 -88 53 26 -30 -26 24 73 12 -9 49 69 -39 -11 78 23 -85 45 124 -49 -103
2881 -103 54 31 -87 3 61 2 -148 -48 25 28 -102 -10 81 23 -96 30 100 -19 -61 27 75 -57 -97 48 -43
2906 -43 -106 -74 46 -62 -83 8 37 -45 -114 26 11 -49 -98 63 101 -41 -22 113 21 -55 -10 122 41 -86 7 90
2932 90 -33 -156 3 6 -50 -84 19 -63 -80 -36 58 10 -87 -21 76 -40 -95 5 145 -52 -53 44 74 9 31 33 12 -80
2960 -80 11 46 5 -69 -53 114 -17 -113 -45 81 -49 -157 62 83 2 -56 89 23 -42 23 83 57 -70 -25 60 -5
2986 -5 -70 -10 105 -75 -47 3 54 -79 -180 57 41 -107 -100 78 21 -44 -26 72 60 -76 19 82 -12 -23 97 55 -43
3013 -43 -90 62 25 -67 -81 48 -27 -130 -13 36 7 -60 99 3 -39 -71 51 15 -32 -34 81 32 -94 -55 79 12
3039 12 -93 -24 8 -12 -48 27 2 -19 -64 25 74 -81 -26 55 72 -33 6 100 -38 -71 52 127 -21 -87 40 46 -111
3066 -111 -117 61 -1 -100 -122 4 16 -113 -74 65 -34 -36 -41 20 13 -34 42 67 -16 -43 55 48 -33 -39 60 28 -45 5 88 -15
3096 -15 -66 24 8 -78 -107 18 11 -50 -65 57 4 14 -19 86 23 -36 7 32 38 -75 52 32 -3 -52 61 6 -72 -39
3124 -39 5 -20 -57 -22 36 22 -52 16 4 -35 -60 13 63 26 -25 39 94 -60 -51 64 49 -65 37 41 40 -45 13 -9 -49 -92
3154 -92 -3 21 -50 -52 -11 41 -28 -37 97 20 -64 -32 36 25 -24 53 48 -12 -56 97 76 -11 -38 -16 30 -63 -44 12 -34 -62 -30
3185 -30 20 3 -71 -30 56 17 -11 63 57 -17 -38 45 23 -30 0 -21 -8 -54 -74 -17 -55 -60 -22 -3 -58 -82 7 32 -48 -22 59
3216 59 51 14 0 43 21 12 35 31 -46 -31 32 65 -68 17 35 -29 -29 -67 -23 -8 -85 -31 36 -35 -13 -60 31 13 -11 41 -32 11
3248 11 -9 -14 63 -13 6 9 6 -60 -44 -15 -10 -86 -29 -29 -10 -26 -26 -12 -7 -16 38 8 6 -10 27 12 -16 -1 112 69 -1 -35 -10 -9 -21
3283 -21 13 36 -53 7 4 24 -26 -22 25 32 -1 7 -25 -20 28 1 20 6 38 28 7 30 32 29 -2 -13 13 11 -22 -10 8 70 -62 17
3317 17 -47 -7 -70 -42 27 12 14 -37 1 17 -31 30 96 42 -19 -10 11 1 -21 -19 19 17 -20 -41 -72 -50 -43 -4 10 -28 -16 -11 -30
3350 -30 -54 -25 8 -15 -14 26 -6 3 2 -35 51 34 -22 3 2 -33 -57 -12 -3 -29 -27 -25 -21 -7 -21 -10 -28 -3 -6 -3 114 17 44 32 -43
3385 -43 21 33 11 6 67 42 -11 -38 -25 24 -24 -46 -8 16 -36 25 11 -32 -10 18 1 1 -12 8 27 14 39 -2 -1 30 -4 53
3417 53 0 50 -46 -4 -3 -28 -70 -16 16 -14 -59 21 -1 46 -51 23 52 6 12 42 44 -20 -29 34 -21 -45 -20 4 14 -52 7 -40
3449 -40 -68 -26 -11 -88 -27 -109 13 -58 -2 -19 -29 8 56 58 -14 -50 8 26 -11 46 -27 -11 -7 5 25 31 -7 -36 -43 17 12 -6
3481 -6 25 -9 5 -25 2 34 -18 55 -20 -26 -20 12 -4 -39 -30 4 -3 -6 18 3 22 6 2 -19 -30 6 -53 -22 -61 -24 -2 8 25 -43
3515 -43 -10 25 60 -24 33 10 3 0 56 12 -37 4 10 -46 -25 -36 -2 -12 8 -7 -8 -14 19 17 -63 -16 47 -2 -19 26 37 -1 2 -3
3549 -3 -2 -4 4 9 -23 -29 10 -15 -18 -20 8 -28 -5 48 -30 -47 -38 11 -24 -25 28 13 -4 -3 -56 25 -10 -49 27 18 -46 -42 -32 -27 -40 -33 -65 -63
3587 -63 -21 18 5 -42 -26 -34 1 17 42 7 -36 52 -6 18 28 -27 40 -7 25 22 1 31 -3 -16 -6 -9 -37 -28 18 -10 3 6 4
3620 4 2 7 54 0 -5 8 -5 -16 37 39 -36 -6 -20 7 -28 23 -47 -6 18 -43 7 -38 -23 -6 -9 -2 14 -16 22 -27 12 -15 -31 19
3654 19 36 48 37 -26 -14 7 -12 50 -39 -42 -104 -70 -14 40 -7 -59 -37 4 -12 -37 5 -11 50 43 21 5 -11 15 32 26 -19 -34
3686 -34 8 9 22 5 -10 -52 8 -35 -9 -10 -63 -5 35 -54 49 8 22 -18 -8 -8 15 -12 -5 49 21 -7 8 4 21 -22 -26 31 -13
3719 -13 -72 24 0 0 43 4 -19 8 49 24 18 -2 12 16 16 41 26 -6 -7 -16 -36 20 -17 11 -57 -55 -41 -37 12 52 12 -44 -66 19
3753 19 11 3 -18 -38 -25 40 -21 21 25 -6 41 39 18 42 -11 -11 18 17 22 -12 -13 -32 -14 -37 15 -43 -11 -12 6 -2 -12 8 -28 -16 45
3788 45 12 -38 -23 10 39 -10 -9 -33 -60 0 -57 -61 -43 -13 -32 -22 -17 -69 4 12 21 80 -7 -17 23 72 31 39 45 22 -12 13 -13 44
3822 44 -30 27 -58 -62 -14 -40 -15 -71 -20 15 20 -6 -17 33 21 48 39 18 15 -54 65 36 -7 54 18 19 -7 35 -20 34 31 -50 -21
3855 -21 -16 28 0 -30 -45 -22 -8 17 30 -13 -16 -19 46 47 -28 -7 -30 19 -8 0 -24 -57 -37 19 4 -7 -28 -24 -27 23 -61 13 19 15 18
3890 18 -25 30 65 71 51 45 41 58 26 -3 55 5 -7 -18 -3 -15 -25 23 -5 -34 7 -18 -1 -54 -40 -34 -28 8 -21 41 -32 14 27
3923 27 19 -25 -7 8 57 9 49 2 -17 -18 5 -5 48 -15 -10 -20 14 31 10 42 35 -3 60 0 2 39 20 11 -19 -5 20 15 -19 19
3957 19 3 -18 -19 -14 -26 -11 -24 -5 -12 -15 -43 15 -43 22 -7 -1 10 4 44 30 -17 60 20 63 33 2 -21 -9 -20 13 14 -11 7 44
3991 44 -26 6 -23 4 -40 -25 -34 -33 1 -15 7 -74 -17 -26 8 16 60 30 56 33 31 1 18 -23 8 -26 5 -36 58 -29 4 -28 -5
4024 -5 56 1 12 16 40 26 35 -4 -51 -52 -34 -45 -34 70 36 -52 23 -2 35 19 12 10 50 -14 55 1 12 23 -61 25 17 -1 35
4057 35 -14 29 -11 35 2 -42 7 49 -23 13 -8 -16 15 61 -49 6 -65 -30 -44 22 15 18 -21 -43 -25 -34 -8 -45 6 -110 -41
4088 -41 -18 28 43 -4 -24 17 -10 3 13 -2 -4 -10 64 -6 2 9 20 -20 -14 31 -72 46 60 14 10 -19 24 35 5 -33 -12 3
4120 3 10 16 -43 -26 -51 -16 35 -19 1 42 -13 27 -34 3 -18 31 20 23 2 -8 -48 11 37 -14 -41 -18 13 -14 -68 27 18 10 -27
4153 -27 -22 -13 -30 -51 50 -76 -14 -42 -7 -55 1 39 -42 -40 -25 -6 -23 31 -1 37 -9 -44 -25 -55 -33 -5 10 -24 -11 11 -6
4184 -6 37 7 10 0 1 45 35 16 -3 36 12 -2 2 -30 13 -9 -36 3 8 -17 -18 -11 4 -13 -50 0 -29 10 -26 12 -15 -2 -22 -4
4218 -4 -17 -72 -12 8 15 -12 102 -1 15 -37 79 -19 -28 22 4 19 -25 54 20 -12 -12 -34 14 -46 20 3 51 20 -13 51 35
4249 35 -22 -35 26 14 -40 -21 62 22 -54 -10 9 -32 -35 28 1 -20 -10 36 41 -62 -23 4 -6 3 42 66 58 -46 37 103 2
4280 2 -58 12 33 13 -45 6 -47 -21 -64 -8 -38 -21 9 24 30 1 6 37 -32 -60 7 30 52 0 24 30 -27 7 81 -19 -26 2
4312 2 9 52 -52 24 -1 -73 -19 -18 15 26 -29 55 -25 2 24 16 -6 -41 15 29 0 -6 -20 -10 -47 16 -11 7 -30 -60 -21 -9
4344 -9 -35 30 -2 -29 -5 -8 3 12 -49 39 27 -20 -6 25 24 24 -19 -22 -11 -52 -19 -29 -5 -57 10 11 46 -15 47 -10 -53 -13 34 -33
4378 -33 -21 -22 14 0 -7 1 32 33 -47 -23 69 19 52 -14 42 -50 -26 33 -27 -51 6 27 -6 -47 9 39 -5 8 58 27 10 -74
4410 -74 41 3 -82 -21 45 -27 -48 37 -8 -11 -26 -65 11 -14 -51 18 10 3 -24 -28 80 -64 -26 24 16 -29 -11 -15 -9 21 80 41
4442 41 28 -5 -37 50 -71 -27 10 29 -48 -32 13 61 -41 19 58 3 -37 13 4 -13 -32 83 17 10 -35 10 16 -32 -22 34
4472 34 9 -51 -43 31 -20 -12 -1 20 -8 -18 22 36 -64 -42 52 9 31 -13 71 7 -32 -21 -7 69 10 -9 28 -59 -30 17 -4
4503 -4 -66 -61 -11 15 -93 -53 25 -33 -56 -18 7 -9 -49 9 3 -7 -29 -5 34 -16 -8 43 13 -16 -29 1 -11 20 -36 71 -23
4534 -23 -26 -26 4 -61 -30 -44 55 53 -49 0 11 -19 65 -15 8 -8 42 4 3 -12 -39 -1 12 17 -25 16 -6 -65 46 11 4 63
4566 63 76 1 -19 42 56 -8 31 -13 10 -16 -9 46 39 19 -17 -17 -33 -61 -32 46 1 -40 -16 -16 6 21 -5 6 -12 14 -17 19
4598 19 24 39 35 45 7 -5 26 21 -8 18 -15 -26 13 19 13 -2 -32 14 -69 -5 -20 10 -60 -36 1 4 -28 -54 57 29 37 -6 4
4631 4 26 -26 -82 36 -59 -28 10 12 1 -67 -24 56 25 16 -17 20 -26 3 34 -13 -11 -14 38 50 21 6 29 11 -25 -11 10 -27
4663 -27 3 -9 -33 3 30 -8 -43 11 -44 -3 -17 -56 -15 11 -17 -30 25 13 5 -25 -29 23 -14 -11 -2 -42 -18 21 35 12 -37 -32 4
4696 4 -23 5 26 3 2 -25 0 4 -37 -6 -4 48 -41 17 9 23 -6 -12 -25 37 -32 -25 -22 -23 -9 3 -6 -52 -3 35 -13 -29 9 2 50 -51
4732 -51 -2 24 -8 27 9 14 12 10 12 50 -16 -55 29 -37 -41 -38 11 -45 24 -26 -9 -12 6 -48 -12 -15 -30 -17 53 -27 43 29 -17 -47
4766 -47 14 10 13 5 -18 13 -8 18 7 -30 -34 -13 2 43 -45 -13 -7 -10 -15 -13 -2 -1 35 3 -31 -66 37 -8 -21 38 -25 -49 -13 -20 -55
4801 -55 44 8 23 -32 -17 24 6 60 4 20 30 -27 27 16 14 -1 42 0 0 39 11 -5 -32 46 8 22 -5 -13 -23 -34 -24 -4
4833 -4 7 23 2 14 -15 18 -9 -6 24 -31 -3 37 -15 -17 21 -43 13 -27 49 -13 15 -41 -1 0 -46 -1 -30 -93 39 -22 15 10
4865 10 -3 51 -23 -21 49 -39 -14 27 -60 22 -77 -9 -18 -15 -13 -67 -5 -20 -10 -32 -5 40 -19 -10 19 34 -32 -37 20 7 -21 0 -48
4898 -48 4 -1 -5 5 35 18 47 12 10 -69 -37 42 -22 -32 -3 -26 -75 44 17 37 -49 -33 41 -30 -21 42 -24 8 12 32 15 10 -3
4931 -3 -34 -26 -33 -33 -51 -55 8 -42 27 -39 -24 32 9 -7 -42 -42 14 18 -11 8 18 8 -44 44 -29 40 -33 -3 55 -54 -14 -31 4
4964 4 -18 1 -35 -5 -9 -26 -9 16 -28 -13 -10 -4 -16 69 33 16 -10 -17 10 -3 28 27 26 22 3 30 -25 -8 -37 36 12 -2 -7 17 -7
4999 -7 -14 71 -33 3 5 -9 37 -14 -32 18 45 35 -26 -34 -23 -44 -1 -37 -48 12 -1 -23 -51 -16 -32 17 0 -64 4 -13 33 15
5031 15 20 51 -5 -5 -31 -46 -5 -32 12 -2 -3 26 3 18 -14 23 -35 -42 4 13 -37 -13 -25 -34 15 -15 11 16 9 2 -6 -56 7 16 -40 -6
5067 -6 -67 9 32 -33 17 -6 9 -33 -7 1 34 20 62 -34 -35 -34 8 32 -65 -35 -19 20 -14 -27 3 -6 9 60 -39 -58 20 -11 -8
5100 -8 35 -35 22 20 16 -50 -20 -22 18 43 40 37 21 -20 -29 -10 43 -9 -38 18 -15 3 -18 2 30 16 16 49 -64 -5 37 -29 -26 -7
5134 -7 12 11 -13 -37 2 24 2 0 24 -5 13 1 13 -31 1 -39 -22 -6 51 25 45 18 -38 -29 -15 -45 -43 -26 -14 26 5 70 -7
5167 -7 37 -45 59 -27 -8 14 29 -26 -22 18 -7 -60 -56 -83 -45 -12 -13 -31 -6 20 -62 -4 33 14 -66 14 -3 56 38 30 14 13 69
5200 69 26 48 9 -51 -26 -77 26 35 1 2 -35 -26 -2 -1 -15 11 -10 8 -8 23 -12 33 1 -68 31 2 4 46 -8 -16 2 -24 -46
5233 -46 -91 9 17 -50 -8 -20 17 10 41 -14 5 10 28 0 39 10 53 -9 28 39 -5 21 -6 41 -30 -33 -26 33 5 -13 -20 -50 -7
5266 -7 -19 -6 3 -20 -50 2 6 -8 35 18 -45 42 7 31 38 11 7 -29 10 -4 28 -38 -24 -13 -70 -1 -46 14 -26 12 -33 -8 -20
5299 -20 -9 -6 -18 15 26 -56 8 -73 -24 13 -28 -6 -8 22 -7 -56 -24 3 -25 -49 -49 33 -1 55 30 32 2 -31 1 26 44 67
5331 67 37 39 70 -15 8 10 -18 8 -45 19 9 -3 -13 9 -31 -29 -34 -62 -75 0 10 -2 17 33 -5 23 -11 17 9 7 72 30 -16
5364 -16 -16 37 -22 78 -3 20 -33 35 49 -13 -41 -27 -39 18 2 -7 -34 66 28 -10 -11 5 -34 -32 -14 0 57 -21 29 -4 4 -57
5396 -57 -11 -36 -53 56 30 -28 -32 -17 16 4 -48 -10 13 -18 12 23 28 8 40 7 52 20 -41 -13 -37 3 17 1 -19 18 3
5427 3 -17 -20 -21 -26 -14 36 -6 -10 -43 -16 41 29 -39 -7 -36 20 31 -34 -4 -26 16 25 -10 36 23 17 -7 -37 57 -15 6 -41 30 -20
5461 -20 37 -24 -74 25 -11 -18 -19 27 38 13 -35 -12 -47 -22 -42 -9 3 27 30 32 3 -76 -3 -24 26 -37 18 26 2 11 -5 -6 -44 10
5495 10 -39 -13 -55 19 19 -21 42 18 25 1 -22 -39 -9 -18 -49 25 2 0 -2 -2 -9 16 -25 -2 2 9 -21 -41 1 20 -17 32 -48 27 -46
5530 -46 97 -17 -30 3 -17 -17 -14 5 0 -14 -74 -16 -8 43 48 16 17 28 19 15 -38 -59 -39 3 -18 -5 -13 -20 11 -62 -58 -27 -22 -14 -25 8
5566 8 21 -28 -56 -20 10 -15 18 18 -30 5 -6 -19 -67 33 9 -27 25 -21 7 28 9 -8 63 34 -35 20 -60 -24 -29 16 40
5597 40 15 15 -77 -20 6 -11 -10 -7 -39 24 12 59 -39 2 -47 35 3 -36 -49 -5 59 21 8 -12 -61 54 -5 -20 55 6 26
5628 26 15 -5 30 5 -26 27 -46 3 -35 -14 7 -57 23 -49 -7 -16 -37 -22 7 -9 -33 -18 -29 -63 -31 33 -15 -17 20 16 -16 3
5660 3 23 -2 -2 8 60 6 -2 10 49 -69 40 -10 -18 22 36 -6 -14 -31 27 -26 -41 0 9 21 28 -22 -87 36 -11 7 -18 -36
5692 -36 -23 4 -49 41 23 -14 5 -14 46 58 -6 6 -5 8 14 23 -30 48 -4 -8 17 13 27 -15 1 -56 -7 -12 1 -8 -26 -6 -43
5725 -43 -56 0 5 26 -88 43 11 15 19 -11 26 -24 -32 -2 11 41 -30 44 -11 -13 7 1 27 -51 -10 34 18 -40 16 -9 -30 -46
5757 -46 26 15 -12 20 -28 16 -47 2 51 -33 -58 1 -17 -92 14 -54 15 -3 -21 -4 7 -2 8 66 -6 11 15 -12 29 -13 -54
5788 -54 72 8 12 55 38 -9 28 -3 -23 -1 19 0 -24 -55 -24 -40 31 -7 -13 27 -15 -13 2 15 -21 -7 14 0 -42 -5 -19
5819 -19 32 -19 0 18 -31 10 13 8 3 -49 59 -51 -29 -36 4 -23 -15 9 55 12 -10 -6 16 34 15 -34 14 39 -46 -27 5 -83
5851 -83 -26 -47 -34 -54 -36 13 -46 -36 -11 -63 -47 -26 0 20 27 -35 16 -12 13 4 9 -13 25 11 15 22 -12 44 -2 -32 47 9 -10
5884 -10 -18 -30 17 -3 -10 19 -27 26 -34 -29 -39 11 3 28 -14 -21 40 -15 17 -8 -46 13 -75 -78 -8 6 9 -3 78 -17 -20 9 33 32 29
5919 29 2 5 14 -23 -4 5 23 -36 -30 13 59 -3 -62 -48 -67 -65 -10 -58 -72 -42 -34 33 2 -20 -10 -15 -41 -7 47 -75 -17 23 43
5952 43 0 -11 -4 -8 16 -52 -4 22 -18 4 -6 27 -54 7 37 29 -15 -19 48 -7 -30 -36 8 -29 -4 0 18 -51 46 77 -20 -65 13
5985 13 -30 19 -38 24 34 43 -54 28 31 -61 -46 22 21 -30 35 32 26 1 50 11 38 19 -8 16 -16 -65 -39 3 -1 3 42 -23 -87 -41
6019 -41 17 -20 4 23 -21 14 32 52 13 -3 -64 -20 18 12 20 9 -26 -47 -17 5 18 5 -1 6 6 6 -18 -22 -19 2 27 -27 -42 -7
6053 -7 12 -12 -14 -13 40 -13 -30 67 -10 -30 8 -26 -8 -32 -19 5 -19 -53 -15 39 -51 -16 -4 -26 26 35 48 -17 -32 -22 8 14 30
6086 30 -47 -18 43 16 17 -8 28 -2 -25 47 -40 9 -16 28 -65 -56 -35 11 -23 -8 -8 4 -1 -34 -44 -27 -25 -30 27 -3 8 6 -24 -73
6120 -73 28 51 26 15 8 -11 -18 -20 -5 -5 -22 38 22 9 -9 -4 -1 24 1 -9 -25 13 -14 -31 -33 23 -21 -43 -31 13 33 -15 -43
6153 -43 -27 -45 9 -63 -50 -24 -7 -16 -35 12 24 13 5 5 -25 -21 21 21 -9 -6 -6 -9 37 19 -38 -48 -9 14 -9 -1 32 -6 -23 -12 -18
6188 -18 35 -14 -40 -20 -17 4 33 -8 -24 24 43 3 -20 -25 12 -27 36 -1 51 -16 -12 44 20 14 -31 -25 18 -20 48 -25 25 27 29 26
6222 26 -23 -32 30 30 13 0 -9 -25 33 0 -24 -35 -41 31 -72 -45 20 -12 -18 36 28 26 -21 -3 -21 9 3 22 -23 -3 3 -2 28 -23 -9
6257 -9 -38 -25 -23 47 -17 -44 -5 2 -3 -40 12 1 -9 -6 -11 17 -14 -12 -8 23 43 67 -18 -2 -32 21 30 -2 8 -19 -75 5 -39 -39 32
6292 32 -12 43 -10 -27 -51 -2 -8 60 8 37 -40 44 7 28 7 35 6 -3 -47 68 -23 -15 28 33 25 -42 -4 -30 -42 -50 49 -29 15
6325 15 -5 13 -17 40 33 34 19 -3 -51 -37 -8 -14 15 -13 -9 38 -11 -3 6 -26 34 -13 -31 32 -12 -2 7 -19 10 -20 -16 -5 -18 6
6359 6 -9 -37 -8 -33 -47 -54 33 16 -7 -58 -17 6 -14 -8 -47 -23 -3 4 35 15 17 4 -43 9 59 -8 26 -1 -9 -36 -24 -13 2
6392 2 -33 17 27 -12 -8 23 -30 7 -64 -61 -27 13 24 -13 16 -15 -33 9 -33 -30 -21 9 -36 35 6 -72 -38 33 -29 11 -4 -47 -32
6425 -32 36 15 14 -34 37 -28 0 62 35 0 6 -11 -53 -21 -121 0 -20 35 -11 -35 1 -5 -30 6 13 27 -17 11 -47 24 -65
6456 -65 -51 -17 44 -19 2 28 49 14 25 -16 -20 -18 -31 18 -10 -11 43 -15 41 -59 14 53 -50 -18 -16 20 -20 10 -34 -43 12 -51
6488 -51 -19 5 29 -12 -25 -8 19 48 -14 -10 -21 -34 1 -41 -59 -18 -4 9 -21 -33 24 36 16 21 -18 7 23 38 13 17 -30 9
6520 9 -36 27 5 -44 12 -5 -55 -54 4 -18 14 -29 -61 -28 -48 -38 -29 35 37 7 5 49 48 37 -2 6 5 49 14 -23 -2 18 21 -15 26
6555 26 6 -15 -19 18 16 -14 10 -19 -14 28 -24 5 51 9 -40 -11 7 18 -32 23 -22 -32 58 -20 -5 -80 35 -7 -4 -56 -23 -36
6587 -36 22 10 -9 -32 27 64 -4 46 -21 27 0 5 -2 13 2 -16 43 -34 -4 43 16 -40 -34 10 9 -10 -36 -34 -74 -19 3 34 5
6620 5 21 -42 -32 -11 7 -61 22 23 -27 12 -2 -6 -42 21 54 8 2 18 1 9 -14 -24 9 -63 -32 -30 -50 -20 71 -19 -9 -36 -15
6653 -15 -53 10 -3 -42 18 -13 -4 7 -6 -38 -52 13 0 -19 -38 21 -18 59 9 -56 -23 -1 -11 50 13 33 0 -34 27 -43 15
6684 15 -39 47 30 45 -28 66 13 -54 -65 -35 17 -58 -55 -50 -30 1 -43 -40 -20 0 16 36 34 -24 -21 9 -33 -45 -42 46 53 1 16 -1
6718 -1 -9 35 18 7 -16 51 -9 -27 34 29 7 -27 -41 0 10 -5 27 -22 5 17 12 -16 -17 -34 -42 -8 58 33 -31 16 -11 -97 -46
6751 -46 56 26 43 37 -25 -16 27 -13 14 19 -18 -8 -48 26 24 -7 -29 -20 -50 -10 11 -47 -23 -35 -48 -48 -33 2 6 2 20 15 -39 29
6785 29 8 -70 -69 39 24 -35 -6 11 27 -1 -46 32 -8 17 -17 16 -43 19 -8 8 -3 -2 -26 -54 5 -16 37 -5 -18 -49 12
6816 12 -10 -8 21 -55 -5 0 -28 -28 -2 9 -19 -3 20 27 -50 5 32 -44 -36 -3 -77 -14 -1 9 -22 14 39 62 0 -24 -42 -34 -23
6849 -23 47 29 3 32 -2 41 -17 25 25 18 30 -32 -12 -27 4 17 -25 -11 31 -23 -10 -10 -10 -21 4 -50 22 -34 3 27 -43 27
6881 27 -27 -44 35 10 -22 44 63 3 45 46 -15 -1 7 -19 -3 4 5 -39 21 40 20 51 49 -10 6 -49 -23 20 -3 -68 -23 -20 -16 -13
6915 -13 33 12 -32 -15 -32 1 -25 34 37 31 6 33 41 -18 18 9 -23 24 -11 -24 -21 -4 0 52 -3 -64 -14 -11 -26 -25 -35 1 32 -28
6949 -28 -13 30 -24 16 69 27 17 -38 -27 -8 -23 14 38 -19 1 -71 34 35 20 20 -46 47 -23 -2 36 29 50 51 11 32 0 -20
6981 -20 -12 31 8 -1 -31 24 -47 3 -26 10 -41 24 51 -17 14 -11 -27 20 -4 -16 25 -21 -30 -19 35 -6 -62 45 29 20 53 5
7013 5 -8 12 15 -57 -20 39 5 41 -52 -12 57 -27 -21 -27 -11 -19 -11 13 47 -16 -20 -17 -3 2 -28 5 -31 -32 9 -18 12 -51 -5 15 -48
7048 -48 -53 -46 -11 -14 17 -4 -8 33 -13 -4 -7 24 -21 -18 -6 -42 20 29 7 -29 -58 66 -46 -41 -59 -21 -29 5 -9 -5 -35 36 -46 -39 -2
7083 -2 -23 -22 18 -46 -8 -1 30 -7 -54 -36 1 -22 -8 29 -28 9 7 -2 -16 24 -50 -21 46 0 42 1 29 10 -34 20 -7 -4 33
7116 33 -28 21 -22 22 21 -46 -37 18 4 25 -30 -85 11 -47 14 1 -22 11 29 4 12 -19 0 -18 -22 15 22 16 -28 4 -27 -21 41 5
7150 5 15 -25 -39 8 9 27 -35 -43 10 -9 -1 -8 9 -14 -32 -17 -38 -9 -4 -13 -30 9 -24 0 -27 5 -20 -8 26 -28 -44 31 6 -20
7184 -20 -32 -1 12 -26 31 1 -11 14 2 15 -96 -9 -53 -14 -15 -3 -15 -23 -3 -1 -49 -49 -50 -20 -64 -10 -2 11 -5 -28 7 -2 -22
7217 -22 47 -38 42 64 5 8 3 57 -38 -54 2 8 -25 10 -20 12 43 8 18 -63 6 -29 -48 -26 9 -33 34 -10 0 -1 -111 25
7249 25 39 9 -60 0 -29 -52 -12 -11 -39 7 25 -44 -10 -36 -52 10 -9 -39 5 20 32 -21 -21 14 9 -8 -36 6 9 34 -13 -8 15
7282 15 28 -31 -90 -48 13 -8 -55 36 -24 -64 -7 -35 -12 -2 -1 17 0 14 -44 24 -9 16 7 31 41 62 7 25 22 -47 20 -17
7314 -17 -13 -20 9 -1 55 -34 -86 1 -19 -55 7 18 -10 -31 47 -65 20 -12 -4 21 -62 17 -21 4 -38 -15 -8 -34 16 39 5 -30
7346 -30 9 -5 41 34 -23 33 16 28 56 -37 -26 9 47 53 51 -56 34 -22 1 -59 -25 -49 -8 22 14 -11 -38 27 22 25 -56 4 -13
7379 -13 -51 26 49 -1 -55 -41 14 -1 -10 -1 20 -68 5 -37 0 35 -69 -14 5 -42 -44 28 -35 -50 -15 3 18 -3 26 10 -26
7410 -26 -9 7 -3 -8 -27 -23 -4 -26 -26 -1 -54 -40 10 15 -57 -79 -49 -38 -14 14 -1 12 27 25 51 -5 33 42 9 -42 -68 10 9 47
7444 47 -41 -27 38 18 29 45 7 -52 8 -11 60 -56 -35 34 -44 -27 -24 20 -35 -29 -27 34 15 -24 -16 7 5 -48 -44 59 -37 -7
7476 -7 7 -20 -38 17 -20 -50 -65 42 3 -42 -31 8 13 7 -9 13 14 9 -1 27 40 -15 19 -30 -71 -44 -45 -23 -53 6 -32 15 -33
7509 -33 -17 4 -5 -51 13 19 40 -24 6 -11 2 -6 15 -23 -28 -11 19 54 26 13 -13 -6 -27 59 -14 2 -15 -24 34 -37 -22 16 33
7542 33 16 8 -28 -5 -14 10 -8 13 -7 -14 36 31 -4 7 19 -8 19 18 60 10 -15 42 25 -23 7 -46 -27 22 -9 -40 -24 -19 -29
7575 -29 1 0 -17 -13 34 -64 20 -26 -27 -81 -59 27 -79 10 -49 15 16 4 9 -13 4 -53 -2 49 30 -47 81 72 0 6 9 -13 -17 -4
7609 -4 19 -6 12 20 3 -26 -39 15 -20 -2 -28 4 19 -48 -13 25 1 -48 13 34 -28 -29 -20 2 22 8 -42 -28 -8 -20 15 -14
7641 -14 -25 36 -56 -30 -6 -45 37 12 -29 41 -20 -40 -17 19 -55 36 -6 25 13 24 -4 -63 -10 33 -38 -28 -21 -22 20 5 -37
7672 -37 9 26 -4 -4 -22 14 14 64 -45 14 4 -3 1 -35 36 1 56 -29 -3 38 -1 -50 -12 -29 -27 -54 2 6 4 -30 8 -10 -15 -19
7706 -19 47 -24 13 23 41 7 -13 32 -47 -17 30 -38 -36 27 47 -56 -17 -5 60 1 11 30 43 46 -70 19 -2 66 -14 7
7736 7 14 -36 -13 22 -21 16 -15 42 25 -14 2 -7 -18 -51 -24 -9 -13 -52 -17 -25 50 -9 8 -3 -42 -9 19 5 11 8 45 43 26 -22
7770 -22 17 33 -33 -8 12 31 7 9 -14 16 -19 -26 38 -2 38 -52 -15 49 17 48 34 -30 -32 -10 -4 25 -30 -34 -27 -7 1 3 -42 -5
7804 -5 -7 34 -26 0 -23 -2 33 29 20 16 -26 49 -21 -3 -7 -39 -8 -19 -1 -3 45 15 -14 -66 -35 -25 -22 -1 22 21 13 -70 -30 -54 -32
7839 -32 3 -9 -11 -40 -14 54 -15 -1 -15 -22 -18 -1 -35 15 -78 6 -3 42 16 -9 3 -10 -33 29 -1 58 -78 -11 21 17 -11 -9 13
7872 13 -18 -38 26 44 -40 10 14 -26 46 -39 -5 46 -22 -7 -42 -54 -20 -7 -31 -25 4 -15 53 -26 -28 12 -15 -41 -9 2 -33 39
7904 39 -6 -7 -40 -32 -41 -19 -3 -4 10 -2 26 -59 1 -38 -29 -19 -8 -27 -34 -34 20 7 18 -46 -60 8 7 25 -26 -4 -10 -14 -31 -83 -65
7939 -65 19 -1 -48 -19 -34 4 -14 6 -15 -35 -7 20 31 -3 25 -19 -22 -6 -41 -62 -19 -48 22 -42 -36 -36 -44 1 4 -34 -33 -19 -3
7972 -3 -25 -11 7 4 8 -31 13 51 -42 20 0 -21 19 -21 23 -27 -31 3 -14 -24 24 -18 -17 20 -18 -8 -14 -10 -50 28 -41 -13 23 -6
8006 -6 16 -13 -22 -10 0 -19 14 -69 -4 45 -62 -4 -6 38 -6 -2 -8 43 23 44 27 -14 -17 -18 26 -43 58 -2 13 38 43 -26 2
8039 2 12 -10 -57 -40 -10 -9 -45 -58 32 -12 -29 -26 1 -24 2 -1 -7 50 7 -20 -27 -13 24 -32 8 2 7 24 41 7 -9 9 0 16 -18
8074 -18 -13 21 33 31 -41 37 -27 -22 0 47 -40 -21 -58 -27 11 4 30 0 -43 -4 9 -28 -62 -37 -19 -38 -13 -12 -36 19 18 62 23
8107 23 66 -9 -11 6 47 0 -32 37 2 18 -8 66 -10 8 10 -38 -17 -39 -31 -7 -25 -33 -48 -3 -5 -36 46 -59 -36 -11 -42 13
8139 13 -8 -2 -4 -69 15 -6 -19 -8 -8 14 -31 33 -69 50 -40 24 6 36 41 -59 1 -20 19 -62 0 -27 16 -19 21 -41 11
8170 11 -18 -30 8 31 -8 -10 -55 -4 10 -42 -27 -91 -13 -40 12 20 29 -9 39 -6 -37
8191c7
##END NTUPLES=NMR FID
##END=
