##TITLE=1H_LR-0154-OMe-BK2-TFA
 DMSO-d6
 8 sc, 
 12.4.2023
##JCAMPDX= 6.0         $$ Bruker NMR JCAMP-DX V2.0
##DATA TYPE= NMR FID
##DATA CLASS= NTUPLES
##ORIGIN= UXNMR, Bruker Analytische Messtechnik GmbH
##OWNER= root
$$ XWIN-NMR		Version 3.5
$$ Wed Apr 12 14:39:44 2023 Russian Standard Time (UT+4h)  she@DPX200
##.OBSERVE FREQUENCY= 200.13135
##.OBSERVE NUCLEUS= ^1H
##.DELAY= (6, 6)
##.ACQUISITION MODE= SIMULTANEOUS
##.ACQUISITION SCHEME= undefined
##.AVERAGES= 8
##.DIGITISER RES= 18
##SPECTROMETER/DATA SYSTEM= spect
##.PULSE SEQUENCE= zg30
##.SOLVENT NAME= DMSO
##.SHIFT REFERENCE= (INTERNAL, DMSO, 0, 15.7039)
##AUDIT TRAIL= $$ (NUMBER, WHEN, WHO, WHERE, WHAT)
$$ ##TITLE= Audit trail, XWIN-NMR		Version 3.5
$$ ##JCAMPDX= 5.01
$$ ##ORIGIN= Bruker BioSpin GmbH
$$ ##OWNER= she
$$ F:/spectra/data/she/nmr/H-F/1/audita.txt
$$ ##AUDIT TRAIL=  $$ (NUMBER, WHEN, WHO, WHERE, WHAT)
(   1,<2023-04-12 14:38:36.39 +0400>,<she>,<DPX200>,
      <created by zg, POWCHK disabled, PULCHK disabled
       configuration hash MD5:
       00 E9 B6 7A A2 85 ED C7 34 08 36 98 17 FE 4E 26
       data hash MD5: 16K
       CE F0 77 FF 14 02 A6 8E AC 8B 65 34 3A 43 F0 F4>)
$$ ##END=
$$ 
$$ hash MD5
$$ 3B F6 50 D0 DE DB 56 82 11 51 1F 70 EC 36 AD 2E
##$RELAX= 
##$RELAX= 
##$RELAX= 
##$RELAX= 
##$RELAX= 
##$RELAX= 
$$ Bruker specific parameters
$$ --------------------------
##$DU= <F:/spectra>
##$EXPNO= 1
##$NAME= <H-F>
##$PROCNO= 1
##$TYPE= <nmr>
##$USER= <she>
##$AMP= (0..31)
100 100 100 100 100 100 100 100 100 100 100 100 100 100 100 100 100 100 
100 100 100 100 100 100 100 100 100 100 100 100 100 100 
##$AQSEQ= 0
##$AQ_mod= 1
##$AUNM= <au_zg>
##$AUTOPOS= <>
##$BF1= 200.13
##$BF2= 200.13
##$BF3= 200.13
##$BF4= 200.13
##$BF5= 200.13
##$BF6= 200.13
##$BF7= 200.13
##$BF8= 200.13
##$BYTORDA= 1
##$CFDGTYP= 0
##$CFRGTYP= 5
##$CHEMSTR= <none>
##$CNST= (0..31)
1 1 145 1 1 1 1 1 1 1 1 1 1 1 1 1 1 1 1 1 1 1 1 1 1 1 1 1 1 1 1 1 
##$CPDPRG= <>
##$CPDPRG1= <>
##$CPDPRG2= <>
##$CPDPRG3= <>
##$CPDPRG4= <mlev>
##$CPDPRG5= <mlev>
##$CPDPRG6= <mlev>
##$CPDPRG7= <mlev>
##$CPDPRG8= <mlev>
##$CPDPRGB= <>
##$CPDPRGT= <>
##$D= (0..31)
0 1.2 0 0 0 0 0 0 0 0.06 0 0.03 0 0 0 0 0.0002 0 0 0 0 0 0 0 0 0 0 0 0 
0 0 0 
##$DATE= 1681295915
##$DBL= (0..7)
120 120 120 120 120 120 120 120 
##$DBP= (0..7)
150 150 150 150 150 150 150 150 
##$DBP07= 0
##$DBPNAM0= <>
##$DBPNAM1= <>
##$DBPNAM2= <>
##$DBPNAM3= <>
##$DBPNAM4= <>
##$DBPNAM5= <>
##$DBPNAM6= <>
##$DBPNAM7= <>
##$DBPOAL= (0..7)
0.5 0.5 0.5 0.5 0.5 0.5 0.5 0.5 
##$DBPOFFS= (0..7)
0 0 0 0 0 0 0 0 
##$DE= 6
##$DECBNUC= <off>
##$DECIM= 32
##$DECNUC= <off>
##$DECSTAT= 4
##$DIGMOD= 1
##$DIGTYP= 9
##$DL= (0..7)
0 120 120 120 120 120 120 120 
##$DP= (0..7)
150 150 150 150 150 150 150 150 
##$DP07= 0
##$DPNAME0= <>
##$DPNAME1= <>
##$DPNAME2= <>
##$DPNAME3= <>
##$DPNAME4= <>
##$DPNAME5= <>
##$DPNAME6= <>
##$DPNAME7= <>
##$DPOAL= (0..7)
0.5 0.5 0.5 0.5 0.5 0.5 0.5 0.5 
##$DPOFFS= (0..7)
0 0 0 0 0 0 0 0 
##$DQDMODE= 0
##$DR= 18
##$DS= 0
$$ [...]
##$SUBNAM2= <"">
##$SUBNAM3= <"">
##$SUBNAM4= <"">
##$SUBNAM5= <"">
##$SUBNAM6= <"">
##$SUBNAM7= <"">
##$SUBNAM8= <"">
##$SUBNAM9= <"">
##$SW= 18.05172834244
##$SWIBOX= (0..15)
0 0 2 0 0 0 0 0 0 0 0 0 0 0 0 0 
##$SW_h= 3612.71676300578
##$TD= 16384
##$TD0= 1
##$TE= 0
##$TE2= 300
##$TE3= 300
##$TEG= 300
##$TL= (0..7)
0 120 120 120 120 120 120 120 
##$TP= (0..7)
150 150 150 150 150 150 150 150 
##$TP07= 0
##$TPNAME0= <>
##$TPNAME1= <>
##$TPNAME2= <>
##$TPNAME3= <>
##$TPNAME4= <>
##$TPNAME5= <>
##$TPNAME6= <>
##$TPNAME7= <>
##$TPOAL= (0..7)
0.5 0.5 0.5 0.5 0.5 0.5 0.5 0.5 
##$TPOFFS= (0..7)
0 0 0 0 0 0 0 0 
##$TUNHIN= 0
##$TUNHOUT= 0
##$TUNXOUT= 0
##$USERA1= <user>
##$USERA2= <user>
##$USERA3= <user>
##$USERA4= <user>
##$USERA5= <user>
##$V9= 5
##$VALIST= <valist>
##$VCLIST= <CCCCCCCCCCCCCCC>
##$VD= 0
##$VDLIST= <DDDDDDDDDDDDDDD>
##$VPLIST= <PPPPPPPPPPPPPPP>
##$VTLIST= <TTTTTTTTTTTTTTT>
##$WBST= 1024
##$WBSW= 4
##$XGAIN= (0..3)
0 0 0 0 
##$XL= 0
##$YL= 0
##$YMAX_a= 181310
##$YMIN_a= -126502
##$ZGOPTNS= <>
##$ZL1= 120
##$ZL2= 120
##$ZL3= 120
##$ZL4= 120
##$ABSF1= 10
##$ABSF2= 0
##$ABSG= 5
##$ABSL= 3
##$ALPHA= 0
##$AQORDER= 0
##$ASSFAC= 0
##$ASSFACI= 0
##$ASSFACX= 0
##$ASSWID= 0
##$AUNMP= <proc_1d>
##$AZFE= 0.1
##$AZFW= 0.1
##$BCFW= 1
##$BC_mod= 2
##$BYTORDP= 1
##$COROFFS= 0
##$CY= 11.3945322036743
##$DATMOD= 1
##$DC= 2
##$DFILT= <>
##$DTYPP= 0
##$F1P= 2.36226072786647
##$F2P= -0.459571619588291
##$FCOR= 0.5
##$FTSIZE= 0
##$FT_mod= 4
##$GAMMA= 1
##$GB= 0.15
##$INTBC= 1
##$INTSCL= 1
##$ISEN= 128
##$LB= 0.24
##$LEV0= 0
##$LPBIN= 0
##$MAXI= 10000
##$MC2= 0
##$MEAN= 0
##$ME_mod= 0
##$MI= 1.114404
##$NCOEF= 0
##$NC_proc= 0
##$NLEV= 6
##$NOISF1= 3.799351
##$NOISF2= 2.8
##$NSP= 1
##$NTH_PI= 0
##$NZP= 0
##$OFFSET= 15.70392
##$PC= 1
##$PHC0= -19467.53
##$PHC1= -2.399195
##$PH_mod= 1
##$PKNL= yes
##$PPARMOD= 0
##$PSCAL= 0
##$PSIGN= 0
##$REVERSE= no
##$SF= 200.130013532006
##$SI= 16384
##$SIGF1= 3
##$SIGF2= 2
##$SINO= 400
##$SIOLD= 16384
##$SREGLST= <1H.CDCl3>
##$SSB= 0
##$STSI= 0
##$STSR= 0
##$SW_p= 3612.71676300578
##$SYMM= 0
##$S_DEV= 0
##$TDeff= 0
##$TDoff= 0
##$TI= <>
##$TILT= no
##$TM1= 0
##$TM2= 0
##$TOPLEV= 0
##$USERP1= <user>
##$USERP2= <user>
##$USERP3= <user>
##$USERP4= <user>
##$USERP5= <user>
##$WDW= 1
##$XDIM= 8192
##$YMAX_p= 0
##$YMIN_p= 0
$$ End of Bruker specific parameters
$$ ---------------------------------
##NTUPLES= NMR FID
##VAR_NAME=  TIME,          FID/REAL,        FID/IMAG
##SYMBOL=    X,             R,               I
##VAR_TYPE=  INDEPENDENT,   DEPENDENT,       DEPENDENT
##VAR_FORM=  AFFN,          ASDF,            ASDF
##VAR_DIM=   8192,          8192,            8192
##UNITS=     SECONDS,       ARBITRARY UNITS, ARBITRARY UNITS
##FACTOR=    0.0002768,     1,               1
##FIRST=     0,             0,               0
##LAST=      2.2672688,     0,               0
##MIN=       0,             -126502,         0
##MAX=       2.2672688,     181310,          0
$$ Real data points
##PAGE= N=1
##DATA TABLE= (X++(R..R)), XYDATA
$$ [...]
1504B57k22j31j48J45L78J4l01j5j86J91QK56j52j52j62L10q7J24l55l96N42m
1526h6K02K8k88j8J14P9j5k50K01j79M48J78j57l42N1J35N0J58n08n9K97M3K83
1549C65l15L0k83j56N55L7o7l46o4L54J55l48K9j50J74J75r8L41l87j59N2J16
1571A0K03j38l02o6J59L94q4j15p4J20j3P9K0k43r7J59L2K18k10j46k96M37J29
1594A76j14k14J9k7O1K12k7j85j29K93j17J28j09p9J70k45N74m7k47j70J09J94
1616B26k7j77ko6j59L24L17l28l14m7K08K80r6j46j30n2L85k3n9l4j27j01J59
1639A1R6J9j36k04L32R7m1j44j51J65Q4j73K18k29m7p6K03J31L6m26j58N47P6
1662B30N8o15K21j10J69L28l07q7j98K65J07J8n5Kj92J93L17k43k48P3m7K19j31
$$ plain form
1504 257 35 -96 -244 -99 279 293 -8 -23 -209 -18 -10 246 94 -58 -220 90 3 127 -228 -624 -82 -86
1526 -86 116 144 -144 -162 -48 31 16 -234 -33 -212 236 414 257 -85 -34 101 151 309 -199 -258 39 82 365
1549 365 50 80 -203 -359 196 233 166 -180 -244 110 265 -83 -54 -204 -30 145 47 388 1 -158 -106 10
1571 10 213 75 -227 -293 -134 260 176 61 -13 107 94 173 193 -50 -147 12 44 262 52 -94 -390 47 176
1594 176 62 -152 -133 -160 -99 113 86 -99 -228 65 -52 76 -33 -112 58 -187 387 340 93 -77 32 226
1616 226 199 22 20 -46 -205 119 436 108 -206 -253 -45 235 139 -7 -137 -189 196 173 114 80 -47 -148 11
1639 11 107 126 -10 -214 118 215 174 30 -121 44 128 -45 173 -56 -103 -179 24 155 191 -235 -393 154 230
1662 230 288 -327 -106 -216 -47 281 -26 -113 -311 -46 61 79 24 26 -166 27 344 101 -147 -74 -121 98 -33
1685c3MJ2o1J03M1o0K0m4k28K88M3n9j59q3J19K16J37k90J2k68J38K00r0Q8l30
1710b84M9L45L49k82k80j29J77L5K35l64K49k18K05j81J56M8k45N1L8M42l69l3
1732fR9j06J90L2j65j68j45K65J03J36j10j21PJ08J26k4m36j39K61J99n4k82K98
1755F8k38J41L1M2N6k10q9L89P2km75j86L38L27k19j35NP0J29q7J51m1j41o3L0
1780c7K49m9j63j33K07K4n3K1j53j04M9K89j24J17k89P1K5J06J28m20P4j02K63
1803dK02k46j59J46M0M6n2q3J01m5LL24m4k35j54K17J23j25k31r2K65N9j02n8
1827a04J28rk07L39n5o6j10q3k8M20k15j81J44n9J40j61K93oj09q1n4K29O0j12
1851A13l64J53K00J85l75K2j54J20J57j26J8K2j55R8J50L7j78k26J77J77P8j53
$$ plain form
1685 -33 -29 -17 -78 25 66 6 26 -18 -246 42 85 26 -133 -216 -97 119 256 -34 -22 -290 -152 48 -42 46 -284
1710 -284 -235 110 459 177 -103 -232 -55 -20 215 -149 100 -118 87 -94 62 110 -135 -84 -46 396 27 -6
1732 -6 93 -13 177 209 44 -124 -269 -4 99 235 125 4 11 119 245 221 -215 -354 -93 106 52 -230 68
1755 68 -170 -29 2 44 100 -110 -199 190 262 260 -215 -401 -63 264 45 -90 -85 -15 114 27 178 137 -4 -67 -37
1780 -37 212 163 0 -133 74 98 45 66 -87 -191 -142 147 23 140 -149 -78 -53 53 181 -239 -165 -267 -4
1803 -4 198 -48 -207 -61 -21 25 -27 -110 -9 -54 -51 273 229 -6 -160 57 180 55 -176 -268 -3 56 -46 -104
1827 -104 24 15 -192 147 92 26 -84 -167 -195 225 10 -171 -27 -86 54 -107 186 180 71 -10 -64 165 225 113
1851 113 -251 -98 102 287 -88 -66 -220 -100 57 -69 -51 -29 -184 -86 64 101 -77 -303 -126 51 129 -24
1873b4p5p9L28j29j58L2p6J72p4k2K14k23p8K52K09J04m77n0j5L82j72N4j61J26
1897F0N4j60J36qm9j24PK96j24m8k69J04L01ml98J06R4n3p6J09K84j98l27K77
1921a0K66j97k18j13J50J73M9M2k38O8Q3j67N6j4J55k27n7K61K76m35k0q6L82
1944A79K07o03N6K50r4l1m7N6K68l19j33J98J36o3j97LJ73k1J25j78K4J2J0Qq2
1969f3L44j60m08N78O6m41j42P2J07K79o4m10J78K69p5k11j3N9J19j19j2J33l1
1992E5j72n1L13R3l15j11m2K52M9L8J44j48Nj86J36P0j3j14k24L95K2j32k85K43
2016B2K14p9k38R8L9l9j04l7J81K04m37J35J36j5N6j85J25q7nj23J66j26K6J12
2040C9K4J56r6j89l9J75K9k1k58K42L1J67j48j11P7M2r8R0m6m2k03J54J57k5m8
$$ plain form
1873 -24 -99 -178 150 21 -137 -105 -181 -9 -83 -105 109 -114 -192 60 269 373 -104 -154 -169 213 41 95 -66 60
1897 60 114 -46 90 82 33 -91 -84 212 88 40 -229 -125 176 172 -226 -120 -26 -79 -155 -46 238 40 -287 -10
1921 -10 256 59 -159 -272 -122 51 100 142 -96 -28 55 -112 -56 -70 85 -142 -199 62 338 -97 -117 -203 179
1944 179 386 -217 -161 89 -5 -36 -83 -27 241 -78 -211 -13 123 60 -137 -134 39 18 143 -35 -11 1 11 19 -63
1969 -63 281 121 -287 291 357 -84 -226 -154 -47 232 168 -242 -64 205 130 -81 -94 -35 84 -35 -47 86 55
1992 55 -117 -168 145 238 -77 -188 -230 22 71 109 253 105 110 -76 60 130 117 3 -221 174 196 64 -221 22
2016 22 236 157 -81 17 56 17 -87 -124 57 261 -176 -41 95 80 136 -49 76 -11 -16 -139 27 -99 -73 39
2040 39 63 219 123 -66 -105 70 99 78 -180 62 93 260 112 1 78 120 22 112 66 24 -179 -25 132 107 59
2065E9k34p5M36M2k09r5J69O2j07j20N6J51m05J65J85N2L1j33mj37K99j75j06
2088i3LQ5J07r7l4j46K93j50n9J27k09qJ64O7O4M6k48n0K62q6k9K75j92j4j55
2113g7J40j8j31l0J29L5L7q1j4n4j18K93j36N9n2m8J73J5J29j26k10p6J95rJ44
2138A69k17J76j38R6j04n6K99l03jJ36O8j02k35J21J10l4j56K44oj43J40j3rP1
2162A13j56K6nJ6K88l39J2jJ5k1j20J84j06L41k11L1j74J16j07K2K21Q1l32P6
2186c0R9ln8N3rJ9j8M7j65ML4k45L16L1Q7m4Lk31J18K0j51N7p4M5jJ9NJ03j17
2215h6Qj31K75k39J25%k4J60k76O4K54K2q8k51L55l12J87L9n5N1j56J43p2n9K1
2240d5J11l3k7K18P6k75Q8J5k57J19j72J12J00j17M5K35j11j75J41roj69J40j81
$$ plain form
2065 59 -175 -250 186 228 19 -76 93 155 48 -72 -16 135 -270 -105 80 132 163 30 26 -111 188 13 -93
2088 -93 -90 -5 102 5 -29 -175 118 -32 -91 36 -173 -181 -17 50 114 160 -88 -138 124 38 9 284 92 78 -77
2113 -77 63 45 -86 -116 13 48 85 4 -10 -64 -182 111 -25 34 -18 -66 107 122 251 125 -85 -161 34 25 169
2138 169 -48 128 -10 86 -18 -74 225 -78 -79 57 125 23 -212 -91 19 -15 -171 73 67 -76 64 51 42 113
2162 113 -43 -17 -22 -6 282 -57 -45 -46 -31 -52 -172 12 -94 247 36 67 -107 9 -98 -76 145 226 -106 -30
2186 -30 69 66 8 61 52 71 53 100 -65 -61 -27 -272 44 75 162 118 121 -110 8 28 -123 -66 -140 -95 -96 -77 -72 31 -86
2215 -86 -78 -209 66 -173 -48 -48 -72 88 -188 -124 130 152 64 -187 168 -144 43 82 27 78 -78 65 -7 -66 -45
2240 -45 66 33 6 224 300 25 113 128 -129 -10 -182 -70 30 -87 -42 193 82 -93 48 39 33 -136 4 -177
2264a77J82j72J80j64J43K97l93J25J01r9pk01K61J56l17k1P5J1LO4P4j35j24
2287a38J66J7P5kp5l1J7m1P5j24R4L2p9Q8k34J78j9J62j38O0q2P6kj5J64k98k12
2314b86L77j67J6K0P9J2m3J25k65J30R1o7O9k05L61k59j35K49j68J27r1J78pk08
2338f7j95K91j45K68j88j69P1J76J3m1K60k22J07k15K0K1k0J4n6J5K66j29l9j90
2362a54J35l2J24q2lpJ51Rk69J88N0q6K1j71K42o1k4O3j52Q9k1J85k75K29m65
2387c16L00N8mk4J5p8JJ20j06J04p3j55K85l16J31M3r4P3R6L3j16Q9l4j54Q2J43
2413A03p3L5M0q1J15j79J57p7j01M5P2M3k00L2K52j31o4k9N6n2n2K1l3K49k37
2438h9J0K5m4N3J13j09m0j06J58J40j61K09j36l8Q9l0j68J85j12p6J49RM2j3j91
$$ plain form
2264 -177 5 -167 13 -151 -8 289 -104 21 122 23 16 -185 76 232 -85 -106 -31 -20 -17 47 121 -14 -138
2287 -138 28 45 120 118 43 12 29 -12 63 -61 33 65 -14 74 -160 18 -1 161 23 83 1 77 75 60 224 -74 -286
2314 -286 91 -76 -60 -40 39 51 8 133 -132 -2 89 22 91 -114 247 -12 -147 102 -66 61 -30 148 141 -67
2338 -67 -262 29 -116 152 -36 -205 -134 42 55 14 274 52 159 -56 -36 -15 -35 -21 -77 -62 204 75 36 -154
2362 -154 -19 -51 73 -9 -12 -19 132 141 -128 60 110 24 45 -126 116 55 31 94 -58 31 10 195 -80 149 -316
2387 -316 -16 42 38 14 29 -49 -48 72 -34 70 -3 -158 127 -189 -58 -15 -109 -36 60 93 -23 66 32 -122 -40 103
2413 103 30 65 105 24 139 -40 117 40 -61 -16 56 99 -101 -69 183 52 -12 -41 15 -37 -89 -68 -101 148 -89
2438 -89 -79 -54 -98 -45 68 -41 -81 -187 -29 111 -50 159 23 -15 74 44 -124 61 -51 -127 22 31 73 60 -131
2463a31J43k03J77j5J50q7o6O8o1K5J21K15j64j53j8J17k57N9J22j03j8l0N3J62
2487A06j16K4p9j6k9J62j01l1r8n0M81k03N8j34J01K5k01K11j60K9j32J14J24
2510H5j46M5j02N1K09j98j08L02J09l70P1J08O1k35M5l5K49j82K07l1l5J02k60
2533e8lJ74r4J90j58p5J10k9J70l23K11j74J58q7l3k45P9L01k2j59J15r9J48q6
2557A1J5J18m8L5J9Kk11M0N6k74M01q4k4O0j30N9K19k31M2M3j97k37K55J53k05
2582a13J20J39q6m2K4j8J2J9p0M5M2l7%k4j95K95L9j43j82L21k35o5J52j38M89
2607C49k61p6j95J26K6J98l00K95n2l26L55j71%O9k54K49l5L0p2k18K18K8O0J78
2631B21l35J85J2j25nj5J54k01K13j41J49m6k68J66M6l3l3N3K4j63K11pj6l0l7
$$ plain form
2463 -131 12 -191 -14 -29 121 34 -32 36 -25 0 121 336 172 19 1 118 -139 -80 42 -61 -79 -109 -56 106
2487 106 -10 14 -65 -81 -110 52 -49 -80 -178 -228 253 50 108 -26 75 100 -101 110 -50 -21 -153 -39 85
2510 85 -61 -16 -118 -67 142 -56 -164 138 247 -123 -52 56 117 -118 -73 -108 141 -41 166 135 100 202 -58
2533 -58 -61 113 19 209 51 -24 86 57 227 -96 115 -59 99 12 -21 -266 -187 114 92 -67 48 -51 97 11
2557 11 26 144 96 131 150 152 -59 -19 37 -237 164 80 56 116 -14 45 264 33 75 118 -79 -316 -61 92 -113
2582 -113 7 146 60 18 42 24 36 55 -15 30 72 35 35 11 -184 111 150 7 -175 146 -89 -154 -2 -140 349
2607 349 88 12 -183 -57 -31 167 -133 162 110 -216 139 -32 -32 37 -217 32 -3 27 -45 -263 -45 -17 43 221
2631 221 -114 71 83 -42 -47 -62 92 -109 104 -37 112 66 -202 -36 10 -23 -56 -3 21 -142 69 62 46 16 -21
2656b1n6M0J77j37j90K23q3JM0Nj8p3J56j9P8k89K0K46j97J87M7j99Q4J02k49
2681a25J45p7j07O8J1K5J70m8K7l9k09O1L1J95m6R5k26oN5J68j32k34K46k01K64
2706A11j15q0J50Q7j77Nr7KJ83j82O3LJ88k20pk0L00r1j39J47q4j45J74j9l3J6
2732B0n9l1L7J27k24M7P2j80M17j02k1j48J65K1k51K53p2q1j25O1J4k3J76j63
2756g0J34n2j6j4k0K8q1M8N8J52k76K7k7QJ76p3q1K57l60J61R3k59J75n0J22L1
2782I1j84M25j73lJ0L1k21J27j48KK14p0j42J36L1M9j64p0P2j28J38j58m3J63
2806a5Q7l5l8oJ25j84J54o3J37o9Q8r9q0l2m9J1l2Mj14K37r4K13k37J09m5r5J00
2833b2j9K49j88N4pj07N2n2Ok6N9J31j10j39P3Q5J79l07m8J68l5R9q1n4N8n2N9
$$ plain form
2656 -21 -77 -37 140 3 -187 36 -47 -46 -6 -1 -19 -92 64 45 123 -166 -146 100 -97 90 137 -62 22 124 -125
2681 -125 20 -57 -164 -96 -85 -60 110 62 89 50 -159 -98 -67 128 82 177 -49 -55 0 168 36 -198 48 -153 111
2706 111 -4 -84 66 153 -24 -19 -116 -114 69 -113 -50 -47 141 -79 -86 -106 194 103 -36 111 27 -118 56 37 4 20
2732 20 -39 -70 -33 94 -130 -83 -11 -191 226 124 103 -45 120 141 -110 143 71 -10 -135 -74 -60 -83 93 -70
2756 -70 64 12 -4 -18 -38 -10 -91 -43 15 167 -109 -82 -109 -101 75 2 -79 178 -182 -21 72 -187 -12 -62 60 91
2782 91 -93 332 159 156 166 197 -24 103 -45 -43 171 101 -41 95 126 175 11 -59 13 -115 23 -135 -178 -15
2806 -15 72 37 -1 -7 118 -66 88 25 162 93 181 82 2 -30 -79 -68 -100 -96 -210 27 -67 146 -91 18 -27 -122 -22
2833 -22 -41 208 20 74 67 -40 12 -40 -34 -60 -1 130 20 -119 -46 39 218 -89 -137 31 -4 95 14 -40 18 -34 25
2860B5j5L8J1l3M7M3j44jO1J15k23J21n6L8R5k01q3N0J32Q4j90lJ43r9j55P1K43
2887A14j39r7L50k51R6O5r2m3p5J17qO6j11M5o8J66l9k14J16K3O7k05K50k67K72
2912A38j82k8K6k7J96k2Mq2q4k8k0L26l15m2J56j8j3M5j63J88P4k28K51k84K49
2937A17r2J63l90L02L9k24J72j07J9P3k1j2j0j09K45j05R5n7k69K57j77R0j09
2960a10J78o3j89o7J84j76L34J2j53M2n5k2J26r8M7J37j36j76K70m0J21j15j20
2983f9K62k81J15p1qJ01j27j25K15q7O9j30o0K26j55J55Qjk2r7K2Qj08L9J66n5
3009a0j20j04J83L03r7j80J73j40p5L9OJ03K8n63N68j57K53k43k14J93K22j40
3031B8J82l1k73R9j40P3Q9q3l4M4p5k4L5J81o9j50K29LJ1j37K12r8m6R1k18J17
$$ plain form
2860 25 10 48 59 26 73 116 -28 -29 32 147 -76 45 -11 27 122 -79 -162 -112 20 104 -86 -89 54 -45 -200 -129 114
2887 114 -25 -122 228 -23 73 138 46 3 -72 45 37 103 -8 37 -31 135 96 -118 -2 21 88 -117 133 -134 138
2912 138 -44 -72 -46 -73 123 101 105 23 -61 -89 -109 217 -98 -140 16 -2 -15 30 -133 55 129 -99 152 -132 117
2937 117 25 188 -202 100 139 -85 87 -20 -1 72 51 39 29 -80 165 60 155 98 -171 86 -91 -1 -110
2960 -110 68 5 -184 -251 -67 -243 91 103 -50 -8 -63 -85 41 -57 -10 127 -9 -185 85 45 166 51 -69
2983 -69 193 -88 27 -44 -52 49 -78 -203 12 -75 -6 -136 -196 30 -125 30 38 37 15 -82 -60 -52 -160 -121 45 -10
3009 -10 -130 -234 -51 252 155 -25 148 8 -67 -28 -22 81 109 -454 114 -43 210 -33 -247 -54 168 28
3031 28 210 179 -94 5 -135 -62 27 -56 -90 -46 -121 -145 -110 71 2 -148 81 84 95 -42 170 72 26 117 -101 16
3057A6J07j05l7J9k29M4K60J03j67R9K0l68K49k30J10R3j00J02Qq7J1J63j56J35
3081F0op4JL7m8N0k63K97o6P3o3J57R5k38l2r0j1n1J75J2j17l6J29n3J8N2n8q3
3109a33K03k18Rk2J32P5l2J32j49J41l5K2p5k06k0L21k21JJ43J17k11k6L8n5J90
3134A21j46k2J18j57n4Q6M8n2J21qn5l5K16k00k2kmM5O2o0J56k01j30J92k5j12
3160a20j9L7P2Q0r1O2k7J8M0m6P7j27jJ01k40K44l8j61J48n6pK83j32q2J1k1L6
3187D1j09K09j77J98M9k04k89M13m07K96k5M4m3L6L8L2k95J14R7%J31j43J30m8
3211H8l03J65qQ5k9N7j70J5J68j45L14k77P2o7mJ53j99n7J88j42J53pj15K55k82
3236i2K16l5m3Jp6K02j20O2j21l1M9J36k06K58j36l53L03o1L6Q4m8m7M1k7j0j80
$$ plain form
3057 16 123 18 -19 0 -229 -185 75 178 11 110 130 -238 11 -219 -109 -16 -116 -14 -6 -93 -82 81 -75 60
3081 60 54 -20 -19 18 -30 20 -243 54 -12 61 -2 155 250 12 -20 -110 -121 -172 3 15 -102 -138 -9 -62 -44 8 -50 -133
3109 -133 70 -148 -139 -161 -29 46 14 146 -3 138 103 125 50 -156 -176 145 -76 -75 68 185 -26 -52 -14 -69 121
3134 121 -25 -47 71 -86 -140 -54 -6 -58 63 55 0 -35 181 -19 -41 -43 -47 -2 60 0 156 -45 -175 17 -8 -120
3160 -120 -139 -102 -30 50 -41 21 -6 12 52 6 83 -44 -45 56 -184 60 22 -139 9 -47 -54 229 97 15 26 5 41
3187 41 -68 141 -36 162 211 7 -282 131 -276 20 -5 39 -4 32 70 102 -193 -79 18 18 149 6 136 88
3211 88 -215 -50 -58 27 -2 55 -115 -100 68 -77 237 -40 32 -35 -39 114 -85 -142 46 -96 57 50 -65 190 -92
3236 -92 124 89 46 47 -29 173 53 115 -6 -37 12 148 -58 200 64 -289 14 -47 -11 73 25 -22 19 -8 -18 -198
3262a98K96j21J25p0p9j2K4Q8mK2M4j02J03j11o0P5n0p6J64k0M0O9k91R2n9R7
3288a4J49j29ml0j6k43J43R4P7Oj29Q1j7n1N5L0J4j5n1K4J91o4k53qK70k74M7
3315a17O7j16J05M9p7J80pj87K05l01K81R7k62J42n7lJ48k15l5PP9r1L11ml63
3340a64J49j40L11j73rrl36L03N3r8K29j20M8RJ2K5n1N2o4n3L4J36j29M3J0o8
3366@J6k2O1j6J54j19J25l15o6K2n7K09j02K08Lm4k41J73J48j4j42O2R3mo1k38
3392a67L21k2k28K71n7j60J6J1J0O9o3j99J86L7j07O7k67J81J13R8k08k2J10K68
3416B58l25n6J90r4P2k18J91K1j31L7J31l3p6J07j19P9J39l48J15J13N4k72J68
3439Cj1k1k2J48m1r2J13j67J27R5j49J61j71k0q2O5J58K5j72O1oj23J31j5J31
$$ plain form
3262 -198 98 -23 102 32 -47 -59 -35 53 49 71 115 13 116 5 -55 20 -30 -106 58 38 78 147 -144 -52 -111 -14
3288 -14 135 6 2 -28 -44 -287 -144 -50 27 33 -96 -15 -32 -83 -28 2 16 1 -50 -26 165 101 -152 -160 110 -164 -117
3315 -117 -50 -166 -61 -12 -89 91 84 -103 102 -199 82 179 -83 59 2 -1 147 -68 -103 -96 -17 -108 203 199 -164
3340 -164 -15 -155 156 -17 -26 -35 -371 -68 -15 -113 116 -4 44 53 65 90 39 91 27 -26 8 144 15 58 68 0
3366 0 16 -6 55 39 193 74 199 -116 -182 -160 -217 -8 -110 98 101 57 -184 -11 137 123 -19 43 136 132 71 -167
3392 -167 154 132 -96 175 118 -42 -26 -15 -5 64 1 -198 -12 25 -82 -15 -282 -101 12 110 -98 -120 -10 258
3416 258 -67 -123 67 -27 45 -173 18 39 -92 -55 76 43 -33 74 -45 34 173 -175 -60 53 107 -165 3
3439 3 -8 -29 -51 97 56 -36 77 -90 37 132 -17 144 -27 -47 -129 -64 94 119 -53 8 2 -121 10 -5 126
3464A26j86k8J17j24N9O3R9n3J4j24M5K4r4J01J65q2k21K04P2j87J24k11J06j31
3488a22R0J46j46J81j09J11k14J09N0n1n3O3N0k2r0Q4p9m8K12j56J24o3l1j7J8
3513C7QJ03k2j37q7m5L32j67M5m2L3r5J28n6j72K35l51K10J13o5K76l79K76j46
3537C2m5M1k8n3R7P8o8j43rL37j82j64q3L90j74m6p5L5K9R3k21J89K0n7Q1k45
3563a71R9R7o9J2K1j20Q1J42K65k24l09L28n7j05Q3P7j63j46L09k11k2q7K04O
3587D0j33kJ20j35K16P3l15Q5J18k1M6j23K22j60M5O3K0r5j73J68K54k78j8lL5
3612D9l6k6l5o8j10K73j00J26Nj25l4P2P2j15QJ14R6l00K96k01M9L6j60Q0Q2L8
3638H6Q4k13L9nL0J07j6r7L7j36J23j47j26M98l52J56K4r0n2J15q7Q2l58P9K95
$$ plain form
3464 126 -60 -88 29 -95 -36 27 126 73 87 -37 8 32 -62 39 204 122 -99 105 177 -10 114 -97 9 -122
3488 -122 -32 114 -32 149 40 151 -63 46 96 45 -8 55 105 83 -7 77 -2 -50 162 6 130 67 36 19 37
3513 37 45 148 126 -11 -98 -143 189 22 67 25 58 -37 91 35 -137 98 -253 -43 70 5 281 -98 178 32
3537 32 -13 28 0 -53 44 122 54 -89 -98 239 57 -107 -190 200 26 -20 -95 -60 -31 62 -159 30 50 -7 74 -171
3563 -171 -72 25 -44 -32 -11 -131 -50 92 357 133 -176 152 95 -10 73 150 -13 -159 150 -61 -83 -170 34 40
3587 40 -93 -95 25 -110 106 179 -136 -51 67 46 92 -31 191 31 76 139 159 64 -109 59 313 35 17 14 49
3612 49 13 -13 -48 -116 -226 47 -53 73 78 -47 -81 -9 63 -52 -44 70 166 -134 162 -39 10 46 -114 -34 48 86
3638 86 170 -43 -4 -9 21 128 112 15 52 -84 39 -108 -234 264 -88 68 92 2 -50 65 -22 60 -298 -219 76
3663G6n3k7o1K97j69n6j53L9J24K5r0q2J12j55R5J0K6m3N6j05%J79or5J30n6O3
3690H1p4np9K51k83K20k14J01l6L9j28K22K8k99K70k6k11j33P2K09R6k64K15j13
3714f1m5J45j02q5J92JM4j08N3j48M6J44j45K50j87j21K02k26L18j80j3J9J00
3737I3j80J34j03J43j33p5J27K0j06J50j60J30%k06K03n0J12j09j6Q1j43J90J05
3760B07j74j16QJ1OK02n2p9j4P2o8p8pJ20j31K30j45K8N9j75j2K7j04K10k05Q7
3786i3J08o4J5J59j21J08k00Q4k10J02J93j67M8J24j7j85J6J31O7j50J1k2J93
3809A30k4l0rr4RJ40qk36J06r4J94j3k7J5O3q1j47J97o5L7k04n5J75J3pP2j42
3836h5k26K39M8r0O4O0J36l06K66p1j38K82j79lj55k9J91k4P9j12j92K63k25K89
$$ plain form
3663 76 23 -4 -65 232 63 7 -146 -107 17 42 -48 -130 -18 -173 -78 -68 -42 -85 -29 -134 -134 45 39 -56 74 18 81
3690 81 7 2 -77 174 -109 111 -103 -2 -38 1 -127 95 123 -176 94 68 -143 -276 -204 5 101 -163 52 -61
3714 -61 -106 39 -63 -148 44 45 89 -19 34 -114 -68 76 -69 181 -6 -127 75 -151 167 -13 -26 -7 93
3737 93 -87 47 -56 87 -46 -121 6 26 -80 70 -90 40 40 -166 37 -13 99 -10 -26 55 -88 102 207
3760 207 33 -83 -75 -64 -58 144 92 13 -1 71 3 -75 -82 38 -93 137 -8 20 79 -96 -108 -81 -185 25 -180 -93
3786 -93 15 -49 -34 125 4 112 -88 -4 -214 -112 81 -86 -38 86 69 -116 -100 31 98 -52 -41 -63 130
3809 130 106 76 67 -27 -18 122 114 -122 -16 -110 84 71 44 59 122 41 -106 91 26 63 -141 -196 -21 -8 -15 57 -85
3836 -85 -311 -72 -24 -114 -50 10 146 -160 106 35 -103 179 0 -3 -158 -187 4 -20 59 -53 -245 18 -207 82
3860H2K6n9j55J38j55j69K93j30K89rp0q4q0L09l22K01k12Q2J73q3k46LJ29K8
3884b1L8N6q2o6L5q9L4L27j40J8j90J68q6l3Qm4M2q3J40K3n0N4O3j15J53j30k83
3911b53K92p4k1J42k7K9j51J95O3j50o4J10r7r6j0j29J20K36j74J64r8O6J0j11
3935b8K7J28l8k52L10j19j17J26j09R0l5L6p1pK12j54l1Qo7lO9J10P1Qm09J35
3961a10K63j94k3O0j87J51Q2j54J96M0j07J87j60j15J65j39rN5J09j86J74j54
3983e6P2r8N8L1R2k2j78K0J35j01Q1J47k22j49K10J04j07o8J17K0R9k09q3O2k4
4008f9J38jp3q2O1M9O4p3L2o6K4N9K2N4k9k8k61%J38lJ36j29Q6q1n2P7K4r9R3
4037A1r6M7M1l1J11k95K68Oj20J83o6k18J12N2M8rj07nO1N9r7R5j3j6J34j11r5
$$ plain form
3860 82 108 49 -106 32 -123 -292 1 -129 160 151 81 -3 -83 226 -96 105 -107 -25 148 65 -181 -178 -49 -21
3884 -21 17 73 -9 -75 -40 -129 -95 232 92 110 -80 88 2 -31 -23 -67 -25 -108 32 55 5 59 122 7 160 30 -253
3911 -253 39 -35 -56 86 59 88 -63 132 195 45 -19 91 -6 -102 -112 -241 -121 115 -59 105 7 73 83 -28
3935 -28 -1 127 89 -163 147 28 -89 37 -72 18 -17 19 -52 -59 153 -1 -32 -24 -91 -94 -25 85 156 164 -245 -110
3961 -110 153 -41 -64 -4 -191 -40 42 -112 84 124 17 204 44 -71 94 -45 -54 1 110 -76 98 -56
3983 -56 16 -82 -24 7 99 77 -101 -81 54 -47 34 181 -41 -190 20 124 17 -51 66 86 185 -24 -107 -45 -69
4008 -69 69 68 -5 -87 -26 23 87 14 46 -20 4 63 85 139 110 82 -179 -179 -41 -44 92 -37 49 -32 -84 -7 17 -82 11
4037 11 -85 -38 3 -28 83 -212 56 62 -58 125 59 -159 -47 5 53 44 -63 -68 -7 52 -45 50 37 21 155 44 -51
4064e1M4J89k05R3j43K09L0j19Mj41J9P5j1l9n6j7J15m7Q0o3j11K48o6l0J35j09
4090C3K4j09J32j19K4j1O6O8k22J55J6r9OJ30N2j07J76o9j62O3N8l9J8k18J70
4115C6op7K66l47K3K44k27J07M8k28J16J85l47L70q1j09k21L8K28p6J34j4J01
4138A63j16J12m9m8m6P4q8j2J17k5j06J38p0j9j86K8p6K30j19L44k90J01k4o2
4162b9L6o6O4r0K42n5k5l5q4j49P7J97k08j9J85pk5j9KJ72j70J01k39R2Q6k2M5
4189E7J20j22j5j18K35j40j6j95L35P3k33J0K6o3P4N8O4k80K01l9n3J62k7r6M4
4214F2m1j9rJ43j2o7j44J37J12M9j40k23Q7J62k06J46pn1J21p5j46J55j16J51
4238F9O7j1q6k62K51j9Q8Qj49m2R1r5K7J94N5j71K46l71J97l37J02J04K07k67
$$ plain form
4064 -51 -7 182 -23 70 -73 136 166 47 51 -90 -71 4 -7 -46 -102 -119 -4 -51 29 -34 -145 103 37 7 142 33
4090 33 57 -52 80 -39 -15 -26 40 108 -114 41 57 -42 -36 94 146 39 215 146 -16 47 105 66 84 -134 36
4115 36 30 -47 219 -128 -105 139 -88 19 67 -161 -45 140 -207 163 82 -27 -248 -210 18 -58 76 62 163
4138 163 47 159 110 62 16 90 2 -10 107 82 -24 114 44 25 -161 -133 -209 21 -98 246 -44 57 33 -29
4162 -29 7 -59 5 -85 157 102 77 42 -42 -191 -114 83 -125 -144 41 34 9 -10 -8 164 -6 95 -144 -52 34 12 57
4189 57 177 55 40 -78 157 17 1 -194 141 214 -19 -9 17 -46 28 86 150 -130 71 32 -21 141 114 18 62
4214 62 21 2 -7 136 124 57 -87 50 162 211 71 -152 -65 97 -109 37 30 -21 100 25 -121 34 -82 69
4238 69 136 125 39 -223 28 9 97 105 -44 -86 5 -90 -63 131 186 15 261 -110 87 -250 -148 -44 163 -104
4262a04J99r7k7N5j09J34j51Q2r6J43R0j43j75J80j24M1J76Q5j79m2J94k62J53
4285B3J45l00J32n7j11K71M0o5j18lo3K56j79k1j8J04J35l09L19l40K2L6N4k61
4309c08K77k3p8n2K67j64J96k25R5n2P9n7J49j66r0J92m6J30j96j2j0K9O6J72
4333A73j74J41k0P8m61K43j71L11k80J95L9r8j7j63L35j59q4p9J95jo9J84j11
4356GL8M4j62K4J03J30r4J4j39M3n7J29K9Jk53J24M3o7j48K33j79K11p2n7L9k02
4382b18J23M6N9n4J76k32Q9K09j50j7r4j7K65k45j7P1J54k39P6j63J9K60q2JR1
4407A11p2p8M5K9M1k78J65r8P5j12J78j0m5qj5J10O6j33q3J10J51r0j11k4n5J05
4433b6J44k05J81j43R7K9l9nN0k44J28J49k04R2l2n2J86j54O3J5qLLJ39j45J24
$$ plain form
4262 -104 95 -2 -29 26 -83 51 -100 -18 -114 29 119 -24 -199 -19 -143 -102 74 159 -20 -62 132 -130 23
4285 23 168 -132 0 -57 -168 103 143 78 -40 -43 -106 150 -29 -50 -68 36 171 -138 181 -159 -137 -101 -47 -308
4309 -308 -31 -54 -132 -184 83 -81 115 -110 -15 -67 12 -45 104 -62 -152 40 -6 124 -72 -84 -94 -65 1 173
4333 173 -1 140 120 198 -263 -20 -191 120 -160 35 74 -24 -41 -204 131 -28 -112 -191 4 3 -66 118 7
4356 7 45 89 -73 -49 54 184 90 104 -35 8 -49 80 109 110 -143 -19 24 -43 -191 42 -137 74 2 -55 -16 -218
4382 -218 -95 -49 10 -44 132 -100 -11 198 48 31 -63 -80 185 -60 -77 -6 148 -91 -15 -178 -159 101 19 20 111
4407 111 39 -39 6 35 76 -202 -37 -135 -60 -172 6 -4 -49 -57 -72 38 104 -29 -112 -2 149 59 -52 -76 -131 -26
4433 -26 118 -87 94 -49 48 77 38 33 83 -161 -33 116 -88 4 -28 -80 106 -48 15 30 22 25 28 167 22 146
4459A46j12q3J30q3l4k0n8J94L7j00p9K09j14k09J94J7o4O1M7O3q0j13J64p8r3
4484e8R3J82j68O1k43P4p8n3J49J54N1l46L16j41j01Q6L2R2pj43Q7j33K36r3j1
4509C8j37p2K98j57n0k8P2Q1j00J5J06lk15J74j03J25J6j03J85k77J11Q4o1J64
4533A63o0k04J82j63J41j00K41j39m5j76K7n4J80J11P0l6k26R5R3n9j68k1P6J56
4557H4j33J15J1q4Q7J26k88j18R7N3O5r2J78k19K84j54j58J14j02K53j81K26l71
4580b07K34J50k63L62l01l2n3J13j26O1N5k5J5J0K10j35j33K47r5k22J13J50p5
4603E3R7j52k04K19L9O4l30K98j41J43j49RO2J79j87J30N1o0nk53J61j15N2ko4
4628a05L0J34j55ON4J59l8p2p4J3m0K21k37R3J94L3j14k19K65l26R8J99n3k27
$$ plain form
4459 146 34 -49 81 -2 -36 -56 -114 80 117 17 -62 147 33 -176 18 35 -29 32 79 142 62 -51 113 35 -58
4484 -58 35 217 49 110 -133 -59 -137 -190 -41 113 164 -182 134 -7 -108 -22 10 102 95 -48 39 -94 142 49 38
4509 38 -99 -171 127 -30 -80 -108 -36 45 -55 -40 66 63 -152 22 -81 44 60 -43 142 -135 -24 60 -1 163
4533 163 103 -101 81 -82 59 -41 200 61 16 -160 -133 -187 -7 104 174 138 -88 7 100 41 -127 -148 -72 84
4557 84 -49 66 77 -7 80 206 -82 -200 -103 -50 15 -77 101 -118 166 12 -146 -32 -134 119 -62 164 -207
4580 -207 27 177 -86 276 -25 -57 -110 3 -123 -62 -7 -32 -17 -7 203 68 -65 182 87 -135 -22 128 53
4603 53 150 -2 -206 13 52 116 -214 84 -57 86 -63 -54 8 187 0 130 181 121 116 -137 24 -91 -39 -41 -105
4628 -105 -75 59 -96 -90 -36 123 85 13 -61 -48 -88 133 -104 -11 183 216 102 -117 148 -178 -80 119 66 -161
4652a61O6J06L2J53m6q8n6O7P9k6m1k9n4L4j30J83J71k02k16J69K2M3j10K26k7
4677A65k36J45K72m80K87k16j8j85L29m8p2RM5n4J13m2q1q9l4K79o5P4p8R0j73
4702f3J09O7m5r1j01J06O9o4J33j27k40K08K8O9k9J2r5P1R4j07pm2M7J2j79Q9
4728g6j22L8K99r7J72q9l2J0j64QO0K0o9L8n7J2m6q2J31J65j00J52j57m9KN3K1
4755D1M08l85q7J63l3N2j69O6K3j95R5K10k04Q6Or2L6j34K96r6j84M9m5J36q8
4780d5R5J19j27r9J60k08K87j04k53K35O3k94J88j7r6j7L67k65R7r0j74K87j92
4803h3m3Q6J05j89J38Nj3L7q0q9k6L43j68J5m1l4J84k90L51j14M7j84Mj41L7K5
4829a18K23J59m12J14K98j07j18r5J15k21J44J81q1j18J05j18K02r0j32J52j12
$$ plain form
4652 -161 -95 11 43 196 150 62 6 73 152 126 85 56 2 36 -94 89 260 58 -158 11 33 76 -34 192 165
4677 165 -71 74 346 -134 153 -63 -81 -266 63 15 -57 -48 -3 -57 56 14 -67 -156 -190 89 24 98 20 110 -63
4702 -63 46 113 68 -23 -124 -18 51 -13 120 -7 -247 -39 -11 58 29 41 -54 17 111 4 -3 -45 2 14 -165 -76
4728 -76 -198 -160 139 42 214 125 93 103 -61 -53 7 27 -42 -4 -61 -49 -95 -177 -46 119 19 171 14 -35 -33 20 41
4755 41 449 64 -23 140 107 159 -10 56 79 -116 -21 189 -15 71 77 -15 21 -113 183 87 -97 -48 -93 43 -45
4780 -45 50 169 42 -57 103 -105 182 78 -175 60 123 -171 17 0 -96 -113 254 -11 86 -4 -178 109 -83
4803 -83 -126 -40 65 -124 14 19 6 43 -37 -126 -152 191 23 38 -3 -37 147 -143 208 94 141 -43 -39 -180 -143 -118
4829 -118 105 264 -148 -34 264 157 39 -56 59 -162 -18 163 82 -36 69 -49 153 63 -69 83 -29
4850b9j00J95k7rk56Q1J46p1M5m2Rj6PK47n8k46M5J38l8o0j4J1N0n0M7j4J62j94
4878d1L1l9N3O7o5J45j48N3j07R7k45J68J3J59j21o3j65J95j37J29J57pj05M3
4902F7j41o5J62m0r1J51q0q3J49J66k55j9J17J29j20q5J17k48J36M1l3j7j32J72
4926bM7Q7j03J38p0j59J47k13m2K23j47R2P3p6p4R3j11J90j49J26j55O8J70j46
4950Gj0j46K74o0j01K52j24j05J14n7j23J02o7Rjm5N9J08j20J39l9jl54K18N8
4975a3m7K15j00l9k48J58J62l04K15j47N5m0J59L6J09k45N8o2K4k37J88J87k09
4998a25P9m6L7J0L05k01Pk38K25j01L2m7Q9n9J26j73L02q1k53J25l8M3k3J18k02
5023h9Q7L7j74K01m4p7L65l56Q6n4K6J25j30p7O1P0j11P3J66j93R2J6k03N1J71
$$ plain form
4850 -29 -129 66 39 30 -226 -145 1 -70 -25 -67 -58 -74 -67 180 122 -124 -79 59 21 -39 -53 -42 8 -42 5 -9 153 -41
4878 -41 -10 -49 4 71 6 151 3 56 -51 46 -199 -31 -18 141 20 -43 -208 -13 -150 -21 136 129 24 67
4902 67 -74 -139 23 -17 -108 43 -37 -120 29 195 -60 -79 38 167 47 -38 79 -169 -33 8 -25 -42 -174 -2
4926 -2 45 132 29 167 97 -62 85 -128 -170 53 -94 -2 71 -5 -79 14 -97 93 -56 70 -85 -17 153 7
4950 7 -3 -149 125 65 -36 216 92 -13 101 44 -79 23 -44 -35 -36 -81 -22 86 -34 105 66 65 -289 -71 -13
4975 -13 -60 155 55 16 -232 -74 88 -216 -1 -148 -93 -133 26 62 171 -74 -16 -78 -54 -291 -103 84 -125
4998 -125 -46 -92 -55 -45 260 59 66 -172 53 -48 -16 -63 26 -33 93 -80 222 141 -112 13 -25 18 -5 113 -89
5023 -89 -2 35 -139 62 18 -59 306 -50 36 -18 8 133 3 -74 -13 57 -54 19 185 -8 84 100 -103 -52 119
5048A19l37K81Q8j99r9J74j7oo9K25k87l3K23j29K75o5k75J88l0J34J13l74J00
5071@Q8q1N2L0k63J90j14k6J55jk10K32o2j66J77P8k9K8j40O8j26P4J86j7j62
5096c9N4J33j66J6O4q7o2L08j05n2j58O6o5J33L4k7N9n4J81l17j5Q4jM7l6J25
5122A20j98J13j47J79k42J01l8K25j51l7NK09k10o5K5lJ0j38QK79n4L7l11K85
5146BJ35o8j05J21J6k20K33j55OJ47o7l6k41K05M1N7k31L86l92P7R0o3R8j4j6
5171Fn4J8R0m8r6L31j39Kkj22Kk1O6j10j3Q0nP2o4O4%k49J88l2N4p2K15j6l03
5200a58M0J01N7J9j07r4J73j1q1%K7N3N1j08n7Q9J41j11j44Q2J87m86L01J37q
5225I3L5k28J30m3j24l3P6K38p5j52j2J37J57j96jj0K16j95J57l96L26k28J53
$$ plain form
5048 119 -218 63 151 -48 -147 27 10 4 -65 160 -127 -160 63 -66 209 144 -131 57 27 161 274 -100 0
5071 0 88 7 59 89 -174 16 -98 -124 31 30 -180 52 -10 -176 1 79 50 78 -62 6 -120 -46 140 123 -39
5096 -39 15 148 -18 -2 62 -25 -87 221 116 64 -94 -28 -93 40 74 47 106 52 233 -84 -99 -15 -16 31 -5 120
5122 120 -78 35 -112 67 -175 -74 -112 113 -38 -75 -70 139 -71 -136 -111 -114 -104 -242 -234 45 -9 28 -283 2
5146 2 137 69 -36 85 101 -119 114 -41 -35 112 45 9 -232 -27 14 71 -160 226 -166 -89 1 -62 36 22 6
5171 6 -48 -30 60 12 -84 247 108 110 108 -14 -12 -33 33 -77 -90 -10 -15 57 -7 57 57 -192 -4 -36 18 -54 161 145 -158
5200 -158 -118 -17 40 59 -48 -142 31 20 -61 -61 -34 19 70 -38 -95 -6 135 24 -120 -38 149 -337 -36 101 93
5225 93 128 -100 30 -13 -137 -170 -94 144 69 -83 -95 42 199 3 2 -8 208 13 170 -226 100 -128 25
5248B5Nj48J3J87J9j56K6L1j20KJ47m9oj30Q1K9mj77M64j03K5r5rm7J94l8j74
5275hpJ53j9j75J69j78J38j05J11k0n3l8m0K56k61j12K19j82K46j50o9M7OM5o7
5300i4K79j77J01m4K12j96k6J5k17J88n2J47l0j53k2J21K5M5k8j60Q0J67k22N3
5324A2M0J34j23j0J36k66j6j95M71k69J65j30nK10k56Q8J49k5n5rj15J63k52J78
5348B0P8k00J31j8J45q5p2N2j32K76k05O6k32J38J22p3p9O5p7L15r9j15J3j66
5372a32J76Q2k3r2J07j41j14K13o5Pn1L9j34L22j58j08m1J43N7k54N13m44K9Q3
5396A4k4J19j08J56j97k01K94j41O9k60L48j41J5l5Q5j06L2L18k89l3J46j41q
5419h8jJ32k3k5M2K15l07N1k1N0q8j04K03m8J62l34k2J04J25l3l0J99k53j7L0
$$ plain form
5248 25 30 -118 -105 82 101 -55 -29 2 -118 -116 31 -18 -24 -154 -73 -44 -48 -225 239 136 161 66 57 10 204 166 -8
5275 -8 -15 138 119 -56 113 -65 73 -32 79 59 6 -32 -72 184 -77 -189 30 -152 94 -56 -125 -78 -72 -27 -94
5300 -94 185 8 109 65 277 81 55 70 -147 41 -11 136 106 -47 -69 52 77 122 94 -66 14 181 -41 12
5324 12 52 186 63 53 189 -77 -93 -288 183 -86 79 -51 -56 154 -102 -14 135 110 55 46 -69 94 -158 20
5348 20 98 -102 29 11 156 71 -1 51 -81 195 -10 56 -176 -38 84 11 -68 -3 -80 235 136 21 34 -132
5372 -132 44 126 103 11 118 -23 -137 76 11 18 -33 6 -128 194 36 -72 -113 30 87 -167 346 -98 -69 14
5396 14 -10 109 1 157 -40 -241 53 -88 -19 -279 69 -72 -57 -92 -7 -113 -81 237 -52 -85 61 -80 -88
5419 -88 -89 43 20 -5 37 252 -55 -4 -25 25 -63 -167 36 -12 150 -184 -206 -102 23 -10 -40 159 -94 -111 -81
5444h1K26q7o4k01J58J75j69M8q6mP5J60j86J00p6Jj52P1J44L6j81n7N9L17j03
5469A23m7j01K4P9OQJ92k46L3K7N2m1o0j12J67j40J04pj46L8L8l3J15J52Kk04
5495B3J05j14R8p3k24K29j35J20Q1k45J6J97j04J4J10K2j03J14n8O5J79m87J80
5518A0j70K19j00J46j4k42Q6oP2j6r7O4J90k72K05J11j84J21q3J60k78N5J72l14
5542a65K42N2k03n7o4J58Kj31K71L8j24j50J36N9j15k05K52N7K4l3m6K11k69J43
5566H3j40N4j40K99j24j41J59k8o3j1M4jJ8n0o3J4j35J6L8J92j13L48j51n1j13
5591e9m2Op3L36j16p4N5m0m2R0M6j73J46j83J21L08l24p5m4K76m9N9N7j03p7K0
5617D6J2j66J13P5m3K3o3k0l7J8n2p2j1K04N7k96K89k1p9L8J39n2m9Q6r3l1q8
$$ plain form
5444 -81 145 58 -6 -207 -49 126 -43 5 -81 -85 -10 150 -36 64 -12 -11 -163 -92 52 88 -93 -150 -91 226 123
5469 123 76 -25 -1 78 84 92 284 38 71 98 150 109 49 -63 104 -36 68 61 -85 -47 -9 -42 73 225 227 23
5495 23 128 14 112 39 -185 44 -91 29 110 -135 -119 78 -26 -12 98 120 17 131 73 138 317 -170 10
5518 10 -160 59 -41 105 91 -151 -65 -71 1 -15 -112 -48 142 -130 75 186 2 123 40 200 -78 -23 149 -165
5542 -165 77 129 -74 -131 -195 -37 -35 -166 105 143 19 -131 5 64 -51 -256 -4 53 77 44 -2 209 -60 83
5566 83 -57 -3 -143 156 32 -109 50 22 -41 -52 -8 -9 9 -41 -104 -90 -225 -209 -171 21 -92 256 105 54 -59
5591 -59 -101 -95 -168 168 52 -22 33 -7 -49 41 87 -86 60 -123 -2 306 -18 -93 -137 139 90 149 206 103 26 46
5617 46 58 -108 5 80 37 60 -3 -23 -60 -42 -94 -166 -177 27 84 -212 77 56 -23 15 154 102 53 139 46 15 -73
5644g3R0j03K7k33L80L2r3j25kK65j01M8k04j5J31k3l5k0J4o4K18j17O6J01J6
5669A80l96K1K70j60K21o4J05j27j53J08j45R3j19M60m51J75k8k29K35k1J58k03
5691g0K71k10Q9r4OJ5n6M5l1K06j09j70J97j22L4m5Q7%J25l76J36J22j37J14N1
5716G8j28J99j7j44j37L1R6R2j75K61k85K21Nj11p4J44l5j36J19q5J42n9j80J45
5740c3K32m0j98O6Nl9J04n1m1q8L6R3J54l31p2q1L85j62R8j28K08k62K59J1j74
5765d9J84j73l8L2J51j72j14M10k74J25J8m6O3nj14j31q9K27R4j47K5l8N9J39
5789A37k4q2M6o3Q9N3p1j05J17k40N8J59k39K24N9k39N7qk0J18j81J71L1m1KL9
5815D7Jk19K10O9j42lr4P6j73K48k2n5P3m7O4p0Q2j90N2K02k73J46R5J8j73J95
$$ plain form
5644 -73 17 -86 -59 -292 88 120 27 -98 -100 165 64 112 -92 -107 24 1 -34 -54 -40 -104 114 -3 63 164 180
5669 180 -216 -195 75 -85 136 72 177 50 -103 5 -140 -47 -166 294 -157 18 -10 -239 -4 -25 133 -70
5691 -70 201 -9 80 -14 -8 7 -49 -4 -35 171 62 -108 89 -33 1 -44 43 43 168 -208 -72 50 -87 27 78
5716 78 -50 149 132 -12 -149 -118 -22 70 -105 156 -129 92 97 -14 -88 56 21 -115 4 -81 61 2 -178 -33
5740 -33 199 159 -39 27 32 -7 97 46 5 -83 -47 46 200 -131 -203 -284 101 -61 37 -91 117 -145 114 125 -49
5765 -49 135 -38 -76 -44 107 -65 -179 231 -43 82 100 54 117 112 -2 -133 -222 5 99 -48 -23 -61 -2 137
5789 137 113 31 77 14 103 156 85 -20 97 -143 -85 74 -165 59 118 -121 -64 -72 -92 26 -155 16 47 6 8 47
5815 47 48 -171 39 108 -34 -37 -131 -55 -228 20 -2 -57 16 -31 33 -37 45 -145 -93 109 -164 -18 77 95 -78 117
5841A17j53J41k51J48N8j31N8n2K14k90J02N1K1j02K85l46K08j88J04OK1j30k3
5864a32K46j20j63K32L4m9l2P2o9j3K26l56QK31J2j30k07J95M7m9J44j40O6j27
5888g4J63k69K67k47K38q6P6j87J77Q4p6j8j29Q4R6p9L0j04J60k6r3J14j85K4
5912f0PL5Q1OK5n6J19j81Kj34K57j93M1m2K20k60J31n9M0J02M2n0j13J98r2r5
5938b9J7J36k29J10l0j30k9J30k8J06K14j84j39Q2j36L45l08M4J90k06j46K87
5960F7r8K3M8k5j20Q8r4O6L2k21K58p8R3r4j67J69O6j2m7J78j51J39k44J37K01
5985B14j40r1KL0l4O9N8r2N8j67J51j77J69j06m9J27j5r4J56r1j15J61k60K54
6009A8j06n1O0R0k3P5k48J08J91j57K89k26j43L4J93J12j93q9JJ52j85J72q9K53
$$ plain form
5841 117 -36 105 -146 2 60 -71 -13 -65 149 -141 -39 12 33 -69 216 -130 78 -110 -6 0 21 -109 -132
5864 -132 114 -6 -169 63 97 48 16 88 19 6 232 -124 -116 115 127 -3 -210 -15 32 -17 127 -13 53 -74
5888 -74 89 -180 87 -160 78 -8 68 -119 58 142 66 48 -81 3 99 20 50 -54 106 80 -13 101 -84 -60
5912 -60 -53 -18 63 69 94 38 157 -24 -22 -156 101 -92 -51 -93 127 -133 -2 -61 -21 81 123 73 -40 158 66 -29
5938 -29 -12 124 -105 5 -25 -155 -184 -54 -82 24 238 54 -85 -3 -139 206 -102 -58 132 -74 -220 67
5960 67 -31 -8 40 15 -105 -17 -111 -45 -13 -234 24 -54 39 -55 -222 -53 13 1 -46 132 -19 120 -124 13 214
5985 214 74 -17 -15 15 -19 50 108 16 74 -93 58 -119 50 -56 -105 22 7 -87 69 -22 -137 24 -236 18
6009 18 -88 -139 -79 11 -12 63 -185 -77 114 -43 246 20 -123 -89 104 216 23 -66 -65 87 -98 74 -15 238
6033B38j10l6J07r0J70k65j3m1Q0R9j22m1k2J65l68K75J37j46j5Q2k5k93K77P2
6057A15p7J22k34N8j54K15om5M3Rj8K02k08N5N3k10J71j44Q4q8L06k46L12m02
6081h7J51rj92K97j33L3k41K07j53J33J78j97L9o6J12J1j20J65o7m5J66l7l57
6104b12L05j82J12k03J78l3k8K19k65mJ29J03n2n6N9r6K5M6r4p1K75j1j18J21
6128A47p2l54K39J32J16j52L0j57M3j08K16j20q0K20n5J32j04o2J17k57J3J03
6150a3j12J45Q3p8K2j31L4J32M5J8j06J0j12J25k53K78j26J61L9r0L0j15l8L5
6174a7J4J19k21J72L5k47K26p4J65j6j16j11l7J29p0J11J22k30k6o6J78j35K34
6197A39k0j27N5j97Q5k7J49j61J45l5M4k1k40J99M6j27j68L31j46J68k2j13L2
$$ plain form
6033 238 128 92 199 109 279 14 1 -40 40 139 17 -24 -46 119 -249 26 163 17 2 84 59 -234 43 115
6057 115 38 160 -74 -16 -170 45 39 -6 37 46 28 230 22 77 130 -80 91 -53 31 -57 249 3 315 -87
6081 -87 64 55 -137 160 27 60 -181 26 -127 6 184 -13 26 -40 72 83 -37 128 61 16 182 145 -212
6104 -212 93 -89 23 -180 -2 -35 -63 156 -109 -113 16 119 67 11 70 -26 -1 45 -49 -120 155 144 26 147
6128 147 75 -279 -40 92 208 56 86 -71 -28 -136 80 -40 -120 100 45 177 73 11 128 -129 -116 -13
6150 -13 -125 20 103 25 47 -84 -50 82 127 145 39 49 -63 62 -191 87 -39 122 161 71 101 -14 -52 -17
6174 -17 -3 116 -105 67 102 -145 81 7 172 156 40 -71 -108 21 -49 62 184 -46 -72 -138 40 -95 139
6197 139 119 -8 47 -150 -65 -92 57 -104 41 6 50 29 -211 -12 34 -93 -261 70 -76 92 70 -43 -11
6220a1l9J94o3O1k23K4p8K24m5p7l1N9K9K9j51O9M3j98M45p4k97R0qJ11j3Kr8
6247b6j39P0K1K44j95J43j3k33J55j23J29j44J19J7j93J75K9J54l15J66j45P9
6269b5K09j11q9J53J4k69O8N1MK00k52R0K07n7k8j25Q5j39q7j49R0L2J35q2J13
6294C8l5J04k5J38j87L5j64J25j1M9j4n9Qm3k6K20j77J43J79k95Q7j09j47K91
6318A25k24J42O2j63j13N8J61J05j49kp5J20q1o3M00k27k83L0K05j46J03J44j23
6341FJ9j1k1j2J42l5j33q8P7M1m7M1J86L2m87L40K9k13mJ21K20j57N1J28l64J07
6367c2J56p7lN5K3l00k0K68k4j97P9L7J47J08j49o3J23o4P6l04J49N3m6j25J70
6392D0j13KPJ12j46K84N1k08j2Q2j83n9J32J3p4k3P7J79n4j55J84l11K40j15l4
$$ plain form
6220 -11 -50 144 81 142 -81 -57 -135 89 44 -33 -64 -5 24 53 -98 -29 14 -184 261 187 -110 -20 -28 83 70 72 -26
6247 -26 -165 -95 -74 170 -25 118 105 -128 27 -96 33 -111 8 25 -168 7 36 190 -125 41 -104 -25
6269 -25 184 73 -16 137 151 -118 -50 1 5 205 -47 43 250 193 165 40 125 -14 -101 -250 -160 -128 7 -75 38
6294 38 3 107 82 220 33 68 -96 29 18 67 53 -6 2 -41 -67 153 -24 119 298 3 90 -19 -166 125
6318 125 -99 43 105 -58 -171 -113 48 153 4 2 -73 47 -34 -97 303 76 -207 -177 28 -118 -15 129 6
6341 6 25 14 -7 -19 123 88 -45 -133 -56 -15 -62 -21 165 197 -290 50 79 -134 -138 -17 203 46 97 225 -139 -32
6367 -32 124 47 44 99 122 -178 -198 70 46 -151 -72 -35 112 220 71 8 131 67 143 -161 -12 41 -5 -130 40
6392 40 -73 -71 -64 48 -98 186 237 29 17 99 -84 -143 -11 2 -72 -95 -18 161 107 -48 136 -175 65 -50 -84
6417h4N2qL6k01J00J24J34j36PJ09o7o8j79M5J79Mp1J6J2J23j64J06kj39J87k47
6443a32K29k27Q8J52j73Q5Q6l8j8j23P9J51l04M8J0J17r8J03j25K93j66J11j10
6466C8J11r2p4j8J37j16J7k1O4j00R5k05j1K58N1r0j55j3J47m0j67J08K77k24
6490b3k4J73k00O5k6n7K53k51J11jQj14K23o6j15NJ34p0r9J23nJ08j59j20K02
6515G5j70j6K03r8P9L6M7k04l6j4L70m04J41J2Q3o6p2J93j71o0Q3o8J76k70J6
6540a35J47Q5l76K70J69O2q8k49r7K92j44J83j54J98l30P8J98no7n1P8j27J60
6563I7q8L3o3M0L9J2p9k9N5K38k81N1M5Q4q7o9J3J28k36J02%j18%N9J50J4j7m9
6591D4o9N9j67R1j05K10j61K60j52JJ19k57L9J50j64J47J4j19K0j27K19j30P8
$$ plain form
6417 -84 -32 -40 -4 -205 -105 19 153 17 24 133 66 -2 -181 -136 43 47 -24 -8 4 127 -37 69 67 -72 115 -132
6443 -132 97 -130 -42 110 -63 22 108 70 52 -71 8 159 -145 -97 -87 30 -68 35 -90 203 37 148 38
6466 38 149 57 -17 -35 102 -14 3 -18 46 -54 41 -164 -175 83 134 44 -111 -124 23 -17 -184 -76 201 -23
6490 -23 -47 126 -74 -9 -35 -92 161 -90 21 20 28 -86 137 71 -44 -39 95 25 -74 49 44 152 -7 -127 75
6515 75 -95 -111 92 -6 73 109 156 -48 -84 -98 272 -132 9 21 104 38 -34 159 -12 -72 11 -57 119 -151 -135
6540 -135 12 97 -279 -9 160 222 134 -115 -212 80 -64 119 -35 163 -167 -89 109 104 37 -14 64 -63 97
6563 97 9 42 -21 19 58 70 -9 -38 17 255 -26 25 70 154 67 -2 11 139 -97 5 5 -113 -113 -54 96 110 93 44
6591 44 -25 34 -133 -42 -147 63 -98 162 10 11 130 -127 -88 62 -102 45 59 -60 -40 -167 52 -78 0
6614@L5P4pj11L2j74K78L3l28j8J20R3oJ0K0m39M19j12J48o7l3K23j08n0L4K8
6640I4p3kK3R0r9K2j05P7j2j05J92p1j75J20J45N0j76J50q6j24p4J18j5r1J05
6665b2J76qj11j04K88p6o6j86K1k0j1L7J91J7j78J06j5j23J58R8j37j49L71l05
6689d8o5j7M5J41J2q1J57j49l6K81j49k91L49l20O3J23O1q3m0K5K2l9P0j34K72
6714A69k25q3Q8j48M33j99j52K34k8M8k13J1K1K09n8p3p5J15j05J66k14M5OL7
6738Io4K34j67j1L2j11N3M2On2J12q8j20K11o1O7k45k8K06Q5j36o7J02k8p4k6
6764a19L3QJ22N4M9o1p5J6j39K57k80L3Q2L1o0O9k4n6N9K04k99J33k10K82o9j24
6790h4J1j56K75k31J49r7l9R7L33l46J36m0K9J0j42K73l4k46Q8M3J7j80o7K72
$$ plain form
6614 0 35 109 102 -9 23 -151 127 160 -168 -186 -66 27 21 31 51 -388 31 -81 67 0 -33 190 82 32 66 94
6640 94 21 19 42 132 33 55 -50 27 15 -90 102 31 -144 -24 121 171 -5 145 59 -65 -139 -21 -36 -127 -22
6665 -22 154 146 35 -69 219 143 77 -109 -88 -108 -119 -82 109 126 -52 54 39 -84 74 172 35 -114 257 -48
6689 -48 -113 -130 -85 56 68 -13 144 -5 -41 240 91 -200 149 -171 -108 15 76 -7 -47 -22 0 -39 31 -103 169
6714 169 -56 -139 -51 -199 234 35 -117 117 89 137 -76 -65 -44 165 107 34 -41 74 -31 135 -79 -34 -28 9
6738 9 -55 179 12 1 33 -78 -25 17 23 -29 83 -5 -125 86 25 92 -153 -181 25 110 -26 -93 9 -19 -93 -119
6764 -119 -86 -78 44 98 147 86 11 27 -112 145 -135 -102 -20 11 -49 20 -4 -60 -1 203 -96 37 -173 109 40 -84
6790 -84 -73 -229 46 -185 -36 -133 -172 -75 258 -88 48 8 37 47 -95 178 144 -102 -14 29 46 -134 -201 71
6814G1j86k23K81R7j1QJK5m4O5j35K83k90J34r5R0nL2j14J01K0J4m8k49qK20j11
6841g7J13L5l1j55K18j43j55J44L6p6J35j63P6J9M3J5j26N9q5O8K2K41j03k00
6865i0L14k23L7M5k5L8k11qL7O3O8pk15K11l3Q0n7j20J06J70k03J5l8n9j71K52
6891b4K25j09pl5j09R2Q0o7J68k81M9J10r6J06j03M5J29j86J6j10K31p2j26o6
6915a40L3J6K82l56K67j90M3k12K04Q0m9J11k69K03J72j94j11Q1r1J28n7j50K87
6938H8j2q3j22j00J02K9k7K67k8j08N5j69L54j47o4J48k55p6P7J42p7q9J44PJ9
6963G5j0p6j88K7l7L58o6l45L31R7k96K03p4j85K73l02K97J4j59K52j26j42k0
6986i9r9K19k2m2j8k8R9k8J79k96J51J61j17P2k10m3O0l4J68Nj99l9J63n9R3j8
$$ plain form
6814 71 -115 -338 -57 40 29 37 38 63 19 84 -51 232 -58 76 -19 71 66 98 -16 85 105 119 71 -178 -186 34 -77
6841 -77 36 71 40 -115 103 -40 -195 -51 -15 -91 44 -119 -43 -24 19 34 -92 -33 -118 -50 -28 213 110 -90
6865 -90 224 1 38 83 58 96 -115 -123 -86 -23 45 38 -177 34 1 81 24 -96 10 180 -23 -8 -46 -105 -276 -24
6891 -24 201 92 85 50 -59 33 113 46 214 -67 -18 92 -4 102 -1 44 173 -13 3 -107 124 52 -74 -140
6915 -140 -107 -91 191 -165 102 -88 -45 -257 -53 27 -22 89 -180 23 195 1 -110 -29 -120 8 -49 -199 88
6938 88 76 -7 -129 -229 -127 -98 -125 142 114 6 61 -108 246 99 35 183 -72 -148 -71 71 -6 -95 49 56 75
6963 75 65 -11 -199 -172 -209 149 83 -262 69 166 -130 73 -1 -186 87 -215 82 96 -63 189 63 -79 -99
6986 -99 -198 21 -1 -43 -61 -89 10 -18 161 -135 16 177 60 132 -78 -121 -61 -95 73 78 -121 -160 3 -56 37 19
7012A9o7J15m1M1q3L5M7r9l9L4J68Qk80K0J30J30l14J27j28J02O7J99j68L0OL8
7038I7l7j82K41l9n2J9j81M0j03K7J89J84n2k94J63j27J93j19Nm2M6J17P7l49
7062a79j4J34K8L08k95N2K5J14ML6k75J29n5L5Oj16K32j34r2J84j17m5J38r9r
7087eJ74j35p2N9m7J0q5L14l02K40l8j00q8q3K28r5O0Lj02JL1r6J34j30Q7O6M5
7114G4k2J10j42JR3Rk10J27L4M3o7l0k5j58N9Q3m3o8J32L2O1j58M5J59l01R5J9
7141d8j0J67l29L34n1k5m4J78j19n2p8J11P5r9OJ10J3j12n7O0n0J73j59O9j2p1
7167b0J40j52J47j59rL03k01j01J00j9R6j08L3J7P0j62j2j12J93n9m2J26p0j4
7191a5k17K64j09K52l57L03k5j71O1k26K80l0O6r6O5P2L7j90O1o0j90K96o0R0
$$ plain form
7012 19 -48 67 26 67 -16 19 66 -33 -72 -38 130 138 -142 -122 8 138 -176 -49 -177 -75 -8 191 23 53 59 97
7038 97 60 -122 119 80 28 47 -134 -94 -197 -170 19 203 151 -143 20 -107 86 -33 -28 -70 -24 93 170 -179
7062 -179 -193 -59 -31 277 -18 34 59 173 177 213 -62 67 12 47 53 -63 169 35 -57 127 10 -35 103 4 -5
7087 -5 169 34 -38 21 -26 -16 -101 213 -89 151 113 13 -75 -158 70 -25 35 38 -64 -63 -32 -128 6 -124 -37 29 74
7114 74 52 162 20 21 114 123 -87 40 74 117 50 20 -5 -163 -104 -21 -64 -132 0 32 93 -65 -20 139 -162 -67 -48
7141 -48 -58 109 -220 114 63 38 -6 172 53 1 -77 34 109 10 16 126 139 27 -30 30 -20 153 -6 63 51 -20
7167 -20 120 -32 115 -44 -53 250 49 -52 48 29 125 17 50 67 137 -25 -37 -149 44 -15 -57 69 -1 -15
7191 -15 -232 32 -77 175 -182 121 96 -75 -14 -240 40 10 76 -20 45 117 154 -36 25 -35 -225 71 11 101
7215A01j45J32J26l94N8K28j02o1K61k45k4J78k3O2p7j1N7Q9k24L8n2J30Lk46
7239a41L75k94J07j35J30L3j46L0j50L71l13JK01j01K84m03q3J65o2P4J79m5M2
7262A19k76J35L8j70Q4J08J75p8k02J68M2k38P3k58K29O7j97P6J85j85K1L2K7
7285b5m0K1o3J70j5J78k49K0Q2j19M1j61L29J1l24J94m7j36J48K41k98j4r1o4
7309b11L07n8k33L84r4j98O4j7J13oj08M8j06J07p3Ln2R4j95K78p0M8q0LN8Lo0
7336e1p3j21M53l74P2R4K27j42j61J38n0q7L3J4P6l7j06R4O8j25m9kP0J11k42
7361a70J17J03K3l0J32j87K79l30J58l7j97R7J55j28p4N3J36j16q2J78j01k7l9
7384h7Q4j00O7r6Q7J7O3m1j82J0K02K26l84J10L2j41O6K7J12J87j09k57J05n9
$$ plain form
7215 101 -44 88 214 -180 -122 106 4 -57 204 -41 -65 113 90 152 75 64 121 210 -14 24 -28 102 105 -141
7239 -141 234 -60 47 -88 42 75 -71 -41 -191 180 -133 -132 69 -32 252 -151 -234 -69 -131 -57 122 77 119
7262 119 -157 -22 16 -154 -70 38 213 135 -67 101 143 -95 -22 -280 -51 16 -181 -105 80 -105 -84 -52 -25
7285 -25 -65 -44 -107 63 48 226 -23 -3 79 -40 1 -160 169 180 -144 50 3 -133 15 256 -42 -56 -147 -211
7309 -211 96 38 -195 189 95 -103 -39 -56 57 51 -57 -9 -115 -8 -81 -78 -130 -36 -231 47 -23 25 -55 -52 6 9 -51
7336 -51 -124 -245 208 -166 -94 0 227 85 -76 62 12 -75 -42 -28 48 11 -95 -1 67 -58 -107 -109 -39 72 -170
7361 -170 -53 50 73 43 175 -12 267 -63 95 58 -139 -42 113 -15 -89 -36 100 -16 -98 80 -21 -48 -87
7384 -87 -3 -103 -36 -132 -45 -28 35 -6 -188 -178 24 250 -134 -24 8 -133 -67 -40 72 259 150 -107 -2 -61
7408f1k5J65r0R5j70J73q4p8k4j63R5J85P4j14j07J30M3m4J40j16q8K06j85k7
7432g0J29q6J20j77l6K30j83J57M1j81L4m4j99K79k7L8M4j17P9J55l51L47j37
7455D5J53k25J11K1j34Pp3K1Q8l4J25j47q1k4J99J66k49K9j16O9J90k03J39j8
7479E9o5L2J43k00N0J13j63J8K9K8j09KQ2K1j44J45q6O3k0j43K60l2j06J20m9
7504D8l04J98J32jj63M6J83j0j63J64k16K15j89R3l2K72l97K82j67L2M9j94J04
7527a8l4o5K90j04j46M7j4O5J71j79K2r5M1J43l10Q7J28k3j4P1j65j0j3J03Q0
7552E8J6M6n4l6j66L25j49j74K57o3j45L3j93M56j37k7J03j48lk04Q6J99k99J90
7576b9K75l34J5K40k97K9J40J1nj91R8J73j99M2K34k66J44%r3R8P6o2l10K25K3
$$ plain form
7408 -61 -86 79 -11 84 -86 87 3 -75 -99 -262 -167 18 92 -22 -129 1 44 0 140 24 -64 142 -43 -70
7432 -70 59 -27 93 -84 -120 110 -73 84 125 -56 -22 -66 -265 14 -13 25 69 -48 31 186 -165 182 45
7455 45 198 -27 84 105 -29 -22 -95 -74 14 -20 105 -42 -123 -147 52 218 -31 -2 -118 -49 141 -62 77 59
7479 59 -6 26 169 -31 19 132 -31 -13 16 44 -65 -63 19 40 -104 41 -45 18 -2 -145 115 83 -23 97 48
7504 48 -256 -58 74 73 -90 -44 139 129 -34 130 -86 129 -60 33 1 273 -124 158 -9 23 72 -122 -18
7527 -18 -52 -117 173 69 -77 -30 -44 21 192 13 35 -60 -19 124 -186 -99 29 6 -8 63 -102 -112 -125 -22 58
7552 58 74 120 66 30 -136 189 40 -134 123 60 -85 -52 -245 211 74 47 150 2 -1 -205 -119 80 -219 -29
7576 -29 246 -88 -73 167 -130 -101 39 50 45 -146 -48 125 -74 -32 202 -64 80 80 -13 85 161 99 -211 14 37
7601C7J11j30j83J92k07J80j14J12m2J65J02k07k0j03Q5k0J44j18O0p5J01m2M3
7624G1J3j49p8L43m0k54J58O0o9n3j45J04J56j31J0j76J03L9J19n5L7O3j13j73
7648a60L38k4j70k0J4K4Q7j71M5O1M4p1k6RR5j86K46k72J07J54j34Q2k48M6K00
7673G0j06L7M4m0N9o9J48j12NP1q7L1N5j66l1K61r6L6j60K2M8n5p8J30O6j45J00
7700C8j43K14k25J77n6J16q1L3O6n7j55J59k57Q2J13j71K45o3R3j31J0k63R4J58
7724dp6J66k02K23r8Q0j2k21J62l0k7n9J86N5j35J30k7j19P0PPl0j44J04k01K2
7750a73J38J37O1j07j98J37j3P0j46R8l1l3J08k4Mr1J15l9J98j73p4n1K31l7j51
7775d4K05j06j11R9N7j94l3JO2m2K09j99K51r4j9N8l84J05J90j09O4K66k58j15
$$ plain form
7601 37 148 18 -165 27 -180 0 -114 -2 -44 121 223 16 -4 -107 -22 -42 102 -16 44 -31 70 28 71
7624 71 84 -65 -143 200 160 -94 64 124 55 2 -143 -39 117 -14 -4 -180 -77 -38 81 26 63 126 13 -160
7648 -160 178 154 -16 -36 -22 2 89 -82 -37 24 68 -3 -29 -20 75 -111 135 -137 -30 124 -10 72 -176 -130 70
7673 70 -36 1 45 5 64 -5 143 31 36 107 20 51 106 -60 -91 170 74 110 -50 -28 20 -35 -113 17 83 -62 38
7700 38 -105 109 -116 61 5 121 40 73 139 82 -73 86 -171 -89 24 -147 98 35 128 -3 7 -256 -162 -4
7724 -4 -80 86 -116 107 9 89 77 -144 18 -12 -39 -98 88 143 8 138 111 -8 62 69 76 46 -98 6 -195 -173
7750 -173 -35 102 163 56 -142 -5 -18 52 -94 4 -27 -60 48 24 28 -63 52 13 211 38 -36 -87 144 107 -44
7775 -44 161 55 -56 43 100 -94 -127 -126 -64 -106 103 -96 155 61 42 100 -284 -179 11 -98 -34 232 -26 -141
7799a41K03m9k3J28j77l8K63l57J03J14P4k29K99k18P9k3P8j59L24k87J42r6l3
7822b3K41k44J8j05K07K6q0M7j08Q3m9P2N4k17J3K52k02m2LJ56j47pJ25j5j46
7847h8L2j4R6k41O2J55j48J49L8J36k24L4P9Oj39J87J32k72O3JR2R4j46j73J85
7872I6j19J57j34n0J58m6j50k8J29j17O1l4J31L2l6j76K96J0k23k13L45j4l28
7895b53J68K97l80J63L5J20o7k69J22J02k10K25MM0j96L58j60k55k51M45m0M5
7917D3q3p8M3J09J64j10k46J64l7J43J1l44P7J56j47M0K30j89P1K18k58P1ql4
7941Fm3N0oQ3o7o3K73j92r0r5R6J04nl6J03j03pj26k3J05O7q0J01j8o2N5o8ol9
7970h6L9K08j72J82j38r2p7J03P5P5k57K51j86J43q2j13J04K60j29r6L2nJ23j08
$$ plain form
7799 -141 62 13 -10 118 -59 -97 166 -191 -88 26 100 -129 170 -48 31 8 86 -73 251 -36 106 10 -23
7822 -23 218 -26 -8 -113 94 120 40 87 -21 62 13 85 139 -78 -65 187 -15 -57 -54 102 -45 -52 73 58 -88
7847 -88 -56 -70 26 -215 -153 2 -146 3 41 177 -47 -13 66 72 -67 120 252 -20 43 44 136 230 84 -89 96
7872 96 -23 134 0 -50 108 62 -88 -116 13 -104 -43 -77 54 86 50 -126 170 180 -43 -256 89 75 -253
7895 -253 -85 212 -168 -5 30 150 83 -186 -64 38 -172 53 57 97 -99 259 99 -156 -407 38 -2 43
7917 43 -40 -118 -75 34 198 88 -158 6 -31 112 123 -221 -144 12 -135 -95 135 -54 17 235 -23 48 40 6
7941 6 -37 13 7 90 23 -40 233 41 -49 -144 -48 56 51 15 118 15 8 -118 -141 -36 31 -49 52 34 -28 27 -41 -47 -86
7970 -86 -47 161 -11 171 33 -59 -136 -33 42 117 -140 111 -75 68 -14 -127 -23 237 108 12 44 39 162 54
7994E4m7N6O4l12R1M7j19p4K84O6n0p9m1j8J89j87N2J90p0k7j54J13J46j60o9
8019e5O5Q5j56J9J30m1j36J61j40J0K57m1l08L53k11j0J1L8p3j3J47k2j6j29R1
8044A6O1j04j72L6J08m2K2K12l2P3m4j87R2p9J69j66m8K61l25j9K27r5J37q4r5
8069g8M1K8q3N3M2J22k63J46oL6k36L07K6k32J54j53N0K72k00j3j6o5Q6l8J5p5
8095h0J33r2J30j34M7p7k0P1P6J6r3j10L63j36j14L51k94m4p5J38q4P3k2j11O2
8120b6j03K50q4K8j80J15m5j03L40k83r0K51j35j00L37j64j29l0J97L3k01J24
8142BK0J22k81L40j42J30j07k1J56j73k9k5K8j40R5J73q4q0jR5m6j74K83j64N1
8167B8Pj57L8J52k37L9J82k3m2l4N7p7J58k3k47J54m7J08P5k17N8K64k33K
$$ plain form
7994 54 7 63 127 -185 -94 -47 -166 -240 44 110 60 -19 -60 -78 111 -76 -24 166 96 69 -85 28 174 14 -55
8019 -55 10 95 -61 -42 88 47 -89 72 -68 -58 199 158 -150 203 -8 -18 -7 31 -42 -55 92 70 54 -75 16
8044 16 77 -27 -199 -163 -55 -97 -75 137 105 178 134 -53 39 -40 129 -37 -85 176 -149 -168 59 -36 101 17 -78
8069 -78 -37 -9 -92 -39 3 125 -138 8 2 38 -198 109 135 -97 57 -96 -46 226 26 13 -3 -68 18 -20 -5 -80
8095 -80 53 -39 91 -43 4 -73 -93 -22 54 70 -23 -133 230 94 -20 331 37 -7 -82 56 -28 45 23 -88 -26
8120 -26 -129 121 37 65 -115 0 -45 -148 192 -91 -181 70 -65 -165 172 8 -121 -151 46 79 -122 2
8142 2 22 144 -137 203 61 191 84 63 219 46 17 -8 20 -120 -25 148 64 -16 -17 78 32 -142 141 -23 28
8167 28 35 -122 -84 68 -169 -130 52 29 -13 -47 10 -67 91 68 -179 -25 -72 36 111 -106 -48 216 -17 -15
8191a5
$$ Imaginary data points
##PAGE= N=2
##DATA TABLE= (X++(I..I)), XYDATA
0@%%%%%%%%%%%%%%%%Qj6J6j6J6k4L2l2L9m7N4o2P1q0Q9j04J19j34J51j70J93k17
38a14K42k70L01l36L73m12M55n02N56o15O77p46Q20r04R99j101J215j344J490
57G84j657J853k081K352k686L102l639M368n408P028r925J6669o0728j2063J70065
72A08034P3276l2889o8948o1123p3950l3187j0317J6324O5930Q4802L1135J6815
84A15902J4826l8704q9541p2264m0135P529M9265M1635K5210M8949K8770l3168
96E8274m0882k9376o4274n0244L0544O0149L2350K6993K6810J4812L985l5045
108C4096p2914l1923K3538P452K05M8152N6193J0027j6112j9344k1389j9590l0800
121c2409l7070J3468O1338L3376p657J393J0751q894k8182l6841k4690O449J6665
$$ plain form
0 0 0 0 0 0 0 0 0 0 0 0 0 0 0 0 0 0 8 -8 8 -8 8 -16 16 -16 23 -24 30 -32 39 -41 48 -56 63 -71 80 -90 103 -114
38 -114 128 -142 159 -177 196 -216 239 -263 293 -322 355 -391 429 -475 524 -577 638 -706 784
57 784 -873 980 -1101 1251 -1435 1667 -1972 2396 -3012 4016 -5909 10760 -49968 -62031 108034
72 108034 181310 148421 79473 18350 -55600 -88787 -99104 -82780 -16850 67952 99087 115902
84 115902 130728 92024 2483 -69781 -109916 -102387 -53122 -11487 13723 62672 91442 58274
96 58274 17392 -11984 -76258 -126502 -95958 -35809 -3459 23534 50344 65156 69141 34096
108 34096 -38818 -70741 -47203 -39751 -39546 8606 64799 74826 58714 39370 17981 -1609 -32409
121 -32409 -69479 -56011 5327 38703 31046 32439 43190 34296 6114 -30727 -55417 -48968 -32303
134c2303J1745K9566L3349p843k6881j639j533k7696k3355K109J6298K5667K3388
147B0872P936K367k514k2258k2185L157M966j4917n254K6042L5431J2351j8268
160B7726k3511k346M721j7072j9624Q496J8735N088M216J4192O730j4023k4563
173a1235j3562Q474R970q290o975J7219K3370L743j0876q506o257q373n586M072
187a2812J0907L373l366O943J6842K984j9357j8479N68Q591k66m113N123J1805
201H743L417m228N77K068r530j6576l486J4886J3590n781r949P297J5119j452
215A4695j5969r441J528K176n86K943P927M208n772m379P156N110j1700j4668
229a6772K885J3016O105k412k487K822L704k536m805J215j513q566j71J3969R140
$$ plain form
134 -32303 -20558 9008 42357 34514 7633 5994 4461 -23235 -46590 -44481 -28183 -2516 20872
147 20872 28808 31175 28661 6403 -15782 -12625 -7659 -22576 -27830 -1788 33643 45994 27726
160 27726 4215 1869 6590 -10482 -30106 -21610 -2875 2213 6429 20621 27351 13328 -11235
173 -11235 -24797 -16323 -6353 -14643 -21618 -4399 18971 22714 11838 3332 -2925 -11298 -16884 -12812
187 -12812 -1905 1468 -1898 5045 21887 24871 5514 -12965 -12397 -3806 -4072 -8185 -3062 8743
201 8743 12160 7932 8509 10577 1047 -15529 -19015 -4129 9461 3680 -6269 1028 16147 14695
215 14695 -1274 -10715 -9187 -7011 -7597 -4654 3273 7481 1709 -2670 4486 9596 -2104 -16772
229 -16772 -13887 -871 5234 2822 335 3157 6861 4325 -480 735 -778 -9344 -9515 4454 13594
244A3594o886r137J245P653J440j0176q398M405P035l01m60N224P67p588m146
259e729M312M742l859j0105j075J3371R362p052q568L148L989k752k279J021l09
274a783j596J094N649O211k793j0059k269P890L802o112n500K863N245K166j656
289C152n65l99l826m555L572O984k726q819J31R755N575n564q022n10N779J465
305A427l149r16L113m28k107L546M989k297q008k146O394N408l060n624l03N297
321B136L096k496k964o37o69j645J916M772o10o746j603O870M671m625o895J62
337e267M862K141k081q14J379m56j482J969L377j721n250j726M816N736j109p035
353b661j456O137L111l640k675N68P9n44J942K245p40l829k505L534N139k095
$$ plain form
244 13594 6708 -2429 -1184 6469 7909 -2267 -10665 -6260 775 474 14 5238 6005 -1583 -5729
259 -5729 -1417 3325 -534 -10639 -11714 1657 11019 3967 -4601 -1453 2536 -216 -2495 -1474 -1783
274 -1783 -3379 -2285 3364 9575 6782 -3277 -5546 2344 6146 34 -5466 -2603 2642 4808 3152
289 3152 2587 2188 -1638 -6193 -2621 4363 1637 -7182 -7051 2704 8279 2715 -5307 -5817 -38 1427
305 1427 -1722 -2638 475 47 -2060 1486 6475 4178 -3830 -5976 418 5826 2766 -2858 -3161 2136
321 2136 5232 2736 -228 -865 -1534 -3179 -1263 3509 2899 -3847 -5450 1420 6091 1466 -5429 -5267
337 -5267 -405 1736 -345 -1159 220 -236 -1718 251 3628 1907 -3343 -5069 -253 5483 4374 -2661
353 -2661 -4117 2020 5131 1491 -1184 -616 -537 -1081 861 3106 2366 -1463 -3968 -434 4705 2610
369B610o924r63N264K871j769k160n52N44K46Q4J779L55l693k250M435N603k414
386C066n391p77L665K969q06l322m25J981M25o02K045K11l949k553L679L655j569
403B302m930j707L500M008j721l899n83J538J92J79J526l89k530j113K688L691
419B752k28m444k416L702M349j345k895l63J782Q01J29N09k95j903j720J834L258
436C507k83m248k339L064L318j380l284j241J516P68J40k13K58j189j429J393
452a642L023m02l203k104K972L774l54l272p93K423J414j38n10M3n48r41R69K534
470C245M96l285k264K323L073m49l601j574R23K126L79j979n85j64q15M58K404
487G11k13l090j509K002K805O66k360j975J417K786p9q92N7l61q05J446K583k81
$$ plain form
369 2610 -4314 -5277 -13 2858 1089 -1071 -1623 -1079 -833 -749 1030 1385 -2308 -4558 -123 5480 3066
386 3066 -2325 -3102 563 3532 2726 -596 -1021 960 1385 783 2828 3039 -910 -3463 216 3871 2302
403 2302 -2628 -4335 -835 3173 1452 -2447 -3030 -1492 -1300 -1121 405 16 -2514 -3627 -939 2752
419 2752 2524 -1920 -4336 -634 3715 2370 -525 -888 894 1695 1824 2333 2038 135 -1585 249 3507
436 3507 3224 -1024 -3363 -299 3019 1639 -1645 -2886 -1370 -602 -462 -675 -417 -1606 -3035 -1642
452 -1642 1381 979 -2224 -4328 -1356 2418 2064 -1208 -2001 422 1836 1698 1188 1231 683 -258 711 3245
470 3245 3741 456 -1808 515 3588 3139 -462 -2036 -1113 1013 1392 -587 -1172 -1336 -2151 -1693 711
487 711 498 -2592 -4101 -2099 706 1372 -988 -2963 -1546 1240 1161 269 326 -35 -840 606 3189 2908
505B908k301j636J086K764J122l480k527J694K363p08j202k71p02r8L29M34L43
522A18o92k128k12L476Q26k673j531J365J284R42l33j580K48J126K59K86R30j141
540E70j685J196K424k13k083j025N10J517Q82j662j458R76L13o04R09M57j663
557f39j545J271J625M77j080k350J00L029Q17k174q58L64M32J010K81q56o77J58
575f15J33O45J603j381j953L68K341M92r80j051l26M60J079K41n50n65o66L09
593d16J228P02j354j225M02R77J078o93j611j25J170N68p13k6r4p68M9J047O23
612H19j064j103P3J187J033n96j357m01J224Q78j38n78l09j47Q18O24j43k9j011
631b20j12J285P34p71j211l08R01P15j12q04p52J04L77N63j33n64q47J32R19O71
$$ plain form
505 2908 607 -1029 57 2821 3943 463 -2064 -370 1993 1285 83 -188 -890 -988 -659 -225 118
522 118 -574 -2702 -2914 562 1388 -1285 -2816 -1451 -167 775 442 -1138 -890 236 495 781 1711 570
540 570 -1115 81 2505 2292 209 -816 -306 1211 2093 431 -1027 -51 262 -342 567 1024 -639
557 -639 -2184 -913 712 1189 109 -2241 -2141 888 1705 -469 -1327 -963 -531 479 760 -96 -773 -615
575 -615 -482 163 1766 385 -1568 -1200 1141 1633 653 -398 -724 -264 815 1056 506 -59 -725 -416
593 -416 812 1514 160 -1065 -663 314 1392 699 -912 -1037 133 701 -12 -38 -132 -900 -851 196 819
612 819 -245 -1348 -1275 -88 945 349 -1008 -1409 -185 693 555 -23 -332 -479 339 963 820 791 -220
631 -220 -332 953 1687 916 -295 -603 298 1013 901 97 -655 -551 -174 389 256 -308 -1155 -1023 -104 567
651E67p67q80k48N65R78J60r01k99J32P49N10R7l62k93pQ01O75k02r71n81O44
672C67R17K2q97r65M66M67K94n31n55l40J80J88M39j62o41o28M77J004j02m64
692d64n26o8R49N01k00l01j75j2O62M29j2n66k48L49P42Q0m98r64J22R10K15p52
714A73l09m4j00K30Q7m5m11l45j4Q27Q8l80q73J37N64O77l62n37j28N54P08M5
736E42k20m01J46K27J62N14l87o06L13M08K78m08n15nL51j12J28j73l84j93L0
757c05L07J15l53o95j49O49O11k33o98M7L88M77J2n03QK68J51K3K59j5l37J38
779A65J95L59k27k7m36j26O11P1m06m18R0K43K5q6j76l90l00N94J04k47n29J81
801g30K49L61Q8m39O3P5L21ML61P1l12k88M90M02J11n22l26J01Q82k49n32m08
$$ plain form
651 567 -200 -1080 -1328 -763 215 375 -526 -825 -693 56 566 663 301 8 1 802 1477 1275 304 -277 367
672 367 1284 1306 409 -556 -90 377 671 140 -415 -755 -575 -387 52 -110 -751 -1379 -902 102 0 -464
692 -464 -990 -1058 -109 392 192 -109 -284 -296 366 795 783 217 -31 318 1060 1140 642 -322 -200 710 925 173
714 173 -136 -180 -280 -50 37 -8 -419 -764 -778 49 137 -243 -1116 -979 -415 262 -100 -637 -765 -211 497 542
736 542 322 -79 67 294 456 970 583 -23 290 698 976 568 53 48 399 287 415 242 -142 -335 -305
757 -305 2 117 -236 -931 -1080 -431 180 -53 -751 -704 -316 161 173 -330 -322 -54 97 120 379 364 27 165
779 165 360 719 492 465 29 -97 514 585 179 -239 -149 94 119 33 -143 -533 -833 -239 -135 -382 -911 -730
801 -730 -481 -120 -32 -471 -408 -333 -12 -8 353 424 112 -176 314 716 827 305 -21 80 962 713 181 -227
823b27L17N2K4m07j0P3o4o0M2n6J12o07J19M80K93l56l64L32J44J91J09r8k74
846b35M35J16k3J37r5l43L42M7l6p7j13m1O5K58m17o7L5J12m54NJ69l5j77j80
870e72J68K59P1k67l48M10N24m70l71M08K30J4k6K9J6J57N4k5R7M0k73m4J76J89
894D46o8l70j74L30K42m76j50J10K45m23o4J80m7j47k5J27J06j13j08r2L62J13
916Dj13M2n7L32n2J24K7o0J24r4j68J07J91l13j90L22J09j55l16K35M6j04k22
939a81R5r6K71l08J16J2k04K27n7K03k70J68k67R5N54J26m94j50L78K3l09K2K57
962B11P5L4l93L35P4k72k03k6K41K62l02j30J67K27l2n37J46L19k91nO4o1J0q1
986a68J25K92J97p49j52L24K03r5j02K08j00K14k87j67L50J62m64O3N26N2m58
$$ plain form
823 -227 90 142 166 -241 -251 -178 -242 -302 -260 -316 -204 -811 -692 -212 81 -275 -639 -307 -163 28 137 39 -235
846 -235 200 316 293 430 335 -8 334 381 345 268 155 114 179 437 20 -47 -12 100 -354 -349 -180 -215 -392 -572
870 -572 -404 -145 -74 -341 -689 -279 245 -225 -596 -188 42 56 30 59 75 232 286 261 358 398 125 81 257 446
894 446 378 8 -166 164 406 -70 -220 -110 135 -288 -352 -172 -219 -366 -391 -264 -158 -271 -379 -471 -109 4
916 4 -109 -67 -124 208 156 280 307 247 371 277 109 216 407 94 -96 226 335 180 -136 99 145 41 -181
939 -181 -86 -182 89 -219 -103 -91 -295 -68 -125 78 -192 -24 -291 -196 358 484 -10 -160 218 241 -68 -46 211
962 211 286 320 -73 262 336 64 -139 -165 76 338 36 -94 73 300 268 -269 -123 196 -95 -100 -36 -97 -87 -168
986 -168 -43 249 446 -303 -455 -131 72 -23 -125 83 -17 197 -90 -257 93 255 -209 -146 380 432 -26
1007b6k21K48J16K98m07l14J86M28p6n01M18R6j98j02M5l0Nr8k06K23M73l36m43
1030d22L62J14k85K60j10k8K41j76R5m0K52k80J9K40K42o98JL47L0n2K36l35m6
1053c3K57j63j48L61o2o87K45M26p6k9R0n97N12J23n78r3K61K97j88K13k44k25
1075c38L14j03J06J44J65n34j57O67K41n47J9J77k35L96n9j02k50J50j69R1J72
1096A48M4n69O8M90k3k33o5k43L53L12j98n21M50j19k5J25J56l67j04J36J97K13
1118B25j29k45j71N15J06k47J49k12k01L17L16j07m13J88k66M1N04r8m14K20J5
1139I3O1j5l25j82L11J59r2l6o9l59O0J83K75q8j50nQ6M25pl34j87J30M13n3l2
1164B62O0k89k44N79j13q3l4j68p0L29J20l67l62L68j51K81n3l82P4J66r8J48
$$ plain form
1007 -26 -247 1 117 415 8 -306 -120 308 232 -269 149 245 47 -55 -10 -40 -35 -133 -339 -116 357 21 -422
1030 -422 -60 54 -231 29 -81 -109 132 -44 51 11 263 -17 2 242 484 -214 -213 134 164 112 348 13 -33
1053 -33 224 61 -87 274 212 -475 -230 196 120 91 181 -416 96 219 -359 -452 -191 106 -82 131 -113 -338
1075 -338 -24 -127 -21 123 288 -246 -403 264 505 -42 -23 154 -81 315 256 154 -96 54 -115 -24 148
1096 148 192 -377 -309 181 158 -75 -140 -383 -30 282 84 -437 13 -106 -131 -6 150 -217 -321 -185 12 225
1118 225 96 -149 -320 195 301 54 203 -9 -210 107 423 316 -97 91 -175 -134 370 272 -142 78 93
1139 93 154 139 -186 -368 -57 102 10 -26 -95 -454 -394 -211 64 -24 -174 -179 -93 332 325 -9 -196 -66 347 294 262
1164 262 322 33 -211 368 255 172 138 -30 -100 229 349 -18 -380 -12 -163 118 65 -317 -243 -77 -175 -27
1186b7o6p6q0K72N2J8j38l15J73K60J72l03k4k0J12K12KP7k57j19R3K60m1j64
1210G3m81J64J75J45l9m21R1j6M49k1k07p2j4r2K73J65k70p4k09M81N0o9n4m14
1234c87M68L38l5l04j59K9K15J27k24j70j41K60K97l5r2m10p0J76L10j31p4k34
1256b46L0l1K51l7j33j65J83J27L67l02k02k70K39N99j37m16Q9j76L40P8K01k49
1278A40l57Q2J57M60m36j04j24R0L44j75j30K4j92L22j68K57m32m3j63M68L32
1299C52k01l60k31K70L75N9j60l56K18J03K29j05j23k56L44JJ13j8m10j16K22
1320e0L70j86j40k04p8K77K83l28k1o3J20K11l3l6j81j92J90M94l26l68J20kK85
1343A42J24k44k04j59K89L55j24P3k53M9p3Q9K86m09j59J5J39L86j49l83J14J06
$$ plain form
1186 -27 -93 -169 -249 23 75 93 -45 -360 -187 73 245 -58 -82 -102 10 222 224 301 44 -75 18 278 237 73
1210 73 -408 -244 -69 76 37 -384 -293 -309 140 119 -88 -160 -174 -266 7 172 -98 -172 -381 100 150 81 27 -387
1234 -387 81 419 384 80 -79 -50 165 292 68 -102 -243 17 314 279 187 -223 -293 -117 193 62 -12 -246
1256 -246 -216 -247 4 -33 -166 -331 -148 -21 346 44 -158 -428 -189 410 273 -143 -54 -230 110 188 389 140
1278 140 -217 -135 22 482 46 -58 -182 -92 252 77 -53 -29 -221 101 -67 190 -242 -285 -448 20 352
1299 352 151 -209 -440 -170 205 264 104 -252 -34 69 298 193 70 -186 158 159 272 254 -156 -272 -50
1320 -50 320 134 -6 -210 -288 -11 272 -56 -77 -140 -20 191 158 122 -59 -251 -61 433 107 -261 -141 -143 142
1343 142 266 22 -182 -341 -52 303 179 252 -1 48 -25 64 350 -59 -218 -203 -64 322 173 -210 -96 10
1365A0N6R1k31p9J1p1M43O3k75l86K78J71J45r4l16o7K82L7M8P7k94j16K47L38
1389C68r1j92k88j48M31J87N8n58NK29J04p8J52k72k03J33L74J87m51l67L89M7
1411A6J61Jn20M0J91M89k58r5k31Q4Q0J54N4k14k60j63P16P7q5m86p4L61J2J59
1435B09k96J0j2J82RL22l82k87J60J04J76m4l00j41J80K44J53m06j75J35P8R8
1457A7j68J4J06r6J57J20j03k29p1J77K83o0l13J07NK19%P3k09K8j35K26J23J03
1481C74k92k94j2M13M8k45k15P9J96K04j58k86q2K78O5J4J9j62j07J54J43L3k42
1504g5j80J36J4J88K71m42k1L49k92K06J88k73j39j36L77J58m92j74RN71m0j01
1526A02j95j05J61j60J99qj48j35K0L18J13j16j81j75L88K68k40m1k65J2J55J43
$$ plain form
1365 10 66 157 -74 -153 -142 -213 230 293 18 -368 -90 81 226 132 -184 -251 31 68 116 193 -101 -217 30 368
1389 368 277 85 -203 -351 80 267 325 -233 -228 1 105 27 179 -93 -296 -163 211 398 -53 -420 -31 16
1411 16 177 178 -342 -302 -111 378 120 25 -206 -122 -42 112 166 -48 -308 -471 245 322 237 -249 -323 38 50 209
1435 209 -87 -77 -89 93 102 424 42 -245 -85 19 195 151 -149 -290 -110 134 287 -119 -294 -159 -81 17
1457 17 -151 -137 -31 -127 30 150 47 -182 -253 -76 207 147 -166 -59 -54 165 165 238 29 57 -78 148 271 374
1481 374 82 -212 -224 189 237 -8 -223 -144 52 256 98 -188 -270 8 73 87 106 -56 -163 -9 134 167 -75
1504 -75 -255 -119 -105 83 354 -88 -109 240 -52 154 342 69 -70 -206 171 329 -163 -337 -328 243 203 102
1526 102 -93 -198 -37 -197 2 -6 -154 -289 -269 49 162 46 -135 -310 78 346 106 65 -200 -188 -33 110
1548A10J07k71j56m5O20n1m12j27O1K62oJ36k40kJ20l0m6J47j25k92L7M15P1l55
1572g2j77l4M19K42l25m29K07O5L26K6q1r0j63K24J23l4q3m29n0M47J42j74k23
1595a43Q9R4K52L2j57l00K1MO6K16j73k95J05J25J89Q9n56J01K98M7J58l25q2
1618a45J48N0N6Q9l68j56K80K30j17J24l35q0P3L15q2j77l4k8L4j08M35j54m7
1641Ck25K7M93r8m64N3J41M04k13r0j51N9R9K55j27l7k76J76j52K34l8l12j05
1664c44L68J10j82J40j16L7J62k41J60p8j40J14P3J9m9j38l7J24Q4J03m17R8P2
1687g8J29J62j17K2k48J24J56R9j32k04m2L35q2J78k96L03m78K79l6L0q9k12K9
1710a68J96J11M1k93L6J30J74r0l90J61k38L13Q0J28rj83j44K27P3n2n9k11J37
$$ plain form
1548 110 217 -54 -210 -255 365 314 -98 -225 -164 98 92 228 -12 -14 106 76 30 177 52 -240 -203 212 283 -72
1572 -72 -249 -283 136 378 53 -376 -169 -104 222 248 167 77 -86 138 261 227 144 -285 -335 112 254 80 -143
1595 -143 -54 40 292 324 167 -133 -112 -108 -42 174 1 -294 -189 -64 125 214 -342 -241 57 104 262 -63 -145
1618 -145 3 53 109 198 -170 -326 -46 184 67 191 -144 -224 -151 164 82 -95 -129 -157 -123 -231 204 50 3
1641 3 -222 -195 298 200 -264 -211 -70 334 121 31 -120 -61 38 293 166 129 -147 29 -123 111 73 -239 -344
1664 -344 24 134 -48 92 -24 13 175 -66 94 16 -124 -10 63 82 33 -105 -142 -18 66 169 -248 -150 -78
1687 -78 51 213 96 118 -130 -6 150 249 117 -87 -129 206 124 302 6 309 -169 110 74 104 15 -197 -168
1710 -168 28 139 180 -113 -77 53 227 137 -253 -92 -330 -17 63 191 182 -1 -145 82 155 103 44 -167 -30
1733c0K21l0p4n2j07J05n3K2k09J26O9K00o7o7k38m2K67K65k26o5j4R6Q3k60J35
1758E5j33Q2j29J98J78j50j19l43N10J69k90j39o8K58J05R1q5m8k19o3L26K8q7
1781A27l12J12J51P1p3j26M5r5K87j61K2j25o2r9M09k21J69l01k10K98J69J04
1803A79l63Q2J70J00j16j03K0J35n9j24L33j23k01j07K95Q5j06j24k80N85rj59
1825A10p1lJ22l67K20J6M7k82Q1Q2J46rk00j58K54Q5K7J2l52J08N0O3l8L4j6k41
1851b80K88J33J00k88k10J74J93P2l87J15K04j48k3J01K28j60k54O1K22l1J8j55
1873b7j03J7K70j87J52j39j42K6Q5K5L8k23J92R8N6j19k48J03L30j54j85L0J60
1896E5m8K7L6J3l28K27j5J02J19l82M9J81K02N5l53m1J86oj49j22J41j1o7j59
$$ plain form
1733 -30 191 161 87 35 -72 33 -20 2 -207 -81 -12 188 121 54 -184 -226 41 306 80 15 1 97 180 -80 55
1758 55 -78 4 -125 73 251 101 -18 -361 149 318 28 -111 -179 79 184 275 190 142 -77 -140 186 214 127
1781 127 -185 -73 78 149 76 -50 -5 -100 187 26 48 -77 -139 -238 171 -50 119 -182 -392 -94 75 179
1803 179 -184 -102 68 168 52 -51 -31 104 45 -79 254 131 -70 -177 118 203 97 -27 -307 278 269 110
1825 110 39 36 158 -209 11 27 74 -208 -127 -45 101 92 -108 -266 -12 73 100 112 -240 -132 -82 -19 -57 -23 -39 -280
1851 -280 8 141 241 -47 -257 -83 110 182 -205 -90 114 -34 -57 44 272 112 -142 -81 141 110 128 -27
1873 -27 -130 -113 157 -30 122 -17 -159 -133 -48 -23 15 -208 -16 82 138 19 -229 -126 204 50 -135 -105 55
1896 55 7 34 70 83 -245 -18 -33 69 188 -194 -145 36 238 293 -60 -101 85 79 -70 -192 -51 -62 -129 -288
1920b88K99K9J3k58R9N7J33j94Q2Q6J0R4k34qJ59J1j63K82L7l06j42J37J87m4
1944G8M9l82J16J25N8k62J99J77o3j10j6Pr7k40K13L43M1l17q5N3K01j22J22j14
1968b6O9l08J80P5L75l27l34K87J35jK9j91j03M25j08k18P8J58j70r0K86j2k89
1991h0J9L3Q3rJ49k98M6L53j88j91N1j02Q5M5k46L79j17p7L1J20m5p3j51J99K57
2016B73l25m4L07j46J59k02l88L87k9nK8O0J09r5j76n1J49J15j74OJ11p9j85J77
2040a8M0j27O7q0K19J1k45l0N5L03j87K2K0k23J62m1RK38n0j30M4Qj01J89o3j01
2066iJ20qk59J24j45K29n5n4J5j2l0J96k44L76j52j33R0J84j1j44j52L5L8J27
2090A26k88K21o6j51K05R2j23q3K90l08N2K51m53L12j40o2N2L11l03q9J62J6j5
$$ plain form
1920 -288 11 40 53 -205 -106 -49 84 -110 -28 58 68 162 -72 -80 79 90 -73 209 246 -60 -202 -65 122 78
1944 78 127 -255 -139 -14 44 -218 -19 158 95 -15 -31 -24 -121 -361 -148 195 236 -81 -166 -113 88 -34 88 -26
1968 -26 43 -265 -85 -10 365 38 -296 -9 126 125 154 -37 -140 285 177 -41 37 195 25 -65 221 209 -80
1991 -80 -61 -28 55 46 195 -103 -57 296 108 -83 -32 -134 -49 -4 -250 129 12 -65 -34 86 41 -32 -183 16 273
2016 273 -52 -96 211 65 224 22 -366 21 -8 -13 15 75 184 89 -87 -138 11 126 -48 -42 69 -10 -195 -18
2040 -18 22 -105 -38 -118 101 112 -133 -163 -108 195 8 30 50 -173 -11 -52 -43 195 145 15 59 67 -34 155 92 -9
2066 -9 111 103 -156 -32 -177 52 -3 -57 -42 -54 -84 112 -132 244 92 -41 49 233 222 78 -74 -39 -1 126
2090 126 -162 59 -7 -158 47 139 16 -67 223 -85 -33 218 -235 77 -63 -125 -73 238 -65 -154 8 24 9
2113IM0l4k70J36J76m6m6j00J78Q4r2j7m6K82k63q4L9N8k4j04J60j76L17l06K00
2138G1k05L73l23M0J14j23J09J00K0r8L1j08N5l2o2O9j86K9J86p8J2M7q1r6J89
2163E3J56l01M3P8r6PJ84j44L5k16J65J07o3k25K31o7K51j26J0j25N4qK8J90M4
2188B65l24m1J07R6k4j90R3p2m0J43M0N3q8j23J01J62j72p2R2J25R4k88KJ12n3
2213bq3L5R0l7K9j05R5J21j49k22K69j20K37j36P7j6N8j60J30Jkj10J3J16j07
2238B2j86J3J20k1Q6m3j6n5P2J07r6j6K1r8J96k84l2M01l37LJ95r2j3p2J30r9
2264i4M2J38J35k74K6j6J4Km3P6n6K32j51p9pN8j13k1K01O8p2M7L9j2l9M6j71
2291b4n8P5o4M2j15K25q7Q8l06O0K22l02K84n9r5J33N8k43J46J8O6m5Pj33N5R8
$$ plain form
2113 9 49 15 -255 -119 57 11 -35 -135 43 127 35 18 -28 254 -9 -93 -54 4 -20 -124 36 -140 177 -129 71
2138 71 -134 239 -84 -44 70 -53 56 156 176 78 109 1 56 24 -38 31 -155 -126 60 -18 -6 41 -40 -136 53
2163 53 209 -92 -49 29 -67 -60 124 -20 15 -201 -36 71 8 -217 14 -53 198 72 82 -43 11 3 31 221 265
2188 265 -59 -100 7 103 79 -111 -18 -90 -130 13 53 106 18 -105 -4 158 -14 -86 6 131 225 -63 -61 51 -2
2213 -2 -85 -50 40 3 32 -73 22 143 -6 -228 41 -79 158 22 99 83 141 -19 111 112 110 0 13 129 22
2238 22 -164 -151 -31 -52 34 -9 -25 -80 -8 99 3 -13 8 -90 106 -178 -210 191 -146 -143 52 -40 -53 -125 5 -94
2264 -94 -52 86 221 -53 -27 -43 -29 -27 -70 6 -50 182 31 -48 -55 3 -110 -131 70 138 66 113 152 140 101 147 -24
2291 -24 -82 -7 -71 -29 -144 81 -6 82 -224 -164 58 -244 40 -19 -114 19 77 -166 -20 -2 64 19 26 -107 -52 46
2317D6m2N0oj42p%J42J00l22J54J16j76P8J54k9k02o6M2K31k00j10O5J26L0o7
2342c5R1ok7l6J23k36J49j24n4K38mj02K52l10J26j11O7j29J49j4j23%J86o6j19
2367a15K8J57k8mn7J09j23P2k39j26K83R9K8L7j28J64q2l8p2R7J9l46L52j98J94
2392H3O2r2j53P5k0J48k05L50k61n6N7J67p7J77j27n2o2J78p3j97M1o2P0o4J28
2417C5NP8j02k75L72mroj44Q9q3J47j59J37l0j98P8l8N8j74J63Q8m8%J09j49M7
2444a3Mk50L66j8j4j12N2j0R1k44Q7R9k87L63k31nN3N9J15j6o3n8N7L8Rr3O2j23
2472h2J69j23K1P8k1j4P3k57J27J38%j03j6k84L04N4L1j45j17O1R1P4k1o2J84
2497A60k29K6J43K0j70m4J17j31K16j47q2L12k27j24K07j41K6J52l2J55m4j29
$$ plain form
2317 46 4 54 48 -94 -101 -101 41 141 -181 -27 89 -87 -9 145 116 -86 -152 -110 121 -79 -189 -124 2 32 -35
2342 -35 56 50 23 -13 110 -126 23 -101 -155 83 79 -23 229 -81 45 -66 1 -128 21 7 -116 -116 70 4 -115
2367 -115 -87 70 42 38 -19 90 -33 39 -200 -326 -43 56 84 121 -7 157 75 37 -35 62 81 -265 87 -111 83
2392 83 145 53 -100 -25 -45 103 -102 248 -13 -69 -12 155 78 255 128 76 14 192 119 -78 -37 -99 -29 -93 35
2417 35 40 118 16 -259 113 109 100 94 -50 39 -44 103 -56 81 51 -147 -69 -107 -49 -223 -60 28 -20 -20 89 -60 -13
2444 -13 -9 -259 107 89 75 -37 15 5 96 -148 -61 38 -249 114 -117 -122 -69 -10 105 89 26 -32 25 63 72 -21 41 -82
2472 -82 87 -36 -15 63 42 28 101 -156 -29 109 109 6 -10 -294 10 64 95 -50 -167 -106 -15 59 38 -24 160
2497 160 -69 -43 100 120 -50 -94 23 -108 108 -39 -121 191 -36 -160 47 -94 -68 84 52 207 163 34
2519C4j31K44j98L5P5j57J64j71K9K3J45j41N5M4n1M9j74K56k11J19J17k8k00
2542g3Q6N8L0k05K30j56q0J85m5j53q7J62m5L7q3O3P5J14Nj62j08K32j51Q8K7
2567D4P9k64J67K9m7k6O5j81K37k54R4J15K1j05J52j18k13K44j5n0J84jl05K35
2591H7k1j98J73Qj23KK51j34o9m6J98kp6n1O9J30l26Q9k23K62r1J6j41J13J73
2616G0j23Q5j54K72m34K16J80k05K2J11o2J62k52K58J4k12KK21j35Q8j17j48%
2639a41P8k2K64k39J98k80K06p1J6q4Pj21J16R6j21%j5J50M8j38J35k0J13k99
2663a24J84j11J19q2q4M7N4K20l23N3J57j20O9k43J15Q6j00j6J13q4J13R2j01
2686C4K98n09J42J28j32M4q9R3j11J13N1q4Q0J77k07R1J94l32n7K15l43L47r3
$$ plain form
2519 34 -97 147 -51 -16 59 -98 66 -105 -76 -53 92 -49 6 50 -1 48 -126 130 -81 38 155 127 -73
2542 -73 13 71 101 -104 126 -30 -110 75 30 -123 -210 -48 -93 -56 -139 -76 -1 113 118 -44 -152 80 -71 17 44
2567 44 123 -141 26 55 8 -18 47 -134 103 -151 -57 58 79 -26 126 8 -205 39 24 -26 158 157 -148 87
2591 87 66 -132 41 49 -74 -72 179 45 -24 -70 128 126 50 -1 68 198 -128 -39 -262 0 -91 -75 -216 -103 70
2616 70 -53 32 -122 150 -284 -68 112 -93 -71 40 -22 140 -112 146 160 -52 -50 171 36 124 7 -141 -141
2639 -141 -63 -85 179 -60 138 -142 64 -7 9 -75 -68 -189 -73 23 -98 -98 -113 37 85 -53 82 62 175 -124
2663 -124 60 -51 68 -14 -98 -51 3 223 -100 -47 110 -10 59 -184 -69 17 -83 -99 14 -70 43 135 34
2686 34 332 -177 -35 93 -39 5 -84 9 -102 11 62 -22 58 235 28 119 313 -19 -76 139 -204 143 50
2709E0J4l5K00l39J53J48r6k17qJ35J48j67P6K34k54Q1k55n8J88MN6N6m8j70O3
2734d1J91l04K3J63k18J76K54l28J93j56J31n0K7j09J47Qj36j2L5N2j31lJ14P4
2758A00j35J99j71n4J01j13m5n7J59q8J1R7J05J6m8j17J7K22j70K48l44O1R4j10
2782b2J37k90J55j16J87j31J52j39j63L10j41Kj17m7K83k65K44j0j79p3L08m3
2804D2j57M5J04j98K76k95J23R6J83j48J7p0j21J59L9j20R7r3p6L08k12q8J23
2827C4j67K33j68M6n7r6O7K52j56J14Lk39J93n2p5K2J16j20Q9J6l8M1K00k52j32
2852a26J44m9P6j21J11q4J85j68kK05k90N4k6R9q6J60n1j26J42K5Q0m31M62k48
2876f5K43j53l1o9k0Q0n5M4J14r7j59J42L8MJ65nj81j17J07m6J70j91l0o6J59
$$ plain form
2709 50 64 29 229 -110 43 191 95 -122 -130 5 153 -14 62 296 42 123 -132 -190 -2 2 58 114 66 -104 -41
2734 -41 150 -154 -131 32 -186 -10 244 -84 109 -47 84 34 61 -48 99 107 -29 -41 -6 46 -85 -88 26 100
2758 100 -35 164 -7 -61 40 -73 -118 -175 -16 -104 -93 4 109 125 77 -40 -23 199 29 277 -67 -6 88 -22
2782 -22 115 -175 -20 -136 51 -80 72 -67 -230 80 -61 -59 -176 -223 60 -205 39 29 -150 -223 85 42
2804 42 -115 -70 34 -164 112 -183 -60 36 219 71 88 18 -103 56 95 -25 72 -21 -97 211 -1 -89 34
2827 34 -133 100 -68 -22 -79 -175 -108 144 -12 102 105 -134 59 7 -68 -46 70 -50 39 55 17 58 258 6 -126
2852 -126 18 -31 45 -76 35 -49 136 -32 -34 171 -119 -65 -91 8 -78 82 31 -95 47 72 152 -279 183 -65
2876 -65 178 25 -6 -75 -95 -15 -70 -26 88 -9 -168 -26 12 16 181 176 -5 -122 -15 -61 109 -82 -112 -178 -19
2901a9R5p6q3L5R4r5%J92k53J55l6j58J64j03M1r5J79j56L43l04M3rJ93m7k67
2926a67J89R9J13k55J14j38j04J95p3K4PP9j88K55l79J99rj7K42k14j8O5J1j69
2950a39J82j12P0l8P6j66J61q0J77jj83J64j71J15p9r3K13j58J15j10M7j57L20
2973A53k48J7K20k07J80j19M0k94K09p0Q8KJ06j48J69j72J23O4j09o1Q9j46j1
2996a25P5J52n3o2J5m2J58j47j44M7J14j11K17j26K48k53q8J27P4j19r0J28J04
3019I9j82J12M1k6M1k05R6j9K1MJ17j29R5K9j47j36N04l23j4O7k18J90L9l4k7
3044ek5J04r7j02J27l0n4J29J85k50j59L04l0Km3o1J4M2l3l4J94J86m58J27Q6
3069A19m08L57j95N2J49j30J64j0j6p6Q0n7j40J88j04J91l15K31mj53j1N7LJ41
$$ plain form
2901 -19 76 0 -83 -48 46 -49 -49 143 -110 45 9 -149 15 -88 -47 -142 37 -119 224 -80 -37 -46 147 100 -167
2926 -167 22 121 234 -21 93 -45 -149 46 -27 -3 4 83 -105 150 -229 -30 -39 -56 186 -28 -46 19 30 -139
2950 -139 43 -69 1 -37 39 -127 34 -46 131 130 -53 111 -60 55 -24 -117 96 -62 53 -57 -10 -167 153
2973 153 -95 -78 142 -65 115 -4 36 -258 -49 -119 -31 -29 77 -71 98 -74 49 113 4 -57 32 -114 -125
2996 -125 -50 102 49 -13 2 -40 118 -29 -173 -126 -12 -123 94 -32 216 -37 -125 2 76 -43 -133 -5 99
3019 99 -83 29 70 44 85 -120 -24 -43 -22 -18 99 -30 65 94 -53 -189 315 -8 -22 45 -173 17 56 22 -5
3044 -5 -30 74 -23 -125 2 -28 -82 47 232 -18 -177 127 97 99 56 -5 9 51 18 -16 178 364 -94 33 119
3069 119 -289 68 -127 -75 74 -56 108 98 82 6 86 29 -111 77 -27 164 -151 80 76 -77 -88 -31 -28 113
3093A13n6m7K55k44J19j83k5J13J4j10n6K98K7j29r5J16j69N9j1K5n2n4m0J53
3117B1M3j50o6Q6K07k55P4Nk5N6L9M8k44J48n1N9M4k6J39p5n2q0K67j49Q0n6j82
3144i5m7K83k1k09%k7J97k57J49J61j30j42J34N1J18k78J01N5j14L3QM1O9r9K
3169a7R4k56J91n6R0k2N6j14P4q4J56j12qoJ4l4R4r7J9J52n4m0k64K76j89J72
3195C5j04N7J16p6p0M0o2K9J8j25J75j33J33j47KJ81q3M8P3o5m1j4R6j26kR6n4
3222cJ64j19o4K79j42j23o3K12oKkk4j71N0j33Q4R4M3j09J26j58K5J33K8L7j90
3248c0j5J62q3k65L88k78L9J79L8k04Q5%J20k2j31J33M2k21p0K48o9J42k31M9
3272FQ3j33k6L6PJ28r2k4k6P8k8J24k98J53K10k23O7k67J38K5J7Q8J0m5J72j39
$$ plain form
3093 113 57 10 265 21 140 -43 -68 45 59 -51 -107 191 218 89 -6 110 -59 0 -11 14 -38 -92 -132 21
3117 21 64 -86 -152 -66 141 -114 -40 -35 -60 -4 35 83 -161 -13 -64 -5 39 13 152 77 25 -55 212 63 143 87 -95
3144 -95 -142 141 120 -89 -89 -116 81 -176 -27 134 4 -138 -4 47 165 -113 -12 43 -71 -38 -30 11 80 -19 -17
3169 -17 77 -179 12 -44 46 24 80 -34 40 -44 112 0 -8 -14 0 -34 60 -37 -18 134 80 40 -224 52 -137 35
3195 35 -69 -12 104 28 -42 -2 -64 -35 -17 -142 33 -100 33 -114 -112 69 -14 34 107 42 1 -13 83 -43 -45 51 -3
3222 -3 161 42 -22 257 115 -8 -71 141 135 137 135 111 -60 -10 -143 -59 35 78 -31 95 -63 -38 95 123 160 -30
3248 -30 -45 117 34 -231 157 -121 -82 97 135 -69 16 16 136 114 -17 116 158 -63 -133 115 46 188 -43 6
3272 6 89 -44 -70 -34 -27 101 9 -15 -41 37 9 133 -165 -12 198 -25 42 -225 -87 -62 -45 43 53 8 180 41
3298D1J14j62rO4K16l49L39l05J15j20Q5J58j67Mm0N1j77P6r7m5R3P5K7j47R2
3323f8K3o3R7j88K57o0L4j74M1OJ33j16J87j01K5k21J46k9K22J15l35J33k53J45
3347d4P9j26R0K5M%O1lrj06j19P1l9J92o8j4R8q7L2j01o2K50J1j66o1M4R2j67
3375a23OK96k92J43J08j04l0j57J05J78k62N8N6J09p8q8K62q0j57K59k41P2k30
3398a90R1Q8J1J99j05r4K5j23r9p5L96N3k48J4J63p7N8j49RJ09j9p7J42j46q6
3423a30J93p3k8L3O2j62K87k01l9K41j56P9k42J4K35j25QK48P8l36P1q8r7P4P5
3448B1o1Nm2K17j16j84K23k6pL9m9j07j76K53n1L8Pj30J07J01J35k01m9K8N9J16
3474A50k31K43M9j14j44L7R2j2L0j50L3jLR7j21J73k17J81O1k18J12j3L2j35O5
$$ plain form
3298 41 155 -7 -16 48 264 -85 254 -51 64 -56 29 187 20 24 -16 35 -142 -66 -163 -208 -115 -40 -13 -160 -68
3323 -68 -45 -108 -11 -199 58 -2 32 -142 -101 -95 38 -78 109 8 33 -188 -42 -71 151 266 -69 64 -189 -44
3347 -44 35 -91 -1 24 28 28 89 86 77 -29 -148 -77 -116 76 8 -6 92 5 37 -64 -126 124 135 -31 -92 -48 44 -123
3375 -123 -117 179 -113 30 138 34 4 -153 -48 130 -132 -74 -18 91 13 -75 187 107 -50 209 -32 40 -190
3398 -190 -99 -11 0 199 94 0 25 -98 -197 -272 124 177 -71 -57 106 29 87 -62 -53 56 37 -40 102 -44 -130
3423 -130 63 -10 -38 -5 57 -105 182 -19 -58 183 27 106 -136 -122 113 -12 -4 244 322 -14 57 -31 -128 -54 21
3448 21 -40 -35 -77 140 24 -160 63 37 30 69 20 -87 -263 -10 -61 -23 -16 -146 -39 62 197 -4 -53 -25 34 150
3474 150 -81 162 211 97 -47 -10 82 70 100 -50 -17 -18 -15 82 -39 134 -83 98 159 -59 53 40 72 -63 2
3499Bl1P0O7J09j03j43j17L46k67J76j28j4R5k34J30J22j13NJ31r2p7k9J82l1
3523E6l8J59m0Nj48o4JJ9n9K6J81r6O3j61K5J10M6p7kp0J29q5M1q3M3j8k04L60
3551A19p4j31J55q6O9j8j34kRJ2J18O3j03m3k3K53j13n3J6Jj16J6J37n3J82j36
3577F5p6l4L9J7M6J9k6r8K41l1o0k8lj38J29q0n2l1J58P8j07R7j35o2J94n8Q9
3604A53r7j60K39j42J01j37Q9j65J83K3o9L8J02l28J12M3j6J33j77M4J19l45L36
3627G9j36L8Nk9k6K89j28j5l8k31M64k93Q3Q6k08j75K40J12j48L3N6q6n3l0K11
3652A00j19J05L1j19m4K00j91J44l3p7M7j72Q7Q4k47K93j33j39J53K36l17K13
3674A02o3r6J81o4j08K35J8k74J56k5p4o1J91p1J55j78j02q8J03j4J94j03Q0k27
$$ plain form
3499 2 -29 41 108 217 114 -29 -146 200 -67 109 -19 -33 62 -172 -42 80 -33 -28 103 11 -66 -95 87 56
3523 56 18 177 137 142 -6 -70 -69 -50 -109 -83 98 2 65 -96 -71 39 85 8 6 -64 65 -20 21 -62 -19 -37 -241 119
3551 119 45 -86 69 -17 52 34 -100 -102 -93 -81 37 100 -3 -46 -69 184 71 18 34 35 -81 -65 72 19 201 65
3577 65 -11 -45 -6 11 57 76 50 -48 193 162 102 74 71 -67 62 -18 -70 -101 57 135 28 125 -10 -72 122 64 153
3604 153 56 -104 135 -7 94 -43 46 -119 64 87 18 56 158 -170 -58 -15 -31 102 -75 -31 88 -257 79
3627 79 -57 -19 -14 -43 -69 220 92 77 39 -192 272 -21 62 148 -60 -235 5 117 -31 2 58 -28 -81 -111 100
3652 100 -19 86 117 -2 -46 154 -37 107 74 -3 44 -128 -41 43 -204 89 -44 -183 -30 206 -111 102
3674 102 39 -57 124 60 -48 187 205 -69 87 62 -12 -73 118 47 202 24 -78 -166 -63 -77 117 14 94 -133
3698a33K46j11j29K12l02P9L24j99J1r3K04l3n3k5j59K32q8j27J62q9K96m39J21
3721i3o9K31k69K82q1J03kr5o1j50Q1J94ro4j03J91j47J4L0N1j49j23J43K00j20
3746a5j09K70k30l8K07l7J2q5P2r8J21k00O9J16Q9j43QO1N8m2j49j8o0J87q2J08
3772G2j98L02k62L5j8J58L9k67K33Q4j46p8j36J90o2J36l8o4mj21J89q2J14p5
3796AM0R7j30O7K1j67J63j33O3J69l32RK08j05J05o2m0L2n4P3m2l37M35Jj87O1
3822d4k6P7K0k29K5K08l6R7Q9k39q9K56k38Q4p1r2K11r1PO8R9q1O6j89O2m3J84
3849H5K03k65J16j8k54O2K54j15j7L0L5j18q8L18o0k13r2J61N7k32J15M9J89n2
3873A50j36L8J31l40L53l9J11m83R0J89k4m5j05K6k1oJ44o5j3J26k65J47K01j08
$$ plain form
3698 -133 113 2 -127 85 -217 -138 186 -13 -2 -95 109 76 23 -2 -161 71 -17 -144 18 -71 225 -214 -93
3721 -93 -162 69 -200 82 1 104 102 7 -54 -204 -123 71 62 -2 -105 86 -61 -47 -17 34 -115 -238 -95 105 -15
3746 -15 -124 146 -84 -122 85 48 60 -25 47 -51 70 -130 -61 55 144 1 9 70 128 86 -63 -81 -141 46 -36 72
3772 72 -126 176 -86 -51 -69 89 128 -139 94 178 32 -46 -182 8 -54 82 44 -20 -24 -145 44 -38 76 1
3796 1 41 138 8 75 96 -71 92 -41 22 191 -141 -132 76 -29 76 14 -26 6 -48 25 -17 -354 81 82 -105 -44
3822 -44 -70 7 27 -202 -177 31 -5 92 181 -58 -147 109 -129 -45 -116 -208 3 -88 -81 -13 86 5 71 -118 -56 -99 85
3849 85 288 23 139 121 -133 -71 183 68 51 81 116 -2 -90 228 168 -45 -137 24 81 -151 -36 13 202 150
3873 150 14 52 183 -157 196 157 268 -215 -125 64 40 -5 -110 -84 -105 -111 33 -32 -45 81 -184 -37 164 56
3897E6j25K3K6J80k41O4J76j48j37K66l39K47J57j5k08k9J57j02p9J6J04N7j16
3920a0M4Oj07J35o0q3O5j7k3j02J00J53j62o3R7P4J65q7j96M7Q9M2k19O0l5L38
3946B51k00R8k39n3K37k21K30j70P9Q6Q7l13K04j4L4k87J24K81r7p1j83P4R9J16
3970A52q8k40J47J78q2l0%j09o2J84k30Q1j88L10q9L44j40j10l31L44j76J75p0
3993c0K0R2q0k4J66j43n6k8Q0JK27k40j51L60pj3k35Q7j03J0M5J11O3j04o8l1
4019e1K39L3oj21l7J4M1p2m6L48l10qj93J53J42r5j05J14o0L0J29q2q5o7J80j38
4045e3k2J50qO5L4j99J97k61K71l5j25k8L9j64K86J27m59J95oq1J00J62j07j56
4069g8M6L7j13J56k72K66j16P1j69K52N7k36J40q8r3qM7J7J14O6j02J9q2O8n0
$$ plain form
3897 56 -69 -46 -20 160 -81 -17 159 11 -126 140 -199 48 205 190 -18 -47 110 8 -71 -55 49 106 -10
3920 -10 34 40 -67 68 8 -75 -10 -27 -50 -152 -52 101 -61 -124 -27 47 212 125 -71 -24 65 107 -112 -52 -87 251
3946 251 51 149 -90 -143 94 -127 103 -67 12 98 185 -128 76 62 96 -191 -67 214 117 46 -137 -63 36 152
3970 152 64 -176 -29 149 67 37 37 -72 -134 50 -180 -99 -287 23 -66 278 138 28 -303 41 -135 40 -30
3993 -30 -10 82 2 -22 144 1 -55 -83 -3 -2 225 -15 -166 194 187 174 -61 26 -77 -67 -22 89 152 48 -20 -51
4019 -51 188 221 215 94 57 71 112 40 -6 342 32 24 -169 -16 126 31 -74 40 -20 10 139 57 -28 -95 85 -53
4045 -53 -75 75 67 132 166 -33 164 -97 174 139 14 -14 25 -139 147 274 -185 10 4 -77 23 185 78 -78
4069 -78 -32 5 -108 48 -224 42 -74 -3 -172 80 137 -99 41 -47 -140 -148 -101 -84 30 96 -6 13 -69 -1 -51
4094e1q6K90j33k4R3M8j17k4O4o2p1j9J7k3M9J02J15q5pj0J9n9j66j31J44K76
4120A49j73J12N2N6l8J8k89K38%j76j21J99J19k43L1P3J20j47J47o5j23N1L8j0
4144A8J25q0p2J31j14j4j37J69p5P5L9J41o8j44Q0j49J32j01K31k06J71m02J93
4167e7j26j0P1J28l7Q5nJ32l3l83J96l2J13j9m1j65J23P0l03K94j25Q0L4n3N3
4192a0l5J04n8OJ88m02K40p2k2M4P9k11J35O7l35L61q0mP4K1L8r3j17P5n5J43
4218H1K0j12j58J99l1p0N1J06j30j17L18l27M55j72q8q3r2J98j59J8O6K7k0J6
4242dj30J91J28j55MJ43l03J98q1L5l0LJ0K0j58J16l9K26j67K12j86k08K72P5
4266A72k11%R9nj34K33j30j3j22Q5M2M4L0k03L2J35r4Q8Q0k35J76k8o9J11m6p9
$$ plain form
4094 -51 -137 153 20 -4 89 137 20 -4 60 -2 -73 -92 -75 -98 -49 53 168 83 76 66 85 26 -140 -271 -127 149
4120 149 -24 88 140 196 158 176 -113 125 125 -51 -172 27 146 -97 -66 7 127 -20 127 62 -61 -10 28 18
4144 18 143 63 -9 122 8 -6 -143 26 -49 26 65 206 138 -6 74 -75 57 -44 187 -19 152 -250 -57
4167 -57 -183 -193 -122 6 -31 54 49 181 148 -235 -39 -71 42 23 -18 -183 -60 10 -293 1 -124 -44 -10 -63 -10
4192 -10 -45 59 1 7 195 -207 33 -39 -61 -17 62 -149 -14 53 -282 79 -1 -5 69 90 128 35 -82 -7 -62 81
4218 81 101 -11 -169 30 -1 -71 -20 86 -44 -161 157 -170 285 113 25 -58 -150 48 -111 -93 -27 0 -20 -4
4242 -4 -134 57 185 30 34 177 -126 72 -9 26 -4 -1 9 29 -129 -13 -52 174 7 219 33 -175 97 172
4266 172 -39 -39 60 55 -79 154 24 11 -111 -26 16 60 90 -113 -81 54 -40 48 128 -107 69 41 -28 83 37 -42
4292d2P2L0p4QJ9j88p1L58k17J29K44m94J84j07L2O8Q9k09K04J00j16m2p2P3O4
4317D2l67K96J59r6j40L7J3N4O8k5j09JJ22j75J93j54j14K79R8j45J70k25j05
4340a23n6K37L1j51J23L0j7q6O4J13m0Pk49j0J28Qp8r7K90o8j42J27j28J20q8
4365e5R3j52K86l00J91k2n6M9J6o9J70j60l6P2j38K13J5q6J19k44J81L1j92M3
4389c1j5J66l59L25n2k73K08o9J25R2l02K50j9J6n8p4R4p4O7M4k42J78k74K01
4413g6J25k20M0K51lj31j22K18j60l6J23kK02k62O9J18J05j94r3Q4K4j56J34n3
4437a5k1J9n4L49jl73J85J80o0k05J1nn4K5kJ50k31k0L9J84j07J53j66r5p7K08
4463A7J2J05l11J73q8J20J4k8j16rM9J24j48R7p6j62K96j70L3J00N7L4n7l3J16
$$ plain form
4292 -42 30 60 -14 -6 13 -175 -246 112 -105 24 268 -226 -42 -149 -117 -49 40 -169 35 135 19 -23 -95 -22 42
4317 42 -325 -29 130 34 -106 -69 -56 -2 66 41 -68 -67 55 -120 73 -81 -195 84 182 37 207 -18 -123
4340 -123 -179 58 89 -62 61 91 74 -12 52 165 125 132 -117 -127 1 9 -69 -166 124 56 -86 41 -87 33 -55
4365 -55 38 -114 172 -128 63 41 -15 34 50 -19 151 -9 -45 27 -111 102 117 31 150 -94 87 118 -74 -31
4389 -31 -46 120 -239 86 34 -239 -31 -100 25 117 -185 65 46 62 4 -70 24 -50 17 61 -181 -3 -277 -76
4413 -76 49 -171 -131 120 117 -14 -136 82 -78 -114 9 7 209 -53 16 134 239 45 -48 36 60 -96 38 -15
4437 -15 -36 -17 -71 278 277 -96 89 269 209 4 15 10 -44 -19 -21 129 -102 -122 -83 101 -6 147 -19 -114 -191 17
4463 17 29 134 -177 -4 -92 28 42 14 -102 -111 -62 62 -86 11 -65 -227 69 -101 -68 32 89 123 66 33 149
4488A49r3k43L05l29L66m5k9m9n6J41n1l2r2j01O3J82k6l16L95j34j59L21Jj04
4512F4o3J89k27R5M9j43o2j8p6K65O8q0l8J36j83K96l73R6Q9R6l25L20n3q9k43
4537b10J97O3J60k89K8J81k20L77k97K8k8QQ1k67J81j87K11J9Rrj26K93k05J51
4561A49j11j56J36Kl2k01J05K19j77j3J25N9k9k78J69R3j0j08J7o0J53K9k92K31
4585B0J72l5j96n5r5L12j43L0J30l99J12N1L17k26J16J28k05K1O8k01l5K01j86
4608i8j2R4r4K15j00j03J48o6j4R1ln2J08j89k9Q3O1j08L4j96M72k11j07jM1J23
4634H7k25L21j18k14K87p8o7K1Ok4J00j4k02J15J29k41K34j18J4R6K07k66j36
4657h6J90q6J32p4R6k13n9k34L57p7j3p5K13Q8n7j31J06p3r7O5M2K6QM9q9P2k03
$$ plain form
4488 149 56 -187 118 -211 155 110 81 32 -24 117 66 34 -58 -159 -96 86 60 -256 139 5 -154 167 168 64
4512 64 1 190 -37 58 107 -36 -98 -116 -192 73 141 61 23 159 -24 272 -101 -5 84 180 -145 175 122 33 -210
4537 -210 -13 50 210 -79 -51 130 -90 287 -10 18 -10 -2 79 -188 -7 -194 17 36 45 36 -90 203 -2 149
4561 149 38 -118 18 20 -12 -213 -108 111 -66 -79 46 105 76 -202 -33 60 50 -58 -41 -101 52 81 -211 20
4585 20 192 157 -39 -94 -189 123 -20 10 140 -259 -147 -96 221 -5 111 239 34 55 123 -78 -113 88 -98
4608 -98 -110 -16 -110 105 5 -98 50 -16 -30 61 58 6 114 -75 -104 -21 40 -68 -34 -230 242 31 -76 -77 -36 87
4634 87 -138 183 65 -149 138 60 -7 14 20 -4 96 82 -120 -5 124 -117 117 -1 13 109 316 50 -86
4657 -86 104 18 150 76 172 -41 -100 -334 23 -54 -67 -142 71 159 102 -29 77 4 -93 -28 14 40 48 97 8 80 -123
4684a23K29j94J20l5J64k69Q5J4j32J58O5q0K0P0l2j29n0J02K17j92N%Q2j54J43
4709H4K51k66k6q8J71k05J91k41J60O8q3R6j71j9J60q2o1n1K53m6j26J33J18p2
4733A48k41L03r4m1k22J68L4R9q4k11L8K91l49J14Q5j29K66J8l17P2r9L45j89
4756EK5m39K34J34NJ78j74p6R3L12l64r5J39q0P1O3J76k61k3J40J59l95M20j66
4780H1l1j36L9JN6r0J94j58J62j54Oj02J05J98j07Q2k38k0K95j57j17P7J00Km6
4805D2n7k9kJ09lj4k56K76K5k9M1k16J60m1r9M2J71K9j9j93J37j50J31P3Q1k46
4831c7%L6P9r1q3J29jJ29j74L6r0J37m0L3j06P8j38O0J67R8m37Q4J48n3N2j6O1
4858F1o6J01m3%n2L2k76L74j0q9L6k12K8K01j52J48L0j23J07j96L8O2J28J27j47
$$ plain form
4684 -123 106 -88 32 -3 161 -108 -23 -9 -141 17 82 2 22 92 60 -69 -119 -17 200 8 13 13 95 -59 84
4709 84 335 69 43 -45 126 -79 112 -129 31 99 16 112 -59 -78 82 0 -61 -112 141 95 -31 102 220 148
4733 148 -93 210 116 75 -147 21 55 154 70 -141 -103 188 -161 -47 38 -91 175 193 -124 -52 -151 194 5
4756 5 30 -409 -175 -41 -36 142 -32 -108 -15 297 -67 -162 -23 -103 -32 31 207 -54 -77 63 222 -173 247 81
4780 81 50 -86 -47 -46 10 -80 114 -44 118 -36 -30 -132 -27 171 64 146 -92 -112 183 26 -91 -14 86 88 42
4805 42 -15 -44 -46 63 60 46 -210 66 91 62 103 -113 47 6 -93 -51 120 149 130 -63 74 -76 55 128 209 -37
4831 -37 -37 -1 78 -13 -96 33 32 161 -13 23 -67 70 30 63 -43 35 -103 -43 124 222 -215 -131 17 -36 16 0 61
4858 61 -5 96 53 53 1 33 -243 131 121 32 68 -144 -116 85 -67 81 111 -12 95 -101 -63 -1 127 254 107
4883A07jk8l9l4J73r7q8J62j64N8p7J96j61pRK4q2J02j39K39R4l99J57J33n6k31
4909a49J17k1J27j3p0j2Q5L8P6o6n1j7m6o2L7P5n9J40l0j54J36j19r1J88j48P0
4935a9p5K00k55K04M1k44L09j83K1j6J00k36j12K26j18N8O2l7J09K4k31J64J69
4958A61k3j32J8Q0L0j48p2k4K35J80k42j95l6J82j63J3K58j38n5Q2j71K74j74
4981f0J75j59K14n3j73M6R2l92N02j14j59p9L40L2m25M44j19r7N0Pj24K98j99
5004D7j10J26rK7N7k13J05j49R7K6J82l2j95n2K28j24j37R4q4K70j26P6M8k41
5028h9Q0K8k0l7Q0J7k27J62M9o1l7J98l08J51r1K11J79k59j13J03k12J14Q5o4
5052f1J25n1l3K9k8R3j26J23p6p0nJ23o5m7l7L59k98j3P5k5J11J42l79J47j13
$$ plain form
4883 107 106 78 39 5 178 81 -7 155 -9 49 -28 168 7 0 9 33 -49 53 -86 153 247 -152 5 138 82 -149
4909 -149 -32 -53 74 61 -9 -21 64 102 178 112 61 44 -2 -64 -27 48 -11 129 99 -55 81 -38 -129 59 -89 -19
4935 -19 -94 106 -149 55 96 -148 161 -22 -1 -17 83 -153 -265 -39 -157 -99 -37 -74 35 59 -172 -8 161
4958 161 138 6 24 104 134 -14 -86 -110 125 305 63 -132 -168 14 -149 -136 122 -16 -71 11 -160 114 -60
4981 -60 115 -44 170 117 -56 -10 82 -310 192 78 -81 -160 180 212 -213 231 112 15 65 72 -52 246 47
5004 47 -63 63 54 81 138 -75 30 -119 -22 4 186 154 -41 -93 135 11 -126 -32 -116 154 28 104 152 -89
5028 -89 -9 19 -1 -38 42 59 -168 -6 43 -18 -55 143 -165 -14 -105 106 285 26 -87 16 -196 -82 3 -61
5052 -61 64 13 -20 9 -19 74 -52 71 -5 -75 -80 43 -22 -69 -106 253 -45 -58 17 -8 103 245 -134 13 -100
5077a00L41k00o2J48j35J64l99K87j81Q9J36j15J45l33J13J59Q4k5L3k32L96k72
5099D1P1o1Q0j58j35M1n1p1K13j16K43j78L23k82m6K11k35J14l2L7o9k1J51k12
5123a42J20r1K05j02l9P0n5j2J8p6K03l5j30R6Q1J9n8j39J27M2J02k13nJ40j97
5148g1N5p9K99l62L34k5k42p7J49m7J61r1O8j15j4OL1j82J86J62k16J72k92N4
5172a36L51j29j83o2M5M0K04k24J00j2O2K5r5k96M54o6k6r0kp0J73J86l41J95
5196A03m63N28j68q8J68R2r2p9J92l06KJ4J25L6o8j24j5J4O6k2O4K8p9q7n9J70
5222d8j14K29J1N0k5l20J35J34j9p5K0J10j34n7L7m7K35J38l76j7J3K02l1j50
5246i9K44k47K60j12l2k5L9o2L9p5J05k60L06K01k30nj26J68j84L3J38l02K32
$$ plain form
5077 -100 241 41 -21 127 -8 156 -243 44 -137 -48 88 -27 118 -215 -102 57 141 116 149 -83 313 41
5099 41 112 51 131 -27 -162 -121 -172 -243 -30 -146 97 -81 242 -40 -86 125 -110 4 -28 9 -60 -81 70 -142
5123 -142 -22 -113 92 -10 -49 21 -34 -46 -28 -104 99 64 -66 30 111 130 72 -67 60 102 204 -9 -14 126 -71
5148 -71 -16 -95 204 -158 176 151 -91 -168 -19 -66 95 4 72 -43 -57 -51 -20 -202 -16 146 -70 102 -190 -136
5172 -136 215 86 -97 -159 -114 -74 130 -94 6 -6 56 81 -14 -310 144 78 52 -38 -40 -110 63 249 -92 103
5196 103 -360 168 0 -88 80 172 80 1 193 -113 -111 -97 28 64 -4 -128 -143 -129 -63 -85 -21 7 -72 -159 -218 -48
5222 -48 -162 67 78 128 103 -217 -82 52 33 -42 -22 88 -46 -103 -66 -113 122 260 -116 -133 -120 82 51 -99
5246 -99 145 -102 158 46 14 -11 28 -34 5 -70 35 -225 81 282 52 47 -79 89 -95 -62 76 -226 6
5269FJ45j86J44J7o2n7K18j90r1o2O0m9K55jk23J7q0K10o0j04K33q5j32kn0O3
5295f6J47PJ10j04k43J42J32oj50n7J14p4J68l1Q1k40j9P3K27j80P6m6j71K40
5319A30j51k14K10q8J94L9j00j8J45k75R7J18r4k3K7p6j20K36p0p5L13n8j28q9
5343g0j32J20l2J03K4j9KJ15k96J97m2J57j19J66l98J82O1j95K68j54K74k53K66
5366B25k20K9k6M8o7p3J95qk0j71j06J83J11K2J52k60J1j51K10j97K90k4p9L1
5390A05on4L8P7j48N0J35j77J1M7j8k7p2R3N7j04J28j71m4j23K07j40J68n5R0
5415F7q0L9k07J68J14L3l6o1K3j53P0Q1L3j1o3K1K3l1j7p1K69j64O3k5j32j5%
5442f2K01j1j05m7K8j41J81j6P2L7j80J39j12j2R0k5k32K41J1O1r7l1JK31j40
$$ plain form
5269 6 151 -35 109 126 64 7 225 35 -56 -118 -58 -107 148 147 -76 -59 -139 71 11 -93 140 55 -77 -79 -129 -66
5295 -66 81 88 198 94 -149 -7 125 119 -31 -88 26 -48 120 89 170 -70 -89 -16 211 31 107 61 -110 130
5319 130 -21 -235 -25 -113 81 120 20 2 147 -128 -31 87 -7 -30 -3 -79 -199 37 -33 -108 205 147 19 -70
5343 -70 -202 -82 -114 -11 13 -6 -4 111 -185 12 -30 127 8 174 -224 -42 19 -176 92 -62 212 -41 225
5366 225 5 34 8 56 -11 -84 111 103 83 -88 -194 -11 100 122 274 14 25 -126 84 -113 177 153 74 105
5390 105 99 45 83 160 12 62 197 20 31 78 60 33 -39 54 111 7 135 -36 -80 -203 4 -136 32 -23 67
5415 67 -13 26 -181 -13 101 134 98 37 60 -93 -23 58 91 80 17 38 61 30 13 -58 211 47 110 85 -47 -62 -62
5442 -62 139 128 23 -24 4 -137 44 28 100 137 -43 96 -16 -28 62 37 -195 46 57 118 21 -10 -9 222 82
5467H2L5k34J41P7J52j78j15k45J76J05k8P0m0ML3m2j40k7J08K48k19j45J88J29
5491A35n4r7K00j75j50k4L10l4o9j99QP5J44j37J05q5J76j06l4L9o1j34K46k30
5515a51J92J17k01M9Nj03M53j47j97J57k13K03j9j43K34k78J06nJ8k13K61K8j69
5538a6n1J3J72j29mp9J73j73J08j38k8J23J4j2k12K02N0q4R7k9N2K8Nk38P3P2
5564a1M9j14J85j18MK40j90j62LJ61j11N2k6J56Qj72k9J61r4j59N2J57Q8j54N3
5589B9J5j90K06j88J30J31j94K04o7l4j27Q0m1j56J55K2j06R8L07j50k51N6R2
5612B1Kl1J4m1j54J49O5J71j88j43L0K7J04j75K8M7LR6m9QJ27k31K71j55o4K02
5638A34M7k04JQ8J62k32J4O2j18O9p6k1n6K62l06J28J63n1M2m6k72K79j4Q9J43
$$ plain form
5467 82 117 -117 24 101 253 75 -40 -285 -109 -4 -32 38 -2 2 35 -7 -147 -174 -66 182 -37 -182 6 135
5491 135 81 -16 184 9 -141 -165 145 111 42 -157 -149 -74 70 -67 38 -47 129 23 -11 28 -33 -167 79 -151
5515 -151 41 158 -43 6 11 -92 361 214 17 174 -39 164 145 2 236 -42 64 59 77 -136 125 153 -16
5538 -16 -67 -54 118 -11 -15 -94 79 -94 14 -124 -152 -29 -15 -27 -239 -37 13 -71 26 -3 49 77 82 -156 -83 -11
5564 -11 38 -76 109 -9 -5 235 45 -117 -114 47 -64 -12 -38 118 126 -46 -75 86 -8 -167 -115 42 130 -24 29
5589 29 44 -146 60 -128 2 133 -61 143 76 42 -85 -5 -46 -202 -47 -25 -131 -33 274 124 -127 -71 21
5612 21 23 -8 6 -35 -189 -40 25 196 8 -135 -105 -78 26 -149 -121 -74 -71 25 -24 -16 111 -120 151 -4 -68 134
5638 134 181 -23 -22 66 228 -4 10 72 -46 23 -53 -74 -130 132 -174 -46 117 66 108 62 -210 69 55 144 287
5663B87k76r5Q0j4M3m4J71j63Q6n3N3o1q1M7J66k04K43m17K78P8k36o1J02J99
5687A28m35K20L8o1L4M8M3r3L6Q7k3p5n6J55p5O7r6J6J14p4J11p4k95L66j65J26
5713F7j88J95j53n3K04J6q8J28ok52J06O0Q3l07jK43j78K28k3j57l1J98j28K9
5737hJ08l67K95r6J14k2p4J55j52K04l0k13N7Q3Jj8q8o6J72l1J84j06L9q3j49
5762i1K3J7J14L2n4j8j23J82q3r0K14Ok61O8M0k7m9J46j24K12l30J23j1L33m6
5787B03j11l3l8j49K15o9N3p9Mr1J29J05m3l6Q1l09J78Jj05J46k1L5J05J03j83
5812I1J24j78M8K3Jp4k5j45J25L6o2L5p6M1O7N0P1k05J17j45k02L32K0j34q2J63
5838A6P0j50R6R0n6pJ4rq2k7LK02k57L7J84k06J11K23j60r7l6Q5Mr5N5L8M3j42
$$ plain form
5663 287 11 -84 -4 -18 25 -19 152 -11 75 22 75 14 -67 -20 146 -58 185 -232 46 124 -112 -173 -71 128
5687 128 -307 -87 -49 -110 -76 -28 15 -78 -42 45 22 -53 -109 46 -29 38 -58 -42 72 -2 109 35 -260 106 -59 67
5713 67 -121 74 -79 -132 72 88 0 128 122 -130 -24 36 119 -188 -189 54 -124 104 81 -76 -107 91 -37 -8
5737 -8 100 -267 28 -68 46 24 -50 105 -47 157 127 -86 -29 54 55 37 -51 -117 55 24 208 102 141 58 -91
5762 -91 -68 -51 63 95 41 23 -100 82 -1 -91 123 129 -132 -64 -24 -51 -100 46 -78 134 -196 -73 -84 249 203
5787 203 92 59 21 -128 87 18 71 -8 -4 -95 34 139 96 60 141 -168 10 11 -94 52 31 66 171 274 91
5812 91 215 37 85 108 109 35 10 -135 -10 26 -36 -1 -77 -36 31 81 152 -53 64 -81 -283 49 69 -65 -147 16
5838 16 86 -64 32 122 66 59 73 64 -18 -45 -42 160 -97 -60 124 -82 29 252 92 -5 -41 44 48 -47 8 46 89 -53
5866e3M6J69j08k03J32L0l1J6k1MK26j21j10N7j57J33r5J1L9R5K1p9l2j24J02
5891e3J5j23Q8%J25j33K5j24O4K45M4r0j48K42k63R6QJ8N2j39rO4k20Q0m6K15
5917C3J12qk69l6L98j86j70J22Q8j33j23J62NR8qj40M5pL3j34O7R4n2k4J1Q9M1
5944A08n4j17o3J63k55K71j13RK9j82J76o9J13j55o9K4K71j25J6mo3J33j62K37
5968A19J7l5l5j84N9PK39j38j5j28J0O8R5j69R9M9oj2j90J14K76k86J49q0O5J4
5994A02n2J59k15j24J56r6MK6j27O3l4J48j40J54l9m8J36j10k36K44l7M5M9k33
6018b05J70n3J94l86M22L3k18j49o4J46K37l16K95jj10nQ3j34K35o5r3j06K5R3
6042B8j19l8K57j08k21J42q6K97j05J13j60J51j45O2n7lJ30m8o5J92k65P3n3L4
$$ plain form
5866 -53 -7 162 54 -149 -17 13 -18 -2 -23 -19 207 86 -24 33 -124 9 -86 -75 -36 59 80 1 -31 -155 -53
5891 -53 -38 -161 -73 -73 52 -81 -56 -180 -116 129 173 83 -65 177 -86 10 18 36 88 -51 -60 4 -216 -136 -182 33
5917 33 145 137 -132 -168 230 44 -126 -4 84 -49 -172 -10 -5 93 85 -55 -10 -17 16 -118 -51 43 -9 -33 -22 67 108
5944 108 54 -63 -126 37 -218 53 -60 -51 -22 -204 -28 -97 16 -139 -208 -184 87 -38 -22 -26 -89 44 -118 119
5968 119 136 101 66 -118 -59 -52 187 49 34 -94 -84 -16 79 -90 9 58 52 40 -150 -36 240 -46 103 23 88 102
5994 102 50 209 -6 -130 26 -70 -66 -40 -167 -104 -138 10 -130 24 -15 -63 73 -37 -273 -29 -66 -21 28 -205
6018 -205 -35 -88 106 -280 142 175 -43 -192 -256 -110 127 -189 106 105 -5 -10 73 -61 174 109 16 -90 -65 28
6042 28 -91 -129 128 20 -201 -59 -145 152 47 160 0 151 6 68 11 8 138 90 25 217 -48 25 -28 6
6066FQ3j04L5J7j46R1j42J71L6N8k09MK12j98q6J59J94k73J22j10K70r5J4n9j27
6091g7Q1nk67L30Nj22K8j38J38l10K51P9K6L7j40K64j18j22p9L18k66r2K13j54
6115a20J94k11K09J57j85j20K4O2N8j63j18N4R5k8j67K67P1k74L14j92J88k05
6137i0QM3K16k71M1j22J86K54m15L04m2q7Q5j70m7K10N5k13K46l49N5o3K50mj21
6162d1K3Q7j01Km4J19N2r4K9K3l01M6K03j9J43rPj49jr1M8J16l3k1r3rK65o8k3
6191F6J0j52O4j26J66J5p2J39O7k91J01j32O9K07n3l4j06Q2k9L1m1m6j31J01m
6216i9K96k44j36L09n9n8l0J1O8j58j82L70J01j11l09K48j15K47k73J73J62k06
6238Eo8k1J67j08Q4j20K32j97L9L0j60l6K48j42n1J35n5K20j92q1N2p3j7J92J10
$$ plain form
6066 6 89 -15 20 37 -109 -18 -160 11 47 105 -104 -100 112 -86 -172 -13 181 -92 30 -80 190 95 109 50 -77
6091 -77 4 -1 -268 62 67 -55 -27 -165 -27 -337 -86 -7 19 56 -84 180 62 -60 -139 179 -87 -179 34 -120
6115 -120 74 -137 72 229 44 -76 -52 10 68 -95 -213 -159 -64 -92 -259 8 79 -195 119 -73 115 -90
6137 -90 -82 -39 177 -94 -53 -175 11 265 -150 154 112 25 110 -60 -107 103 158 -55 191 -158 -103 -166 84 80 -41
6162 -41 -18 69 -32 -30 -74 45 97 3 32 55 -246 -200 3 -16 127 118 125 -24 -25 -116 -68 48 15 -6 -99 -108 157 89 66
6191 66 76 -76 -12 -138 28 43 -29 110 177 -114 -13 -145 -76 131 78 44 -62 20 -9 22 -19 -65 -196 -95 -99
6216 -99 197 -47 -183 126 67 9 -21 -10 58 -100 -282 88 189 78 -231 17 -98 149 -124 49 211 5
6238 5 -63 -84 83 -25 59 -61 171 -26 13 43 -117 -153 95 -47 -98 37 -18 202 10 -71 -19 -92 -109 83 193
6263A93l14j2K27L0k61m8K72j42J32q3nM2q3M5J30k13J08J21j4M0k40K22k45Q8
6287a0l7M2q8O0Q6N2n3K0j87j3P4J22k45K63j02m7J96j18j57J59M0L3j55Q4k6
6312go1J27j76O2k0J16k46K49n0MJ09J49k27J10j23O9J27l77K48J88j01j64J31
6335A37j54j8p2K40K8j62Q1L9k71K83k98L40O1k38J22j07n3M7j27K63k44K48M7
6358A92k13J5P6k14K75j21l1k1r9J08j7J33p8o9J87j33N2j87RK30j07lj47K61
6382I8o2mk98M92k56l6r9Q4N3N8N2n1j07J33l09K56j15L3J76j41j9L2j45j36M33
6407A22k38L37k24j05Q1l4l5m1K15Q3l0r6M7r6j44K13r3j77Q0N7kP0N2j16j46
6432b20Q9K0R4j19J58Q5r7O3%J77k12l8L3K5p1J26J1M5j40j47K18l62L71j13m3
$$ plain form
6263 193 -121 -133 94 124 -137 -185 87 -55 77 -6 -11 31 -52 -7 123 -90 18 139 125 165 -75 147 -98 -10
6287 -10 -47 -5 -93 -33 53 105 52 72 -115 -128 -54 68 -177 86 -16 -63 133 15 -142 17 57 90 -65 19 -7
6312 -7 -68 59 -117 -55 -75 41 -205 44 -6 -2 107 256 29 139 16 85 212 -165 83 271 170 6 137
6335 137 -17 -35 -107 133 161 -1 80 119 -152 131 -167 173 234 -4 118 11 -42 5 -122 141 -103 145 192
6358 192 -21 -6 70 -144 131 10 -21 -42 -141 -33 -50 83 5 -64 123 -10 42 -145 -136 94 -13 -16 -163 98
6382 98 36 32 -266 226 -30 -66 -165 -81 -28 30 82 31 -76 57 -252 4 -111 -78 98 -43 -62 -30 -175 -311 122
6407 122 -116 221 -3 -108 -27 -61 -96 -137 78 161 131 35 82 -14 -158 55 -38 -215 -135 -78 -80 -10 42 -74 -220
6432 -220 -131 -111 -17 -136 22 107 10 73 73 250 38 0 33 58 -13 113 124 169 29 -118 100 -262 109 -4 -47
6457d7j67J75n3J02M6j06M0O0L0k20L36k61R4k1l2J04n0r9P7R6p4j05J19j54K48
6482A38j49N0j24mJ10K14m26L09k31L9n1J79m4j70J84M5k5M0j75J03k2J29l8j35
6506e4J98q2j4m3j06J60Ok22K07K7K1J04k02J07j9j91J71J1L2r4o3K18o9j72K16
6531A47j18L6k72L09k5j40J44j08J46R7j38j01J81J15l05O4j13Q6rk28K19J34
6553A21k16nJ03j21J4L46m65M06l06K4P1L8OJ50j46j49l9J43j23J89K67l12j56
$$ plain form
6457 -47 -214 -39 -92 10 56 -50 -10 50 80 -140 196 -65 29 8 -24 80 30 -69 8 104 30 -75 44 -110 138
6482 138 -11 39 -85 -89 21 235 -191 118 -113 -74 -125 54 10 -160 24 69 44 84 -91 12 -10 119 81 -54
6506 -54 144 62 48 5 -101 59 65 -157 50 77 98 202 0 107 88 -103 68 79 111 17 -46 172 103 -69 147
6531 147 29 65 -207 102 77 -63 81 -27 119 216 78 -23 158 273 -32 32 -81 5 -4 -232 -13 121
6553 121 -95 -100 3 -118 -104 242 -223 183 -123 -99 -28 10 16 166 20 -129 -168 -25 -148 41 308 -4 -160
$$ [...]
8191b9
##END NTUPLES=NMR FID
##END=
