##TITLE=1H_LR-0154-OMe-B-IPS
 D2O
 8 sc, 
 14.3.2023
##JCAMPDX= 6.0         $$ Bruker NMR JCAMP-DX V2.0
##DATA TYPE= NMR FID
##DATA CLASS= NTUPLES
##ORIGIN= UXNMR, Bruker Analytische Messtechnik GmbH
##OWNER= root
$$ XWIN-NMR		Version 3.5
$$ Tue Mar 14 14:26:22 2023 Russian Standard Time (UT+4h)  she@DPX200
##.OBSERVE FREQUENCY= 200.13135
##.OBSERVE NUCLEUS= ^1H
##.DELAY= (6, 6)
##.ACQUISITION MODE= SIMULTANEOUS
##.ACQUISITION SCHEME= undefined
##.AVERAGES= 8
##.DIGITISER RES= 18
##SPECTROMETER/DATA SYSTEM= spect
##.PULSE SEQUENCE= zg30
##.SOLVENT NAME= CDCl3
##.SHIFT REFERENCE= (INTERNAL, CDCl3, 0, 15.7039)
##AUDIT TRAIL= $$ (NUMBER, WHEN, WHO, WHERE, WHAT)
$$ ##TITLE= Audit trail, XWIN-NMR		Version 3.5
$$ ##JCAMPDX= 5.01
$$ ##ORIGIN= Bruker BioSpin GmbH
$$ ##OWNER= she
$$ F:/spectra/data/she/nmr/H-F/1/audita.txt
$$ ##AUDIT TRAIL=  $$ (NUMBER, WHEN, WHO, WHERE, WHAT)
(   1,<2023-03-14 14:25:15.00 +0400>,<she>,<DPX200>,
      <created by zg, POWCHK disabled, PULCHK disabled
       configuration hash MD5:
       00 E9 B6 7A A2 85 ED C7 34 08 36 98 17 FE 4E 26
       data hash MD5: 16K
       79 C1 FC FC 5A 96 95 2B 94 42 F0 84 FD 05 A8 96>)
$$ ##END=
$$ 
$$ hash MD5
$$ 9B 22 03 6A B3 AC 17 C0 E2 2B D2 0E 84 57 11 CF
##$RELAX= 
##$RELAX= 
##$RELAX= 
##$RELAX= 
##$RELAX= 
##$RELAX= 
$$ Bruker specific parameters
$$ --------------------------
##$DU= <F:/spectra>
##$EXPNO= 1
##$NAME= <H-F>
##$PROCNO= 1
##$TYPE= <nmr>
##$USER= <she>
##$AMP= (0..31)
100 100 100 100 100 100 100 100 100 100 100 100 100 100 100 100 100 100 
100 100 100 100 100 100 100 100 100 100 100 100 100 100 
##$AQSEQ= 0
##$AQ_mod= 1
##$AUNM= <au_zg>
##$AUTOPOS= <>
##$BF1= 200.13
##$BF2= 200.13
##$BF3= 200.13
##$BF4= 200.13
##$BF5= 200.13
##$BF6= 200.13
##$BF7= 200.13
##$BF8= 200.13
##$BYTORDA= 1
##$CFDGTYP= 0
##$CFRGTYP= 5
##$CHEMSTR= <none>
##$CNST= (0..31)
1 1 145 1 1 1 1 1 1 1 1 1 1 1 1 1 1 1 1 1 1 1 1 1 1 1 1 1 1 1 1 1 
##$CPDPRG= <>
##$CPDPRG1= <>
##$CPDPRG2= <>
##$CPDPRG3= <>
##$CPDPRG4= <mlev>
##$CPDPRG5= <mlev>
##$CPDPRG6= <mlev>
##$CPDPRG7= <mlev>
##$CPDPRG8= <mlev>
##$CPDPRGB= <>
##$CPDPRGT= <>
##$D= (0..31)
0 1.2 0 0 0 0 0 0 0 0.06 0 0.03 0 0 0 0 0.0002 0 0 0 0 0 0 0 0 0 0 0 0 
0 0 0 
##$DATE= 1678789514
##$DBL= (0..7)
120 120 120 120 120 120 120 120 
##$DBP= (0..7)
150 150 150 150 150 150 150 150 
##$DBP07= 0
##$DBPNAM0= <>
##$DBPNAM1= <>
##$DBPNAM2= <>
##$DBPNAM3= <>
##$DBPNAM4= <>
##$DBPNAM5= <>
##$DBPNAM6= <>
##$DBPNAM7= <>
##$DBPOAL= (0..7)
0.5 0.5 0.5 0.5 0.5 0.5 0.5 0.5 
##$DBPOFFS= (0..7)
0 0 0 0 0 0 0 0 
##$DE= 6
##$DECBNUC= <off>
##$DECIM= 32
##$DECNUC= <off>
##$DECSTAT= 4
##$DIGMOD= 1
##$DIGTYP= 9
##$DL= (0..7)
0 120 120 120 120 120 120 120 
##$DP= (0..7)
150 150 150 150 150 150 150 150 
##$DP07= 0
##$DPNAME0= <>
##$DPNAME1= <>
##$DPNAME2= <>
##$DPNAME3= <>
##$DPNAME4= <>
##$DPNAME5= <>
##$DPNAME6= <>
##$DPNAME7= <>
##$DPOAL= (0..7)
0.5 0.5 0.5 0.5 0.5 0.5 0.5 0.5 
##$DPOFFS= (0..7)
0 0 0 0 0 0 0 0 
##$DQDMODE= 0
##$DR= 18
##$DS= 0
##$DSLIST= <SSSSSSSSSSSSSSS>
$$ [...]
##$SUBNAM2= <"">
##$SUBNAM3= <"">
##$SUBNAM4= <"">
##$SUBNAM5= <"">
##$SUBNAM6= <"">
##$SUBNAM7= <"">
##$SUBNAM8= <"">
##$SUBNAM9= <"">
##$SW= 18.05172834244
##$SWIBOX= (0..15)
0 0 2 0 0 0 0 0 0 0 0 0 0 0 0 0 
##$SW_h= 3612.71676300578
##$TD= 16384
##$TD0= 1
##$TE= 0
##$TE2= 300
##$TE3= 300
##$TEG= 300
##$TL= (0..7)
0 120 120 120 120 120 120 120 
##$TP= (0..7)
150 150 150 150 150 150 150 150 
##$TP07= 0
##$TPNAME0= <>
##$TPNAME1= <>
##$TPNAME2= <>
##$TPNAME3= <>
##$TPNAME4= <>
##$TPNAME5= <>
##$TPNAME6= <>
##$TPNAME7= <>
##$TPOAL= (0..7)
0.5 0.5 0.5 0.5 0.5 0.5 0.5 0.5 
##$TPOFFS= (0..7)
0 0 0 0 0 0 0 0 
##$TUNHIN= 0
##$TUNHOUT= 0
##$TUNXOUT= 0
##$USERA1= <user>
##$USERA2= <user>
##$USERA3= <user>
##$USERA4= <user>
##$USERA5= <user>
##$V9= 5
##$VALIST= <valist>
##$VCLIST= <CCCCCCCCCCCCCCC>
##$VD= 0
##$VDLIST= <DDDDDDDDDDDDDDD>
##$VPLIST= <PPPPPPPPPPPPPPP>
##$VTLIST= <TTTTTTTTTTTTTTT>
##$WBST= 1024
##$WBSW= 4
##$XGAIN= (0..3)
0 0 0 0 
##$XL= 0
##$YL= 0
##$YMAX_a= 229601
##$YMIN_a= -229234
##$ZGOPTNS= <>
##$ZL1= 120
##$ZL2= 120
##$ZL3= 120
##$ZL4= 120
##$ABSF1= 10
##$ABSF2= 0
##$ABSG= 5
##$ABSL= 3
##$ALPHA= 0
##$AQORDER= 0
##$ASSFAC= 0
##$ASSFACI= 0
##$ASSFACX= 0
##$ASSWID= 0
##$AUNMP= <proc_1d>
##$AZFE= 0.1
##$AZFW= 0.1
##$BCFW= 1
##$BC_mod= 2
##$BYTORDP= 1
##$COROFFS= 0
##$CY= 11.3945322036743
##$DATMOD= 1
##$DC= 2
##$DFILT= <>
##$DTYPP= 0
##$F1P= 2.36226072786647
##$F2P= -0.459571619588291
##$FCOR= 0.5
##$FTSIZE= 0
##$FT_mod= 4
##$GAMMA= 1
##$GB= 0.15
##$INTBC= 1
##$INTSCL= 1
##$ISEN= 128
##$LB= 0.24
##$LEV0= 0
##$LPBIN= 0
##$MAXI= 10000
##$MC2= 0
##$MEAN= 0
##$ME_mod= 0
##$MI= 1.114404
##$NCOEF= 0
##$NC_proc= 0
##$NLEV= 6
##$NOISF1= 3.799351
##$NOISF2= 2.8
##$NSP= 1
##$NTH_PI= 0
##$NZP= 0
##$OFFSET= 15.70392
##$PC= 1
##$PHC0= -19266.09
##$PHC1= 10.00074
##$PH_mod= 1
##$PKNL= yes
##$PPARMOD= 0
##$PSCAL= 0
##$PSIGN= 0
##$REVERSE= no
##$SF= 200.130013532006
##$SI= 16384
##$SIGF1= 3
##$SIGF2= 2
##$SINO= 400
##$SIOLD= 16384
##$SREGLST= <1H.CDCl3>
##$SSB= 0
##$STSI= 0
##$STSR= 0
##$SW_p= 3612.71676300578
##$SYMM= 0
##$S_DEV= 0
##$TDeff= 0
##$TDoff= 0
##$TI= <>
##$TILT= no
##$TM1= 0
##$TM2= 0
##$TOPLEV= 0
##$USERP1= <user>
##$USERP2= <user>
##$USERP3= <user>
##$USERP4= <user>
##$USERP5= <user>
##$WDW= 1
##$XDIM= 8192
##$YMAX_p= 0
##$YMIN_p= 0
$$ End of Bruker specific parameters
$$ ---------------------------------
##NTUPLES= NMR FID
##VAR_NAME=  TIME,          FID/REAL,        FID/IMAG
##SYMBOL=    X,             R,               I
##VAR_TYPE=  INDEPENDENT,   DEPENDENT,       DEPENDENT
##VAR_FORM=  AFFN,          ASDF,            ASDF
##VAR_DIM=   8192,          8192,            8192
##UNITS=     SECONDS,       ARBITRARY UNITS, ARBITRARY UNITS
##FACTOR=    0.0002768,     1,               1
##FIRST=     0,             0,               0
##LAST=      2.2672688,     0,               0
##MIN=       0,             -229234,         0
##MAX=       2.2672688,     229601,          0
$$ Real data points
##PAGE= N=1
##DATA TABLE= (X++(R..R)), XYDATA
$$ [...]
1450H690n197o816n310j158L552O511O379L264j586n485o782m788o84L801O386
1465G77O078K771j695n538o634m645l66M022O544N862K329k137n532o426m249
1480h839J4M121O304N748K090k398n737o279l968L82M475O261N318J684k644n709
1496H23n964l723N22M571O353N038J421k918n881n884l062Q84M600O137M688J120
1512H725k941n792n789k889J136M775O122M564N81l296n622n526k644J576M732
1527b288N856M290N11l559n778n257k398J854N017N726L788K15l683n688m857
1542f251k131J874N122N694L575j33l887n717m761j516K205N017N498L262m04
1557G447l935n611m653j300K505N145N331K972q51m098n379m343j051K720N046
$$ y = [8690, 3493, -3323, -8633, -9791, -6239, 272, 6651, 9915, 8329, 2844, -3938, -8726, -9410, -5609, 777, 6855, 9626, 7931, 2393, -4241, -8886, -9252, -5230, 1314, 7176, 9505, 7368, 1836, -4590, -8839, -8825, -4704, 1600, 7348, 9438, 7040, 1303, -4976, -8944, -8562, -4087, 2174, 7492, 9176, 6532, 823, -5141, -8864, -8342, -3771, 2582, 7620, 9041, 6123, 242, -5642, -8704, -7820, -3220, 2917, 7605, 8725, 5784, -8, -5797, -8686, -7550, -2775, 3347, 7911, 8492, 5196, -426, -5952, -8596, -7020, -2288, 3568, 7858, 8369, 4810, -968, -6225, -8623, -6769, -1752, 3974, 7762, 7977, 4294, -1394, -6251, -8382, -6508, -1386, 4308, 7883, 7750, 3863, -1854, -6615, -8131, -5926, -909, 4589, 7851, 7447, 3512, -2099, -6752, -8052, -5547, -402, 4929, 7901, 7050, 2952, -2427, -6770, -7821, -5101, -55]
1572e5N109K760r60m300n473l977q06K951N140M886K339j190m349n261l816m68
1588g470L007N184M859K024j505m408n200l550p2L186N067M587J780j682m418
1603A389n090l353Q8L446N087M395J437k007m508m844l021K89L454N032M151J337
1619G282k117m690m804k782O63L694M951L837R18k265m495m668k521P39L776N013
1635B531L670O97k507m676m483k122J158L746M796L403M93k639m561m352k010
1650f856J343L942M696L162K29k944m535m059j707J486L965M557K981J0k986m572
1666a288l970j368J668M146M377K703k43l099m483l761j218J915M110M377K473
1681F339n41l221m530l456q71K001M113M164K226o65l284m406l365p74K314M129
$$ y = [-55, 5054, 7814, 6854, 2554, -2919, -6896, -7702, -4751, 389, 5275, 7614, 6424, 2075, -3186, -7002, -7470, -4463, 721, 5580, 7604, 6099, 1691, -3509, -7059, -7131, -3945, 1122, 5709, 7489, 5807, 1389, -3701, -7054, -6966, -3520, 1567, 5962, 7399, 5392, 884, -3960, -6981, -6692, -3238, 1794, 5945, 7282, 5165, 475, -4329, -7111, -6448, -2754, 2197, 6034, 6952, 4687, 192, -4476, -6997, -6258, -2482, 2531, 6201, 6898, 4391, -285, -4768, -6890, -5732, -1986, 2810, 6213, 6706, 4067, -494, -4846, -6856, -5513, -1571, 3125, 6287, 6516, 3572, -963, -5022, -6729, -5243, -1278, 3279, 6260, 6270, 3284, -1288, -5258, -6626, -4958, -812, 3565, 6268, 6025, 2926, -1557, -5318, -6536, -4621, -511, 3866, 6339, 5798, 2577, -1953, -5409, -6280, -4279, -166, 3998, 6224, 5559, 2275, -2131, -5496, -6270, -3956, 173]
1697A73M073J957r99l409m280l107m30K378M121L896J751j121l494m250k910k00
1713e851K573M094L721J429j221l561m081k692l4K605M116L536J306j485l632
1728H23m041k371K14K731L981L389J090j637l642l887k301M54K898L996L172Q51
1744E720j831l725l686k026N52L034L863L013O41j972l742l608j755Q35L062L824
1760B199K712M40k077l662l502j581J002L034L847K625J45k221l734l266j348
1775e387J205L146L654K368Lk290l668l130j217J362L263L615K136k28k546l511
1791a225k956j008J492L189L519K005l28k585l629k799p75J676L277L390J688
1806D931n64k591l519k633n25J731L264L243J653p19k795l444k450l44J841L311
$$ y = [173, 4246, 6203, 5204, 1795, -2485, -5592, -6022, -3644, 477, 4373, 6124, 5003, 1509, -2741, -5651, -5851, -3278, 816, 4537, 5966, 4745, 1184, -2897, -5589, -5623, -3018, 1098, 4634, 5940, 4455, 823, -3218, -5589, -5375, -2644, 1337, 4726, 5816, 4179, 537, -3350, -5651, -5197, -2299, 1697, 4869, 5720, 3889, 164, -3522, -5548, -4996, -1962, 1901, 4914, 5555, 3583, -159, -3767, -5522, -4687, -1625, 2199, 4911, 5351, 3274, -388, -3890, -5471, -4469, -1435, 2412, 5037, 5182, 2961, -773, -4039, -5387, -4182, -1036, 2618, 4986, 4989, 2699, -969, -4099, -5316, -3954, -691, 2924, 5060, 4832, 2286, -1225, -4181, -5189, -3697, -508, 3011, 5016, 4688, 2103, -1526, -4325, -5100, -3424, -147, 3243, 4931, 4367, 1776, -1743, -4376, -4901, -3170, 94, 3337, 4990, 4271, 1476, -1968, -4418, -4762, -2921, 390]
1822C90L063J402q29k779l371k317k28J990L337K962J228j056k844l323k081l7
1838d493K041L259K897J068j159k858l259j992J38K297L141K681Q68j271k948
1853D10l125j733K41K255L254K589P11j472k994k990j665N45K324L086K434O04
1869D474j580k896k904j534O17K510L126K198L18j678k870k840j343Q77K401L030
1885A906K095K25j773k954k693j094Q63K570K948J890L1j890k854k652r57J076
1901c263K572K951J752j25j994k856k416q08J200K567K743J740k76k032k867k304
1917c416o94J306K719K676J499m37k174k825k079n70J409K656K576J419o09k109
1933A347k851k112k76J418K723K509J177p19k178k765j897j74J550K649K418J071
$$ y = [390, 3453, 4855, 4026, 1247, -2124, -4441, -4669, -2679, 658, 3620, 4848, 3792, 948, -2375, -4456, -4493, -2452, 807, 3704, 4772, 3613, 755, -2504, -4496, -4358, -2061, 1080, 3761, 4629, 3358, 410, -2715, -4448, -4207, -1952, 1302, 3891, 4602, 3130, 136, -2854, -4519, -3974, -1650, 1436, 3870, 4474, 2894, -2, -2906, -4440, -3823, -1313, 1813, 4011, 4329, 2651, -219, -3059, -4402, -3525, -1124, 1906, 4001, 4226, 2453, -501, -3194, -4288, -3425, -855, 2093, 3983, 4014, 2124, -730, -3382, -4339, -3263, -691, 2260, 4012, 3887, 1893, -963, -3379, -4187, -2987, -420, 2323, 4063, 3787, 1755, -1112, -3416, -4110, -2804, -85, 2591, 4090, 3653, 1479, -1346, -3425, -3995, -2586, 70, 2646, 4065, 3456, 1347, -1504, -3616, -3892, -2474, 249, 2758, 3935, 3216, 1038, -1727, -3624, -3798, -2248, 401, 2819, 3890]
1949C890p95k234k748j740LJ675K636K313Q89r67k250k632j605O5J735K660K155
1966C050Q21j103k330k554j456K04J742K706K014O30j188k380k431j361L40J910
1982a386K557J907M71j216k336k365j211M50J940K546J795M36j382k436k276j036
1998c542N80K049K421J759J69j435k330k265q90O72K019K501J543kj459k368k096
2015b674p64Q91J996K257J549k6j633k319j967p31R81K062K284J362j98j663k315
2032i08j859n87J051K144K156J240k66j784k223j803m26J128K104K146J099l56
2048B856j719k317j677l73J292K074K090J001o10j722k173j640k00J319K074J987
2064B262R00n44j884k185j464n4J317K156J802Q06o63j835k127j372M4J310K216
$$ y = [3890, 3095, 861, -1887, -3627, -3624, -1949, 687, 3000, 3889, 2922, 672, -1960, -3565, -3500, -1765, 895, 3050, 3871, 2768, 438, -2116, -3572, -3368, -1626, 1080, 3094, 3724, 2536, 156, -2275, -3636, -3296, -1386, 1171, 3078, 3549, 2333, -3, -2368, -3579, -3129, -1189, 1357, 3152, 3588, 2206, -230, -2506, -3542, -2962, -913, 1508, 3267, 3436, 2001, -329, -2594, -3484, -2812, -793, 1708, 3251, 3249, 1790, -578, -2674, -3438, -2547, -551, 1706, 3255, 3229, 1596, -723, -2690, -3421, -2440, -378, 1906, 3268, 3070, 1407, -908, -2767, -3354, -2303, -159, 1997, 3237, 2971, 1187, -1036, -2839, -3265, -2137, -33, 2113, 3212, 2856, 1137, -1180, -2857, -3230, -1938, 136, 2226, 3227, 2617, 895, -1278, -2918, -3118, -1799, 275, 2262, 3162, 2618, 734, -1451, -2915, -2969, -1652, 504, 2306, 3112, 2449, 614, -1513, -2885, -2841, -1531, 685]
2081F85J771O11p62j955k034j242J32J462K098J723M36q33j850k006j176K34J505
2098a201K090J612M14r55j916j910j006L17J531K048J540K62j023j878j948q99
2114b922M72J584K045J417K11j134j929j734q41M95J670J953J335Q5j167j943
2130d03j699p16O22J721J844J232L4j254j947j599n96P44J625J911J093q0j369
2147A163j832j543m62P25J767J735J000j69j320j866j459l92R06J659J760R69
2163B641l35j450j753j379l19R27J729J697Q19l59j472j764j303j95J053J651
2179A88J655P18m66j466j771j188j02J097J698J584N31n25j514j653j162MJ134
2196a238J701J462N49o79j434j675j074J37J176J711J341M63o81j559j585r73
$$ y = [685, 2456, 3067, 2305, 350, -1684, -2926, -2794, -1332, 766, 2489, 2925, 2092, 242, -1764, -2940, -2706, -1201, 889, 2501, 2915, 1960, 44, -1866, -2872, -2555, -1024, 1024, 2564, 2826, 1803, -75, -2023, -2922, -2450, -866, 1179, 2596, 2807, 1673, -256, -1990, -2831, -2336, -666, 1287, 2622, 2707, 1540, -403, -2102, -2818, -2196, -475, 1369, 2601, 2635, 1381, -566, -2165, -2761, -2017, -392, 1519, 2612, 2532, 1163, -669, -2212, -2674, -1949, -182, 1553, 2553, 2384, 1064, -802, -2261, -2653, -1747, -88, 1672, 2641, 2306, 856, -897, -2276, -2595, -1668, 61, 1758, 2577, 2218, 746, -1018, -2321, -2516, -1463, 188, 1843, 2561, 2095, 629, -1142, -2330, -2432, -1335, 363, 1947, 2478, 1953, 439, -1214, -2376, -2372, -1238, 463, 1925, 2474, 1795, 361, -1314, -2388, -2251, -1075, 636, 1977, 2440, 1759, 200, -1385, -2358]
2212b358K16J202J681J276L74p53j574j542q64K85J236J658J218K84q49j576j451
2229a537p66L69J177J687J170J43r02j548j408o78M29J279J590J107J08r54j555
2246b89j409n74N30J336J508J007k5r42j537j349m98M99J458J447R87o7j062j549
2264e29j289l56N87J428J384Q69j38j052j448j246l79P07J358J405Q24k59j055
2281H11j516j145k50P78J349J355O83k91j098j461j081j59P95J377J309O37m22
2298A671j126j440r91q7P96J422J304N09m34j207j453q71p8R81J320J228M06l90
2316A560j219j397q71Q3R22J379J134L36m27j262j345q03J34R66J317J144L13
2333A964n82j274j279p11J85R89J327J057K33o89j219j229n94K09J021J279J028
$$ y = [-2358, -2142, -940, 741, 2017, 2391, 1638, 64, -1478, -2342, -2057, -821, 837, 2055, 2339, 1490, -86, -1537, -2303, -1934, -757, 930, 2100, 2243, 1341, -207, -1615, -2293, -1864, -585, 1005, 2112, 2220, 1266, -289, -1698, -2272, -1742, -406, 1102, 2109, 2084, 1142, -395, -1744, -2242, -1743, -285, 1162, 2149, 2082, 1020, -529, -1818, -2174, -1587, -159, 1225, 2094, 1956, 904, -544, -1790, -2169, -1462, -104, 1301, 2125, 1866, 811, -705, -1850, -2100, -1322, 27, 1382, 2065, 1774, 676, -785, -1866, -2025, -1230, 147, 1456, 2093, 1671, 545, -895, -1886, -1973, -1177, 245, 1549, 2058, 1624, 417, -1036, -1907, -1985, -1004, 316, 1544, 1950, 1560, 341, -1056, -1927, -1844, -922, 457, 1591, 1927, 1500, 238, -1107, -1910, -1776, -810, 507, 1651, 1964, 1382, 108, -1171, -1882, -1697, -708, 619, 1676, 1909, 1220, 1, -1228, -1822, -1613, -592, 687, 1715]
2350A715J02o48j291j219o05L78J072J270R13R9p34j190j151n84L94J074J280
2367H75Q69K1q56j244j033m31M38J051J227Q56q6p98j240j088l53M34J183J199
2385A024P21j20q37j283r47l32N62J103J141O57j23q80j272r26j59N73J074J166
2403A142N17j60r33j165q77k35O52J096J184M58k72r75j118q68m1O25J151R88
2421A169M94l48q79j194p38q8P42J150R36M09l95r65j102p01M7P13J029R97L84
2440A660m53j055j021o69J06P48J104Q58K80m38j003j000o59J23P66J154Q20K08
2458A529m84j074r85n21K57O96J092Q61J02n07r83j001m71K13Q58J021P72J00
2476A475o17r95r59l62K67Q46R89P60L5o43j044q67l99L72Q77R34P07No46r91
$$ y = [1715, 1817, 1169, -122, -1341, -1946, -1568, -496, 774, 1687, 1786, 1052, -138, -1289, -1873, -1479, -405, 875, 1744, 1765, 909, -335, -1368, -1799, -1361, -310, 917, 1773, 1687, 889, -351, -1439, -1792, -1358, -175, 1024, 1745, 1625, 788, -495, -1442, -1774, -1212, -109, 1032, 1689, 1566, 686, -586, -1512, -1671, -1098, -24, 1142, 1659, 1499, 566, -599, -1476, -1711, -1059, 37, 1221, 1679, 1407, 432, -686, -1554, -1595, -970, 181, 1169, 1663, 1315, 436, -758, -1496, -1584, -842, 308, 1244, 1653, 1258, 293, -809, -1510, -1463, -750, 279, 1276, 1660, 1207, 152, -869, -1538, -1432, -684, 420, 1278, 1558, 1120, 117, -883, -1542, -1419, -653, 501, 1321, 1529, 1045, -29, -1014, -1535, -1278, -582, 510, 1371, 1473, 966, -17, -1018, -1489, -1276, -418, 603, 1375, 1475, 858, -137, -1096, -1458, -1191, -345, 644, 1404, 1439, 796, -248, -1115, -1514, -1142, -265, 669, 1376, 1381, 735, -256]
2496b56q82k77L38Q42J006O32r4o92j003p31k62L69R33Q99N59j31o37j052p61
2515a200j86M67R16Q95N12j84p32r27p36k09N27R20Q99L80k04p31j013o36j30
2534a372N57R45P88M07k56p24r30o70k7M70R78Q48L24l18p14r48o00PO34Q20P79
2555I98K85k65q02r13n57M8O26Q47Q29J85l46q19q67m68R1N17R99P34K29m47q81
2576B3q79m32K07O16Q77O65K08m98q22p49n04J97O86R10N90J57m50q80p52l42
2596a172J59O42Q34O70O6n05p62q32l21K51O81R33N06Nn33p75p82k79K42Q07P51
2617E86N78l6n89p90p13k05K85P75P58M32j2n65p44o90k65L57P82P66M83j59o13
2638D21p69o48j45L75P70P39L77j68n28q38o32l6L70Q02O84L13j65n43q68n04
$$ y = [-256, -1138, -1415, -1077, -235, 771, 1403, 1309, 617, -386, -1117, -1379, -1010, -77, 822, 1381, 1250, 613, -439, -1200, -1386, -919, -3, 892, 1404, 1220, 488, -439, -1175, -1384, -857, 63, 962, 1342, 1138, 407, -606, -1242, -1372, -815, 130, 918, 1325, 1069, 345, -585, -1255, -1282, -812, 166, 1014, 1338, 1020, 306, -642, -1242, -1235, -601, 219, 998, 1283, 1018, 216, -697, -1254, -1206, -580, 267, 1096, 1281, 935, 116, -751, -1219, -1128, -611, 388, 1122, 1351, 904, 23, -856, -1288, -1081, -465, 412, 1077, 1285, 787, -35, -784, -1288, -1091, -405, 505, 1095, 1252, 802, -78, -830, -1172, -1013, -371, 463, 1133, 1199, 694, -68, -900, -1221, -970, -289, 644, 1150, 1155, 622, -153, -935, -1214, -972, -165, 586, 1164, 1128, 539, -251, -964, -1169, -884, -109, 649, 1081, 1069, 504, -240, -930, -1195, -838, -56, 710, 1193, 1034, 421, -348, -996, -1141, -766, 4, 743, 1120, 952, 424, -414, -1046, -1082, -712, 90, 774, 1087, 922, 379, -489, -993]
2658i93n9L89P57O93L77k45o60p91m56q5M78P63O65K13k32n78p60m96j8M98P57
2679B17O18K34k45o57p62m17P4M71O94N93K82l55o31p46l93M6N85O76O32J73l57
2700G32p54o65l56J75N05O74N52J70l66p22o35l09J34N44P44M78R8l60p05o44
2720g10k30P7O12P14N03j3l79p01o00k57K28N22O82N19qm65o83n40k72K86N19
2741a96O62M17K0m35o89n61j86K88N85N73M17l7m52o64n28j81K75O09O40L44r1
2762H10m06o80m98j42L03O55N95K89j59m20o70m80q8K96N80O55K81j90n10n80
2782c59n20j5M09N30O12K94k32n29n98m53J2L32O42N59K45k48m91o88l40K8L80
2803d30N71N67J98k27n82n25l86K3M13O09N12J75k44n85n57l39O9L85O14M45J43
$$ y = [-993, -1052, -663, 94, 787, 1164, 919, 259, -532, -988, -1073, -595, 168, 833, 1046, 814, 236, -524, -1020, -1038, -540, 217, 835, 1069, 824, 167, -595, -1012, -938, -467, 227, 820, 1102, 747, 116, -630, -1023, -977, -392, 284, 916, 1089, 732, -22, -687, -1043, -868, -363, 311, 863, 1033, 667, -55, -690, -999, -865, -321, 423, 901, 999, 639, -66, -710, -940, -863, -251, 463, 966, 953, 574, -127, -727, -984, -756, -234, 448, 967, 959, 494, -189, -729, -1001, -715, -196, 466, 883, 903, 468, -221, -782, -968, -680, -95, 478, 895, 858, 406, -258, -786, -967, -692, -83, 557, 901, 810, 404, -276, -774, -916, -613, 42, 637, 926, 767, 347, -323, -803, -891, -595, -15, 640, 921, 731, 221, -359, -879, -894, -485, 45, 657, 951, 719, 190, -408, -861, -849, -517, 125, 684, 929, 681, 190, -498, -838, -810, -430, 141, 708, 906, 679, 97, -428, -814, -791, -378, 231, 743, 918, 674, 89, -468, -807, -738, -353, 261, 706, 849]
2824H49k73n29o06l00J18M57N87M33Q3k56n65n79k86J28M44N68M64O9l02n49m95
2845e40k43J24M95N60L60M3l62m89m80k45J39M79N73L76rl61o15m13j84K31M52
2866a09M97L72K7l62n60m56k44K22N02N21L08j5l52n31n05n9J65N23N47K73Qm93
2888B79n14m23j05K97M89M76K55o6l68o10l15j30K25N55M80K14j38l74n04l83
2908f60n9K58N01M69K43j56l41n65l28n3K64N18M45K12k28m21m26l79k3K94N15
2929H0M76J61j45m36m50l46K4L50M35M21J61k47m05m69k67j2M10M85L81Q8k18
2950D77l90m57k98N3L51N01L41M1j51m15n07k36R1M11M43L06R5k04m96l76k11
2971f31L7M13M37L37nk24m37l42k36Q7M50K98M16M4l24l44m35k24J59M03M36K67
$$ y = [849, 576, 47, -559, -859, -741, -284, 303, 736, 819, 563, -2, -581, -867, -739, -295, 273, 737, 806, 504, -45, -540, -783, -659, -164, 396, 756, 799, 437, -52, -532, -777, -638, -159, 414, 790, 781, 420, -195, -608, -792, -561, -109, 388, 760, 787, 425, -135, -591, -835, -613, -111, 410, 718, 703, 351, -180, -685, -744, -579, -56, 491, 764, 772, 279, -235, -658, -763, -466, 23, 499, 754, 688, 320, -290, -605, -735, -510, 45, 525, 739, 601, 227, -277, -660, -719, -461, 40, 509, 752, 596, 255, -310, -638, -691, -427, 91, 536, 748, 520, 99, -327, -706, -729, -435, 80, 556, 717, 572, 136, -314, -660, -636, -286, 149, 570, 731, 484, 79, -390, -657, -669, -259, 226, 607, 695, 477, 87, -370, -668, -615, -264, 237, 578, 619, 468, 53, -454, -690, -599, -188, 255, 561, 656, 452, -44, -420, -631, -594, -181, 256, 593, 588, 364, -73, -415, -651, -564, -114, 184, 600, 644, 320, -24, -459, -683, -524, -121, 315, 582]
2993E82N9k98m48m01j45J50M33M44J99K4l18m23l72j46J62M21M04K75o0k69n15
3014b42k21j60J92M06L90K14Ql40m54k76j20K30L90L71K14q7l36l62l09j14J79
3035d27M68M02J29r1k54m45l67m7K50M79L69J32j15l35m48k43n0K53M91L22J29
3056F02j23l54m09k84N5J99M06M21P5j51l34l89k77R8K07L93L29J19j76l90l48
3077c31k20N5L00L66L25P9j86l65m14j88R7K95M04K78N0k05l90l06j90J20K42
3098a84M10L08j7j90l07l83j26L0L30L46L39Ok56l73l55j01P5L98L19J65J15l12
3120B37l60k64j29J02L36L86J92j1k63l74k80p6J69K58L37K20J0k82l05l41p9
3141e17J03M06L09K29l0l45k78l10p1J75L24L64J90j06k55l50k93j7J43L88L25
$$ y = [582, 641, 343, -105, -506, -651, -501, -68, 376, 575, 599, 281, -142, -514, -660, -498, -77, 327, 602, 542, 273, -242, -463, -623, -431, -25, 365, 579, 587, 247, -207, -483, -603, -373, 17, 388, 602, 515, 179, -183, -492, -606, -427, 41, 443, 572, 481, 227, -218, -585, -632, -382, 97, 466, 598, 483, 148, -300, -543, -593, -340, 151, 473, 602, 479, 125, -284, -568, -513, -314, 92, 513, 588, 437, 103, -286, -563, -465, -258, 135, 464, 583, 407, 17, -331, -551, -496, -196, 170, 495, 574, 388, 23, -391, -579, -482, -187, 217, 495, 545, 340, -50, -356, -546, -426, -184, 226, 534, 517, 327, 20, -363, -489, -459, -129, 217, 556, 562, 306, -67, -422, -523, -448, -50, 269, 434, 549, 237, -123, -387, -516, -414, -78, 308, 500, 489, 226, -148, -428, -504, -335, -77, 260, 480, 490, 208, -97, -438, -517, -414, -8, 301, 530, 500, 155, -123, -433, -504, -329, -5, 359, 549, 443, 188, -162, -455, -472, -329, 59, 384]
3162C84J65o5l80k79k45q9K39L33K55J72p0k85l98k31K5J94L40L14J19j43k47
3183A08l69j79j6K02L19K93J82j98l18l38r3J2J84L32L17R2j49l14l41k12O4K04
3205b18L54K75R0k06k95l31j71M0K76L64K37M8j54l40k56j81J00J92K92K56J33
3226E05k19l09l23j38J28K42L25K53J3k68k30l32j13J02K58L17K43j4j33l94k99
3247c86l3N2L18K62K17o1j41l14k83r7R5L17K92K19o2j75l11l04m9R7L17L14J03
3270C87M3j99l67k24q5J77L07J48K61o4k02k80k37j28J72K92L19Q0m2j74l34k24
3292c74n8J36L16K68J11kl15k68k30J8J82K49K88J29j35k90k57j73k3K19L02K60
3314C53Q2q9l20k25k08j3K22L28K16Q6j30k70k41j68j4K04L91J38N4q2k80k52
$$ y = [384, 549, 484, 104, -175, -420, -509, -270, 63, 318, 490, 420, 135, -263, -494, -469, -275, 65, 379, 498, 355, 108, -261, -440, -456, -254, 65, 358, 540, 342, 24, -314, -407, -395, -211, 121, 438, 530, 381, 67, -274, -486, -422, -218, 136, 411, 501, 295, 0, -331, -502, -462, -186, 178, 415, 463, 309, -31, -287, -468, -368, -176, 116, 372, 505, 286, -23, -346, -484, -356, -114, 211, 464, 477, 209, -21, -353, -466, -364, -106, 211, 454, 440, 307, -87, -386, -419, -367, -49, 213, 430, 369, 228, -86, -369, -466, -371, -54, 238, 457, 395, 220, -91, -395, -444, -347, -30, 284, 387, 430, 231, -136, -360, -445, -268, 39, 187, 448, 384, 182, -98, -335, -463, -291, 1, 320, 400, 358, 184, -150, -374, -432, -296, 20, 288, 399, 397, 82, -186, -416, -398, -216, 33, 321, 450, 315, 25, -232, -405, -428, -209, 93, 353, 435, 346, 26, -199, -407, -420, -198, 130, 346, 432, 302, 32, -209, -377, -391, -187, 204, 342, 396, 314, 34, -218]
3336b18k15M9K88K23K73J0j01l29k72j11N2J79L39K27L9j56k72k62j97J28K08
3357a18L30J72j0j74k28k34j28N2K47L49J20J7k57k02k45o8Q0K29K49J47K2r8
3379B52l19l04K2J7K20K98K00o3j35l12j49p3P5K30K92J17mj96k83j79q0J52J96
3402b6K86J64o8j74k82k10p9J45K81K18J29nk62k07k87O2P3K82K29J34n2k36k68
3425a53k04O0O4K99J68J37o7k37k87j07m5J73K55K49M7n0k37k34j81L4J62K26
3447G2K51M3j29k07j99j11m5J68K70J94N8p5k66k57n6l8J66L05J57mo6k20k64
3470b53q4RK44J77J65J20j45k62k29m0L6J34K55J73P6j79j79k84j02L8K34L05
3492B09J33qj09l25j38j20R1J73K59J74j8j38k17j95j14Q5K40J91K25j08j58j77
$$ y = [-218, -433, -384, -96, 127, 400, 410, 309, -20, -292, -403, -351, -172, 167, 394, 433, 277, 5, -257, -454, -326, -118, 212, 384, 374, 200, -28, -262, -390, -338, -91, 258, 378, 395, 138, -64, -309, -377, -297, -68, 181, 328, 350, 252, -67, -371, -349, -332, -112, 186, 386, 323, 188, -124, -273, -346, -271, -41, 251, 368, 364, 168, -115, -294, -374, -222, -26, 260, 424, 356, 182, -100, -310, -389, -244, 37, 255, 384, 379, 117, -90, -377, -315, -242, 40, 269, 403, 351, 115, -153, -357, -297, -233, 66, 234, 371, 304, 67, -220, -327, -372, -199, 56, 305, 352, 302, 65, -169, -350, -316, -154, 72, 323, 366, 237, 30, -169, -280, -325, -157, 113, 307, 365, 290, 24, -233, -289, -327, -161, 144, 301, 297, 231, 11, -253, -337, -328, -84, 93, 258, 378, 233, -29, -258, -298, -262, -128, 127, 300, 376, 197, 18, -266, -368, -330, -96, 209, 342, 334, 225, -100, -238, -358, -267, -94, 165, 339, 321, 183, -34, -229, -343, -258, -18, 173, 398, 290, 132, -45]
3514d5j91j69J91J50K69K06j21j28k56k16o6J17K49K16J95m3k25k11k34K8P0K78
3536F4J19J92n6j72l17j25j0R1K38K23J8K3j86k65j20k6O1K42K63P5m9k37k01
3559a55j62j2J46J72K29J06p6k14k25j56OJ35L02K59l7r9j40k11j81L9J64K34
3581A24R5J62j24j90k78j11kJ76K89J23J1Jk67j52j84NJ99K13J76M6o7k43k48
3604b46r8J24J79J49J89K8j07k22k02j28M5K81Q4K44J2j06k11k43r4Q8J64K49
3626A79J07qp8j82k85n8J23K30J02J91nj73k30j59n2J06J46J87J45K1k14j87j86
3649b80m6R9J83K38J22p3j20j70j94l9O1K66J78J00mj70k92j06m4J08K97O8J05
3672B87m9j05k27k08J0J24K04J39J46o1j53k31j13k3N6K55J52J49r8j78k56o1
$$ y = [-45, -236, -405, -214, -64, 205, 411, 290, 162, -94, -310, -376, -259, -10, 206, 401, 358, 133, -78, -312, -284, -214, 64, 183, 375, 319, 147, -170, -295, -305, -214, 24, 247, 265, 288, 102, -163, -283, -309, -248, -6, 257, 332, 283, 46, -155, -317, -329, -183, -11, 218, 324, 248, 34, -191, -347, -341, -206, 96, 355, 318, 219, 79, -132, -313, -274, -110, 124, 219, 381, 257, 67, -211, -322, -324, -148, 141, 264, 275, 276, 9, -143, -327, -322, -123, 90, 266, 312, 245, 2, -246, -344, -220, -41, 108, 297, 325, 218, -4, -206, -334, -289, -8, 76, 320, 332, 226, 15, -228, -322, -234, -70, 179, 286, 278, 200, 18, -267, -325, -202, 28, 130, 321, 316, 143, -87, -246, -298, -192, -46, 141, 286, 307, 93, -94, -280, -326, -227, -44, 194, 316, 243, 123, -47, -241, -280, -219, 47, 225, 325, 321, 151, -141, -247, -291, -183, 114, 182, 287, 238, 133, -94, -302, -292, -168, 36, 175, 321, 260, 107, -124, -237, -260, -204, 51, 203, 352, 254, 76, -180, -241]
3694b41m6J59K17J82M0n2k38j73o2j9R5J77J58R5l0k12k66r6P9J06K42J31Q2j74
3718A54j67k21j9K8J55J26J89K5n9j96j84j16K1J71J92J52M3r3j69k67r8R9J18
3741a16K32J01Q8j24k26j65k4mK06J66J05Rp1k15j94K8K8J61J68J06J6j76j95
3764i6j05r8J02J95J33Q8J2j33j97p8j06N5K24J39J50nj67k00j31m1P2K06J94
3787B13R3m6j65k08j73QJ07J80J56J13l1j47j75j35r1J35K19J62O9o4k11j57j64
3810c12P2P7J80J64Q8o0j57j30j41mM6K42J38P9j24j31j57p1m6J61J82P3J11j15
3834A65j19j51j29lJ35K07J44k0o2j46k07l1l5K38J07J53k1k0k27j45m6n9J55
3857a17K14J16K5j15j91p9r4L7J25J96J22J6j04k28j15l4M9J35J71J24K8j41k03
$$ y = [-241, -287, -128, 89, 271, 311, 259, 21, -152, -214, -233, -138, 39, 197, 292, 262, 50, -216, -312, -233, -127, 115, 246, 328, 154, -13, -234, -253, -225, -70, 56, 245, 270, 211, 15, -169, -285, -264, -93, 99, 251, 294, 201, 32, -235, -333, -234, -116, 116, 217, 305, 181, -45, -210, -234, -238, -32, 134, 239, 248, 177, -38, -232, -204, -176, -15, 153, 259, 275, 99, -96, -201, -299, -197, -2, 131, 219, 231, 98, -99, -177, -283, -228, -4, 135, 285, 280, 113, -87, -218, -259, -187, 19, 213, 306, 260, 95, -113, -286, -278, -171, 9, 165, 278, 247, 100, -75, -210, -301, -166, 53, 215, 284, 220, 9, -148, -312, -240, -163, 17, 181, 269, 209, 52, -78, -219, -223, -177, 65, 203, 282, 158, 27, -130, -201, -247, -86, 96, 169, 280, 165, 46, -105, -234, -237, -102, 105, 249, 229, 167, 21, -186, -217, -252, -14, 93, 246, 225, 205, -22, -167, -213, -272, -117, 97, 213, 238, 123, -68, -147, -241, -204, -79, 117, 239, 255, 151, -77, -192, -226, -177, -42, 129, 253, 281, 140, -63]
3880f3j66J4k3J83J56J81j1j94j23p9j10J01J03J93R5Rr9k22j36r2J22J44J96
3903A79Q3n1j48j29j14l0K9J77J54P5j3j13j82j21p0J55J78J40N4l8j56j75r6
3926b12J0L9J68J70J44p1j89j62j06L5N3K07J02N4o6j21j91r1N2M9J63J66P8j76
3950A05l6j58j27jJ43J18J24Q3q5j89j15j25J13M7J47J50Pn1j54r9j14N8Q5J38
3974F4J37O0j60r0j68q1J9J18K24N2O4j16j40j25q6L1J16J95J21rj46q8j76l9
3998b23N9J36J75J02Nr5j71j21j02R0J29K14L0m5n8j68j29k7l1J63K01O5M2j19
4022A22j88j52N4L5J47J09N6j0n3k14q8m0R6J11J24J51j01j09j72m5L5O9N1J41
4046A29R3nj32j29j55n9J37J66J34M8j10j00j29r7L6O8J80Q4J0k3j67q4r7NR3
$$ y = [-63, -229, -215, -238, -55, 101, 282, 271, 77, -46, -125, -235, -134, -31, 162, 257, 266, 167, -55, -191, -283, -161, -17, 179, 262, 211, 63, -66, -180, -210, -181, -4, 150, 225, 212, 99, -83, -204, -274, -119, 59, 199, 253, 215, 59, -116, -212, -202, -163, 5, 175, 319, 248, 59, -103, -209, -174, -121, 86, 188, 242, 176, 55, -136, -227, -175, -126, 37, 203, 281, 105, 69, -89, -216, -217, -74, 44, 168, 251, 166, -23, -138, -263, -150, -103, 44, 194, 201, 150, -4, -103, -217, -159, -74, 64, 201, 261, 101, 11, -157, -238, -219, -101, 123, 175, 239, 123, -17, -142, -228, -197, -81, 114, 235, 226, 80, -8, -184, -223, -164, -28, 147, 249, 254, 159, -12, -133, -235, -145, -16, 198, 228, 183, 125, -43, -172, -199, -230, -67, 134, 199, 241, 122, -66, -218, -164, -129, 18, 127, 183, 173, 120, -94, -182, -222, -126, -15, 109, 260, 159, 50, -122, -167, -132, -63, -12, 129, 222, 217, 85, -44, -199, -258, -121, 45, 179, 227, 117, 17, -112, -209, -173, -105, 75, 159, 169, 146, -21, -105, -202, -197, -104]
4071a04J55J23L7p3r7j77j40Q2R2J69J44K8p6j97n0j19J3J03J74J51l9o2j73p2
4095a08m6PN6K07R6n1m5j18j00p0j3J01J46J15m8n6p4j87m9N8Q7J70J03k9m5j22
4121a5j14n6M0J04J06J06K0j32j09j19%M0Q9J42L8O8j42p6q3j00N2J63J25Q3m2
4146A88j10j03j41K2O2P6J11Q3J8j46j25q6p6J10J26J23M1Nq7k16m9MM8Q3K20
4171A81N6r8o0j45j14K6Q2J10J17J9J2j38j48j02N1N9J30J41J6l9q6j84o2L4M9
4196i3J73N3K8K1j69p1j12PJ19R5R7mOj73j1j50LJ30J63J02j7q1q0j46k6k4J07
4223e3J30P9L6p0r1r7j12Q3M4J01N9P4p6r6j36n8O5J00J06ON4p0j21j12mQJ80
4250B9N2Q0j2j21o9r1m0Q0R2J09J06j8j55q5j13rN3J18J06J24q6q4q4k02N6P3
$$ y = [-104, 51, 174, 211, 138, 41, -136, -276, -194, -102, 67, 211, 239, 163, -34, -84, -203, -190, -87, 87, 238, 199, 137, -36, -108, -154, -147, -91, 116, 212, 161, 116, -2, -102, -172, -185, -84, 62, 177, 129, 73, -1, -188, -237, -179, -92, 78, 181, 152, 107, -15, -129, -185, -145, -41, 65, 171, 191, 59, -50, -169, -169, -129, -40, 102, 140, 208, 66, -10, -93, -193, -141, 22, 147, 230, 188, 78, -25, -166, -144, -82, -6, 105, 188, 206, 60, -65, -151, -227, -117, 9, 132, 173, 178, 91, -125, -174, -170, -122, -39, 181, 237, 139, 79, -66, -180, -154, -72, 38, 155, 174, 186, 48, -100, -202, -151, -92, 38, 179, 195, 156, 70, -114, -176, -142, -93, 80, 133, 161, 182, 13, -58, -170, -163, -44, 51, 148, 144, 150, -23, -34, -184, -181, -51, 112, 214, 197, 116, 36, -110, -136, -160, -53, 77, 156, 192, 122, 31, -66, -178, -95, -51, 50, 109, 183, 107, 11, -125, -183, -118, -18, 88, 94, 148, 78, -43, -155, -159, -151, 29, 81, 161, 149, 28, -41, -132, -172, -92, 0, 109, 215, 197, 42, -43, -156, -165, -112, 6, 112, 236, 150, 66, -18, -220, -164, -91]
4276i1P4J40K9p2n5j16q6L8K8J74K5L0rj01l3j40M8M9Q9O2O1No8j06r1nM5J34
4304E8J02J3m1j12j01r6K3Q6R4J23J0k9j29p8n5l1R1J56n6J28n5r2p6j17mJ59
4330b9P1P5N7n8r2j35l7L5L7J22J49n6J4j33j14o5P3M2J55K0qn6q8m1p8N8M2J19
4358G9O9l7k3j16p3m5P1L4J67L3mn2j38p8p5R7J27N0N6or4n4j13o3M9J64Q3N8
4386A66o2l1j52L3p3J8J27P0KK1q6j33o3RK1J15J00J05n2j36n0o6l0N3R3J35k4
4413A10j8j3j72l3M2K2J01M8Q0p8r1l6j22K2P5P0J12O7o3q0j13JKK3R2R2pLj34
4442Bp9l2k5P8J03K6L1o4m1n7p7OR8N3J22j%j27j32n5O5O3J11Q9k6q3p1j09J0
4471a22M8R4R2J0Rp2n6p8o4K7P7J29NM6j42mj09K3M3RJ00RP2j03j26m7QPJ08J07
$$ y = [-91, -17, 123, 152, 80, 25, -91, -177, -139, -111, 63, 88, 118, 109, 8, -25, -165, -117, -68, 21, 83, 144, 149, 81, -25, -116, -121, -76, 58, 160, 173, 132, 20, -81, -177, -154, -68, 26, 149, 159, 130, 1, -77, -132, -163, -72, 84, 28, 156, 101, 9, -67, -184, -188, -29, 42, 117, 174, 116, 24, -111, -148, -113, -76, 46, 195, 139, 153, 20, -94, -159, -86, -44, 111, 131, 123, 67, -21, -62, -140, -82, -40, 79, 148, 111, 88, -28, -101, -146, -75, -41, 126, 159, 155, 103, -35, -113, -188, -91, 36, 86, 142, 136, 42, -12, -125, -188, -139, 25, 108, 166, 104, 73, -79, -46, -119, -101, 26, 96, 98, 119, 33, -100, -163, -154, -133, -18, 82, 187, 135, -1, -51, -117, -147, -94, -1, 134, 110, 92, 79, -93, -126, -84, -62, 39, 87, 167, 89, -2, -38, -160, -138, -63, 7, 119, 186, 123, 43, -70, -69, -67, -44, 48, 140, 133, 136, 2, -77, -109, -134, -56, 47, 73, 104, 40, -1, -58, -135, -129, -31, 22, 144, 143, 143, 16, -116, -171, -106, -43, 68, 157, 131, 48, -23, -132, -122, -74, 20, 112, 122, 131, 59, 3, -75, -139, -112, -35, 94, 99, 145, 3, -1, -110, -87, -44, -35, 65, 74, 146, 43, -83, -130, -122, -115, -7, 100]
4501A00ll3k7n3p7k4K2P7J04L8Lq3o9r9qN7J30J2L4J4j02m3n2%j2J22R6J0j5r8
4531B1p4n4qL9Q2L5O9K4j23r8n5L7M7Q0Q5j0k8kp5p5k7O5J05L3N2J6j03j20n0
4560a12O7RR0K6Kk8J1j39m0K2M8J41j9O9l6j24j8o9l4J20L5Q3npr2j26l1N0P3
4589c4P9M7J0n1k0p5o3O7LN8O4L9Mj22j1n1n6J61L8J3J6j02J3j29n6J39M4M5K2
4618I2K6r5q3k6n9M3L7J18M1J1o1r4k1n6Q2K9P6M7j2l4j22n2j2O4J13K1M8jp2
4647D8p8Lo7K1J34J4oL2p1r8L6o6QO6R4K1q5O1j11p0J1J0J15R2L3j05m2m6k8m0
4677a14M8J15N6N9j15k5j00m0NO1O3J25K3j04k0r3o5M8Q0O1P5o0l4l2j10j10J13
4704i0Q7N8NJ5Qj04p8L2pN6P7K2N5r1p2j38O1K9N7L5J02j4j6j04n7K2j1N3N1P3
$$ y = [100, 97, 64, 37, -16, -93, -117, -95, -18, 86, 124, 127, 44, -25, -124, -132, -75, 55, 67, 101, 115, 13, -30, -82, -82, -94, 28, 124, 134, 119, 21, -53, -107, -115, -76, 6, 41, 110, 134, 11, -87, -142, -105, -58, 22, 107, 97, 69, 67, -8, -83, -110, -45, 60, 93, 145, 161, 58, -62, -112, -45, -36, 54, 80, 82, 54, 65, -74, -114, -92, -44, 97, 78, 147, 111, -13, -31, -100, -134, -14, 21, 104, 99, 92, 0, -126, -157, -107, -34, 45, 92, 102, 51, 31, -44, -107, -40, -37, 21, 85, 124, 128, 6, -5, -56, -112, 49, 87, 100, 116, 14, 27, -102, -158, -19, 25, 70, 92, 118, 23, -60, -86, -145, -102, -65, 53, 94, 105, 44, -50, -71, -127, -45, -16, 60, 107, 95, 61, -61, -113, -125, -61, 52, 73, 121, 120, 48, -30, -27, -94, -73, 61, 75, 69, 101, 30, -68, -32, -98, -90, -24, 70, 91, 6, 67, -44, -114, -103, -93, 22, 114, 147, 42, 0, -46, -74, -114, -66, 49, 105, 164, 49, 24, -76, -116, -111, -50, 13, 138, 161, 57, 37, -56, -121, -73, 7, 68, 143, 83, 49, 17, -93, -203, -90, -3, 55, 60, 75, 83, -21, -99, -67, -74, -18, 59, 81, 136, 45, -27, -165, -104, -75, -18, 17, 119, 105, 89, -15, -72, -50, -61, -8, 43, 116]
4734A16K9p7n9j7j22M5N1J11l4N2j8n3p3j4K7j5J04M2k3p1l5k2m7kQ4R1J6k0m1
4763B5j2p6j1k5J27O2k2Pm8j11O1p7J4J46kJ5Rn6m3j03J8O6R7N7qJ2j24l3r4N4
4793g5N4M8O2j1m6j0r5l8j8M8O0J12k0k6l8q1mK5K9O2O3%m7l9k4j31P6N3P9M9
4823A17j8K3j16r1N0j5R2J5L7N6j09n4l8j4J8J0K8Q9nk4p2j01K8jJ36L5o0J01
4851A17l4o2m0q7O9J20n9M5K8r0K0l0nn0J12M4kM5j41n4NNnN8O6J2k6p1%q2j8
4882a10O8N4P9JL0j28k5J9r1P8O3L6L2j5m2j48J0NN8R4L1K4n7J8j67k9N6L1PJ58
4912A40j14O7q1o5Mo0O4N8L6L7l8l5n2n8J9lJ33Rk5J5J3j12l4O0k4J10J9l1M8
4941A00o5p3m9K7J4P8M7J4m9m7n5l2L4O4ML0L0k8l0q1m5L4O3O1l9K7O8j61M0l9
$$ y = [116, 145, 68, 9, -8, -130, -85, -34, 77, 43, 95, 77, 24, -49, -63, -36, -51, 53, 95, 72, 1, -34, -56, -103, -105, -21, 70, 86, 66, 25, 13, -63, -74, -99, 28, 90, 68, 75, 27, -84, -23, -100, -86, 60, 58, 73, 82, 26, -17, -120, -102, -36, 61, 118, 110, 122, -2, -35, -129, -75, -21, 27, 89, 78, 32, 22, -73, -111, -129, -81, -21, 91, 71, 45, 7, -74, -78, -53, -24, 38, 101, 101, 54, 15, -9, -140, -64, -11, 68, 117, 99, 122, 6, -85, -35, -50, 42, 57, 94, 150, 41, -13, -51, -65, -47, -37, -9, 80, 75, 51, -21, -122, -94, -95, 41, 76, 16, 117, 83, 21, -19, -106, -37, 83, 24, 69, 97, 7, 27, -3, -8, -58, 54, 98, 96, 141, 0, -54, -49, -44, -49, 9, 75, 87, 61, -10, -10, -92, -110, -42, 12, 91, 92, 122, -6, -31, -12, -103, -25, 38, 74, 106, 91, 49, -99, -89, -84, -26, 68, 99, 123, 66, 84, -83, -112, -56, -25, -18, 140, 26, 93, 12, -53, -49, -109, -45, 13, 49, 86, 48, 13, -39, -97, -78, -81, 52, 61, 36, 51, 64, -48, -82, -22, -46, 64, 83, 52, 100, 35, -38, -87, -60, -46, 32, 79, 93, 44, -3, -58, -90, -56, 8, 12, 42, 72, 44, 14, -67, -112, -78, -15, 46, 7, 34, 102, -59, -19, -58]
4971e8j6J09R1p4M6m0p0m4r7J10M8OL9K3j4k6r4m2O0N6J2N9j7K1j02k2k0K2M4
5000A0N4N6l0r9ll7k2L5J2P4J3Np0k8qp4Q3L5P5k5K4q6k9M3o8M5J0P8Mm2Lo2L6
5033A2l0k4J12m2R7j15j0q6l5O5M3L0L5J6Rp1o0K7k7J6Q3M9J6n0k7m5n9J5M7L6
5063B7K8P3n1m8o3k2M0j6M4N5k2K7o9J7o1J5M4O8n0J1K2n6q4K3M3n1Q3N6k0k3
5093D0n8k3k5J6L2J6O7K4l4j08P3q8P9NN6m4Q7j12k4l4Qk5Q6K3l8O8k1n7m0k3
5123g4j1J12J2M7pp1n9J8k9K7J8M4K0Ln7l1o1J01o2N8L2L0l2m2qj3lj2J05J0o
5154E9l8k2l6j8m2J18qM5pJ9l8j02N3qm9O8P6n6j1k0k7lQj5O2M7K3n2Pq0opL9
5187b1R3QJ0n6Jp0J5J0Q6n3rN1o8k4K6o0J4M8O6o9Q3Mj25Ooj9N8%O6k7K5m3j4
$$ y = [-58, -74, 35, 126, 52, 98, 58, -12, -56, -153, -43, 5, 11, 50, 73, 59, 33, -61, -103, -43, 13, 25, 84, 67, 88, -14, -36, -56, -34, 10, 64, 120, 90, -9, -12, -49, -71, -36, -24, 50, 63, 68, -2, -30, -38, -112, -29, 6, 81, 56, 80, -6, -35, 8, -60, -15, -5, 73, 77, 35, 38, -24, 12, -18, -42, 70, 28, 125, 10, 0, -86, -121, -56, -13, 17, 52, 68, 77, 6, -54, -27, -54, -38, 45, 94, 110, 60, 33, -12, -71, -56, -9, 27, 55, 128, 77, 29, -34, -56, -16, -32, 12, 67, 45, 72, 3, 20, -41, -26, 18, 86, 36, 47, 69, 13, -71, -48, -5, -56, 27, 83, 63, 40, -18, -41, -66, -50, -18, -2, 65, 89, 55, -53, 20, -68, 11, 16, 72, 28, 115, 3, -21, -55, -47, -72, 14, 37, -1, 67, 46, -11, -51, -74, -85, 27, 39, 86, 79, 8, -51, -33, -62, -35, -17, 27, 47, 50, -7, -38, -99, 2, -60, -2, 30, 60, 28, -14, -22, -35, -38, -50, 55, 65, 59, 21, -1, -37, -55, -97, 21, 13, 58, 51, 70, 32, -70, -17, -25, -74, -6, 70, 14, 3, -17, -44, -47, -39, -54, 8, 55, 78, 26, 33, -47, -53, -60, -21, 72, 80, 90, 34, 35, -35, -20, -10, 76, 23, 14, 65, -3, -27, -1, -61, -47, 1, 67, -2, 81, 85, -40, -34, -40, -59, -1, -1, 65, 38, 63, 20, 6]
5220Fm1j6rP2L5JL5m9j27l7Q4N1O1k0N0Jp6p3m4J00kJ5Q2kk5j38j6N4J2K5K3j
5252C1M5J9j17o9L0L6K4N4j3l0K0J2j08J1N1j3P6l8j6ll0l8J6O9l3Q4m5L1n3n5
5282e2Oo7N2O7R4o9Pj7r7K5l8J27m9Q6k3Oo1J1m3pK0O0n9N1M3p8n3M8m6JP4k4
5314eP4j2l0n9L0o5O7K4L9J9q2K4q1O1o8M7Q9l4M4L2j38j6j0J0J5J9R4l8ol8q0
5345g4L1j3lP6L6k1l3j3J0o3K6L3J8k2J00o1n0pKk4N8L4LJ9k1l0r3j0P0J3J4J00
5377A05K4j10p3j1L0j8P2RJN4o8m8Lk9JO0jK9J8n4k6Ql4K4K5K2N1l4J0k0m8K6
5409bm7R1L0M1n5q9qPlmP8rO3l0l4Nn5p5O9N4RnJ5m6l5o5rJ20m7J02k5M8j2j30
5443e3l9M6M5L9L7%%l9n6pk6J9O5J0j0m3J1nJ4o6K2K3J11k4l0l3j7j9L6l5L7j4
$$ y = [6, -35, -51, -60, 12, 47, 48, 83, 34, -93, -130, -46, 5, 66, 46, 96, 97, 21, -52, -96, 4, 2, 17, 99, 97, 72, -66, -82, -28, -16, 9, 32, 31, 76, 95, -22, -91, -61, -25, -1, 53, 40, 10, 30, 42, -66, -55, -4, -17, 59, 21, 5, 2, -28, -66, -50, 19, -14, 70, 25, 56, 3, -52, -46, -113, -61, 6, 100, 31, 38, 21, -76, -51, -89, 38, -11, 75, 52, 58, -3, 8, -35, -42, -22, 38, -21, 30, 73, -5, -58, -10, -56, -55, 19, -5, 69, 57, 27, -32, -2, -67, 0, 24, 63, 82, 0, 24, -57, 4, -64, -17, 72, 38, 82, 114, -24, -40, -50, -40, -25, -6, 88, 50, 44, 6, -74, -43, -56, -59, 17, 53, 32, -1, -14, -4, -67, -41, -8, 10, -12, 88, 27, -23, -30, -28, -52, 6, 40, 43, 62, 41, 11, -82, -92, -22, -9, 5, 105, 129, 19, -54, -65, -35, -53, 19, 28, 29, 83, 15, -33, -30, -59, -58, 2, 1, 30, 48, -6, -32, -24, -58, -34, -9, 13, 64, 30, 40, 20, -28, -2, -49, 42, 72, 113, 58, -31, -39, -32, -35, -39, 39, 30, 93, 63, 29, 34, -21, -96, -27, 27, 36, 31, 46, 0, -35, -100, -109, 11, -36, 66, 41, 89, 77, -53, -92, -46, -1, 38, 75, 75, 75, 36, -20, -27, -53, -34, 31, 41, 31, -12, -1, -6, 8, -58, -36, -13, 98, 74, 44, 11, -6, -25, 11, -24, 13, -1]
5475aL6Ql0j9n9KM5M6N3k7Jj6l8p9L1M0N0L2Kk0n8Lj07M9NJ31l4J0Pj12N9n8L5
5508a3J1M4Rl1K4l5p3J6J9J3M1nP3k8q0o6M8N1p4J01pJ9J1j24j4J8L4K1J03j8
5538H8Pj01M1m3l5O9qqJ2M0j3r5O8rj3K3J8K9j1k1o8n0L9l0Q3lQ5o5K0p5Jk5L4
5571a6M5K1kj6K0j4j05N8J4oL3L8qr7M2o8N1kL7j1P3l8k6j7j7j9K3M5RM9p8m0
5603b2%k7m6M8L4K0N6o3mJ6o3J7M4J2j1M2j2o7L0j6J1RL5%k6N3q2Mm7JK1P9J3
5636E9ln0J5n6N1p1N3O6nM1q1J1p8J9K5l2O3L9r9M8K9j27P9n3N2Q8l2M1m7k5o9
5667d9o8J04L0L8lko1j9p3J06j7L3R7p2l4k5pL0n9O6l3N9lkl8m9pqJ1M3M2n3M7
5700B4L9n7m4Rj7N1kP3J1j15J3l0lK5L5N1j0pm1j7k4m1J0P2M4LKn7j6m6qM4K5
$$ y = [-1, 35, 43, 13, -6, -65, -63, -18, 28, 81, 54, 55, 39, 1, -78, -47, -7, 43, 75, 77, 57, -1, 2, -105, -56, -51, 80, 46, 56, 63, -49, 10, -48, -13, -2, 42, 51, 20, 44, 9, -64, -48, -29, -16, 25, 20, 93, 65, -15, -81, -33, 18, -56, 45, 38, 57, 68, -56, -70, -52, -18, 3, 106, 88, 95, -6, 35, -8, -43, 26, 18, 10, 22, 62, 49, -46, 22, 13, 0, 23, 41, 70, 59, 38, -30, -80, -41, -71, 12, 9, 94, 29, 49, -26, -25, -50, -16, 29, 50, 48, 32, 52, 38, -67, -9, 5, -1, 32, 70, 62, -35, 7, -61, -10, -12, 25, 14, 87, 49, 23, 6, -11, -30, -7, 38, 47, 96, 18, -22, -22, -49, -95, -47, -13, 7, 63, 0, -4, 12, -51, -34, 10, 22, 11, 53, 41, -26, 4, -12, -1, 8, 43, 43, 17, 70, -12, -8, -55, -54, -33, 46, 59, 56, 6, 21, -35, 16, -55, -2, 64, 59, 100, 19, 30, -48, -29, -4, -36, 27, 66, -33, 15, 44, -83, -4, -57, -5, 83, 51, 92, 45, 20, -49, -117, -13, 17, 55, 52, 50, -11, -30, -103, 3, -14, 19, 116, 44, 10, -15, -22, 8, -51, 15, -18, 41, 38, 36, -2, -51, -58, -66, -55, -12, 30, -23, 24, 63, 6, -38, -29, -46, 5, 3, 76, 87, -28, -15, -45, -48, -23, 12, 63, 53, 46, 5, -12, -36, -77, -67, 5, 49, 52, 54, -3, -19, -65, -73, -29, -4]
5733dN6Lj5q2j0K1oJ1N6k1M4L9n7j02KJ4J9N8N9k1N5m2j25N9j3J0O9o6J5pMm4
5765b1ml9J5N3L8N3j05m2j1J2J9MK4mO7q3K8n0kJ8J0Q7%k0Kk5q1O9m2M4K8pN4
5798H9j01j4n6L3L8K0N8jp1Jrk3n3K2R3j3N9o7N4o4k3M4m3j1P0K6l9Ln6K2m9N4
5830gK0N0n8O0j5p8l8M8kM3K6k6K7k9k9k7K3j3P1k7L0n2m1N7l2l1k8O1M6nP5p8
5862B1j00mPP3k2O7Qp5MQm3JM2O9OL2p4n0j0k6P8j6L2%Rj1l1j4J6ok6L2K5L7k8
5897C1j6q0P0q0P3O8o5N5m8n7K4l0j3NJ30k9k3M1j04K5l7NL5L8M6o7Pkk7m3J8
5928e0O5K8l4N0o5Nl6j6J5K7O8p8j6M3o5J0M0J7P5p6J11j04n3J5l4L4k8O8J4O8
5958I8n9l8ol5n3P2N8j7M3J0o1o2N2m5K6rJ11k2n0j3J3j9o9N1M7nJ8Ml3m4j2R5
$$ y = [-4, 52, 55, 40, -42, -52, -31, -37, -26, 30, 9, 53, 92, 35, -67, -65, -51, -32, 26, 85, 64, 119, 77, -48, 11, -2, 8, 77, 11, 26, 19, 23, -21, -25, -64, -49, 4, 42, 95, -10, -52, -63, -51, -32, -28, -4, -8, 59, -24, 4, -46, -48, -30, -20, 67, 67, 47, 49, 24, -57, 12, -30, 14, 42, 35, 89, -12, -26, -82, -49, -11, 9, 67, 66, -5, -4, -13, -36, -89, -67, 26, 13, 72, 5, 59, -5, -28, 16, -27, -38, 32, 58, 19, 22, -34, -12, -61, -7, 13, 63, 5, 65, 50, -28, -66, -18, -20, 23, 49, 23, 50, 21, -8, -35, -12, -25, 46, 19, 49, -3, -44, 13, -19, -50, -78, -17, 29, 24, 99, 21, -79, -83, -76, -3, -25, 42, 50, -25, -21, -13, -56, -55, -13, 56, 62, 94, 20, -30, -40, -66, 12, -4, 28, 28, 37, 26, -5, -19, -3, -9, -35, -3, 22, 59, 31, 15, -65, 5, -75, -2, 66, 1, 56, 8, -49, -25, -55, -68, -63, 67, 38, 15, 56, -48, -23, -60, -55, -20, 18, 64, -3, 4, 2, -25, -68, -50, 15, 43, 9, 59, -6, -1, -37, -53, -38, -11, 57, -21, -37, 6, -59, -49, -9, 8, 83, 7, 118, 14, -39, -24, -58, -24, -52, 16, 30, 98, 39, 1, -5, -40, -93, -21, 37, 20, 63, 73, 12, -50, 2, -43, -17, -26, 85, 63, 13, 0, 13, -6, -75, -24, 23, 18, 36, 40, 7, -37, -49, 46]
5990D6o7K5M6mk5n0o0P4q2P6J3L0O6k6q5qj3L6M5k3J7LJ7n1l7lL0k2N8O1k7On
6023F1r9ONM5J8K8Qq7J5o6L4j3J9L6J2Q4r8j1p1PK7N4L5n8P5k8m4k1m7J11m5L7
6055B9kL7L2o0q0j0l1Q8L1RJ3k2m5n8L5K4l4N3L2M4m8q0j2m8R9j5O3M1o1jk9n1
6087e7j1O4NN7j7Qj3n5j0rJR3K7j5j7l6l8n9Q2LJ5K6jL2l0j07M4lL6K0nK6n5O2
6121F3n4r1M3P3Ml2j3M6j1n9PK0LJ4N8m8K3Pn4l4NK9rN6j4j5L9q9j6jK7R0n0M1
6155E8pp7mm2M3lL2N7k6k6K2jm8j5K1M8P8j07J9j2K7n9J8K8j0L3k5lm7nJ2j5L3
6188cO1l9M4p9k2j3k2K8P8n6J63q7o9K8l4j2kRj0P7rm4j8k0QL6j1O6N0l2k5m5
6220dk5l0M7M0J7K3nk8m7K1l6k8J12l8K9L1r4k5J0lk7N3J3M6l0l9rl7M0J5j4P8
$$ y = [46, -21, 4, 50, 46, 21, -29, -89, -15, -97, -21, -8, 22, 88, 62, -23, -31, -44, -8, 37, 14, 31, 34, 51, 0, -37, -40, -10, -32, 26, 87, 60, 66, 61, -38, -32, -27, 18, 36, 64, 72, -15, 0, -66, -32, -45, -26, 10, 22, 106, 8, -3, -74, -67, -40, 14, 49, -9, 66, 38, -6, -27, -74, 37, -8, 29, 27, 64, 96, 36, -44, -54, -85, 3, 34, 43, 56, 34, -11, -69, -34, -10, -44, 9, 41, 85, 37, -43, -55, -103, -4, -19, 44, 85, 24, 23, -6, -57, -68, -4, 1, 58, 41, 49, 36, -19, -29, -38, -37, 56, 83, 68, 51, 15, -23, -82, 0, 3, 18, 44, 43, 75, 45, -62, -18, -21, 15, 35, 30, 56, 1, 63, 9, -82, -39, 34, 38, 6, -7, 39, 28, -31, -24, -4, -1, 13, 71, 23, 46, 53, -1, -35, -30, -1, -10, 46, 32, 17, 56, -33, -49, -50, -23, 67, 17, 58, 51, -26, -30, -72, -29, -32, 0, 57, 31, 5, 27, 26, -22, -37, -16, 32, 110, 3, 22, 10, 37, -22, -4, 24, 14, 47, 22, 19, -28, -33, -21, -36, -3, 58, 19, 63, -16, -38, -51, -73, -45, 33, -23, 140, 53, -16, 12, -22, -34, -36, -27, -37, 40, 31, -13, -31, -51, -43, -7, -18, 48, 98, 66, 41, -4, -29, -59, -12, 28, 45, 68, 63, 35, -12, 9, -27, -55, 57, 19, 48, 79, -15, -40, -30, -33, -60, -7, 6, 52, 22, -17, -26, -63, -23, -8, -22, 56]
6252E6m9L4o2n2K1L2J5rO9JN4j06n1K2L8nk9Q5L3n8l6J0o0J1J9K9M3n6K7n5Lr
6284c5j3MJ17l8j5J4m9joK3J9m2P7Nj3k8n9j5L5k5Q2N4n4%j5L5m3k5M0j1M4J7
6316G9o3l2om1J0K2L8OL8l1q5OL6k9O9KL4j3k8ql1J4k8NN6O1m4j7oj3l2LK6M5
6350D3J6rn3L7o5j9Q3m9P1qRn7k5J3m8LO4N6k8L4p7n1PoJ5K6M3j7J9p0J6K0m3
6383e0Q5Pj2LL2q9Ok3j1J7N0J3J9K5n1n6M5k8k8P3N1ql0o5nN4l6J8k7L6K1j9r
6416Hmo1L3%P1n3L0k8Lm8PM5j7L1O9j5l3n3o7P4k9M0j4J17k7o4l7l7K8j3j8J21
6448E9n2J1J5m1J6J5p3M6K9KL1k2o1M1m3l3M0QJ03k0o6J0p5L6J7oJ7L8Q7o0q9
6479b0j6L5k6K5Q1n5j9k5l7O1n0J5N3j6Q9m7L1j62K4j3K0L6RL2j0ko5LO3p2M1
$$ y = [56, 7, 41, -21, -73, -52, -20, -5, -14, 55, 56, 110, 4, -47, -25, 13, 8, -21, 64, 97, 39, 3, 13, -47, -36, -17, 12, 55, -1, 26, -29, -26, -35, -48, -44, 73, 35, 20, 34, -15, -16, -22, 1, 20, -22, 55, 60, 47, 19, -40, -55, -20, -45, 37, 91, 37, 37, 22, 57, 14, -11, 29, 18, 62, 79, 16, -16, -22, -63, -53, -31, 7, 13, 51, 20, -65, -59, -23, -52, 17, 19, 53, 40, 12, 4, -27, -13, -41, -36, 20, 81, 37, 20, 14, 1, -31, -28, -2, 43, 59, 50, -3, 34, -31, -50, 33, -16, 55, 47, 56, -1, -26, -13, -61, -58, 6, 62, 34, 68, -9, -60, -53, -59, -44, -18, 25, 8, 27, -43, -27, -7, -50, 35, 42, 30, 33, 65, -24, -18, -41, -52, -35, 15, 28, 47, 72, 21, -35, 10, -18, -46, 27, 78, 70, 40, -25, -30, 24, -12, 6, -21, 15, 36, 17, 8, 4, -57, -24, -24, 47, -6, 24, -4, -1, -49, -42, 3, -14, 17, 86, 71, 38, -15, -82, -8, -37, 3, -11, 106, 79, 15, -22, -59, -31, -44, -62, 59, 7, 18, 33, -8, 8, 23, -50, -4, 25, 27, 58, 36, -25, 16, -27, -60, -20, -12, 91, 71, 5, 15, -60, -24, -7, -13, 4, 42, 129, 69, -20, -36, -1, -27, -2, 79, 24, 5, -20, -57, 4, -46, -31, 22, 6, 95, 48, 79, -83, -59, -72, -52, -16, -7, 25, 15, 13, -52, -49, 14, -58, -17]
6510a7j4R4%m3k9m3K7J7N8qO0o8n7k6j1Q7l3J6Q8Mo3m0J5p1O7k4L7NL9k8o8M0
6542A1j07Q1K0J0L0j4m1N7m9p5M2ML5P7o5L9o6l2ml2P9P8K2n2pn5L3j12O9M0J02
6573A18m6j8kk5o5K8Qk6K9M5k4l9Jj8k1K9OK6L2ln0Nk1l4jQ0M1j0Rk0pn1J3J5
6607DJN6l1L9m4n1L0p0Q6L9j9l6J4K0m9n5M2J9QJ7J5jj6j7m4j2N5OJ1K0nm0k3
6640c1K4j9J4J8N6k2J9pn1k7L0j1qQJ7M0n0K6j7o7M2%P0K7o4M4j62J03rQl2N7
6672B6j2J5K5n8p1K9J4Q0N5j08J6K6m9n3N7jL0RM4%j17L2k3j9P4KP2qp1J2o6K6
6704a2j6N9l7L7j6oj1j5j0M2Rj0J9j1M1m8m0o3J10l2N2J7k0J8k1j1p5O4mO3l3
6735D0KJ6l7p0K7K4qP9j1J8lr0J6j4rQ6j1Qk7q6M5qk2J0J9O2k2l1J7q3rO3j7K8
$$ y = [-17, -31, 63, 63, 20, -9, -52, -25, -8, 50, 42, 102, 34, -23, -49, -60, 27, -6, 10, 98, 102, 39, -1, 14, -57, 10, -14, 23, 28, 67, 39, -29, 11, -96, -15, 5, 15, 45, 31, -10, 47, -2, -77, -35, -31, 4, 81, 16, 55, -11, -43, -47, -79, 0, 78, 100, 48, 41, -14, 19, -93, -24, 16, 118, 72, 54, 52, 27, -38, -10, -2, -28, 1, 46, 22, -17, -16, -34, -55, -26, -20, 6, 38, 35, -15, -10, -31, -65, -66, 14, 55, 45, 54, 34, 27, -24, -11, 4, 5, 61, 30, 69, 25, -26, 4, -66, 20, 59, 40, 4, 18, 38, -11, -66, -24, -5, 3, 20, 35, 34, 18, 1, -43, -55, 0, 6, 17, 37, 32, -8, -31, -7, -26, -12, 6, 62, 40, 59, 52, 1, -26, 4, -7, -15, -7, 10, 50, 0, 26, 9, -58, -16, -16, 54, 81, 17, 61, -101, 2, -7, 1, -31, 26, 14, 29, 54, -4, -75, -46, -32, 48, 103, -5, 11, 37, -12, -65, -8, -9, 21, 30, 74, 74, -43, -11, -34, -53, 21, 23, 95, 87, 16, 28, -38, -12, -28, 31, -6, 31, 15, 9, -2, -17, -27, 15, 24, 14, 33, 22, 63, 15, -25, -88, 22, -10, 42, 59, 39, 57, 36, 25, -50, 14, 10, 73, 40, 42, 58, 21, -49, -22, 2, -6, 73, 62, 80, 77, -13, 3, -11, -20, 66, 55, 63, 36, -50, -5, -13, -35, -25, -6, 56, 34, 3, 20, -63, -72, -9, -26, 2]
6769BL2P3p4k4o2PO5LN2n5M9p2J4l6Jk9P2k9P4Lo8J6Lo0nO9j6KQj4QJ5n3J4m6
6804f1R2k1nN0mpp6o1Q0O6mK0q9P3q6K1n7L6J6N8K3p1rL1p0P0k6J1RJJL4j00R
6838d6J5%M3LM3m9Km5j3M5J5j7P1l9L4m4o9N5Km5P8On5O1p3k6k0K9P6J8l0jK2
6871D6k6m0mK3pL3n0N4nl4%l4OM4qM8k9n0%j3N5j7P0k1jK0j24M4l1N5n0J03J1
6904F8k4J9Or4J1lK3oK4l4NOl5K3l1J4j2Q5L0k7m2o0mL9m6Q5Mjl1l8j7KP3l3N9
6939C8m4R9q9j0j5l4P7k6J8O9j1m4n7J9k4pQ4k8P9p6oL7j00J9M2l1lJ4L4j3k5
6970a4J7n6J0M3M3j8mn7mK1l9N0J8N1m3J2K0k6p0J9J6L3J0l8M8k5l5J5j4N8p2
7001c1N5j3Om4j3O1m2M0k7nQ4q6K4k7m3Q9l7O0j5ool2Jn6K9K5J0J8Q4j21L0n1
$$ y = [2, 34, 107, 33, 9, -53, -46, 19, 22, 74, 19, 68, -4, 10, -26, -25, -54, 18, -11, 63, 66, -2, 14, 17, -43, -48, 21, 5, 7, 15, 1, 9, 24, -29, -15, -61, 31, 10, 5, 55, 51, 44, -32, -93, -13, 53, 49, 69, -20, 53, -33, -12, -69, -33, -17, 41, 64, -7, -16, 15, -55, 15, -11, 0, 9, 10, 11, 45, -55, -46, -31, -31, 12, 15, 58, 9, 11, -34, -47, -2, 13, -4, 67, 28, 62, 18, -51, 4, 6, -39, 39, 45, -10, 51, -22, -48, -68, -39, 37, 55, 25, 24, 46, 20, -20, -24, -1, -8, 25, -25, 29, 24, -10, -10, -44, -38, 6, -2, 46, 17, -33, -33, -46, 9, -8, 62, 41, 40, 60, -64, -20, -51, 4, -46, 57, 68, 44, 63, 69, -25, -14, -17, 6, 0, 24, -10, -5, 1, -34, -11, -42, -28, -40, 45, 75, 48, 6, -54, -58, -19, -65, 20, 24, 23, -8, -46, -63, -61, 12, -21, 38, -6, 93, 4, -6, -21, -55, 22, -4, 14, 83, 72, 28, -29, -10, -34, -41, 43, 15, 94, 18, 12, 49, -51, -32, 10, -21, -24, -10, 24, 11, -14, 3, -53, -43, 0, 43, 25, 21, -36, -40, -19, -58, -8, 10, 61, 18, 30, 50, 24, -46, -27, -11, 22, 32, -6, 42, 17, -18, -3, -17, 41, -31, 24, 11, 17, -27, -40, 21, -21, 19, -8, -13, 71, -15, 9, -18, -61, 28, -9, 51, 36, 30, 24, -8, -7, -63, -34, -9, 1, 19, 103, -18, 12, -39]
7033c9M4o2J12k2j0M3o6K0n7k0nR1Ol0J04m6j02j1K1KLK6L4m1M3j2m5qORJ0K4
7065B2J0Nj4o1J3K4J0M2J9l6l3J2l1On4J7Q7mK4mo9L6n3l6L4L9J6J2N0q4l5j9
7097e5M8K1J2Nk2j4l3m0R3o3J00Nqm2K6k5l9K6l2O2J8jJ1Rr9j9nN1K7J6K3l0o
7130B0o7m6M7nP5J8mm5K2j15N5K2k7N7J7Jn3J7K7k4j08P8lO5nj6K7n9j5mL3P8
7162F3l3K3p3M3k4m8oQ0rN0pl0k7j8K3J1m4O6O0r6rK0M4q3m3J05n0NJ1K1l7l5
7194d7J3l1K6K3J14q5L8l0m7L7l2LO1M0k4l0p4N7K8q1O3j6M1n1JQp8P0j1P3L7
7225I6j05M3m7LJm3M2NK7L0m5M8r5nkjK7N2RNm4rJ4q1L9O3L6mm4K1r1K2N9r0N0
7260a4M1J3L0n9mq0%M4N2j4j9O2rpp3M6mo0O1kM7%p7k3L1J7mO6k0n3J3J2m6J2
$$ y = [-39, 5, -57, 55, 33, 23, 66, 0, 20, -37, -57, -62, 29, 35, 5, 109, 63, -39, -50, -29, -27, -24, 2, 36, -5, 38, 26, -19, -27, -21, -12, -2, 22, 32, 37, 23, -38, -25, -1, 9, 51, 70, 34, 1, 13, -18, -12, -66, -49, 38, 34, 58, 54, -15, 21, -32, -68, -34, 5, 21, 33, 83, -1, -36, -55, -7, 14, 26, 31, 9, -5, -38, -78, 15, -48, 52, 57, 49, 7, 33, 8, -31, -5, -37, 25, 43, 42, 53, 62, -37, -56, -61, -10, 17, 33, 56, 26, 20, -47, -93, -46, -51, 24, 42, 38, -7, 15, -100, -45, -23, -50, 7, 24, 25, -28, -11, 16, -8, -116, -38, -41, 24, 19, 3, 30, -29, -44, -48, -15, 63, 30, 53, -20, 23, -1, -49, -55, 25, 16, 66, 59, 29, 2, -16, 7, 18, -26, 40, 100, 4, -5, 15, 59, -24, -67, 38, -12, -7, 4, 25, -12, -47, -34, -65, -39, -16, 98, 13, 51, 21, -26, 11, -21, -18, 43, 83, 59, 29, -45, 12, 40, -41, 22, 6, 47, -4, -3, 5, -73, -3, -14, 59, 96, -9, 34, -13, -10, -9, -52, -10, -5, 22, 52, 7, 55, -40, -45, -47, -48, -21, 31, 40, 45, 1, -8, 6, -75, -36, 27, 63, 59, 15, 36, -55, -33, 26, -64, -14, 27, 40, 70, 11, 7, -73, -73, -29, 23, 9, -10, 52, 43, 36, -37, 9, 5, -55, 6, 4, 51, 51, -26, -49, -18, -1, -5, 61, 41, -12, 1, 13, -33, -21]
7294b1L5RO4n3M0m4o5M4l5N9k2Pk3K0Mk1Qq4O9j2M6L1n2m4l0PN3j5K8J08p7K2
7326E6k1p9M8PM6m6K6qjlp1nO1LL0L4p9K2Nl3J0k5n4Q5l5L1%J1m9k6K7K7M9J2
7360E5o4Pk0M2j4j8NK8q%k0Lnp2J11J4rj2l9k1K0J3j9J4N0m1N9q7P0n6j6j3lR2
7394D6K0o0l7mm9K8K6J8j0O2K1m7k0J2k7jJ6M9J6n1N3m7l0j2Rm1M7J00l8m2J1
7425A8J3o0j0K4K5J7k2L0pj13L5N6K7Lj2K8m3J2j1r4R4m7O7Rl2l7N0k1k6L7L0
7456D0m2k5M0J3Lj03M5L5J8qN8l3J7o7K0n6O7o2N4j8L8k9L5r2J5M8OJ7o3R8p6
7487gn9L8lL7l2qK4N8j8q5P4n1K5K7PM2k9k8m0KJ7LN4j7j6j7lk2l6L7J1J1l6Q5
7521D5Oj02J1l8L1J2N4M0J3j11J36j53K1K6K2PJ8K3k6k0m6J9j6K0O1Rn3K2K2m7
$$ y = [-21, 14, 23, 87, 34, 74, 30, -35, 9, -26, 33, 11, 18, -5, 15, 19, -2, 6, -78, -9, -21, 25, 56, 4, -40, -70, -63, -10, -25, 3, 111, 34, 56, 35, -44, 4, 11, 57, 11, 37, 29, 28, 25, -46, -51, 10, 13, 43, 77, -2, 20, 25, -8, 2, -23, -77, 8, -27, 4, 4, 15, -34, -60, -33, -6, 43, 55, -9, -2, -22, 20, 6, -12, -7, 21, 13, 13, -7, -4, -9, -81, 30, 44, 35, 23, -16, -37, -17, -4, -23, -9, 41, 0, 59, -28, 42, -14, -30, -43, -46, 46, 66, 6, -31, -35, -84, -56, -30, -12, -22, 40, 61, 14, -6, 6, -21, -22, -6, 43, 59, 8, 61, 14, -16, -28, -19, -60, -13, 87, 49, 7, 18, 31, -29, -39, -15, 10, 27, 5, 35, 28, -85, -50, 6, 33, 36, 24, 52, 9, 21, 10, -84, 10, -37, 30, 39, 7, -30, 20, -1, -27, 10, 40, -2, -27, 13, 26, 29, -74, -29, 6, 24, 16, 74, 41, 58, -9, 11, -45, 22, -40, 14, -4, 34, 5, 40, -52, -37, 11, 17, 34, -29, 69, -7, -66, -28, -31, 6, -26, -34, -10, 48, 30, -55, 19, -32, -7, 20, 27, 69, 40, 12, -28, -26, -9, -6, 48, 31, 15, -2, -5, -27, -63, -26, -15, -4, -40, 45, 51, -51, -40, -78, -47, -35, 19, 59, 72, -39, 97, -56, -35, -9, 13, 20, 38, 61, 35, 15, -31, -12, -28, -8, 53, 62, 9, 31, 53, 6]
7551FJ3l9N7L2k5M5m8nk0km1m9P0J5J7k2J6n9K1rQL8J9m7J6ql9L7k7j3N4M9oq6
7585c2M4m7nN7j9NM3nl1m2l4J8nO9J7pN9q7j9J0kM8j5j8J3J2k5M2m7l4L5J5K1
7618C4M5n3ql7l2N9m0L7K8lL4o4n5KM8pM1l4rK4k3N2j3k8K5j2Oj3%m2J8n0M2%
7652b8N1ol2J6J1k3%n1P4J1J5j1m0%j5jQM7L9m0Om2lJ8Nq3Q8L5jJ2p5L2l2K8J0
7687B3j0J6l9K5J5n8qn4Q7J9J2M0k9o4K6m5O2Rm1L4k1N1l8l6k%MM2rK3mJj9l1
7721a9jK6l6N8K8l2oL3p8Qk0J3N2l2M3l1Ml0j6pK6M1J2m9K0n2J3j6K4LR6m2pj2
7755A4j6j3QjJ4K2J4m2M0k9KJ2kn3L9J9m2L5L3p4m7O0j6L5J2l1M3p2L4mp5J00
7787A9k9K2P8r1k8J4K5j3O5p0M8m6n3M1j9N9OQPl2ok9K7j6m4N7j8M7MOn5lJ9l0
$$ y = [6, 19, -20, 37, 69, 44, 89, 41, 36, 16, 14, -27, -76, -6, 9, 26, 4, 20, -39, -18, -27, -19, 19, 38, -9, 7, -1, -40, -3, -30, -43, 11, 60, 54, -32, 12, -35, -40, 17, -2, 3, 46, 41, 10, -32, -66, -48, -53, 16, 33, 26, 85, -2, -21, -11, -13, 35, 20, 2, 15, 27, 2, 44, -3, -37, -2, 13, 34, 79, 26, 18, -19, -51, 8, -32, 5, 33, 30, 64, 0, -55, -53, -5, -12, 29, -5, -14, 10, -13, 39, 26, -2, 23, 11, 17, 4, 4, -38, -20, -70, -28, -28, 23, 17, -15, 1, 12, -11, -11, -62, 12, 23, 38, 27, -13, -13, -28, -29, -21, 26, 65, 25, 31, -11, -14, 4, 9, -74, 14, 49, 48, 60, -15, 17, -15, 13, 23, 13, 29, -10, 15, 30, -28, -36, -90, -3, 16, 28, 68, 39, -25, 1, -44, 18, 27, -14, 20, -1, 50, 12, -24, -26, -26, -22, 20, 11, 34, 30, 31, 12, -19, -20, 6, -30, 28, 56, 24, 18, 51, -27, -19, -39, -26, 26, -6, 37, 6, 10, -20, -36, -43, -17, 24, 36, -13, 7, -45, -32, -48, -24, -21, 75, 33, 26, 14, -2, -15, -7, -8, 6, 28, 42, 0, 40, 11, 13, 25, 23, -30, 9, 28, -14, 21, 54, -20, -67, -7, -23, 12, 24, -7, 36, -36, -2, -6, -81, 19, -10, 12, 90, -1, -29, -15, 10, -3, 62, -8, 40, -6, -59, -18, -37, 22, 28, 36, 43, 11, 5, -24, 3, -13, -57, 0, -18, 29, 33, 39, -16, -19, 0, -30]
7821c0M1RmJ2K2m4k3k5M8m1O5J7l2mk4j0m4P6j3K5P3n4m7J5K3j1k4n4J26Lm1K0
7853E0p8J8l7N4Qj1ON3k3q7L0K2mm2L4L1j0l1l9N5PLmK5j9n7N3m7J1M4mnj2M3
7887C7Rk5k8qKLQ8qj28Q8j5k9L1%j6%k1M6J0l9j0n0K7J5N4J1n3j2O7o1l5kL1P1
7921E0m0O1l5p9O5qk5J3J9j3L6j05Q9q0rM0O1j0mN1q8n4M9L1l7K5J3K3o9K1pn7
7953g3N5N4l3J1J9k0M0j05K3M3K3q0N0O8kn9l9L8l3mO7j4J3jk8Jl9M5m3L9Rn0
7985b5N1m3J0Nm0O7j7N6m9l0J5m8kO1j3rOL4k0k7N2Nj8k0J9J3l5L8jm0Pk7L4N2
8019F1o5j0M5j6m9k4K0L4K1O6k4m9n4J07j06M7k9J4J1Nl6K3j7Oj7O7j0J2lj8J4
8050B6l2j7L8k1qL2K2k6l4kl5N4M6MK9nk6l9p5PJ7L1qJ3L1m1L1m7K1JJ1j5N8n2
$$ y = [-30, 11, 20, 16, 28, 50, 6, -17, -42, 6, -35, 30, 47, 15, 11, -13, -23, -67, 9, -4, 21, 94, 40, -7, 8, 31, 20, -4, -58, 68, 71, 30, 50, -28, -10, -47, 7, 15, 4, 10, 63, 40, -47, -17, 5, 1, -41, -7, 24, 14, -17, -56, -1, 6, 9, 5, 30, 11, -46, 7, -40, -29, 15, 11, 6, -6, 37, 46, 21, -7, -15, -13, -10, 78, 70, -58, 30, 15, -14, 17, 17, 1, 1, -20, 26, 36, -3, -13, -63, -36, -21, 33, 44, -9, -21, 46, -15, -50, -52, -21, 50, 10, 71, 36, -43, 22, 14, -11, 2, 21, 8, 44, -61, 28, -52, -61, -21, 40, 30, 26, 77, -11, -65, -16, 15, -22, 3, 16, 39, -30, -9, -16, -73, -18, 36, 3, 14, 33, 13, 53, -52, -29, 14, 37, -43, 7, 75, 73, 14, -25, 13, -20, -24, 43, 29, 42, 41, 13, 14, -25, 20, -23, 16, 25, -25, 26, -17, -7, -2, -42, 25, 8, 64, 15, -15, 0, -48, -50, 11, -2, -11, -5, 29, 9, -18, 34, 39, 21, 1, 20, 33, -2, 36, 35, -5, 2, -25, 9, 61, -4, -14, 31, 15, -34, -58, -38, -4, 17, 83, 59, 10, -44, 63, -43, 4, -25, -11, 0, 5, -31, -8, -25, -19, -36, 31, 21, 33, 30, 12, 26, -6, -23, 15, -6, -14, 18, 40, 14, -20, -22, -57, -3, 43, 47, 76, 71, 45, 6, -69, -62, -45, -14, -22, -9, 22, -19, 12, -35, -14, -13, -2, -17, 41, -11]
8084a1L0o8L2J0K2N6k0j3m5J7j9j9qO0KL9n3%Mk6K9K0m2L0m5K0k1M6l4K5j5j0
8116gL6k8k2N1mk8k3K8om5M5Qj7qP1n5KkO3o5m5R1m6Q0m6j7j0O0Pl8jj8M2o2m1
8151e0M3k6Q9m4qJ8k9k0m2P9MOMK1J2j09R1k7Pj9lL1l0l6RKj1QK9N6m2j9jjpJ4
8187aM1o5Q2j5
$$ y = [-11, 19, -49, -17, -7, 15, 71, 51, 38, -7, 10, -9, -28, -36, 24, 26, 65, 12, 12, 16, -10, 19, 39, -3, 27, -18, 2, -19, 27, -7, 18, 3, -7, 29, 1, -21, 30, 26, -2, -25, 3, -3, -48, -3, 5, -12, -20, 51, -4, -2, -4, 59, -6, -51, 40, -6, 74, 28, 11, 1, 61, 68, 30, 29, 11, 53, -9, -50, -7, -33, 56, 12, 4, 22, -7, -27, -69, 10, 14, 20, 24, 45, 57, -52, 39, 12, 19, 0, -3, 28, -2, -38, -29, -27, -38, -30, -1, 55, 13, -6, -7, -8, -15, -1, 40, -25, 57, 42]
8191D2
$$ Imaginary data points
##PAGE= N=2
##DATA TABLE= (X++(I..I)), XYDATA
0@%%%%%%%%%%%%%%%%%%%%%%%%%%%%%jNpPrRj2J6j7J9k1K3k5K7l1L6m1M4m7N3n9
50c1O5p2P9q8R6j03J15j26J38j51J62j76J87j95J99j79R6J90j390J3607J37467
71A49890P9711l5211j11844j58469j24221k6748P3972J39643J51173Q0954l0268
82A88582j18373j52267j17925k0524Q1349J42512J45298P3562m3896j23561j36156
93h1399j01285k0155Q2886J40428J28808O4348l6505j25888j42562q9802o180
104a87306Q1801J35136J19268M9181m0982j17916j36921q4488J059Q1624J30825
115C1281J16440M0241n0671j14789j27203p5798J1185Q4408J19980J07011L9064
126A81149n1717j13021j20302p1840J4842R2166J19535R4131K8572n4105j10845
$$ y = [0, 0, 0, 0, 0, 0, 0, 0, 0, 0, 0, 0, 0, 0, 0, 0, 0, 0, 0, 0, 0, 0, 0, 0, 0, 0, 0, 0, 0, 0, -1, 4, -3, 4, -5, 4, -8, 8, -9, 10, -11, 12, -13, 14, -17, 19, -22, 22, -25, 28, -31, 34, -38, 41, -47, 49, -54, 61, -65, 73, -78, 84, -92, 95, -100, 99, -80, 16, 206, -1184, 12423, 149890, 229601, 194390, 82546, -75923, -200144, -226892, -152920, -13277, 137896, 218850, 188582, 70209, -82058, -199983, -220507, -139158, 3354, 148652, 222214, 178318, 54757, -81399, -182684, -202839, -119953, 20475, 149283, 213631, 177126, 51238, -91324, -181126, -187306, -105505, 29631, 148899, 198080, 157098, 39182, -97739, -182227, -181168, -99544, 31281, 147721, 187962, 137291, 22502, -104701, -180499, -169314, -84906, 35074, 142085, 181149, 129432, 16411, -103891, -175731, -160889, -68723, 50812, 144943, 173515, 119410, 8565]
137H565j11151o0952J6141Q7103J15652Q9373K3358n6277j11732j09214n2804
148a61938K4349Q8330J10639P9139J3088n6453j03350j03213m9944K7423Q8644
159d3286J07933P6131P379o3068j02386r4350m0920L2321Q7430J00710O8753M588
171A41235o2397r9703r0595l7592L5828R0361R8368O0570l240o4936r5739q2062
183a09902l0755L5854Q6707R5152N7499o702o7251r5728p8329k3550M1992Q6820
195h193Q9187M9227j1832o6338r0688p2995k0545M2896Q6362Q7798M5530j7549
207A12860p0220q8886o5937j2878M5662Q2960Q1390M0740j9087o9413q6883o3584
219a13276r295M9431Q3762P8058L4590k4972p0420q1935n6667n152M9348Q1003
$$ y = [8565, -102586, -163538, -147397, -60294, 55358, 144731, 168089, 111812, 80, -109134, -161938, -137589, -49259, 61380, 140519, 153607, 97154, -6196, -109409, -159353, -131930, -43286, 64647, 140778, 148157, 85089, -17297, -111647, -152567, -120246, -32816, 67894, 136647, 141235, 78838, -20865, -111460, -149052, -113224, -22863, 75505, 136075, 132835, 67899, -27840, -109902, -140657, -104803, -18096, 77056, 134555, 127853, 60602, -35126, -113455, -137005, -95013, -8193, 80994, 130221, 118389, 52051, -38637, -111632, -132177, -89281, -2919, 84879, 130409, 112860, 42640, -46246, -112183, -125061, -79399, 3561, 84951, 125691, 106604, 37191, -49692, -113276, -122571, -73140, 10622, 88680, 123270, 98298, 27878, -54057, -110724, -115876, -66528, 14475]
231A4475P4546L2342k6735p2243q1608n2377P30N3261P9763O8502K5961k9057
243H7560p0524p7716m8535K783N3519P9657O6730K1460l3324p2014p5519m2693
255a08616Q886N4614P5640O1775J8028l4476p0778p3653m0654J2214N7935P5436
267C6351N7770J2360l8470o9848o8608l5526J4567N7638P3044N4800J0515m0266
279F4327p1337o6949l0866J9133N9542P1059M9177N125m1028o8682o3706k8354
291a02559K0780N9961P0441M6755J087m4543o8929o0221k2737K4585N9264O6547
303E0431M2867j222m5019o7522n8322k0583K7320O1449O5384L8462n964m6832
315D0449o5583n3548j6453K8303N9917O3291L6498p906m8310o5623n1427j2584
$$ y = [14475, 89021, 121363, 94628, 22385, -59223, -111600, -110870, -57609, 22154, 90656, 116617, 87560, 17036, -60680, -109215, -106432, -52913, 26744, 93474, 114934, 81610, 9596, -65923, -108616, -99730, -45116, 30524, 92299, 110327, 75851, 5073, -68580, -109234, -97020, -39085, 36351, 94121, 106481, 68011, -1837, -70445, -105971, -91404, -33766, 39278, 94078, 104593, 64327, -7010, -73959, -104825, -85692, -26150, 44909, 94086, 99211, 58183, -10499, -74205, -102559, -81779, -21818, 48623, 95378, 96465, 51922, -17007, -77228, -99965, -75380, -16116, 50431, 93298, 92076, 47057, -20465, -78787, -99370, -72050, -10601, 54783, 93245, 87281, 40449, -25134, -78682, -95135, -66832, -6915, 56376, 92874, 84968, 36658, -28965, -80392, -92976]
327i2976L1992O0467N9950L1546j1182m8277o2932m8193j0656L2729O0422N8883
339F1773K9069j4612n0858o2049m3937n875L4595N9114N5280K5310j6092n0114
351B1604o0864m2290l100L7138N9582N3347K1287k0020n0858n7875l7923j35L7605
364d2502N7690N1075J9615k1916n2188n6962l5201L416M0243N7111M6954J5220
376H2555k3569n1315n4494l2369M934M0464N6854M5554J2502k6429n2487n2806
388e0606k8041Q680M1141N4637M2375R673k7226n1351n1478k6501J1395M3265
400b4037N4062L9613O093k9883n0951m8151k2811J3244M2895N2206L7608M447
412G4335l1380n1649m6765j9963J6381M4198N0750L3397R81l1973n0150m4474
$$ y = [-92976, -60984, -517, 59433, 90979, 79797, 31520, -31412, -79605, -90261, -57532, 2890, 61773, 90842, 76230, 25372, -36677, -80614, -86489, -51894, 7220, 62500, 87810, 71718, 21604, -39260, -81550, -84650, -47512, 12070, 65417, 86704, 66684, 15826, -42049, -79972, -80107, -42502, 15188, 66263, 85878, 63962, 11774, -45188, -80389, -76973, -36730, 20381, 67335, 82555, 58986, 7671, -46823, -79192, -74258, -33794, 23060, 68614, 81116, 54687, 2200, -50606, -78647, -69967, -28826, 25811, 68186, 77859, 50633, -718, -52196, -78697, -67302, -24037, 30025, 69638, 75731, 45848, -5103, -53254, -76065, -62821, -19926, 32280, 69888, 74335, 42955, -8694, -55459, -75422, -59041, -14843, 35907, 69304, 70285, 38312, -11838, -56312]
424e6312j7791J7491M4454N0081L1746j683l4332n0262m1836j3925J9992M4296
436h081M7702K8817l498l4457m9203m0500j2164K2070M5558M6857K5864o869l5788
449B6308m7947l7426r163K3053M4487M5161K4148q458l6848m7886l5914o475K5505
462d1455M4727M2985K0753j0969l6989m5855l3746n141K6559M4893M1827J9044
474F6633j3258l8734m5120l0569j878K7955M4156L9279J6629j4227l8749m4411
486c2294k8756L7K9488M4832L7864J3058j6914l8997m2837k5773K635K9530M3298
499A5171L6688J1436j8685l9659m2056k4287N684L1707M2335L3841Q946k0541
511D0580l9214l9719k2200O530L2701M2312L2130P152k2242m0473l8234j8684
$$ y = [-56312, -74103, -56612, -12158, 37923, 69669, 67986, 33654, -16608, -58444, -72369, -52377, -8081, 39621, 68438, 64940, 30483, -18720, -59220, -71384, -49314, -3756, 43101, 68965, 62096, 26308, -21639, -59065, -68228, -45175, -688, 44473, 68621, 60163, 23315, -24571, -60485, -66960, -41455, 3272, 46257, 67010, 56041, 19052, -26803, -60549, -65690, -39131, 5762, 47589, 66633, 53375, 14641, -30479, -61048, -62926, -34971, 9185, 48464, 65093, 50866, 12117, -32294, -61050, -61013, -31525, 13307, 51171, 64229, 47315, 8318, -34519, -60292, -57657, -28127, 15171, 51859, 63295, 44610, 4951, -37105, -61392, -55708, -24001, 18334, 52175, 61121, 40580, 1366, -38353, -60553, -54023, -21322, 20990, 53120, 60272, 38030, -2443, -40677, -59361]
523e9361Q769L2989M1374K9569M684k2319l9889l7885j7025J0900L3615M0967
535B6388K8019J412k4287l8782l5901j5026J2875L3335L9116K7092N17k6175l9044
548a0461l4196j3311J5224L5121L7366K3635j122k6627l8407l1646j1588J5196
560d0816L5538L7681K1611l335k7454l9037l0281p788J6841L4546L6231J9521
572E3258n531k7184l7748l0050o403J8876L4831L5234J8084q370k8989l5877k7408
585d7277m921K0271L4636L3166J6675q766l0149l5998k5318k900K1637L5328L1367
598C7751J3785j0248l0006l5010k3385j328K1688L5120L1086J1851j2286l0559
610H459l4568k1534J293K2734L3788K9217J0401j3304l0458l3556k0627K614K4190
$$ y = [-59361, -50592, -17603, 23771, 53340, 58024, 35705, -4184, -42069, -59094, -48194, -14579, 26388, 54407, 55819, 31532, -7250, -43151, -58177, -45302, -11967, 27149, 54241, 54758, 28583, -10461, -44657, -57968, -42744, -7623, 29743, 53378, 52256, 25629, -12778, -44424, -56012, -40816, -5278, 32403, 54014, 50679, 23225, -15812, -46093, -53881, -37040, -2494, 33737, 53258, 47727, 20543, -17205, -47255, -53658, -34782, 49, 35283, 53367, 44997, 16008, -19869, -47277, -52198, -31927, 2709, 35875, 52550, 43784, 13635, -22363, -47681, -50581, -28944, 6384, 37751, 51536, 41288, 11282, -23728, -47113, -48441, -26753, 8367, 39453, 51304, 39018, 8459, -26109, -47643, -46350, -23616, 10172, 39389, 49790, 36486, 6028, -27528, -48155, -45541, -21351]
623b1351L3950K7745Q422j5115l0804l1798j8325L981K4418L3278K6371P194j5779
636C2187l1296l1487j6637N998K5605L2813K4335M771j6819l0680l0026j5137
648d6373O902K5748L2461K3598L100j8554l1109k8806j2954Q928K6141L1170K1542
661D1794J764j8943l0692k7912j1827J0212K7194L0853J9990l76k0350l0326k5977
674c4596r689J1136K6944K9738J8727j348k0967l0472k5238q095J2953K7526K8851
687B5470J6436l297k1375k9462k3727o745J3535K7529K8347J5493m839k2565k9355
700a4555k2279m524J4958K7194K6762J3794n832k2577k8738k1293l549J5930K7769
713C060K6075J2020p669k3363k7827j9371j823J6523K7007K4935J0953q466k3836
$$ y = [-21351, 12599, 40344, 48766, 33651, 2847, -28951, -47276, -43295, -18877, 14401, 40772, 47966, 32187, 891, -30596, -47233, -41235, -15630, 17183, 41518, 46289, 29470, -1210, -31236, -46373, -39471, -13723, 18738, 42336, 45436, 26882, -4227, -33033, -45987, -37059, -10918, 20252, 41794, 43558, 24615, -6077, -33989, -45816, -35604, -8410, 22443, 42433, 42057, 21707, -8619, -34596, -44285, -33149, -6205, 23533, 42260, 40912, 19945, -10527, -35765, -43860, -30907, -3381, 25470, 41906, 38609, 17234, -12228, -35955, -42700, -29165, -1636, 26711, 42204, 37365, 14800, -14555, -36834, -41358, -26400, 794, 27556, 41350, 35518, 12941, -15797, -37090, -40639, -24709, 3060, 29135, 41155, 33486, 10123, -17704, -37075, -38898, -22375, 4632, 29567, 40520, 32054, 8218]
726H218k7816j8187j34J7809K7187K3471Q933r845k3668k6451j6834Q16J8253
739a8248K6968K2774P714j1071k4469k5882j5042K713J8928K6248K1162O176j1679
752B6292k4122k5254j4200L666J9846K6263K0098M448j3130k4349k3872j2339
764c6653M980J9771K5348J9069L515j3712k4442k3386j1220O463K0845K4843J7405
777C2826J810j4567k3810k2059r929P078K0766K4569J6610O99j5581k4104k1173
790b6865q162Q495K0843K3530J4986m00j5729k3611k0448p402R362K1395K3213
803A9207J3887k079j6733k3201j8947n740J0066K1070K2227J2889k697j7084k3192
816a0327j8215m516J1298K1504K1399J1225m093j7309k2377j6873l595J1639K1338
$$ y = [8218, -19598, -37785, -37919, -20110, 7077, 30548, 39481, 29636, 5968, -20483, -37317, -36501, -18248, 8720, 31494, 39208, 28137, 3668, -22214, -37256, -34543, -15615, 10633, 31795, 37971, 26292, 2170, -23084, -37284, -33618, -13772, 12491, 32589, 37037, 23907, -442, -24314, -36653, -31673, -11902, 13446, 32515, 36030, 22318, -2124, -25510, -36730, -30267, -9422, 15421, 32826, 34636, 20069, -3741, -25800, -35729, -28651, -7885, 16684, 33294, 33993, 18412, -5692, -26865, -35027, -26532, -5689, 17841, 32827, 32427, 16698, -6913, -27361, -34763, -25401, -4006, 19207, 33094, 31015, 14282, -8919, -27866, -33606, -23540, -2470, 19757, 32646, 29949, 12865, -10327, -28542, -33058, -21760, -256, 21143, 32368, 28275, 10966, -11411, -28284, -31879, -20240, 1098]
829A098K0861J0401n085j8063k2174j5853k040J2579K1134J9654R019n930j8003
842G598k1641j5005j192J3301K1273J9096P750p342j8506k0840j3411J25J3694
855a5100K0717J8066O883p782j8693k0648j2692J437J4593K0756J7013N279q799
868B1030j8586j9587j1445K072J4774K0378J6471M415r761j9066j9160j0252L572
881b5145J5369J9721J5011L309j0126j8801j8454r495M232J5839J9757J4294K013
894B7524j1196j8800j7444q121N182J5865J9040J3470J294j1477j8799j7087p248
907b7797O269J6362J8691J2244k6j2042j8402j6106o193O685J6357J8290J1550
920B5882q20j2805j8586j5323m954P647J6532J7482J0267j637j2934j8030j4755
$$ y = [1098, 21959, 32360, 27275, 9212, -12962, -28815, -30855, -18276, 2858, 22512, 31531, 25601, 7598, -14043, -29048, -30240, -16939, 4334, 23430, 31180, 23838, 5332, -15508, -28919, -28794, -15100, 5617, 23683, 30566, 22784, 4091, -16557, -29249, -27812, -13219, 7537, 24550, 29829, 21030, 2444, -17143, -28588, -26516, -11742, 8636, 25107, 29522, 19761, 695, -18465, -28717, -25145, -9776, 9945, 24956, 28265, 18139, -662, -19116, -28611, -24379, -8540, 11217, 25511, 27524, 16328, -2472, -19916, -28037, -22855, -6990, 12050, 25520, 26814, 15337, -3462, -20549, -27797, -21528, -5166, 13525, 25769, 25743, 13701, -4701, -20807, -27000, -20315, -3958, 14332, 25882, 25062, 12257, -6329, -21652, -26606, -18959, -2427, 15055, 25322, 23685, 10751, -7279, -22034]
933b2034m312Q302J6817J7299R455k863j3578j7692j3573l096Q895J6565J6430
946A6615Q723l401j3885j7584j3033k153R728J6843J5887P348m520j4006j7018
959a0456j2017j366R945J6657J5397O712n314j4583j6814j1181j90J0872J6363
972D025J4403N619n831j4476j6235j0502M07J1372J6518J3886M714o792j4896
985B212j5678r279J443J1511J6150J3119L992p090j5049j5578q539K308J2068
998h410J6103J2286K680p884j4687j4818p863L082J2067J5695J1949K092q650
1011A3642j4908j4386o918M052J2609J5093J0836J374q937j4718j3664o305M412
1024a7818J2985J5144J0079M66r513j4881j2896n117M980J2948J4687R318k39
$$ y = [-22034, -26346, -18044, -1227, 16072, 25527, 22664, 9086, -8606, -22179, -25275, -16380, 185, 16615, 25338, 21937, 8052, -9532, -22565, -24718, -14990, 1853, 17740, 25088, 20568, 6562, -10456, -22473, -23839, -13894, 2763, 18160, 24872, 19558, 4975, -11839, -23020, -23210, -12338, 4025, 18428, 24047, 18216, 3740, -12495, -22997, -22590, -11218, 5300, 19186, 23900, 17108, 2212, -13466, -22745, -21302, -9791, 6359, 19478, 23470, 16380, 1331, -14247, -22786, -20478, -8410, 7693, 19979, 22659, 14775, 88, -14730, -22593, -19511, -7444, 8251, 20200, 22292, 13642, -1266, -15652, -22570, -18518, -5909, 9184, 20020, 21394, 12457, -2261, -15925, -22230, -17818, -4833, 10311, 20390, 20856, 11343, -3538, -16434, -21551, -16571, -3623, 11064, 20382, 20143]
1037B0143r737j4755j2711m339N842J3205J4291Q460j240j0270j4230j1910l606
1050b0857O219J3108J3903Q067j847j0824j4278j1244k680P091J3234J3079P034
1063B0005k427j0757j4076j0517k154P409J3459J2822O338l339j1202j3804r676
1076a7919j131P737J3171J2260N638l811j1270j3622r382l97Q486J3196J1767
1089A4723M690m613j1462j2910q550J09Q709J3015J1337M186n105j1917j2691
1102a0479p770R53R260J2844J0412L399n456j1788j2322p122J381R449J2967J0115
1116A5843K471o109j1862j1992o292K210R571J2447R648J931o491j1830j1748
1129a2203n853K944J0028J2300Q939J140p137j1618j0973n232L360J0000J2102
$$ y = [20143, 10406, -4349, -17060, -21399, -15557, -2352, 11939, 20399, 19159, 8889, -5341, -17251, -20857, -14638, -1530, 12373, 20440, 18593, 7769, -6509, -17753, -20433, -13342, -108, 12971, 20005, 17578, 6821, -7255, -17772, -19926, -12517, 942, 13764, 20102, 16763, 5561, -8243, -17919, -19050, -11313, 1858, 14118, 19756, 15945, 4675, -8947, -18329, -18726, -10240, 2956, 14723, 19413, 14800, 3338, -9572, -18122, -18013, -9304, 3711, 15048, 19234, 14129, 2212, -10479, -18249, -17296, -8036, 4808, 15220, 18619, 13163, 1375, -10947, -18069, -16688, -7239, 5728, 15843, 18314, 12205, 343, -11649, -17941, -15731, -6160, 6287, 15935, 17866, 11375, -455, -12203, -18056, -15112, -5084, 7216, 16155, 17295, 10158, -1460, -12433, -17665, -14305, -4305, 7797]
1142G797Q420O78p504j1872j0635m394M025J0360J1743P512Mp671j1663j0191
1156a3391l796M382J0490J1677P056q57q152j1625r552k938M973J0344J1139O547
1170A6297j296q413j1451r211k455N539J0753J0747N681j953q621j1251q528j881
1184a6043N821J0545J0491N326k437r035j1194p979j104O276J0643R921M566k908
1198A2889q993j0816p630p09O643J0712R668M035l597r273j0609o822o0O913J0372
1213B723R166L556l792r311j0465o581N73P281J0533Q654K784m369r438j0000
1227h686n874J005P420J0269Q403K360m762r672r747n374J691P789J0092P708
1241A2622J815n133r501r359m906K048Q017J0025P369J128n590r592q929m113
$$ y = [7797, 16217, 16895, 9391, -2481, -13116, -17510, -13485, -3125, 8618, 16130, 16134, 8463, -3200, -13391, -17187, -12805, -2315, 9362, 16418, 15561, 7409, -4216, -13768, -16706, -11733, -1389, 9750, 16297, 15001, 6588, -4863, -14074, -16529, -10990, -237, 10510, 16191, 14238, 5617, -5634, -14162, -16043, -10222, 323, 10814, 16140, 13703, 4668, -6526, -14505, -15609, -9333, 1310, 11231, 15797, 12889, 3896, -6920, -14550, -15259, -8616, 2096, 11764, 15799, 12202, 2929, -7680, -14502, -14562, -7649, 2723, 11889, 15445, 11653, 2342, -8123, -14704, -14131, -6850, 3683, 12337, 15121, 10752, 1314, -8686, -14560, -13555, -6135, 4134, 12537, 14897, 10135, 463, -9284, -14658, -12967, -5178, 4914, 12622, 14437, 9304, -197, -9556, -14462, -12414, -4397, 5628, 12997, 14125, 8535, -1057, -9986, -14099]
1255a4099K527Q017R718O829P12n826r542q753l784L135Q308R524O322k6o149
1270F913r371q207l211L432Q287R364N901m18o400r514p829k590L972Q486Q858
1285G673N326q33o656r202p463k237M238Q573Q871M789j397o975r036o971j598
1300a2898M574Q500Q367M411j721p065r063o643j111M916Q627Q095L783k287p230
1315C255q687o164o40N099Q522P874L461k724p450q652n680o5N548Q369P398K888
1331A2352k955p393q352n384K55N752Q475P128K384l496p572q057m782P76N890
1346d979Q135O784K113l719p625p970m452J146O206Q226O313J403m001p583p569
1361g572l944J434O265P993O097J090m336p703p342l515K006O447P773N581P70
$$ y = [-14099, -11572, -3555, 6163, 12992, 13704, 7878, -1664, -10417, -14201, -11066, -2758, 6766, 13088, 13062, 6913, -2458, -10665, -13876, -10444, -2157, 7207, 13108, 12690, 6290, -3224, -11053, -13643, -9671, -1185, 7673, 12999, 12166, 5510, -3692, -11155, -13392, -9154, -581, 8290, 13079, 11682, 4707, -4329, -11300, -12898, -8324, 176, 8543, 12954, 11233, 4168, -4895, -11538, -12649, -7733, 894, 8989, 12772, 10485, 3255, -5432, -11596, -12236, -7137, 1385, 9259, 12720, 9996, 2546, -6106, -11786, -11851, -6303, 2066, 9464, 12352, 9397, 2004, -6348, -11732, -11477, -5725, 2750, 9878, 12262, 8766, 1194, -6863, -11645, -10869, -4979, 3156, 9940, 12053, 8334, 709, -7261, -11713, -10567, -4361, 3865, 10178, 11581, 7580, -3, -7572, -11516, -10082, -3817, 4176, 10273, 11363, 7027, -676, -8018, -11533, -9527, -3080, 4693, 10274, 11044]
1376A1044m594p543p032l262K240O642P795N273K08m906p558o717k662K617O597
1391a858P475M847k4n061p632o503k331L038O752P350M395n84n249p385o102j916
1407a0788L169O755P176M165q90n504p396n820j417L561O869O829L603j216n439
1422C657p270n541j142L779O915O718L295j656n823p016n154o98M025O729O395
1437G213L014j869n888p013m846l47M287O865O025K579k280n855o736m499LM312
1453e035O791N943K208k521o072o642m100N29M659O548N575J829k855n964o448
1468e555l849P07M880O645N359J439l247o155o128l379J007N015O456M876J200
1483I271l274o228n995l069J395N100O534M578O19l506o031n819k668J701N040
$$ y = [11044, 6450, -1093, -8125, -11387, -9147, -2505, 5290, 10563, 10771, 5865, -1693, -8410, -11072, -8455, -1858, 5617, 10464, 10440, 5379, -2253, -8756, -11087, -8049, -1297, 6053, 10448, 9864, 4615, -2770, -8872, -10788, -7619, -864, 6312, 10477, 9587, 4083, -3313, -9133, -10550, -6989, -120, 6709, 10312, 9096, 3657, -3613, -9154, -10296, -6517, 398, 7116, 10411, 8755, 2932, -4084, -9238, -9936, -5911, 818, 7213, 10227, 8358, 2470, -4543, -9389, -9736, -5449, 1416, 7441, 10020, 7740, 1885, -4851, -9350, -9347, -5035, 1756, 7699, 9907, 7386, 1314, -5328, -9428, -8899, -4240, 2308, 7883, 9712, 6857, 893, -5555, -9404, -8697, -3817, 2828, 8187, 9626, 6379, 224, -5904, -9283, -8276, -3261, 3195, 8071, 9271, 5997, -231, -6226, -9295, -7900, -2800, 3734, 8312, 8931, 5425, -606, -6425, -9093, -7392, -2352]
1498b352O255M529L48l763o126n680k283K067N221O077M026Q6l903n986n277k205
1514h966K208N402N971L748j52m196o033m919j688K327N409N777L432m32m201
1529C687o011m800j396K671N558N602L010r33m285n800m541r62K748N408N443
1544E399K875j131m458n781m296p18L218N344N142K536j354m636n512m019n26
1559g917L227N540M979K261j617m818n456l522j68L406N416M672J911j784m705
1574A425n482l396J80L575N406M550J513k093m806n140l121L90L619N302M380
1589F302J361k376m864n008k939Q09L847N252L954J086k485m878m814k623Q54
1604f522L992N234L848P28k699m928m666k194J143M022N053L570N01k812m890
$$ y = [-2352, 3903, 8432, 8780, 5017, -1109, -6789, -9072, -7005, -1784, 4293, 8319, 8405, 4502, -1484, -6761, -8966, -6758, -1356, 4615, 8363, 8211, 4015, -2018, -6937, -8625, -6298, -889, 4888, 8320, 7888, 3687, -2324, -7124, -8520, -5849, -291, 5311, 8321, 7388, 3103, -2697, -7238, -8200, -5452, -44, 5399, 8274, 7143, 2685, -3096, -7392, -8110, -4892, 452, 5594, 8130, 6776, 2140, -3372, -7391, -7917, -4690, 850, 5829, 8090, 6473, 1655, -3801, -7323, -7491, -4085, 1331, 6003, 7914, 6130, 1425, -4057, -7453, -7273, -3698, 1708, 6258, 7771, 5678, 872, -4268, -7389, -6999, -3380, 1922, 6302, 7663, 5287, 423, -4585, -7524, -6715, -2868, 2384, 6338, 7424, 4939, 61, -4753, -7376, -6522, -2530, 2704, 6552, 7280, 4581, -347, -5013, -7207, -6064, -2042, 3011, 6581, 7082, 4270, -620]
1619f20m618k018J419M178M972L343J62l123m766m276j753J520M248M814L159
1634F641K9l285m869m147j427J893M299M645K886k91l284m743l947j314J994M417
1650e03M584K649n84l465m680l763q53K131M333M403K340p14l488m744l536p00
1666f590K389M430M223K072j017l600m517l308m55K514M310M141J935j254l705
1681A568m436l078k29K806M285L858J632j483l631m349k975P0K839M354L725J313
1697F269j577l858m206k605L00K871M344L471J101j672l864m137k444M98L089
1712b420M271L305Q14j877l891l942k128N66L149M190L217O79k209l883l800j878
1728e837Q51L240M076K829N43k182l905l663j737J008L302M017K771K04k384l905
$$ y = [-620, -5238, -7256, -5837, -1659, 3313, 6656, 6818, 3695, -1071, -5347, -7100, -5580, -1332, 3482, 6641, 6670, 3385, -1484, -5631, -7058, -5165, -866, 3779, 6665, 6374, 3090, -1653, -5600, -6914, -4920, -503, 4081, 6730, 6146, 2681, -1999, -5762, -6615, -4484, -151, 4252, 6592, 5878, 2390, -2354, -5890, -6590, -4201, 229, 4452, 6524, 5507, 1907, -2610, -5918, -6373, -3859, 451, 4592, 6527, 5273, 1568, -2868, -5946, -6175, -3369, 916, 4774, 6406, 4923, 1292, -3057, -6032, -5962, -3123, 1231, 4956, 6269, 4692, 834, -3372, -5977, -5677, -2806, 1538, 5009, 6110, 4438, 574, -3563, -6007, -5509, -2420, 1851, 5156, 5970, 4093, 202, -3740, -5868, -5302, -2153, 2037, 5254, 5933, 3724, -159, -3959, -5837, -4986, -1746, 2330, 5159, 5702, 3520, -385, -4048, -5785, -4777, -1475, 2542, 5313, 5517, 3133, -772]
1744g72l503j422J250L298L985K425M8k454l823l422j229J448L448L762K313k92
1760E060k557l855l101r73J427L471L653K244l94k783l844k921p96J786L426L545
1776C388J828n50k750l721k851n50J848L425L475J632p43k877l640k561m07J998
1792c056L421L287J535r60k898l582k457k24K137L530L057J332j171k948l492
1807b489k189q1K174L482K971J167j222l079l457k066J85K334L429K842Q54j310
1823C545l133l232j921L41K359L404K724P21j482l151l187j687M99K469L332K537
1839D138N19j571l137l076j545O39K594L310K348L65j791l046l033j242P58K524
1855a246L224K232K57j898l098k841j239R92K692L066K039N0j920l132k692j040
$$ y = [-772, -4275, -5697, -4447, -1149, 2836, 5261, 5309, 2855, -968, -4390, -5619, -4171, -723, 3039, 5352, 5060, 2503, -1352, -4453, -5426, -3999, -528, 3125, 5369, 4975, 2192, -1652, -4573, -5369, -3583, -157, 3388, 5216, 4666, 1916, -1805, -4656, -5206, -3358, 67, 3542, 5174, 4431, 1554, -2086, -4647, -5054, -3056, 365, 3652, 5187, 4227, 1329, -2253, -4710, -4934, -2797, 733, 3790, 5122, 3951, 1003, -2489, -4678, -4759, -2585, 897, 3868, 5035, 3813, 734, -2723, -4789, -4604, -2270, 1159, 4001, 4855, 3545, 412, -2820, -4741, -4400, -2041, 1363, 4087, 4808, 3326, 175, -3012, -4699, -4200, -1731, 1601, 4138, 4657, 3086, -51, -3127, -4672, -4033, -1439, 1871, 4219, 4584, 2793, -253, -3286, -4528, -3770, -1246, 1978, 4210, 4467, 2569, -529, -3370, -4609, -3617, -925, 2141, 4180, 4230, 2310, -822, -3514, -4554]
1871d554J124K682L130J857j24k090l085k521p70J160K754K947J743k60k131l081
1887a219k435o33J388K802K851J547m84k264k967k305m68J450K754K777J409n69
1903C634k303k977k167l40J618K791K667J191p42k281k933j958k32J708K815K578
1919C069J111r33k427k795j829j7J767K744K455R54r47k453k793j758J64J890
1935a798K779K329O77j110k472k664j541K13J926K713K226O33j259k454k602j407
1951c811L68J978K717K099M59j366k465k490j316N45K039K680J958L55j501k469
1967b20k427j041O58K066K556J851J86j473k554k289j010P33K224K545J630J0
1983C445j580k443k187q60Q73K177K394J578k0j673k509k118o86J034K175K361
$$ y = [-4554, -3430, -748, 2382, 4239, 4115, 2025, -1060, -3581, -4351, -3191, -437, 2510, 4253, 3993, 1862, -1219, -3654, -4287, -2899, -97, 2754, 4301, 3817, 1553, -1414, -3719, -4187, -2737, 17, 2794, 4203, 3634, 1331, -1646, -3813, -4153, -2535, 256, 2923, 4114, 3372, 1091, -1842, -3800, -4032, -2324, 491, 3069, 4180, 3247, 820, -1975, -3804, -3821, -2054, 690, 3145, 4099, 3152, 699, -2094, -3852, -3688, -1798, 981, 3310, 3987, 2877, 405, -2259, -3800, -3587, -1661, 1052, 3278, 3911, 2652, 198, -2404, -3811, -3443, -1465, 1252, 3351, 3810, 2444, -21, -2511, -3827, -3282, -1243, 1437, 3395, 3750, 2249, -220, -2647, -3688, -3030, -964, 1592, 3443, 3629, 2156, -398, -2687, -3697, -2964, -740, 1805, 3435, 3445, 1865, -578, -2765, -3625, -2752, -575, 1819, 3397, 3377, 1704, -805, -2923, -3609, -2575, -400, 1961]
1999A961J437k33j697k368k017n84J068K257K281J308l20j800k441j815m13J149
2015b227K256K168J132l76j841k372j817k53J244K298K157R84n89j858k273j680
2031c047j70J339K129K150R52p25j857k292j574m8J447K212K007P86p63k003k170
2048a627j471Q3J481K197J868P54q88k027k147j279J99J490K190J828M98q89k015
2065B45k188j170K96J597K202J698M36j097j981j975j075L54J577K167J644K96
2081C026j091k108j880r96M84J706K094J495K17j232j988j875q80O28J665K037
2097A302J469J20j248k117j777o99O45J772J971J328n3j208k108j707o25P66J788
2114c81J937J242j18j425j948j633m84P08J864J903J117j86j418k059j505l98
$$ y = [1961, 3398, 3165, 1468, -900, -2917, -3501, -2433, -176, 2105, 3413, 3093, 1293, -1148, -2963, -3376, -2227, 29, 2197, 3329, 2953, 1112, -1260, -3077, -3330, -2086, 212, 2369, 3353, 2764, 906, -1367, -3047, -3217, -1878, 251, 2401, 3353, 2628, 771, -1521, -3095, -3143, -1696, 516, 2523, 3309, 2546, 543, -1627, -3098, -3015, -1534, 663, 2531, 3285, 2397, 370, -1777, -3056, -2857, -1367, 823, 2651, 3149, 2260, 245, -1943, -3113, -2817, -1220, 982, 2680, 3116, 2019, 38, -1937, -3012, -2658, -1081, 1086, 2730, 3026, 1935, -173, -2053, -3049, -2565, -859, 1235, 2730, 2947, 1715, -273, -2148, -3028, -2400, -735, 1302, 2771, 2891, 1643, -474, -2251, -2950, -2305, -533, 1438, 2766, 2713, 1505, -603, -2310, -2935, -2169, -381, 1556, 2798, 2680, 1255, -693, -2326, -2810, -2102, -238, 1665, 2782, 2596, 1178, -881, -2386, -2784]
2130b784Q96J845J797R91l44j430j909j502k47R33J836J762R57m98j494j917j419
2147b527o3R90J868J639P63m23j585j891j226j03J135J802J662O18n92j575j765
2164a273j224O4J115J859J486N59o12j632j792j102J80J264J791J453M62q08j572
2181B18j681j016J76J310J762J406L51q47j593j677r05L28J365J673J321K48r32
2198A507j575j571q55L57J426J719J221J55r28j630j539o63L79J380J679J188
2214B250J03j041j691j426o10N54J416J648J039k1j079j605j356n33O25J431J595
2231A299R65j19j133j593j282m41O61J488J446R39j76j122j637j184l77P23J366
2248a77J586Q24k84j179j499j202l14Q68J388J494O69k77j163j619j080j69Q41
$$ y = [-2784, -1888, -43, 1754, 2745, 2401, 971, -938, -2440, -2687, -1754, 82, 1844, 2801, 2303, 809, -1108, -2527, -2590, -1600, 268, 1907, 2670, 2247, 662, -1229, -2455, -2558, -1423, 379, 2041, 2659, 2067, 492, -1273, -2497, -2433, -1318, 541, 2027, 2586, 1974, 342, -1450, -2552, -2372, -1108, 683, 2136, 2598, 1790, 218, -1463, -2479, -2303, -993, 769, 2175, 2526, 1679, 86, -1591, -2496, -2168, -803, 870, 2191, 2439, 1507, -68, -1639, -2494, -2137, -711, 1008, 2229, 2384, 1456, -174, -1713, -2376, -1997, -617, 1062, 2250, 2353, 1312, -379, -1805, -2415, -1861, -445, 1203, 2242, 2221, 1142, -463, -1819, -2352, -1727, -296, 1299, 2264, 2145, 1012, -581, -1863, -2304, -1643, -155, 1291, 2230, 2054, 932, -705, -1889, -2266, -1543, -177, 1409, 2233, 1949, 770, -729, -1931, -2245, -1377, 11, 1505, 2174, 1897, 734, -885, -1965, -2134, -1293]
2265a293J468J362O79l89j243j517j076n0Q88J381J417N48m83j246j493r39mR21
2283a069J425J300M62n37j240j434r10K5R97J455J209M08o09j288j404p76J35
2300a851J031J425J148L21o54j297j394q03K77J122J353J097K31p53j274j305
2316a326o66K48J121J378J047J92p88j356j209o74M53J076J346R58P5p68j335
2333b28j148n84L71J188J319R06k9q15j319j154m12M68J140J304Q19r1q11j375
2351d51j089l38N54J131J243P61j11r20j283j060k55N68J149J232P02j83r79j259
2369e88j015j80N90J214J202N87k29r82j268r27j28O44J198J131N30k72j062j198
2387g53q53n5O68J171J130M49l37j070j158q26oP49J245J054K81l39j044j156
$$ y = [-1293, 175, 1537, 2216, 1827, 584, -933, -2009, -2059, -1171, 210, 1627, 2175, 1692, 446, -1047, -1986, -1990, -1069, 356, 1656, 2118, 1581, 341, -1093, -2003, -1978, -981, 474, 1683, 2091, 1482, 194, -1210, -1986, -1851, -820, 605, 1753, 2074, 1420, 123, -1271, -2074, -1797, -675, 678, 1775, 2006, 1253, -21, -1326, -1992, -1744, -623, 755, 1802, 1994, 1206, -150, -1359, -2033, -1580, -504, 842, 1800, 1875, 1107, -228, -1376, -1960, -1589, -401, 918, 1824, 1795, 980, -339, -1493, -1905, -1437, -297, 1007, 1826, 1735, 924, -451, -1540, -1878, -1324, -193, 1050, 1811, 1700, 780, -503, -1563, -1818, -1250, -101, 1131, 1833, 1650, 671, -588, -1603, -1783, -1193, 21, 1223, 1810, 1581, 599, -669, -1596, -1724, -1080, 118, 1249, 1779, 1507, 445, -753, -1606, -1661, -993, 178, 1308, 1757, 1420, 350, -808, -1634, -1640, -891, 354, 1408, 1689, 1350, 306, -850]
2405h50p50m5Q21J125J056L46m58j089j083p12J04Q32J116R69K79m73j075j023
2423i10p50K23Q15J170Q51K56n96j062r95n90J67Q81J170P77K23o41j103j016
2441a130n18L17R19J071Q09L9n49j068r98m89K97R58J076P02Q9o70j053j013l01
2460a512L15R39J059O31k1o64j030r63l17M63R35R70O94r9p61j019q06k99M89
2479i96Q59J021O06j14p81j023q28k18M91R87R36M80j12q32j062o79k44N55J028
2498G4R19M43j86q98r38p13j09N84Q91R48L96k85q44r39o57pN03R94Q76L02k31
2519A123q36r62n89l3O54R35P47L39k72q73j005n53Q0O11R34Q76K06m24q45r13
2539h00m95P2O74R32Q04K03n16p91r56m44J70O66Q99O98J33l90q60q76m64J95
$$ y = [-850, -1600, -1645, -824, 301, 1357, 1703, 1245, 156, -927, -1639, -1535, -703, 413, 1382, 1661, 1188, 113, -910, -1660, -1437, -622, 548, 1399, 1655, 1059, -3, -998, -1588, -1421, -540, 630, 1407, 1630, 989, -114, -1130, -1648, -1331, -412, 659, 1468, 1507, 958, -110, -1108, -1597, -1300, -342, 734, 1436, 1525, 855, -198, -1211, -1512, -1197, -258, 801, 1432, 1411, 747, -283, -1246, -1563, -1100, -165, 805, 1499, 1400, 639, -380, -1186, -1485, -996, -137, 884, 1490, 1376, 595, -428, -1256, -1474, -983, 4, 940, 1420, 1308, 476, -586, -1265, -1509, -954, 74, 993, 1436, 1250, 352, -586, -1299, -1408, -824, 67, 1015, 1411, 1126, 282, -657, -1314, -1321, -818, 176, 1052, 1354, 1123, 287, -675, -1264, -1297, -643, 292, 1039, 1378, 1106, 233, -772, -1325, -1245, -634, 300, 1176, 1382, 958, 113, -800, -1295, -1223, -549, 383, 1187, 1390, 874, 83, -873, -1317, -1147, -481, 418, 1116, 1249, 859, -1, -877, -1341, -1146]
2559a146P05R59O89Km50q70p35m03J98O98R11O01R4n32q85p49m03K61P97R01N96
2580A239j3n55r28o94k90L41P40Q14N46m5n34q77p59k56L54Q13Q13N04j27n76
2600E10p96p21k25L71Q03Q14M50j28n73q96o45j08L57P96P64M37j88o04q44o36
2620a062q4L71P97P99L86k29o64p66n76m5L62Q09O88L80j83p41p86n58n5N09P77
2641A29P18K60j96p16p91m80MM97P84O66K83l00p65p20m53O8N56P38O15J93k74
2662H16p81o79l95K8O16O93O59Q0l37p01o90l77J36N45P61O21J02l89p82o77l56
2683a107K13N60P29N09R8m10o28o88l11J71O24O75N22R6m51p12p25k08K32O00
2703b11P40M38J6m85p43n93j97K64O21O88L98Mn26o65n99j40K86N79O76M56j12
$$ y = [-1146, -441, 518, 1207, 1209, 759, -111, -846, -1249, -1051, -353, 558, 1159, 1253, 721, -164, -913, -1316, -1055, -258, 643, 1239, 1226, 671, -257, -951, -1241, -900, -160, 654, 1200, 1155, 621, -256, -1015, -1271, -917, -104, 709, 1213, 1086, 510, -286, -1007, -1232, -861, -58, 756, 1206, 1078, 505, -391, -1036, -1144, -787, 9, 773, 1210, 1022, 418, -426, -1062, -1146, -775, 22, 821, 1207, 978, 314, -452, -1028, -1073, -711, 98, 786, 1166, 983, 242, -544, -1102, -1157, -648, 129, 847, 1107, 911, 195, -596, -1076, -1072, -575, 209, 875, 1158, 858, 93, -627, -1080, -1012, -456, 282, 897, 1090, 816, 35, -644, -1039, -1011, -395, 298, 957, 1037, 700, -1, -691, -1068, -932, -387, 374, 995, 1097, 708, -74, -751, -1107, -894, -334, 395, 904, 1002, 592, -36, -724, -1035, -864, -240, 435, 957, 1053, 602, -110, -835, -1043, -811, -211, 529, 967, 983, 498, -245, -838, -1035, -771, -150, 538, 936, 940, 414, -251, -850, -990, -704, -125, 551, 1007, 895]
2724H95m98o94n21j63L40O46N31M59p4n25p06n32j13L08O02O88L58j59m92o86
2744c36n22p6M17N43O09L26j49n29o32n12p6L87O41N94K21j77n38o21m38o3M38
2765d93O29N86J73j94n55o47l92L3M50N22N78K16j97n83o09m15J09L83O08O00
2785H02J11k56o18n57l17lM87N97M97J59l22n59n38l44O3M44O71M59R6l07n93
2806b8n70k87J02N16O20M46N4l26o39n13k56J97M82O05L98Ql38n67n24k11J28
2827g03N37N23M02O8m10n94n00j37J88N22M81M22j9l38o16n41j67K82M84O03K76
2848G63n3l71n13n32j41K74N38N62K86m9m79n23m23o3K15N04N25K76j20m28n31
2869b83m43j02L45N13N23K47j56m85m50m03p1L20N04N24J94r4n03n17l96j8L50
$$ y = [895, 397, -297, -818, -981, -641, 5, 536, 995, 921, 396, -310, -842, -955, -647, -45, 643, 1001, 842, 350, -336, -858, -934, -517, 26, 635, 961, 812, 283, -349, -861, -937, -550, 91, 685, 906, 729, 191, -430, -868, -931, -493, 136, 722, 895, 701, 146, -501, -893, -860, -410, 112, 690, 906, 709, 126, -483, -898, -789, -406, 202, 802, 913, 657, 39, -518, -835, -838, -351, 246, 743, 902, 580, 21, -517, -861, -798, -354, 317, 776, 872, 565, -28, -598, -885, -783, -267, 353, 799, 853, 527, -112, -625, -881, -684, -202, 403, 801, 809, 471, -96, -620, -831, -703, -166, 357, 759, 827, 417, -177, -677, -814, -626, -104, 377, 799, 780, 442, -174, -715, -882, -600, -116, 487, 763, 710, 339, -174, -706, -847, -573, -35, 527, 813, 764, 285, -238, -661, -724, -509, -5, 520, 796, 676, 248, -283, -726, -828, -483, 30, 553, 800, 644, 159, -291, -694, -765, -445, 59, 583, 777, 683, 180, -337, -733, -751, -401]
2890d01N24M73J63j73l96n78k70k9L14M82M66K49k53m41o03k35O7K51N77M00J73
2911G60k48m51m77k97k7M59M70M84J08l15m60m82j87J2L74N03M10Q7k55m89m11
2932d32k81J21L55N38K94O9k74m63l91k06J04L78N20K86Q5k89m88m43j58R8M39
2953a38M89K78N4l40m57l60j78J14M24M45K74K8k96m95l72j44J76L91M66L07o1
2974F05l18m98l64r2K03M49M19K30q3l35l96l92q5K49L54M45K90o6l88m38l37
2995e48p9J81M99L91J98j07l34m11l89K1K32M00M21J64j05l91l92l33j1K35L99
3016D1M12J73j63l52l96k44m9K80M01M03O6r2l88l76k77m5K99L88L78J12j74l05
3038I2m28k14LL54M14K78J30j85l55m62k39R6K91M23L17Q6k08m20l67j53M0L42
$$ y = [-401, 123, 596, 759, 586, 190, -388, -658, -687, -373, 109, 575, 824, 571, 130, -473, -708, -641, -390, 187, 587, 760, 512, 61, -416, -713, -740, -281, 189, 673, 781, 466, 6, -476, -663, -651, -277, 226, 636, 723, 468, -21, -432, -713, -592, -237, 301, 595, 664, 390, -73, -464, -670, -566, -188, 332, 618, 703, 414, -74, -517, -675, -577, -138, 351, 629, 683, 343, -114, -474, -652, -538, -114, 331, 605, 633, 337, -158, -530, -674, -498, -107, 359, 666, 605, 287, -211, -575, -667, -464, -15, 404, 634, 551, 216, -180, -572, -657, -408, -54, 391, 681, 615, 227, -211, -548, -627, -446, 53, 444, 642, 535, 201, -210, -599, -578, -346, 54, 475, 639, 534, 143, -249, -582, -593, -358, 41, 453, 626, 463, 111, -285, -529, -578, -298, 103, 506, 572, 480, 92, -284, -561, -606, -307, 81, 459, 571, 397, 92, -336, -550, -547, -193, 221, 499, 629, 444, 89, -373, -612, -516, -225, 198, 515, 601, 393, -27, -394, -547, -507, -165]
3060a65L69K99O1j41m37m03j47P1L61M03K85J2k20m17l54j80P9L50M96J79M8k43
3082C06l61l51j25J22L13L71K27J8k43l88l10j32J30L63L79J86j3k26m64k30j04
3103e32J79L05M13J46Nl52l62k77n5J43M04L27K05m5l13l35l37m2J86L90L45J10
3125E08ql39m13k04o2K18L54L41J43j24l05l31k25n4J82L89L36J24j12k81m29
3146b92j65k3K04L53K79J55r1l29l30k23qK11M06K11J34j06l37l64j66J5K63L62
3168A59K47J26j62k77l31k33K7K56L22K70M1j52l05l21j05k1L00L31K38N8j97
3189B71l10k65k11Q1L20L11K21M3j86k18l73j82J05K96L17K05J7k01l27k57j54
3210d97J35K63L45J99j2j67l49k14j48M9L40L11J61J1k37k92k00j82J59K48K90
$$ y = [-165, 204, 503, 564, 423, -14, -417, -564, -493, -132, 271, 556, 568, 348, -69, -423, -603, -524, -174, 322, 501, 549, 306, -55, -406, -531, -409, -96, 275, 502, 520, 277, -111, -421, -553, -423, -60, 319, 505, 492, 266, -198, -428, -532, -353, -48, 365, 511, 516, 164, -198, -475, -530, -387, 17, 344, 549, 504, 191, -144, -481, -523, -337, 53, 398, 508, 500, 161, -252, -456, -518, -300, 54, 395, 538, 414, 109, -222, -447, -501, -319, 70, 406, 530, 418, 137, -292, -457, -480, -276, 77, 356, 511, 420, 91, -239, -462, -470, -259, 147, 358, 492, 386, 49, -315, -481, -466, -203, 159, 406, 532, 370, 93, -238, -471, -444, -188, 134, 404, 445, 293, -12, -333, -438, -459, -159, 172, 410, 468, 271, -39, -304, -515, -434, -114, 197, 418, 461, 275, 57, -316, -498, -393, -97, 220, 425, 442, 241, -86, -343, -497, -362, -99, 246, 445, 433, 266, -83, -297, -445, -396, -56, 255, 416, 427, 190, -102, -302, -484, -325, -77, 213]
3231B13K61j23j78l11k61n5J63K68L14J33K2k28l84k29k1J35K47L65J48p7k96
3252A06k51k08j16K23L47K05J65l0k83l50k17QJ33K71L24J30j19k57k89k07k7
3273d42J57L20L01Q1j00k04l20k31J2J99K37L10P3k9l01k74j84J0K15L01K29P0
3295D30r4k70l28k12J22K08K48K32J01j36k58l22j68P7K19K95K64mj57k10l33
3316b96j36R2J42L21K55O3j44l25k25j69Q5K21K78K86j1j61l42k87k0J01J90K86
3338B04K24k3k29k33k65q6J05K41K36J94M4j88l22k57q0J45K20L19J43j6j51l35
3360a10k10r3J44K87J58K23j00j69j90k54j4P7K55K31J48pj91l46j81l2J76K10
3382A2K66J94j31j85l25j59r9K38K01K58J17o6k13l04j27n9J92K73K21N1p2k19
$$ y = [213, 474, 351, 173, -138, -399, -454, -291, -23, 291, 424, 446, 218, -166, -395, -416, -281, -34, 331, 479, 402, 106, -145, -353, -469, -246, 101, 306, 471, 441, 158, -192, -409, -401, -268, 3, 327, 457, 338, 81, -208, -415, -442, -285, 35, 336, 417, 317, 113, -207, -438, -426, -227, 10, 320, 393, 364, 63, -211, -395, -385, -170, 131, 360, 430, 336, 66, -262, -474, -352, -144, 104, 336, 437, 301, 43, -279, -447, -370, -151, 144, 408, 404, 247, 37, -296, -432, -340, -198, 123, 378, 441, 297, -28, -253, -422, -337, -116, 162, 448, 437, 276, -66, -353, -373, -272, -82, 204, 428, 405, 176, -57, -322, -408, -303, -62, 174, 368, 412, 224, -98, -355, -435, -290, -70, 249, 392, 376, 225, -110, -320, -413, -269, 18, 176, 399, 299, 130, -60, -314, -328, -251, 4, 235, 383, 376, 185, -161, -342, -374, -198, 12, 278, 472, 341, 156, -169, -328, -427, -189, 12, 270, 387, 321, 108, -196, -323, -382, -190, 83, 304, 355, 283, 64]
3404F4k61j71P7J44K84J72Q7r7k72k33j90O8J45K89K48K0r3j99k99j06jJ73K97
3427A46J62J11k02k18k25j35QJ99L29J53M8j41k33k60p2k6K86K17J62M1j17k15
3449A8k57j50J03J32L19J94j0j53k79j87p2O8K37J46K24O5j76k99j79j05J37J97
3471b7K03K06o1j29k60k33j1J07J60J63K65q0j25k06k64l7N0K10K58J46j3j49
3493A73k69k17j9R0K78K12J20m4k05k80j26o7R1K19K57J58n8j83k49j74o2K35
3515a20J48K12J24j12j83k23j81J6R6K87J44J61r9k18k19j69pJ66K25K16J15j37
3537B42j94k19j23p5K43J91K14Q7m6k63k37j52M2J44K94J07N5k7k24k32j80P7
3559b76J10K23K15N1r3j91k43j65J66Q1K65J25R9j36k09k37j11K5K45K09J42j7
$$ y = [64, -197, -368, -291, -147, 137, 309, 396, 299, 27, -206, -396, -328, -183, 106, 354, 374, 281, 82, -217, -323, -324, -151, 146, 308, 419, 217, -1, -226, -361, -353, -154, 175, 328, 376, 235, 2, -258, -330, -356, -70, 147, 309, 350, 233, 18, -239, -389, -286, -154, 165, 359, 349, 196, -83, -270, -342, -274, -37, 109, 333, 398, 222, -77, -256, -361, -224, -27, 176, 382, 321, 192, -68, -301, -312, -205, -45, 118, 383, 303, 178, -28, -292, -329, -279, -69, 189, 335, 322, 173, -96, -313, -332, -242, 36, 248, 368, 324, 119, -161, -287, -354, -263, -44, 213, 371, 313, 130, -119, -293, -355, -120, 28, 240, 364, 252, 69, -154, -335, -319, -223, 64, 208, 369, 270, 52, -167, -336, -343, -177, 48, 264, 379, 242, 48, -171, -294, -369, -126, 65, 279, 366, 320, 57, -180, -332, -290, -146, 148, 255, 310, 283, 59, -173, -353, -276, -166, 57, 272, 323, 230, 39, -204, -369, -203, -122, 143, 268, 367, 231, 22, -215, -326, -301, -56, 153, 295, 278]
3581B78j07k25j62r6O1J64K78J74m8j73j04k54r7L8K30K28R2J3r9k42j96p1R7
3604b21J74K09K03o6j71j70j96o3K9K46J71J45Rj55j78k38n6J09K31J61J46m4
3626B75j97j20k40m6J76J58K44P4p0j44k41j92j4J45K41J40Q3m3j57k15j08m0
3648b91J04J99K19O0m9j59k11j73J0J34K26J75R5p1k30k27j10K9J59J99J29J08
3670C25j00j46j98j82M8J35K47J64P2j57j84j84n2k0J19K18J44K6q8j59k59r1
3692c22N2J19K64J64L1r1j91k64j18J37J46J60K16k2j18j82j62j04M6J35K35J72
3714C03j9r1j99j75n5j9K57J85R5O7k38j55j71j21J05K27J67R2J5j26k14j19q2
3737b71Q0J63J87P8j0j33j69j67l4Q7J74K02Q0n3j00k33r4n6Q5K07J53J07n6j09
$$ y = [278, 171, -54, -216, -312, -251, -87, 191, 365, 317, 144, 40, -214, -311, -273, -43, 185, 277, 290, 191, -51, -247, -318, -221, -47, 162, 365, 299, 128, -42, -238, -301, -272, -26, 145, 290, 299, 144, -34, -272, -328, -219, 12, 173, 319, 275, 78, -42, -282, -328, -152, 6, 250, 324, 254, 110, -131, -323, -337, -192, 49, 189, 272, 229, 72, -143, -251, -291, -187, 12, 231, 291, 242, 83, -128, -301, -291, -157, 69, 244, 339, 268, 38, -189, -299, -270, -111, 88, 217, 325, 225, 79, -119, -301, -253, -118, 129, 293, 365, 208, 24, -160, -212, -232, -113, 105, 249, 275, 187, 28, -231, -322, -270, -151, 113, 277, 308, 217, 26, -238, -356, -219, -73, 87, 303, 281, 163, -19, -181, -285, -239, -104, 131, 303, 284, 193, -6, -181, -236, -255, 2, 187, 282, 349, 111, -44, -215, -336, -231, -4, 163, 255, 270, 144, -70, -189, -271, -191, -28, 159, 237, 227, 94, -75, -242, -276, -189, -15, 187, 267, 214, 114, -119, -213, -269, -184, 23, 176, 283, 227, 118]
3761A18j98j65k0J27J99J10R9m9j37j67j49K0N5K21J21J06n7k01j35j69OJ58R7
3784a0K48L4o2j74k28m8K0O5K05J33Q1m0j99k01r6J8J33K33J72J3q0j67k02r5
3808b47QJ58J59Q6P4p5j59j25j42M3J15K17J01O4j15j92j44r8O4R8K43J06k9l7
3832A73k02j41r3QK02J37J48K9r4k37p7k8l2J72J78J03kp0k10j98lL7J72J67J24
3857B63j3j46j63r7j12M2K03J82J03m6j09k30j14q8J57J32K48J2l4j13j25j14
3879a62o0Q2J14K12Q7m1j80j62j00ML8J96J26J38o7j23j94j32J1Q4J37J76P9m1
3903B22j65j74j05k1J05J86J17N7l6j64j72o0l9R8J77J40Q7j12j17j76m4l9J03
3926a32J94J78Lq5j11k03p3P1O2J79J67ko6j77j02j15QJ66P3K02l3k5k29r6m3
$$ y = [118, -80, -245, -265, -138, 61, 171, 270, 221, 84, -83, -232, -212, -157, 64, 185, 291, 234, 33, -102, -271, -265, -107, -10, 238, 272, 210, 36, -192, -240, -220, -155, 50, 183, 264, 224, 25, -176, -272, -254, -121, 112, 284, 297, 217, 50, -152, -247, -239, -81, 78, 164, 238, 163, 4, -121, -263, -220, -105, 112, 213, 277, 162, -30, -174, -272, -208, -110, 133, 239, 210, 173, -29, -170, -263, -255, -53, 84, 232, 261, 167, -70, -147, -175, -207, -35, 143, 246, 244, 174, -36, -234, -237, -200, -28, 139, 263, 250, 104, -59, -156, -268, -226, -23, 159, 262, 216, 107, -123, -237, -325, -168, -36, 212, 224, 190, 77, -48, -162, -222, -140, -26, 186, 273, 232, 52, -110, -210, -206, -168, 28, 154, 292, 225, 102, -92, -224, -213, -129, 8, 184, 263, 222, 57, -117, -222, -243, -138, 48, 165, 222, 186, 22, -150, -210, -249, -151, 26, 166, 253, 141, 24, -152, -196, -235, -132, 62, 240, 243, 158, 47, -156, -229, -158, -96, 83, 250, 248, 182, 5, -97, -212, -204, -38, 35, 237, 204, 179, -50, -146, -189]
3951a89%J45K08M9K3p6k17j48rj5K12J21N8R8j46j18j68o5P3J62J50Q4jr8j72
3976c9j11m4O6O8K14M8k2p6j29j41m0M4J33J19J55o4j07j62j36n9J86J24J12N4
4000A93nj10j60p8m6P2K06Q1P7k8j92j02p0m4J16J71J03Q6p3j57j00j40nJ50J15
4025F0J38M4k1k25j25n5m0J23J41J01N1n5j41j62n4N9kJ45K04O7j24j64q7p3M
4050a91J45J36O6K6jk09j20J1l1N9K36j5J07n8j68m5j45O1J09J08R7K9r4j53n6
4075i6j52M7J71J18J58j3p8k25n3j14N6J05J79Q0M4j51j61p0p4N6J41K03O0l7
4099A94j39j44rm4L2J28J19P4J1j37j08j05n8O0J33J16K7K8j24q4j23p6Q2J36
4123a1J47M5Mj24j46r8kO8J29J01R2m2p0k11l8k5M9J89M2J78j20p5j28j24j4O0
$$ y = [-189, -189, -44, 164, 213, 236, 160, -57, -205, -214, -229, -17, 104, 162, 260, 114, -4, -172, -237, -164, -2, 148, 232, 231, 133, -39, -150, -194, -128, -60, 154, 202, 180, 104, -25, -166, -206, -162, -29, 90, 245, 181, 74, -88, -224, -283, -97, 27, 139, 193, 188, 78, -82, -160, -206, -134, 72, 153, 230, 202, 10, -92, -162, -206, -90, 81, 184, 270, 197, 40, -60, -200, -205, -55, 60, 198, 242, 221, -4, -129, -184, -224, -101, 40, 141, 192, 137, -4, -166, -220, -161, -163, -18, 186, 253, 129, -35, -122, -195, -191, -46, 90, 156, 182, 181, -28, -148, -137, -168, -109, 127, 112, 219, 161, -7, -52, -197, -136, -27, 81, 178, 207, 113, -40, -96, -248, -201, -30, 88, 246, 233, 155, -70, -123, -237, -181, -76, 103, 183, 227, 76, -85, -155, -229, -173, -32, 171, 231, 194, 55, -89, -98, -142, -110, 18, 137, 211, 222, 85, -23, -128, -186, -126, 7, 123, 150, 178, 54, -30, -153, -229, -147, -11, 136, 181, 185, 61, -85, -183, -185, -117, 12, 113, 205, 163, 93, -118, -156, -181, -132, 57, 99, 277, 157, 82, -46, -170, -184, -124]
4149a24J63J40K2n9j24p4j01J2M6J31J74kq2r7j31m6n3P4J58J36J0Jj74r2j26
4174b18k8K05M3J21Q3j36r9j3j12K4Q7N3R4J06r3j06j00j46R5R5N9J71Ok9j38
4199B4j77k8M3J05J41Q4j7n3j98q6KP4L7J11O7O4j00q1k10L4mJ53R8O2Q2j76o8
4226a7j36lKJ26J75K5M1j09j53j01n2R0Q3J14P5m6n3p7j35m8O2R1J39J00j4j66
4252A3n9q1o4J03J42O1N6o6mk29n0QP7O5J82L8o7q3j32q3jJ39M8J29L1q6m3j04
4280f0n1L2J8Q2J21J5l6j36l6j72J05P8O0R9N0j27k2j38p4P6RJ56R7ll4n9j31
4307h1l5n8J34J01O5K7l2o4j73j2QR5J33k5P1n1j13j13qjJ46L4Q6Jj03pj76l4
4335a85R8O2J37K6K7j58q3m0o0L3J34O8J03l5j0j61m4m2J0J31J10O1o2q8q5p4
$$ y = [-124, 39, 179, 201, 142, 18, -56, -157, -145, -99, 32, 206, 204, 122, 25, -106, -152, -205, -131, 27, 163, 173, 174, 0, -92, -218, -246, -41, 2, 123, 206, 70, -29, -42, -154, -130, -43, 10, 104, 210, 117, 11, -89, -235, -140, -45, 14, 185, 191, 162, 24, -153, -181, -138, -33, 108, 192, 175, 122, -76, -162, -160, -86, -49, 62, 129, 193, 93, 12, -198, -164, -168, -15, 83, 145, 227, 51, -17, -153, -156, -154, -28, 147, 172, 213, 104, -49, -150, -202, -112, -29, 85, 160, 114, 61, -16, -151, -199, -137, -46, 93, 193, 179, 13, -46, -127, -191, -88, 54, 115, 171, 105, 101, -128, -178, -170, -93, -28, 154, 192, 125, 42, -90, -173, -174, -35, 13, 142, 173, 87, 44, -60, -111, -79, -61, 21, 142, 157, 121, -15, -51, -223, -118, -40, 20, 119, 169, 42, 20, -118, -192, -116, -107, 49, 146, 143, 109, 50, -81, -116, -174, -40, 61, 126, 153, 121, 57, -116, -128, -120, -25, 108, 83, 154, 103, -10, -123, -131, -132, 14, 48, 134, 135, 32, 25, -151, -185, -87, -25, 112, 138, 165, 7, -76, -116, -176, -143, -9, 59, 162, 127, 117, -44, -88, -130, -120, 11, 121, 182, 120, 32, -53, -127]
4361a27p8J10Q3K04j2k6j09j13r2N6K8N8J22N6o1p9n9r0j4P9Q8J19%m1o0j05p7
4388a40M4QJ10J06m0L7o6j57oKK6R0P3O5l9j23q3l6J3O0Q8J20qMj58p1l6NN1R2
4418C1P8L0q2l8j55j1nJ03R1N6J2n1k3j54j8NR1Q5L6M3l4j17n4p4N8O8J21K7l1
4447H8j2j32l0j05J05M1J16P0J0r7m3j36O8m1M1P4J04Qj01l1p9q3O4R9N0O2j4
4474I6l0r6Rj00QJ47M6L4Po0o9j06M2PR6J08M9p2m6j14p8N7L8M6Q0J9l0l6j73
4503a21l1RN1J17P8OM8j79qj40Q4M2N1P9N0qr2p6r7M9K3J03L3J01o0r2o6Nn3M4
4533e0L2Q1P3j0j03q2p4N3N5N6O4m2M6q9j22MnP9O3N1O0j08r3l8j3K9N7J27N1
4562A52m3J7o7j10p1Q2l3J26K2K8n5j19j9l9J03O2M8L0K6r6oj12n8M4R7Q6oM9
$$ y = [-127, -205, -95, -12, 192, 180, 154, 45, -68, -160, -104, -76, -18, 104, 160, 99, 20, -39, -129, -143, -64, 24, 143, 143, 102, 42, -63, -140, -96, -88, 22, 128, 88, 125, 59, -98, -104, -102, -76, 14, 87, 152, 113, -10, -93, -129, -116, -56, 32, 152, 144, 148, -10, -81, -117, -112, -61, 31, 109, 139, 57, 19, -136, -147, -152, -49, 42, 98, 110, 59, 36, -118, -136, -131, -40, 45, 81, 124, 90, -27, -81, -155, -97, -29, 92, 119, 88, 76, -56, -86, -191, -86, -45, 71, 141, 151, 54, 11, -125, -57, -98, -57, 17, 121, 129, 28, -3, -82, -165, -101, -2, 48, 110, 96, 66, -30, -21, -121, -113, 34, 80, 114, 121, 61, -8, -114, -72, -65, 31, 139, 188, 116, 70, -44, -122, -65, -27, 19, 99, 118, 88, 52, -121, -152, -143, -92, 25, 103, 109, 157, -22, -30, -170, -86, -44, 7, 86, 136, 128, 36, -40, -137, -88, -65, 38, 71, 172, 112, 20, -46, -41, -94, -50, -18, 63, 136, 126, 23, -59, -133, -80, -25, 31, 95, 53, 99, 10, -112, -108, -113, -34, 29, 80, 140, 32, -61, -99, -112, -83, -26, 101, 152, 109, 126, 59, -51, -122, -40, -73, 53, 75, 103, 48, -71, -90, -129, -26, 36, 84, 114, 140, 44, 38, -74, -132, -88, 9, 95, 89, 138]
4590A38p7p8m7k6M1P4JK9N2n0r2p9KP6L6QJ09M8r8o4r4oN2K9Q1K6O0j39n1k2l9
4621a00P1J2J05J8k0r7j1q9OO3R5jN4k9m4q1m4m7P1L2J67l9q7l4Km7k9Q3O3M9
4651I2L3kj21q6k6M7K3N8Q0L2m7o2o5p3R0j0N6P4J7m7p7j08j9M3L5R0N7K1p6q3
4681e4K5j00qJ22K6K1J4L0o8r0K9l1J19N3RJ3r5m2n7k4N7L1P6R1l0j04k6l6j0
4710e9j5O9J04lk1n9l6q3n1R1M9J00K3kj03o2J5n9O6L1R2j9L3r1n9j4n4N5Q1P7
4740I6M0l9o2o5l8n2J08O2MM9o6J9j16o0L7P5K9R4J6m2o7q8n2M3oR7M3JQp3q5
4771i0%j1M4R2N1l2J2o6r0J9K3P6K5LL3L3j10n5l4k4J02P0l8R5j5j28K7j12LO6
4801c1O7L2N4o9r0o7j3NP7M0J05j4j05m8l3l3O9L5L4J2N2o1j5m1n5R7o3R3R5j9
$$ y = [138, 61, -17, -64, -90, -49, 25, 26, 55, 107, 57, -35, -114, -112, -36, 0, 8, 117, 165, 67, 3, -91, -97, -45, -16, 65, 91, 151, 12, -39, -61, -100, -29, -17, 88, 106, 86, -11, -22, -111, -105, -42, 53, 52, 106, 77, 33, -48, -92, -139, -68, -36, 131, 92, 5, -29, -27, -74, -103, -20, 43, 92, 125, 123, 2, -84, -110, -63, -40, 18, 98, 130, 83, 21, -44, -117, -27, -37, 19, 93, 110, 63, -14, -122, -141, -98, -63, 27, 84, 105, 29, -54, -29, -129, -137, -15, 11, 32, 46, 76, 8, -82, -53, -84, 35, 88, 97, 110, 15, -27, -84, -108, -51, -20, 56, 147, 117, 13, -13, -49, -59, -74, -5, 99, 96, 75, 16, -20, -103, -154, -63, -14, 86, 109, 107, 4, -58, -43, -102, -36, -5, 87, 68, 101, 10, -49, -63, -117, -62, 19, 96, 136, 97, 35, -30, -68, -120, -12, 50, 54, 103, 37, 56, -60, -120, -83, -8, 21, 115, 131, 89, 22, -66, -118, -75, -81, 16, 59, 60, 68, -5, -90, -90, -101, -57, 35, 86, 54, 66, 0, -90, -71, -48, 28, 53, 56, 89, 122, 12, -43, -77, -101, 1, 71, 33, 128, 113, -15, 12, -100, -97, -31, 36, 68, 122, 53, -37, -104, -117, -112, -35, 5, 110, 96, -9, -57, -90, -123, -54, -19, 15, 27, 79, 18, 3, -38, -93, 4, -59, 34, 129, 110]
4831A10j32j1k8l8O1J5N7M6m3j9k7l0p8P2K4O5L2n4K6j05l3l2P2N0N2K8Kn5o3
4860c6n4j8P7L3P3Qk7J9j21k8K8j6O6J7O9m5%k6p7K5M5k1J30o4j8n0o0m4J8Q6
4890a1M2MJ8pn2o5j6n1Q4P2O4L5l1p8l7q8L0O9L6Q8k4J9r8j1o7M9j8P1P7Mq2n0
4922b4L7l9m7L6P0N6q6P4r5k9o5K6J04L9M8n1o1Rm0n9L5jJ04J1J9k0l1j48L8P0
4952b0j7O8M1L9j09k9m0RJ4Q6jNJ6j2o9l9l4N5M3R0l7k9mo2j2m2L6P1L8L3j6m9
4984B3p5j9k3nQ1N0K6j7j8k5n5m6O3LN6J15r4mr5qJ6OL0N5P0q6K2j42k9K1O5P
5016c2Q9j5K6q0m1L7m4J7M9O6o2K2k9o0K3n4L6J02M0k0j1l7p1J5Jk1Q0N4K3n2
$$ y = [110, -22, -33, -61, -99, -38, -23, 34, 80, 37, 18, -9, -39, -117, -45, -21, 44, 76, 22, 48, -57, -90, -122, -50, 0, 52, 80, 82, 27, -36, -90, -108, -31, 2, 75, 83, 56, 75, -46, -74, -46, -62, 4, 21, 90, 45, 45, 19, -58, -33, 12, -9, 121, 57, 39, -11, -71, -115, -97, -11, 31, 35, 53, 46, -6, -71, -87, -138, -54, 18, 82, 117, 86, 8, -29, -117, -87, -18, 18, 106, 82, 101, 3, -8, -75, -26, -44, 27, 104, 108, 26, -24, 13, -26, -73, -37, 33, 89, 3, 77, -18, -47, -112, -86, 18, 57, 105, 54, -7, 2, -38, -97, -62, -63, 41, 52, 71, 51, 20, -128, -90, -20, -37, 31, 72, 111, 2, -27, -67, -58, -44, 42, 41, 46, 62, 50, -19, -58, -92, -37, 6, 96, 59, 30, 26, -36, -48, -90, -54, 17, 55, 88, 72, 23, -52, -71, -94, -99, -18, 32, 58, 41, 23, -2, -57, -103, -40, -37, 19, 134, 40, 36, -59, -67, -51, -45, -15, 40, 110, 24, 46, -96, -125, -104, -39, -32, 57, 42, 68, -12, -53, -16, -60, -43, 6, 72, 10, 32, 3, -57, -34, -88, -52, 50, 90, 70, 59, 22, -49, -34, -33, -54, 26, 80, 103, 51]
$$ [...]
8191b1
##END NTUPLES=NMR FID
##END=
