##TITLE=1H_LR-0154-M1-TFA-BK
 D2O
 8 sc, 
 17.2.2023
##JCAMPDX= 6.0         $$ Bruker NMR JCAMP-DX V2.0
##DATA TYPE= NMR FID
##DATA CLASS= NTUPLES
##ORIGIN= UXNMR, Bruker Analytische Messtechnik GmbH
##OWNER= root
$$ XWIN-NMR		Version 3.5
$$ Fri Feb 17 15:34:59 2023 Russian Standard Time (UT+4h)  she@DPX200
##.OBSERVE FREQUENCY= 200.13135
##.OBSERVE NUCLEUS= ^1H
##.DELAY= (6, 6)
##.ACQUISITION MODE= SIMULTANEOUS
##.ACQUISITION SCHEME= undefined
##.AVERAGES= 8
##.DIGITISER RES= 18
##SPECTROMETER/DATA SYSTEM= spect
##.PULSE SEQUENCE= zg30
##.SOLVENT NAME= DMSO
##.SHIFT REFERENCE= (INTERNAL, DMSO, 0, 15.7039)
##AUDIT TRAIL= $$ (NUMBER, WHEN, WHO, WHERE, WHAT)
$$ ##TITLE= Audit trail, XWIN-NMR		Version 3.5
$$ ##JCAMPDX= 5.01
$$ ##ORIGIN= Bruker BioSpin GmbH
$$ ##OWNER= she
$$ F:/spectra/data/she/nmr/H-F/1/audita.txt
$$ ##AUDIT TRAIL=  $$ (NUMBER, WHEN, WHO, WHERE, WHAT)
(   1,<2023-02-17 15:33:33.89 +0400>,<she>,<DPX200>,
      <created by zg, POWCHK disabled, PULCHK disabled
       configuration hash MD5:
       00 E9 B6 7A A2 85 ED C7 34 08 36 98 17 FE 4E 26
       data hash MD5: 16K
       B8 D4 EA 3E 4A 52 FF 31 DD D9 7D 3D 6F D5 B1 D6>)
$$ ##END=
$$ 
$$ hash MD5
$$ 43 35 6B 54 85 5B FE 30 AE 43 E5 7B A5 0E 02 7C
##$RELAX= 
##$RELAX= 
##$RELAX= 
##$RELAX= 
##$RELAX= 
##$RELAX= 
$$ Bruker specific parameters
$$ --------------------------
##$DU= <F:/spectra>
##$EXPNO= 1
##$NAME= <H-F>
##$PROCNO= 1
##$TYPE= <nmr>
##$USER= <she>
##$AMP= (0..31)
100 100 100 100 100 100 100 100 100 100 100 100 100 100 100 100 100 100 
100 100 100 100 100 100 100 100 100 100 100 100 100 100 
##$AQSEQ= 0
##$AQ_mod= 1
##$AUNM= <au_zg>
##$AUTOPOS= <>
##$BF1= 200.13
##$BF2= 200.13
##$BF3= 200.13
##$BF4= 200.13
##$BF5= 200.13
##$BF6= 200.13
##$BF7= 200.13
##$BF8= 200.13
##$BYTORDA= 1
##$CFDGTYP= 0
##$CFRGTYP= 5
##$CHEMSTR= <none>
##$CNST= (0..31)
1 1 145 1 1 1 1 1 1 1 1 1 1 1 1 1 1 1 1 1 1 1 1 1 1 1 1 1 1 1 1 1 
##$CPDPRG= <>
##$CPDPRG1= <>
##$CPDPRG2= <>
##$CPDPRG3= <>
##$CPDPRG4= <mlev>
##$CPDPRG5= <mlev>
##$CPDPRG6= <mlev>
##$CPDPRG7= <mlev>
##$CPDPRG8= <mlev>
##$CPDPRGB= <>
##$CPDPRGT= <>
##$D= (0..31)
0 1.2 0 0 0 0 0 0 0 0.06 0 0.03 0 0 0 0 0.0002 0 0 0 0 0 0 0 0 0 0 0 0 
0 0 0 
##$DATE= 1676633613
##$DBL= (0..7)
120 120 120 120 120 120 120 120 
##$DBP= (0..7)
150 150 150 150 150 150 150 150 
##$DBP07= 0
##$DBPNAM0= <>
##$DBPNAM1= <>
##$DBPNAM2= <>
##$DBPNAM3= <>
##$DBPNAM4= <>
##$DBPNAM5= <>
##$DBPNAM6= <>
##$DBPNAM7= <>
##$DBPOAL= (0..7)
0.5 0.5 0.5 0.5 0.5 0.5 0.5 0.5 
##$DBPOFFS= (0..7)
0 0 0 0 0 0 0 0 
##$DE= 6
##$DECBNUC= <off>
##$DECIM= 32
##$DECNUC= <off>
##$DECSTAT= 4
##$DIGMOD= 1
##$DIGTYP= 9
##$DL= (0..7)
0 120 120 120 120 120 120 120 
##$DP= (0..7)
150 150 150 150 150 150 150 150 
##$DP07= 0
##$DPNAME0= <>
##$DPNAME1= <>
##$DPNAME2= <>
##$DPNAME3= <>
##$DPNAME4= <>
##$DPNAME5= <>
##$DPNAME6= <>
##$DPNAME7= <>
##$DPOAL= (0..7)
0.5 0.5 0.5 0.5 0.5 0.5 0.5 0.5 
##$DPOFFS= (0..7)
0 0 0 0 0 0 0 0 
##$DQDMODE= 0
##$DR= 18
##$DS= 0
##$DSLIST= <SSSSSSSSSSSSSSS>
$$ [...]
##$SUBNAM2= <"">
##$SUBNAM3= <"">
##$SUBNAM4= <"">
##$SUBNAM5= <"">
##$SUBNAM6= <"">
##$SUBNAM7= <"">
##$SUBNAM8= <"">
##$SUBNAM9= <"">
##$SW= 18.05172834244
##$SWIBOX= (0..15)
0 0 2 0 0 0 0 0 0 0 0 0 0 0 0 0 
##$SW_h= 3612.71676300578
##$TD= 16384
##$TD0= 1
##$TE= 0
##$TE2= 300
##$TE3= 300
##$TEG= 300
##$TL= (0..7)
0 120 120 120 120 120 120 120 
##$TP= (0..7)
150 150 150 150 150 150 150 150 
##$TP07= 0
##$TPNAME0= <>
##$TPNAME1= <>
##$TPNAME2= <>
##$TPNAME3= <>
##$TPNAME4= <>
##$TPNAME5= <>
##$TPNAME6= <>
##$TPNAME7= <>
##$TPOAL= (0..7)
0.5 0.5 0.5 0.5 0.5 0.5 0.5 0.5 
##$TPOFFS= (0..7)
0 0 0 0 0 0 0 0 
##$TUNHIN= 0
##$TUNHOUT= 0
##$TUNXOUT= 0
##$USERA1= <user>
##$USERA2= <user>
##$USERA3= <user>
##$USERA4= <user>
##$USERA5= <user>
##$V9= 5
##$VALIST= <valist>
##$VCLIST= <CCCCCCCCCCCCCCC>
##$VD= 0
##$VDLIST= <DDDDDDDDDDDDDDD>
##$VPLIST= <PPPPPPPPPPPPPPP>
##$VTLIST= <TTTTTTTTTTTTTTT>
##$WBST= 1024
##$WBSW= 4
##$XGAIN= (0..3)
0 0 0 0 
##$XL= 0
##$YL= 0
##$YMAX_a= 821098
##$YMIN_a= -827977
##$ZGOPTNS= <>
##$ZL1= 120
##$ZL2= 120
##$ZL3= 120
##$ZL4= 120
##$ABSF1= 10
##$ABSF2= 0
##$ABSG= 5
##$ABSL= 3
##$ALPHA= 0
##$AQORDER= 0
##$ASSFAC= 0
##$ASSFACI= 0
##$ASSFACX= 0
##$ASSWID= 0
##$AUNMP= <proc_1d>
##$AZFE= 0.1
##$AZFW= 0.1
##$BCFW= 1
##$BC_mod= 2
##$BYTORDP= 1
##$COROFFS= 0
##$CY= 11.3945322036743
##$DATMOD= 1
##$DC= 2
##$DFILT= <>
##$DTYPP= 0
##$F1P= 2.36226072786647
##$F2P= -0.459571619588291
##$FCOR= 0.5
##$FTSIZE= 0
##$FT_mod= 4
##$GAMMA= 1
##$GB= 0.15
##$INTBC= 1
##$INTSCL= 1
##$ISEN= 128
##$LB= 0.24
##$LEV0= 0
##$LPBIN= 0
##$MAXI= 10000
##$MC2= 0
##$MEAN= 0
##$ME_mod= 0
##$MI= 1.114404
##$NCOEF= 0
##$NC_proc= 0
##$NLEV= 6
##$NOISF1= 3.799351
##$NOISF2= 2.8
##$NSP= 1
##$NTH_PI= 0
##$NZP= 0
##$OFFSET= 15.70392
##$PC= 1
##$PHC0= -19120.85
##$PHC1= 23.40078
##$PH_mod= 1
##$PKNL= yes
##$PPARMOD= 0
##$PSCAL= 0
##$PSIGN= 0
##$REVERSE= no
##$SF= 200.130013532006
##$SI= 16384
##$SIGF1= 3
##$SIGF2= 2
##$SINO= 400
##$SIOLD= 16384
##$SREGLST= <1H.CDCl3>
##$SSB= 0
##$STSI= 0
##$STSR= 0
##$SW_p= 3612.71676300578
##$SYMM= 0
##$S_DEV= 0
##$TDeff= 0
##$TDoff= 0
##$TI= <>
##$TILT= no
##$TM1= 0
##$TM2= 0
##$TOPLEV= 0
##$USERP1= <user>
##$USERP2= <user>
##$USERP3= <user>
##$USERP4= <user>
##$USERP5= <user>
##$WDW= 1
##$XDIM= 8192
##$YMAX_p= 0
##$YMIN_p= 0
$$ End of Bruker specific parameters
$$ ---------------------------------
##NTUPLES= NMR FID
##VAR_NAME=  TIME,          FID/REAL,        FID/IMAG
##SYMBOL=    X,             R,               I
##VAR_TYPE=  INDEPENDENT,   DEPENDENT,       DEPENDENT
##VAR_FORM=  AFFN,          ASDF,            ASDF
##VAR_DIM=   8192,          8192,            8192
##UNITS=     SECONDS,       ARBITRARY UNITS, ARBITRARY UNITS
##FACTOR=    0.0002768,     1,               1
##FIRST=     0,             0,               0
##LAST=      2.2672688,     0,               0
##MIN=       0,             -827977,         0
##MAX=       2.2672688,     821098,          0
$$ Real data points
##PAGE= N=1
##DATA TABLE= (X++(R..R)), XYDATA
0@%%%%%%%%%Qj6J6k4L2m0M9n8P5r0J09j32J55j87K21k59L06l55M13m74N43o25
$$ 0 0 0 0 0 0 0 0 0 0 8 -8 8 -16 16 -24 25 -33 42 -48 61 -71 84 -103 118 -141 165 -190 223 -251 292 -333
31c33P11q12R19j035J173j318J477j656J847k059K289k540K818l115L444l804
$$ -333 378 -434 485 -550 623 -695 782 -874 973 -1086 1203 -1337 1481 -1634 1810 -1994
47a994M195m628N097n616O188o817P522q306R188j0187J1326j2649J4197j6040
$$ -1994 2201 -2427 2670 -2946 3242 -3575 3947 -4359 4829 -5358 5968 -6681 7516 -8524
61h524J8285k1078K4672k9498L6362m6981O5783j09158M00553J21738o97339l84291
$$ -8524 9761 -11317 13355 -16143 20219 -26762 39021 -70137 330416 452154 -245185 -629476
73f29476j98501K71189M86471N58692K83856l1807m19514n49394m49575j01962
$$ -629476 -827977 -556788 -70317 488375 772231 740424 320910 -228484 -678059 -780021
83g80021K42682N18894N06807K77700r5486m05257n53196l92806o5091K77644
$$ -780021 -537339 -18445 488362 766062 670576 265319 -287877 -680683 -745774 -468130
93d68130M78010M85555K37808j13398m05788n07824l79074m1160L01142M81674
$$ -468130 9880 495435 733243 619845 214057 -293767 -672841 -714001 -412859 68815
103F8815M40951K05831j40948m08398m77423l30224k4495L04964M68949M08879
$$ 68815 509766 715597 574649 166251 -311172 -641396 -665891 -360927 108022 516901
113E16901J72454j50486m12379m63580k94427N201L08306M59040L78093J30583
$$ 516901 689355 538869 126490 -337090 -631517 -626316 -318010 141030 519123 649706
123F49706j66773l97197m41400k65989K8036L06989M46946L62534J00316j91149
$$ 649706 482933 85736 -355664 -621653 -593617 -286628 160318 522852 623168 432019
133D32019l88862m14031k37086N6869L12681M19567L33741Q4902k02873l85167
$$ 432019 43157 -370874 -607960 -551091 -238410 181157 514898 599800 396927 11760
143A1760l89471k12732P3999L22434M08164L03247N5035k18303l78039l58782
$$ 11760 -377711 -590443 -516444 -194010 214154 517401 572436 354133 -23906 -382688
153c82688j80333Q4905L18196L93372K77553L5875k25312l78528l44385j48588
$$ -382688 -563021 -478116 -159920 233452 511005 546880 321568 -56960 -401345 -549933
163e49933J10523L18568L75173K48261P082k31308l61541l21297j28063J23759
$$ -549933 -439410 -120842 254331 502592 509674 278366 -83175 -404472 -532535 -408776
173d08776L17812L62499K29690j5328k45974l55472k96989r9279J43164L13961
$$ -408776 -90964 271535 501225 485897 239923 -115549 -412538 -511817 -368653 -54692
183e4692L37945K04638k8941k49027l46089k79065q0662J56154L17637L25138
$$ -54692 283253 487891 458950 209923 -136166 -415231 -495893 -339739 -22102 303036
193C03036J78511n2322k56166l34376k53344n6649J64831L09628L08357J59898
$$ 303036 481547 429225 173059 -161317 -414661 -471310 -306479 3149 311506 471404
203D71404o5269k60422l29064k37208l3814J82090L07999K88419J34209q3295
$$ 471404 406135 145713 -183351 -420559 -454373 -272283 35716 324135 458344 375049
213C75049k60840l13203k17169j8250J88468L04509K75800J15926j00068k67792
$$ 375049 114209 -198994 -416163 -434413 -245945 58564 334364 450290 350222 82430
223H2430l04039j95099M515J98962K97407K54578R4402j10198k64661k93894j80380
$$ 82430 -221609 -416708 -412193 -213231 84176 338754 433156 322958 58297 -235597 -415977
234d15977K0496K09163K95651K41215P1555j29126k66753k77646j57334L8177
$$ -415977 -395481 -186318 109333 350548 422103 292977 26224 -251422 -408756 -370579
244c70579K13760K86217K24336N6858j40271k68400k68223j40738N6460K24788
$$ -370579 -156819 129398 353734 410592 270321 1921 -266302 -407040 -350580 -125792
254a25792K80514K04039L4294j51860k64834k51905j21766O7198K26911K76172
$$ -125792 154722 358761 393055 241195 -23639 -275544 -397310 -330112 -103201 172971
264A72971J90838J6501j64429k67306k40408r9398Q6642K29940K64413J72176
$$ 172971 363809 380310 215881 -51425 -291833 -391231 -304589 -74649 189764 361940
274C61940n25j71373k61110k28130q5918R8486K35656K59269J57372j9549j83653
$$ 361940 361415 190042 -71068 -299198 -385116 -286630 -50974 208295 365667 346118 162465
285A62465k57612k11512o5648J11038K34406K46669J43064l0447j90442k56678
$$ 162465 -95147 -306659 -372307 -261269 -26863 219806 362870 332423 141981 -114697
295a14697j99937m9470J24100K39368K37822J22628m8562j94860k48698j84930
$$ -114697 -314634 -364104 -240004 -636 237186 359814 311252 116392 -132306 -317236
305c17236l4302J32578K37205K28919J10745o1519k03773k46625j70430j5006
$$ -317236 -351538 -218960 18245 247164 357909 296390 92617 -154008 -324438 -339444
315c39444J44963K35953K15184R2599p3268k04386k38733j59024l036J54144K36949
$$ -339444 -194481 41472 256656 349255 275987 71601 -167132 -326156 -329192 -175048 61901
326F1901K06713P7133q7882k11263k31125j40989J4096J60343K31576J94153O3453
$$ 61901 268614 345747 257865 46602 -184523 -325512 -311416 -151073 80503 274656 338109
337C38109r7680k12184k25951j30656K8251J71739K30638J80885M5674j10732
$$ 338109 240429 28245 -197706 -328362 -300111 -128372 102266 283151 328825 218093
347B18093k13155k14378j14724L9300J75084K26701J70655L3655j20684k17094
$$ 218093 4938 -209440 -324164 -284864 -109780 116921 287576 321231 200547 -16547
357a6547k07854r9458N5028J82725K21560J54944J7458j27631k13782j98306q7653
$$ -16547 -224401 -323859 -268831 -86106 135454 290398 307856 180225 -33557 -231863 -319516
368c19516O4922J86959K19298J45166K487j39497k13764j87775p1009P7989J88484
$$ -319516 -254594 -67635 151663 296829 299316 159819 -53945 -241720 -312729 -234740 -46256
379d6256K09857J32941q821j45105k12601j79103o0386Q8782J94705K04776J18331
$$ -46256 163601 296542 287721 142616 -69985 -249088 -309474 -220692 -25987 178789 297120
390B97120k3334j53337k08404j65776m7031R5861J94082J98446J08176l2890j58954
$$ 297120 273786 120449 -87955 -253731 -300762 -204901 -10819 187627 295803 262913 103959
401A03959k08960j56986l1852J07499J95512J89944R3369m5181j61601k02411
$$ 103959 -105001 -261987 -293839 -186340 9172 199116 292485 247304 85703 -116708
411a16708j46821k1129J14262J95836J84596Q3415n7920j69102j97982j34946
$$ -116708 -263529 -284658 -170396 25440 210036 293451 235531 66429 -131553 -266499
421b66499p007J22958J93093J73007P1951o5201j71576j94733j25806L039J30862
$$ -266499 -273506 -150548 42545 215552 287503 222302 50726 -144007 -269813 -266774 -135912
432a35912J95219J65516N7130p7038j74602j87517j12356J5076J34838J91430
$$ -135912 59307 224823 281953 204915 30313 -157204 -269560 -254484 -119646 71784
442G1784J57257M7494q4893j76961j84118j02067K8257J43311J89086J46005L4185
$$ 71784 229041 276535 191642 14681 -169437 -271504 -243247 -99936 89150 235155 269340
453B69340r4012j75875j75309r2038L6016J47589J87528J37768K3528j02862j79780
$$ 269340 175328 -547 -175856 -267894 -231878 -84289 103239 241007 264535 161673 -18107
464a8107j68784p8628M7817J50911J81797J26783J2574j07958j77852j63362o9572
$$ -18107 -186891 -265519 -217702 -66791 115006 241789 254363 146405 -31447 -194809 -264381
475b64381N6576J55357J80184J17844j174j16117j76226j54124n7554O5894J56384
$$ -264381 -207805 -52448 127736 245580 244406 128289 -47937 -202061 -259615 -193721 -37337
486c7337J73692J09418q207j22244j76506j47371m7560P5617J61781J67759R7245
$$ -37337 136355 245773 237566 115322 -61184 -208555 -256115 -180498 -18717 149042 246287
497B46287j9277j27562j73191j36956l7918Q0463J62981J64572Q7440k9483j32784
$$ 246287 227010 99448 -73743 -210699 -248617 -168154 -5173 159399 246839 217356 84572
508H4572j73744j29051k3275Q9393J61655J57304P6546l9133j34578j69204j22865
$$ 84572 -89172 -218223 -241498 -152105 9550 166854 243400 204267 69689 -99515 -222380
519b22380j5012R7988J63201J52306O7370n1399j41053j63537j11070m436J04774
$$ -222380 -237392 -139404 23797 176103 243473 192074 51021 -112516 -223586 -228022 -123248
530a23248J61303J43287N8527n6777j45686j61112j02200N059J12174J63933J34425
$$ -123248 38055 181342 239869 183092 37406 -123706 -225906 -220847 -108673 55260 189685
541A89685M4596o5328j46724j56207r0636J4312J13687J62487J29991L4926p3768
$$ 189685 234281 168953 22229 -133978 -224614 -210302 -96615 65872 195863 230789 157021
552A57021j48791j53606q1763K7744J19502J57627J21548K5005q1838j47381j46350
$$ 157021 8230 -145376 -227139 -199395 -79893 77734 199282 224287 142449 -4932 -151282
563a51282p5478L5020J25861J55513J14085J6401r1025j49987j38618o3496M2582
$$ -151282 -226760 -191740 -65879 89634 203719 220120 129095 -20892 -159510 -223006 -180424
574a80424J29361J51160J03703Q879r4141j51792j33999n4072N0954J32812J50269
$$ -180424 -51063 100097 203800 212679 118538 -33254 -167253 -221325 -170371 -37559 112710
585A12710R3778l599r8594j49691j27327m3506N7875J32665J46602Q7844j2702
$$ 112710 206488 202889 104295 -45396 -172723 -216229 -158354 -25689 120913 208757 196055
596A96055j04725j48526j21676l4138O8125J34332J39697P8867k1091j09579j44598
$$ 196055 91330 -57196 -178872 -213010 -144885 -10553 129144 208011 186920 77341 -67257
607f7257j13483k8176P3617J37658J35531P0452l0093j15870j43452j03629j7007
$$ -67257 -180740 -208916 -135299 2359 137890 208342 178249 62379 -81073 -184702 -201709
618b01709P8567J38237J28787O0574l5733j17216j42302r8134p600Q5244J39049
$$ -201709 -123142 15095 143882 204456 168723 51507 -90795 -188929 -196529 -111285 27764
629B7764J24758N0389m5797j19463j37619q9414J556Q9318J36512J19705M3581
$$ 27764 152522 202911 157114 37651 -99968 -189382 -187826 -98508 38004 157709 201290
640B01290n2987j23038j34452q2180J0207R6672J35682J10770L4402n9971j23960
$$ 201290 148303 25265 -109187 -191367 -181160 -84488 51194 161964 196366 136395 12435
651A2435j28808p4440J6666J00247J35348J04929K5951o6572j26919j24699o4362
$$ 12435 -116373 -190813 -174147 -73900 61448 166377 192328 125756 -1163 -125862 -190224
662a90224K5560J03539J32343R7511J7545p0730j26488j21703n7349L3448J07527
$$ -190224 -164664 -61125 71218 168729 186274 115544 -10944 -132647 -189996 -156548 -49021
673d9021J31328R0798P753p7830j25719j14730m8928L9661J09251J26792Q5109
$$ -49021 82307 173105 180858 103028 -22691 -137421 -186349 -146688 -37437 89355 174464
684A74464J575q2800j26731j10544m1192M7788J12802J23196P6016o891q6610
$$ 174464 176039 93239 -33492 -144036 -185228 -137440 -24638 98558 174574 167683 81073
695H1073j24570j03828l4275N2396J14250J20792P0090j4097r1924j24504r7820
$$ 81073 -43497 -147325 -181600 -129204 -14954 105838 175928 161831 69907 -54597 -152417
706a52417k4675N9236J14737J15793O1910k0733r4168j22578r2295j8271O4874
$$ -152417 -177092 -117856 -3119 112674 174584 153851 59683 -62895 -155190 -173461 -108587
717a08587J17035J12028N4473k9718r8110j19832q4675r867O9666J15760J07097
$$ -108587 8448 120476 174949 145231 47121 -72711 -157386 -167253 -97587 18173 125270
728A25270M7599l5116j00826j18577p9195j560P5558J16765J01680L8424m2514
$$ 125270 172869 137753 36927 -81650 -160845 -162405 -86847 29918 131598 170022 127508
739A27508j02694j13890p1978M947P9099J16061R7364L2038m9239j05882j11392
$$ 127508 24814 -89076 -161054 -156107 -77008 39053 136417 168455 119216 13334 -98058
750i8058o4032J3316Q4126J13991R0294K4331n3998j06345j07583n8204J9526
$$ -98058 -162090 -148774 -64648 49343 139637 163968 109970 3625 -103958 -162162 -142636
761a42636Q7538J13895Q5233J5954o0371j07607j02755m9718K6415Q9755J10801
$$ -142636 -55098 58797 144030 159984 99613 -7994 -110749 -160467 -134052 -44297 66504
772F6504P9021R823o4271j08456r9619m3509L3694R3589J08993P1929J632o9211
$$ 66504 145525 155348 91077 -17379 -116998 -160507 -126813 -33224 75769 147698 149330 80119
784H0119j07024r3744l6366L8226R4730J06602O6779m129p4036j07535q9467k8961
$$ 80119 -26905 -120649 -157015 -118789 -24059 82543 149322 145193 71157 -36378 -125845 -154806
796a54806M4988R6847J02356N9220j0577p6569j05732q4594k3291M9775R8754
$$ -154806 -109818 -12971 89385 148605 138028 61459 -44273 -128867 -152158 -102383 -3629
807c629J00078N3561j8538q0438j04792p8198j5584N4650R8472R5270M7501k3433
$$ -3629 96449 150010 131472 51034 -53758 -131956 -147540 -92890 5582 100852 148353 124920
819A24920q2699j03447p3910r054N9730R9907R1884L9921k9972q5458j00091o7476
$$ 124920 42221 -61226 -135136 -144190 -84460 15447 107331 147252 117280 31822 -68269 -135745
831a35745k878O2847R9287Q8066L4662l5842q8052r8431o1932M830O7741R8352
$$ -135745 -138623 -75776 23511 111577 146239 110397 22345 -76086 -138018 -133188 -65447 32905
843C2905Q2446K7483m0563q8766r4837n6568R520P0728R8427P8638K1257m6228
$$ 32905 115351 142834 102271 13505 -81332 -137900 -128380 -57652 40775 119413 140670 94442
855I4442r1041r1423m9642J5949P3602R5887P3204J5650m9422r1223q9234m4451
$$ 94442 3401 -88022 -137664 -121715 -48113 47774 120978 136628 87206 -4017 -93251 -137702
867a37702K1356P6830R5565O8212Q403n4277r1094q4892l7623K5881P8017R2952
$$ -137702 -116346 -39516 56049 124261 132664 78387 -12707 -97599 -135222 -109341 -31324 61628
879F1628O3988L851n8296r2013q1633l2323L2363Q0718R0347N7621k222o1533
$$ 61628 125616 129467 71171 -20842 -102475 -134798 -102435 -21717 68630 126251 124029 62496
891F2496r0894p7055k7300L6086Q2836Q8546N3018q238o5350r1009p2368k0392
$$ 62496 -28398 -105453 -132753 -96667 -13831 74715 127733 119495 54145 -36864 -109232 -129624
903a29624M1202Q3061Q5193M7001j3218o6963q9924o8852j5099M5742Q4435Q2670
$$ -129624 -88422 -5361 79832 126833 113615 46652 -43272 -112124 -127223 -81481 2954 85624
915H5624M1715j9694p0253q7360o3813r413M9386Q3861P9523L7017k4069p2814
$$ 85624 127339 107645 37392 -49968 -113781 -123194 -73808 10053 89576 126593 102524 29710
927B9710q6669n9212l660N3767Q5006P5362K9846k8492p4278q3930n4333J164
$$ 29710 -56959 -116171 -119831 -66064 18942 94304 124150 95658 21380 -62550 -116883 -115719
939a15719N6425Q4953P2055K5611l3943p6000q2081m9108P546N9606Q3394O7814
$$ -115719 -59294 25659 97714 123325 89382 13382 -68699 -117807 -110261 -50655 32739 100553
951A00553J9707l7270p6659q0012m4736J2362O2947Q3192O3971J3968m2478p7853
$$ 100553 120260 82990 6331 -73681 -118417 -106055 -43108 40084 104055 118023 75545 -2308
963b308p6167l8640J6605O4652Q1706N9735R283m5459p8840p4246l3770K2415
$$ -2308 -78475 -117115 -100510 -35858 45848 105583 114866 69407 -9433 -83679 -117449 -95034
975i5034O7850P9972N4484L250m9152p7955p0263k8832K6390O8388P8890N1519
$$ -95034 -27184 52788 107272 110522 61370 -16585 -86848 -115680 -89290 -20902 57988 109507
987A09507j521n3519p8356o6815k3422L1063P0547P5647M6094o170n4963p7759
$$ 109507 107986 54467 -23889 -90704 -114126 -83063 -12516 63131 109225 103055 48092 -29667
999b9667o3594j9072L4182P2119P4494M1302j0949n8084p7150n9265j3870L8165
$$ -29667 -93261 -112333 -78151 -6032 68462 109764 98815 40731 -36419 -95684 -109554 -71389
1011g1389P1788P1599L7355j4912n9778p6583n6242r419M2023P3117O9203L1959
$$ -71389 399 71998 109353 94441 34663 -41920 -98162 -107581 -65558 7559 76762 108721
1023A08721j9742o1664p4351n2104n126M4742P2924O6517K8328k3534o4285p3051
$$ 108721 88979 27315 -47036 -99140 -104266 -59524 13400 79917 108245 84711 20426 -52625
1035e2625m8385M25M8226P2729O2536K3234k6982o5121p1200m4215M248N0346
$$ -52625 -101010 -100585 -52359 20370 82906 106140 79158 14037 -57163 -101378 -97130 -46784
1047d6784P3363O0019J8377l1843o6369o9695l8605R070N2837P1585N6688J3796
$$ -46784 26579 86598 104975 73132 6763 -62932 -101537 -92467 -39630 31955 88643 102439
1059A02439l4641o6896o7729l5592J3669N5981P1178N2579Q849l8700o7378o4142
$$ 102439 67798 902 -66827 -102419 -88750 -32769 38409 90988 99837 61137 -6241 -70383
1071g0383l0931J7514N7713O9543M9055N421m2587o8408o1780k5817K2093N9716
$$ -70383 -101314 -83800 -26087 43456 92511 97932 55345 -13063 -74843 -100660 -78567 -18851
1083a8851O8003M4201K35m4209o8260n8727k2156K5600O0997O7607M0863m926
$$ -18851 49152 93353 93588 49379 -18881 -77608 -99764 -74164 -13167 54440 95303 90377
1095I0377m7791o7763n5869j6268K9561O1487O4660L6893q653m9675o7213n3144
$$ 90377 42586 -25177 -81046 -97314 -67753 -6266 58394 95287 86634 36959 -30254 -83398
1107h3398j3009L3535O3140O2657L2784j3238n2346o6082m8839q502L5832O3388
$$ -83398 -96407 -62872 268 62925 95709 82471 30125 -35957 -84796 -93298 -57466 5922
1119E922O0388K8772j6532n4431o5638m5438m319L9718O3831N7554K4046k0407
$$ 5922 66310 95082 78550 24119 -41519 -86957 -91276 -51558 12273 69827 93873 73466
1131G3466n5151o4070m2087k51M1768O4039N5782J9794k4084n6964o2962l8045
$$ 73466 18315 -45755 -87842 -88093 -46325 17714 73496 93290 69206 12242 -50720 -88765
1143h8765M214M4586O2931N2304J6689k7317n7837o1146l5146P559M7200O3399
$$ -88765 -84551 -39965 22966 75270 91959 64642 6805 -54341 -89487 -81928 -34728 28671
1155B8671M9192J2207l0748n9143n8411l0902J1332M8307O2290M6619Q766l3326
$$ 28671 77863 90070 59322 179 -58232 -89134 -77802 -29495 32795 79414 88180 54854
1167E4854o0006n7058k7077J5384N0633O1254M2977M420l6341n9198n4809k3555
$$ 54854 -5152 -62210 -89287 -73903 -23270 37984 80961 85381 49040 -10158 -64967 -88522
1179h8522J8446N1694O0656M0386M93l9087o0354n1662j9172K2317N2740N8780
$$ -88522 -70076 -18382 42274 82660 83153 44066 -16288 -67950 -87122 -64805 -12065 46715
1191D6715L5963k697m1324n9119m9838j6066K4979N4810N7396L3003p290m3631
$$ 46715 82678 79981 38657 -20462 -70300 -86366 -61387 -6577 50819 83822 76532 32901
1203C2901n9063m6330j1915K8312N4822N5309K9843j0422m5407n8809m3834p981
$$ 32901 -26162 -72492 -84407 -56095 -1273 54036 83879 73457 28050 -30759 -74593 -82574
1215h2574L1355N5770N3335K5418j4214m6867n6894m1224m217L3408N6052N1455
$$ -82574 -51219 4551 57886 83304 69090 22223 -34671 -75895 -80112 -46704 9348 60803
1227F0803K2297j7690m8860n6409l7829o3L6868N5525M8650J8429k0285m9512
$$ 60803 83100 65410 16550 -39859 -77688 -77751 -40883 14642 63292 81721 61436 11924
1239A1924n5284l4694K678L8833N6252M6300J4784k3781n1002n3305l0973O437
$$ 11924 -43360 -78054 -75376 -36543 19709 66009 80793 57012 6010 -47295 -78268 -71831
1251g1831M0328N5493M3815J1601k6445n1572n2245k7929J0172M2424N5185M0800
$$ -71831 -31503 23990 67805 79406 52961 1389 -50856 -78785 -68613 -26189 28996 69796
1263F9796P251k9244n1854m9755k4286J2928M3898N4200L8425M306l1866n2749
$$ 69796 77047 47803 -4051 -53806 -78092 -65164 -21266 32934 71359 75665 43799 -8950
1275h950m8192k0677J6507M5678N2565L4952R26l3971n1905m6231j7736J8987
$$ -8950 -57142 -77819 -61312 -15634 36931 71883 72809 38838 -13067 -59298 -77034 -58047
1287e8047M6826N1911L2690l132l6137n2343m3145j4037K2105M6863N0105K9523
$$ -58047 -11221 40690 73380 70248 34111 -18232 -61377 -75414 -53309 -6446 43659 73182
1299G3182n579l7895n1845m1329j0970K4816M8604M8534K5919r390l9500n1030
$$ 73182 67603 29708 -22137 -63466 -74436 -49620 -1016 47518 73437 64047 24547 -26483
1311b6483l8337p415K6785M8840M6903K3109j1899m1632n0624l6036l606K9638
$$ -26483 -64820 -72235 -45450 3390 50293 73402 61503 19871 -30753 -66789 -70395 -40757
1323d0757M9095M4728J9531j5168m2432m9369l3057j026L1676M9382M3158J6288
$$ -40757 8338 53066 72597 57429 14997 -34372 -67429 -68455 -36779 12603 55761 72049
1335G2049j8326m3602m8462k9952K760L3589M8565M0760J3242k0521m3855m7506
$$ 72049 53723 10121 -38341 -68293 -65533 -31944 16621 57381 70623 50102 6247 -41259
1347d1259k7706N603L5765M8679L8463R854k3287m5038m5318k4295Q412L6778
$$ -41259 -68965 -63362 -27597 21082 59545 69399 46112 1074 -44244 -68539 -60127 -23349
1359b3349M8192L6019P191k5198m5823m4386k1300J1343L8607M7308L3360L827
$$ -23349 24843 60862 68053 42855 -2968 -47354 -68654 -57311 -18704 28604 61964 65791
1371F5791k7353m5536m1853j9113J3893L9506M6465L1371R64k9407m5963m0372
$$ 65791 38438 -7098 -48951 -68064 -54171 -14665 31800 63171 64135 34728 -11235 -51607
1383e1607j5804J6864M0379M4933K8696j555l1384m5304l8763j3063J9077M1556
$$ -51607 -67411 -50547 -10168 34765 63461 61906 30522 -14782 -53545 -66608 -47531 -5975
1395e975M4304K5707n105l2882m5058l6268r628K0912M1936M2813K3221o950l4709
$$ -5975 38329 64036 58931 26049 -19009 -55277 -64905 -43993 -2057 40756 63977 57027 22318
1408B2318m5234l4149o714K3818M2575M1177K0265j0337l5637m4005l1896m242
$$ 22318 -22916 -57065 -63779 -39961 2614 43791 64056 53719 18082 -25923 -57819 -62061
1420f2061K5537M2618L9977J7702j2700l7084m3949k8823j139K7572M2505L7600
$$ -62061 -36524 6094 46071 63773 51073 13989 -29960 -58783 -59922 -32350 10155 47755
1432D7755J4959j5163l7501m2818k6933J216K9665M2828L6419J1617j7489l9215
$$ 47755 62714 47551 10050 -32768 -59701 -58485 -28820 14008 50427 62044 44555 5340
1444E340m1142k4072M390L0796M2295L4179R202j9701l9608m0217k1688P205L2273
$$ 5340 -35802 -59874 -55484 -24688 17607 51786 60988 41287 1679 -38538 -60226 -53021 -20748
1457b0748M2478L1385O312k1812l9678l8640j9433R415L3726M1527K9819M279
$$ -20748 21730 53115 59427 37615 -2063 -40703 -60136 -50721 -16995 24532 54351 58630
1469E8630k4526l9970l7498j6489J2003L4814M0486K7646J360k6062l9858l5629
$$ 58630 34104 -5866 -43364 -59853 -47850 -13036 27450 55096 56456 30394 -9464 -45093
1481d5093j4045J3800L6046M0305K4969j770k7110m0381l3507j1160J6054L6226
$$ -45093 -59138 -45338 -9292 31013 55982 54212 27102 -13279 -46786 -57946 -41892 -5666
1493e666L8950K3088m139k8598m0286l2191q679J8743L7153L7836K0153o440l0292
$$ -5666 33284 56372 52233 23635 -16651 -48842 -57521 -38778 -1625 36211 56364 49924 19632
1506A9632l9496l0061n895K0345L7223L6540J8115q757l1640l9196k7933l468
$$ 19632 -19864 -49925 -55820 -35475 1748 38288 56403 47646 16006 -23190 -51123 -54591
1518e4591K2553L7352L5004J5511j0927l1982l8472k6440j417K4275L7691L3860
$$ -54591 -32038 5314 40318 55829 44902 12920 -25552 -51992 -53409 -29134 8557 42417
1530D2417J3550j3716l3139l7478k3935J087K5449L7470L2185J1082j5322l3814
$$ 42417 55967 42251 9112 -28366 -52301 -51214 -25765 11705 43890 54972 39650 5836
1542E836l6749k1790L369K6975L7378L0295Q459j7066l4377l5382j9523N202K7997
$$ 5836 -30913 -52703 -49334 -22359 15019 45314 53773 36707 2330 -33052 -52575 -47373 -19376
1555a9376L6821K9013O433j9017l4642l4549j7722P898K9390L6277K6800M205
$$ -19376 17445 46458 52891 33874 -768 -35317 -53039 -45141 -15751 20526 47326 51531
1567E1531k0821l4753l3138j5348R701L0233L6342K4958J530k2360l5462l1697
$$ 51531 30710 -4043 -37181 -52529 -42828 -12595 23747 48705 50235 27875 -7587 -39284
1579c9284j2553J1538L0989L5436K2633m45k3272l5784l0150j0738J4010L1822
$$ -39284 -51837 -40299 -9310 26126 48759 48314 25042 -10742 -40892 -51630 -37620 -5798
1591e798L4694K0469k912k5325l4699k8331q581J5896L1848L3744J8668n238k6175
$$ -5798 28896 49365 46453 21128 -13571 -41902 -50483 -34587 -2739 31005 49673 44435 18260
1604A8260l4948k7096o000J8078L2837L2111J6215p251k7324l3956k5117m117
$$ 18260 -16688 -43784 -49784 -31706 1131 33242 49457 42206 14882 -19074 -44191 -48308
1616d8308J8960L3151L1144J4441r331k8307l3981k3084j666K0728L3035K9717
$$ -48308 -29348 3803 34947 49388 40057 11750 -22231 -45315 -46981 -26253 6782 36499
1628C6499J2093j0609k8978l3109k1657J16K2022L3098K8961J0055j3052k9528
$$ 36499 48592 37983 9005 -24104 -45761 -45645 -23623 9475 38436 48491 35439 5911
1640E911l2455j9544K444K3199L2886K7045Q408j4763l0366l1431j7862M511K4525
$$ 5911 -26544 -46088 -43644 -20445 12441 39486 47894 33131 2765 -28666 -46528 -42017 -17492
1653a7492L2682K5399N873j6084l0477l0255j5993N906K5617L2382K3797M301
$$ -17492 15190 40589 46462 30378 -99 -30354 -46347 -40441 -14824 17558 41355 45656
1665D5656j7685l0944k9722j3585Q489K5835L2002K1957K076j8852l1022k8058
$$ 45656 27971 -2973 -32695 -46280 -37791 -11956 20046 42003 44079 25227 -5795 -33853
1677c3853j2085R912K7180L1515K0391k29k0709l0771k6731r721J1712K7873L0023
$$ -33853 -45938 -36026 -8846 22669 43060 42831 22122 -8649 -35380 -45101 -33389 -5516 24507
1690B4507J8559k115k1412l1177k5360p632J3525K8495K9434J6599m290k2801
$$ 24507 43066 40951 19539 -11638 -36998 -44630 -31105 -2610 26824 43423 39133 16332
1702A6332l0519k3406o177J5031K8974K8452J4658n890k3921l0465k2010l758
$$ 16332 -14187 -37593 -43770 -28739 235 28687 43345 37455 13534 -16931 -38941 -42699
1714d2699J7144K8650K7187J2743p486k4647k9680k0827j861J8202K8677K6672
$$ -42699 -25555 3095 30282 43025 35539 10892 -18788 -39615 -41476 -23274 5403 32075
1726C2075J0796r635k5172k9084j9051M17J8742K8945K5032R138j0841k5971k8333
$$ 32075 42871 33236 8064 -21020 -40071 -39654 -20912 8033 33065 42203 31362 5391 -22942
1739b2942j7660J982K0081K9483K3399P145j2300k6542k7298j6033L662K1258
$$ -22942 -40602 -38620 -18539 10944 34343 41488 29188 2646 -24652 -40685 -37023 -15765
1751a5765K8562K2625N744j4137k6768k6784j4295N502K2535K8098K0732L929
$$ -15765 12797 35422 41166 27029 261 -26523 -40818 -35316 -12781 15317 36049 39978
1763C9978j5389k6578k6051j2404O721K3136K8238J9389J955j6833k7023k4939
$$ 39978 24589 -1989 -28040 -40444 -33723 -10587 17651 37040 38995 22162 -4861 -29800
1775b9800j0331Q771K3205K7201J8070M17j7513k7261k3905q571J0320K3893K6834
$$ -29800 -40131 -31360 -8155 19046 37116 37533 20020 -7241 -31146 -39717 -29397 -5504 21330
1788B1330J6489j675j8741k7205k2298p175J1993K4330K6113J5218l436k0025
$$ 21330 37819 36144 17403 -9802 -32100 -39275 -27282 -2952 23161 38379 34943 14918
1800A4918k6822k1231n253J3106K4838K5263J3110m643k0853k6229j9976l742
$$ 14918 -11904 -33135 -38388 -25282 -444 24819 37929 33286 12433 -13796 -33772 -37514
1812c7514J4386K5132K4189J1733o537k1440k6541j8014j973J5780K5284K2960
$$ -37514 -23128 2004 26193 37926 31389 9949 -16592 -34606 -36579 -20799 4485 27445
1824B7445J0027p555k2256k5635j7084l98J6673K5446K2334Q277r548k2565k5099
$$ 27445 37472 29917 7661 -17974 -35058 -35456 -18783 6663 28997 37274 27726 5161 -19938
1837a9938j5488J188J7524K5431K1366O769j0748k2990k4494j4267K941J8583
$$ -19938 -35426 -34238 -16714 8717 30083 36852 26104 3114 -21380 -35647 -32706 -14123
1849a4123K5155K0025N265j2367k3378k3349j2698L971J9399K5006J8783L570
$$ -14123 11032 31057 36322 23955 577 -22772 -35470 -31499 -12100 12906 31689 35259
1861C5259j3370k4095k2398j0910N918J9920K4277J7224K487j4171k3812k2153
$$ 35259 21889 -2206 -24604 -35514 -29596 -9676 14601 31825 34312 20141 -3671 -25824
1873b5824r278O940K0761K4147J6170L28j5817k3343k0891q050Q515K1199K3549
$$ -25824 -35102 -28162 -7401 16746 32916 33244 17427 -5916 -26807 -34857 -26342 -5143 18406
1886A8406J4821r51j6496k4119j9570o577J0054K1617K3191J2911k604j7423k3527
$$ 18406 33227 32276 15780 -8339 -27909 -34486 -24432 -2815 20376 33287 30683 13260 -10267
1899a0267j8330n221J1156K1781K2303J1828l850j8175k3434j7458l163J2379
$$ -10267 -28597 -33818 -22662 -881 21422 33250 29400 11225 -12209 -29667 -32830 -20451
1911b0451K2202K1140J0226n535j8625k2366j6868j691J3388K2204K0445R142
$$ -20451 1751 22891 33117 27582 8957 -13409 -30277 -31968 -18580 3624 24069 33211
1923C3211p066j9276k2413j4972l89J4402K1891J9867P344p815k0181k1561j3735
$$ 33211 26145 6869 -15544 -30516 -30905 -16503 5388 25255 32599 24784 4603 -16958 -30693
1936c0693R09J5357K2076J8339O018r217k0094k1151j2432K387J6035K1768J7523
$$ -30693 -29784 -14427 7649 25988 32006 22789 2695 -18456 -30888 -28501 -12466 9302 26825
1949B6825M702j0356k0462k0986j0929M081J6728K1721J6292K957j1499k0318
$$ 26825 31527 21171 709 -20277 -31206 -27125 -10397 11324 27616 30573 19074 -1244
1961a244k0027r806N409J7041K1536J5278J626j2402k1144j8718q473O667J7832
$$ -1244 -21271 -31077 -25668 -8627 12909 28187 29813 17411 -3733 -22451 -30924 -24257 -6425
1974f425K0787J4087J47j3035k0611j8278p197P903J8216K0737J2346j044j4191
$$ -6425 14362 28449 28596 15561 -5050 -23328 -30525 -22622 -4406 16331 28677 27633 13442
1987A3442k0290j7259n788Q573J8815K0006J1332k152j5060k0533j6401l988R995
$$ 13442 -6848 -24107 -29895 -21322 -2507 17499 28831 26679 11619 -8914 -25315 -29303 -19308
2000a9308J8798J9386R761l407j5619k0087j5025l321J0955J9128J8693R060n043
$$ -19308 -510 18876 28637 25230 9611 -10476 -25501 -28822 -17867 1261 19954 29014 23971
2013B3971j6287j9968j4062j338J1678J9226J7210Q338o081j6565j9539j3414
$$ 23971 7684 -12284 -26346 -27684 -16006 3220 20430 28768 22687 6122 -13417 -26831
2025b6831k11J2617J9088J7092O610p088j7278j8973j1812R54J2802J9655J6069
$$ -26831 -27042 -14425 4663 21755 28365 21277 3999 -14974 -26786 -25832 -13030 6625 22694
2038B2694N248p996j7737j8530j0678K334J3716J9244J5256L896r058j7757j8071
$$ 22694 27942 19946 2209 -16321 -26999 -24665 -10949 8295 23551 27447 18389 632 -17439
2051a7439r437K943J4541J9202J4224K912j0134j7920j7189q822M611J5133J8569
$$ -17439 -26876 -23933 -9392 9810 24034 26946 16812 -1108 -18297 -27119 -22508 -7375 11194
2064A1194J3056J762j0604j7867j7085p498N594J5857J8192J2345K39j1716j8049
$$ 11194 24250 26012 15408 -2459 -19544 -27042 -21448 -5591 12601 24946 25185 13469 -4580
2077d580j5689o368O682J5781J8159J1440j196j2058j8234j5273n018P647J6550
$$ -4580 -20269 -26637 -19955 -4174 13985 25425 24229 12171 -6063 -21336 -26354 -18707 -2157
2090b157J7351J0058k194j2991j7456j4878l408Q382J6706J7289Q705l203j3663
$$ -2157 15194 25252 23058 10067 -7389 -22267 -25675 -17293 -587 16702 25407 22204 8541
2103H541j7695j3542k394R288J6944J5910Q179m196j3964j7383j2678j809J0662
$$ 8541 -9154 -22696 -25090 -15802 1142 17052 25231 21035 7071 -10312 -22990 -24799 -14137
2116a4137J6478J5919O782m917j4738j7142j1420m68J0778J7013J4974O015o438
$$ -14137 2341 18260 25042 20125 5387 -11755 -23175 -23643 -12865 4148 19122 25137 18699
2129A8699j4919j6697j0570O36J1494J6994J4078M736o951j5324j6295r224J186
$$ 18699 3780 -12917 -23487 -22851 -11357 5637 19715 24451 17500 2176 -14119 -23343 -22157
2142b2157J2379J6669J3438L852p959j5622j5581q903K991J2370J6924J2460K686
$$ -22157 -9778 6891 20329 24181 16222 600 -14981 -23884 -20893 -8523 8401 20861 23547
2155B3547q675j5731j5095p666L635J3274J6617J1569J606r720j5697j4586o368
$$ 23547 14872 -859 -15954 -23620 -19985 -6711 9906 21475 23081 13361 -2336 -16922 -23290
2168b3290M553J3689J5633J1147N44j0134j5924j3819n785N948J3941J5547R792
$$ -23290 -18737 -5048 10585 21732 22276 12142 -3782 -17601 -23386 -17438 -3497 12050 21842
2181B1842o43j0643j5734j3254m506O411J4559J5138R100j709j1490j5720j2610
$$ 21842 21199 10556 -5178 -18432 -22938 -16527 -1968 13170 22270 20561 9071 -6649 -19259
2194a9259l250P587J4412J4884P903k601j2095j5404j1675k516Q027J4741J4759
$$ -19259 -22509 -14922 -510 14374 22277 19676 7581 -7823 -19498 -22014 -13987 754 15513
2207A5513P002m050j2430j5343j0722j377Q887J4926J3437O228m552j2704j5028
$$ 15513 22515 18465 6035 -9308 -20030 -21407 -12520 2406 15843 22071 17519 4815 -10213
2220a0213j0236l13R702J4756J3134N101n626j3141j4676r225Q27R968J4947J2391
$$ -10213 -20449 -20762 -11060 3696 16830 21931 16305 3164 -11512 -20737 -19910 -9942 5005 17396
2234A7396M132o117j3239j4524q630J762J0669J4801J1276L624o971j3280j4180
$$ 17396 21528 15411 2172 -12352 -20982 -19220 -8551 6250 17526 21150 14179 899 -13281
2247a3281p460K398J1363J4102J1283K283p759j4043j3198o504L380J1677J4426
$$ -13281 -20741 -18343 -6980 7122 18405 20688 12929 -1114 -14312 -20816 -17436 -5759 8667
2260H667J0153J153p991j3865j2964n711L853J2081J4288R145R58r078j4133j2089
$$ 8667 18820 19973 11982 -1883 -14847 -20558 -16705 -4624 9664 18809 19767 10689 -3444 -15533
2274a5533m809M724J2634J3503Q764n02r496j3776j1678l946N771J2595J3347
$$ -15533 -20342 -15618 -2984 10519 19283 18781 9285 -4491 -16169 -20115 -14344 -1749 11598
2287A1598P865j259j0101j3622j1253l385O881J2663J3163O963k182j0898j3165
$$ 11598 19463 18204 8103 -5519 -16772 -20157 -13276 -613 12550 19513 17331 6433 -6732
2300f732j0764j959P171J2957J2657O086l013j0733j3525r871j165P753J3125
$$ -6732 -17496 -19455 -12284 673 13330 19416 16403 5670 -7855 -17726 -18891 -11138 1987
2313A987J2070N228l631j1654j3102q811l53Q205J3068J1676M758m772j1759j3010
$$ 1987 14057 19285 15654 4000 -9102 -17913 -18266 -10061 3007 14683 19441 14669 2910 -10100
2327a0100q154O01Q714J3310J0898L708n379j1859j2872p030J047R834J2788J0480
$$ -10100 -18254 -17653 -8939 4371 15269 18977 13598 1739 -11133 -18163 -17116 -7282 5506 15986
2341A5986K933o345j2000j2451o480K308R624J2825R803K126o772j2118j2049
$$ 15986 18919 12574 574 -11877 -18357 -16049 -6425 6400 16203 18329 11557 -561 -12610
2354a2610n861K760J0459J2998R050R35p172j2396j1564n002L868J0571J2349
$$ -12610 -18471 -15711 -5252 7746 16796 17731 10559 -1837 -13401 -18403 -14535 -3964 8385
2367H385Q679J90p914j2604j0443m264M232J1060J2223P562n84q282j2315j0404
$$ 8385 17064 17254 9340 -3264 -13707 -17971 -13739 -2679 9544 17106 16522 8240 -4075 -14479
2381a4479l697N332J1193J1712P471j439r056j2067r915k622N752J1308J1703
$$ -14479 -18176 -12844 -1651 10061 17532 16093 7037 -5030 -14945 -17567 -11815 -507 11196
2394A1196O235k219r279j2134r276j613O204J1650J1129N598k924r864j1579q909
$$ 11196 17431 15212 5933 -6201 -15477 -17090 -10886 764 11893 17491 14567 4703 -6876 -15785
2408a5785r76O864J1549J0863M729l375r988j1885p740p24P572J1719J0286M202
$$ -15785 -16761 -9897 1652 12515 17244 13869 3881 -8004 -15744 -16468 -8896 2823 13109 17311
2422A7311m591j0090j1381p362N11P670J1597J0213K958m923j0436j1061o446
$$ 17311 12720 2630 -8751 -16113 -15602 -7932 3665 13878 16836 11913 1477 -9584 -16030
2435a6030R78Q332J1354R430K639n802j0413j0766o217J993Q797J1467Q749J754
$$ -16030 -15052 -6720 4634 14064 16703 10901 488 -10278 -16495 -14502 -5705 5762 14511 16265
2449A6265o073j0972j0366n289K567R424J1050Q155R76o447j0788j0089m696L313
$$ 16265 10192 -780 -11146 -16435 -13868 -4444 6606 14761 15737 9290 -1498 -11587 -16283 -12970
2463a2970R500J1137P354l0o900j0804r538l603M046R310J0796O824k81p632j0712
$$ -12970 -3470 7667 15021 14991 8091 -2713 -12251 -15854 -11808 -2498 8298 15122 14841 7209 -3503
2478c503r368k801M421R999J0254O410j443p835j0604q582k515N373R852J0121
$$ -3503 -12871 -15672 -11251 -1252 9002 15412 13969 6134 -4470 -13052 -15567 -10194 -342 9779
2492I779N710k071q125j0741q151j398N434J0151R620N165k597q324j0807p545
$$ 9779 15489 13418 5293 -5448 -13599 -14997 -9563 588 10208 15373 12776 4452 -6355 -13900
2506a3900q09N865J0413R404M129l004q746j0251p218m52P104R975R020L443l368
$$ -13900 -14709 -8844 1569 10973 15102 12098 3352 -6899 -14117 -14569 -7465 2510 11530 14973 11605
2521A1605r139j0303o480M56O840J0442Q568K714l930r568r875n596Q96P509J0229
$$ 11605 2466 -7837 -14317 -13861 -7021 3421 11989 14703 10773 1205 -8670 -14266 -13370 -5861 4368
2536D368Q199K265n033r557r583n265K107P678R957P671J659n412r684r124m611
$$ 4368 12567 14832 9799 242 -9341 -14606 -12499 -4821 5136 12807 14466 9054 -630 -9754 -14365
2551a4365K299P874J0157O986Q55n719r501q907m011L089Q168R674O812J21o282
$$ -14365 -12066 -4192 5965 12951 13806 8087 -1414 -10321 -14332 -11243 -3075 6599 13411 13532 7250
2566G250r777q365l482L720Q202R750O216n35o637r743p833k811M266Q520R412
$$ 7250 -2527 -10892 -14374 -10654 -2452 7298 13514 12979 6342 -3401 -11234 -14045 -9779 -1259 8153
2581H153N431j189o880r693p632k002M868Q852Q857M747j685p027r538p415j263
$$ 8153 13584 12395 5515 -4178 -11810 -13812 -8944 -92 8765 13512 11827 4800 -4738 -12153 -13416
2596a3416N132R049Q728M264k357p679r530o489q58N414R289Q275L593k517q058
$$ -13416 -8284 765 9493 13757 11400 3721 -5809 -12298 -13156 -7742 1547 9822 13415 10898 2840
2611B840r253o515K31N911R271P930K809l239p865r246n503K34O476R023P705
$$ 2840 -6413 -12928 -12697 -6786 2485 10415 13224 9985 2120 -7126 -12629 -12395 -5919 3104 10809
2626A0809K315l675q197q747n561J285O678R160P254J525m001q496q458m905J550
$$ 10809 13124 9449 1252 -7495 -13056 -11771 -5093 4067 11321 12846 8845 349 -8109 -13014 -11464
2641a1464O872R188O808J286m615q598q259l939J964P235Q777O311P22n163q117
$$ -11464 -4592 4596 11404 12690 8075 -523 -8782 -12721 -10757 -3522 5255 11566 12288 7125 -992
2656i92q229l519K718P426Q564N872Q5n586q380p735k816L242P511Q395N550m94
$$ -992 -9221 -12740 -10022 -2596 5968 11840 11925 6339 -2041 -9776 -12592 -9350 -1839 6556 12106 11612
2672A1612n959q632o879k608L542Q118Q015M927j093o146q915o324k045M195Q016
$$ 11612 5653 -2979 -9858 -12466 -8924 -806 7209 12136 11043 4897 -4018 -10342 -12387 -8192 -176
2687a76Q005M224j525o137q793o359r89M301P857P602M123j838p145q171o186
$$ -176 7829 12053 10528 4391 -4402 -10761 -11750 -7449 408 8010 12133 10295 3150 -5021 -11207
2702a1207m31M681Q457P218L452k423p319q057n432k38N094Q262P074K604k719
$$ -11207 -11638 -6957 1500 8718 12170 9747 2428 -5629 -11061 -11299 -6205 2057 9131 11735 9016
2717I016p183q225m864N63N550P931O637K230l512p178p791m583R04O027P757
$$ 9016 1833 -6392 -11256 -10693 -5143 2788 9425 11655 8143 965 -6826 -11409 -10505 -4478 3279
2732C279O516J876l838p605p471m231J594N840Q414O015Q80m018p904p194l638
$$ 3279 9795 11671 7833 228 -7243 -11474 -9880 -4040 4374 10389 11269 7251 -653 -7847 -11485
2747a1485J828O567P732N741L23m572p353p113l229K431O739P687N332J16m869
$$ -11485 -9657 -3090 4642 10383 10706 6134 -1219 -8332 -11561 -9130 -2391 5296 10628 10744 5875
2762E875p683p127k459K828O822P761M600l35n393p494o536j929L216O913P665
$$ 5875 -1808 -8935 -11394 -8566 -1744 6017 10617 10282 4889 -2605 -9141 -11070 -7854 -941 6724
2777F724M250q69n726p675o090j637L732O919P476L599j037o034p502n753r88
$$ 6724 10974 10105 4379 -3296 -9386 -11023 -7291 -372 7104 10703 9666 3632 -3870 -9623 -10611
2792a0611L908P046P035L392j752n909p619n526k66M174P202O925K885k239o187
$$ -10611 -6703 343 7378 10770 9018 3109 -4510 -10036 -10302 -6128 1074 7999 10884 8645 2458
2807B458p415m958k91M797P343O126K619k631o409p337m276O2N009P361O165J737
$$ 2458 -4957 -9915 -10206 -5409 1934 8060 10679 8048 1639 -5698 -9974 -9912 -4903 2458 8623 10360
2823A0360k906o466p125m163R81N191P116N911J543l440o786o739l783J075N575
$$ 10360 7454 988 -6137 -10300 -9319 -4128 2988 8899 10442 7002 216 -6523 -10306 -9231 -3656
2838c656P170N610J218m011o827o664l292J978N764O737N518L94m242o555o525
$$ -3656 3514 9124 10342 6331 -496 -7160 -10452 -8474 -2710 4027 9545 9939 5697 -858 -7383
2853g383k837K103O020P022M887k63m632o686n530k813K513O170O488M462l56
$$ -7383 -10220 -8117 -2097 4925 9812 9549 4917 -1769 -7299 -10112 -7599 -1429 5059 9521 9165
2868I165m662o749n818j912K922O249O437M195q78n004p032n211j616L023O446
$$ 9165 4503 -2246 -8064 -9976 -7054 -805 5632 9827 8949 3945 -3087 -8298 -9914 -6891 -445
2883d45O619L740j197n487o739m987j274L431O551O434L110j492n196p049m953
$$ -445 6174 9914 8717 3230 -3509 -8496 -9770 -6339 212 6646 9756 8264 3068 -3981 -8934
2898h934m00L639O459O163K858k103n350p031m311k00M273O395N951K357k384
$$ -8934 -9334 -5695 764 6927 9785 7682 2332 -4699 -9010 -9210 -4937 1458 7409 9766 7382
2913G382n679o488m068q6M408O366N832K003k816n790o545l624N89M493O692N208
$$ 7382 1703 -4785 -8853 -8939 -4531 1835 7667 9670 6854 1064 -5481 -9105 -8516 -4023 2669 7877
2929G877J625l238o047n893l304P44M897O409N195R02l467o212n695l136J438
$$ 7877 9502 6264 217 -5676 -8980 -8236 -3339 3070 8265 9167 5700 -512 -6207 -9343 -7905
2944g905N218O404M569P41l699o097n663k539J502N182O414M432K28m166o055
$$ -7905 -2687 3717 8286 9027 5328 -769 -6432 -8971 -7469 -2287 4127 8559 8787 4621 -1434
2959a434n349k355K148N556N861M195k54m236o033n187k001K695N521O101L361
$$ -1434 -6783 -9138 -6990 -1434 4427 8622 8368 4132 -1901 -7088 -9089 -6394 -873 5228 8589
2974H589n96m153o356m911j565K842N851N610L512j074m741n843m850j088L151
$$ 8589 7993 3840 -2516 -7427 -8992 -6150 -299 5311 8823 7749 3008 -2835 -7685 -8773 -5622
2989e622N931N418K800r27m878o300m227n34L200N895N348K600j567n018o259
$$ -5622 309 5727 8527 7600 2722 -3578 -7805 -8339 -5139 756 6104 8704 7137 2119 -4140
3004d140l666l81L582O087N275J943j846n227n855l659m6L825O048M880J816k571
$$ -4140 -7806 -8187 -4605 1482 6757 8700 6854 1627 -4228 -7887 -7933 -4108 1940 6820 8636 6065
3020F065m994n714l566O83M072N763M683J313k646n153n586k981O97M528N734
$$ 6065 1071 -4643 -8209 -7526 -3454 2309 6992 8305 5659 506 -5080 -8061 -7364 -2836 2898
3035B898M502N08k721n349n408k722J230M575N664M180O14k985n612n509k158
$$ 2898 7400 7908 5187 -162 -5570 -8292 -7062 -2487 3177 7357 7971 4986 -626 -6135 -8293
3050h293J915M573N723L433P54l718n701m838k212K271M761N541L171J67l842
$$ -8293 -6378 -1805 3918 7351 8105 4387 -1314 -6152 -8364 -6093 -1332 4209 7380 7547 3705
3065C705n460m713j758K404M712N689L073k02m194n598m278j329K552N076N361
$$ 3705 -1755 -6468 -8226 -5822 -1110 4579 7652 7450 3256 -2342 -6620 -7949 -5397 -321 5040
3080E040K775m89m527n530m132q51K760N052M962K924j448m379n273m006n67L126
$$ 5040 7815 7326 2799 -2731 -6863 -7714 -4954 98 5060 7984 6536 2157 -3116 -7122 -7689 -4563
3096d563N533M849J952j547m445n439l620j12L312N155M611K042j934m529n424
$$ -4563 970 5819 7771 6224 1779 -3660 -7280 -7392 -4080 1075 5686 7728 5794 1265 -4159
3111d159l062r5L740N112M875J060j870m896n178k938N26L832N147M127J282k585
$$ -4159 -7221 -7316 -3576 1536 6411 7471 5601 705 -4473 -7411 -6885 -3053 2094 6221 7503 4918
3127D918m489n171k733R09M051N177L956O60k626m841m660k480Q42M361N190L642
$$ 4918 429 -4742 -7475 -6566 -2515 2662 6618 7278 4652 -189 -4849 -7329 -6487 -2126 3064 6706
3143F706P52l159m940m606k007J281M172N345L178K31l049n228m294j644J610
$$ 6706 7458 4299 -641 -5247 -7254 -5973 -1801 3544 6722 6953 3904 -1324 -5618 -7262 -5652
3158e652M459M839L257l1l558m889m201j470K170M399N024K626m91l490m909m197
$$ -5652 -1193 3646 6903 6872 3314 -1575 -5776 -7246 -5076 -677 4347 6973 6482 2992 -1917 -6114
3174f114j044K370M549M782K394p90l644m782m024m21K414M508M621K292j395
$$ -6114 -7158 -4788 -239 4543 6937 6147 2503 -2279 -6303 -6724 -4310 198 4819 7111 5716
3189E716l838m762l383m98K683M503M577K047j535l837m679l622J06L101M106
$$ 5716 1878 -2884 -6267 -6765 -4082 421 4998 7045 5510 1673 -3006 -6628 -6522 -3421 685
3204F85M568J642j839l908m793l038K76L252M723L980J164j762m052n043k432
$$ 685 5253 6895 5056 1148 -3645 -6683 -6407 -3155 1568 5548 6712 4950 898 -4145 -6577
3219f577M26L131M902L842J124k033m557m322k579N39L804M692L481P58k479m269
$$ -6577 -6151 -3020 1882 5724 6848 4815 258 -4064 -6643 -6104 -2300 2392 5873 6631 4152 -117
3235a17m538j917J046L876M259L410L61k588m685l955k014J413L704M771L047
$$ -117 -4655 -6572 -5526 -1650 2609 6019 6380 3792 -893 -4848 -6862 -5449 -1745 3026 6073
3250F073M37l129m497l958j566J790M096M214K808n9l273m458l860j202J986M109
$$ 6073 6510 3381 -1116 -5074 -6640 -4850 -754 3460 6268 6209 2936 -1522 -5382 -6584 -4598 -489
3266d89M244K672n59l147m766l516j113K028M417M314K337q93l152m655l421q18
$$ -489 3755 6427 5868 2721 -2045 -5561 -6674 -4646 -229 4085 6422 5529 2377 -2278 -5699 -6517
3282f517K415M269M196K122q76l604m491l271m65K431M206M048K079j277l717
$$ -6517 -4102 167 4363 6485 5609 2005 -2486 -5757 -6222 -3791 415 4463 6542 5265 1548
3297A548m613l086n6K700M190M156J694j671l767m536k697K04K904M373L839J259
$$ 1548 -3065 -6151 -6207 -3507 683 4839 6533 4862 1095 -3441 -6138 -5934 -3030 1343 5182 6441
3313F441j615m073m518k226K63L049M505L411J036k125m053m180k094P51L509
$$ 6441 4826 753 -3765 -5991 -5728 -2679 1826 5237 6273 4148 95 -4085 -6179 -5428 -1919
3328a919M084K978J195k461l785m113k049R12L327M360L223K63k543m049l793
$$ -1919 2165 5143 6338 3877 92 -4021 -6070 -5158 -1831 2529 5752 6015 3472 -577 -4370
3343d370j579Q22L662M228K820N26k659m223l793j568J441L991L822K550K86l016
$$ -4370 -5949 -5127 -1465 2763 5583 6109 3450 -773 -4566 -6134 -4693 -702 3120 5670 5956 2940
3359B940m087l891j191J583L797M041K520q1l006m237l330j000J823L801M106
$$ 2940 -1147 -5038 -6229 -4646 -849 3192 5712 5631 2625 -1612 -4942 -5942 -4119 -318 3788
3374C788K162n32l111m059l360r07K244L805M260J506o31l128m308k913o03K518
$$ 3788 5950 5418 2307 -1752 -5112 -6019 -3775 30 4290 5796 5165 2037 -2271 -5184 -5787 -3269
3390c269L559L882J599o62l303m694k695Q0K165M217L596J128q96l564m020k670
$$ -3269 290 4172 5771 5109 1806 -2888 -5583 -5503 -3338 879 4475 5603 4707 1143 -2877 -5547
3406e547k07K940L892L448J284j649l311m048k375J52L022L881L429R07j729l913
$$ -5547 -5754 -2814 1078 4526 5810 4161 850 -3198 -5573 -5421 -2399 1482 4911 5818 4089 176
3422A76l531k421O91L197L578L328N65j880l858l454k007P68L111M046K857N12
$$ 176 -3355 -5776 -5085 -1888 1690 5018 5583 3703 -155 -3609 -5616 -4848 -1737 2309 5166 5678
3438E678k214l792l727j734J171L116L889K886Q8k246l753l518j786J238L641
$$ 5678 3464 -328 -4055 -5789 -4618 -1502 2387 5273 5361 3115 -638 -4156 -5942 -4704 -1063
3453a063L626K744J06k722m021k966j349J704L104L974K451j79l075l609l112
$$ -1063 2563 5307 5413 2691 -1330 -4296 -5645 -3941 -837 3137 5588 5409 2334 -1275 -4387
3468d387j366J583L988L672K272p97k683l956k970p85J641L785L599J846p51k982
$$ -4387 -5753 -4170 -182 3490 5762 4965 2282 -1674 -4644 -5429 -3788 -3 3596 5442 4691 1709
3484A709l669k941k45J705L664L635J672q54l050m151k510k61K023M012L419J357
$$ 1709 -1960 -4901 -5146 -3441 223 3858 5530 4676 1626 -2525 -5035 -5296 -3273 739 4158 5515
3500E515r96l489l869k534J96K320L781L446J074j247l324l888k238J85K487L711
$$ 5515 4519 1030 -2839 -5373 -5177 -2857 924 4370 5444 4197 873 -3015 -5253 -5068 -2581 1130
3516A130L319J120j914l329l778j721J55L041L510K962J000j746l754l460j893
$$ 1130 4449 5569 3655 326 -3452 -5173 -5018 -1977 1533 4495 5495 3749 -5 -3465 -5358
3531e358O96K878L790K482P84k146l190l790j514J128K523M208K758P6k308l736
$$ -5358 -4662 -1784 2006 4488 5272 3126 -64 -3854 -5368 -4240 -1717 2491 5249 5325 3017 -719
3547g19l454j211J108L225L691K264R1k317l403l449j284J269L429L949K020k95
$$ -719 -4173 -5384 -4276 -1051 2640 4904 4995 2678 -725 -4174 -5458 -4189 -760 3189 5209 4914
3563D914k503l730l026j164J699L521L426K016l33k715l786k674r74J709L804
$$ 4914 2411 -1319 -4345 -5509 -3810 -289 3137 5153 4820 2105 -1681 -4355 -5329 -3620 184
3578A84L147J744l54k957l818k747n86K289L521L117J622r27k981l511k566j91
$$ 184 3331 5075 4721 1764 -2054 -4801 -5387 -3098 423 3540 5162 4235 1254 -2257 -4823 -5014
3594e014K046L667L373J291j236l383l326k522QK363L568L355J349j659l249l570
$$ -5014 -2968 699 4072 5363 4127 744 -2582 -5104 -5096 -2733 835 4190 5539 3880 631 -2939
3610b939k093R9K695L581L163P63j546l315l483j947O83K467L534K841P53j672
$$ -2939 -5032 -4933 -2238 1343 4506 5269 3723 408 -3075 -5022 -4339 -1872 1662 4503 5256 3584
3626C584l503l293j854O52K742L670K597M52j618l887l201j737P97L371L432K545
$$ 3584 81 -3212 -5066 -4414 -1672 1998 4595 5047 3429 -458 -3659 -5396 -4599 -1228 2204 4749
3642D749L30k276l581l020j371J125L070L611K184R6k260l452l090j383J740K728
$$ 4749 5079 2803 -778 -3798 -5169 -4044 -974 2637 4821 4917 2657 -795 -3885 -5268 -3528 -800
3658h00L532K396m43k426l406l036j014J604L190L605J754k86k852l365k817r41
$$ -800 2732 5128 4685 2259 -1147 -4183 -5197 -3593 -403 3202 4956 4670 1818 -1547 -4364 -5305
3674e305J825L341L527J717q34k797l464k459n50J596L567L458J570p51k971l430
$$ -5305 -3480 -139 3388 5105 4271 1474 -1990 -4449 -4999 -3403 164 3622 5192 4441 1470 -1960
3690a960k606k94K140L486K879J420r53l137l395k427l78K793L037L490Q56r72
$$ -1960 -4566 -4860 -2720 766 3645 5065 4112 975 -2420 -4847 -5225 -2432 605 4095 4951 3979
3706C979k962l751k185J97K427L357L153R46j351l419l428j982L79K442L890K533
$$ 3979 1017 -2734 -4919 -4722 -2295 1062 4215 5161 3810 391 -3037 -5019 -4640 -2198 1692 4225
3722D225Q37j653l148l299k075O72K630L400L001M78j909l179l497j403O65K903
$$ 4225 5062 3409 261 -3038 -5113 -4441 -1811 1589 4590 5068 3159 -20 -3517 -4920 -4255 -1352
3738a352L495K418O15k090l728k934j575J063K802L691K161K82k266l408l028
$$ -1352 2143 4561 5176 3086 -642 -3576 -5151 -4088 -1286 2405 4566 4848 2582 -826 -3854
3753c854j143J119L151L268K260k52k286l293l138q60J181L463L254K016m44k370
$$ -3854 -4997 -3878 -727 2541 4801 4549 2263 -1030 -4168 -5028 -3847 -384 2870 4886 4442 2072
3769B072l429k726q56J368L477L472J712p31k578l276k756p46J924K973L543J447
$$ 2072 -1357 -4083 -4939 -3571 -94 3378 5090 4359 1781 -1495 -4251 -4997 -3073 -100 3443 4890
3785D890p09k544l564k638k73K078L376K773J592j010k573l419k566k25K033L545
$$ 4890 4181 1637 -1927 -4565 -4838 -2760 616 3389 4981 3971 1398 -2021 -4587 -4812 -2779 766
3801G66K880J288j133l014l337k150j62K509L315K798J144j121l094l408k247
$$ 766 3646 4934 3801 787 -2550 -4700 -4862 -2353 962 3760 4904 3783 689 -2719 -4966
3816d966N89K198L289K914Q98j429l283l251j760N44K379L500K659M63j722l381
$$ -4966 -4377 -2179 1110 4024 4922 3493 210 -3041 -4801 -4257 -1878 1622 4281 4744 3022 -359
3832c59k977j628Q87K284L674K630L03j573l532l215j621J180L019K992K541J88
$$ -359 -3336 -4964 -4077 -1793 1881 4511 4814 3241 -291 -3506 -5127 -3947 -928 2064 4605 4793
3848D793k016l550k945j023P51K980L441K293j18k262l382k825r03R49L190L269
$$ 4793 2777 -773 -3718 -4741 -3990 -1010 2431 4724 4606 2344 -1038 -3863 -4766 -3817 -627 2642
3864B642J817L2k141l643k671q28J400L003L183K112o65k222l736k447o46J686
$$ 2642 4459 4491 2350 -1293 -3964 -4792 -3392 -389 2794 4906 4241 2019 -1717 -4164 -4810 -3124
3880c124L390K844J623o64k356l520k693k22J488L688K855J262k66k946l251k393
$$ -3124 266 3110 4733 4069 1713 -1807 -4500 -4722 -3234 454 3309 4571 4305 1359 -1892 -4285
3896d285l44J824L052L178J599j588k613l222k112j37J994L339K973J257j062
$$ -4285 -4629 -2805 247 3425 5024 3436 823 -2399 -4511 -4648 -2654 685 3658 4915 3853
3911C853l139l319j826M3J934L258K973J117j378l029l350j926K17K500L431K595
$$ 3853 714 -2605 -4431 -4388 -2454 804 3777 4894 3516 487 -2863 -4789 -4572 -2072 1359 3954
3927C954Q86j752k983l029k034O02K558L643K596L63j719l192l102j461O97K562
$$ 3954 4840 3088 105 -2924 -4958 -4356 -1798 1845 4441 4804 3085 -107 -3209 -4670 -3973 -1411
3943a411L426K324L21j758l502l024j305Q30K972L194K317M43k075l452k858j295
$$ -1411 2015 4339 4660 2902 -600 -3624 -4929 -4099 -1127 2067 4384 4827 2752 -700 -3558 -4853
3959d853Q58L048L333K133k20j916l601k743p58J000L254L104K196j29k473l554
$$ -4853 -3995 -947 2386 4519 4299 2383 -1218 -3961 -4719 -3719 -465 2639 4835 4706 2233 -1321
3975a321k824o82J516K836L295J904m98k244l812k448p38J848L098L186J714q75
$$ -1321 -4145 -4827 -3311 -475 2820 4724 4226 1982 -1830 -4278 -5016 -3168 -70 3116 4830 3955
3991C955k364l617k326k63J703L197L111J425j045k909k916k305k49J845L518
$$ 3955 1591 -2026 -4352 -4615 -2912 285 3396 4821 3776 867 -2049 -4354 -4603 -2758 760
4006G60K805J385j230k850l460k077k0K360L119L093J075j283l309l288j700J32
$$ 760 3565 4950 3720 870 -2590 -4667 -4687 -2327 792 3885 4960 3677 368 -2920 -4620 -4488
4022d488K445L280K767Q03j511k925l229j844M64K465L188K656N56j446l024l068
$$ -4488 -2043 1237 4004 4807 3296 371 -2858 -4702 -4238 -1773 1415 4071 4627 3181 157 -2911
4038b911j650N27K383L339K438M30j670l248l004j269P71K295L505K603j37j349
$$ -2911 -4561 -4034 -1651 1688 4126 4556 2886 -362 -3366 -4635 -3864 -1569 1936 4539 4402 3053
4054C053l611k882j382J034K634L562K124J86k192l457k736j122Q92L227K929
$$ 3053 -558 -3440 -4822 -3788 -1154 2408 4532 4718 2526 -931 -3667 -4789 -3897 -670 2259
4069B259K305k24k100l166k864r02J344L101K988J850m56k126l040k915p83J344
$$ 2259 4564 4340 2240 -926 -3790 -4692 -3348 -247 2741 4591 4135 2009 -1031 -3946 -4729 -3385
4085c385L389K814J747k88k766l310k507k12J522L203K891J378l92k737l168k475
$$ -3385 4 2818 4565 4277 1511 -1799 -4306 -4518 -2996 207 3098 4476 4084 1347 -1821 -4296
4101d296l48K023L134K901J145m42k886l513k142J2J886L187K671J342j019k949
$$ -4296 -4644 -2621 513 3414 4559 4117 1231 -2282 -4424 -4412 -2526 661 3332 4674 3655 706
4117G06l018k238J42K100L242K563Q63q11l069l039j848L87K193L245K558O58
$$ 706 -2312 -4550 -4408 -2308 934 3497 4360 3549 480 -2559 -4407 -4020 -1827 1418 3976 4634
4133D634j616k806k951j850P83J956L172K586O89j518l125k936j637N41K715K808
$$ 4634 3018 212 -2739 -4589 -3806 -1850 1322 3908 4597 3079 -46 -2982 -4619 -4078 -1363 1445
4149A445K447J095k514k734l085j372N54L068L173K273L64k080l097k825j100
$$ 1445 3892 4987 2473 -261 -3346 -4718 -4164 -1096 2077 4350 4714 2634 -463 -3288 -4388
4164d388O79K924L194K029J0k052l318k565j241J132K983L308J860j89k204l346
$$ -4388 -3709 -785 2409 4438 4448 2396 -922 -3487 -4728 -3596 -613 2695 4555 4366 2162 -1184
4180a184k656o11J238K968K878J714l23k278l222k380o88J407K869L246J442m08
$$ -1184 -3840 -4451 -3213 -245 2633 4347 4024 1746 -1476 -3856 -4544 -3137 -268 2978 4420 4012
4196D012k513k940k587l77J688K970K928J397q71k465l464j974j83J692K993K989
$$ 4012 1499 -1441 -4028 -4405 -2717 253 3181 4578 3707 1242 -2222 -4196 -4379 -2687 306 3295
4212C295J159q84k716l126j928j31K138K880L039O89j200k581l094j940L04J906
$$ 3295 4454 3570 854 -2272 -4200 -4331 -2193 687 3726 4415 3215 634 -2460 -4400 -4096 -2190
4228b190L479K608M54j151k702l377j410K98J966L240K783O14j725k961k592j535
$$ -2190 1289 3897 4351 3200 498 -2879 -4289 -3991 -2025 1215 3998 4612 2887 -74 -2666 -4201
4244d201L37K334K939K678M25j603k856k949j533Q00K545K954K223N8j765k617
$$ -4201 -3864 -1530 1409 4087 4512 2909 53 -2896 -4429 -3629 -1084 1870 4093 4151 2386 -231
4260b31l034j055R25K303L121K073K47k023k745l018r40R28K641L146J774j10
$$ -231 -3265 -4320 -3395 -1092 2029 4102 4349 2326 -419 -3437 -4377 -3449 -808 2338 4112 4002
4276D002j827l156k639o43J235K424L075J828l25k197l263k201q26J558K761L010
$$ 4002 2175 -981 -3620 -4263 -3028 -604 2471 4299 3974 1777 -1486 -3687 -4513 -2955 -194 2816
4292B816J465l76k468k949k503l65J573L110K778J128o26k376l089k010j71J535
$$ 2816 4281 3905 1437 -1512 -4015 -4380 -2807 303 3081 4209 3583 1207 -1882 -3892 -4063 -2528
4308b528K708L049J388j108k444l249j705j83J877K711K727J112j021k591k958
$$ -2528 180 3229 4617 3509 1065 -2184 -3889 -4072 -2195 516 3243 4355 3334 743 -2215
4323b215j880K46J591L487K292O73j279k598k628j751J59J999L081K205J057j332
$$ -2215 -4095 -3849 -2258 1229 3521 4194 2915 317 -2311 -4062 -3903 -1904 1177 3382 4439 3107
4339C107k959k989j499K97K416K852K415M04j355l006k679j200L54K426L168K428
$$ 3107 148 -2841 -4340 -4043 -1627 1225 3640 4044 2689 -317 -2996 -4196 -3842 -1416 1752 4180
4355D180J24j590l247k594j395J249K386K799K223J33j860k944k493j485J131
$$ 4180 4304 2714 -533 -3127 -4522 -3273 -887 1912 4135 4268 2408 -536 -3029 -4514 -3383
4370c383K436K984J912L5k043k774k515j125J201K442L151J945m50j930k685k571
$$ -3383 -947 2037 3949 3984 1941 -833 -3348 -4473 -3272 -830 2321 4266 3816 1886 -799 -3370
4386c370q81J576K610K548J647l43k270l026k097o42J568K870K495J504l64k334
$$ -3370 -4251 -2675 -65 2483 4130 3787 1517 -1509 -3606 -4248 -2680 190 2685 4189 3825 1491
4402A491l069k023m23J443K515K804J462o21k545k795j930l13J795K500K890J083
$$ 1491 -1578 -3601 -4024 -2581 -66 2738 4200 3579 1034 -1761 -3691 -4004 -2209 291 3181 4264
4418D264r80k572k751j938o5J957K923K355J088j010k651k689j891K23J808K917
$$ 4264 3284 712 -2039 -3977 -4042 -2085 838 3193 4281 3271 620 -2069 -3960 -3737 -1929 988
4434I88K297P64j207k421l058j451N38K019K904K027O30j495k428k870j455O06
$$ 988 3285 4049 2842 421 -2637 -4088 -3550 -1531 1373 3400 4030 2535 107 -2763 -4218 -3612
4450c612K173K833K182N79j637k713k485j573Q23K256K861K064L24j846k452k883
$$ -3612 -1439 1394 3576 4155 2518 -195 -2680 -4253 -3430 -1174 1687 3751 4075 2229 -223 -3106
4466c106j058J125K125K772J920J99j977k516k640j059J181K372K797J863R1j924
$$ -3106 -4164 -3039 -914 1858 3778 3977 2000 -516 -3156 -4215 -3034 -662 2135 3998 4089 2165
4482B165l228k346p49J254K174L063J840o02j874k999k156p78J479K550K713J508
$$ 2165 -1063 -3409 -4158 -2904 -730 2333 4173 3571 1697 -1302 -3458 -4236 -2757 -207 2506 4014
4498D014k33k259k886k240m73J461K817K525J452q10k113k734k065l29J320K862
$$ 4014 3781 1522 -1364 -3604 -4077 -2616 201 2726 4178 3368 1255 -1479 -3544 -3873 -2553 309
4514C09K544J266n45k739k600k041j07J761K757K321J154p44k613k658j940j15
$$ 309 2853 4119 3574 835 -1765 -3806 -3913 -2152 605 2926 4080 3336 723 -1935 -3875 -3990
4530c990K006K793K125J054j193k176k933j348J17J842K567K553M53r73k628k769
$$ -3990 -1984 809 2934 3988 2795 619 -2314 -3662 -3545 -1703 864 3417 3870 2897 269 -2500
4546b500j542L64K256K833K056N13j529k371k543j729R13K102K694J840N99j383
$$ -2500 -4042 -3678 -1422 1411 3467 3980 2451 80 -2463 -4192 -3279 -1177 1517 3357 3956 2573
4562B573l028k147j399N10K396K998J668K42j536k474k681r11O36K131K827J707
$$ 2573 -455 -2602 -4001 -3491 -1095 1903 3571 3813 2277 -197 -2878 -3789 -3153 -1022 1805 3512
4578C512K32j944k482k423o84R83K127K593J889P1k007k844k320p18J271K308
$$ 3512 3744 1800 -682 -3105 -3789 -2806 -679 1914 3803 3874 1867 -977 -3297 -4015 -2744 -436
4594d36K744J386j50j853k749k227q27J703K213K515J581m62j992k761k151m51
$$ -436 2308 3694 3544 1691 -1058 -3285 -4112 -2409 -196 2319 3900 3438 1446 -1315 -3466 -3917
4610c917J492K442K632J333n22k474k552j997l45J656K421K652R35n98k195k428
$$ -3917 -2425 17 2649 3982 3460 986 -1566 -3563 -3908 -2252 169 2821 3756 3158 963 -1465
4626a465j999k93J420K830K449Q34q93k210k645j606q6J787K826J926J052j152
$$ -1465 -3464 -3757 -2337 493 2942 3776 2883 673 -1972 -3578 -3664 -1877 949 2875 3927 2775
4642B775k380k530j561K52J713K904K024P50j281k451k594j669M93K003K901K035
$$ 2775 395 -2135 -3696 -3444 -1731 1173 3197 3947 2666 215 -2379 -4048 -3555 -1552 1349 3384
4658C384M68j478k246k765j273O20K218K524K019N24j832k405k273j322Q49K069
$$ 3384 3852 2374 128 -2637 -3910 -3290 -1072 1452 3471 3995 2163 -242 -2515 -3837 -2988 -919
4674i19K583J866K06j537k475k621r72R23K419K644J561j15j679k527k200p81
$$ -919 1664 3530 3736 2199 -276 -2897 -3869 -2946 -527 2117 3678 3563 1884 -643 -2843 -3624
4690c624O25K345K459J748j08j697k459k217r25J300K308K449J295k81j690k649
$$ -3624 -2999 -654 1805 3553 3445 1748 -711 -2928 -3853 -2553 -245 2204 3499 3218 1528 -1121
4706a121k059m62J041K469K592J110l14j911k473k294j63J420K488K197Q99k26
$$ -1121 -3180 -3642 -2601 -132 2460 3570 3256 1345 -1128 -3422 -3585 -2165 323 2520 3419 3193
4722C193k192k464j737n48J673K253K456J240q28j786l015j631p5J473K713J921
$$ 3193 1001 -1463 -3200 -3748 -2075 178 2634 3874 3046 1260 -1755 -3386 -3461 -1988 725 2646
4738B646Q96q05k334k058j766q8J807K541K017Q33j233j876k487j715J36K016
$$ 2646 3542 2737 403 -1655 -3421 -3509 -1702 839 2856 3689 2456 580 -1907 -3622 -3486 -1470
4754a470K504J859Q36j252k270k667j099K22K148K505J742O68j388k384k323j231
$$ -1470 1034 2893 3729 2477 207 -2460 -3559 -3337 -1189 1316 3058 3726 2338 -46 -2369 -3600
4770c600N40K095K475J742J31j613k035k184j054N59K213K369J667K70j817k252
$$ -3600 -3060 -965 1510 3252 3383 1770 -265 -2449 -3503 -2944 -731 1638 3305 3575 1758 -494
4786d94k392p70J098J796K578J428J36j602k354k342o25J014J999K548J234M9
$$ -494 -2886 -3656 -2558 -762 1816 3244 3380 1778 -576 -2918 -3543 -2529 -530 2018 3252 3301
4802C301j609k583k101k96R09J857K529J451l61j667k296k158n11J431K270J966
$$ 3301 1692 -891 -2992 -3288 -2379 -522 2007 3458 3097 1430 -866 -3024 -3535 -2104 166 2132
4818B132J553o57k087j972j981l46J196K151K629Q27n59k161k277j844m2J632
$$ 2132 3685 3028 941 -1031 -3012 -3358 -2162 -11 2618 3445 2886 725 -1552 -3396 -3438 -1806
4834a806K352K006Q08o42j981k361j664J88J444K515J666J096r72k299k192j525
$$ -1806 546 2552 3360 2718 737 -1624 -3288 -3100 -1656 859 2525 3621 2649 350 -1842 -3367
4850c367J13J757K245K447K20r29k480k012j265L67J760K384J765L54q43k533
$$ -3367 -3254 -1497 748 3195 3415 2486 6 -2006 -3271 -2904 -1144 1240 3005 3359 2516 -17
4866a7k249j217M56J925K397J642L39j262j919k541r84P52J549K534J469L47j207
$$ -17 -2266 -3483 -3027 -1102 1295 2937 3276 2014 95 -2446 -3430 -2678 -1129 1405 2874 3221 2014
4883B014k119k360q95P32K013K144J958r6j804k112j844j106J061J997K254J329
$$ 2014 -105 -2465 -3360 -2628 -615 1529 3487 3391 1587 -525 -2369 -3475 -2414 -417 1837 3166
4899C166J82j784k379j886m58O46K160K571J067k22j537k327j977n90Q53K445
$$ 3166 3348 1564 -815 -2701 -3159 -2513 -353 2218 3285 3063 1526 -801 -2778 -3368 -2515 -70
4915g0K317J063l34j940k363j530m48J167K338J917J335p11j945j903j846k45
$$ -70 2247 3310 2976 1036 -1327 -2857 -3305 -2138 200 2117 3452 2741 796 -1107 -2953 -3198
4931c198J160K177K178J156q68j825k260j481n2J205K315K284O87r10k036k145
$$ -3198 -2038 139 2317 3473 2605 780 -1480 -2961 -3013 -1808 507 2791 3478 2568 532 -1613
4947a613j477j0J583K364J804Q67p68k236k598j231M43J392K494J658O36j075
$$ -1613 -3090 -3100 -1517 847 2651 3518 2750 514 -2084 -3315 -2872 -1480 1014 2672 3308 2233
4963B233k007k130j139K97J442K278J702N81j197k182k057j128M76J672K216J417
$$ 2233 226 -1904 -3043 -2746 -1304 974 2676 3257 2060 -122 -2179 -3307 -2831 -1159 1057 2474
4979B474O29j204k114j967j018N71J842K272J684q2j085k545j976r18P26J935
$$ 2474 3103 1899 -215 -2182 -3200 -2629 -787 1485 3169 3087 2002 -543 -2519 -3437 -2711 -776
4995g76K296J451j34j128k529j692q95P43J998K333J525n4j421k453j857o80Q14
$$ -776 1520 2971 2837 1709 -820 -2512 -3407 -2664 -666 1667 3192 3138 1717 -736 -2593 -3273 -2459
5012b459K323J905J598m48j751j994j789p16J261J915K238Q40j65j790k177j610
$$ -2459 -136 1769 3367 2919 1168 -826 -2615 -3331 -2070 -155 2083 2923 2758 968 -1209 -2819
5028b819k43J109J913K272O94n35j443k067j637m12J391K272J765R47o33j934
$$ -2819 -3062 -1953 -40 2232 2926 2391 948 -1119 -2756 -3168 -1777 495 2260 3207 2574 640
5044F40k039j334KJ181K051J968N40n99j798k311j360r8J758K076J609R79q91
$$ 640 -1399 -2733 -2731 -1550 501 2469 3009 2410 612 -1699 -3059 -3157 -1399 677 2286 3265 2374
5061B374k267k002j107M20J213K407J634K69q47k071k100r77L05J748J901J652
$$ 2374 107 -1895 -3002 -2582 -1369 1038 2672 2941 2094 23 -2077 -3054 -2749 -1001 900 2552
5077B552K77j192j652j874j039N11J461K156J502L7q89k307j801q19N94J761K167
$$ 2552 2829 1637 -15 -1889 -2928 -2417 -956 1200 2702 2739 1850 -457 -2258 -3077 -2483 -722 1445
5094A445J294n5j089j951j899r09Q41J945J740J643n8j327k384j894k63P35J901
$$ 1445 2739 2684 1595 -356 -2255 -3164 -2323 -378 1362 3005 2947 1620 -764 -2658 -2921 -2186 -285
5111b85K008J035M6j397j883j978m16P39J858K087J067j67j645k118j523k16Q02
$$ -285 1723 2758 2804 1407 -476 -2454 -2870 -2131 -273 1814 2881 2714 1069 -1049 -2572 -2788 -1986
5128a986J973J673J039k39j671j697j667o11J230K332J662P43k85j959j854j329
$$ -1986 -13 1660 2699 2460 789 -908 -2575 -3186 -1956 376 2038 2781 2496 537 -1317 -2646
5144b646K0Q38K196J775R27r72j807k136r47k6J424J922K010N73r98j772j836
$$ -2646 -2626 -1788 408 2183 3110 2138 331 -1805 -2752 -2778 -1354 568 2578 3151 2153 381 -1455
5161a455j516K93J460K074J714L80n91k161j682j212o8J494K097J782J99q22j891
$$ -1455 -2971 -2678 -1218 856 2570 2950 2359 198 -1484 -2696 -2764 -1270 827 2609 2808 1986 95
5178I5j704j281J83K002J862J234M76j053k058j942m70K31J293K273J422J95r35
$$ 95 -1609 -2890 -2707 -705 1157 2391 2867 1814 -244 -2186 -2656 -2425 -1132 1141 2563 2758 1823
5195A823j994j941o86O86J575J894J332J46j496k019j325j065Q91J805J799J238
$$ 1823 -171 -2112 -2798 -2112 -537 1357 2689 2835 1339 -680 -2005 -3070 -2179 -374 1425 2663
5211B663K0j630j688j621n95O17J823K125J099l69j372j713j589q02J219J891
$$ 2663 2683 1053 -635 -2256 -2851 -2234 -411 1714 2813 2444 1072 -641 -2230 -3032 -1813 78
5227G8J404J320m57j402j931j549k63J095J764J848O94j46j746j861j333l16R55
$$ 78 1482 2802 2345 943 -988 -2537 -2800 -1705 59 1907 2601 2455 709 -1152 -2485 -2801 -1846
5244a846K174J309J117l76k075j630r92l63J425K013J334O12m55j794j877j213
$$ -1846 328 1637 2754 2378 303 -1327 -2319 -2682 -1257 756 2090 2702 2247 453 -1424 -2637
5260b637q2J627J583J623Q40q35j819j765j107K34J209J652J846L49p20k011j917
$$ -2637 -2719 -1092 491 2114 2954 2119 300 -1465 -2572 -2338 -1129 523 2369 2718 1998 -13 -1930
5277a930o88R0J534J714J750J85q58j872j617j040M03J411J652J584L81j118j875
$$ -1930 -2618 -2528 -994 720 2470 2655 1797 -75 -1692 -2732 -2329 -918 734 2318 2699 1581 -294
5294b94j533q25L73J625J852J266J84j297j668j638o47L71J404K146J292j79j044
$$ -294 -1827 -2652 -2279 -654 1198 2464 2648 1351 -317 -1955 -2602 -2231 -827 1319 2611 2432 1388
5311A388j738j622o86P63J600J630J181J2j156k006j448m45M60J704J808J179
$$ 1388 -350 -1972 -2658 -1895 -295 1335 2516 2528 1372 -634 -2082 -2527 -2067 -363 1445 2624
5327B624k08j440j637j584k95Q49J685J477J341j95j731j772j478j83J065J549
$$ 2624 2416 976 -661 -2245 -2540 -1691 -6 1471 2812 2617 886 -886 -2364 -2547 -1482 67
5343F7J443J056l44j523j499j626J21P81K013J731M07l90j744j603j432L30R54
$$ 67 1510 2566 2222 699 -800 -2426 -2305 -1524 489 2220 2627 2237 493 -1110 -2542 -2212 -1258
5360a258J444J788P21o48j378j657j467J11J041J728J543M72n72j731j702q03
$$ -1258 186 1974 2695 2047 669 -988 -2455 -2344 -1303 425 1968 2440 1868 137 -1565 -2368
5376b368N0R21K092J416K93o15j580j905m73p7J254J813J533K25r62j765j443
$$ -2368 -2318 -1397 695 2111 2404 1789 209 -1696 -2169 -2246 -992 821 2354 2579 1617 -148 -1591
5393a591r64L48J370J968J357p8r96j768j414o92M40J329J750J217L74j361j603
$$ -1591 -2555 -2207 -837 1131 2488 2410 1414 -354 -1768 -2460 -2020 -691 1059 2276 2650 1289 -314
5410c14j641m83O15J502J635R76J83j094j775j523n17L85J659J948O32J42j201
$$ -314 -1955 -2438 -1823 -321 1314 2290 2473 1379 -396 -1919 -2436 -2051 -392 1556 2188 2330 1129
5427A129j647j578o53Q85J629J556J016o0j080j742j669l11P87J669J781O45p3
$$ 1129 -518 -2096 -2749 -1864 -235 1321 2337 2277 1197 -545 -2214 -2525 -1738 -69 1712 2357 2284
5444B284j382j757j182m49J074J465J618P01k65j436j811q37k64R82J495J240
$$ 2284 902 -855 -2037 -2486 -1412 53 1671 2372 2107 671 -1140 -1977 -2241 -1259 236 1476
5460A476R90o73r31j834j222l07J540J410J309O49m48j504j896r90K32J185J642
$$ 1476 2466 1793 862 -972 -2194 -2501 -961 449 1758 2407 1959 455 -1441 -2431 -2199 -1014 628
5477F28J246M79o68j341j655r18J28Q88J700J461K91r17j184j739p36L00J181
$$ 628 1874 2353 1685 344 -1311 -2229 -2101 -1213 487 1948 2239 1322 138 -1601 -2337 -2037 -856
5494h56J653J198L82r69j653j349q11M73J412J395J257Q6r53j243j783n05L59
$$ -856 797 1995 2377 1408 -245 -1594 -2405 -1932 -520 875 2132 2218 1265 22 -1761 -2266 -1907
5511a907J519J403Q85K41j060j398j499l79L97J519J492Q41j3r39j452j374p52
$$ -1907 -388 1015 1900 2141 1081 -317 -1816 -2195 -1798 -279 1213 2054 2041 1102 -350 -1724 -2476
5528b476R92J410J208J086l72r17j467j266j44N04J218J536P71j52r35j853j153
$$ -2476 -1484 -74 1134 2220 1848 931 -536 -1802 -1946 -1442 -224 1312 2083 1931 996 -857 -2010
5545b010k92P28J603J413P59n43p41j792r91k74R02J280J703K46Nj361j502j068
$$ -2010 -2302 -1574 29 1442 2201 1658 917 -875 -1866 -2140 -1238 42 1745 1991 1996 635 -867 -1935
5563a935k98J085J165J588P83o60j531j345j110N60N65J614J318N39o76j500j162
$$ -1935 -2233 -1148 17 1605 2388 1728 197 -1148 -2258 -1698 -1133 481 1799 2338 1662 162 -1000
5580a000j266K47J035J620J223L45p98j275j468q87K07J076J664J089L21r06j287
$$ -1000 -2266 -2019 -984 636 1859 2204 1406 131 -1337 -2224 -2017 -941 723 1812 2133 1227 -60
5597f0j320p21P8J283J491Q09N76o58j837j185m37J04J417J090J285R4r74j189
$$ -60 -1380 -2101 -2023 -740 751 1560 2136 1478 -359 -1544 -1981 -1877 -460 630 1915 2009 1035 -154
5615a54j452o24M78J246J625Q31J1r87j307j168o57O25R37J543J124J85j167j601
$$ -154 -1606 -2230 -1752 -506 1119 1950 1961 974 -333 -1501 -2158 -1533 -596 947 2071 2256 1089 -512
5633e12j201l19O07J191J325R21q6r90j538j149q2N38J236J313P95j44j210j343
$$ -512 -1713 -2032 -1425 -234 1091 2012 1926 936 -602 -1751 -1833 -1295 -59 1254 2049 1905 695 -648
5651f48j395j00P87J438J229Q24o20r95j310j186k04R06J507J106O63k23j420
$$ -648 -2043 -2143 -1356 82 1311 2135 1515 520 -790 -1976 -2180 -1274 233 1339 2002 1779 359
5668C59j498r45nR85J521J066O39m67j088j514r86J58P24J191J333N44o73j267
$$ 359 -1139 -2084 -2089 -1104 417 1483 2122 1655 567 -947 -1933 -1775 -1051 140 1473 2017 1344 77
5686G7j026r31J71N76J730J051K04l91j415j104q66k3J352J108J148L14p29j153
$$ 77 -949 -1880 -1709 -1133 597 1648 1852 1461 46 -1058 -1924 -1947 -595 513 1661 1975 1246 93
5704I3j292p94k6J287J714P64j2o73j350j128m36J51J307J228Q92L6r31r85j197
$$ 93 -1199 -1993 -2019 -732 982 1746 1734 1061 -289 -1417 -1853 -1702 -395 833 1725 1761 830 -155 -1352
5723a352o83O78J239J064R05J30r49j247j286l98M62J065J537R88m00q65j316
$$ -1352 -2035 -1357 -118 946 1851 1981 1032 -215 -1501 -1899 -1437 -372 1165 2153 1753 888 -428
5740d28j150l41O28J038J681N68k01q83j712r64j20P25J168J116P97m32q53j068
$$ -428 -1578 -1919 -1291 -253 1428 1996 1795 912 -800 -1764 -1884 -1159 9 1125 1922 1490 637 -431
5758d31r45n11P97R73J652L84l88r88j358p50k73P39J201J316M76m67p83j322
$$ -431 -1376 -1887 -1090 -117 1535 1919 1531 543 -815 -1565 -1838 -1099 102 1418 1894 1427 644 -678
5776f78p85j88Q37J175Q91Q71q39j027j317q36L6J062J344J051J50m64j266j190
$$ -678 -1463 -1651 -814 361 1252 2123 1284 257 -1060 -1896 -1860 -798 546 1597 1747 1283 17 -1173
5794a173n19m3P76J434J114K26o16j101j352n31J10Q72J569P12M0n26j105j042
$$ -1173 -1692 -1735 -959 475 1589 1815 1199 98 -1254 -1785 -1675 -803 766 1478 1518 992 -113 -1155
5812a155m78nR84J424R21Q2p24j278j250q7k8J021J437R25j58o30j188j049n69
$$ -1155 -1633 -1638 -654 770 1691 1773 1049 -229 -1479 -1566 -1594 -573 864 1789 1631 1001 -187 -1236 -1805
5831a805K37J205J396N50J47j036j025j184l46O84R04J017O63K15j072q75j142
$$ -1805 -1568 -363 1033 1583 1730 694 -331 -1515 -1861 -1177 -273 744 1407 1622 550 -325 -1467
5848a467l22O22J173J330K85j06r46j175q03j47L35J378J011M25k26r66j089o84
$$ -1467 -1789 -1167 6 1336 1621 1515 569 -606 -1409 -1556 -1221 157 1168 1593 1367 401 -688 -1372
5866a372o00J090J234P82O12L6j476j127p27o5O54J126J186M28k56j143j252o10
$$ -1372 -1972 -882 352 1134 1746 1782 306 -821 -1548 -1613 -959 167 1353 1781 1525 382 -870 -1480
5884a480j0P37J308J028k1n11q99j270n94P7Q38J201J397l17k95r22j285p75M78
$$ -1480 -1490 -753 555 1583 1562 1051 152 -1118 -1712 -1635 -797 404 1801 1484 1189 267 -1018 -1793 -1315
5903a315O98J136J142k9p61q41j198n15L75O90J332R15j7o85j207j076k19M2J095
$$ -1315 -617 519 1661 1632 871 30 -1168 -1683 -1308 -618 714 1629 1612 927 -280 -1356 -1575 -1533 -438
5922d38J274P14J78q18j181r62m25N39J000J014N27K87q63j071j253k04N22P91
$$ -438 836 1550 1728 910 -271 -1233 -1658 -1119 -119 895 1422 1709 846 -225 -1478 -1682 -1160 -369
5940c69J292P98l91n49j240p37l65N02J056R76L41J09n83j360r47J51J43J243
$$ -369 923 1721 1330 781 -459 -1196 -1561 -1059 -3 973 1314 1423 840 -520 -1467 -1316 -1173 70
5958G0R24N64j79o83j353j000q4O49J108J038O29p16o15j168o56J70L84J252R52
$$ 70 994 1558 1379 696 -657 -1657 -1741 -1092 16 1054 1683 967 352 -816 -1472 -1302 -918 334 1286
5977A286K52k99j062j190n78K92O52R21Q33M17l51o32j608l78j94J118Q25Q74
$$ 1286 1538 1239 177 -1013 -1591 -1299 -647 274 1107 1524 1173 541 -1067 -1445 -1639 -521 304 1178
5995A178L65l81j166j039o15L43O42J079J004L77j151n01j090n40N99J2J527N98
$$ 1178 1543 1162 -4 -1043 -1658 -1315 -673 406 1410 1787 636 135 -955 -1495 -896 -884 643 1241
6013A241K15p59p81p86o74K79R43Q89O30K53p49j003q25k68J66R62J243N02k3
$$ 1241 1456 697 -84 -870 -1544 -1265 -322 567 1197 1450 701 -302 -1127 -1395 -1229 -267 976 1478 1455
6032A455p74p87j033k77O57N05J007Q13Qr36r87j048%L80J057R29L47J3q35r55
$$ 1455 681 -106 -1139 -1416 -759 -254 753 1566 1574 638 -349 -1397 -1397 -1017 40 969 1316 1329 494 -461
6052d61j074N6N73R28R15O48j72j042r06p11j91M76R27J130K19k87n00j025q29
$$ -461 -1535 -1479 -906 22 937 1585 1413 371 -535 -1246 -1437 -961 -34 1096 1315 1028 528 -497 -1326
6071a326J18L00J034P45O46m84o13j189o05kP13Q40R98J05j22q34j002n08j69
$$ -1326 -1208 -908 126 871 1517 1033 420 -769 -1374 -1376 -663 177 1175 1280 1158 324 -678 -1186 -1355
6090a355Q96R16O84L08l77q51q30o18l9O60J153O26K26n14r81p29n84J59P90Q23
$$ -1355 -459 457 1141 1449 1072 221 -609 -1227 -1266 -606 547 1173 1399 885 -96 -825 -1409 -1250 -460 363
6110C63Q41N46r60q49o45p30R9R37R71O65M1m72o99p71p63J66R07R41N27J91m15
$$ 363 1204 1750 790 -59 -704 -1434 -1335 -398 573 1238 1279 807 108 -663 -1426 -1260 -353 588 1115 1306 891
6131H91j061q10m32J35J043P74P57l30l63j057n20j96J25Q76R60M99j36r73m31
$$ 891 -170 -980 -1412 -1277 -234 540 1297 967 604 -453 -973 -1169 -1044 -168 792 1291 1155 182 -249
6150b49o70m69P04P75Q38L06p6p72o09q69k83O42N10J116L14k78p70o50p11J29
$$ -249 -919 -1388 -684 91 929 1235 1159 387 -222 -1091 -1374 -732 -222 894 1208 930 160 -490 -1201 -1072
6170a072N52O10O24M07j88q68m97o41q6O51P29P39n3L6p69r80k89kM06R20O40
$$ -1072 -520 90 714 1121 933 65 -432 -1073 -1159 -508 221 960 907 943 174 -806 -1095 -1097 -691 229 869
6191H69K31k16o12r83l59J91M73R95M37M29n35q06q65l13n8P11P80N50M06m34
$$ 869 1100 884 272 -711 -1070 -879 -406 589 1026 1455 920 114 -751 -1064 -1122 -411 369 919 1325 891
6211H91q05r96n04L04P90Q73K88M25p31n91o96l15M1O88J053L07J48p11n91p03
$$ 891 86 -910 -1414 -1110 -320 553 841 1266 535 -56 -752 -1067 -1026 -338 715 1022 1170 459 -132 -835
6231h35m53J98R54P98M24M1l99q61m76p31M72N25R84N31j83n86p67l31n14M73
$$ -835 -1288 -1090 -136 662 1086 1127 728 -133 -609 -1340 -868 -343 641 1172 989 403 -364 -695 -1209 -736
6251g36K48J421K63m32l30q23n01k49P02P02L55O01k13n66o24m18l43K83O49Q08
$$ -736 -488 933 1196 764 434 -389 -890 -1139 -437 265 620 1221 1008 442 -182 -600 -943 -660 -11 797
6271G97K91lr84o67n79L57K88N44N84J89J48p14p97k85k7M03N29N35O10o16m01
$$ 797 1088 1085 101 -566 -1145 -788 -500 44 628 817 965 251 -546 -831 -858 -455 74 609 1219 603 202
6292B02o81n46L63J27J010M43K23m43q00k75p38J05M95O74P30J91k87m28q08o05
$$ 202 -479 -1025 -662 -535 475 918 1141 698 -102 -377 -1115 -1010 -515 159 889 1080 793 365 -443 -1048
6312a048J2M17R83N79o2k31m54j065l5J77M28R08N3K87k76p83r07R9j0O09O78
$$ -1048 -1036 -619 364 943 881 650 196 -869 -904 -727 -299 609 662 949 673 -110 -1017 -918 -928 -319 359
6333C59L10N9m50o26n63OJ07P42M53M11Jm91o58m36m28L02R54J36N40J19l04q71
$$ 359 669 728 278 -348 -911 -905 -798 -56 397 808 809 318 -340 -776 -1204 -902 52 188 728 847 543 -328
6355c28l22j83K85O79N41N6J10o15o21o06P6L48O98O32J15p7m31n77p09J6N25
$$ -328 -650 -833 -548 131 672 728 838 223 -398 -1004 -928 -580 118 750 865 788 357 -220 -929 -913 -388
6376c88N34N20L38j62o26p88l15j86M82R04N04M4j85n69p00j93j78N65M33O77
$$ -388 146 666 1004 842 216 -572 -887 -1073 -591 313 817 861 676 107 -593 -786 -964 -399 34 711
6396G11K55k34o60m27m01m8J83O43P79j39n9m72o31l47J51L78N84N22k08l9r12
$$ 711 966 732 72 -355 -756 -804 -621 22 801 662 603 131 -500 -847 -696 -318 266 788 580 541 -371
6417c71j41J3l0L06M54N82o2k25n96l91l39K27N18L79M83Q2n69l50m83j64O4M77
$$ -371 -512 -499 -529 -223 231 813 751 526 -70 -461 -800 -573 -55 324 807 889 320 -30 -513 -677 -613 -136
6439a36O90R3k62j34m31l07m50L63M63N27L33Ql46q06k87o5K85M64Q45Q7k32l95
$$ -136 554 647 385 251 -180 -487 -937 -574 -111 416 749 757 411 -395 -682 -747 -462 2 847 934 702 307
6461C07p02n25N1L20O76N27J92k59n26n22l04O2L10N12M91q1N2m09m64l85k5O13
$$ 307 -395 -920 -869 -549 127 654 846 587 61 -461 -765 -703 -393 119 610 529 581 172 -292 -677 -702 -89
6483h9K14O19m8j47k87m66m13r9L48O03M36P7k08m05p28k12nM45M06M00O03o32
$$ -89 125 744 696 549 262 -204 -617 -716 -368 235 671 748 540 135 -593 -805 -810 -365 41 441 1044 412
6505D12l34k78o61K48K16O48J10M88m02n60m90J38K08J5M76L40J22l50k89o88
$$ 412 78 -200 -861 -613 -397 251 361 849 447 -113 -603 -465 -257 -242 234 574 696 346 57 -631
6525f31j68J87P20L04L01m7o34J17n61j14J29O07J12J77J83l95l54m47l13P8R14
$$ -631 -799 -612 108 412 713 666 32 149 -412 -526 -397 210 322 499 682 287 -67 -514 -827 -749 165
6546A65r8P18k3l47o94k93p9L11L01K81M73j22o07j63l46m4K53K33M84M19k72
$$ 165 67 785 762 415 -279 -572 -651 -340 -39 242 715 593 -14 -177 -523 -567 -314 -81 403 822 550
6567E50l90l35l13j51K10K02P55p4K30n82l21l62J74PN59M95J06k34k86q13p9
$$ 550 160 -175 -488 -639 -429 -227 528 454 684 102 -219 -581 -407 -400 159 654 760 526 240 -573 -652
6588f52Q4L53N28K2J78j13m11n46l7k66O20M17J75L35k76k79o47L8j3K71O58J07
$$ -652 -568 -215 313 335 513 400 -11 -557 -594 -860 -240 177 352 687 411 132 -515 -477 -490 -219 439 546
6610E46J30k86m50l17J96m58N29K92M00p8j18n17l06nR4M43L40K27k97j81k35
$$ 546 676 390 -60 -377 -181 -639 -110 182 582 504 386 -131 -437 -442 -348 95 435 662 365 184 -51
6631e1l79j96K48K74M56m7k9j59k39k28j02L4L42M20N59o31m35q5j15j98J84N77
$$ -51 -430 -626 -378 -104 352 305 276 117 -122 -350 -452 -418 -76 344 903 272 -163 -248 -363 -561 -377 200
6653B00r3L68k26l01k55k71J50j14N80J18K75j0k19m38j79J17o6O02K21K8p0k82
$$ 200 107 475 249 -52 -307 -578 -428 -542 38 156 431 421 202 -236 -415 -298 -364 238 459 487 417 135
6675A35k58j74k6J84J86L93j35j32k44k68N3j48J58M22K52L5j97l54m27J87R2
$$ 135 -123 -297 -323 -139 47 440 305 173 -71 -339 -286 -434 -276 146 398 433 236 -118 -545 -358 -266
6696b66O7N04K89k73q0k41k94l37P9M62L46J92j33j21k94k65n6p9M39j2M38J85
$$ -266 -199 305 594 321 241 0 -294 -631 -552 -90 256 448 315 194 -100 -365 -421 -500 -61 -73 365 550
6718E50k69n82j03j15K08K95Q1K96j34O1l07m04m7K65J06N68j75L3k57j76l77
$$ 550 281 -301 -404 -519 -311 -16 65 361 227 288 -19 -423 -470 -205 -99 469 294 327 70 -106 -483
6739d83j4N86N7P8L58n23n6l01k56L79L8L69k3L03n9l49k68p8j49L71n0M98j65
$$ -483 -497 89 146 224 582 59 3 -298 -554 -175 -137 232 209 512 453 104 -164 -242 -391 -20 -70 428 263
6762B63m2l5m66Q7j45J28J69L77r1l00J34l37j24mK60K79L0K59j54m01j81n5L62
$$ 263 221 186 -280 -193 -338 -210 -41 336 245 -55 79 -258 -382 -386 -126 153 183 442 288 -113 -294 -349 13
6785A3J00J24J06J12j94l30j93M7k71O56k13J32L36q0l50k29k93N15J20J48k3
$$ 13 113 237 343 455 261 -69 -262 -215 -486 170 -43 89 425 345 -5 -234 -527 -12 108 256 233
6806B33k9q5p6m29PL23L0K13jO1ll39p9Rp6K6M94M6N1k66l34P7k12J76K11L16
$$ 233 204 119 43 -386 -379 -56 -26 187 186 247 244 -95 -174 -165 -241 -215 279 325 376 110 -224 -147 -359 -183 28 344
6832C44J35k00k50l96OJ17J93n7K76K04j48l72J7J3j75J15L08O8J60l61p0k38
$$ 344 479 279 29 -367 -361 -244 -51 -108 168 372 224 -148 -131 -118 -293 -178 130 198 358 -3 -73 -311
6854c11J03R6M4M1L04O0p8k93j86j07n5J70L75j19K17j50J20m2k04k05L71K2Q3
$$ -311 -208 -112 -68 -27 277 337 259 -34 -220 -327 -382 -212 163 44 261 111 231 189 -15 -220 151 173 256
6877B56K69m03l72K6n0J0K23L07K6r2J7n42J15m0J5N97l25L17j00l87l6j20K04
$$ 256 525 122 -250 -224 -274 -264 -41 266 292 200 217 -325 -210 -250 -235 362 37 354 254 -133 -169 -289 -85
6900h5R8J58K9L2j81q9J31j82k43J38M03K78k06o7j33k47k17K31k01M16J19n1
$$ -85 13 171 200 232 51 -38 93 -89 -332 -194 209 487 281 214 81 -166 -383 -152 -353 63 182 131
6922A31jj40J2Kp9J63K29k35J40J23m69k92N02j71M3K57O9j94J38k25m1k44r0
$$ 131 130 -10 2 4 -75 88 317 82 222 345 -124 -416 86 -85 -42 215 284 90 228 3 -38 -282 -372
6945c72M16r7J49K15l18k06J45k91K57J97P8j43L76k89l0k54n5j59M12J43L39
$$ -372 44 -53 96 311 -7 -213 -68 -359 -102 95 173 30 406 117 87 -167 -222 -381 31 174 513
6966E13m11J32n62J42k48Q6N02K7J24j25j38j83k37K5PM46K8m4K0q0j88j86K06
$$ 513 102 234 -328 -186 -434 -348 154 181 305 180 42 -141 -378 -353 -346 100 128 84 104 24 -164 -350 -144
6989a44p9O7K97J58k09M1l77J58l19M17M2M7J38j10p8j47j08J44pM00Q0l67J71
$$ -144 -223 -156 141 299 90 131 -246 -88 -407 10 52 99 237 127 49 -98 -206 -62 -69 331 411 44 215
7012B15l26K00k17j15R6L59K23k13R5m48k02J59P8J30K70J67n16J52j29lj97j1
$$ 215 -111 89 -128 -243 -147 212 435 222 317 -131 -333 -174 -96 34 304 471 -45 107 -22 -25 -222 -233
7034b33K45R8J4K50l14K8k23k67L69J71j28K39R0k66l19K23n4l28M16K08J3Q0
$$ -233 12 110 124 374 60 88 -135 -402 -33 138 10 249 339 73 -246 -23 -77 -405 11 219 232 312
7056C12j98l03j03K22J09M7J04rM1k81j3Kj40K19q6K25KRl06k01J11k21K64L51
$$ 312 114 -189 -292 -70 39 86 190 181 222 -59 -72 -70 -210 9 -77 148 150 159 -147 -348 -237 -458 -194 157
7080A57O6J47j30j54k96k20J97K35J22j2k17L02l02L7k34J66K4K43j9J3n4p6j30
$$ 157 223 370 240 86 -210 -430 -233 2 124 112 -105 197 -105 -68 -302 -136 -112 131 112 125 71 -5 -135
7103a35J21k83N51j41r5J88j7j03j06L7k66K65o2J25O4K04m58k8Q3k1J95p4N9
$$ -135 -14 -297 254 113 18 206 189 86 -20 17 -249 16 -46 79 143 347 -111 -139 -56 -77 118 44 103
7126A03j82P5o2j2l2O7J82k08L25o1p6l65L69n06Q2L40R5qk15m5K2k1o2j31K96
$$ 103 -79 -4 -66 -78 -110 -43 139 -69 256 195 119 -246 123 -383 -301 39 134 126 -89 -134 -112 -133 -195 -326 -30
7151c0K40K7j54R5j64l08K1L41j56K91j5k9o7l24j03R7l3K43K18K3j33j73k37
$$ -30 210 237 83 178 14 -294 -273 68 -88 203 188 159 92 -232 -335 -238 -271 -28 190 213 80 -93 -330
7174c30K94j5j47L15J41j50j5K24o34n2K50N8M21l53m3K55l54L26j97J9K26j43
$$ -330 -36 -51 -198 117 258 108 93 317 -317 -369 -119 -61 360 7 -36 219 -135 191 -6 13 239 96
7196I6j16K36p9j89NJ8L36k95K56n0j49q0J29j89n4rj1M14j80J99r3k49k44K10
$$ 96 -20 216 137 -52 -47 -29 307 12 268 218 69 -11 118 -71 -125 -134 -145 269 89 288 195 -54 -298 -88
7220h8j75L86J03j7j86l0l1J0j7K0Kk1K45m13J78k34O0K9kM77q8n9j78k46P9L7
$$ -88 -263 123 226 209 23 -7 -38 -28 -45 -25 -23 -44 201 -212 -34 -268 -208 -179 -181 296 208 149 -29 -275 -196 -159
7246a59L07l00J74PM13m88r8r2n4L8J57L33j44j37P4Mk55j2qL46j44L42p3l12
$$ -159 148 -152 22 29 442 -46 -144 -236 -290 -252 -95 238 94 -43 31 35 -220 -232 -240 106 -38 304 231 -81
7270h1kj71Q3J24J24l0K82m38L99j69l23j3K34j37L8K57K7l96K08j15m43N12p4
$$ -81 -83 -254 -171 -47 77 47 329 -109 290 121 -202 -215 19 -118 -80 177 204 -192 16 -99 -542 -30 -104
7293a04M03k40P2j07M9k98J44J8m3K69k51o8K0j02J51n3N7K76O2L3K28n08k59
$$ -104 299 59 131 24 73 -225 -81 -63 -106 163 -88 -156 -136 -238 -87 -140 -83 193 255 288 516 8 -251
7316b51k4N38j48J90l42K87j34j68k14Q5N6K09R9PQ6j06j36k73j71L04r1M20o3
$$ -251 -275 263 115 305 -37 250 116 -52 -266 -181 -125 84 183 190 276 170 34 -239 -410 -106 -197 223 160
7339A60k9j22o4j50o0j6M05m7L4J83l76N1k00J84L7J82qj41k13M53k73L3N1k58
$$ 160 131 9 -55 -205 -265 -281 124 77 111 294 -82 -31 -231 -47 -10 172 164 23 -190 263 -10 23 74 -184
7363a84P0Q3L36m6j87r2j53q4J76J76J4N5j81O0j94L2M5o0L34q2J75j00m1j24
$$ -184 -114 -31 305 259 72 -20 -173 -257 -81 95 109 164 -17 43 -151 -119 -74 -134 200 118 293 193 152 28
7387B8j43l25L83N8K96j37N0K5l95j38M17k24J02J11j34J77j72j02j01J35L46
$$ 28 -115 -440 -57 1 297 160 210 235 -160 -298 119 -105 -3 108 -26 151 -21 -123 -224 -89 257
7408B57q6L32l29Q2m14q5J75l25M83J79l7N9n23P3O4n6L31m2M2j55O3j5R8l81
$$ 257 171 503 174 256 -158 -243 -68 -393 90 269 232 291 -232 -159 -95 -151 180 138 180 25 88 73 171 -210
7432b10K8O9R5J73nj95M1J00j73l2J20j49L06n6j83N7R1j02j87K1K90J9K08m11
$$ -210 -182 -113 -18 155 150 -45 -4 96 -77 -109 11 -138 168 112 -71 -14 77 -25 -212 -191 99 118 326 -85
7456h5K03j7k81J1O0J25r6J87K2lo8j8j37J32KJ20Pk17L35j60m73K51P7n3K24
$$ -85 118 101 -180 -169 -109 16 -80 107 129 126 58 40 -97 35 37 157 164 -53 282 122 -351 -100 -23 -76 148
7481A48M00m08k05j45J83J22j25R7J72m38L13k70j00J79M05k88J06J36J2q7l26
$$ 148 548 140 -65 -210 -27 95 -30 67 239 -199 114 -156 -256 -77 328 40 146 282 294 207 -119
7502a19j04Q0k2J50J09q9K62j72j70Qn0j52J43K38J44P0l17k21K70m68L75K67
$$ -119 -223 -143 -165 -15 94 5 267 95 -75 -67 -117 -269 -126 112 256 326 9 -212 58 -410 -35 232
7524B32j88J32O6l02j36K1K07k07L55q4J28k98o0J91k14P2K3K9K42o7j94K8k81
$$ 232 44 176 242 -60 -196 -175 32 -175 180 96 224 -74 -134 57 -157 -85 -62 -33 209 142 -52 -24 -305
7547c05K58l32J80K95J37k19j28J66j59R0p8J28Q4j17L54j91k71R2k00q9K42J10
$$ -305 -47 -379 -199 96 233 14 -114 52 -107 -17 -95 33 117 0 354 163 -108 -16 -216 -305 -63 47
7569D7R9j97k5%J74l89J17jJ80K07j06m5j06l05K00j03K72j5M9k8L6k80K13r0
$$ 47 146 -51 -76 -76 98 -291 -174 -175 5 212 106 61 -45 -350 -150 -253 19 4 53 25 61 -219 -6 -96
7593i6o1Q8lK68q7j9l18J24j73L79p3j1j5J02m5j53j51L26j60O0J57J1j15J34
$$ -96 -157 -69 -72 196 109 90 -228 -104 -277 102 29 18 3 105 60 -93 -244 82 -78 -18 139 150 35 169
7617A69j79j35L0J94J06l00J08j17J32J29j69r9O6K7K30l09J48j36J61k50J01
$$ 169 -10 -145 -115 79 185 -115 -7 -124 8 137 -32 -131 -65 -38 192 -117 31 -105 56 -194 -93
7638i3q8L21J2mJ4k89j01j30L13J18j70M42k33k24K39l32k15K31K74l54N50m37
$$ -93 -181 140 152 148 162 -127 -228 -358 -45 73 -97 345 112 -112 127 -205 -420 -189 85 -269 281 -156
7660a56L61j76o3l06J34K9M54l44J89m7k11r9k63O19l80L51J89k95J07j53j5j51
$$ -156 205 29 -34 -340 -206 -177 277 -67 122 75 -136 -235 -498 121 -259 92 281 -14 93 -60 -75 -226
7682b26K96l1J6J12l6mk97j29m7L09n7J13J49r9K1k44K1L2q5J71P4K3J80j88K8
$$ -226 70 39 55 167 131 127 -170 -299 -346 -37 -94 19 168 69 90 -154 -133 -101 -186 -15 59 82 262 74 102
7707A02r0J1j92L8L86Ok24J71l95K5mR4K74j69K87p8j02l7j02l37N53m42L31K0
$$ 102 12 23 -169 -131 255 261 37 208 -187 -162 -166 -72 202 33 320 242 140 103 1 -336 217 -225 106 126
7731A26q3M5j34l34L99j37K96J0j20J16k54J27R0m56K38M6K64mj11j34j30O0L07
$$ 126 43 88 -46 -380 19 -118 178 188 68 184 -70 57 147 -309 -71 -25 239 235 124 -10 -140 -80 227
7754B27k47J62j59K08o3l88K09r9J83M0Q4j14o7J21l1j70p8o6J01%K05K23ml24
$$ 227 -20 142 -17 191 128 -260 -51 -150 33 73 157 43 -24 97 66 -104 -182 -248 -147 -147 58 281 277 -47
7778d7k61L98k4l22K96l3P0k55L28j84o4J03k1J21k18O4K59k04j73O2j63K81O6
$$ -47 -308 90 66 -256 40 7 77 -178 150 -34 -98 5 -16 105 -113 -49 210 6 -167 -105 -268 13 79
7801G9o7J91j6l76K11j55J14Q4r6j0q9J57J40m58J74J70j36M53m02J07r8j16J74
$$ 79 12 203 187 -189 22 -133 -19 65 -31 -41 -130 27 167 -291 -117 53 -83 370 -32 75 -23 -139 35
7824C5k47N7K19J54k48J64r8O3k85K16N5j34K27J32o5l42o5J60k36j73N03j5n8
$$ 35 -212 -155 64 218 -30 134 36 99 -186 30 85 -49 178 310 245 -97 -162 -2 -238 -411 92 77 19
7847A9R8P8n89M06o0k43M01K47m39K13k66J72k35N7J55K14k92J24K9Q7l68k5n6
$$ 19 117 195 -394 12 -48 -291 110 357 -82 131 -135 37 -198 -141 14 228 -64 60 89 176 -192 -217 -273
7870b73J94N16k60N6k43J79j54n9j17K23K09j00p7j9p5k25j39J94P1K82J53l74
$$ -273 -79 437 177 233 -10 169 15 -44 -161 62 271 171 94 75 0 -225 -364 -170 -99 183 336 -38
7892c8J22k37kQ1k3MK07N0k33J02p9k37J41Q2J40k9N0J52j28p8j42J08m72L66
$$ -38 84 -153 -155 -74 -97 -93 114 164 -69 33 -46 -283 -142 -60 80 51 101 253 125 47 -95 13 -459 -93
7916i3J78K95m09J01j24k75K55p2J68j20n0M11n79L57j26J63j67L36j31J96k23
$$ -93 85 380 -29 72 -52 -327 -72 -144 24 -96 -146 265 -314 43 -83 80 -87 249 118 314 91
7937I1l65J65J5J3k5K31j62kL84l94r0n4K07o2K42K0j31J94l61Nn6Q5k61L04J59
$$ 91 -274 -109 -94 -81 -106 125 -37 -39 345 -49 -139 -193 14 -48 194 214 83 277 -84 -79 -135 -50 -311 -7 152
7962A52k38K92m36N2J26n7J40R3p7J13k37K03k69J46j42Q7l2K65k7l0k19Q9j13
$$ 152 -86 206 -230 -178 -52 -109 31 124 47 160 -77 126 -143 3 -139 -52 -84 181 154 124 -95 -6 -119
7985a19j43QK31L15j49k03Q0kk16J50K82q7k52Kp6J99l28L72k11J82l0J2J72k67
$$ -119 -262 -254 -23 292 143 -60 20 18 -198 -48 234 147 -105 -103 -179 20 -308 64 -147 35 5 17 189 -78
8009g8J03q1J85l15J80j30N24l62l19J43L3j43J75m6J50Qp7N6lj5l10L1K10K73
$$ -78 25 -56 129 -186 -6 -136 388 26 -293 -150 -117 -260 -85 -131 19 27 -50 6 3 -12 -322 -291 -81 192
8033A92o7k26K64l26R6j95k3K14M45l93k6J43p1m4k87J64L9J89N8o4O4l32J15
$$ 192 125 -101 163 -163 -67 -262 -285 -71 374 -19 -45 98 27 -17 -304 -140 -101 88 146 82 146 -186 -71
8056g1k09L31L8j23K79m17J29J71k11J62r7j60K20r2K78k98J54m92L78K9m2l6
$$ -71 -280 51 89 -34 245 -172 -43 128 -83 79 -18 -178 42 -50 228 -70 84 -408 -30 -1 -43 -79
8078g9J90k26j8R3l81M54K41k03P9j60N8j36j62K77j55L38O9k74o9J32l92J88
$$ -79 111 -115 -133 -40 -421 33 274 71 150 -10 48 -88 -250 27 -128 210 279 5 -64 68 -324 -136
8100a36j7K8J87k06J82p0P3j24P2P6l59L15K2M9k0k24L07l89J60k0K39n2%J62
$$ -136 -153 -125 62 -144 38 -32 41 -83 -11 65 -294 21 43 92 72 -152 155 -234 -74 -94 145 93 93 255
8124B55N6l38k26L35l65M05J22J07o1j41j12k40K99l42O9K94j63k6r2J50q4J17
$$ 255 311 -27 -253 82 -283 122 244 351 290 149 37 -203 96 -246 -177 117 -46 -72 -164 -14 -98 19
8146A9R7k00J49k09K17k63J59k35j50L81M5K28k69jN2j0j78J46J24j85K56N5k67
$$ 19 116 -84 65 -144 73 -190 -31 -266 -416 -35 10 238 -31 -32 20 10 -168 -22 102 -83 173 228 -39
8169c9J68Ol15K0Q4K44l8k91K71n5k67L11k36R1n6J65k9j05J6l0J4Q0
$$ -39 129 135 -180 -160 -76 168 130 -161 110 55 -212 99 -137 -46 -102 63 34 -71 -55 -85 -71 9
8191I
$$ Imaginary data points
##PAGE= N=2
##DATA TABLE= (X++(I..I)), XYDATA
0@%%%%%%%%Jj%qJ3j3J7j8K6l3M0n3O1p4Q8j00J21j40J62j90K16k51K84l22L72
$$ 0 0 0 0 0 0 0 0 0 1 0 0 -8 5 -8 9 -9 17 -16 24 -29 32 -42 46 -54 67 -73 89 -101 115 -136 148 -174 198
33A98m19M74n33N98o74P51q38R34j035J149j272J409j559J717j897K092k303K538
$$ 198 -221 253 -280 318 -356 395 -443 491 -544 605 -667 742 -817 900 -997 1095 -1208 1330
51A330k793L081l401L754m159M616n141N754o471P335q392R725j1468J3845j7313
$$ 1330 -1463 1618 -1783 1971 -2188 2428 -2713 3041 -3430 3905 -4487 5238 -6230 7615 -9698
66i698K2855l3175N9018k50267n80390M111L03299N56847N01107K47391j66897
$$ -9698 13157 -20018 39000 -211267 -791657 -787546 -484247 72600 573707 821098 654201
77F54201m44784n55623l85518l4274L48676N28878M86012J99218j78196m69855
$$ 654201 209417 -346206 -731724 -765998 -417322 111556 597568 796786 618590 148735
87A48735n25070l54773P628L62430N19889M24417J63930j90452m60847n00567
$$ 148735 -376335 -731108 -723480 -361050 158839 583256 747186 556734 95887 -404680
97d04680l04854J9970L57504N16587M07859J15332k11516m50458m72754k63522
$$ -404680 -709534 -689564 -332060 184527 592386 707718 496202 45744 -427010 -690532
107f90532N9440L51710M89095L81250Q8525k26961m34101m49459k40351Q7925
$$ -690532 -631092 -279382 209713 590963 679488 452527 18426 -431033 -671384 -583459
117e83459L61344M65124L50262O0150k48997m23974m11710k11429J00484L60686
$$ -583459 -222115 243009 593271 653421 404424 -19550 -431260 -642689 -542205 -181519
127a81519M42061L21624M3716k62675m26516l83176j75205J16874L61058M23611
$$ -181519 260542 582166 625882 363207 -63309 -446485 -621690 -504816 -143758 279853
137B79853K82539J8002k58034m13319l64297j47022J33464L57499M10749K59337
$$ 279853 562392 580394 322360 -90959 -455256 -602278 -468814 -111315 299434 558771
147E58771j0873k70035m00623l36728j13326J52301L46191L85115K37212k8683
$$ 558771 547898 277863 -122760 -459488 -572814 -420513 -74322 310793 548005 519322
157E19322k74509l87400l18934r4141J74079L50854L61179K05712n2010k82342
$$ 519322 244813 -142587 -461521 -555662 -381583 -30729 330450 536162 484152 201810
167B01810l71189k87305p1020J80150L44139L43960J83384o7414k88868l65292
$$ 201810 -169379 -456684 -527704 -347554 -3415 340545 523929 456515 167647 -197645
177a97645k65035m2398J95707L40005L21241J51744q4019k83667l49370k45171
$$ -197645 -462680 -505078 -309371 30634 351875 503619 419600 135933 -213437 -458608
187d58608k5026K04040L35929L07347J31631j06024k89992l35149k19376p09K13440
$$ -458608 -483634 -279594 56335 363682 495313 389289 99297 -235852 -455228 -455937 -242497
198b42497L24400K84025J11236j15660k88563l23153k02881J6066K25455L23007
$$ -242497 81903 365928 477164 361504 72941 -250212 -453093 -437027 -211572 111435
208A11435K65160Q4829j33414k87081l05245j78564L2942K27538L12976K49844
$$ 111435 376595 461424 328010 40929 -264316 -442880 -409938 -182400 130576 380420
218C80420O8180j45260k89570k94844j58410N3476K37244L04126K27596M5361
$$ 380420 448600 303340 13770 -281074 -439484 -386008 -148764 155362 382958 428319
228D28319j56689k83465k77314j41414O5257K41226K99493K12393K6227j71702
$$ 428319 271630 -11835 -289149 -430563 -365306 -124080 175413 387806 414033 242331
238B42331k85393k61699j16254Q3652K43388K86501J92821Q930j77556k81217
$$ 242331 -43062 -304761 -421015 -337363 -93975 192526 385347 394277 216721 -64496
248f4496k50121r9734R8207K50185K80099J74352j3223j89728k75048k31522p8450
$$ -64496 -314617 -414351 -316144 -65959 214140 388492 375269 185541 -89507 -321029 -399479
259c99479J10907K47318K68108J60561k6757j99310k73719k18617n9675J27885
$$ -399479 -288572 -41254 226854 387415 360658 161348 -112371 -330988 -390663 -262778
269b62778K52035K54643J37758m3396k04276k66034k01647m4367J35503K52031
$$ -262778 -10743 243900 381658 338262 133986 -132048 -333695 -378062 -242559 9472
279I472K47075J23871n9641k13551k62446j85216k3126J47852K49337K32083J05288
$$ 9472 256547 380418 320777 107226 -155220 -340436 -363562 -215710 33627 265710 370998
290C70998p0711k14256k55920j74270q486J58959K50560K22442Q8080q8143k20204
$$ 370998 300287 86031 -169889 -344159 -352645 -193686 56874 279316 367396 279253 59049
301E9049k45723j55432P070J65693K45722K09606P4256r8097k23289k41894j42585
$$ 59049 -186674 -342106 -335036 -169343 76379 285985 360241 262144 38855 -203039 -345624
312c45624K3910J77528K43412J94796N4996j10464k23087k29415j27978L4746
$$ -345624 -321714 -144186 99226 294022 349018 238554 15467 -213948 -341926 -307180
322c07180J81363K41534J84986M0729j22506k26745k22624j10902N2747J88614
$$ -307180 -125817 115717 300703 341432 218926 -7819 -230443 -341345 -288598 -99984
332i9984K33641J69221K6031j30488k25043k12671r8206O2827J95394K32367J56791
$$ -99984 133657 302878 328909 198421 -26622 -239293 -337499 -274672 -79278 153089 309880
343C09880Q554j42317k24786k00447q1080P5843J96169K24064J44618l248j49322
$$ 309880 318434 176117 -48669 -249116 -330196 -254353 -58184 165880 310498 307250 157928
354A57928k24601j92938o7486R0018K01671K17443J29562k0168j57910k18668
$$ 157928 -66673 -259611 -327097 -237079 -35408 182035 311597 291429 133519 -85149
364h5149j79210n4373R7601K02849K11085J19172l1602j66493k19027j67290l8189
$$ -85149 -264359 -318732 -221131 -18282 192803 311975 280373 113880 -105147 -272437 -310626
375c10626J10070K05080K00595J02385m2487j68649k14482j57566k6048J17380
$$ -310626 -200556 4524 205119 307504 265017 96368 -118114 -275680 -301728 -184348
385a84348K06638J95654R0047n7037j75512k10204j43906j0638J24800K03131
$$ -184348 22290 217944 307991 250954 75442 -134762 -278668 -289306 -164506 38625
395C8625J85341P8997o6001j78356k06223j36021O87J36223K03752J75432O4378
$$ 38625 223966 302963 236962 58606 -147617 -283638 -282951 -146728 57024 232456 296834
406B96834p7709j81672j97749j21770J1376J40001K01378J68007N4118q6562j86395
$$ 296834 219125 37453 -160296 -282066 -270690 -130689 70689 238696 292814 206252 19857
417A9857j93993j09423K5780J47729J99073J55439L9075r3509j84119j87293j00134
$$ 19857 -174136 -283559 -257779 -110050 89023 244462 283537 190028 5909 -181384 -281518
428b81518L5302J52243J97709J48067K6966j05434j87273j78583q6218M6708J56655
$$ -281518 -246216 -93973 103736 251803 278769 173335 -13938 -192521 -278739 -232031 -75376
439g5376J91265J36118J6953j11318j86501j73109p6800N7010J63244J89050J24989
$$ -75376 115889 252007 268960 157642 -28859 -201968 -278768 -221758 -58514 130536 255525
450B55525K884j19688j85402j62484o3321O5540J63192J84279J17258o793j26243
$$ 255525 258409 138721 -46681 -209165 -272486 -206946 -43754 140525 257783 250990 124747
461A24747j85493j56304n1242P7091J67004J77758J04493j8371j30999j81461
$$ 124747 -60746 -217050 -268292 -191201 -24197 153561 258054 239683 108684 -72777
471g2777j47124m2401Q3738J68955J73577R5363k8502j39204j80919j36322k9740
$$ -72777 -219901 -262302 -178564 -9609 163968 259331 230829 91625 -89294 -225616 -255356
482b55356R1640J69114J65724Q3441l6343j40842j78810j29629j9425R9227J71538
$$ -255356 -163716 5398 171122 254563 218220 77378 -101432 -231061 -250486 -151259 20279
493B0279J60788P2397m9026j44197j73314j19424q002J05249J68430J54343O5004
$$ 20279 181067 253464 204438 60241 -113073 -232497 -240499 -135250 33180 187523 252527
504B52527n7490j49463j70031j11159K620J15071J68601J43858N2443o5227j51732
$$ 252527 195037 45574 -124457 -235616 -232996 -117925 50676 194534 246977 181750 30018
515C0018j63634j00612R850J18521J69733J37589M1963p4014j56344j60836q7613
$$ 30018 -133616 -234228 -224378 -105857 63876 201465 243428 169414 13070 -147766 -235379
526b35379K2721J22855J66489J28305L0376q0078j54592j56605q0686L2919J28209
$$ -235379 -212658 -89803 76686 204991 235367 155289 697 -155908 -236594 -203675 -75466
537g5466J65199J22115J8273r0891j54869j47956p0150M2428J31945J58887J13762
$$ -75466 89733 211848 230121 139230 -15639 -163595 -233745 -191317 -59372 99515 213277
548B13277J1929r7196j57414j41928o1175N1119J38711J55837J01413R96j02133
$$ 213277 225206 128010 -29404 -171332 -232507 -181388 -42677 113160 214573 215569 113436
559A13436j56411j33909n0268N6324J39690J54469R3798r054j07564j57461j28261
$$ 113436 -42975 -176884 -227152 -170828 -31138 123331 217129 208075 100511 -56950 -185211
$$ [...]
8191A63
##END NTUPLES=NMR FID
##END=
